##TITLE=1H_LY-PropPd120
 CDCl3,8 sc, 
 20.9.2021
##JCAMPDX= 6.0         $$ Bruker NMR JCAMP-DX V2.0
##DATA TYPE= NMR FID
##DATA CLASS= NTUPLES
##ORIGIN= UXNMR, Bruker Analytische Messtechnik GmbH
##OWNER= root
$$ XWIN-NMR		Version 3.5
$$ Tue Sep 21 09:11:52 2021 Russian Standard Time (UT+4h)  she@DPX200
##.OBSERVE FREQUENCY= 200.1314
##.OBSERVE NUCLEUS= ^1H
##.DELAY= (6, 6)
##.ACQUISITION MODE= SIMULTANEOUS
##.ACQUISITION SCHEME= undefined
##.AVERAGES= 8
##.DIGITISER RES= 18
##SPECTROMETER/DATA SYSTEM= spect
##.PULSE SEQUENCE= zg30
##.SOLVENT NAME= CDCl3
##.SHIFT REFERENCE= (INTERNAL, CDCl3, 0, 15.7039)
##AUDIT TRAIL= $$ (NUMBER, WHEN, WHO, WHERE, WHAT)
$$ ##TITLE= Audit trail, XWIN-NMR		Version 3.5
$$ ##JCAMPDX= 5.01
$$ ##ORIGIN= Bruker BioSpin GmbH
$$ ##OWNER= she
$$ F:/spectra/data/she/nmr/H-F/1/audita.txt
$$ ##AUDIT TRAIL=  $$ (NUMBER, WHEN, WHO, WHERE, WHAT)
(   1,<2021-09-21 09:10:26.81 +0400>,<she>,<DPX200>,
      <created by zg, POWCHK disabled, PULCHK disabled
       configuration hash MD5:
       00 E9 B6 7A A2 85 ED C7 34 08 36 98 17 FE 4E 26
       data hash MD5: 16K
       46 D7 65 A3 7B A8 3A 83 CF CA E8 05 27 6B 45 BC>)
$$ ##END=
$$ 
$$ hash MD5
$$ D0 CF 1F 27 94 87 1B 6D 4C 1E 3C D6 AC 3C 0D 0F
##$RELAX= 
##$RELAX= 
##$RELAX= 
##$RELAX= 
##$RELAX= 
##$RELAX= 
$$ Bruker specific parameters
$$ --------------------------
##$DU= <F:/spectra>
##$EXPNO= 1
##$NAME= <H-F>
##$PROCNO= 1
##$TYPE= <nmr>
##$USER= <she>
##$AMP= (0..31)
100 100 100 100 100 100 100 100 100 100 100 100 100 100 100 100 100 100 
100 100 100 100 100 100 100 100 100 100 100 100 100 100 
##$AQSEQ= 0
##$AQ_mod= 1
##$AUNM= <au_zg>
##$AUTOPOS= <>
##$BF1= 200.13
##$BF2= 200.13
##$BF3= 200.13
##$BF4= 200.13
##$BF5= 200.13
##$BF6= 200.13
##$BF7= 200.13
##$BF8= 200.13
##$BYTORDA= 1
##$CFDGTYP= 0
##$CFRGTYP= 5
##$CHEMSTR= <none>
##$CNST= (0..31)
1 1 145 1 1 1 1 1 1 1 1 1 1 1 1 1 1 1 1 1 1 1 1 1 1 1 1 1 1 1 1 1 
##$CPDPRG= <>
##$CPDPRG1= <>
##$CPDPRG2= <>
##$CPDPRG3= <>
##$CPDPRG4= <mlev>
##$CPDPRG5= <mlev>
##$CPDPRG6= <mlev>
##$CPDPRG7= <mlev>
##$CPDPRG8= <mlev>
##$CPDPRGB= <>
##$CPDPRGT= <>
##$D= (0..31)
0 1.2 0 0 0 0 0 0 0 0.06 0 0.03 0 0 0 0 0.0002 0 0 0 0 0 0 0 0 0 0 0 0 
0 0 0 
##$DATE= 1632201026
##$DBL= (0..7)
120 120 120 120 120 120 120 120 
##$DBP= (0..7)
150 150 150 150 150 150 150 150 
##$DBP07= 0
##$DBPNAM0= <>
##$DBPNAM1= <>
##$DBPNAM2= <>
##$DBPNAM3= <>
##$DBPNAM4= <>
##$DBPNAM5= <>
##$DBPNAM6= <>
##$DBPNAM7= <>
##$DBPOAL= (0..7)
0.5 0.5 0.5 0.5 0.5 0.5 0.5 0.5 
##$DBPOFFS= (0..7)
0 0 0 0 0 0 0 0 
##$DE= 6
##$DECBNUC= <off>
##$DECIM= 32
##$DECNUC= <off>
##$DECSTAT= 4
##$DIGMOD= 1
##$DIGTYP= 9
##$DL= (0..7)
0 120 120 120 120 120 120 120 
##$DP= (0..7)
150 150 150 150 150 150 150 150 
##$DP07= 0
##$DPNAME0= <>
##$DPNAME1= <>
##$DPNAME2= <>
##$DPNAME3= <>
##$DPNAME4= <>
##$DPNAME5= <>
##$DPNAME6= <>
##$DPNAME7= <>
##$DPOAL= (0..7)
0.5 0.5 0.5 0.5 0.5 0.5 0.5 0.5 
##$DPOFFS= (0..7)
0 0 0 0 0 0 0 0 
##$DQDMODE= 0
##$DR= 18
##$DS= 0
##$DSLIST= <SSSSSSSSSSSSSSS>
$$ [...]
##$SUBNAM2= <"">
##$SUBNAM3= <"">
##$SUBNAM4= <"">
##$SUBNAM5= <"">
##$SUBNAM6= <"">
##$SUBNAM7= <"">
##$SUBNAM8= <"">
##$SUBNAM9= <"">
##$SW= 20.0188988654967
##$SWIBOX= (0..15)
0 0 2 0 0 0 0 0 0 0 0 0 0 0 0 0 
##$SW_h= 4006.41025641026
##$TD= 16384
##$TD0= 1
##$TE= 0
##$TE2= 300
##$TE3= 300
##$TEG= 300
##$TL= (0..7)
0 120 120 120 120 120 120 120 
##$TP= (0..7)
150 150 150 150 150 150 150 150 
##$TP07= 0
##$TPNAME0= <>
##$TPNAME1= <>
##$TPNAME2= <>
##$TPNAME3= <>
##$TPNAME4= <>
##$TPNAME5= <>
##$TPNAME6= <>
##$TPNAME7= <>
##$TPOAL= (0..7)
0.5 0.5 0.5 0.5 0.5 0.5 0.5 0.5 
##$TPOFFS= (0..7)
0 0 0 0 0 0 0 0 
##$TUNHIN= 0
##$TUNHOUT= 0
##$TUNXOUT= 0
##$USERA1= <user>
##$USERA2= <user>
##$USERA3= <user>
##$USERA4= <user>
##$USERA5= <user>
##$V9= 5
##$VALIST= <valist>
##$VCLIST= <CCCCCCCCCCCCCCC>
##$VD= 0
##$VDLIST= <DDDDDDDDDDDDDDD>
##$VPLIST= <PPPPPPPPPPPPPPP>
##$VTLIST= <TTTTTTTTTTTTTTT>
##$WBST= 1024
##$WBSW= 4
##$XGAIN= (0..3)
0 0 0 0 
##$XL= 0
##$YL= 0
##$YMAX_a= 420321
##$YMIN_a= -438770
##$ZGOPTNS= <>
##$ZL1= 120
##$ZL2= 120
##$ZL3= 120
##$ZL4= 120
##$ABSF1= 10
##$ABSF2= 0
##$ABSG= 5
##$ABSL= 3
##$ALPHA= 0
##$AQORDER= 0
##$ASSFAC= 0
##$ASSFACI= 0
##$ASSFACX= 0
##$ASSWID= 0
##$AUNMP= <proc_1d>
##$AZFE= 0.1
##$AZFW= 0.1
##$BCFW= 1
##$BC_mod= 2
##$BYTORDP= 1
##$COROFFS= 0
##$CY= 11.3945322036743
##$DATMOD= 1
##$DC= 2
##$DFILT= <>
##$DTYPP= 0
##$F1P= 2.36226072786647
##$F2P= -0.459571619588291
##$FCOR= 0.5
##$FTSIZE= 0
##$FT_mod= 4
##$GAMMA= 1
##$GB= 0.15
##$INTBC= 1
##$INTSCL= 1
##$ISEN= 128
##$LB= 0.24
##$LEV0= 0
##$LPBIN= 0
##$MAXI= 10000
##$MC2= 0
##$MEAN= 0
##$ME_mod= 0
##$MI= 1.114404
##$NCOEF= 0
##$NC_proc= 0
##$NLEV= 6
##$NOISF1= 3.799351
##$NOISF2= 2.8
##$NSP= 1
##$NTH_PI= 0
##$NZP= 0
##$OFFSET= 15.70392
##$PC= 1
##$PHC0= -13977.38
##$PHC1= 1.000905
##$PH_mod= 1
##$PKNL= yes
##$PPARMOD= 0
##$PSCAL= 0
##$PSIGN= 0
##$REVERSE= no
##$SF= 200.130013532006
##$SI= 16384
##$SIGF1= 3
##$SIGF2= 2
##$SINO= 400
##$SIOLD= 16384
##$SREGLST= <1H.CDCl3>
##$SSB= 0
##$STSI= 0
##$STSR= 0
##$SW_p= 3612.71676300578
##$SYMM= 0
##$S_DEV= 0
##$TDeff= 0
##$TDoff= 0
##$TI= <>
##$TILT= no
##$TM1= 0
##$TM2= 0
##$TOPLEV= 0
##$USERP1= <user>
##$USERP2= <user>
##$USERP3= <user>
##$USERP4= <user>
##$USERP5= <user>
##$WDW= 1
##$XDIM= 8192
##$YMAX_p= 0
##$YMIN_p= 0
$$ End of Bruker specific parameters
$$ ---------------------------------
##NTUPLES= NMR FID
##VAR_NAME=  TIME,          FID/REAL,        FID/IMAG
##SYMBOL=    X,             R,               I
##VAR_TYPE=  INDEPENDENT,   DEPENDENT,       DEPENDENT
##VAR_FORM=  AFFN,          ASDF,            ASDF
##VAR_DIM=   8192,          8192,            8192
##UNITS=     SECONDS,       ARBITRARY UNITS, ARBITRARY UNITS
##FACTOR=    0.0002496,     1,               1
##FIRST=     0,             0,               0
##LAST=      2.0444736,     0,               0
##MIN=       0,             -438770,         0
##MAX=       2.0444736,     420321,          0
$$ Real data points
##PAGE= N=1
##DATA TABLE= (X++(R..R)), XYDATA
$$ [...]
2786c70j733j480j023l60J55N42J044J623J822J620J375J050O39Q9n76j127j449
2803A841j546j708j651j129n62p4L39Q46J377J729J815J427J086Q38L27l68q68
2820C719j239j543j615j690j374p27k41J40N61J163J601J729J605J232R01N85
2836D807j2p37j145j326j597j689j454j036m63P7M00Q34J407J765J630J315J089
2853C865O79K39m37r56j320j438j577j601j227o56j74K59O98J131J607J712J433
2870B237J094Q87M84j86q16j099j381j492j555j448r34l08J00M92R66J444J614
2887I9J549J272Q90O64J33n86j043j245j441j573j386j139n75n7M00P03J208J654
2905d73J591J248J084P47L36k89q43j247j340j408j448j378p02k24J38O17J017
$$ plain form
2786 -370 -2103 -3583 -4606 -4966 -4811 -4269 -3225 -1602 220 1840 3215 4265 4904 4993 4417 3290 1841
2803 1841 295 -1413 -3064 -4193 -4755 -4829 -4490 -3644 -2267 -538 1277 2704 3790 4628 4955 4587 3719
2820 3719 2480 937 -678 -2368 -3742 -4469 -4710 -4570 -4009 -2846 -1245 484 2089 3321 4222 4807
2836 4807 4795 4058 2913 1587 -10 -1699 -3153 -4189 -4652 -4575 -4175 -3341 -1934 -169 1461 2776 3865
2853 3865 4544 4783 4346 3390 2070 632 -945 -2546 -3773 -4429 -4603 -4344 -3646 -2515 -908 804 2237
2870 2237 3331 4218 4702 4516 3700 2601 1220 -272 -1827 -3275 -4209 -4517 -4417 -3925 -2959 -1515 99
2887 99 1648 2920 3810 4474 4607 4021 2978 1733 292 -1281 -2667 -3806 -4381 -4438 -4038 -3335 -2127 -473
2905 -473 1118 2366 3450 4197 4533 4244 3401 2154 814 -594 -2042 -3420 -4122 -4346 -4208 -3591 -2574
2922b574J397J642J461J064Q34O03l9o72j053j307j393j397j368j070l87R1L78
2939c790P56J318J531J497J238R06O22K93l20j024j218j248j400j443j152o54
2955d088j36L28N89R87J507J613J256R69Q13M26j13o67j156j317j225j368j425
2972c007q56k71J29M66Q45J253J531J483J094P57O21J91n66r52j184j274j287
2989a027j319j180n79J20L42N16J131J490J461J209R74O34L89j47q87j186j106
3006H35j236j489j187p43k49K92N11P69J318J613J297R29Q24N67n6n55r80j205
3024A255j168j267j418j013l20R2L23O83J133J409J518J142P33O13L88m19q72
3041B812j043j188j313j293j175o61J8L05L77R11J443J463J174J004O99M01l7
$$ plain form
2922 -2574 -1177 465 1926 2990 3824 4427 4388 3716 2663 1356 -37 -1434 -2802 -3872 -4259 -4168 -3790
2939 -3790 -3034 -1716 -185 1312 2550 3456 4078 4371 4051 3027 1809 561 -839 -2282 -3434 -4088
2955 -4088 -4224 -3896 -3307 -2320 -813 800 2056 3025 3838 4264 4151 3484 2328 1011 -214 -1582 -3007
2972 -3007 -3863 -4134 -4005 -3539 -2694 -1441 90 1573 2667 3424 4045 4236 3670 2718 1534 260 -1027
2989 -1027 -2346 -3526 -4105 -3985 -3643 -3127 -1996 -506 955 2164 3138 3772 4161 4014 3127 1941 835
3006 835 -401 -1890 -3077 -3820 -4069 -3777 -3266 -2497 -1179 434 1731 2660 3484 4051 3995 3440 2460 1255
3024 1255 87 -1180 -2598 -3611 -3931 -3839 -3516 -2833 -1700 -291 1227 2369 3102 3715 4103 3684 2812
3041 2812 1769 581 -732 -2025 -3200 -3861 -3843 -3538 -3161 -2250 -807 656 1830 2834 3533 3934 3897
3058C897o55j103j136j125j354j310p43k67Q7M45O83J082J571J438Q86P62O55
3075C813P1m40q36j141j175j181j280j156l96N7J86N61J017J358J423J227P29
3092B837N47M83j72p50j009j089j246j277j107p88j63K85L53P31J283J421J162
3109A501R51P69M55R1m56r81j165j012j250j324q54l43oL76O56R03J387J404R75
3128B077P29P03K60l70p41j033j137j101j156j119o25J7J61L92R14J257J301J207
3146A736Q86N18M61L8o57r84r65j139j241j113p66l97J89L94O08J084J411J165
3164A228R39P73M69J61k81p96j158r97j115j253r37l77j03K44N83Q42J147J382
3182G51J087O88N87M61j61o42r15j106j124j040j027q17j57J66L10P48J132J228
$$ plain form
3058 3897 3242 2139 1003 -122 -1476 -2786 -3529 -3796 -3709 -3264 -2581 -1499 72 1510 2396 3158 3813
3075 3813 3884 3444 2608 1467 292 -889 -2169 -3325 -3721 -3664 -3478 -2917 -1900 -542 881 2108 2837
3092 2837 3384 3867 3695 2945 1936 847 -399 -1676 -2783 -3571 -3734 -3449 -3096 -2365 -1082 339 1501
3109 1501 2452 3221 3676 3767 3311 2330 1165 153 -1097 -2421 -3275 -3618 -3624 -3248 -2592 -1689 -302 1102 2077
3128 2077 2806 3509 3769 3399 2658 1625 488 -613 -1769 -2888 -3513 -3496 -3335 -2943 -2029 -772 529 1736
3146 1736 2622 3140 3601 3639 2982 1998 1033 -106 -1347 -2460 -3226 -3623 -3434 -3040 -2432 -1348 63 1228
3164 1228 2167 2940 3409 3570 3289 2493 1335 338 -777 -2030 -2967 -3344 -3447 -3203 -2620 -1778 -631 751
3182 751 1838 2526 3113 3574 3413 2771 1856 750 -374 -1414 -2441 -3258 -3415 -3249 -2939 -2191 -1059 169
3200A69J193R11O32M04K14m22r11j015j008j171j046q21n08nM18N31Q35J291J233
3219I24Q93P81N75K20j46o27j096j083r11j104j044n57j49J51N17P87R88J270
3237C89J178P52N41M81K8n86q15j012j092r75r45r38l77K14L39N71R88J137J130
3256A008J034O88L50K28j94q20j016q75j063j077q71n74j42M01N66O28J066J287
3274F24R66P31O14K98j01m87r15j097q45r87j089p36j21J28M03O82Q21J121J230
3293A240R23N03M12J87m51p74r01j042r62q81r40n47J72L49M27P96J134J118J022
3312A785P44L26K18l9o20j000r01r02j052r13n85k29K62N26N90Q78J317J056O52
3331B113N82L44k7l49p39j094r32q26j036q37k25J20L04N79P99J003J207R43N13
$$ plain form
3200 169 1362 2273 2905 3309 3523 3101 2190 1175 167 -1004 -2050 -2871 -3379 -3384 -2966 -2435 -1600 -309 924
3219 924 1817 2598 3173 3393 3247 2620 1524 441 -470 -1574 -2618 -3175 -3324 -3173 -2656 -1869 -881 389
3237 389 1567 2319 2860 3341 3369 2783 1968 956 -136 -1111 -2056 -2994 -3371 -3157 -2818 -2247 -1259 -122 1008
3256 1008 2042 2730 3080 3308 3114 2294 1278 403 -660 -1737 -2608 -3182 -3324 -2923 -2357 -1729 -663 624
3274 624 1590 2321 2935 3233 3132 2645 1730 633 -212 -1199 -2288 -3024 -3145 -3017 -2614 -1932 -1111 10 1240
3293 1240 2163 2666 3078 3265 2814 2040 1139 97 -865 -1746 -2686 -3233 -3061 -2712 -2285 -1489 -355 763 1785
3312 1785 2529 2855 3073 3034 2414 1414 513 -389 -1441 -2354 -2939 -3168 -2906 -2380 -1790 -912 405 1461 2113
3331 2113 2695 3039 3012 2663 1924 830 -102 -928 -1964 -2801 -3026 -2906 -2602 -2023 -1224 -221 986 1929 2442
3350B442L63K74k29p53q54r43r72q84q38n95j4L84L70O11J068J147R51P28M19
3369B675J96N0m34r26r74p83r69r55o00k76J55M97N23P46J175J136P13M99M23
3388B871P3k97o58r87r95p98q62q90l91J06K73M66P85R52J066J019N47L03L07
3407B890j6p07q34q89r04q98p88o43j74L32M03N18R25J162Q80P86N02K39N0k97
3427B537q36r87p72q42r61o83l11K0M10O12O27R92J176Q39M32M14K38k97n35q62
3447A211j028q20p83q54n73K7K72M24O80R14R95J041O94L08K52O9n13q51q48q88
3467b71q92p88o48l65K57N03N08P39J084J012P10N82L03L2k01o82r73q47p75r37
3487a649p89l31PK74N66O51Q44J133R57N36L71K66j81n00q08r52q94p60q03o67
$$ plain form
3350 2442 2805 3079 2850 2097 1243 300 -672 -1556 -2394 -2989 -3003 -2619 -2249 -1638 -570 577 1528 2256 2675
3369 2675 2871 2921 2487 1561 587 -196 -1165 -2120 -2720 -2996 -2841 -2344 -1821 -1075 100 1236 1949 2448 2871
3388 2871 2944 2647 1989 1002 7 -791 -1653 -2543 -2934 -2828 -2555 -2089 -1304 -352 714 1733 2280 2583 2890
3407 2890 2874 2167 1333 444 -460 -1358 -2146 -2789 -2963 -2631 -2228 -1710 -785 377 1257 2043 2545 2784 2834 2537
3427 2537 1701 714 -58 -900 -1861 -2544 -2855 -2835 -2425 -1813 -1186 -194 982 1821 2253 2667 2905 2608 2073 1211
3447 1211 183 -637 -1420 -2274 -2847 -2820 -2548 -2124 -1444 -530 465 1506 2200 2508 2760 2829 2316 1465 617 -271
3467 -271 -1163 -1951 -2599 -2964 -2707 -2204 -1696 -957 127 1139 1849 2431 2734 2766 2565 1883 910 63 -712 -1649
3487 -1649 -2438 -2769 -2762 -2488 -1922 -1271 -427 706 1663 2199 2570 2836 2655 2155 1347 395 -499 -1259 -2062 -2729
3507b729j02K76L48O26Q78R32J003Q27L54K49P3l21p73q83q42q78q06o52l94N1
3527b763M89M85O13J024J085P77N51L54R1j53n35q99r48p77q35q09m60l0K19N22
3547a999O45P99J016J044O06L45K63n1m49p31q87r11q09p47o95k55K22L64N20
3566a710Q11R67R77Q33N09K08P4j51p16q84q48q34q38o79m22n1L54N60O14Q29
3586c97J108Q47O05L84J31j46m17p93r71p93p94p99n90r7J67M47O20P62R00J046
3606A220P86L37K81N8l45o81q44r04q81o99o98m22J19M01M77O77R75R44Q55O30
3626B286K56J00j04n32q83r26p83q21p39m37j82K69N32N79Q04J045R14O56M13
3645B447K08n7l48o79j009q65p68p65o56k34J43L29O01P68Q64J027Q49M53K21
$$ plain form
3507 -2729 -2831 -2555 -2207 -1581 -703 229 1232 2059 2413 2662 2735 2414 1641 758 -84 -962 -1768 -2420 -2814 -2763
3527 -2763 -2274 -1789 -1176 -152 933 1710 2261 2615 2706 2553 2018 1119 171 -606 -1441 -2250 -2710 -2740 -2521 -1999
3547 -1999 -1354 -555 461 1505 2111 2456 2719 2668 2219 1488 601 -310 -1119 -1866 -2561 -2816 -2594 -2230 -1710
3566 -1710 -899 68 1045 1878 2387 2595 2669 2518 1802 918 70 -764 -1602 -2281 -2703 -2754 -2400 -1840 -1226 -397
3586 -397 711 1558 2163 2547 2678 2532 2115 1322 351 -442 -1236 -2035 -2625 -2722 -2555 -2108 -1488 -726 174 1220
3606 1220 2006 2343 2624 2682 2337 1656 812 -92 -973 -1672 -2370 -2792 -2673 -2272 -1795 -1118 -143 801 1656 2286
3626 2286 2542 2642 2538 2006 1123 197 -586 -1407 -2146 -2583 -2765 -2496 -1964 -1385 -581 464 1378 2034 2447
3645 2447 2655 2598 2250 1571 562 -303 -1071 -1836 -2492 -2726 -2583 -2254 -1653 -885 -21 1006 1855 2308 2529
3664B529J45k08o70p95r29q77p12o56n05n5L46M89O35R05R77Q42O85L60J24p5
3684B555l88q28r51q11q12p35n38k41J59M80O42O88R75J011O57M83K62J8l33o07
3704A686q84r64p77o89p14l59P6L55M78P60Q62R00R39N77K53J11j12n79p93q39
3724B87r23p74o32n01k33L10N31N71Q30R52R01P11M11J67r9k88p18r68q10p79
3744a054p64n95k66N1M64N54P43Q24J025Q33M45L29M1k71n70p83r25q46p37o94
3764b196m62rL41M57O89Q36R23R05O86L00J28j08m43p29r12q22q39o91n14k38
3784b698J70N26N35P41R49R04P55N11J51l5k50o10q50r32p41p64o60l37K4L24
3804b287O02O80P63R86R27N27K90R8j73m91p38r03r09p42o77m95j16K62M54O27
$$ plain form
3664 2529 2674 2466 1796 1001 72 -805 -1517 -2173 -2678 -2733 -2387 -1898 -1263 -358 619 1461 2146 2506 2630 2555
3684 2555 2167 1339 388 -423 -1235 -1970 -2508 -2749 -2590 -2110 -1468 -780 195 1206 1863 2346 2608 2626 2293 1686
3704 1686 802 -162 -939 -1628 -2342 -2701 -2625 -2270 -1792 -1032 -170 730 1669 2246 2499 2610 2498 1919 1126 287
3724 287 -636 -1410 -2042 -2543 -2776 -2466 -1935 -1364 -534 418 1319 2030 2441 2608 2509 2221 1503 535 -275 -1054
3744 -1054 -1818 -2413 -2679 -2628 -2164 -1610 -867 -43 982 1815 2260 2589 2630 2359 1789 1006 81 -765 -1502 -2196
3764 -2196 -2658 -2667 -2326 -1869 -1180 -344 579 1484 2170 2470 2598 2490 2047 1318 406 -416 -1255 -1946 -2460 -2698
3784 -2698 -2528 -2002 -1467 -726 223 1127 1882 2393 2544 2509 2259 1649 799 -133 -874 -1638 -2298 -2635 -2611 -2287
3804 -2287 -1685 -1005 -242 744 1671 2198 2488 2586 2413 1922 1184 281 -628 -1370 -2047 -2542 -2658 -2396 -1942 -1315
3824a315P87R09R15P08M07R8l0l32o84q74q28q44p21n30k76K6M12N96O74R21R38
3845I57P60N40K78nj97n09q47q94q17p65o82l88p7K72N30O65Q28R38Q85N92L43
3866B407J36r0m28p40q57r18p59o49n13k19J45M45N99P88Q87Q84P34N15J60n2
3886B475k40o37q66q46q36p42n32l55j6L55N70O85Q37Q99Q33N54L57N9k04m77
3906A873p20r18q84o81o95m60j41K36M85O59P64Q97Q50P08L87J91j09l43o90q31
3926E78q84p90o90n03l00N9M47N87P25Q52Q37P85N39K41k1k37n24q10q39q31p55
3947a534n60m08m8K53N68O61P75R32P90O21L55R5j68m17o78q16q81p95o53m60
3967b368k20J76M40O26P41Q19Q65P56M52J83l9l44n99p65q75q40o72n10k80j3
$$ plain form
3824 -1315 -528 381 1296 2004 2411 2509 2479 2147 1463 589 -239 -1083 -1804 -2334 -2610 -2584 -2172 -1576 -902 19 957
3845 957 1717 2257 2535 2530 2333 1824 977 83 -734 -1499 -2181 -2569 -2646 -2374 -1844 -1179 -351 587 1472 2064 2407
3866 2407 2543 2453 2025 1285 428 -490 -1249 -1898 -2411 -2630 -2485 -2040 -1441 -653 234 1118 1852 2367 2527 2475
3886 2475 2235 1598 732 -114 -950 -1692 -2224 -2579 -2595 -2240 -1670 -985 -148 751 1584 2138 2495 2554 2350 1873
3906 1873 1153 235 -649 -1330 -2025 -2485 -2626 -2390 -1905 -1246 -482 415 1265 1973 2360 2551 2442 2099 1409 578
3926 578 -306 -1096 -1786 -2289 -2589 -2530 -2083 -1496 -771 81 918 1703 2242 2483 2462 2225 1701 891 52 -779 -1534
3947 -1534 -2094 -2502 -2550 -2297 -1729 -1068 -293 639 1429 2050 2405 2500 2332 1915 1237 421 -460 -1255 -1908 -2368
3967 -2368 -2588 -2412 -1972 -1346 -605 214 1079 1835 2287 2470 2431 2087 1488 723 -152 -992 -1664 -2174 -2454 -2467
3987b467L63M80O82Q48Q82P35O04L12J2k24m60p30q24q07p70o09l90j43J72M71
4007a863O20P82Q83Q50O32M34J43j37l46o09q11q50q04o76n29k41J00L70N81P68
4027g03Q01Q12P46N16K65%k51n38p48q45q60p11n50l46n4K90M84O68P95Q08P98
4048A377O32L90P4k03m08o87q03q44p33o59m17j96J14M16O31P49Q25Q13P32M65
4068B268J64n5l17o35p15q47q02p07n01k85k1L57N30P17Q00Q22P44N34L40K5k29
4089B187m87o66q21q27p72n59l85j15J87M55O56P39Q52P84O44L97J24j09l80n94
4109A310p75q60p65o41m61k40J28K98N86P11Q40Q06O86N02K51l5k47n43o94q50
4129Gp76p40n37k85n8K53M90O62P96Q07P90N29L57O7j62m33o32p98q10p65n78
$$ plain form
3987 -2467 -2104 -1624 -942 -94 788 1523 2127 2439 2451 2227 1767 1037 213 -594 -1364 -1973 -2363 -2506 -2334 -1863
4007 -1863 -1243 -461 422 1272 1904 2338 2481 2344 1998 1389 578 -272 -1076 -1752 -2281 -2522 -2422 -2052 -1471 -703
4027 -703 98 910 1656 2172 2437 2437 2186 1648 900 55 -805 -1516 -2066 -2412 -2466 -2176 -1692 -1024 -229 579 1377
4048 1377 2009 2399 2473 2270 1862 1175 372 -472 -1205 -1864 -2281 -2477 -2363 -1947 -1316 -567 258 1071 1803 2268
4068 2268 2432 2377 2060 1425 710 -137 -939 -1646 -2147 -2432 -2453 -2096 -1566 -849 -49 773 1517 2051 2391 2416 2187
4089 2187 1700 1034 213 -614 -1386 -1945 -2330 -2445 -2258 -1803 -1147 -408 444 1228 1872 2269 2393 2284 1904 1310
4109 1310 535 -325 -1090 -1731 -2192 -2432 -2304 -2006 -1420 -709 131 937 1623 2125 2376 2341 2094 1551 857 7
4129 7 -769 -1509 -2046 -2331 -2389 -2136 -1646 -984 -188 619 1409 1938 2295 2362 2200 1767 1135 337 -473 -1238 -1816
4150a816m14j78J55M09N95P43Q10P58O63M57J78r9l15n53p31q20q05o32m91k54
4170b340M3K53N36P14P55Q10O92N56K89M9k65n04o69p88p54p37n19l28r2J51M47
4191a701O09P90P60P52N79M11J13j14l64o52p60p66p24o28l94j88P6L06N73P29
4211e93P77P65N99M59K64l8l05m89o69p76p37o65n26k94QK14M44O69P69P36P15
4232A327N37L04J03k03m11n95p57p69p54n54l52j12J42L40N95P06P94O92O02M34
4252B069J37p6l20n46p10p33p17o36m55k31P5K82M73O58P76P19O70M81K67J9k68
4273A934m79n97p11p40o86n64l18l5K08M23O07P23P22O86N29L91J00j45m13n69
4293A066o66p58o70o24l87j79J70L77M94O52P22P04O21M31J93n8l05n03o16p07
$$ plain form
4150 -1816 -2230 -2408 -2253 -1844 -1249 -506 304 1062 1725 2182 2360 2261 1946 1393 662 -158 -963 -1595 -2086 -2340
4170 -2340 -2297 -2044 -1508 -794 -39 771 1463 2019 2308 2357 2092 1588 919 131 -623 -1360 -1879 -2207 -2299 -2148 -1701
4191 -1701 -1092 -302 458 1210 1789 2200 2313 2199 1835 1183 423 -343 -1067 -1695 -2089 -2277 -2201 -1895 -1322 -593
4211 -593 184 949 1548 2007 2271 2233 1928 1439 770 -6 -743 -1408 -1934 -2228 -2220 -2006 -1562 -893 -124 612 1327
4232 1327 1864 2168 2271 2068 1657 1062 305 -464 -1218 -1772 -2124 -2236 -2094 -1754 -1159 -453 341 1033 1635 2069
4252 2069 2206 2130 1810 1264 554 -179 -896 -1532 -1987 -2218 -2143 -1861 -1388 -730 46 765 1435 1916 2183 2202 1934
4273 1934 1455 858 147 -593 -1279 -1843 -2161 -2196 -1988 -1565 -958 -235 487 1173 1702 2093 2193 2048 1635 1066
4293 1066 400 -358 -1028 -1652 -2039 -2218 -2048 -1671 -1177 -525 197 901 1522 1953 2146 2088 1783 1280 664 -43
4313d3p41o38m28k79K1K54M38O13P23P23O64M92K48P7j98m50n63o83p25o88n03
4334a686l43q7J65L31N70O93P53O77N23L52J47r4l25n64o54o94p10n49m13j75
4354b083P2K95M60O26P46P16N32M12K38L3k28m73o06o95p18o00m76k27m5J90L94
4375a437N65P17P14O33N04K61R8j54l97n84o13p02o45n41l45j30J49L37M99O46
4395d25P21O39N31L62J95k9l35m91o49o31o49o10m03k13K3K62M12O05O77O92N75
4416A259M15K75O8k08m35n63o75o36o07n06l21p0J78L45N71O57O73O45M59L19
4436A843J46q8l39n29o49o62o09n68l81j38R1L02M72N80P05O89M95L70J75L0k31
4457A704m80n99o70o33n88m43k43L0K10L96N27O59P27O01M00K65J00j62l76n47
$$ plain form
4313 -43 -784 -1422 -1850 -2129 -2108 -1854 -1416 -803 -80 643 1307 1799 2047 2124 1926 1476 913 230 -495 -1183 -1686
4334 -1686 -2029 -2116 -1951 -1620 -1050 -357 396 1073 1596 1948 2095 2001 1676 1112 458 -236 -946 -1495 -1908 -2083
4354 -2083 -2011 -1716 -1256 -630 116 832 1364 1776 2014 2047 1819 1346 740 45 -673 -1273 -1749 -1976 -2021 -1831 -1437
4375 -1437 -872 -155 559 1192 1696 1957 2055 1901 1504 920 307 -395 -1040 -1581 -1926 -2056 -1907 -1570 -1071 -425
4395 -425 296 935 1466 1828 2023 1994 1659 1168 519 -112 -761 -1371 -1774 -1987 -1964 -1702 -1290 -685 -8 684 1259
4416 1259 1674 1949 2017 1809 1374 811 136 -500 -1107 -1613 -1934 -2004 -1826 -1481 -910 -253 420 1065 1524 1843
4436 1843 1989 1901 1562 1033 384 -278 -887 -1455 -1836 -1974 -1883 -1581 -1109 -529 176 865 1360 1730 1905 1935 1704
4457 1704 1224 625 -45 -678 -1266 -1709 -1952 -1922 -1712 -1316 -789 -130 597 1198 1598 1863 1963 1801 1425 878
4477H78o55o66n78n42l09q3J75K83M83O48O97O39M88K92J87m0l24n17n71o54o27
4498g96n72m13j39L5K82M32N49O58O82N49M48J95Jk23m08n94o13o35n84n02k43
4519a891l7K21L61N57N63O84O27M65K82R3j19m11m94o24n92n96n43l87j14J62
4539a793L09M42N80O67O53N25L51J41nk71n02n82o14o19n40m26k23K2K95M09N10
4560f71O24O92N35L95K52M8j71l85n46o40o12n35n08k85p1J58L52M74N87O83O13
4581I89M47K93R8l7l12n03o06n97o02n12l66j86R0L20L91N40O55O64N27L62J83
4602A838j0k01m16n85o56n33n72m46k20k8K20L68M89N67O71O29L96K37Q3j33l03
4623A395n12o18o27n59m50l97p9J51L16M02N47O28O36N38K75J52rk47m53o06n93
$$ plain form
4477 878 223 -443 -1021 -1563 -1872 -1955 -1780 -1497 -1014 -366 331 970 1458 1750 1937 1897 1573 1056 485 -169 -796
4498 -796 -1368 -1781 -1920 -1885 -1603 -1171 -622 36 718 1267 1715 1910 1911 1688 1280 686 73 -562 -1146 -1648 -1891
4519 -1891 -1928 -1707 -1346 -789 -226 458 1085 1550 1832 1925 1806 1395 901 277 -315 -911 -1454 -1841 -1955 -1793
4539 -1793 -1484 -1042 -462 205 858 1383 1734 1875 1870 1599 1097 515 -99 -718 -1258 -1684 -1907 -1885 -1590 -1181 -671
4560 -671 -47 645 1180 1575 1827 1875 1704 1319 773 133 -479 -1014 -1522 -1807 -1878 -1720 -1368 -894 -307 376 989
4581 989 1436 1729 1827 1790 1478 975 369 -228 -830 -1342 -1708 -1894 -1804 -1484 -1093 -553 102 766 1293 1655 1838
4602 1838 1828 1627 1211 626 -30 -563 -1135 -1581 -1801 -1829 -1609 -1241 -752 -185 486 1115 1511 1748 1831 1698 1395
4623 1395 883 265 -362 -921 -1371 -1768 -1847 -1696 -1380 -978 -431 197 833 1371 1646 1798 1789 1542 1089 483 -110
4644a10n60n09m19k63Q0K55L95M45O50O49N23L96K13M5j31l28o15o23n68n14m93
4665a482l10k7J62L65M40N37O58O17M43K28J33k3k95m62o78n68n54m42m54j52
4685a864J38K66M06N09O05O61N51L29R2P4j58m66n92n60n76n27l90k65n1K91L23
4706a204M16O03P11N51L81K07O9p0k92n22o05o08m93n36l48o1J10K95M44N40O04
4727A92O55M75K43J66K4k54m44n82n79o02m88l92k55J20K42L36M79O16O24N77
4747A153L81J73J2q2l62o22n47n36n40m70k74q8J89L71L59N45O91O12L92K93J08
4768A758r9k82m35o10n41n24n07m24j34J02K85L81N05N90O26N49L09J46N4j98
4788A551m25n26n95n59m95m34l32O4K45L16M05O26O03N75M07K42O9n8l22n50n82
$$ plain form
4644 -110 -670 -1179 -1598 -1861 -1781 -1526 -1131 -686 -36 613 1136 1532 1745 1790 1659 1331 716 93 -475 -989 -1482
4665 -1482 -1792 -1819 -1657 -1292 -852 -315 343 960 1403 1631 1764 1741 1446 984 306 -262 -816 -1258 -1712 -1864
4685 -1864 -1726 -1460 -1054 -545 60 721 1272 1601 1693 1767 1609 1143 551 -9 -585 -1112 -1502 -1767 -1818 -1527 -1204
4706 -1204 -788 -185 526 1077 1458 1665 1734 1664 1372 850 245 -363 -856 -1392 -1740 -1801 -1691 -1396 -952 -412 192
4727 192 847 1322 1565 1731 1755 1501 1057 475 -104 -706 -1194 -1586 -1841 -1721 -1479 -1143 -664 -48 576 1153
4747 1153 1534 1707 1719 1637 1275 653 106 -430 -970 -1440 -1714 -1802 -1613 -1242 -883 -338 353 965 1357 1650 1758
4768 1758 1659 1377 942 332 -209 -733 -1240 -1664 -1798 -1696 -1411 -1030 -525 65 691 1240 1549 1695 1749 1551
4788 1551 1126 600 5 -554 -1049 -1483 -1815 -1751 -1506 -1190 -785 -159 444 1019 1426 1668 1737 1679 1357 807 225
4809B25n57n13n11l03j09J06L04M30M70O61O27M37K91J91o0k41l61n93o15n17
4829f38m70m37k16L4K21L24N33N57O50N63L48J88Q9j19l84n00o08n69n30m09l06
4850a679j03K15K94L77N91O29N49M92K66J04p0k16m89n89n35n73n28l44j52N4
4870a707K34M41M71N78O72N04L25K14J8k30l52n23o25n80m80m62k63PJ74L30M79
4891g75O45N01O11M43K22R6o3l22n05n48o35n22m39l31j70O5L65L71N72O15N62
4912G58N07L47J34n3j96m19n62o17n38n10l64k29m9K46M31M77N32O13O08L44K20
4933A680O8j49l14m96o29o50m39m45l24j03J67K96N00N28N89N60N52K44Q0j3k48
4954A454m52n99n79o06m12l59k14ML08L95M83N89O23N44L65J84l7j38l18n59o64
$$ plain form
4809 225 -332 -845 -1356 -1659 -1768 -1662 -1358 -928 -458 203 830 1267 1558 1749 1689 1448 1087 494 -121 -638
4829 -638 -1108 -1545 -1761 -1727 -1506 -1182 -649 -92 558 1121 1469 1657 1746 1627 1243 743 135 -434 -964 -1373 -1679
4850 -1679 -1782 -1567 -1273 -896 -305 324 873 1365 1631 1735 1665 1449 960 371 -164 -737 -1265 -1609 -1761 -1707
4870 -1707 -1473 -1032 -561 17 689 1193 1518 1732 1750 1520 1168 645 20 -560 -1040 -1502 -1765 -1758 -1584 -1254 -775
4891 -775 -130 371 982 1425 1647 1743 1680 1358 853 305 -330 -852 -1291 -1622 -1792 -1727 -1362 -991 -419 196 758
4912 758 1265 1612 1746 1693 1497 1078 516 -101 -639 -1149 -1513 -1742 -1791 -1545 -1114 -637 -105 508 1116 1460 1680
4933 1680 1748 1599 1285 789 160 -490 -929 -1374 -1698 -1801 -1634 -1338 -838 -310 279 839 1391 1635 1715 1702 1454
4954 1454 1002 403 -176 -782 -1194 -1553 -1767 -1763 -1455 -1060 -577 12 635 1179 1544 1728 1691 1553 1235 676 12
4975A2m92n15m56k89k3J72L52M99M94O09O28M73J91P7q4k72m17o28o54n32m20
4996a275l71k06J56K98L94N36N73N92N95L19R9qj78l95n55o26n70n15l75k33q1
5017a826K86M19L95N41O89O01L80K31rj17k39m96o54o08m64n04l39r6J00L54M74
5038h82N06N54P07N24K29J06m4k17m19n76o82n50m67l52k83P6K96L46N02N96O26
5059E96N86L82J78n4m8l58n73o19n68n65m02k96j05J99M11M15N23O34O63M33K58
5080A690J03j06k12m53o82o33n06m67m15j99J14K93M29N23N87O59O01L00J03K9
5100A758j59l91n69o55o24m79l95l13j0K42L63M42O41O21O14M54K13K4q6k84n29
5121H78o27o27n29m85l01j77J06L59M68N15O04O72N13K98J40n3k33l82o48o60
$$ plain form
4975 12 -480 -995 -1451 -1740 -1763 -1591 -1239 -740 -246 363 991 1464 1655 1732 1648 1376 959 331 -323 -855 -1275
4996 -1275 -1646 -1852 -1696 -1398 -1004 -468 105 697 1292 1611 1710 1702 1524 1129 574 -52 -622 -1137 -1512 -1745 -1826
5017 -1826 -1540 -1121 -726 -185 504 1105 1485 1716 1707 1590 1351 855 201 -407 -871 -1375 -1714 -1810 -1710 -1356 -882
5038 -882 -376 178 885 1409 1638 1744 1700 1483 1064 488 -194 -744 -1211 -1563 -1846 -1770 -1474 -1128 -626 -30 596
5059 596 1182 1564 1742 1688 1640 1282 709 90 -478 -1043 -1445 -1741 -1846 -1647 -1236 -821 -298 336 999 1432 1690
5080 1690 1793 1687 1475 1022 340 -293 -799 -1266 -1681 -1880 -1766 -1473 -1044 -521 66 725 1326 1626 1729 1758
5100 1758 1599 1208 639 -16 -640 -1119 -1514 -1827 -1837 -1595 -1232 -790 -149 472 1086 1540 1753 1777 1691 1407 878
5121 878 251 -376 -905 -1390 -1691 -1868 -1762 -1403 -935 -420 184 856 1369 1667 1807 1754 1521 1139 491 -169
5141a69n12m70m59k69M9K37M18N53N45O61O20L91J38J00j41l75n26o59o38n16
5161a022m18l31j46K36L21M55N92O88N89M64L18N8p6k26m68o33o24o11m83l51
5181a668j62m6L51M49N23N91O66N68L44K23j1j87l89n59p33n89m57m50l28QK02
5202a654L58N22N77O05O64M93K00O6p6l03n39o08o43o13m13l62j77J23L48M24
5222a008N23O59O27N47L54J51n8k08l91o74o43n58n13m34k17m6K10M99M88N55
5242a37O57O43L96K12Q9j67l49n00o60o67n07m61l66j18J64L76M82O24N70O53
5262I34N31L09Q2o8k57m70n91o70o37m78l35k50L1L16M40N23O03O34O11L99J92
5283A849l8j73l43n52o78o48n07m55l11k1J29M14N33N50O39O80M60K31J20r2l25
$$ plain form
5141 -169 -681 -1151 -1610 -1879 -1830 -1593 -1175 -622 -77 584 1204 1595 1733 1833 1692 1317 791 132 -506 -1022
5161 -1022 -1440 -1771 -1917 -1681 -1360 -905 -313 375 964 1428 1746 1804 1728 1502 1034 401 -223 -834 -1317 -1668
5181 -1668 -1830 -1876 -1525 -1076 -553 38 704 1272 1616 1839 1828 1641 1252 693 -40 -629 -1086 -1536 -1864 -1856 -1654
5202 -1654 -1296 -774 -197 408 1072 1565 1765 1831 1755 1452 913 305 -338 -951 -1364 -1726 -1903 -1780 -1432 -1008
5222 -1008 -485 174 801 1348 1702 1853 1795 1587 1196 522 -121 -679 -1192 -1626 -1843 -1889 -1679 -1180 -692 -137
5242 -137 520 1163 1559 1771 1860 1693 1344 844 184 -483 -990 -1451 -1817 -1935 -1771 -1395 -913 -289 281 934
5262 934 1465 1774 1856 1788 1531 1061 470 -200 -837 -1315 -1650 -1900 -1869 -1553 -1113 -590 13 647 1258 1657 1849
5283 1849 1811 1638 1295 743 65 -583 -1090 -1545 -1856 -1877 -1748 -1334 -801 -251 388 1068 1528 1759 1879 1787 1462
5304A462m87o52o56n89m27m29j77J33L24M34N63O44O26O09L52J13l9j66m38n95
5324F05o59o01n65l97k57l1K50M15N11N59P07N94M34K68K9j71l04m91o85o45n68
5345a002m64l50q5R8L63M97N82O12O58N64K61R5m2k10n07n69o60o00n12l79k53
5366a903L7K88M17N28O44O26N66M69J79m2j34l57o07o31o16n60m32k90j11J99
5386a730L67N11N88O53O22N13K70Q8j48k55m66o37o61n91m38m03k04J14K59M69
5406a079N77O01O62N81L33J73j7j96m19n69o48o59n21m24k56n0K89L74N06N76
5426a66O58N69N08K56M9j50l08n31o49o37n60m98l03j42R8L44M99N62O33O38N06
5447A376L51J66j08k59m01o04o76n88n13m10j98PK68L87N69O25O30N67L90K48
$$ plain form
5304 1462 975 323 -333 -922 -1349 -1778 -1955 -1822 -1498 -1064 -501 143 769 1378 1730 1843 1804 1638 1200 605
5324 605 -54 -655 -1220 -1617 -1874 -1905 -1655 -1240 -729 -170 537 1131 1565 1833 1862 1691 1387 896 211 -434 -1002
5345 -1002 -1466 -1816 -1901 -1803 -1440 -943 -361 251 909 1473 1734 1829 1787 1577 1070 501 -159 -759 -1271 -1650 -1903
5366 -1903 -1866 -1578 -1161 -633 11 637 1203 1672 1851 1809 1675 1318 711 80 -536 -1096 -1528 -1818 -1929 -1730
5386 -1730 -1363 -852 -264 389 1011 1524 1794 1882 1734 1479 1013 376 -285 -876 -1314 -1717 -1921 -1807 -1548 -1079
5406 -1079 -502 99 761 1342 1675 1848 1831 1635 1216 647 -1 -660 -1181 -1605 -1861 -1911 -1622 -1248 -742 -166
5426 -166 492 1061 1569 1825 1874 1724 1416 885 236 -401 -961 -1459 -1762 -1904 -1806 -1462 -963 -401 232 870 1376
5447 1376 1727 1893 1785 1526 1125 521 -155 -743 -1256 -1666 -1864 -1857 -1589 -1202 -633 -8 622 1189 1579 1827
5467A827K0j62l98n08o19o75n59m34k77j65J90L75M69N84O79N94N29L25O4j20
5487A739k61m33o57o38n86n02l40j93K8K93M60N57O32O00N73L93K16n2k43l28
5507A258n77o52o65m90m31k78n7K02L58N64O05O03N97N01K56O4j47l28m92o22
5527B69o32o06m35l19j50R1L22N02N33O18N78N51L81J40o0k15m09o13o38n98n54
5548a244l74j94k3K12M21N57N71O42N91M11K36N4k18l49m81o25o68n63m12k92
5568a748j18J53L17M79O13N95O11N01L33O4q9k54m13o06o13o31m90l18k31N6K60
5589a529M68N26N86O21N20M13K08l6k19l35n22o31o46m93m17k64n9J33L82N18
5609g76O00N61O20M26K94P3j43l01m46n59o66n70m49k82k18R6L04M24N51O13N80
$$ plain form
5467 1827 1847 1685 1287 779 160 -515 -1074 -1508 -1785 -1950 -1760 -1385 -916 -332 347 941 1470 1795 1859 1739
5487 1739 1478 1045 388 -250 -836 -1338 -1678 -1871 -1843 -1550 -1090 -533 99 699 1272 1665 1881 1829 1586 1258
5507 1258 681 29 -636 -1126 -1557 -1835 -1892 -1690 -1332 -768 -163 440 1037 1538 1794 1858 1711 1383 891 269
5527 269 -363 -969 -1404 -1723 -1873 -1782 -1460 -958 -425 193 771 1322 1703 1843 1783 1568 1159 546 -92 -690 -1244
5548 -1244 -1618 -1812 -1835 -1623 -1202 -645 -74 568 1159 1570 1806 1860 1642 1293 812 187 -481 -1044 -1456 -1748
5568 -1748 -1866 -1713 -1396 -917 -304 291 902 1403 1736 1800 1711 1457 1044 438 -175 -806 -1296 -1614 -1845 -1789 -1529
5589 -1529 -1061 -535 51 672 1192 1605 1813 1777 1558 1223 701 70 -576 -1069 -1486 -1750 -1809 -1676 -1294 -776
5609 -776 -176 385 1005 1431 1725 1798 1655 1354 908 349 -317 -887 -1336 -1618 -1836 -1740 -1436 -1012 -461 152 732
5630G32N40L47J43n7j79m12n62o17n48n35l63k56j4J92M37M61N78O28N51L97K58
5651A721M8j37l38m80o06o19n42l83l34j28J24K94N04N30N87N44N03L46Q9m0k67
5672A416m29n24o14n67m95k98k49M3K23M16M90N97N69N47L88J92K6j93l83m59
5692F96n80n95n20l95k57r8J38L55M54N66O14N13M17L07J21j08k95m31n53n81
5712b32n70m47l29j41O9K62L70N34N71N45N27L32J98l2j98l79m65n93n77m63m13
5733a431k17n2J93L39M74N48N48N60L80L14j8o4l00m48n42o10n07m23l16r1Q3
5754a580K74L89N41N24N86M46L25J42p1k28l38m99n73n53m76l11k16%J96L57M53
5775f12N45N56N11L44K57K3j36l49m30n29n64n00l76k86r0J26K98M01N24N53M87
$$ plain form
5630 732 1272 1619 1762 1705 1526 1114 552 -65 -613 -1148 -1511 -1767 -1781 -1589 -1152 -691 -113 515 1066 1463 1721
5651 1721 1769 1632 1294 814 208 -411 -953 -1336 -1670 -1798 -1674 -1380 -876 -346 241 785 1288 1634 1723 1683 1416
5672 1416 987 463 -151 -718 -1213 -1511 -1760 -1717 -1494 -1078 -588 9 578 1125 1513 1705 1731 1538 1155 696
5692 696 116 -479 -999 -1394 -1651 -1749 -1611 -1256 -802 -236 378 891 1308 1615 1736 1628 1333 902 349 -232
5712 -232 -802 -1249 -1578 -1719 -1650 -1388 -1018 -484 87 632 1159 1491 1689 1657 1459 1080 615 22 -555 -1018 -1431
5733 -1431 -1648 -1700 -1507 -1168 -694 -146 402 962 1342 1656 1638 1574 1274 826 284 -326 -833 -1256 -1572 -1663 -1580
5754 -1580 -1306 -917 -376 148 734 1180 1505 1647 1576 1348 1010 511 -62 -615 -1091 -1402 -1618 -1618 -1422 -1065 -612
5775 -612 -67 489 1000 1344 1601 1624 1488 1139 709 180 -384 -884 -1260 -1546 -1636 -1510 -1212 -811 -287 266 753
5796G53M36L09J24r7k24m17m73n51n26m63k98j46J4J87L84M54N33N37M86L49J74
5817A545J1j85l08m40n18n67m45l67k38o1J55K80M13N11N34M76M01K60O7n8k54
5838A212l98n39m96m80m24k94j28K6K51L95M50N43M62M61L36J37j3j87l50m32
5858E32m88n44m46l86j42j9J28L09M46M81M87N17L45K22Q6j71k48l96m85m89m78
5879g39l90k60j06Q6K23L68M95N03N00L85L00J12m6j92l32m87m73m97m32k91k00
5900a473M7J43K88M49N11N11M03L33K22L1j45l10l93m55n02m36l76k39l8R2K63
5921a074L49M77M78M52M14K43R7n4k35l55m14n05m61l95k90j20K1J77L28M19M59
5942A1N03M00K96J62K7j64k99m25m45m50m45l17k08p9J51L01L23M82M67M45L38
$$ plain form
5796 753 1189 1498 1622 1525 1301 884 411 -140 -666 -1129 -1427 -1573 -1559 -1372 -988 -534 -1 536 1022 1371 1545
5817 1545 1556 1371 1063 623 105 -462 -907 -1274 -1512 -1573 -1418 -1138 -725 -214 320 796 1197 1457 1524 1466 1212
5838 1212 814 275 -221 -701 -1125 -1419 -1547 -1521 -1270 -875 -425 118 580 1041 1377 1514 1501 1314 964 532
5858 532 44 -500 -946 -1332 -1474 -1493 -1365 -1056 -610 -129 358 875 1220 1442 1528 1357 1109 713 228 -261 -739
5879 -739 -1129 -1389 -1495 -1409 -1186 -818 -323 180 680 1065 1365 1477 1431 1239 907 420 -53 -550 -982 -1273 -1473
5900 -1473 -1426 -1283 -995 -546 -35 476 879 1212 1434 1465 1320 1010 617 162 -340 -776 -1152 -1391 -1429 -1337 -1074
5921 -1074 -725 -248 230 682 1096 1339 1436 1382 1147 792 378 -127 -588 -983 -1273 -1393 -1372 -1195 -867 -448 11
5942 11 514 914 1210 1372 1399 1235 936 511 66 -384 -829 -1146 -1354 -1433 -1282 -981 -658 -176 291 736 1074
5963A074K27P5n4k18m08m22m31m53l88k40j30R4J58L32M11M68M19M00K84J22J5
5984A335j58l00m05m41m47m02l02j78l9J64K23L52M48M82M13L01K26O2j05k58
6004I71l56m09m24m20l88k19n2L5J98L48L82M87M37L13K64J59l7j95l04l85m79
6025g4l68l65l38j16MJ23K85L57M24M42L94K97J60N7j32k18l41m14m65l74l25
6046i87k02r5R3K11L37L64M68M02L32K44Q5n4j82l00l87l88m10l94k48j58O5J45
6068a059K68L51M40M49L23K88J69K3j18k83l30m39l81l88l08k00m1J29K03L28
6088e76L69M62L56L36J40J43k5k53l15l66l52l94l70k65p1QJ67K67L52M44M07
6109D64L20K51J50M0j58k75l50m14l52l63l12j61o7J26K33L25L70M50L43L33J52
$$ plain form
5963 1074 1301 1376 1322 1104 696 274 -157 -610 -998 -1238 -1368 -1274 -1116 -784 -373 95 514 914 1198 1320 1335
5984 1335 1177 877 472 31 -416 -818 -1120 -1298 -1337 -1173 -950 -598 -150 332 745 1046 1272 1334 1229 971
6004 971 615 206 -218 -638 -1026 -1245 -1297 -1262 -1064 -716 -334 153 590 903 1167 1326 1289 1094 790 405 -74
6025 -74 -442 -807 -1145 -1261 -1257 -1134 -849 -492 -68 374 768 1065 1225 1282 1150 932 591 177 -288 -662 -987
6046 -987 -1189 -1284 -1191 -980 -643 -279 189 591 923 1167 1252 1198 1016 716 329 -59 -469 -863 -1111 -1269 -1204 -1059
6068 -1059 -791 -440 0 449 772 1060 1229 1252 1134 851 521 82 -299 -687 -995 -1195 -1236 -1107 -904 -576
6088 -576 -207 255 611 947 1087 1230 1205 952 637 271 -81 -475 -845 -1110 -1181 -1173 -1006 -739 -387 57 464
6109 464 784 1035 1185 1225 1067 792 442 28 -324 -687 -999 -1160 -1227 -1101 -868 -543 -173 277 620 953 1105
6130A105R0o0k32l18l76l52m00l45k15r6N4J68K69L64M28L62L59K26J14J1j30
6151A026l00l18l84l94l54k97j40J7J35J99L11M00M19L54K67J62N2q4k14l17l43
6172A97l88l80k94k05n5O1J46K92L39M02M09K72K06J06Pj54k63l58m28l24l41
6193g53k51j34L1J49J69L46M06M10K99K66J54N3r8k58l09l50l16l98k78k14l8
6214a114Q0J68K59L71L91L67L16J86Q7m0j73k76l47l05l84l31k62n6J4J14K18
6235g17L07M15L97K84K31J53L0j14k45k87l62l71l41k86j48l1R5J73K74M01L71
6256B29L13K87J71R0m5j75l02l14l35l72l16k04j02N7J09K23L28M10L44K86K61
6277I43J29J9j36k73l00l38l34l55k59j51KQ8J88K84L89L45L14K76J59Q5o7k17
$$ plain form
6130 1105 1195 1135 903 585 209 -143 -543 -888 -1103 -1199 -1145 -977 -708 -344 84 446 805 1031 1145 1156 1026
6151 1026 726 408 24 -370 -724 -1021 -1161 -1144 -1009 -810 -499 -99 320 674 941 1103 1155 1071 857 540 197
6172 197 -191 -571 -865 -1070 -1125 -1064 -918 -626 -287 115 524 796 1002 1108 1115 961 698 340 -88 -412 -753
6193 -753 -1004 -1138 -1107 -958 -789 -443 -37 373 672 938 1092 1145 1047 789 480 130 -186 -584 -862 -1076 -1114
6214 -1114 -1034 -866 -607 -236 155 522 838 1024 1111 1071 898 622 275 -30 -414 -745 -1007 -1063 -1049 -935 -717
6235 -717 -410 5 402 686 917 1070 1100 986 741 454 92 -279 -620 -906 -1054 -1085 -990 -817 -543 -142 229
6256 229 542 829 1000 1090 1045 870 568 254 -81 -453 -769 -973 -1075 -1018 -909 -686 -358 52 396 682 943
6277 943 1072 1091 955 682 382 44 -290 -645 -904 -1055 -1053 -965 -777 -493 -104 241 555 831 990 1075 1008 791
6299G91k76k81l69l42k94j99o7O8J06K35L44L82L33K94K16Q3L1j49k79k72l57
6320bl32l25k45j21j3J14J78L03L55L96K89K52J40Q3r8k14k84l44k99l46k63k17
6342i93k0J9J78K37L76L44L47K07K35R5oj73k48k90l39l41k85k23j25J4J23K02
6364f66K60L99L22K86K45J22N2r2k19l31k87k86l63k57j66k6Q6J60K24L34L77
6385A74L22K56J56J06n2j59k18l70l12l09k80k29r8O6J04K00L07L57L25L04J69
6406H19J51L3r4k60k78k92l73k74k43j52k7J12J72K28L22M00K64K80J66J7n4j37
6428G80l04l03k91l14l15j66o2J2J70K19K94L59L86J84K21J00M1j58k31l19l15
6449a2k64l14k60j28L5R6J81K68K93L72L00J84J29J11n1k42k55k93l02l34k69
$$ plain form
6299 791 515 234 -135 -477 -771 -970 -1037 -969 -863 -628 -284 98 431 725 941 1024 1055 906 627 355 -2
6320 -2 -334 -659 -904 -1025 -1038 -924 -746 -443 -88 308 597 849 989 1072 974 760 476 132 -167 -513 -776 -993
6342 -993 -1013 -994 -816 -579 -203 141 488 695 930 1025 1019 846 598 308 -31 -372 -657 -880 -1005 -991 -868 -666
6364 -666 -406 -7 315 601 846 968 1020 928 709 378 91 -195 -558 -815 -981 -1007 -921 -761 -537 -203 174
6385 174 496 752 908 1014 962 803 585 215 -97 -406 -686 -915 -1013 -947 -843 -643 -336 21 346 650 819
6406 819 970 1003 909 649 371 79 -294 -568 -811 -963 -990 -878 -706 -478 -156 244 508 788 954 971 917 780
6428 780 476 173 -118 -432 -747 -913 -975 -963 -793 -574 -280 79 465 649 870 970 1011 853 622 303 -12
6449 -12 -276 -590 -850 -978 -943 -847 -666 -398 -105 267 567 751 880 991 940 698 443 150 -152 -486 -755
6470g55j85p1J27J33J94L05L73L00K61K12R8l5j19k69l23k81l06l08k33r8N0J29
6492h01J73K77K99M07K43J90J53K8q3k02l01l20k95k98k25k12JJ05J30K36L19
6513a76L68L24K25J13P1Qj44k86l16k89l01k92j78j04L4J41J97K87L89L26K25
6534F22J93J31Rr1k51k94k71l17l01k43j42L0R2J69K54K86L62K94K40J03P2n6
6556H91j95k48l34k64k72l11j64n3O5J46J86L29K94L56K71J50R0Qj27k87k73k94
6578c6k94k68k39j06J8J33J80K47L56L66K00K17J30L5o8k11k62l45k23l14k81
6599g65j58mP2J36K32L39L17L13K01J64R3kk10j88l13l25k62l11j87p7L6J04J88
6622f07L04L39L32K24K17J10M9j19k54k89k41l27k78k42r6l8J14J68K04L25L45
$$ plain form
6470 -755 -940 -1011 -884 -751 -557 -252 121 421 682 894 992 957 838 569 246 -35 -341 -649 -882 -980 -930 -801
6492 -801 -628 -351 -52 355 598 788 941 969 886 684 383 63 -232 -530 -755 -967 -966 -861 -731 -495 -176
6513 -176 192 516 741 854 925 933 789 503 187 -102 -403 -695 -873 -977 -943 -802 -605 -318 71 397 622
6534 622 815 946 955 864 613 319 48 -269 -570 -813 -955 -925 -833 -664 -410 -124 238 532 772 875 947 891
6556 891 696 448 114 -150 -422 -733 -897 -950 -885 -739 -553 -224 70 426 697 847 937 945 818 531 258 -36
6578 -36 -330 -598 -837 -943 -925 -792 -612 -365 -9 357 557 774 904 939 871 660 398 53 -170 -484 -765
6599 -765 -923 -927 -855 -719 -487 -148 169 482 683 847 940 938 728 540 227 -98 -360 -671 -858 -935 -899 -795 -607
6622 -607 -303 36 368 592 809 919 968 849 595 306 65 -262 -540 -782 -878 -916 -802 -634 -430 -105 240
6643B40K54K20J47Q6o7j48k70l37k88k58k94j89NNJ54K15L05K77L67K62J24R7
6665I07M7j82k40k26l34k94k60k24j17L0J13J74K12L69L09K37K33J23O1q6j86
6686F66k70k81k75l37k66r3r4Q4J96K03K75L61K85K08J43J12k6j43k37l17k96
6707a02k55k86k10o5O8P9J96K76L16L12K75J46J46Qp5k25k67k81l05k77j78k03
6729i07j0J39J45K18L08L35K73K09J58K6k3j57k63l01k82k87k36j51q7J4J78K11
6751d90K35L15L58K18J32R0L0j34k13k58l20k79k26k23j11K1R5J49K67K95L09
6772B60K76J70J20N5k6k02k77k60k77k94k17j79n4J19J26K08K91L17K84K05J53
6793G98Q6m4j34k18k81k62k60k88k05r7K1J64J98J96L16L46K25J60J40J9j02k18
$$ plain form
6643 240 494 714 861 947 880 732 462 125 -163 -421 -715 -904 -899 -894 -740 -525 -220 57 424 686 810 907
6665 907 954 772 532 306 -28 -322 -582 -806 -923 -893 -780 -606 -394 -25 284 521 754 877 938 852 666
6686 666 396 115 -160 -497 -763 -856 -950 -866 -670 -467 -192 169 454 662 805 917 891 748 511 194 -102
6707 -102 -357 -643 -853 -918 -850 -771 -575 -299 17 329 604 750 896 904 829 604 337 56 -249 -526 -704 -907
6729 -907 -917 -778 -633 -415 -107 228 501 710 868 894 871 714 451 150 -132 -419 -655 -806 -893 -879 -701 -490
6751 -490 -255 60 418 636 768 858 888 754 541 283 -37 -316 -542 -765 -876 -855 -760 -611 -344 -49 260
6772 260 536 706 826 881 855 653 376 116 -161 -455 -672 -851 -905 -786 -660 -452 -161 156 440 645 798
6793 798 884 840 706 488 207 -55 -315 -603 -808 -905 -884 -720 -522 -326 -10 336 561 721 861 880 778 560
6815E60j88l32k68k35k42j50J9O2J57K31K53L03K83K25J02O1j1j53k68k78k38
6836a07k66k72j53r8O0J83J85J81L55L00J98J64J19l8o5j89l17k59k33k94j91
6857g37j12J6R3J66K58K61K96K82J59J20M0l3k04k12k58l03k62k11k14K7N2J32
6879f44K15K50K81K84K30J46M3Pj03k10k99k59k41k56j81j17J6J42J61K66K64
6900eL30K15J67J02j0m3j74k52k84k55k46k41r6k2N8J88J79K52K94L03J81J07
6922G48O3k0j49k17k63k82k45k13j68o1J5J51J69K29L14K44K53J55O3j7m1k21
6944E07k65k61k64k13k13q7J0J12J31K01K59L21K20J91Q3P1o3j60j74l09k39k40
6966c82j99j56m9O9J04K00K56K60K48K55J02O3j4j17j79k58k64k36k09j76j26
$$ plain form
6815 560 372 40 -228 -463 -705 -855 -836 -774 -617 -386 -133 170 453 678 780 841 830 677 409 131 -107
6836 -107 -373 -645 -798 -896 -836 -653 -468 -287 68 368 566 730 849 811 746 557 240 -19 -252 -546 -737
6857 -737 -849 -833 -740 -574 -316 -55 241 523 682 802 842 809 605 393 135 -168 -430 -641 -855 -828 -776 -644
6879 -644 -429 -179 102 386 616 762 805 812 709 499 200 -59 -300 -556 -737 -854 -838 -696 -535 -269 -5
6900 -5 325 540 707 809 799 756 582 330 46 -209 -455 -696 -792 -814 -756 -568 -389 -137 157 460 641 748
6922 748 811 791 642 425 162 -120 -365 -578 -746 -807 -792 -641 -472 -243 71 315 568 723 786 769 728 507
6944 507 242 -19 -283 -496 -709 -796 -786 -674 -543 -342 -83 238 458 649 732 803 740 580 406 97 -142 -382
6966 -382 -581 -737 -786 -717 -613 -413 -157 103 351 606 708 771 757 640 461 203 -61 -297 -506 -682 -808
6987h08M0J32J34K27K60K89K24J47J00k5rj60k73k17k56k32k17r3n6P4J72J78
7009c69K31K73K72K01R6O4k1j45j93k76k10k69k04j77l0M4J10J65K06K58K86K26
7031E38J40O7Kr1j80k40k43k27k23j64j42K2Q4J32J93K66K72K08J82J44%m2j10
7054E88k44k27k55j98k04j51m1J7J42K16J77K42K38K46Q6P3Kj17j56k17k40k35
7076b58j91k15r0NJ12J63K02K36K54K04J71J14J4m0j95j97k01k43k37j64j33n5
7098g44N4J24K00K36K86J76J93J53N6m0q9k05k21k29k15k12j72o9QQ2J95K05K24
7121dK35K39J47Q0lm2j81j78k68k25k06j65j33mO5J35J64K33K61J97K13J00L5
7144F95j0j34j58k27k56k12k14j05j22P3J26J30K14K42K56J74J70O5k8m6j60k39
$$ plain form
6987 -808 -768 -636 -502 -275 -15 274 498 645 745 720 711 551 278 61 -195 -427 -644 -737 -793 -719 -547 -369
7009 -369 -138 135 407 608 704 768 747 602 409 133 -77 -346 -550 -727 -757 -713 -603 -438 -232 26 312 538
7031 538 678 745 747 656 476 236 -7 -234 -457 -621 -763 -741 -657 -525 -332 -66 206 414 596 740 740 698 588
7054 588 344 117 -138 -336 -540 -691 -732 -715 -573 -357 -180 62 300 546 632 705 707 590 434 217 -23 -258
7076 -258 -449 -664 -754 -749 -637 -474 -272 -36 218 422 593 707 721 681 486 289 88 -155 -392 -556 -689 -744
7098 -744 -690 -566 -366 -130 156 332 525 678 734 694 605 400 179 -50 -265 -477 -649 -718 -710 -628 -433 -228 -4
7121 -4 231 470 617 697 694 652 471 293 25 -200 -406 -571 -704 -708 -643 -508 -344 -111 150 347 560 660 695
7144 695 685 551 393 166 -90 -302 -516 -621 -743 -670 -544 -414 -200 42 298 472 642 707 679 633 473 234
7166B34k15k35j88j80r4KN9J45K07J98K48K15J77J05Mo2p7k22k28k34j90j84j14
7189f29n5L1J09J71K04K13K58J95J35K7Mp6j84k18k02k31j91j39j05k1J15J31
7211d58J69K42K23K08J71Q5M1l7j31k04k47k17k04j81j29j4L0J37J66J83K66K40
7233C39J63J23M5J0j23j69k06k26k27j75j58q3J0J06J53J62K41K49K01J47P4q
7255F48l4j28k14k27k06j78k30q1l2M7J44J58K03K20K28J93J23K8k7r3j64k25
7277A53k26j94j87j57o9M1N2J86J91K12K43K02J45M1K7m3j52k25k04k22k22j39
7299e47j24nQ1J24J62K03K23K42J63J23L7p8o1j91k23k22k14j77j44m8J6R1J49
7322d20K36J93K52J90J33P0k0m9j66k00k38j99j77j76j02j6P1J62J78K08K49J99
$$ plain form
7166 234 19 -216 -404 -584 -678 -676 -617 -472 -265 -67 181 396 573 678 682 620 543 321 93 -141 -331 -515 -629
7189 -629 -684 -653 -544 -373 -169 44 302 497 632 659 663 587 403 185 -17 -248 -439 -578 -683 -704 -589 -458
7211 -458 -289 -47 176 384 555 640 681 644 513 309 62 -155 -359 -540 -669 -683 -653 -516 -350 -167 99 339
7233 339 502 625 670 680 557 388 182 -44 -271 -446 -604 -687 -677 -571 -418 -256 -15 234 435 582 656 648
7255 648 614 486 272 45 -161 -339 -569 -650 -682 -635 -491 -333 -130 90 318 511 634 662 635 542 378 153
7277 153 -73 -267 -454 -611 -680 -639 -587 -401 -210 2 245 447 592 633 660 617 465 240 36 -186 -408 -547
7299 -547 -671 -676 -595 -471 -309 -106 117 359 522 645 682 604 543 352 129 -93 -307 -484 -628 -676 -660 -569 -420
7322 -420 -184 9 261 451 584 654 634 585 419 219 -19 -218 -395 -571 -673 -689 -618 -456 -278 -70 179 378
7344C78J53Q1M0Jj42j93k30j83k19j96j38k7K9J07J87J97K09K36J69J21P2rn9
7367E84j67j98k33k31j61j54p8l1P1J61J65K19K46J99J18J36J9m0j42j49k45k25
7389a36j94k00j08l5O4P7J71K19K36J97J69J57O2l9q6j56k09j99k42j66j41j17
7411f76LQ5J45K05J89K48J80J69J04J1o3j26j82j97k39k46j36j06k0MJ46J62K01
7434a39K36K20J87Q3J10p0p2k04j71k18k58j83j43l0jN7J59K09K24K27J91J75
7456E89O0J1q8j19j77k30k17k13j57j29oO6R8J99K01K27K34J81J31K4m6j01j79
7479C59k12k34k47j33j45o6K6R0J57K56J68K21K31J28Q8l1p0j53j86k29k46j95
7501d23j91o3qP3J25J79K49K13J86K03J41J5l6j51j59k29k25k21j75j47n5N6N9
$$ plain form
7344 378 531 612 652 653 511 318 88 -95 -314 -510 -648 -675 -646 -539 -352 -155 54 290 459 580 652 643 584
7367 584 417 219 -14 -245 -406 -560 -638 -669 -598 -437 -272 -53 193 392 510 646 665 625 483 334 89 -136
7389 -136 -330 -530 -638 -673 -609 -532 -361 -142 94 291 460 617 679 640 554 398 189 -10 -252 -418 -559 -676
7411 -676 -673 -588 -443 -238 -49 199 379 548 652 663 600 474 292 95 -144 -390 -526 -632 -652 -648 -502 -340 -139
7434 -139 97 317 504 587 697 627 555 351 180 -38 -296 -479 -622 -652 -653 -596 -437 -228 -4 223 414 589
7456 589 649 660 572 453 276 46 -171 -384 -541 -670 -676 -610 -512 -313 -112 115 349 530 661 685 639 538 359
7479 359 147 -87 -334 -467 -612 -678 -652 -562 -405 -149 19 240 471 599 687 656 586 433 247 18 -228 -423
7501 -423 -614 -677 -685 -612 -487 -308 -59 154 340 543 684 699 663 512 353 124 -101 -322 -497 -644 -699 -643 -584
7524e84J97K45K18K15J84J26Q0Rq0j93j98k22k22k17j70n6l4J02J38K07K26K14
7546A85K17J63J30k5l4j22k03k21k22k33j84j08l4M2R9J90K21K30K27K12J21O7
7568G18m5j11j58k01k64k06k19j15p3KO4J47K26K31K36J89J71J15Pj11j16k03
7590B84k18k36k17j81r5l5O7Q6K00K27K52K38J72J00O0l2j07j80k41j91k35k11
7612d93j67m1K7Q8J73J97K50K40K14J42P6k5m3j44k33k07k71k07j57j12j9O8J23
7635e21K29K18K59K23J62J28J6j3j67j74k22k60k14k04j44l7QJ47K04J84K30K52
7657C04K20J36O0j7r8j50k01k51k59k18j45j12L1O0J60K13K18K93J84J74J33J1
7679G46o4j69k11k29k64k06j68j04o0M1J35J57K73K38K09K38J16N4k9j08j53k20
$$ plain form
7524 -584 -387 -142 76 291 475 601 681 690 610 417 219 -3 -225 -442 -612 -668 -702 -600 -462 -255 -29 185
7546 185 402 565 695 670 636 514 311 90 -132 -365 -549 -657 -691 -649 -550 -360 -139 91 318 530 651 718
7568 718 673 562 404 203 -61 -267 -486 -601 -674 -672 -608 -461 -235 -4 232 421 592 707 714 603 487 284
7590 284 66 -170 -387 -568 -663 -698 -631 -545 -345 -118 134 372 544 644 704 672 565 385 144 -47 -282 -493
7612 -493 -660 -701 -674 -586 -413 -216 34 274 488 630 706 681 638 494 261 54 -217 -424 -581 -693 -712 -644 -521
7635 -521 -292 -74 185 408 570 698 714 701 534 360 138 -122 -336 -540 -684 -721 -713 -566 -362 -178 52 304
7657 304 524 660 720 703 605 455 254 3 -256 -474 -619 -731 -700 -640 -480 -267 -49 244 428 602 735 746
7679 746 682 513 302 73 -191 -397 -565 -669 -729 -688 -553 -396 -123 115 324 562 678 732 703 595 442 222
7701B22k64k49k08j41q8OO9J78K46K27K39K21J68Q4K7n9j56k29k33k52k45j39
7723e76j46rK9J57K10K64K30K55J49J35N3o4j28j80k45k43k40j88j42p3K0J03
7745f29J89K25K85K16K17J81R3o8q4j61k00k67k47k40j26j09j7O8J69K09K59K36
7767A99K12J96J11N9r8j44j65k54k64k17k12j31l0M7Q3J95K66K60K12K29J43J2
7789G09L7j47j76k01k40k66k14j64o4j8J30J27K32K57K21K53J50J10L1q4j66j99
7811C18k72k61k38j72o8m0L3J51K08K36K20K75J79J58L8l1j18k10k50k24k79k19
7833e66j13q5PJ04J77K85K40K42J80J82Q6mr1j74k17k28l01j98j77r1kQ2J16K33
7857c13K58K27K67J83J00N0j09j23j75k48k73k46j49j76l9K3J30K10K31K51K31
$$ plain form
7701 222 -42 -291 -499 -640 -728 -722 -653 -475 -229 -2 237 458 626 710 737 678 522 293 60 -192 -437 -576
7723 -576 -722 -731 -702 -545 -335 -71 159 414 563 698 751 687 559 379 134 -109 -349 -537 -679 -752 -732 -629
7745 -629 -440 -215 70 286 503 684 777 709 625 464 264 -3 -250 -490 -616 -725 -742 -674 -505 -296 -37 199
7767 199 411 607 718 777 679 535 370 116 -148 -365 -577 -708 -738 -691 -608 -413 -147 113 325 554 697 709
7789 709 746 599 423 222 -18 -284 -498 -662 -726 -744 -614 -487 -255 2 223 476 626 736 767 683 517 318
7811 318 46 -215 -453 -625 -693 -733 -700 -549 -341 -105 115 390 569 727 765 734 616 406 156 -68 -347 -566
7833 -566 -679 -764 -757 -653 -476 -191 49 291 471 653 739 735 644 470 253 25 -276 -474 -651 -742 -744 -662 -546 -313
7857 -313 -55 172 439 622 722 772 663 540 365 117 -156 -402 -551 -727 -766 -743 -613 -403 -172 79 310
7878C10K08J71P0m1o8k00k05l10k46k10j35j03kJ05J48K22K63K72K21J60J11K7
7900G68r0j60k05k33k90k14j83j36j5P9P2K47K67K68J73K24J39O3m7j36k08k10
7922A73k68k29k26j68n6N3P6K13K37K79K16K14J50P6k1p8j53k26k55k48k17j50
7944f08j43J0P1J27K29K73K45J82K18J03O0q0j29k06k25k74k53j93j05l2K5J08
7966e97J99K52K58K23K02J37O7l8j18j70k09k47k58k28j29r6K9O3J69K60K36K25
7988B30K11K06J11j6p1j66k40k06k31k55k00p1l7N5J32J92K44K90K32J46J31N8
8010G45n6j60j43k49k21k55k23j18o1M1N8K11K51K35K22K41J40J02m6n7j83k41
8032B33k13k41k31j66j09J3O9J55J77K80K59J71K03J35pm4j64j88k39k24k47k07
$$ plain form
7878 310 518 689 759 718 650 450 245 -65 -311 -521 -656 -759 -761 -656 -508 -286 -23 249 470 630 741 768
7900 768 678 518 313 80 -210 -424 -607 -743 -758 -679 -607 -360 -93 175 348 572 711 774 727 591 383 173
7922 173 -95 -324 -550 -718 -774 -721 -645 -432 -195 84 300 514 664 740 719 641 488 262 7 -241 -458 -608
7944 -608 -751 -741 -670 -543 -314 -41 204 386 604 707 767 687 558 352 127 -147 -400 -593 -698 -730 -705 -597
7966 -597 -398 -146 112 335 537 674 741 703 585 415 206 -41 -299 -527 -656 -752 -723 -660 -491 -231 5 230
7988 230 441 647 758 742 671 505 265 59 -172 -427 -627 -698 -735 -680 -548 -356 -112 178 410 556 687 745
8010 745 689 529 386 137 -84 -339 -562 -680 -741 -700 -642 -431 -180 55 277 518 658 760 714 657 474 233
8032 233 20 -221 -452 -618 -727 -714 -645 -490 -313 -33 226 397 600 735 728 684 520 332 93 -131 -378 -585
8054e85r5m9M6J25J97K02K61K31K07J06R9l3j36j82k29j97k60k11j67m3K5Q0J60
8077d48K23K08K44K06J85Q8Mo2j85j96k07k20k40j81j33QO5J32J74K65K31J98
8099C59K07J18N2o9j37j90j82k43k36k25j03l6RQ2J81K29K37K33K17J01Q9K5j43
8122E75j44j88k28k43k24j45j22K6O7J22K27K25K65K14J35J18L5m0k01j64k32
8143G8k13k07k24q6o0O4R5J98J95K78J94J82J37P1j0j67j46k16k14k40k10j64
8165f65l9M7Q0J41K30K13K27J89J42J10J0n9j73j93k21k31k09j83n6kK8J15J96
8188c03K24K49J91
$$ plain form
8054 -585 -680 -729 -683 -558 -361 -159 102 333 540 646 745 712 576 394 165 -32 -292 -503 -670 -713 -688 -608 -448
8077 -448 -225 -17 227 433 618 706 710 648 463 267 60 -160 -400 -581 -714 -706 -641 -509 -335 -70 161 359
8099 359 566 684 736 667 530 340 158 -85 -321 -546 -649 -685 -676 -594 -413 -184 53 286 503 604 693 718 575
8122 575 431 243 15 -228 -452 -597 -719 -693 -626 -504 -277 -52 213 427 562 680 715 675 474 310 78
8143 78 -135 -342 -566 -652 -712 -648 -553 -355 -160 118 312 494 631 702 692 525 379 163 -51 -291 -501 -665
8165 -665 -704 -657 -577 -436 -206 7 234 423 565 675 685 626 453 260 39 -192 -401 -584 -640 -642 -614 -499 -303
8188 -303 -79 170 361
8191C61
$$ Imaginary data points
##PAGE= N=2
##DATA TABLE= (X++(I..I)), XYDATA
0@%%%%%%%%%%%Qj6J6j6K4l2M0m8N6p2Q6j02J20j39J63j90K21k55K92l34L82m32
33b28M89n54O25p03P89q86R86j100J225j358J505j665J841k033K243k470K723
50A429l001L306l642M017m438M907n442O055o763P591q577R775j1272J3204j5797
65h648J9490k5217L5413n9161K19773J59255k11117p1114j48376j12000j18827
76c20529o7148n1093M8691P8435J05670J26204J62443J09675Q4054Q0062O3857
87D20321j8167q2002j25270j20800j09326j03001j19780r7093m0696K2702N9109
98c14003Q8759J12339J33597J19386R0586P9418O5244M987o0401r6595j06788
109A16529j03843r9233j16056j16319n2100K4010M3584N6720R7330J16940J10276
$$ plain form
0 0 0 0 0 0 0 0 0 0 0 0 0 8 -8 8 -8 16 -16 24 -24 32 -40 46 -56 64 -75 88 -102 119 -136 156 -178 204 -228
33 -228 261 -293 332 -371 418 -468 518 -582 643 -715 790 -875 966 -1067 1176 -1294 1429
50 1429 -1572 1734 -1908 2109 -2329 2578 -2864 3191 -3572 4019 -4558 5217 -6055 7149 -8648
65 -8648 10842 -14375 21038 -38123 181650 340905 129788 58674 -89702 -201702 -320529
76 -320529 -387677 -438770 -390079 -311644 -205974 -79770 82673 192348 276402 356464 420321
87 420321 402154 320152 194882 74082 -35244 -138245 -258025 -355118 -395814 -373112 -314003
98 -314003 -225244 -112905 20692 140078 230664 310082 375326 380313 319912 223317 116529
109 116529 12686 -86547 -202603 -318922 -371022 -347012 -303428 -246708 -149378 -32438 77838
120G7838J08364Q9822N0295J9151k0367q0050j03031q4099r2436j19874j05368
131b59755n7739q109L4126N3836O0573Q7170J17325J10107Q1614O1178L0430j5440
143B95316m9732p0469q2872q7488r9759j06227p2238j6719J6635L0445M8131P3096
155a21881J00203J12353Q9163N4338L7042J1748l1442n7485o7685q5710r7584
166e6940r1930p6888m2604N190K6553K8077N6936R6111J01603Q6106O6347L8035
178B36596J4898k470l4865o8360p8439q2790r0536p5257m1168j6595L296K6715
190b08975M6743P2311R6315Q8446N8683M2314L2010P446k1593m8075p2764q1168
202A1693p5154p1139n6623k5828m240R335L6372O5705Q0531Q3240O9548M3261
$$ plain form
120 77838 186202 276024 326319 345470 325103 245053 142022 57923 -34513 -154387 -259755
131 -259755 -317494 -325603 -291477 -237641 -177068 -89898 27427 137534 219148 280326 310756 295316
143 295316 245584 175115 92243 4755 -95004 -201231 -273469 -290188 -273553 -243108 -194977 -121881
155 -121881 -21678 90675 179838 234176 271218 282966 251524 194039 126354 40644 -56940
166 -56940 -148870 -225758 -268362 -263172 -236619 -208542 -151606 -55495 46108 132214 198561 236596
178 236596 251494 249024 214159 145799 67360 -15430 -105966 -181223 -222391 -238986 -235690 -208975
190 -208975 -162232 -89921 6394 94840 153523 195837 227847 235293 213700 165625 92861 11693
202 11693 -63461 -134600 -191223 -217051 -221291 -211956 -175584 -109879 -29348 53892 123440 166701
214A66701L0542K5410l332m2442o2381p1714p6039o5816n2905m3275k0231R344
226b06138K7952M7880P2655P7156O3623N3673M1556K2916N711k0852n4871o8062
238F3199o2440o2273o0617m4983k7060p427K1116M4114N5003O5808O8124N4151
250A06715M2616L5506J3845j6195l9400n6656o2736n5477n3776n6525l9537r342
262a90962J2656L1905M9941N5984N8090O1338N1515L3275K0061l63l1762n0462
274A01216n2711n4636n5093n1063m5395k6137P370K9448L6483M7263N7182N5961
286D9888N2308M4170K3670J853j6070l8098n2485m9395m8126n4669m8885k8853
298a64692n750J8085L4432L8712M6186N8381N5827M1022K8926J3207r550k7567
$$ plain form
214 166701 197243 222653 219321 176879 114498 42784 -33255 -99071 -151976 -195251 -215482 -206138
226 -206138 -178186 -130306 -57651 19505 83128 136801 178357 201273 206984 186132 131261 63199
238 63199 759 -61514 -122131 -167114 -194174 -201601 -180485 -136371 -81368 -15560 52564 106715
250 106715 149331 184837 198682 182487 143087 86431 23695 -31782 -85558 -142083 -181620 -190962
262 -190962 -178306 -146401 -96460 -40476 17614 78952 130467 163742 183803 183440 151678 101216
274 101216 48505 -6131 -61224 -112287 -157682 -183819 -176449 -147001 -110518 -63255 -6073 49888
286 49888 102196 146366 170036 171889 155819 117721 65236 15841 -32285 -86954 -135839 -164692
298 -164692 -170442 -152357 -117925 -79213 -33027 25354 81181 122203 151129 164336 154786 127219
310A27219m0551n0704n0302m6665m8669l9641j2051J1674K2627L3091M3278N0319
322c75N5729M9501K9267J3600L665j5519l5710m3871m7829n0794m6088l6903k3199
335a48526K18J9387K4498L2870M9834N5935M7286L4671J9560N253n112k1178m1152
348G3544m7764m4883m5908m1919k5388p326P205K0357K9067L8771N2902N3925
360F2583L5815J9925J3350K364j4065k9648m3525m8634m2816l8031l3139j6408
372a32229K837J2374K1801L6360M6630M8826M2475K6377J3184R053k295k4690
384A00703l9388m2399m3007l9875l1948k3055q964Q719J9111K6915M1232M9102
396A7146M1084K9142K0926J2357K186j3348l3615m3640l8659l5051l5965k8552
$$ plain form
310 127219 86668 35964 -14338 -61003 -109672 -149313 -161364 -149690 -127063 -93972 -50694 -375
322 -375 55354 104855 134122 147722 151387 135868 100158 56287 8458 -42336 -88424 -125327 -148526
335 -148526 -148308 -128921 -104423 -71553 -21719 34216 81502 116173 135733 140986 135874 114696 73544
348 73544 25780 -19103 -65011 -106930 -132318 -139644 -132439 -112082 -83015 -44244 8658 62583
360 62583 98398 118323 131673 134037 119972 90324 46799 -1835 -44651 -82682 -115821 -132229
372 -132229 -129392 -117018 -95217 -58857 -12227 36599 79074 105451 118635 127688 125393 100703
384 100703 61315 18916 -24091 -63966 -95914 -118969 -127933 -119214 -100103 -73188 -31956 17146
396 17146 58230 87372 108298 120655 122841 109493 75878 32238 -6421 -41472 -77437 -105989
408a05989j3968k05J3890K6283L3782M0928M3588L3903K1748J7312R429q824k6293
421H5584l6555l9581l5168l1474l1831k3625m743R937J9181K9896L7681L8423
433A7725L5607K8874J8970J1285N72j8963l3849l4913l2697l3621l2137k5896
445i9043j3702M054J7521K2966K9982L8142L7027K9558K3570J5239K781j0285
457I7810k4332l3892l2896l0172l2734l0474j7080j679J0239J9785K5841L0908
469a8676L6797L5079K4866J6341Q711m586j8403k6458l0983l2490l1195k9638
481g0635k3298p521P303J3735J9840K8708L3937L4350K9543J9345R155J345r841
494H5966k2885k8788k9379l1356l0651k3811j3244j13J1504J6886K1989L1083
$$ plain form
408 -105989 -119957 -120162 -106272 -79989 -46207 -5279 38309 72212 93960 111272 120701 111877 85584
421 85584 49029 9448 -25720 -57194 -89025 -112650 -117393 -107456 -88275 -58379 -20698 17725
433 17725 53332 82206 101176 112461 113033 94070 60221 25308 -7389 -41010 -73147 -99043
445 -99043 -112745 -108691 -91170 -68204 -38222 -80 36947 66505 90075 105314 108095 97810
457 97810 73478 39586 6690 -23482 -56216 -86690 -103770 -105449 -95210 -75425 -49584 -18676
469 -18676 18121 53200 78066 94407 103118 98532 80129 53671 22688 -9802 -40997 -70635
481 -70635 -93933 -101454 -94151 -80416 -60576 -31868 2069 36419 65962 85307 94462 95807 85966
494 85966 63081 34293 4914 -26442 -57093 -80904 -94148 -94261 -82757 -65871 -43882 -12799
506a2799L5313K9746K1399J3785M451n315j5334k5728l0314k8572k8303k6748
518f8419j7445m671N556J3595K0689K6268L1103L1931K4168J4701R021P23j1627
531G5593k1449k6967k8756k7066k4722k1436j1934J695J0816J6203K3414K8928
543e681K9098K5895J9096J1118M409m651j7264k5634k6256k5106k5386k2507j5516
556g8385n493O695J5035J8855K4275K8955K6678K0528J4861Q150j117j1456k0927
569D6654k5983k4568k2805k3725j9853r021K067J0511J6595K1124K5113K7233
581B3342K4001J6231R904L766o754j6868k1844k3845k3812k2699k0964j4177k134
594g5853P783J2586J7020K3089K6420K4770J9440J2034N174j479j0956j9580k2414
$$ plain form
506 -12799 22514 52260 73659 87444 91895 86580 71246 45518 15204 -13368 -41671 -68419
518 -68419 -85864 -90535 -84979 -71384 -50695 -24427 6676 38607 62775 77476 86497 87220 75593
531 75593 54144 27177 -1579 -28645 -53367 -74803 -86737 -85042 -74226 -58023 -34609 -5681
543 -5681 23417 49312 68408 79526 83935 79284 62020 36386 10130 -14976 -40362 -62869 -78385
556 -78385 -83878 -77183 -62148 -43293 -19018 9937 36615 57143 72004 80154 79037 67581 46654
569 46654 20671 -3897 -26702 -50427 -70280 -79301 -77234 -66723 -50128 -29004 -3891 23342
581 23342 47343 63574 73478 77244 70490 53622 31778 7933 -15879 -38578 -59542 -73719 -75853
594 -75853 -68070 -55484 -38464 -15375 11045 35815 55255 67289 72463 70984 60028 40448 18034
607A8034k2399k3351k2351j5953o280L201J0159J3913J8663K5309K6379K0657
619D5981J4026Q054J400o271j4476k0768k2801k2308k1752j8773j0079j10O133
632f1744J0918J6537K2182K5469K3159J5879R323M981j596j0954j7893k1070k2334
645g143k1649j8941j3564m836L247Q086J3210J9968K4350K3057J7751J2138P144
658F2818J804n816j5044k0506k0871k0645j9845j5534q597j097N602J1116J6729
671b9886K1990K3363J9081J3415R920N189k449j1090j7860k0457j9917j9024j7169
684d4894j2133m507K430Q126J4437J9741K1426J9976J5789J1371P745J640p555
697E3592j5234j8637j9167j8795j7582j4267q307p66N823J1129J6784K0472J9925
$$ plain form
607 18034 -4365 -27716 -50067 -66020 -72300 -69099 -58940 -45027 -26364 -1055 25324 45981
619 45981 60007 68061 69461 63190 48714 27946 5145 -17163 -38915 -57688 -67767 -67877 -61744
632 -61744 -50826 -34289 -12107 13362 36521 52400 61723 66704 65108 54154 36261 15191 -7143
645 -7143 -28792 -47733 -61297 -66133 -62886 -54800 -41590 -21622 2728 25785 43536 55674 62818
658 62818 64622 58806 43762 23256 2385 -18260 -38105 -53639 -62236 -63333 -57731 -46615 -29886
671 -29886 -7896 15467 34548 47963 57883 63072 60623 49533 31673 11216 -8701 -27725 -44894
684 -44894 -57027 -61534 -59104 -50978 -36541 -16800 4626 24602 40391 51762 59507 61147 53592
697 53592 38358 19721 554 -18241 -35823 -50090 -58397 -59163 -53340 -42211 -25427 -4955 14970
710A4970J6928J3580R836M067l739j1710j6818j7988j7791j8058j5987j0850m193
723e7753K831R079J4044J7858J9411J7963J4848J1414O605n80q336j3584j6427
736A7373j7367j7646j7122j3469o728L92O327J1380J5624J7720J7719J6331J3226
749D3760Q662K495m987j1199j4439j6339j7474j7378j4629r220k469L856Q734
762d0627J2572J5879J7577J7096J4990J0739M581k253q186j2410j4795j6245j7053
775a8135j5782j1365n265O61N962J0505J4065J6647J7335J5769J2062O653M01
788D9513n204r397j2570j5310j6861j6394j3274p883j852L574Q294J2220J5250
801i894J6618J6094J3224Q589L242j922o798j0919j4414j6627j6612j3990r337
$$ plain form
710 14970 31898 45478 55314 59381 55642 43932 27114 9126 -8665 -26723 -42710 -53560 -57753
723 -57753 -54922 -45843 -31799 -13941 5470 23433 38281 49695 56300 55720 47384 33800 17373
736 17373 6 -17640 -34762 -48231 -54959 -54567 -48240 -36860 -21236 -3516 14203 30534 43760
749 43760 52422 54917 49930 38731 24292 7953 -9521 -26899 -41528 -50748 -53217 -49361 -40627
762 -40627 -28055 -12176 5401 22497 37487 48226 52807 50554 42368 29958 15163 -1082 -18135
775 -18135 -33917 -45282 -50547 -49886 -43924 -33419 -19354 -2707 14628 30397 42459 49112 49513
788 49513 44309 34912 22342 7032 -9829 -26223 -39497 -47380 -49232 -45658 -37364 -25144 -9894
801 -9894 6724 22818 36042 44631 47873 45951 39153 28234 13820 -2807 -19419 -33409 -42746
814d2746m122J058N781R902J3462J5841J6098J4304J0508N468L96m319q982j3147
828A9502j5773j6073j4164j0590o311j812K936P812J2039J4962J6010J4792J1517
841C4847P208K576k069o642j1148j4506j5617j4383j1730q302m261O02N860J0527
855b7038J3841J5192J4604J2380Q848M725M66m352r182j3209j5012j4479j2493
868b5709r654o194j640L744Q590J2153J4000J4233J3035J0481O854K497k277p236
882C2877j1464j3868j4031j2812j0796p990l914J382O594J0546J2840J3573J3296
895A6233J1651Q551M339l71n197r504j2344j3434j3070j1771r414n717o13M682
909c5979Q845J1396J2682J3000J2357J0032O167J537l277p528j0802j2677j3060
$$ plain form
814 -42746 -46868 -45810 -40029 -30127 -16665 -824 15274 29578 40086 45554 45950 41631 32649 19502
828 19502 3729 -12344 -26508 -37098 -43409 -45221 -42285 -34473 -22434 -7472 8538 23330 34847
841 34847 42055 44631 42562 35920 24772 10266 -5351 -19734 -31464 -39766 -44027 -43425 -37565 -27038
855 -27038 -13197 1995 16599 28979 37827 42552 43018 38666 29484 16275 1263 -13216 -25709
868 -25709 -35363 -41557 -43197 -39453 -30863 -18710 -4710 9523 22558 33039 39893 42390 40113 32877
882 32877 21413 7545 -6486 -19298 -30094 -38084 -41998 -40616 -34022 -23476 -10636 2937 16233
895 16233 27884 36435 40774 40403 35206 25702 13358 -76 -13146 -24917 -34331 -40048 -40661 -35979
909 -35979 -27134 -15738 -3056 9944 22301 32333 38500 40037 36760 29232 18430 5753 -7307
922g307j2320j0354p031k476K506O793R711J1632J2720J2769J1157P725L150j481
936C7194n621q967j1365j2599j2512j1123q300m338K65M610Q104J0666J2309J2769
950A1092J1775Q831M742M33l571o974r839j1948j2657j1836r358n824j644K569
964c4209O340R368J1514J2346J1869R823O364K458j409n111q398j1107j2492j2096
978a4740j0051o940l390L99M379P836J0439J1862J1861J0473P928M279L64l482
992C1217o924r878j1754j1938j0606q058m992j509K305O303R514J1144J1551J0843
1006A7218Q908N914K108j834n442q396j0683j1642j1024r013o368l172N92M602
1020b8232Q127J0392J0955J0683R636P428L863j95l872o992r439j0913j1263r844
$$ plain form
922 -7307 -19627 -29981 -37012 -39488 -36982 -30189 -20478 -8846 3874 16643 27800 35525 38675 37194
936 37194 31573 22606 11241 -1358 -13870 -24993 -33293 -37631 -37366 -32756 -24652 -13986 -1677 11092
950 11092 22867 31698 36440 36873 33302 26328 16489 4541 -8116 -19952 -29310 -35134 -36778 -34209
964 -34209 -27869 -18501 -6987 5359 17228 27051 33415 35873 34464 29353 20955 9848 -2644 -14740
978 -14740 -24791 -31731 -35121 -34722 -30343 -22507 -12068 -206 11655 22128 30056 34335 34699 31217
992 31217 24293 14415 2661 -9277 -19883 -27941 -32933 -34442 -32137 -25834 -16320 -5176 6375 17218
1006 17218 26126 32040 34148 32314 26872 18476 7793 -3849 -14873 -23886 -30254 -33426 -32834 -28232
1020 -28232 -20105 -9713 1242 11925 21561 28989 32852 32657 28785 21793 12354 1441 -9822 -19666
1034a9666p409m522j107K825O631R247J0399J0602J0061Q493N549J300k545n476
1048B4382q093j0097j1002j0442q453n588k439J054M913Q112R740J0208J0180
1061A2475R269O654L002j052m227o604q874j0591j0875r130o510l701l02L137
1075b7329O443Q977R941R933R535P811M381M15k765n300p766r801j0730r938p240
1090b3433m453j904J403N028P857R486R888R636Q255N706K071j592m092o287q982
1105H587j0460j0045q148n385k825k25L096O712Q962R486R314Q686O668L544K08
1120B8175k925n321p561r748j0267q652o074l990j653J559N095Q020R389R049
1134E096Q447P558M996J610j567m199o683q818r773r126p075m590k736k34L755
$$ plain form
1034 -19666 -27075 -31597 -32704 -29879 -23248 -14001 -3602 7000 17061 25554 31103 32403 29858 24382
1048 24382 16289 6192 -4810 -15252 -23705 -29293 -31732 -30678 -25765 -17653 -7913 2295 12475
1061 12475 21744 28398 31400 30348 26121 19517 10643 52 -10823 -19953 -26463 -30164 -30466 -27329
1075 -27329 -20886 -11909 -1968 7965 17500 25311 29692 30107 27342 22042 14276 4475 -6255 -16193 -23433
1090 -23433 -27886 -29790 -28387 -23359 -15502 -6016 3872 13508 21763 27469 29540 27948 23856 17569 8587
1105 8587 -1873 -11918 -20066 -25451 -28276 -28501 -25405 -18693 -9731 -245 9069 17755 24423 27967 28175
1120 28175 25250 19929 12368 2620 -7647 -16299 -22373 -26363 -28016 -26457 -21362 -13342 -3953 5096
1134 5096 13543 21101 26097 27707 26140 21941 15258 6440 -3333 -12459 -19534 -24124 -26860 -27094 -23339
1149b3339P169Q603Q945Q426P729O139L268m62l390n384p668r399r171p573n702
1164b1809l512j213J928N799Q190Q465P995P873O967M459J171k104m866o524q096
1179D723r225q326o188m397k380P77M284O979Q254Q028P506P447N937K295j174
1194B4540l597n709p381q443q537p297m999k975o79K703O199P517P572P794P500
1209A4208O433M062J07l140m549o015p890q662p713n945l796j296J235M327P001
1224a1633P525P197P530P244M844J413j597l912n345o557q221q561o541m265k436
1239b3315K34L184N545P109P558P238P113O039K791r60k909m195o064p695q262
1254f589p540m968k479r64J437M679O633O999P309P271O076L927Q14k304l670
$$ plain form
1149 -23339 -16170 -7567 1378 9804 17533 23672 26940 26478 23088 17704 10036 637 -8534 -16107 -21809
1164 -21809 -25321 -26534 -24606 -18807 -10617 -2152 5843 13716 20683 25142 26313 24209 19343 12819 4723
1179 4723 -4502 -12828 -19016 -23413 -25793 -25016 -20732 -13753 -5499 2529 10035 17482 23419 25714 24540
1194 24540 20943 15234 7853 -590 -9127 -16424 -21423 -24398 -25077 -22374 -16175 -8658 -1086 6708 14208
1209 14208 20641 24703 24810 21670 17121 11106 3216 -5446 -13159 -19104 -22900 -24196 -22961 -18634 -11633
1224 -11633 -4108 3089 10619 17863 22707 24120 22523 18611 13266 6709 -1512 -10073 -16614 -20879 -23315
1239 -23315 -23081 -19897 -14352 -7243 315 7553 14666 20705 23496 22536 19627 15432 9368 1673 -6589
1254 -6589 -14129 -19097 -21576 -22540 -21103 -16424 -9791 -2792 4517 11788 17864 21791 22605 20301 16631
1269A6631m708o865q429p629n648l506j386N20K743N634P316P084O717O651M725
1284A9850J716q00k832m387n841p504q287o293l592k253q35J932M522O425P367
1299h12O787O036N402L316J4k239l325n207p159p602o844m803k361j194J33L383
1315a6475O284O763O577O270N366L923J772j170l410m247n894p636o979n006l399
1330a7261k025j77K030M780O914O622N598N538M967K443j29k243m137n327o243
1345A350p140o087l667k236j448J070M124N892O428O008N170M910M081R37k071
1360A7321l262m370o036o521o131m911k971j191p9K495N535O204N486N445N304
1375A2318M088K228n78l191m066m566o124o700n131l469k244l29J716L842N844
$$ plain form
1269 16631 11923 5058 -3371 -11000 -16648 -20154 -21540 -21020 -18277 -12643 -5327 1757 8474 15125 19850
1284 19850 21566 20766 17934 13547 7706 202 -8085 -14378 -17970 -20223 -21058 -19126 -14604 -8179 -812
1299 -812 5975 12011 17413 20729 20743 18504 15179 9972 2813 -4789 -11633 -16436 -18797 -19991 -19858 -16475
1315 -16475 -10191 -3428 3149 9419 14785 18708 20480 19310 15900 11653 5759 -1877 -8856 -13862 -17261
1330 -17261 -19286 -19463 -17433 -12653 -5739 883 6481 12019 16986 19429 19300 17057 12920 7593 1350
1345 1350 -5790 -11877 -15544 -17780 -19228 -18158 -14034 -8142 -1714 4294 9464 14374 18455 19392 17321
1360 17321 14059 9689 3653 -2868 -8999 -13910 -16881 -18072 -18151 -15656 -10121 -3917 1569 7014 12318
1375 12318 16406 18634 18056 14865 10799 6233 109 -6591 -11722 -15191 -17435 -17764 -16048 -12206 -6362
1390f362O094M921M991N139L002q7k003l488m558n118o136o285m175j945j143
1405a7153N20L266N029N520N637N040M510L994J508j822l167l396m852o096n870
1420g332m930l045r85J26J527M296N809N221M917N107L994K018j28k590l661l850
1436F494n169o530n349l116j851n93J311K959M803N962N053M298M551L231K89
1451A6343j751k803l963m833n518n899m366j705p54q5K301M514N173N327M907
1466F888L984L471J952j003k978l181m075n682n564m452l071j194J02R40L321
1481a0542N611N331M298M401L906K165K10j866l528l755m278n797n372l092j706
1496a4014q69Q19K718M240N449N014L703L795L516R59j548k523l566m442m860
$$ plain form
1390 -6362 -268 4653 9644 14783 17785 17698 15695 12207 7649 2531 -3605 -9890 -14065 -16010 -17153
1405 -17153 -16633 -13367 -8338 -2818 2819 7859 12369 16363 17871 16049 12882 9486 4634 -1462 -7332
1420 -7332 -12262 -15307 -16292 -16166 -14639 -10343 -4534 687 5604 10711 14705 16723 16595 14005 10344 6494
1436 6494 1325 -5205 -10554 -13670 -15521 -16114 -14803 -11844 -7041 -1079 3974 8272 12823 16054 16343
1451 16343 14592 11789 7826 2993 -2525 -8424 -12790 -14495 -15249 -15334 -13033 -8519 -3346 1981 6888
1466 6888 10872 14343 16295 15292 12314 9133 5058 -624 -6188 -10640 -13711 -14905 -14803 -13863 -10542
1481 -10542 -4931 400 4698 9099 13005 15170 15380 13514 9986 6231 1953 -3844 -9216 -12308 -14014
1496 -14014 -14883 -14064 -11346 -7106 -1657 3357 7060 10855 14371 15330 13782 11259 7693 3251 -1609
1511a609n215m470k128m59j84J565M085M838M679M502L833L198K237k55k834l255
1527H528l348m761n332m283l025j500J01R26K359M768N231M070L878L881K362
1542A3855K84j371l090l614l609m836n363l449j495q30M39K234L602M653N041
1557B451L780L193L251J516j257k409k853l882m511m693m395k574l31J16Q17L155
1573h626M594M390M295L708K788J991M73k177l253k939l946n121m277k864j550
1588a2514j02R37J732L819N177M185L249L449K476O08r47k445l473l535m073m937
1604f394l771j437n51J3J674L168M130M759L876K691K778K068m28k328k683l483
1620D082m260m179l978k813o52K54M21K197M341M466L835L484K722J870Q89j334
$$ plain form
1511 -1609 -6824 -11294 -13422 -13881 -14065 -12500 -8415 -3577 1102 5604 9437 12635 14872 14617 11783 8528
1527 8528 5180 419 -4913 -9196 -12221 -13721 -13620 -12694 -10335 -5567 -336 3734 7612 11493 13855
1542 13855 14139 12768 9678 6064 2455 -2381 -7744 -11193 -12688 -13518 -13079 -10845 -7243 -2590 2451
1557 2451 6231 9424 12675 14191 12934 10525 7672 3790 -721 -5414 -9809 -12383 -12714 -12598 -11781 -8626
1573 -8626 -4032 358 4653 8361 11149 13140 13613 11436 8183 5244 1298 -3823 -8100 -10964 -12514
1588 -12514 -12616 -11679 -9947 -6128 -951 3234 6483 9932 12408 13016 12069 9624 6151 2616 -1457 -6394
1604 -6394 -10165 -11602 -12153 -12140 -10466 -7298 -3168 1591 5467 8158 10936 13004 12576 10248 7565 4082
1620 4082 -178 -4357 -8335 -11148 -11800 -11546 -11125 -8928 -4587 -121 3714 7198 9920 11790 12679 11345
1636A1345l221l076l249m434m288k747j667n13P22J514L078M841M468K916K756
1651H445K725J024p20k024l226l420l424m293m060j897m17j14J198K969L807M289
1667H62L852K502K333K316L40k177k743k996l795l953l650l055j198M60O13J650
1683h639L739M270L520L118K908K053J002q49l024l347k673l636m266l066j657
1698a0547o23N79J575K475M009M446L014K482K821J543o79k058k868l215k973
1713a9l548m194k594m09J24Q06K525L512L775L767K872K141K107Q03j835k884
1729F949k495l085l805l678l101j658L12R50J177K984M176L486K932K880K133
1744A0157R48m77k398l181k551l038m239l561j591m67L42J336K058L273M347L451
$$ plain form
1636 11345 8124 5048 1799 -2635 -6923 -9670 -11337 -11850 -11128 -9614 -6536 -1695 2773 5689 8445
1651 8445 11170 12194 11474 9450 6224 2804 -620 -4913 -8973 -10870 -11287 -11401 -10203 -7234 -3427 862
1667 862 4714 7216 9549 11865 12205 10028 7285 4289 494 -3459 -7109 -10164 -11362 -10902 -10289 -8639
1683 -8639 -4900 -630 2890 6008 8916 10969 11971 11122 8098 4751 2078 -1558 -5824 -8890 -10547
1698 -10547 -11170 -10591 -9016 -6541 -2532 1914 4928 7410 10231 11774 11095 9037 6169 2954 -19
1713 -19 -3567 -7761 -10355 -10764 -10640 -9834 -7309 -3797 -22 3745 6617 8758 10865 11668 9833 6949
1729 6949 4454 1369 -2436 -6114 -9215 -10873 -10561 -9611 -8434 -5450 -1274 2212 5144 8024 10157
1744 10157 11105 10628 8230 5049 2498 -540 -4779 -8340 -9931 -10398 -10056 -8720 -6662 -3389 958 4409
1760D409K298K455J789k46j777k366k960l148l347l849k867n73L96L47J677L238
1776d524L674L776L124K079J702J045j015k640k409k734l759l771k834j666q9
1791a0041P64Q73K153M029M002K829K570K151R93j37j580k888k850k875l833l598
1807g438j799m70p5R43J941K924M084L781K258J916K006L92j378k159k743l283
1823I00l303l319k894j123J93K76J211L034L692L497L030K193J623J278k01k353
1839G734k742k626l312l571k708j909p63N08J025J915L533M035K875K214K249
1854H457J481J35j144k703l121k668l165l541k325q47k84O77K026K794L466L650
1870B888K579J820J981J058r87k198k570l040l194k973k975j808r0N17R39K519
$$ plain form
1760 4409 6707 9162 10951 10705 8928 6562 3602 454 -2893 -6742 -9609 -10182 -9786 -9439 -7762 -4524
1776 -4524 -850 2926 6050 8129 9831 10876 9861 7221 4812 2078 -1681 -5452 -8286 -9952 -10041
1791 -10041 -9277 -8404 -6251 -2222 1780 4609 7179 9330 10323 10186 8606 5718 2868 -7 -3840 -7438
1807 -7438 -9237 -9707 -9782 -8839 -6898 -3974 110 3891 6149 8065 10071 10463 9085 6926 4183 900
1823 900 -2403 -5722 -8616 -9739 -9546 -9270 -8059 -5025 -1333 2164 5194 7387 9010 10288 10087 7734
1839 7734 4992 2366 -946 -4517 -7225 -9134 -9897 -9389 -8364 -6449 -2916 1119 3994 6208 8457
1854 8457 9938 10073 8929 6226 3105 437 -2728 -6269 -8594 -9441 -9725 -9048 -7022 -4228 -762 2888
1870 2888 5467 7287 9268 10326 9339 7141 4571 1531 -1663 -4636 -7611 -9419 -9509 -8992 -8053 -5534
1886e534L502L309K984K534J757J208J74j840k870k485k819l463k998k033j020
1901i594L00J201J567K782L754L295K363K262J571J50r59k096k920k726k815l420
1917e285k858j122k2N46J558K438L030L560L070K022J661J157n31j948k275k662
1933B339l102l057k910k235m28P41Q81J733L058L370L060K637J926J090M20j107
1949H416k550k614k520l161l203k271j257k9J061J495K124L395L544K482K073
1964F985J805O45o27j725k701k850k611k989l047j656k56L39J156K232K832L313
1980H45L181K162J553J418K25j595k419k483k890k922k728k405j110M34Q50J383
1996f501K781L389L015K512K065J320O39m86k204k780k519k765l141k462j463
$$ plain form
1886 -5534 -2032 1277 4261 6795 8552 9760 9934 8094 5224 2739 -80 -3543 -6541 -8574 -9594
1901 -9594 -9294 -8093 -6526 -3744 10 3305 5668 7930 9501 9651 8692 6596 3676 950 -1865 -5285
1917 -5285 -8143 -9265 -9287 -8741 -7183 -4745 -1715 1845 4915 6937 8598 9755 9224 7276 5001 2339
1933 2339 -763 -3820 -6730 -8965 -9393 -8652 -7771 -6038 -2980 390 3450 6087 8013 9103 9523 8416
1949 8416 5866 3252 732 -2429 -5632 -7903 -9160 -9189 -8128 -6633 -4509 -1114 2430 4912 6985
1964 6985 8790 9435 8808 7083 4382 1532 -1079 -4068 -7115 -8771 -9027 -8688 -7532 -5300 -2468 845
1980 845 4026 6188 7741 9159 9384 7789 5370 2887 -3 -2925 -5653 -8058 -9168 -8734 -7884 -6501
1996 -6501 -3720 -331 2684 5196 7261 8581 9220 8734 6530 3750 1231 -1534 -4675 -7137 -8600
2011h600m72O82J416J959K988L607K723J888J847J130k37j453k374k819k680k717
2027c112k998k177n48K56P80J854K679L124L215K527J608J406O53j036k260k382
2043C589k650k960k805k469j508L4Q45J127K177L209L192K593K225J585P31j65
2059H750j616k660k486k585l061k830j712n97K89J238J776K543L417L026K134
2074E626J790J380J18j153k063k621k718k664k878k456j027J53O50J456K464K988
2090i55L101K661J891J398Q83n09j945k351k522k893k802k411j749m72N65J062
2106g048J825K944L265K620K219J738R50J15j046k304k661k530k849k819j905
2121g486q83r1Q76J604K304L135L189K326J721J416N76o54j755k373k792k744
$$ plain form
2011 -8600 -9072 -8390 -6974 -5015 -2027 1580 4303 6191 8038 9168 8931 7478 5104 2285 -395 -3112
2027 -3112 -6110 -8287 -8835 -8579 -7799 -5945 -3266 -142 3073 5600 7208 8614 9267 8231 5971 3589
2043 3589 939 -2021 -4826 -7295 -8803 -8769 -7924 -6797 -4620 -1411 1781 4374 6599 8184 8915 8750
2059 8750 7134 4474 1988 -597 -3658 -6488 -8200 -8797 -8508 -7270 -5494 -2951 466 3492 5626
2074 5626 7416 8796 8914 7761 5698 3077 359 -2305 -5183 -7639 -8666 -8513 -7863 -6407 -3943 -955
2090 -955 2146 4807 6698 8096 8979 8470 6525 4174 1652 -1241 -4043 -6454 -8203 -8675 -8110 -7048
2106 -7048 -5223 -2279 986 3606 5825 7563 8513 8628 7582 5278 2617 87 -2762 -5581 -7486
2121 -7486 -8369 -8460 -7584 -5980 -3676 -541 2648 4974 6695 8111 8687 8033 6278 3905 1113 -1631
2137a631k614k492j411j75M55J068K119K842L066K768K112J340R20P6j376k251
2153D816k441k718k874k405j903q83K98J013J503K354L155K904K319J790J123
2168H051K96o72j851k537k473k588k776k296j189k29O97J429J953K598L103K694
2184D210J919J471Q21l86j506k097k531k570k536k573j953n44M48J058J649K419
2200b701K799K853K374J635J049L04r70k076k340k351k598k637k189j326P2R50
2216g152J384J936K722K920K469J986J365N78m31j522k359k413k315k663k545
2231f040j624m23M88J180J723K315K939K860K051J447J049P0j119j991k346k477
2247A02k499k531k113r17K50Q03J301K151K813K873K387J697J051N98m12j671
$$ plain form
2137 -1631 -4245 -6737 -8148 -8323 -7868 -6800 -4681 -1839 1227 3995 6107 7447 8367 8443 7067 4816
2153 4816 2375 -343 -3217 -5622 -7525 -8408 -8110 -7097 -5594 -3240 -85 2819 5138 6928 8051
2168 8051 8347 7675 5824 3287 814 -1774 -4550 -6846 -8035 -8264 -7567 -6138 -4185 -1587 1516 4210
2184 4210 6129 7600 8421 8035 6529 4432 1901 -669 -3205 -5778 -7731 -8275 -7827 -6769 -5120 -2701
2200 -2701 98 2951 5325 6960 8009 8313 7343 5267 2927 576 -2022 -4659 -6848 -8174 -8102 -7152
2216 -7152 -5768 -3832 -1110 1810 4279 6265 7630 8208 7777 6255 3896 1483 -832 -3495 -6040
2231 -6040 -7664 -8087 -7599 -6419 -4696 -2381 558 3418 5469 6916 7965 8035 6916 4925 2579 102
2247 102 -2397 -4928 -7041 -7958 -7708 -6905 -5604 -3453 -640 2233 4620 6317 7368 7966 7554 5883
2263E883k332k345k522k607k222j386k86N82J091J624K635L056K521J848J361
2278F901Q58j7j114k073k467k336k508k461j759o75J85P73J456K232K876K827
2294B698K053J436J182N14p36j782k210k399k469k409k172j181l8N43J079J924
2310c967K692K804K236J788J374Q36j54j451k228k257k281k449k301j583n99K22
2326g318R39J604K384K803K393J880J615J225K62j030j943k239k182k253k420
2341d280j971j043j12N10J375K180K578K579K040J628J430P97m72j611k051k130
2357A447k356k400k166j455m91L31J013J772K461K561K209J835J612J029Q6j114
2373F374j907k130k202k529k275j614p97l7O19J370K110K581K447K029J752J314
$$ plain form
2263 5883 3551 1206 -1316 -3923 -6145 -7531 -7817 -7235 -6144 -4520 -1885 1171 3692 5540 6901
2278 6901 7759 7742 6628 4555 2088 -248 -2756 -5217 -6976 -7651 -7466 -6693 -5237 -3005 -129 2698
2294 2698 4751 6187 7369 7883 7147 5365 3155 756 -1713 -4122 -6294 -7475 -7513 -6970 -5891 -3967
2310 -3967 -1275 1529 3765 5553 6927 7763 7609 6158 3930 1673 -608 -3057 -5358 -6941 -7540 -7318
2326 -7318 -6379 -4775 -2391 412 2805 4685 6300 7525 7787 6757 4814 2575 393 -1860 -4280
2341 -4280 -6251 -7294 -7406 -6896 -5521 -3341 -763 1816 3856 5484 6914 7711 7239 5628 3577 1447
2357 1447 -909 -3309 -5475 -6930 -7421 -7090 -6077 -4305 -1844 717 2926 4761 6373 7402 7488 6374
2373 6374 4467 2337 135 -2394 -4669 -6283 -7080 -7117 -6498 -5128 -3018 -437 2010 4039 5791 7105
2389G105L24p33j539j918k113k406k413j943j127l23K77J031J860K430K522K245
2405C279J890J395O83l44j140j628j911k407k580k187j477o24J29P65J502K181
2421b474K412K298K061J697R97N7p53j371j807k226k618k354j706r79k02N08J233
2438e227J802K174K329K259K015J366M03n00j210j584k059k396k414j956j292
2453f290n78J04R48J637K080K219K285K154J655P31j64q89j399j836k255k447
2469b045k089j564r80k49O70J415J949K134K226K175J847J112J64n31j101j667
2485C466k210k372k196j731j205n45K70J158J714K001K177K231K003J384N32k32
2501F445q34j428k015k382k259j811j394q57o2P75J508J860K065K274K120J592
$$ plain form
2389 7105 7429 6696 5157 3239 1126 -1280 -3693 -5636 -6763 -7086 -6809 -5778 -3918 -1488 1034 3279
2405 3279 5169 6564 7247 6903 5763 4135 2224 -183 -2763 -4950 -6427 -7051 -6922 -6157 -4655 -2474
2421 -2474 -62 2236 4297 5994 6991 7048 6295 4924 3117 891 -1727 -4081 -5787 -6766 -6968 -6460 -5227
2438 -5227 -3425 -1251 1078 3337 5352 6718 7121 6621 5411 3827 1768 -628 -3042 -4998 -6290
2453 -6290 -6868 -6764 -5816 -4179 -2099 120 2405 4559 6214 6945 6781 5892 4493 2657 402 -2045
2469 -2045 -4134 -5698 -6678 -6927 -6257 -4842 -2893 -759 1467 3642 5489 6601 6765 6234 5133 3466
2485 3466 1256 -1116 -3312 -5043 -6248 -6793 -6523 -5365 -3651 -1650 527 2758 4761 6145 6677 6445
2501 6445 5611 4183 2168 -214 -2473 -4284 -5678 -6535 -6597 -5822 -4314 -2454 -389 1885 4005 5597
2517E597P97M4m97j147j782k266k285j992j534j113m40M63J231J677J941K169
2533H63K235J824J123L44k99q21j514k095k285k051j712j315p45J18R52J493J785
2550b100K047K259J999J359O85m6n88j232j855k206k111j815j521j039k32O22
2566e774J332J621J922K117K138J621R58K90l47r78j678k081k099j894j581j315
2582e748n89L16J037J515J817K050K100J776J255N45m2o71j470j972k075j923
2598b079j680j404r12j06P50J324J711J978K088J897J377Q20K85m24j066j748
2614B811k076j998j774j504j151m23L72J045J536J866K101J955J552J051N06m3
2630E826p96j517j953k008j919j597j245p07R1P47J284J717K009K043J747J227
$$ plain form
2517 5597 6394 6438 5941 4794 3012 746 -1539 -3531 -5065 -6178 -6618 -6155 -4924 -3247 -1306 863
2533 863 3098 4922 6045 6389 6090 5269 3755 1660 -625 -2676 -4388 -5703 -6448 -6330 -5378 -3885 -2100
2550 -2100 -53 2206 4205 5564 6249 6203 5615 4383 2528 322 -1789 -3604 -5125 -6164 -6396 -5774
2566 -5774 -4442 -2821 -899 1218 3356 4977 5935 6225 5878 4900 3222 1141 -958 -2852 -4433 -5748
2582 -5748 -6337 -6021 -4984 -3469 -1652 398 2498 4274 5529 6074 6032 5361 3891 1919 -156 -2079
2598 -2079 -3759 -5163 -6075 -6181 -5431 -4107 -2396 -418 1670 3567 4944 5764 6049 5625 4559 2811
2614 2811 735 -1263 -3037 -4541 -5692 -6115 -5743 -4698 -3162 -1296 805 2760 4312 5363 5869 5826
2630 5826 5030 3513 1560 -448 -2367 -3964 -5209 -5916 -5825 -5078 -3794 -2077 -68 1975 3722 4949
2646D949P38J96n50j178j795j948j919j787j401r08k19L94J044J572J850K040
2662A078J872J471R75M06k47r84j478j778j915j881j611j169n30K07Q39J337J688
2679a720J936J908J637J266O27k6p57j247j597j785j956j756j374p10m3N86J108
2696c903J528J824J860J760J422R53K29n43j026j454j688j842j871j515r34l24
2712e524L26Q42J359J697J832J777J559J134N26k02q78j236j492j814j922j625
2728c641j123n67J2O21J166J566J787J754J618J333Q00J2n93j032j398j660j901
2745a246j779j259o91k50K87R34J400J704J769J664J389J024L28l33q23j167j551
2762A400j845j821j455r15m29M0N63J233J646J663J670J543J181O22m8o45r87
$$ plain form
2646 4949 5687 5883 5333 4155 2360 412 -1507 -3294 -4695 -5603 -5822 -5428 -4384 -2812 -962 1078
2662 1078 2950 4421 5396 5802 5555 4571 3093 1315 -600 -2481 -4092 -5261 -5791 -5584 -4745 -3408 -1720
2679 -1720 216 2124 3761 5027 5654 5628 4871 3624 2027 242 -1714 -3470 -4844 -5554 -5597 -5011 -3903
2696 -3903 -2375 -551 1309 3069 4491 5444 5673 5130 4104 2650 962 -880 -2751 -4266 -5200 -5524
2712 -5524 -5198 -4356 -2997 -1300 532 2309 3868 5002 5528 5326 4448 3212 1720 -94 -2016 -3641
2728 -3641 -4764 -5331 -5319 -4698 -3532 -1966 -179 1575 3193 4526 5326 5338 4745 3713 2315 655 -1246
2745 -1246 -3025 -4284 -4975 -5225 -4938 -4004 -2604 -900 869 2533 3922 4946 5274 4941 4118 2951 1400
2762 1400 -445 -2266 -3721 -4636 -5065 -5025 -4462 -3229 -1583 80 1750 3293 4474 5096 5048 4403 3416
2779C416j340j702j891j598j075o31k15L85R76J450J697J624J538J370Q77J58
2795E039m25q45j224j528j778j692j317p66l63N0P95J337J552J638J532J383J126
2812D514N22k93p23j046j368j678j717j413j030n28q2M31J119J537J568J465J510
2829B788J261P56N9n29r65j184j524j741j575j115p34l23K71Q71J341J539J525
2846G21J422J365J021L16l37p38j087j378j642j673j344q59l55o1M86J254J474
2863a415J465J511J366J108O73j07o05r04j167j588j704j395j049n88j58K77Q61
2880c419J351J589J389J430J294P71K03l57q07j093j356j660j643j113o90l81
2896d492J40O40J128J466J568J344J263J057L98k15o00r08j252j539j572j459
$$ plain form
2779 3416 2076 374 -1517 -3115 -4190 -4821 -5036 -4651 -3675 -2225 -528 1096 2634 4004 4881 5039
2795 5039 4614 3769 2545 1017 -761 -2453 -3770 -4536 -4899 -4849 -4054 -2717 -1165 473 2005 3388 4514
2812 4514 5036 4743 4020 2974 1606 -72 -1789 -3202 -4232 -4760 -4842 -4411 -3292 -1755 -187 1278 2788
2829 2788 4049 4805 4864 4335 3370 2186 662 -1079 -2654 -3769 -4503 -4826 -4555 -3684 -2343 -804 721
2846 721 2143 3508 4529 4845 4508 3770 2683 1305 -337 -2010 -3354 -4213 -4568 -4629 -4143 -2889 -1415
2863 -1415 50 1561 2927 4035 4708 4601 3996 3092 1925 337 -1367 -2762 -3811 -4399 -4557 -4280 -3419
2880 -3419 -2068 -479 910 2340 3634 4405 4608 4251 3444 2351 995 -665 -2308 -3421 -4111 -4492
2896 -4492 -4352 -3712 -2584 -1118 450 1794 3057 4114 4512 4297 3697 2789 1537 -2 -1574 -3033
2912c033q50l63j04L32J003J361J451J424J372J044O94J21n40q29j024j379j648
2929i68j489j017o30j37J40O63J203J540J347J293J254R10K62k98o66j001j178
2946A228j475j616j262o74l54n5M98J009J332J495J317J174J094O28j54n75p85
2963B825j088j395j511j447r26m08j25J39P77J298J423J321J281J098P37K70l90
2980C879q15r00j168j571j493j039o31l00R5M85J011J464J432J093J186J025M27
2997D180k19n33r07j102j297j567j355p20k78j97K63Q81J246J408J305J098J060
3014C266P80P4n49o94q99j330j488j375j009m72j55J0N45J228J405J227J184J128
3032B876Q52L42k04p66q82r67j427j532j080p13l38n1M19Q97J306J444J048J090
$$ plain form
2912 -3033 -3883 -4246 -4350 -4018 -3015 -1654 -203 1221 2593 3637 4331 4452 3912 3083 2059 680 -968
2929 -968 -2457 -3474 -4104 -4241 -4101 -3438 -2235 -695 652 1945 3199 4109 4371 4073 3407 2406 1228
2946 1228 -247 -1863 -3125 -3799 -4153 -4208 -3710 -2701 -1369 126 1443 2617 3711 4339 4185 3610 2825
2963 2825 1737 342 -1169 -2616 -3542 -3950 -4075 -3936 -3159 -1861 -438 883 2164 3262 3999 4269 3879
2980 3879 3064 2164 996 -575 -2068 -3107 -3738 -4038 -3943 -3458 -2447 -983 449 1542 2728 3753 4180
2997 4180 3961 3428 2521 1419 122 -1445 -2800 -3520 -3798 -3995 -3732 -2851 -1605 -197 1108 2206 3266
3014 3266 4046 4120 3571 2877 1978 648 -840 -2215 -3224 -3696 -3851 -3841 -3296 -2068 -663 564 1748 2876
3032 2876 3728 4070 3866 3100 2218 1251 -176 -1708 -2788 -3501 -3839 -3890 -3471 -2574 -1268 176 1224 2314
3050B314J108N67q4n28p43r92j255j413j401q70l42k09J38P93J194J290J241J080
3068A888R98R09K47m55p60p85j119j438j314j039o45j82j6M03J061J356J162J111
3086A382J150R36M13q4o46q90q66j207j502j168o88m42j77L01P78J204J354J136
3104I84R92J047P29K1m19o46q88j141j316j366r83m43k30L2O13J135J182J190
3122D93J129R47Q35M25k64p01o70j018j388j290j062o63k63K2K55P69J285J225
3140F6R98J092J000M78K3m65q05q95j067j359j235p16m63k48K24O28J015J292
3158d37J196R59R39Q40J77l94n54p97j066j167j239j097n88j84l5L82R88J155
3176i22J113J139R80P39N00j5o50p23p64j209j315j042q11l95K6K35N67J065J272
$$ plain form
3050 2314 3422 3989 3905 3377 2634 1642 387 -1026 -2427 -3297 -3639 -3848 -3710 -2917 -1723 -433 808 1888
3068 1888 2886 3795 4042 3587 2827 2042 923 -515 -1829 -2868 -3513 -3695 -3711 -3308 -2247 -891 271 1382
3086 1382 2532 3468 3881 3797 3151 2261 1395 188 -1314 -2482 -3170 -3612 -3789 -3488 -2710 -1506 -152 984
3104 984 1976 3023 3752 3773 3354 2708 1820 679 -637 -2003 -2986 -3429 -3659 -3627 -3014 -1879 -697 493
3122 493 1622 2569 3404 3829 3565 2864 2194 1176 -212 -1502 -2564 -3227 -3490 -3468 -3213 -2444 -1159 66
3140 66 1064 2156 3156 3634 3657 3192 2387 1492 425 -934 -2169 -2885 -3348 -3596 -3372 -2744 -1729 -437
3158 -437 759 1718 2657 3497 3674 3280 2726 1929 863 -304 -1543 -2640 -3228 -3412 -3447 -3065 -2077 -922
3176 -922 191 1330 2310 3049 3549 3534 2884 2161 1397 188 -1127 -2169 -2980 -3375 -3349 -3114 -2547 -1482 -210
3195b10J024R42J009O01J18k93p22q49r08j182j349q98l97k54R9N30Q14J120J243
3214D38J039P99Q66L62k30n50o64r68j146j133j153p03j48jJ84P19J105J072J125
3233A013R94P01N49J51m58p05p49j008j286j140p60m47m7J87L75Q75J268J104
3251F17Q97Q96O88K37j69n37q86r01r53j343j012m25k38m8L65P64R98J248J045
3270A243P99P13N48n4n02o17q45j111j063j102q23k42J8N8N39J077J097J029R50
3289A712P10N36L49k31p74p69q54j154j158q04m69j94J67L27O88J243J167P95
3307A287P73P80L75j07m40q45q92q48j178j107n58j82j09K39O96R46J114J068
3325A012P45O72O42J32m71o25p64r89j002j009q76m28L9J09L27R40J131R80Q23
$$ plain form
3195 -210 814 1756 2765 3366 3484 3191 2469 1620 712 -470 -1819 -2717 -3114 -3368 -3269 -2739 -1925 -805 438
3214 438 1477 2276 3142 3504 3274 2724 2060 1092 -54 -1187 -2340 -3043 -3191 -3192 -3008 -2289 -1184 -112 1013
3233 1013 2007 2708 3257 3408 2950 2245 1496 488 -798 -1938 -2698 -3145 -3192 -3005 -2630 -1755 -487 617
3251 617 1514 2410 3098 3335 3166 2629 1743 842 -111 -1454 -2466 -2891 -3129 -3177 -2812 -2048 -1050 198 1243
3270 1243 2042 2755 3303 3249 2747 2130 1285 174 -889 -1991 -2814 -3056 -3038 -2980 -2441 -1364 -267 762 1712
3289 1712 2422 2958 3307 3076 2302 1533 679 -475 -1633 -2437 -2906 -3100 -2933 -2606 -1918 -675 492 1287
3307 1287 2060 2840 3215 3108 2668 1823 931 83 -1095 -2202 -2760 -2942 -3051 -2812 -2116 -1170 -56 1012
3325 1012 1757 2429 3071 3203 2732 2107 1343 354 -648 -1657 -2533 -2961 -2922 -2813 -2486 -1546 -415 565 1388
3344A388Q32N70L20q6o81q03o79j003j181r08m58k61R0L29N55J046J196Q46P03
3363A815P77M69o9m09o71q42q52r53j122p58j73p8J04O00Q71R77J071Q28O15N81
3383B781L12l52o65o61q25j038r96q26n00n7J75K18P23J124R73Q13Q21N86L38
3402B944qn36p84p21q14j153r60n01k57J0K88N00Q54J132R74O83O70N69K6l70
3422B546n44p93q70q93j054q36k64mJ7M09Q16J001R94Q99O21N11M05j77o04o67
3442A513p42r85j031q03o01j32J80J83N46J022J073Q09P64O37L83M9l40p57p97
3461I71p41j015j040n96k45r0K07M62P68J077J072O97N80O16J81k93n43p20q84
3480D64q75r43q77m19l6O6K99P23R82R76Q71P14M60L89O1n63p22o96q82j022q42
$$ plain form
3344 1388 2220 2790 3110 3024 2343 1540 861 -142 -1323 -2231 -2689 -2950 -2860 -2531 -1976 -930 266 1112 1815
3363 1815 2592 3061 2992 2583 1912 1070 218 -735 -1857 -2615 -2788 -2866 -2762 -2162 -1291 -314 757 1585 2200 2781
3383 2781 3093 2741 2076 1415 590 -448 -1444 -2270 -2770 -2827 -2652 -2434 -1711 -587 386 1199 2020 2606 2944
3402 2944 2936 2400 1616 895 81 -1072 -2032 -2533 -2790 -2780 -2492 -1992 -1138 -6 968 1651 2321 2890 2916 2546
3422 2546 2002 1209 339 -554 -1608 -2444 -2708 -2712 -2695 -2286 -1470 -469 525 1424 2045 2556 2961 2784 2180 1513
3442 1513 771 -214 -1245 -2048 -2649 -2781 -2601 -2418 -1872 -850 223 1032 1796 2433 2816 2865 2525 1768 971
3461 971 230 -785 -1825 -2421 -2666 -2756 -2549 -2087 -1319 -242 830 1527 2107 2723 2904 2611 2068 1348 464
3480 464 -411 -1354 -2231 -2650 -2686 -2620 -2321 -1598 -616 360 1231 1945 2405 2794 2855 2292 1570 874 -8 -1030 -1872
3501a872o04k52R0K74M15Q72J094Q80O77O74M58J08k21o71q18p26r04j052p22
3520b300l15q9R9M83O76R04J108Q34N46N68L49j93n21o51q55q80q86q91n87n9
3540b660J34J81O06R53R55Q96P47M80M17J15l75p51p00q52r68r11n85l51J5K59
3560b395L76P43J087R57O81O21N26J84j58n47q23q13p70r90q54l40j20N2L67P00
3580a516Q60R93R12O07N16M14n1m98o12q06q80q78q61o72j88J19J91M85Q51R74
3600d0Q98P39O02L85J81k23o64p85p22r25r56o80m05q4K03L95O35R43J063P40
3620A300O32N42K77j32m45p44q20p74r17q80n40j26O4K57O25Q34R45R76O64N15
3640B253M38R0m06o60p16q74q77q08p60l57P1K27M00P11R93R21P97O51M09K19
$$ plain form
3501 -1872 -2476 -2728 -2638 -2364 -1949 -1077 17 897 1574 2248 2706 2814 2593 1922 1104 378 -526 -1578 -2300
3520 -2300 -2615 -2704 -2605 -2122 -1446 -542 566 1400 1946 2514 2863 2670 2149 1498 643 -237 -1123 -2014 -2601 -2660
3540 -2660 -2526 -2345 -1739 -786 169 1065 1812 2292 2709 2824 2449 1698 998 146 -822 -1733 -2318 -2669 -2654 -2395
3560 -2395 -2019 -1276 -189 768 1449 2070 2596 2780 2622 2075 1252 439 -331 -1321 -2175 -2515 -2635 -2583 -2216 -1516
3580 -1516 -656 337 1249 1856 2372 2786 2735 2237 1625 819 -61 -939 -1800 -2472 -2660 -2541 -2350 -1865 -1014 -40
3600 -40 858 1597 2199 2584 2765 2542 1878 1093 371 -554 -1510 -2190 -2595 -2679 -2476 -2081 -1446 -503 560 1300
3620 1300 1932 2474 2751 2619 2174 1430 610 -164 -1081 -1961 -2501 -2627 -2563 -2306 -1681 -847 98 1074 1738 2253
3640 2253 2691 2781 2375 1715 999 125 -752 -1560 -2320 -2677 -2606 -2379 -1979 -1268 -275 646 1443 2094 2503 2722
3660B722j03n99p88p24q26r72p95m57j38J72L48N82Q52J042Q44O23O01L39m8m04
3680B271o41q42q00q57r13o53j97P7K02N05P66R64R43Q08N14L80K28k16o99o85
3700A155q15q99q68p19m70j9K29L09O55R91R20Q33O73M46K23n1m29p50p60q24
3720a70r23q00n46j92Q3L38N18P71J047R33O48N40L86P0l55n86p85q64q22q60
3740a569p33k88L7J60M28P50R04R81P96N92L89K64j42n71p33p67r06q85p29m88
3760b510j55K26K76N98Q97R94Q49O47N01K80ml46o64q55p77q62q43n77k30j9K83
3781b291N06P20R83R67P09N17M13J36k34n25p76q67q45p77p57m18n9J59L82O97
3801a360Q94R11Q75O08M20K92k5m70p33p99q17q89p49n53k28J09L30N32P57J026
$$ plain form
3660 2722 2619 2020 1232 508 -318 -1290 -2085 -2542 -2680 -2508 -2160 -1578 -726 316 1160 1783 2384 2723 2675 2271
3680 2271 1630 788 -12 -869 -1782 -2435 -2632 -2555 -2353 -1848 -1082 -118 825 1633 2147 2527 2755 2539 1840 1155
3700 1155 340 -559 -1427 -2146 -2616 -2635 -2406 -2097 -1442 -451 469 1302 1975 2421 2644 2593 2164 1414 654 -170
3720 -170 -1093 -1893 -2439 -2631 -2548 -2210 -1692 -921 126 1059 1707 2247 2633 2703 2348 1762 977 113 -709 -1569
3740 -1569 -2302 -2590 -2553 -2393 -1965 -1215 -311 670 1466 2058 2447 2711 2569 1998 1265 498 -408 -1293 -2022 -2510
3760 -2510 -2665 -2439 -2163 -1565 -668 326 1175 1822 2323 2603 2599 2253 1589 734 -43 -905 -1748 -2325 -2555 -2574 -2291
3781 -2291 -1785 -1065 -82 885 1594 2111 2524 2660 2426 1901 1125 258 -587 -1364 -2121 -2539 -2598 -2439 -2057 -1360
3801 -1360 -466 445 1320 1928 2348 2640 2615 2145 1412 613 -204 -1093 -1842 -2395 -2623 -2514 -2184 -1652 -895 131
3821A31Q69O77N26L44Q0k95n82q33q16q02q18o92l18l6K35M59O90Q68R59P99N44
3842A989M61J80j41n23p17p92q26q41p70n34j01J63L07O33Q52Q92Q93O87N00K69
3862B581J8l64p29p27p95q64p80o27k90L5L39M70O82R59R22P08N85M10M1k31n12
3883A831p75q15p84q56p16l58q3J80M39O16Q08R27Q97O24M13K55r9m88o09q06
3903F01q76p78p57n51k16R0L57M84Q07R43Q75P18N42K78L3l01n41p65q21q39q56
3924a573n79l16p7K85M74O68Q78Q97Q07N50L86J65j93m24p24q41q00q40o76m39
3944b372j54J45L78O08P68R04Q72O75M40K32jl53o40p45q38q46p50n69k72N9K83
3965b176N27P22Q82Q73P74M98L06P6j88m93p92p92p88q47o41l52j04J93M98O22
$$ plain form
3821 131 1000 1677 2203 2547 2627 2332 1750 917 101 -701 -1519 -2211 -2529 -2565 -2330 -1871 -1181 -313 646 1445 1989
3842 1989 2450 2630 2489 1966 1249 457 -369 -1210 -1980 -2514 -2615 -2452 -2145 -1512 -660 232 1125 1812 2312 2581
3862 2581 2599 2235 1506 779 -16 -880 -1660 -2287 -2577 -2542 -2203 -1733 -1051 -92 830 1538 2123 2533 2574 2343 1831
3883 1831 1056 241 -543 -1399 -2115 -2473 -2556 -2376 -1937 -1321 -513 414 1311 1935 2348 2603 2504 2016 1407 601
3903 601 -275 -1053 -1810 -2361 -2577 -2487 -2130 -1646 -839 104 979 1697 2239 2517 2550 2249 1708 943 122 -717 -1573
3924 -1573 -2152 -2468 -2545 -2260 -1786 -1118 -240 657 1464 2014 2400 2565 2372 1948 1224 383 -417 -1257 -1933 -2372
3944 -2372 -2526 -2381 -2003 -1395 -627 277 1149 1824 2264 2496 2495 2142 1502 757 -81 -927 -1677 -2246 -2518 -2459 -2176
3965 -2176 -1649 -927 -45 828 1602 2100 2406 2482 2294 1801 1009 217 -571 -1418 -2059 -2411 -2515 -2322 -1824 -1202
3985a202P71Q90Q13N97M14K24q9m18o61q12q40p82o83n33j80R2L38N56P28Q56
4005G9Q58P29N19K61K6k99n70o89q48q33p28n66l65n0K44M74O54Q71Q34P75O23
4026A999L45R3j16m30o93p98q19q09o47m65j25J23M11N65P76Q77Q41O33M41K03
4046B405Pl76n62p78q34p87p07n42k71N5K65N19P25Q04Q57P38N67K91P0j82n06
4067A758p37q02q12p76n99m01p8J97M22O20P73Q88Q07O26M13J18r8l80o16p86
4087E37q01q05p03m82j70Q3L24N80P23Q21Q42O94M84K58rk61n37p20q11p96p28
4108a477n94k88l5K24N21O44Q05P93P69O04L58P3j38m57o80p79q04p69o41m09
4128b280j10J09L91O18P31Q54P46O70M49K23j05l20n89p25p88p74p27m93k75N8
$$ plain form
3985 -1202 -431 459 1272 1869 2283 2507 2418 2000 1339 527 -313 -1095 -1778 -2311 -2491 -2399 -2061 -1505 -777 79
4005 79 937 1666 2185 2446 2472 2173 1603 914 66 -767 -1495 -2061 -2426 -2476 -2232 -1758 -1104 -233 601 1376 1999
4026 1999 2344 2437 2321 1891 1198 400 -419 -1228 -1875 -2340 -2465 -2342 -1931 -1366 -590 287 1128 1761 2202 2405
4046 2405 2412 2036 1474 696 -138 -925 -1632 -2174 -2445 -2390 -2125 -1606 -881 -77 780 1518 2085 2376 2446 2264 1758
4067 1758 1021 219 -593 -1369 -1968 -2369 -2447 -2250 -1828 -1208 -435 453 1260 1886 2299 2417 2319 1939 1323 537
4087 537 -264 -1069 -1772 -2254 -2424 -2341 -2017 -1437 -714 107 949 1643 2127 2385 2376 2115 1578 858 47 -749 -1477
4108 -1477 -2071 -2359 -2394 -2170 -1649 -1005 -200 593 1362 1966 2324 2397 2259 1802 1122 343 -461 -1230 -1871 -2280
4128 -2280 -2390 -2281 -1890 -1272 -541 313 1059 1729 2178 2401 2296 1976 1387 662 -126 -900 -1627 -2120 -2395 -2337
4148b337K98N24P12P43Q44P26N01L20M9k65m92o68p66p95p20n82l81m6J63M30
4168a742O29P85Q15P57O05L47J39j27l79o07p37p85p89o31m35j51Q2L41N39P21
4188f23P60P80O53M91K18pk86n27o61q11p57o83n28k96J5K28M67O39P71P92P02
4209A337N38L22Q8j95m38o13p31p80p19n51l83j54J32L62O33O88Q06P12O28M02
4229B084J56o2l43n46o92p49p45o22m97k08K5K84N26O91P40P41O49M67L17J2k45
4250A983m71o48p46p41o78n28l04p5J77M14O22P50P75O50N69L47J09j34l57n69
4270A145p65p24p10n70l82j39L1L03N77O68P70P41N93M44J93m6k71n06o59p58
4290f5p35o13m67j89k3J42N16O36P44P54O22M91K93M6j55m29o09p03p78o70n12
$$ plain form
4148 -2337 -2039 -1515 -803 -60 784 1510 2011 2331 2380 2115 1623 955 189 -606 -1326 -1908 -2289 -2335 -2172 -1742
4168 -1742 -1113 -328 487 1244 1849 2196 2335 2208 1829 1222 485 -300 -1089 -1720 -2155 -2306 -2224 -1883 -1344 -623
4188 -623 137 917 1570 2061 2279 2272 1986 1459 798 -13 -770 -1453 -1981 -2277 -2262 -2034 -1567 -928 -157 635 1337
4209 1337 1875 2197 2285 2090 1652 1039 308 -472 -1191 -1742 -2125 -2279 -2147 -1785 -1152 -464 342 1054 1682 2084
4229 2084 2240 2178 1835 1289 597 -152 -897 -1519 -2016 -2224 -2199 -1915 -1389 -698 42 783 1432 1899 2216 2228 1983
4250 1983 1512 864 118 -623 -1301 -1829 -2133 -2208 -2031 -1617 -995 -245 530 1180 1749 2096 2205 2071 1714 1145
4270 1145 380 -344 -1054 -1624 -2006 -2145 -2114 -1811 -1234 -566 204 945 1538 1982 2175 2129 1858 1352 693 -65
4290 -65 -800 -1413 -1880 -2069 -2092 -1950 -1434 -798 -54 700 1322 1813 2106 2152 1997 1568 959 256 -522 -1192 -1704
4311a704k99r9J01L66O01O72P43O80N50L93J03o6l53n12o52p47p13n85l89j82
4331b092M3K95N01O24P38O89N75M81K54l5k67m19o37o59p33o59m79k55oJ68M14
4352a459O09O77O93O60N09L16J14j82m17n49o40p14o83n19l88p9J01L13N10P29
4372c99O77O02N76M40J63o8l05m93o10p02o84o00m15j59J6K67L76O15P18O68N91
4393A274M81K49L4k57m27n10o87o94o67m48k65m5J16L40N45O86O78O47M94L27
4413A871J48j23l68m72o15o67p03n79l46j14P8K67M45O11O91O73N68M13K25m3
$$ plain form
4311 -1704 -2003 -2102 -2001 -1635 -1034 -362 381 1061 1611 2004 2107 2041 1688 1176 524 -223 -936 -1521 -1910 -2092
4331 -2092 -2049 -1754 -1253 -629 109 798 1373 1854 2108 2073 1806 1387 750 91 -642 -1301 -1780 -2035 -2041 -1873 -1459
4352 -1459 -850 -173 520 1180 1689 2005 2119 1937 1520 971 331 -383 -1066 -1585 -1973 -2052 -1951 -1638 -1128 -399
4372 -399 278 880 1456 1896 2059 1991 1686 1193 583 -119 -803 -1403 -1818 -1977 -1961 -1694 -1318 -703 15 683 1274
4393 1274 1755 2004 2038 1781 1354 844 157 -537 -1204 -1652 -1917 -1962 -1846 -1506 -961 -275 403 1050 1544 1871
4413 1871 2019 1896 1528 1056 441 -226 -929 -1508 -1854 -1968 -1890 -1623 -1178 -567 124 797 1365 1778 2003 1960
$$ [...]
8191E70
##END NTUPLES=NMR FID
##END=
