##TITLE=1H_LY-Prop24028
 CDCl3,8 sc, 
 25.10.2021
##JCAMPDX= 6.0         $$ Bruker NMR JCAMP-DX V2.0
##DATA TYPE= NMR FID
##DATA CLASS= NTUPLES
##ORIGIN= UXNMR, Bruker Analytische Messtechnik GmbH
##OWNER= root
$$ XWIN-NMR		Version 3.5
$$ Mon Oct 25 10:25:39 2021 Russian Standard Time (UT+4h)  she@DPX200
##.OBSERVE FREQUENCY= 200.1313468511
##.OBSERVE NUCLEUS= ^1H
##.DELAY= (6, 6)
##.ACQUISITION MODE= SIMULTANEOUS
##.ACQUISITION SCHEME= undefined
##.AVERAGES= 8
##.DIGITISER RES= 18
##SPECTROMETER/DATA SYSTEM= spect
##.PULSE SEQUENCE= zg30
##.SOLVENT NAME= D2O
##.SHIFT REFERENCE= (INTERNAL, D2O, 0, 15.7039)
##AUDIT TRAIL= $$ (NUMBER, WHEN, WHO, WHERE, WHAT)
$$ ##TITLE= Audit trail, XWIN-NMR		Version 3.5
$$ ##JCAMPDX= 5.01
$$ ##ORIGIN= Bruker BioSpin GmbH
$$ ##OWNER= she
$$ F:/spectra/data/she/nmr/H-F/1/audita.txt
$$ ##AUDIT TRAIL=  $$ (NUMBER, WHEN, WHO, WHERE, WHAT)
(   1,<2021-10-25 10:22:57.90 +0400>,<she>,<DPX200>,
      <created by zg, POWCHK disabled, PULCHK disabled
       configuration hash MD5:
       00 E9 B6 7A A2 85 ED C7 34 08 36 98 17 FE 4E 26
       data hash MD5: 16K
       67 A5 96 9F 97 3C 1F B5 C4 03 AD DF 64 EC E7 33>)
$$ ##END=
$$ 
$$ hash MD5
$$ 3F 5B BE A7 8C F8 46 2D C9 41 14 29 FF 65 CB 01
##$RELAX= 
##$RELAX= 
##$RELAX= 
##$RELAX= 
##$RELAX= 
##$RELAX= 
$$ Bruker specific parameters
$$ --------------------------
##$DU= <F:/spectra>
##$EXPNO= 1
##$NAME= <H-F>
##$PROCNO= 1
##$TYPE= <nmr>
##$USER= <she>
##$AMP= (0..31)
100 100 100 100 100 100 100 100 100 100 100 100 100 100 100 100 100 100 
100 100 100 100 100 100 100 100 100 100 100 100 100 100 
##$AQSEQ= 0
##$AQ_mod= 1
##$AUNM= <au_zg>
##$AUTOPOS= <>
##$BF1= 200.13
##$BF2= 200.13
##$BF3= 200.13
##$BF4= 200.13
##$BF5= 200.13
##$BF6= 200.13
##$BF7= 200.13
##$BF8= 200.13
##$BYTORDA= 1
##$CFDGTYP= 0
##$CFRGTYP= 5
##$CHEMSTR= <none>
##$CNST= (0..31)
1 1 145 1 1 1 1 1 1 1 1 1 1 1 1 1 1 1 1 1 1 1 1 1 1 1 1 1 1 1 1 1 
##$CPDPRG= <>
##$CPDPRG1= <>
##$CPDPRG2= <>
##$CPDPRG3= <>
##$CPDPRG4= <mlev>
##$CPDPRG5= <mlev>
##$CPDPRG6= <mlev>
##$CPDPRG7= <mlev>
##$CPDPRG8= <mlev>
##$CPDPRGB= <>
##$CPDPRGT= <>
##$D= (0..31)
0 1.2 0 0 0 0 0 0 0 0.06 0 0.03 0 0 0 0 0.0002 0 0 0 0 0 0 0 0 0 0 0 0 
0 0 0 
##$DATE= 1635142977
##$DBL= (0..7)
120 120 120 120 120 120 120 120 
##$DBP= (0..7)
150 150 150 150 150 150 150 150 
##$DBP07= 0
##$DBPNAM0= <>
##$DBPNAM1= <>
##$DBPNAM2= <>
##$DBPNAM3= <>
##$DBPNAM4= <>
##$DBPNAM5= <>
##$DBPNAM6= <>
##$DBPNAM7= <>
##$DBPOAL= (0..7)
0.5 0.5 0.5 0.5 0.5 0.5 0.5 0.5 
##$DBPOFFS= (0..7)
0 0 0 0 0 0 0 0 
##$DE= 6
##$DECBNUC= <off>
##$DECIM= 32
##$DECNUC= <off>
##$DECSTAT= 4
##$DIGMOD= 1
##$DIGTYP= 9
##$DL= (0..7)
0 120 120 120 120 120 120 120 
##$DP= (0..7)
150 150 150 150 150 150 150 150 
##$DP07= 0
##$DPNAME0= <>
##$DPNAME1= <>
##$DPNAME2= <>
##$DPNAME3= <>
##$DPNAME4= <>
##$DPNAME5= <>
##$DPNAME6= <>
##$DPNAME7= <>
##$DPOAL= (0..7)
0.5 0.5 0.5 0.5 0.5 0.5 0.5 0.5 
##$DPOFFS= (0..7)
0 0 0 0 0 0 0 0 
##$DQDMODE= 0
##$DR= 18
##$DS= 0
##$DSLIST= <SSSSSSSSSSSSSSS>
$$ [...]
##$SUBNAM2= <"">
##$SUBNAM3= <"">
##$SUBNAM4= <"">
##$SUBNAM5= <"">
##$SUBNAM6= <"">
##$SUBNAM7= <"">
##$SUBNAM8= <"">
##$SUBNAM9= <"">
##$SW= 18.0517286264689
##$SWIBOX= (0..15)
0 0 2 0 0 0 0 0 0 0 0 0 0 0 0 0 
##$SW_h= 3612.71676300578
##$TD= 16384
##$TD0= 1
##$TE= 0
##$TE2= 300
##$TE3= 300
##$TEG= 300
##$TL= (0..7)
0 120 120 120 120 120 120 120 
##$TP= (0..7)
150 150 150 150 150 150 150 150 
##$TP07= 0
##$TPNAME0= <>
##$TPNAME1= <>
##$TPNAME2= <>
##$TPNAME3= <>
##$TPNAME4= <>
##$TPNAME5= <>
##$TPNAME6= <>
##$TPNAME7= <>
##$TPOAL= (0..7)
0.5 0.5 0.5 0.5 0.5 0.5 0.5 0.5 
##$TPOFFS= (0..7)
0 0 0 0 0 0 0 0 
##$TUNHIN= 0
##$TUNHOUT= 0
##$TUNXOUT= 0
##$USERA1= <user>
##$USERA2= <user>
##$USERA3= <user>
##$USERA4= <user>
##$USERA5= <user>
##$V9= 5
##$VALIST= <valist>
##$VCLIST= <CCCCCCCCCCCCCCC>
##$VD= 0
##$VDLIST= <DDDDDDDDDDDDDDD>
##$VPLIST= <PPPPPPPPPPPPPPP>
##$VTLIST= <TTTTTTTTTTTTTTT>
##$WBST= 1024
##$WBSW= 4
##$XGAIN= (0..3)
0 0 0 0 
##$XL= 0
##$YL= 0
##$YMAX_a= 390894
##$YMIN_a= -334376
##$ZGOPTNS= <>
##$ZL1= 120
##$ZL2= 120
##$ZL3= 120
##$ZL4= 120
##$ABSF1= 10
##$ABSF2= 0
##$ABSG= 5
##$ABSL= 3
##$ALPHA= 0
##$AQORDER= 0
##$ASSFAC= 0
##$ASSFACI= 0
##$ASSFACX= 0
##$ASSWID= 0
##$AUNMP= <proc_1d>
##$AZFE= 0.1
##$AZFW= 0.1
##$BCFW= 1
##$BC_mod= 2
##$BYTORDP= 1
##$COROFFS= 0
##$CY= 11.3945322036743
##$DATMOD= 1
##$DC= 2
##$DFILT= <>
##$DTYPP= 0
##$F1P= 2.36226072786647
##$F2P= -0.459571619588291
##$FCOR= 0.5
##$FTSIZE= 0
##$FT_mod= 4
##$GAMMA= 1
##$GB= 0.15
##$INTBC= 1
##$INTSCL= 1
##$ISEN= 128
##$LB= 0.24
##$LEV0= 0
##$LPBIN= 0
##$MAXI= 10000
##$MC2= 0
##$MEAN= 0
##$ME_mod= 0
##$MI= 1.114404
##$NCOEF= 0
##$NC_proc= 0
##$NLEV= 6
##$NOISF1= 3.799351
##$NOISF2= 2.8
##$NSP= 1
##$NTH_PI= 0
##$NZP= 0
##$OFFSET= 15.70392
##$PC= 1
##$PHC0= -15058.85
##$PHC1= 4.800829
##$PH_mod= 1
##$PKNL= yes
##$PPARMOD= 0
##$PSCAL= 0
##$PSIGN= 0
##$REVERSE= no
##$SF= 200.130013532006
##$SI= 16384
##$SIGF1= 3
##$SIGF2= 2
##$SINO= 400
##$SIOLD= 16384
##$SREGLST= <1H.CDCl3>
##$SSB= 0
##$STSI= 0
##$STSR= 0
##$SW_p= 3612.71676300578
##$SYMM= 0
##$S_DEV= 0
##$TDeff= 0
##$TDoff= 0
##$TI= <>
##$TILT= no
##$TM1= 0
##$TM2= 0
##$TOPLEV= 0
##$USERP1= <user>
##$USERP2= <user>
##$USERP3= <user>
##$USERP4= <user>
##$USERP5= <user>
##$WDW= 1
##$XDIM= 8192
##$YMAX_p= 0
##$YMIN_p= 0
$$ End of Bruker specific parameters
$$ ---------------------------------
##NTUPLES= NMR FID
##VAR_NAME=  TIME,          FID/REAL,        FID/IMAG
##SYMBOL=    X,             R,               I
##VAR_TYPE=  INDEPENDENT,   DEPENDENT,       DEPENDENT
##VAR_FORM=  AFFN,          ASDF,            ASDF
##VAR_DIM=   8192,          8192,            8192
##UNITS=     SECONDS,       ARBITRARY UNITS, ARBITRARY UNITS
##FACTOR=    0.0002768,     1,               1
##FIRST=     0,             0,               0
##LAST=      2.2672688,     0,               0
##MIN=       0,             -334376,         0
##MAX=       2.2672688,     390894,          0
$$ Real data points
##PAGE= N=1
##DATA TABLE= (X++(R..R)), XYDATA
$$ [...]
2333a567j067n74m6O07J034J339J338J141P11K53l62p90j051j261j206r60n41
$$ -1567 -2634 -3208 -3254 -2647 -1613 -274 1064 2205 2916 3169 2807 2017 966 -295 -1501 -2461 -3002
2350c002m8M97R55J254J350J161O88K24l46q46j156j258j149q27m12M0N43R17
$$ -3002 -3050 -2553 -1598 -344 1006 2167 2855 3079 2733 1887 731 -527 -1676 -2503 -2915 -2875 -2332 -1415
2368a415J219J219J066P31K32l04q54j150j296j226q41l64J24O01J004J151J170
$$ -1415 -196 1023 2089 2820 3052 2748 1894 744 -552 -1778 -2619 -2983 -2859 -2258 -1254 -103 1067
2385A067R78O78J82k87o86j076j269j179q64m52R7N65J028J124J187R57N81Q3
$$ 1067 2045 2723 2905 2618 1932 856 -413 -1592 -2456 -2908 -2811 -2246 -1218 -94 1093 2050 2631 2714
2403B714k84p40r77j130j041q23m21N0N50R30J110J204R21N48P1l82p73j035j093
$$ 2714 2430 1690 713 -417 -1458 -2281 -2702 -2652 -2102 -1172 -62 1142 2063 2611 2682 2300 1527 492 -601
2422f01r35p13l41J07N22Q46J071J101R30N66J49l78p91j074j096j005o78l03
$$ -601 -1536 -2249 -2590 -2483 -1961 -1115 -44 1057 1987 2553 2702 2324 1533 459 -637 -1642 -2320 -2623
2440b623K05N40Q73J034J030Q46N32J06k96p49j031j117r68p38k62J99O02R18
$$ -2623 -2418 -1878 -1005 29 1059 1905 2437 2543 2247 1498 467 -650 -1618 -2356 -2618 -2419 -1817 -899
2458h99J069J005P84M02R3l42p42r25j024r35o85k77J13N56R17J059R70P81M45
$$ -899 170 1175 1959 2361 2454 2112 1370 445 -579 -1514 -2199 -2476 -2363 -1807 -890 169 1139 1920 2365
2477B365K8m31o75r25r68q82n73k74J07M84Q04J009R90P31N23j7l70o90r16j010
$$ 2365 2393 1962 1287 362 -606 -1488 -2061 -2335 -2228 -1744 -940 69 1059 1790 2313 2296 1926 1236 320 -690
2497f90p94n59j92J79N33Q01Q63Q85P50L81O8l75o88r18r50q37n29j43K32N44
$$ -690 -1484 -2043 -2235 -2056 -1523 -722 141 1026 1776 2157 2225 1850 1162 244 -706 -1543 -2072 -2215 -1983 -1439
2517a439P96R41Q33O32L29ll67o31q74r06p68n72j90K04N42Q21R26Q95O39K91
$$ -1439 -643 298 1131 1763 2092 2089 1722 1091 217 -689 -1457 -2029 -2219 -2015 -1473 -652 274 1169 1808 2099
2537B099m9l75o70q77q59p08m85j46J65N33P80Q74Q28O34L27j7l94p16q51q50
$$ 2099 2050 1675 1005 128 -731 -1439 -1924 -2070 -1905 -1372 -592 282 1110 1744 2071 2054 1660 944 93 -757
2557g57o83m61j17K14N26P44Q25P53O20K94Ql73o21q28q51p24m66j19K48M80P84
$$ -757 -1440 -1901 -2018 -1804 -1278 -534 291 1044 1664 1958 1966 1593 972 144 -707 -1431 -1897 -2016 -1768 -1288 -504
2578e04P93P56N61K88n3l52n89p35p98o70m23j15J75M82O95Q19O90N51K60q8l71
$$ -504 289 1045 1606 1894 1841 1489 900 165 -633 -1303 -1726 -1841 -1666 -1184 -489 330 1020 1571 1831 1743 1372
2599A372o01p42p38n86l77p5K10M65O70P11O73N10K41k7l68n93p45p52n70l60
$$ 1372 771 29 -709 -1295 -1672 -1747 -1537 -1072 -402 309 982 1492 1733 1706 1338 745 0 -752 -1322 -1682
2619a682o4K65M69O89O96O41M45K00n7l31n79o87o79n87l38j01K01N23O71O91
$$ -1682 -1746 -1481 -1012 -323 373 1014 1459 1659 1602 1271 692 5 -674 -1261 -1599 -1700 -1499 -976 -305 386
2639C86O24M35J95j01l69n62o44o37n22l21o2K13M43O02O52O19M45J86j15l72
$$ 386 1010 1445 1640 1539 1170 608 -36 -673 -1195 -1516 -1578 -1365 -922 -320 332 951 1396 1582 1467 1095
2659A095n47o44o55m85k72N1K63M16N58O23N32L87J72j16l06n63o17o25m69k79
$$ 1095 548 -96 -751 -1236 -1508 -1457 -1194 -778 -220 403 935 1322 1494 1378 1072 509 -108 -733 -1202 -1481
2679a481K4K83M50O00O24N32K60J14j14l47m96o25n31m64k21k5K28M98N86O25
$$ -1481 -1457 -1174 -724 -124 500 1032 1292 1406 1292 945 449 -176 -707 -1171 -1392 -1417 -1189 -691 -105 520
2699E20M79L14O6j57l79n29n21n56l54k14K6K24M31N51N72N08L04J33k04l45n43
$$ 520 999 1313 1379 1222 843 314 -207 -763 -1117 -1331 -1305 -1081 -650 -99 473 981 1285 1418 1214 869 326
2720C26n99n11l71j55P1L05M11M92M96M33K88P4j40l33m74n49n50l54j61R1K99
$$ 326 -273 -784 -1155 -1310 -1239 -934 -523 -31 465 898 1186 1260 1120 787 313 -236 -786 -1140 -1301 -1210 -911
2741i11M32N14N16L85K48k3j79l19m43n05m43l40j16K5K42M27N54N34L97K05j2
$$ -911 -479 35 551 936 1184 1161 982 663 220 -285 -728 -1068 -1184 -1159 -917 -490 64 598 995 1200 1188
2762A188j92l67n19m78m18k61j01O2K31M19N05M74L83K36K3k14l54n03m88m28
$$ 1188 996 629 110 -368 -786 -1047 -1148 -1086 -855 -436 69 543 926 1162 1185 971 617 114 -374 -802
2782h02k69p7J13K92M30M53M14L20J78K1j75l14m45m76l88l18r9J25L38M17M45
$$ -802 -1071 -1148 -1035 -743 -313 140 554 874 1052 1073 898 584 139 -337 -725 -1043 -1142 -1017 -679 -262 183
2803A83M29L19J71p0j87l56l92m37l52l00o5R4K95L80M59M66K99J74j08k26l45
$$ 183 612 931 1102 1032 845 489 97 -340 -692 -992 -1057 -963 -668 -288 171 637 936 1110 1002 776 431
2824D31m24m04l59k07k7J37K58L35M27M21K80J19n0j86l48m20m21l65j88NJ65
$$ 431 7 -397 -756 -963 -990 -853 -595 -260 167 588 868 987 937 751 403 -17 -438 -803 -991 -986 -821
2845h21K91L70M24L50K13J20o0j71l64l72m39l03j72p2J30L39M29L82L37K35J21
$$ -821 -530 -160 264 614 827 947 887 716 352 -20 -459 -762 -934 -1006 -876 -537 -108 274 611 846 967
2866I67q4k37l52m12l57k53j77l3J41K96L89L47L62K55R1r5k09l46m14l17l13
$$ 967 883 646 294 -118 -475 -728 -905 -938 -797 -501 -112 235 597 852 943 848 639 293 -121 -438 -751
2887g51j36oJ74K79L61L31L74K20O8r3k31l16l84l37l17j12J0J90K73L26L74L07
$$ -751 -887 -893 -719 -440 -79 252 626 846 914 821 590 274 -110 -447 -764 -876 -866 -676 -403 -77 297 604
2909F04K00O1j18j96l25l45l64k60q6L1J25K90L31L64K98J88L3j13k12l45l37
$$ 604 804 865 747 551 226 -119 -483 -743 -829 -798 -673 -383 -52 312 610 798 831 718 506 161 -176
2930a76k99k40q3N3J79K76L16L19K44J65N5j09k28l17l40k94k04j10N7J96K79
$$ -176 -475 -715 -798 -745 -566 -290 26 345 589 754 809 700 472 155 -185 -479 -683 -793 -736 -540 -261
2951b61L17K88K67J36k7j27j97k94k91k29k39q7N1J86K27L09L25K36J24Rj64k35
$$ -261 56 344 611 747 720 593 396 102 -189 -418 -657 -744 -693 -507 -280 29 354 590 714 723 559 324
2973C24k52k78k58j95qN3J62K40K33L15K33R1qj22k15k53l37k52j35j1Q8J63K88
$$ 324 72 -206 -464 -659 -667 -614 -452 -212 21 336 569 660 652 530 315 62 -275 -527 -662 -673 -585 -422 -134
2996a34K69K24J83Q2l8r4j93k89k99k05j30m0J17J94K43K83K41J82J6n8j57j91
$$ -134 135 359 542 624 586 492 299 10 -289 -494 -624 -664 -547 -353 -110 173 414 596 612 554 397 206
3018B06k59k25j88o9q2J33J72K33K89K06J85K6o6j93k33k82k30j16j09K5J37J85
$$ 206 -53 -278 -466 -535 -617 -484 -312 -79 210 416 601 627 561 368 135 -147 -377 -493 -602 -577 -440 -255
3040b55K73J72K07J21Q9r5j63k17k74k23k15l7O8J40K42K21K22J77J26k0r1j73
$$ -255 18 190 397 518 607 512 349 132 -142 -365 -580 -617 -549 -409 -167 54 276 453 579 559 468 295
3062B95k11k24k20j60r5R0J25K19K57K30J92P7k8j16j99k32k42j77q7n3M5J53
$$ 295 84 -140 -360 -520 -615 -525 -400 -181 76 306 498 575 547 431 232 0 -242 -419 -506 -559 -514 -361
3084c61J84K38K50J60R9k8q3j98k52k70j80j05pN7J67K54K10K04J42Q0j8j37j73
$$ -361 -177 61 311 471 570 542 459 261 9 -261 -441 -546 -553 -496 -329 -75 135 339 481 561 543 406 233
3107B33k37k46j66j45k0P5J88K25K32K12J48K0k6j46j55k52k12j52j03j6Q9J47
$$ 233 -4 -250 -416 -561 -581 -506 -318 -93 139 351 499 519 493 347 192 -60 -272 -424 -527 -543 -454 -307
3129c07K02K21K36J34R4n6j74k09k28j79j64r6%J04J72J92K07K19J33N3o8j42
$$ -307 -105 116 352 486 580 524 350 141 -87 -266 -430 -526 -526 -422 -250 -58 149 368 501 554 486 344
3151C44j63k50k38j62p4J1J23J82J99K35J81J06K0o8j22j85k55j59j78r0K6Q8
$$ 344 181 -69 -307 -469 -543 -532 -409 -227 -28 207 388 494 514 446 324 139 -116 -275 -453 -543 -517 -429
3173d29J84K42K27J94R5Mo9j59k07k21j56j31p8K5R4K01K03K20J52J14L5o9j69
$$ -429 -245 -3 224 418 513 517 448 289 82 -139 -295 -426 -504 -479 -385 -184 19 239 391 505 540 471 302
3196C02k13k29k04j18m4M4J29J83J90K11J46P9Jo6j61j84k13k32j16m2L4J66J94
$$ 302 89 -140 -344 -462 -506 -462 -333 -150 40 251 397 476 477 411 250 66 -147 -379 -495 -537 -503 -337 -143
3219a43K09K03J37Q3k1q6j05k14k04j72j41m0M7J33J71J77K37J40J33l4j32j39
$$ -143 66 269 406 489 468 382 277 63 -141 -313 -454 -494 -447 -314 -143 34 271 411 544 510 378 239
3241B39k19k11j67p6j7K5J19J74J94K09J30O0J0p9j74k02k02j64j18j2O6J13K20
$$ 239 20 -191 -358 -434 -451 -426 -307 -133 61 270 400 460 470 391 217 15 -187 -351 -469 -481 -415 -302 -82
3264h2J91J71J34L2Kr8j42k11j69j43j09l3P1R8K26J79K08P2N9k1j19j78j69j55
$$ -82 109 280 414 446 448 350 208 -3 -172 -315 -424 -457 -386 -288 -62 117 325 397 456 435 316 138 -31 -186
3288a86j16j21nP7R4J72J91J58J47L7o6j07j59j67j88j23n4K5O6J38J53J89J10
$$ -186 -302 -423 -428 -351 -257 -85 106 264 411 448 382 275 116 -51 -239 -362 -416 -391 -325 -187 -34 155 265
3311B65J08K4m7q8j50j86j60j13o2J7R1J33J67J72J45O8On9r2j65j60j34j16l7
$$ 265 373 397 350 262 112 -74 -234 -347 -409 -392 -301 -168 -1 171 316 384 390 331 239 74 -86 -220 -336 -373
3335c73j9P8J54J52J74J64L6Ro4j31j57j41j66m9o3L0R4J52J67J44J36M5J2l3
$$ -373 -392 -314 -160 -8 166 330 366 375 311 180 23 -118 -284 -333 -396 -366 -272 -120 47 191 327 372 384 351
3359C51j49j64j68j48q7j6L5J18J52J59J51P6P0nr5j20j43j59j46j10k9P4J19
$$ 351 202 38 -130 -278 -365 -381 -346 -228 -76 83 234 310 380 375 280 160 17 -142 -288 -398 -427 -353 -234
3382b34J54J53J54J13N9kj06j55j69j41j17q4KM2J16J37J89J36J33N1k8q0j93
$$ -234 -80 73 227 340 399 397 291 136 -33 -174 -291 -375 -373 -331 -215 -78 111 247 380 431 403 323 130
3405A30j55j66j50o6ON9J47J34J56J63J12K7j9r6j51j66j67j59m7k0P9J29K02
$$ 130 -25 -191 -341 -407 -401 -342 -195 -61 95 258 370 397 378 282 131 -35 -202 -361 -408 -428 -349 -220 -18
3428a8J54J54O2M1j8j15j17j91j73j38n2l1J23J43J55J52J71J01J0n3r2j61j66
$$ -18 136 290 352 393 375 260 143 -48 -221 -359 -411 -442 -319 -176 -21 131 302 403 413 360 268 107 -59
3451e9j84r0p9%O9J49J70J76J46Q5M9m5j48j56j61k02q5n8J9Q3J40J68J44J77
$$ -59 -243 -333 -412 -412 -343 -194 -24 152 298 383 432 387 239 83 -78 -280 -365 -423 -404 -321 -181 -13 131 308
3475C08R8K2k7j24j43k20j49j34n2L6N7J52J60J90J50J13j9o2j05j85j40j95r8
$$ 308 406 428 401 277 134 -86 -235 -369 -421 -385 -328 -176 -16 174 324 437 418 356 251 66 -74 -269 -367
3498c67o5L6P1J38J71K02J53Q0j4k9j41j78j86j50j01o9L7J11J37J81J53J56P5
$$ -367 -432 -396 -325 -187 -16 186 339 419 405 376 235 57 -129 -279 -380 -449 -412 -301 -164 17 170 326 401
3521D01L5l5j22j98j95j51j08q8M1R0J94J73J74J23J09Jm7j59j48j81j81j02p8
$$ 401 436 401 279 81 -114 -265 -373 -461 -420 -330 -136 37 211 334 443 444 397 238 90 -91 -272 -374 -452
3544d52L0J10J57J97J51J62O7J9n2j68j74k11j27j28j8MJ44J12K04K12J15J07
$$ -452 -422 -312 -155 42 193 355 422 441 389 221 47 -164 -291 -419 -437 -433 -289 -177 27 239 354 461
3566D61k1n8j23k00k10j41j00r4P8Q5J65J82K03J37P0J9p3j50j91j76j74r9n7
$$ 461 440 382 259 59 -151 -292 -392 -486 -408 -323 -158 24 227 364 434 453 380 230 39 -137 -311 -410 -467
3589d67M2J01J83J98J49J68P0J4q1j63j82j74j69j02n2L5J31J66J96J54J51J05
$$ -467 -425 -324 -141 57 206 374 444 458 377 214 32 -142 -311 -413 -465 -430 -299 -133 63 217 368 473
3611D73J1j05j30k03j74j68j03n3M4J18J71J72J96J29Q7Mj06j54j65j89j78j38
$$ 473 484 379 249 46 -128 -296 -399 -452 -408 -290 -119 53 249 378 465 469 363 209 44 -145 -323 -461
3633d61MM6J08J71J84J71J51O6kq7j42j97j87j70p9k3M6J23J53K04J82J45L3J5
$$ -461 -457 -411 -303 -132 52 223 374 440 438 351 209 12 -175 -345 -424 -447 -401 -278 -125 79 261 406 439 454
3657D54j04j29j75k20j55p6n8N6J37J25K30J72J50L7j1j12j45j75j96j58p4m0
$$ 454 350 221 46 -174 -329 -405 -463 -407 -270 -145 85 257 407 444 433 321 176 1 -195 -353 -427 -467
3679d67O7J43J96J84J69R6M9k4q7j42j77k33j43p7j1Q1J54J53K08J94P7O2k9j20
$$ -467 -400 -257 -61 123 292 388 437 413 326 184 7 -226 -369 -446 -457 -376 -222 -69 139 333 410 472 443 323
3703C23j40k07j85j30j17j7R2J26J89K05J68J38M6o4j41j50j59k15j60r4L5M9
$$ 323 183 -24 -209 -339 -456 -473 -381 -255 -66 139 307 445 491 427 286 136 -23 -238 -398 -492 -457 -408
3725d08J51J69K19J76J25N3k3j34j68k19j85j37r6NO5J56K18J79J92J07O2m6j23
$$ -408 -257 -88 131 307 432 485 462 328 160 -59 -244 -381 -477 -472 -407 -251 -33 146 338 445 507 461 338
3748C38j58k21k09j76p2NQ8J58J85K04J86J07Q8r3j11j67k14k01j52q8MP8J42
$$ 338 180 -41 -250 -426 -498 -493 -405 -247 -62 142 328 435 523 430 319 152 -62 -263 -415 -503 -499 -421 -279
3771b79K08K31J73J48N5m1j36k07j81k33j68o0j9P2J92J96K38J95R1O0j6j46j83
$$ -279 -71 160 333 481 536 495 359 152 -29 -262 -430 -490 -509 -437 -245 -49 189 384 475 535 519 373 190
3794A90k38k08j60q4oN2J80J89K58J79J10N1l1j17k02j97k22k02n9k3J24J68J87
$$ 190 -48 -256 -416 -500 -506 -454 -274 -85 173 352 462 513 482 365 163 -34 -256 -458 -517 -540 -416 -248 -61
3817f1K30K01J41K2l7j16j84k18k47j84p5NJ06J65J85K51J73J45N0l4j83j62k33
$$ -61 169 370 511 533 496 380 196 -22 -269 -453 -528 -523 -417 -252 -67 184 357 502 552 518 335 173 -60
3840f0k24j65j04M2P4J67K28K07K03J06N8k2j82j99k13k17j47j01J8R7J95J92
$$ -60 -284 -449 -553 -511 -437 -270 -42 165 368 474 532 510 328 129 -84 -301 -448 -549 -531 -434 -239 -47
3862d7K38J77J42L2l8j58j84k27k38j33j07K6J10J56J90K72J68J26N7j01j37j76
$$ -47 191 368 510 542 504 346 162 -65 -303 -436 -543 -517 -407 -251 -61 211 379 505 562 461 324 148
3884A48k38k02j73p0J1Q5J81K21K40J90J23J4n5j26k26k18k08j49j08K0J55J54
$$ 148 -90 -292 -465 -535 -524 -439 -258 -37 203 393 516 530 475 349 123 -95 -303 -452 -560 -540 -385 -231
3906b31K05K19K13J24L5o6j83j93k12k24j67o9J9J32J66K20K41J85J07M0q7j63
$$ -231 -26 193 406 530 565 499 316 123 -89 -313 -480 -549 -530 -398 -232 -12 229 414 521 561 474 311
3928C11j60k86j91j66n2PJ26J82K28K13J76J14L9p8j61k04k46j82j71k2J2J36
$$ 311 151 -135 -326 -492 -544 -537 -411 -229 -1 212 388 502 541 463 302 98 -148 -330 -501 -523 -511 -375
3950c75J73K13K63J88O0L3q2j72k02k30k09j31n7L6R2K25K34K05J45J03Kq8j51
$$ -375 -202 11 274 462 522 555 473 301 99 -131 -340 -471 -528 -492 -400 -175 59 264 409 512 514 426 275
3973B75j88k48k22j23j8J8J35K04K15K06J62J07pj08j42k11k38j98j19k7L7J65
$$ 275 87 -161 -383 -506 -524 -506 -371 -167 48 254 416 523 516 408 266 55 -183 -381 -500 -527 -490 -325
3995c25J80K00K04K08O8l5q5j71j75k44j78j30l1O8J08K13J99K40J27O3j5j01
$$ -325 -145 55 259 467 535 500 415 244 69 -175 -353 -483 -514 -446 -338 -125 74 314 441 504 489 388
4017C88j66k12j98j92j20l2P6J51J73K17J98J60N5Pj13j98j92j93j90j00KM1J42
$$ 388 222 10 -188 -380 -500 -532 -456 -305 -132 85 283 443 498 505 392 194 2 -191 -381 -481 -479 -438 -296
4040b96K08J96K05J47N8k7j32j71k21j89j88j09OQ8J57J94K11J85J32O6o4r0k25
$$ -296 -88 108 313 460 518 491 359 188 -33 -222 -410 -519 -513 -425 -268 -74 137 322 454 520 456 366 141
4063A41j93j91j68j24K0Q9J42K04K19K02J33N7n4j13j94j98k42j73o4j0J00J66
$$ 141 -52 -243 -411 -535 -515 -426 -284 -80 139 341 474 531 477 364 170 -28 -270 -443 -507 -517 -417 -251
4085b51K16K10J81J03P8n6j33j92k25j85j99o1qJ02J33K46K11J97J35M1q4j22
$$ -251 -35 175 356 459 537 481 348 156 -69 -254 -453 -514 -522 -420 -287 -41 170 367 502 543 459 337
4107C37k09k03k41j35j00L9P6K01K14J83K46Q8O5r1j37j91k18k09j84n6KJ09J72
$$ 337 128 -75 -316 -451 -551 -512 -436 -235 -21 162 408 496 561 470 333 142 -76 -285 -469 -525 -523 -414 -242
4130b42K47J82J93J45Ql3j65k01k29k01j79j00P6P8J74K18K19J96J01N1p8j28
$$ -242 5 187 380 525 533 500 335 134 -95 -296 -475 -575 -499 -421 -247 -29 190 386 487 538 460 332
4152C32k01k19k28j75n2L6R9J51K30K08K22J18K3o1j59j72k30k20j57o9K5J03
$$ 332 131 -88 -316 -491 -543 -507 -408 -257 -27 181 403 521 544 483 324 152 -78 -298 -455 -524 -499 -396
4174c96J79K12K31J80P7O3p6j59j95k39j86j64n9RJ33K02J96K20J65J20Qp7j21
$$ -396 -217 -5 226 406 483 546 470 311 116 -123 -309 -473 -532 -523 -390 -188 8 228 393 513 521 444 323
4197C23k36k35j66j57n6K4J08J74K11K45J93Q8K4q0j52k15k14k15j41n4J1J11
$$ 323 87 -148 -314 -471 -527 -503 -395 -221 -10 235 428 516 540 460 308 93 -121 -336 -477 -531 -520 -409
4219d09K17K10K22J45J14jm1j77j77k68j83j45m7L3J38J79K29K00J73R6on9j75
$$ -409 -192 18 240 385 499 498 457 280 103 -165 -348 -493 -540 -507 -369 -190 39 239 412 508 502 443 268
4242B68k03k30j96j16n3M8J46J84K28K07J91N0J3j22j62j98k42j51j27o7P1R3
$$ 268 65 -165 -361 -477 -530 -482 -336 -152 76 283 474 524 537 415 253 55 -187 -338 -465 -532 -461 -368
4264c68J87K29K24J73N2K0j07j90j74k33k02p0q7Q0J28J97K17K10J35Q9j5r1j67
$$ -368 -181 48 272 445 497 517 410 220 46 -187 -389 -459 -546 -466 -338 -141 76 286 421 510 495 404 237
4287B37k02k22j60j29m2P2J22K11K10K06J35P1k4r8j64j97k22j80j21j5M0J58
$$ 237 35 -187 -347 -476 -518 -446 -324 -113 97 303 438 509 485 387 223 26 -196 -376 -497 -512 -472 -314
4309c14J92K30J81J32P1Qj28j77k08k08j54j29LO9J17K19K05J63J61N8pj54j35
$$ -314 -122 108 289 421 492 500 372 195 -13 -221 -375 -504 -501 -432 -315 -96 109 272 433 491 484 330 195
4332A95k36j87j24j28jN9J45J87K28J78J14O3l7j15j69j70k30j72j01NR0J81J40
$$ 195 -41 -228 -352 -480 -481 -422 -277 -90 138 316 430 493 456 341 172 2 -228 -400 -501 -496 -406 -225 -85
4355h5K16J64J24N3k1j47j59j83k15j45q9J5P3J70J74K03J52J38M8q0r4k00j85
$$ -85 131 295 419 472 451 304 145 -38 -253 -398 -487 -472 -399 -229 -55 148 300 438 486 406 312 112 -73
4378g3j95j36m1k2J10J42J96J85J65J54k9k7j27j77k22j66j58n7JJ17J66J75J95
$$ -73 -268 -404 -445 -467 -357 -215 -19 166 331 485 456 429 302 125 -97 -263 -421 -478 -477 -360 -194 -19 176
4401A76J57J02M0q9j23j63k04j96j29p8O4J08J32K11J77J74Q1Pm6j27j86j98j88
$$ 176 333 435 475 386 263 100 -104 -300 -429 -507 -443 -335 -203 8 185 359 440 447 401 274 88 -110 -298
4424b98j28l7J8J25J53J73K21J63M9K8p3j49j95k01j72j53j8N3J09J55K05K16
$$ -298 -426 -463 -445 -320 -167 6 227 390 439 467 394 245 50 -151 -323 -476 -494 -441 -332 -177 28 244
4446B44J23O5K8r6j45j69k30j63j33k0L3J32J78J89K12J51P3ko4j76j98k00j46
$$ 244 367 432 460 364 219 50 -180 -343 -476 -496 -463 -331 -153 36 248 399 472 470 406 230 32 -168 -314
4469c14j21o5P7J12J94J84J86J50P7j2q6j77j86j92j65j24l2N5J18K11J68K42
$$ -314 -435 -500 -423 -311 -117 67 253 403 480 468 382 205 19 -173 -338 -462 -494 -439 -321 -110 58 300
4491C00R0P1J2j15j68j83k26j46j01k4N5J34J87J97J80J42P3k5q6j41k42j69j78
$$ 300 390 461 473 358 190 7 -219 -365 -466 -490 -435 -301 -114 83 263 405 478 453 367 226 -16 -185 -363
4514c63j07rO6J41J74J92J87J41K8kq0j85j85k04j40j01l8O1J34J93J95J88J32
$$ -363 -470 -479 -413 -272 -98 94 281 422 450 448 368 183 -2 -206 -346 -447 -485 -424 -290 -97 98 286 418
4537D18K8Nj30j64j75j92j64r0j1P8J44J77J99J69J43O9n4q6j98j73k11j16j18
$$ 418 446 451 321 157 -18 -210 -374 -464 -475 -397 -253 -76 123 292 435 504 450 364 166 -7 -218 -334 -452
4560d52l2R0J41J91J97J62J10M6m6j00j69j72k31j36o3J7N8J66J54J99J94R7J6
$$ -452 -484 -394 -253 -62 135 297 407 453 407 307 138 -34 -265 -401 -464 -447 -389 -223 -69 130 324 421 437
4583D37j4j32j35k05j62j75o6rJ10J29J80K01J76J11M6o0j53j25k26k04j27p0
$$ 437 423 291 156 -49 -211 -386 -452 -461 -351 -222 -42 159 335 446 492 432 279 154 -72 -276 -403 -473
4605d73K4O7J67J96J89J39J16J9m1j40j49j99j88j20q5L6P3J70J61K17J55R6M
$$ -473 -449 -382 -215 -19 170 309 425 444 403 263 114 -85 -273 -393 -478 -442 -369 -199 -38 179 334 430 434
4628D34m3r6k08j73j80j20o5LJ31J40J99J68J60Q3L2o8j29j52k27j70j20l6J6
$$ 434 391 295 87 -86 -266 -386 -451 -448 -317 -177 22 190 350 433 465 397 268 116 -111 -281 -401 -437 -421
4651d21Q6J79J76J75J36J08qo6j33j73j84j79j32n7O4J06J28K32J77J30J05J5
$$ -421 -335 -156 20 195 331 439 431 365 232 59 -125 -304 -436 -493 -429 -323 -195 37 214 344 449 464
4673D64p2j28k03j86j64j03p0M8R1J78J68J96J42R2k0o5j17j97j97j51j03n3L9
$$ 464 392 264 61 -125 -289 -392 -462 -414 -323 -145 23 219 361 453 433 368 251 54 -143 -294 -397 -450 -411
4696d11R6J60J94J87J43N0J1p5j49j68j89j82j14j4K9J15K10J46K01J55O7l6n3
$$ -411 -315 -155 39 226 369 419 430 355 206 38 -151 -333 -447 -461 -432 -317 -107 39 240 395 462 426 373
4719C73j53k00j90j50j10m2Q8J00J65K14J46J47P1l6o4j61j72k07j83q4k2P3J33
$$ 373 220 20 -170 -320 -430 -472 -384 -284 -119 95 241 388 459 423 359 198 26 -181 -364 -448 -470 -397 -264
4742b64J60J84J72J55K2k0p3j35k07j86j54r0m5R0J26J91J66J96J21N1k8j07j39
$$ -264 -104 80 252 407 429 409 336 201 -6 -192 -346 -436 -481 -391 -265 -74 92 288 409 460 432 325 186
4765A86j97j87j64q3k1Q2J11J83K22J68J28J8Lj06j97j79j92j46p9k0N9J09K21
$$ 186 -11 -198 -362 -445 -466 -384 -273 -90 132 300 428 446 449 343 146 -33 -225 -371 -450 -470 -411 -302 -81
4788h1J92J68J33M5k3j18j69k01j71j69p2rO5J51J82K20J70J13M9k1j03j81k03
$$ -81 111 279 412 457 434 316 147 -54 -225 -394 -466 -475 -410 -259 -77 143 313 426 475 454 351 170 -33
4811c3j99j46p0m0R3J54K07J78J56J18O1l3j09j95j75j88j73n2n0P6J80J77J92
$$ -33 -232 -378 -448 -488 -395 -241 -34 144 300 418 479 446 337 142 -33 -221 -394 -446 -496 -420 -240 -63 129
4834A29J88J03K9j9j10j69k30j54j71n9PM9J44K08K25J32J37L9n6p0j92j96j80
$$ 129 317 420 449 430 320 151 -79 -233 -404 -463 -456 -407 -263 -55 170 302 439 478 422 352 160 -36 -216
4857b16j85p6j0R3J45K06J83J97J09J9n0j14j81k19j71j29m8k7O9J98J59J94J89
$$ -216 -401 -477 -487 -394 -249 -43 140 337 446 465 415 301 120 -99 -270 -399 -447 -474 -405 -207 -48 146 335
4880C35R0L2p3r3j93j71j54j53r7L9P1J63J54K54J48P4L5m0j35j83j68k04j39
$$ 335 425 457 384 291 98 -73 -227 -380 -477 -438 -367 -204 -50 204 352 426 461 421 286 103 -65 -269 -408
4903d08n7J6Q4J68J68K16J41R7M4r7q5j90k19j70j10n4oJ17J52J72J85J72R9J3
$$ -408 -465 -449 -365 -197 -29 187 328 425 469 372 287 97 -122 -292 -402 -456 -462 -345 -193 -21 164 336 435 448
4927D48o4j49j74j64j80j48k4L8R2J58J89K20J24Q0J0o7j28j91j46k10r9p0J1
$$ 448 384 235 61 -103 -283 -431 -455 -417 -325 -167 22 242 366 446 456 389 261 70 -76 -286 -385 -455 -444
4950d44R4J72K11J82J59N7J7q6r5k26k00j48j35k0M7R6J49J70K07J53Q2N4j17
$$ -444 -350 -178 33 215 374 431 448 362 267 41 -159 -307 -442 -462 -415 -319 -170 0 207 360 442 496 379
4973C79j40k04j86j54j12m1O0P6J82K06J66J25Q7j4n8j30k08j70k00j05m2M5J33
$$ 379 239 35 -151 -305 -417 -458 -398 -322 -140 66 232 357 444 430 372 242 34 -136 -336 -441 -483 -438 -305
4996c05J56K09J71J33P2k4n2j91j30k27j34j18l2N2J36J60K17J47J32N7pm1j90
$$ -305 -149 60 231 364 436 412 360 169 39 -188 -322 -440 -472 -420 -284 -124 93 240 372 429 422 381 191
5019A91j66j80j70j01PJ8J21J85J83J69J07Q4k8r7j41j82j94j57p9j7P4J13J47
$$ 191 25 -155 -325 -426 -419 -401 -280 -95 88 257 364 448 420 323 182 0 -194 -351 -430 -447 -373 -260 -113
5042a13K01J72J08O7j8j13j56k05j46j38q9j8Q1J23J92J79J60J19J6pj00j87j76
$$ -113 88 260 368 435 417 304 148 -57 -203 -341 -430 -448 -367 -244 -52 127 287 406 422 415 315 128 -48
5065d8j76j26q7j0R8J12K11J53J62J39K9n2j09j71j59k39r5o8RQ9J19J83J80J50
$$ -48 -224 -350 -437 -447 -349 -237 -26 127 289 428 457 405 296 125 -34 -273 -368 -436 -427 -338 -219 -36 144 294
5089B94J44k1m5j09j63j91j68j14o6k2J06J45K10J63J51J21nl6j23j68j91j76
$$ 294 438 417 372 263 100 -91 -259 -373 -439 -461 -355 -210 0 163 314 435 430 394 271 103 -88 -264
5111b64j16o7RJ05J49J65K43J34P9pm4j32j79j96j51j32m3J2P8J89J69J88J76
$$ -264 -380 -447 -438 -333 -184 -19 224 358 437 430 386 254 75 -121 -272 -404 -447 -435 -357 -168 1 189 365
5134C65O6km3j55j50k21j78j03l1L8R8J49K09J80J39Q6K0o1j75j54j99j75r6p7
$$ 365 431 429 386 231 81 -140 -318 -421 -452 -414 -316 -167 42 222 361 447 467 406 231 77 -122 -297 -393 -470
5158d70L8J23J60J93J68J60J09l7p5j56j40k29j49j39m0N8J07J65K04J66J39R7
$$ -470 -432 -309 -149 44 212 372 481 444 369 213 73 -156 -305 -444 -484 -426 -319 -154 50 216 355 452
5180D52j8q2j34j75k05j27j10n9L6J22J59K10J44J29J34j3j10j47j69j79j59j36
$$ 452 434 352 218 43 -162 -289 -399 -458 -422 -300 -141 69 213 342 476 463 353 206 37 -142 -301 -437
5202d37k4L5J30J63K12J41J49P4j0j00j29j82k00j52r1k1K8R5J71K05J81J39M0
$$ -437 -461 -426 -296 -133 79 220 369 443 433 333 204 22 -178 -330 -421 -442 -414 -319 -148 57 238 377 417
5225D17Jp1j29k07j81j31j23k5O5J28J41K08J41J61O0j9r9j65j75j75j47q9qJ9
$$ 417 418 347 218 11 -170 -301 -424 -449 -384 -256 -115 93 234 395 455 436 337 172 -3 -178 -325 -414 -422 -403
5249d03J56J37J79J93R1P0nj26j21j82j88j40j03K5J9J24J74K10J32J26O8l1o8
$$ -403 -247 -110 69 262 353 423 418 292 171 -11 -199 -339 -442 -417 -398 -274 -100 110 242 368 436 405 337
5272C37j94j45j76j61q7J8M5J43J47J71J85J31L5jj37j83j54j91j24o0m9R9R7
$$ 337 143 -2 -178 -339 -426 -408 -363 -220 -73 98 283 414 449 448 311 128 -26 -217 -341 -401 -450 -351 -254
5295b54J87J71J65J43K0m9j02j36j97j62j53o6PO9J39J69J73J85J06K7p1j02j24
$$ -254 -67 104 269 412 432 383 281 145 -52 -214 -367 -433 -426 -357 -218 -49 124 309 415 442 371 269 145
5318A45j97j72j16q4J7Q7J18J47K18J47R3M3l8j01j72j79k07j34n8j0Q5J45J87
$$ 145 -52 -224 -340 -424 -407 -320 -202 -55 163 310 403 446 408 307 135 -44 -251 -385 -443 -453 -368 -223 -36
5341c6J76J57R8J4k5j02j95j78j35j48p7NJ11J67J54J79J64O5M6m7j15j70k06
$$ -36 140 297 395 409 384 282 87 -91 -226 -374 -451 -446 -335 -168 -14 165 329 394 440 393 278 108 -98
5364i8j70j14l5J7R6J30J78J86J25J04Qn4r0k05j86j56j50n3M9R1J57J69J74J68
$$ -98 -268 -382 -417 -400 -304 -174 4 190 315 419 427 373 283 78 -108 -264 -414 -467 -418 -327 -170 -1 173 341
5388C41L9M8p4j46j78j38j63j09q7P1Q9J38K03J82J45P4K9r7j29j69j90j64j18
$$ 341 380 428 354 208 30 -108 -271 -380 -467 -396 -307 -169 34 216 361 435 464 367 238 69 -121 -285 -403
5411d03l5K8J17J30K26J64J37P7j6n5j61j49k18j71q6m3L8R5K15J78J60J54L6
$$ -403 -438 -410 -293 -163 63 227 364 441 425 370 209 60 -158 -329 -415 -458 -420 -325 -110 68 228 382 418
5434D18kp0j06j90j89j71j04m1L2J44J55J92K15J07N4K4j14j28j84j70j91r6n7
$$ 418 416 346 240 50 -139 -310 -414 -455 -423 -279 -124 68 283 390 444 468 354 226 42 -128 -319 -415 -472
5457d72N6J33J56J97J80J54L1Rq8j54k08j66j55j18l9O1J37J61J95J75J56P0l9
$$ -472 -416 -283 -127 70 250 404 435 444 356 202 -6 -172 -327 -445 -484 -423 -286 -125 70 245 401 471 432
5480D32o0j67j90j82j78j10m8J05J15J60K09J93J34Q5j9j30j40j90j79j93p7n7
$$ 432 372 205 15 -167 -345 -455 -503 -398 -283 -123 86 279 413 498 479 349 209 19 -160 -353 -430 -487
5502d87N7J24K03J65K19J24P7%j29j32k18k02j53j01m9N9J16J93K11J87J24J28
$$ -487 -430 -306 -103 62 281 405 482 482 353 221 3 -199 -352 -453 -502 -443 -327 -134 77 264 388 516
5524E16l7j39j34j83j92j48j26n0O0J46J79J91K00J58K7Mp3j94k19j77j48j05
$$ 516 479 340 206 23 -169 -317 -443 -493 -433 -287 -108 83 283 441 468 472 399 205 -14 -191 -339 -444
5546d44l4K0J68J84J95J83J57L0J7j00j66j96k00k01j02jO7J30J70K26J83J55
$$ -444 -478 -458 -290 -106 89 272 429 459 476 376 210 14 -186 -387 -489 -490 -423 -293 -123 103 286 441
5568D41M1l6m8j69k00k18j39j26j3L5J53J79J78K28J20O7k3r2k00j78k15j36j07
$$ 441 482 446 398 229 29 -189 -328 -454 -467 -432 -279 -100 78 306 426 493 470 378 178 0 -215 -351 -458
5591d58l9P4J36J78K10J75J12R0k8r1j84j80k37j35r4j3P0J42J79K21J71J32N2
$$ -458 -497 -423 -287 -109 101 276 388 478 450 359 175 -5 -242 -377 -471 -484 -414 -272 -93 128 299 431 483
5614D83m8j03j40j92k03j36j23j1O6J43J98K15J84R8N8l7j16j52k09k07j57p5
$$ 483 435 332 192 0 -203 -339 -462 -473 -407 -264 -66 149 333 431 489 452 336 184 -25 -232 -389 -464
5636d64l2Q4J60J85K06J78J41L4l1j48j80j76j94j71p5mR7J30K35J73J88J22K5
$$ -464 -496 -412 -252 -67 139 317 458 492 461 313 133 -43 -237 -408 -483 -487 -390 -260 -25 148 336 458 483
5659D83k6j40j53k13j93j80o4k6J35J44K02K13J37J56Rk9j51j51k16k06j50q8
$$ 483 457 317 164 -49 -242 -422 -486 -512 -377 -233 -31 182 319 475 484 455 304 153 -63 -269 -419 -507
5681e07J7Q8J55K04J92J97J17L0l7j23k08j88j99j63q9K7Q8J52K34J96J87J20
$$ -507 -490 -402 -247 -43 149 346 463 493 456 333 125 -63 -262 -425 -514 -487 -399 -247 -13 183 370 490
5703D90J5o5j24j86k24j74j39j00J4J36J47K14J85J98R6K2o6j24j98j83k50j18
$$ 490 505 440 316 130 -94 -268 -407 -507 -493 -357 -210 4 189 387 483 505 439 315 117 -66 -316 -434
5725d34q7J8J16J75K18J63J88J30L4p9j27j98j99k16j43o7kJ33J92J86K52J19
$$ -434 -521 -503 -387 -212 6 169 357 487 521 442 315 117 -82 -298 -441 -508 -510 -377 -185 1 253 372
5747C72J53J2p4j47k02k11k04j47p5K1J00K01K09K11J46J55%p5j48k18j93k11
$$ 372 525 537 463 316 114 -97 -301 -448 -523 -502 -402 -201 8 219 365 520 520 445 297 79 -114 -325
5769c25j36p1J4J32J64K36J92K14J10k5o6j39j96k42k21j11n7L6J33J76K20K12
$$ -325 -461 -532 -518 -386 -222 14 206 420 530 505 439 300 104 -138 -359 -470 -527 -491 -358 -182 38 250
5791B50J80R9J3j08j24k15k46j99j18o2N5J19J56K42K18J69J01J9j05j47k26k39
$$ 250 430 529 542 434 310 95 -151 -350 -468 -530 -475 -356 -200 42 260 429 530 549 444 297 71 -168
5813a68j87j72l3N1J20J96K33K24J62R9J6j10j76j97k36j78j42l4L1J33K00K29
$$ -168 -355 -527 -560 -509 -389 -193 40 264 426 525 541 431 255 58 -178 -356 -498 -532 -501 -368 -168 61
5835F1K23J61J10J0r5j90k00k33j94j60m3K6J37J84K65J97J85R9Lj07j71k10k29
$$ 61 284 445 555 565 470 280 80 -153 -347 -507 -550 -524 -387 -203 62 259 444 543 546 439 268 58 -171
5858a71k12j54l3N9J38J77K34K57J92R2k5r4j58k29k48j98j27r3R1J60J70K96
$$ -171 -383 -537 -570 -511 -373 -196 38 295 487 579 554 460 302 73 -175 -373 -500 -593 -502 -342 -172 124
5880A24J92J69O4qj17j46k39j88k36j32p8R1J08K36K21K67J22J07J5j35k03k08
$$ 124 316 485 549 541 424 278 39 -149 -385 -517 -595 -504 -396 -160 61 328 450 557 572 437 234 26
5902B6k14k00j35m6M8J41K34K17K46J76R0k8j07j82k37k22j81j37m0O4J28K10
$$ 26 -188 -388 -523 -569 -521 -380 -146 71 317 493 583 555 448 266 29 -193 -374 -511 -551 -487 -359 -149
5924a49K63J87J71Q4k7r0k13k24k27j81j46k8N5J43K20K68K16J56N5j5q7j97k39
$$ -149 114 301 472 556 529 439 226 2 -225 -406 -552 -580 -525 -382 -162 106 322 478 533 518 431 234 -5
5947ek23j73j44j7N3J68K22K42K06J95N2k5j17j80k59k27k03j12QO2J56K05K29
$$ -5 -228 -401 -545 -562 -509 -341 -119 123 329 524 576 551 434 254 -5 -232 -435 -547 -539 -477 -321 -116 113
5970A13K52J41P7n4j46j49k77k30j87p2m5R4J62K18K23K39J44N9pj68j74k33k55
$$ 113 365 506 583 529 383 234 -43 -273 -460 -532 -577 -483 -321 -103 120 359 503 562 555 387 213 -20 -275
5993b75j88j00oR3J98K02K39K03J70N2l7j52j92k50k34j56j55K8Q5J85K47K01
$$ -275 -463 -563 -569 -476 -278 -76 163 366 536 588 551 399 207 -43 -277 -433 -588 -560 -475 -290 -43 158
6015A58K17J60K0m5j21k29k17k33j81r4j1J04J78K42K34K34J39L5o4j28k33k16
$$ 158 375 535 555 510 389 160 -57 -290 -471 -565 -576 -472 -294 -52 182 416 555 590 526 398 165 -51
6037e1k45j98j14L6J22J78K37K47K08J63Qm9j48k28k43k23j69j13pJ23J86K54
$$ -51 -296 -494 -608 -572 -450 -272 -35 212 420 583 591 542 394 166 -77 -300 -469 -582 -589 -466 -280 -26
6059b6K35J80J56M7q2j49k20k79j74k09p4J4J30J73K67K57J70J31O9r0j73k22
$$ -26 209 389 545 592 510 361 141 -138 -312 -521 -595 -581 -451 -278 -11 246 416 547 616 526 353 131
6081A31k43k33j53j00N3R9J98K43K28K06J45J2m1j68k39k63k04k15o9M5J14K01
$$ 131 -112 -345 -498 -598 -545 -446 -248 -5 223 429 574 586 545 377 138 -125 -329 -544 -613 -568 -454 -253
6103b53K19K94J68J32L8r8j39k58k61k22j82l5J9J21K22K62K27K17J24J0r5j70
$$ -253 -34 260 428 560 598 500 361 103 -158 -380 -562 -597 -578 -457 -235 27 254 471 595 605 510 340
6125C40k16k68k29j75o5M9J28K16K56K28K02J36J6j15j92k21k20k39k06m9M4J56
$$ 340 124 -144 -373 -548 -613 -564 -436 -220 36 264 466 602 618 503 311 90 -130 -369 -575 -624 -580 -424
6147d24K22K39K51J84R8L6j04j60k67k62k16j90n5O5J32K24K81K65J84J47l5q8
$$ -424 -202 37 288 472 570 606 502 342 75 -187 -403 -593 -648 -583 -451 -227 54 319 503 650 615 527
6169E27k06k34k69k34j57m3L1J58K05L01K53K05Q1L9j21k35k25k66k44j52p8O4
$$ 527 321 87 -182 -416 -573 -616 -585 -427 -222 79 332 537 618 657 536 301 76 -190 -434 -586 -664 -600
6191f00J69K37K62K39J96R7K3j27j61k98k51k21j70l7O0J89K35K54K43J76J28
$$ -600 -431 -194 68 307 503 600 623 496 335 37 -214 -435 -605 -642 -582 -393 -158 96 339 515 643
6212F43oj31j96k80k47k08j71n5P0J65K69K64K27K01R5k1j16k26k54k26k71j24
$$ 643 637 506 310 30 -217 -425 -596 -651 -581 -416 -147 117 344 545 640 619 503 277 23 -203 -474 -598
6234e98m4N8J72K23K83K38J91J14j8j30k07k68k35k40j41l8Q0J80K04K96K63J76
$$ -598 -642 -584 -412 -189 94 332 523 637 619 489 282 14 -221 -461 -602 -640 -560 -380 -176 120 383 559
6256E59Q7oj52k11k35k72k18j48l4O3J80K52K76K35J71Q6j4j38k30k33k79k27
$$ 559 646 640 488 277 42 -230 -448 -596 -630 -567 -387 -135 141 376 547 633 619 481 251 18 -261 -488
6278d88j33pQ0J71K33K70K61J74Q7j8j46k50k46k60k35j15nR3J87K53K56K49J87
$$ -488 -621 -628 -548 -377 -144 126 387 561 648 630 484 234 -12 -272 -507 -622 -627 -534 -347 -94 162 411 598
6301E98M6k7j42k38k69k52j99j39J9O8J86K70K55K30J74M6l1j27k54k43k93j98
$$ 598 644 617 475 237 -32 -284 -483 -622 -603 -535 -349 -79 176 406 580 626 595 468 214 -29 -322 -520
6323e20j34J9J08J86K64K51K52J78N8p3j57k24k90k41j86j27oJ07K39K19L04K27
$$ -520 -654 -635 -527 -341 -77 174 426 604 662 589 432 208 -82 -323 -509 -636 -642 -535 -296 -77 227 454
6345D54J51O4p9j14k80k65k52k17j05KJ07K23K39K90K33J64N2o6j40k70k57k89
$$ 454 605 669 590 476 196 -69 -321 -538 -643 -641 -534 -311 -72 218 451 615 667 601 461 191 -66 -355
6367c55k00j13K5J09K31K66K76K26J50N8m9j84k73k61k43k01q4j3J42J71K98K68
$$ -355 -555 -668 -643 -534 -303 -37 239 465 615 673 624 440 167 -94 -337 -538 -622 -635 -493 -322 -24 244
6389B44K15J73P0q2k03k45k47k78k11q2k3J56K08K83K76K15J53N2p3k05k51k71
$$ 244 459 632 702 620 417 172 -75 -353 -564 -646 -669 -513 -305 -22 254 469 622 674 601 396 145 -126
6411a26k94j36j45N3J30K37K68K81K30J44J8r4j45k62k85k55k07r7M5J25K43K61
$$ -126 -420 -556 -701 -648 -518 -281 -13 268 498 642 660 566 421 159 -126 -381 -588 -685 -640 -515 -272 -11
6433a1K77K29J50L1n9k05k73k95k53j64j06K9J43K28K89K78K31R0O0p1k20k57
$$ -11 266 495 645 676 617 412 139 -156 -409 -573 -679 -650 -507 -279 10 288 519 609 669 598 378 121
6455A21l15k10j95r6N5J25K71K66K78K27J37K5r9k11k66k63k72k18q0Q4J55K45
$$ 121 -194 -404 -599 -695 -640 -515 -244 22 300 527 664 689 590 379 113 -150 -422 -640 -720 -636 -481 -236
6477b36K94K74J92J38J7r9k01k83k87k55j85m6M8J41K44K88K64K66R4k0p6k18
$$ -236 58 332 524 662 679 580 379 96 -191 -446 -631 -677 -629 -488 -244 44 308 574 668 648 572 354
6499C54k64k94k67j54o9M4J76K34K97K80K44J08pr4k11k68l22k09j88j08Q5J45
$$ 354 90 -204 -471 -625 -694 -650 -474 -240 57 337 581 689 682 588 377 109 -213 -422 -610 -718 -633 -488
6521d88K51L05L00J91J34k1r8k28k69k76k80j76p5P3J68K57L12K66K07J34lr8
$$ -488 -237 68 368 559 693 672 574 346 77 -199 -479 -655 -730 -657 -489 -232 80 346 553 687 684 586
6543E86k32l00l04k05k00m7N9J69K61K98K72K23J35j8r9k51k48l07k59j69r2J12
$$ 586 354 54 -250 -455 -655 -702 -643 -474 -213 85 357 580 715 697 598 347 99 -208 -467 -636 -728 -616
6565f16J71K17L07L10K15Q3K9j96j76k87k97k85j31r1P4K04K54L20K53K31Q3K2
$$ -616 -445 -228 79 389 604 687 716 520 344 57 -240 -525 -656 -747 -673 -469 -215 105 358 589 672 694
6587F94j24k34k87k94k59j37l2M3J78K76K95K70K06J21l1j08k47k82k90k69j53
$$ 694 570 336 49 -245 -504 -641 -673 -630 -452 -176 119 389 595 716 685 577 330 48 -242 -511 -664
6608f64k2O5J90K44K94K76K01J34n0j22k18l17k81k45j56n2J08J70K60L02K68
$$ -664 -686 -621 -431 -187 107 383 584 718 668 546 328 11 -270 -515 -671 -723 -615 -445 -185 117 385
6629C85K22J06m2j29k35k95k59k51j80m0J41J57K57L07K85K02O9j7j65k12k86
$$ 385 607 713 671 542 307 12 -247 -498 -678 -718 -577 -420 -163 144 429 631 700 683 518 306 20
6650B0l12k23j57k6J06J75K52L16K71K01P5m9j56k32k62l19k47j27oQ9K12K49
$$ 20 -292 -515 -672 -698 -592 -417 -165 151 422 623 698 649 493 261 -1 -320 -567 -694 -700 -611 -399 -150
6672a50K96K64K01R7l7j40k69k90k66k66q1n2J16K17K39L20K54J72P6m2j26k67
$$ -150 146 410 611 708 671 531 262 -28 -294 -560 -641 -693 -577 -360 -121 199 453 625 701 659 533 266
6694B66k73k88k67j09k8J07K21K65K84K64J82Q1o1j69k50k90k77k12j24m2J48
$$ 266 -7 -295 -562 -671 -699 -592 -371 -106 178 442 624 705 644 475 225 -65 -342 -554 -678 -720 -572
6715e72J99K67K85K86J70O7n8j57k56k90k63k41j10K0N5K43K79K72K74J89L3k3
$$ -572 -373 -106 179 465 635 702 644 487 231 -59 -322 -563 -673 -653 -598 -355 -76 196 470 659 692 669
6737F69j66k74l11k60k18j36lJ04K43K79K72K65J71M4j2j99k50l14k74k12j07
$$ 669 503 229 -82 -342 -560 -696 -699 -595 -352 -73 199 464 635 679 667 468 218 -96 -370 -582 -689
6758f89k7J35K29K90L15K32J65P2o7k12k25l04k96k23n9k7J29K35K62L21K23J89
$$ -689 -716 -581 -352 -62 253 485 650 722 655 443 218 -86 -382 -605 -664 -691 -562 -327 -65 256 479 668
6780F68L4n3j70k96k83k78k34j32N2J11K45L06K85K46J52N9q2j96k66k78k97j93
$$ 668 702 649 479 183 -100 -378 -612 -744 -692 -581 -336 -30 255 501 653 712 630 434 168 -110 -407 -600
6802f00j23M3J25K52K79K87K61J56L7p9j95k59l14k75k17j02N4J40K39K83K96
$$ -600 -723 -680 -555 -303 -24 263 524 680 717 638 443 184 -130 -405 -622 -724 -670 -530 -291 -8 288
6823B88K36J40M8j06j78k80k94k87j92r0K4J36K51L00K68K39J72K8o8k07k75k97
$$ 288 524 664 712 606 428 148 -146 -433 -625 -715 -691 -555 -304 -4 264 503 675 703 635 428 153 -144
6845a44k80k22p8J2J85K30K97K92K48J55K5j18j96k57l19k55j84j14N0J30K77
$$ -144 -424 -646 -724 -712 -527 -297 0 292 540 695 720 602 406 149 -170 -425 -609 -723 -673 -543 -266
6866b66K44L15K32J49K9r5k09k72k92k81j71r2M1J50K36K93L09K08J31L8p1k40
$$ -266 -22 293 525 674 703 608 399 127 -165 -446 -617 -709 -668 -518 -282 11 320 528 659 697 626 386
6888C86k42k96k83j95q3N9J52K55K81K77K54J35J8p7k31k76k96k67j99p7K0J64
$$ 386 144 -152 -435 -630 -713 -654 -502 -247 34 311 565 700 718 641 410 134 -162 -429 -628 -705 -685 -521
6910e21K54K71L01K25J70L1j56j81k75k96k88j88m3PJ57K54L07K76K38J35L2j24
$$ -521 -267 4 305 530 700 731 575 394 119 -177 -465 -653 -696 -689 -532 -278 29 305 543 678 710 586
6932E86k01k58k89k91j72n9J3J66K65K70K93K13J28M6j28j91k55l01k72j96n6
$$ 586 385 127 -162 -453 -625 -684 -671 -505 -240 30 323 536 664 710 582 391 136 -165 -437 -633 -689
6953f89M0J73K11K91K93J94J64j9j05j72k60l04k53k17n1N7J69K18L23K50K24
$$ -689 -649 -476 -265 26 319 513 677 658 553 381 121 -183 -436 -653 -704 -647 -478 -260 63 313 537
6974E37J24J3q1k33k39k91k91j61m9N0J41K61K64K94K11J04M2r3k32k96k89k25
$$ 537 661 674 593 360 121 -170 -461 -622 -671 -621 -480 -219 45 339 550 654 696 603 371 75 -214 -439
6996d39j71o5M0J76J92L03K98K11J23j1r1k34k64k71k36j94l6O2J44K33K78K86
$$ -439 -610 -675 -635 -459 -267 36 334 545 668 657 566 332 68 -203 -439 -633 -669 -607 -463 -230 48 334
7018C34K30J20l0j02k17k59k73k64j59o0N9J60K78K48L04K19O9K0j07k35k66k95
$$ 334 564 684 654 552 335 76 -197 -461 -620 -680 -621 -461 -183 65 369 588 657 677 570 335 69 -226
7040b26k36j67n2N5J76K80K88K34K20Q4J5j23k39k87k56k42j73m9Q5J71K72K92
$$ -226 -462 -629 -681 -626 -450 -170 118 352 572 656 671 548 309 22 -234 -476 -649 -698 -613 -442 -170 122
7062A22K38K14J24l3j21k23k72k88k35j45m9O8J91K43K59K80K03J14l2j22k18
$$ 122 360 574 698 665 544 321 49 -239 -474 -619 -668 -600 -409 -166 93 373 576 690 658 536 318
7083C18l01k73k54j36k8M7K07K62K64K66J90R0Lj41k46k40l08k18j57n7J09J91
$$ 318 17 -256 -510 -646 -674 -627 -420 -158 106 372 562 652 655 514 268 28 -280 -498 -655 -712 -603 -412
7105d12K50L00K46J98R9k6j22k43k48k99k18j63m6R0J96K61K81K42K16Q1k6j58
$$ -412 -162 138 384 582 681 655 533 290 42 -257 -475 -638 -684 -594 -398 -137 144 386 602 683 657 499
7127D99k06k89l03k10j28o4R0J90K76K62K68J77J27n1j29k52k73k48k56j62j7
$$ 499 293 4 -299 -509 -637 -701 -611 -421 -145 117 385 562 689 638 509 257 -16 -264 -520 -682 -699
7148f99J04J85K92K45K96J62Q2j7j39k47k60k65k77r5l5N2K24K93K35K93J80R3
$$ -699 -595 -410 -118 127 423 585 667 650 511 264 4 -261 -538 -633 -668 -616 -392 -99 136 429 609 702
7170G02n8j62k23k81k84k00j55m3J07J97L05K52K63J81P8j4j87k20k91k74k20
$$ 702 644 482 259 -22 -306 -506 -661 -704 -597 -400 -95 157 420 601 679 665 478 258 -33 -307 -527
7191e27j19k1R7K16K44L01K67J53P3l7j58k01l15k78k09j37k8Q6K27K43L17K33
$$ -527 -646 -667 -570 -354 -110 191 458 611 684 647 489 288 -27 -305 -514 -651 -679 -593 -366 -123 194 427
7213D27J98L4l8j46k35k85k71k13j46oJ07K21K62K91K49J67O5m4j77k12l21k50
$$ 427 625 659 621 475 240 -45 -316 -529 -675 -681 -574 -353 -91 200 449 616 681 637 460 248 -73 -323
7235c23k31j10J8J05J96K68K78K59J51Q7o1j82k20k93k68k28j14pJ28K18K70K44
$$ -323 -554 -664 -646 -541 -345 -77 201 460 611 698 637 455 235 -58 -326 -554 -668 -675 -547 -329 -59 185
7257A85K56J50O5l9j79k36l04k27k50j12L5R6K41K52K81K98J25N1q7j70k32k95
$$ 185 441 591 656 617 438 202 -102 -329 -579 -691 -656 -560 -319 -67 214 512 637 688 601 431 199 -96
7279i6k52k21j20K7J35K10K87K55K37J88M8q1j85k35k87k80k09q6K4R1K31L00
$$ -96 -348 -569 -689 -662 -527 -317 -30 225 462 650 698 617 432 197 -90 -370 -579 -665 -641 -550 -319 -19
7301a9K73K13J53M2o9j84k33k90k25k28r3lJ48K09K84K70K21J44O3q9j46k70l08
$$ -19 254 467 620 662 593 409 176 -114 -339 -567 -660 -663 -515 -306 -22 248 469 613 676 587 441 171 -137
7324a37k30k09o9%J49K01K72K94K34J16O3p9k02k51k91k66j81j19Q1J45K00K52
$$ -137 -367 -576 -645 -645 -496 -295 -23 271 505 621 684 605 403 152 -139 -405 -586 -705 -624 -479 -279 -27
7346b7K71K42J39L3r5j94k36k77k77j79m3J0J57K03K66K95K11J55Qq8j83k85k60
$$ -27 244 486 625 658 563 369 133 -144 -421 -600 -643 -633 -476 -273 -7 288 499 654 662 574 391 106 -154
7369a54k55j74q3N7J38K22K92K47K28J13K0j06j60k82k71k45j73j01M3J24K85
$$ -154 -409 -583 -666 -609 -471 -249 43 290 518 631 651 545 385 103 -168 -413 -586 -687 -644 -520 -235
7390b35K62K43K54J08Oq9k20k28k96k19j65j14Q9J18K27K72L14K07J23nq3k12
$$ -235 27 270 524 632 638 549 329 101 -195 -414 -579 -693 -604 -486 -259 13 327 534 657 652 569 357
7412C57k53k95k38j74n3M7J76K19K72K73J77J26Kp9k10k67k76k49j75m9P1J30
$$ 357 104 -191 -429 -603 -656 -609 -433 -214 58 331 508 634 636 557 347 80 -196 -445 -620 -669 -598 -468
7434d68K65K46K84K12J02J5j00k22k86k61k30j75l4O5J60K32K86K53K21Q9Oj38
$$ -468 -203 43 327 539 641 656 556 334 48 -213 -443 -618 -652 -587 -427 -195 91 344 565 654 660 522
7456E22k18k21l18k20j61o8P9K13K00K64K61K01J22k1r9k14l10k17l02j44j4O4
$$ 522 304 83 -235 -455 -616 -684 -605 -392 -192 72 333 534 656 635 536 322 12 -205 -507 -651 -665 -601
7478f01J76K19L03K58K17P0Lj52j98k57k63k52j63l2P7J68K41L17K42K08Q1k6
$$ -601 -425 -206 97 355 572 642 645 493 295 38 -225 -477 -640 -672 -595 -427 -186 131 373 581 662 636
7500F36j04k62k14k92k43j69oN6J85K55K68K71J78R0J0j55k26k66k76k32j37n3
$$ 636 532 270 56 -236 -479 -648 -654 -598 -413 -158 110 381 559 649 659 504 278 12 -264 -496 -633 -686
7522f86P9J93K46L01K50J88J05n1j37j87k88k59k28j56k2O9J74K56K89K42J95
$$ -686 -607 -414 -168 133 383 571 676 625 488 301 13 -246 -474 -630 -652 -583 -409 -153 136 378 573
7543E73R7k1j23k43k64k66k14j77k8Q0J94K27K82K60K01P4l0j39k36k41k85k28
$$ 573 670 649 526 283 19 -247 -461 -638 -666 -586 -392 -165 117 377 578 652 622 483 247 6 -279 -507
7565e07j22l4Q4J97K35K61K87J82Q5k3j45k47k62k70k39j34kR7J74K68K92K55
$$ -507 -629 -663 -579 -382 -147 114 401 583 668 645 500 253 -9 -279 -518 -652 -654 -557 -383 -115 177 432
7587D32J58M8Nj51k28k98k81j86j68k8J34J85K70K64K50J83Q0m2j36k25l07k70
$$ 432 590 638 643 492 264 -34 -315 -501 -669 -697 -563 -378 -108 156 406 589 669 627 491 266 -41 -311
7609c11k05j37j5J02J88K56K86K42J80M7J0j81k37k43k65k47j10j2J08K18K36
$$ -311 -516 -653 -668 -566 -378 -122 164 406 586 633 643 462 225 -18 -283 -530 -640 -652 -544 -326 -90
7630i0K79K34J78O6n0j54k48k70k63k13j12j0J03J80K95K57K60J58P6q0j37k24
$$ -90 189 423 601 667 617 463 215 -55 -318 -531 -643 -653 -550 -370 -75 182 442 600 676 596 459 235
7652B35k68k96k09j03nJ15K05K47K82K39J60P1p3j39k47k92k62j63q3n1J09K15
$$ 235 -33 -329 -538 -641 -646 -531 -326 -79 203 442 602 673 600 461 214 -78 -340 -503 -586 -637 -528 -313
7674c13K53K79K13J70N3n1j60k60k48k63k13r0mJ01K14K57K56K58J40O3p4j64
$$ -313 -60 219 432 602 655 604 444 184 -64 -327 -540 -630 -634 -533 -319 -62 194 452 592 655 581 417
7696D17k43k61k50j98j17K1J30J83K50L08K27J45M1q0j58k06k80k58j90j04K7
$$ 417 174 -87 -337 -535 -652 -631 -501 -318 -68 240 467 612 653 573 415 209 -71 -329 -519 -623 -596
7717e96R7J88K74K49K44J46N0r4j76k27k66k61j85j12M2J26K19K20L16J98J43
$$ -596 -499 -311 -37 212 456 602 652 558 382 155 -111 -372 -557 -669 -627 -501 -282 -62 254 452 595
7738E95O2p9j92k49k30k54k15p5L4J17K19K62K38K43J31M7j10j69k35k51k64j97
$$ 595 657 578 386 137 -93 -347 -562 -637 -603 -486 -267 -5 233 476 607 654 544 375 140 -111 -375 -572
7760e72p3J7J54K04K47K90K10J58pr1k06k38k36k49j95q7P8J05K60K30K71K57
$$ -572 -645 -628 -474 -270 -23 267 477 635 628 537 331 93 -143 -392 -587 -674 -596 -491 -231 -1 270 527
7782E27J00L1j10k05k15k92k33j79o1M5J39K22K74K68K04J25j0p8j83k32k91k51
$$ 527 627 658 548 343 128 -164 -397 -576 -637 -592 -453 -231 43 311 515 640 630 552 369 137 -154 -405
7804d05j65r8Q0J33K29K48K74K21J01%j04k16k08k54k47j58j04N5J49K43K80K66
$$ -405 -570 -668 -588 -455 -226 22 296 517 618 618 514 298 90 -164 -411 -569 -673 -618 -469 -226 54 320
7826C20K18J16Jj28k07k27k76k41j26p5J3J70K50K54K66K14J18Mj38j92k71k65
$$ 320 538 654 655 527 320 93 -183 -424 -550 -625 -612 -442 -192 62 328 542 660 664 526 334 63 -202
7848b02k28j50m3M8J34K74K26K74J91J05rj03j85k85k65k44j54l3M4J89K42K78
$$ -202 -430 -580 -623 -575 -441 -167 59 333 524 629 620 517 332 47 -218 -462 -616 -649 -605 -416 -174 104
7870A04K67J71J04mj38k00k43k91k29j28n7P9J63K34K69K73J93N9jj36k04k66
$$ 104 371 542 646 642 504 304 61 -230 -459 -587 -644 -565 -402 -168 101 374 567 626 625 489 285 19
7892A9k70k26j30m2N9J83K33K76K40K12J02k4j54k03k47k90k06j68j5R3K02K23
$$ 19 -251 -477 -607 -649 -590 -407 -174 102 342 554 656 632 478 275 28 -262 -468 -636 -651 -558 -356 -133
7914a33K87K01J93Q5j2j14k30k65k47k54j33k5R9J66K71K67K28J86N2Kj54k07
$$ -133 154 355 548 633 621 507 277 12 -235 -489 -622 -647 -548 -382 -111 156 384 570 622 624 470 263
7936B63k49k97j85j62k1Q5J64K63K78K57J58P6j2j61k23k35k66k32j18k7R5J79
$$ 263 14 -283 -468 -630 -651 -566 -402 -139 139 396 554 630 618 457 234 -1 -267 -499 -617 -644 -549 -370
7958c70K37K72K52J66R7k4j54k35k43k70k12j18l1J03J61K44K82K34J81N3l4j36
$$ -370 -133 139 391 557 654 630 476 241 -2 -272 -484 -602 -633 -530 -369 -125 157 391 572 625 591 455
7980D55k06k83k76k32j03j5J42J56K53K87K07J62Q8k6j64k28k70k77j81j27J2
$$ 455 249 -34 -310 -542 -645 -660 -518 -362 -109 178 385 547 635 609 445 217 -53 -330 -511 -638 -626
8001f26J00K08K27K79K35J81P4p6j60k42k52k60k04r7l0J24K01K57K77K08J90
$$ -626 -526 -318 -91 188 423 604 678 602 442 200 -52 -312 -516 -613 -643 -519 -318 -61 216 424 614
8022F14K9q1j57k32k54k71j81j05oJ14K22K54K47K40J61M4p6j50k24k69k51j80
$$ 614 643 562 405 173 -81 -352 -533 -638 -644 -530 -308 -54 193 433 594 638 562 412 188 -81 -332 -512
8044e12j00K3J06K04K61K56K16J62K7n5j73k44k49k72j99p2LJ33K20K39K66K20
$$ -512 -612 -589 -483 -279 -18 238 454 616 643 588 415 171 -78 -350 -549 -621 -618 -485 -265 -26 240 460
8066D60J19N9q1j78k52k54k30k05r4N0J28J99K61K66K32J41J8p2k09k20k61k49
$$ 460 579 638 557 379 127 -127 -357 -562 -656 -606 -478 -279 -18 248 480 621 639 567 358 138 -123 -372
8088c72j72p3K6J16K32K76K21K48J30lp3j47k91k84k23j90o1N7J06K26K65K59
$$ -372 -544 -617 -591 -475 -243 33 254 502 632 629 556 409 118 -166 -389 -579 -640 -583 -477 -251 14 273
8110B73K08J40jq7j80k48l03k20j79k7JJ85K12K52L06J95J02Pq9k01k22l00k26
$$ 273 481 621 620 533 353 105 -198 -418 -597 -624 -623 -438 -226 26 332 527 629 636 547 346 124 -176 -402
8133d02j99m1O6J34K41K73K56J90J04L4j37j89k75k47k46j51m4M7J52K40K57K46
$$ -402 -601 -642 -576 -442 -201 72 328 518 622 656 519 330 55 -192 -438 -589 -633 -586 -434 -194 63 309
8155C09K22J01j5j14k03k78k51k32j28m9M8J71K38K73K57J78J18j8j08k20k29
$$ 309 531 632 617 503 300 22 -229 -461 -589 -638 -590 -419 -181 92 349 527 645 627 519 299 70
8176G0l03k32j40o4J09J74K41K49K56K02O7j3j16k07k71
$$ 70 -233 -465 -605 -669 -560 -386 -145 104 360 562 629 616 500 293 22
8191B2
$$ Imaginary data points
##PAGE= N=2
##DATA TABLE= (X++(I..I)), XYDATA
0@%%%%%%%%%%%Qj6J6j6J9k7L2m0M8n6O6p6R1j07J27j50J75k00K29k62L00l41L85
$$ 0 0 0 0 0 0 0 0 0 0 0 0 8 -8 8 -8 11 -16 16 -24 24 -32 34 -42 49 -58 69 -81 94 -106 123 -139 161 -180 205
34B05m38M93n54O20o92P73q62R60j064J181j308J445j597J761j942K140k357K597
$$ 205 -233 260 -294 326 -366 407 -455 505 -559 622 -686 759 -838 923 -1019 1121 -1236 1361
52A361k861L155l485L856m276M758n316N971o751P703q894J0430j2506J5478k0127
$$ 1361 -1500 1655 -1830 2026 -2250 2508 -2808 3163 -3588 4115 -4779 5651 -6855 8623 -11504
67a1504K8505m8449J88413K33929r2296n6442j39709j30800j53281r2899n9843
$$ -11504 17001 -31448 156965 390894 298598 242156 102447 -28353 -181634 -274533 -334376
78c34376Q614M1706R9163J27300J53853J23935Q5078K7356j6800p9040j22362
$$ -334376 -325762 -284056 -184893 -57593 96260 220195 305273 332629 315829 236789 114427
89A14427j46748j28438r6959m8528m191M8818R3776J26431J24612J05741P5512
$$ 114427 -32321 -160759 -257718 -306246 -310437 -261619 -167843 -41412 83200 188941 264453
100B64453L9361j5136p0769j12548j27127j21748r7041n7931l959N3301R8860
$$ 264453 303814 288678 217909 105361 -21766 -143514 -240555 -298486 -302445 -249144 -150284
111a50284J18490J17067J01605P2747K7272k5133p0340r8772j11448j10496r3207
$$ -150284 -31794 85273 186878 259625 286897 261764 191424 92652 -18796 -129292 -222499
122b22499n4715j803M8971Q5835J08628J16382J03080O7524J9250k8972o7448
$$ -222499 -277214 -279017 -230046 -144211 -35583 80799 183879 251403 270653 241681 174233
133A74233r2622j05085j02612q0416m1417J422L9703P3803R9909J08333R4594
$$ 174233 81611 -23474 -126086 -206502 -247919 -246497 -206794 -132991 -33082 75251 169845
144A69845O3049K1096k3304o2624r2091j06515r9670p2294l5127L503M1972P5720
$$ 169845 232894 253990 230686 168062 75971 -30544 -130214 -202508 -237635 -234132 -192160 -116440
156a16440R5836R7943Q3874N6179J9613j9854n7746q8438j02044r3762o9492l6471
$$ -116440 -20604 77339 161213 217392 237005 217151 159405 70967 -31077 -124839 -194331 -230802
168b30802L379M5091P7720R3227R1808P6251M9319J4740k2788n7395q1366q9777
$$ -230802 -227423 -182332 -104612 -11385 80423 156674 205993 220733 197945 140550 59184 -30593
180c0593q3872o5688l5340L776M2215P1478Q7487Q8679P4579M7237J1357k6244
$$ -30593 -114465 -180153 -215493 -211717 -169502 -98024 -10537 78142 152721 199958 211315 185071
192A85071n7805p7962q4859p8691n9511k9358O333M0252O6782Q2409Q4385P1469
$$ 185071 127266 49304 -35555 -114246 -173757 -203115 -196782 -156530 -89748 -7339 77046 148515
204A48515M5042J0133k6159n6917p6886q3453p6173n5523k4633R940M0911O4271
$$ 148515 193557 203690 177531 120614 43728 -39725 -115898 -171421 -196054 -186114 -145203 -80932
216h0932P7993P9100O5642M0315Q756k3923n2558p2588p9965p3118n2580k2843
$$ -80932 -2939 76161 141803 182118 190874 166951 114393 41805 -38160 -111278 -163858 -186701
228a86701R517L9329O3010P5982P4724O0242L6530P181k3537n0396o8778p5437
$$ -186701 -177184 -137855 -74845 1137 75861 136103 172633 179814 156277 105881 37103 -38334
240c8334o8637m9205k1846Q665L8077O1569P3600P1826N7808L4427N394k4394
$$ -38334 -106971 -156176 -178022 -169357 -131280 -69711 3889 75715 133523 167950 173344 148950
252A48950m9998o7207p2299o4446m5731k0319Q867L7625N9747P0340O8380N5424
$$ 148950 98952 31745 -40554 -105000 -150731 -171050 -162183 -124558 -64811 5529 73909 129333
264A29333L3298M852k4662m9449o4817o8559o1252m4101j9133R824L6974N6722
$$ 129333 162631 167483 142821 93372 28555 -40004 -101256 -145357 -164490 -154666 -117692 -60970
276f0970O6235O5238N3343L1419L627k4362m7302o1700o5536n8474m1196j6565
$$ -60970 5265 70503 123846 155265 158892 134530 87228 25528 -40008 -98482 -139678 -156243
288a56243J0945L5828N4006O3227O2275N0321K8738K313k4061m5933o0113o3869
$$ -156243 -145298 -109470 -55464 7763 70038 120359 149097 151410 127349 81416 21303 -42566
300d2566n6417l8546j3791J2581L5881N3066O1820N9975M6889K5688J000k3390
$$ -42566 -98983 -137529 -151320 -138739 -102858 -49792 12028 72003 118892 144580 145580 122190
312A22190m4420n8624o2373n4454l6721j3078J2080L5479N3349O1357N7760M4029
$$ 122190 77770 19146 -43227 -97681 -134402 -147480 -135400 -99921 -46572 14785 72545 116574
324A16574K3705J33k3767m4079n6379n8422n0755l4736j3024J1363L4439N1403
$$ 116574 140279 140412 116645 72566 16187 -42235 -92990 -127726 -140750 -129387 -94948 -43545
336d3545N8593N5367M2720K2894j210k5229m4386n4949n5640m7235l1302r965
$$ -43545 15048 70415 113135 136029 134819 109590 65204 10255 -45385 -92620 -123922 -133887
348a33887J3333L4436M9243N5059N1921M0238K1353k229k5598m3891n3723n4255
$$ -133887 -120554 -86118 -36875 18184 70105 110343 131696 129467 103869 59978 6255 -48000
360d8000m5973k9432p186J6046L5425M8012N3001M9446L7287J8186m009k4937
$$ -48000 -93973 -123405 -130591 -114545 -79120 -31108 21893 71339 108626 126812 122803 97866
372I7866m1559n1497n3025m4957k8009o092J6102L5133M8384N3198M8348L4681
$$ 97866 56307 4810 -48215 -93172 -121181 -127273 -111171 -76038 -27654 25544 73892 108573
384A08573J5288o033k5731m1248n0100n0456m1619k5602n621J5396L4068M7353
$$ 108573 123861 117828 92097 50849 749 -49707 -91326 -116928 -122549 -107153 -73085 -25732
396b5732N2037M7246L3910J4787o551k6516m2044n0082m8916l9123k3210l991
$$ -25732 26305 73551 107461 122248 115697 89181 47137 -2945 -51861 -90984 -114194 -118185
408a18185J6050L3805M5812M9375M4320L2056J4667n801k5972m1379m8600m7198
$$ -118185 -102135 -68330 -22518 26857 71177 103233 117900 112099 86127 44748 -3852 -51050
420e1050l8029k2516k937J7383L4199M4449M6797M1596K9797J2601p172k5356
$$ -51050 -89079 -111595 -114532 -97149 -62950 -18501 28296 69892 99689 112290 105118 79762
432G9762l8839m5696m5068l6490k1335k331J7238L3509M3353M5676M0515K8112
$$ 79762 40923 -4773 -49841 -86331 -107666 -109997 -92759 -59250 -15897 29779 70294 98406
444I8406J0444q680k5618l8085m4190m2718l4087j9536j201J7243L1930M1273
$$ 98406 108850 100170 74552 36467 -7723 -50441 -84528 -104064 -105265 -88022 -56092 -14819
456a4819M4320L9662K6999R571q550k5049l7619m3572m1723l2452j7584o6J6963
$$ -14819 29501 69163 96162 105733 97183 72134 34515 -9057 -50780 -83232 -100816 -100882 -83919
469h3919L1080M0436M2671L6986K4898R236q170k4606l6791m2095m0047l1055
$$ -83919 -52839 -12403 30268 67254 92152 101388 93218 68612 31821 -10274 -50321 -81376
481h1376j6688M06J7355L1606M0034M0974L4881K3173P617r407k4752l5612m0163
$$ -81376 -98064 -97658 -80303 -48697 -8663 32311 67192 90365 97982 88575 63823 28211 -11952
494a1952l8054k9437j5626O48J6968L0739L9054L9969L3925K2502P292r812k5136
$$ -11952 -50006 -79443 -95069 -94421 -77453 -46714 -7660 32309 66234 88736 96028 86216 61080
507F1080l5351l8999l6594k8113j4404J826J7377K9763L6859L7786L2532K1739
$$ 61080 25729 -13270 -49864 -77977 -92381 -90555 -73178 -43415 -6556 31230 63762 85501
519H5501O660r852k3961l3726l8130l5945k6935j3085K697J7684K9461L5775L6122
$$ 85501 92161 82309 58348 24622 -13508 -49453 -76388 -89473 -86776 -69092 -39631 -3856 32266
532C2266L0607J9418M844j0020k2842l2343l6389l3771k5162j2592K437J7356
$$ 32266 62873 82291 87135 77115 54273 21930 -14459 -48230 -73392 -85984 -83547 -66191
544f6191K8841L5150L5644K9831J8101L532j0817k3290l2212l5227l1807k3203
$$ -66191 -37350 -2200 33444 63275 81376 84908 74091 50801 18589 -16638 -48445 -71648
556g1648j1198K800J6746K7943L4213L4353K8548J7667L719j0853k3715l2201
$$ -71648 -82846 -80046 -63300 -35357 -1144 33209 61757 79424 83143 72290 48575 16374
568A6374l4557l0886k2145r782M319J7558K7471L2511L2199K6622J6420L376j0428
$$ 16374 -18183 -49069 -71214 -80996 -76677 -59119 -31648 863 33062 59684 76104 79480 69052
581F9052k2537l0740l3441l0445k2017r350M913J7814K7356L2222L1288K4852
$$ 69052 46515 15775 -17666 -48111 -70128 -79478 -74565 -56751 -29395 2827 34115 58967
593E8967J4691K462j0675k2160k9227l1206k8841k1361r316M399J6792K6397L1671
$$ 58967 73658 76120 65445 43285 14058 -17148 -45989 -67350 -76666 -72267 -55475 -29078 2593
606B593L1079K4887J4414J553j1658k2268k8659l0514k7370j9178p809M337J5867
$$ 2593 33672 58559 72973 74526 62868 40600 11941 -18573 -45943 -65121 -72930 -68593 -52726
619e2726K5328L0309K9803K4145J4186J491j1379k1988k8838l0434k6459j7926
$$ -52726 -27398 2911 32714 56859 71045 72536 61157 39169 10331 -20103 -46562 -64488
631f4488o801N237J6668K5063K8857K7984K2725J3277J354j0567k0763k7762k9842
$$ -64488 -71289 -66052 -49384 -24321 4536 32520 55245 68522 69876 59309 38546 10784 -19058
644a9058k6309j8077o989N413J7038K5281K8629K7216K1486J1984N36j0853k0283
$$ -19058 -45367 -63444 -70433 -65020 -47982 -22701 5928 33144 54630 66614 67150 56297 36014
657C6014k6561k8174k4924j7472o914N219J6465K4511K8053K6936K1050J1192
$$ 36014 9453 -18721 -43645 -61117 -68031 -62812 -46347 -21836 6217 33153 54203 65395
669F5395l88j1539k0680k6109k6927k3226j5875n729N571J5788K3237K6973K6104
$$ 65395 65007 53468 32788 6679 -20248 -43474 -59349 -65078 -59507 -43719 -20482 6491 32595
682C2595K0290J0773l81j1712k1024k6225k6441k2584j4784m291O728J6175K2830
$$ 32595 52885 63658 63277 51565 30541 4316 -22125 -44709 -59493 -63784 -57056 -40881 -18051
695a8051K5991K4641J8831R933o08j1246k0123k5199k5981k2319j4353l847O972
$$ -18051 7940 32581 51412 61345 60737 49491 29368 4169 -21812 -44131 -58484 -62331 -55359
708e5359J6406K3141K5706K3511J7458Q834j360j1428j9467k4010k4696k1222
$$ -55359 -38953 -15812 9894 33405 50863 59697 58337 46909 27442 3432 -21264 -42486
720d2486j3748l777O743J6238K2893K5232K3073J7071Q182k263j2201j9577k3634
$$ -42486 -56234 -60011 -53268 -37030 -14137 11095 34168 51239 59421 57158 44957 25380 1746
733A746k3875j9973j2463l053O809J5768K2048K4257K2373J6686P911k474j2125
$$ 1746 -22129 -42102 -54565 -57618 -50809 -35041 -12993 11264 33637 50323 58234 55760 43635
746D3635j9589k3608k3496j9117j1656k421P249J5765K1331K3122K1380J5849
$$ 43635 24046 438 -23058 -42175 -53831 -56252 -49003 -33238 -11907 11215 32595 48444
758D8444P322k573j1666j8954k2973k2889j8618j1219k005P710J5852K1036K2584
$$ 48444 55766 53193 41527 22573 -400 -23289 -41907 -53126 -55131 -47421 -31569 -10533 12051
771A2051K0520J4718O350k793j1442j8417k2134k1844j7922j0949j878P689J5703
$$ 12051 32571 47289 53639 50846 39404 20987 -1147 -22991 -40913 -51862 -53740 -46051 -30348
784c0348K0726K2269K0052J4112N832l243j1790j8169k1378k0948j7046j0174
$$ -30348 -9622 12647 32699 46811 52643 49400 37610 19441 -1937 -22885 -39931 -50105
796e0105j328P576J5065K0153K1715J9316J3508N536l357j1829j8060k0887k0214
$$ -50105 -51433 -43857 -28792 -8639 13076 32392 45900 51436 48079 36250 18190 -2697 -22911
809b2911j6232r506r99P468J4650J9396K0757J8542J3163N541l223j1506j7488
$$ -22911 -39143 -48649 -49648 -42180 -27530 -8134 12623 31165 44328 49869 46646 35140 17652
822A7652k0423j9963j5962r033p00P558J4453J9006K0067J7809J2426N105l276
$$ 17652 -2771 -22734 -38696 -47729 -48429 -40871 -26418 -7412 12655 30464 42890 47995 44719
835D4719j1052j6837j9797j9310j5372q691o84P528J4444J8692J9477J7101J1850
$$ 44719 33667 16830 -2967 -22277 -37649 -46340 -47024 -39496 -25052 -6360 13117 30218 42068
848D2068M477l711j0943j6274j8915j8401j4559q208n18P336J4064J8111J9006
$$ 42068 46545 42834 31891 15617 -3298 -21699 -36258 -44466 -44984 -37648 -23584 -5473 13533
861A3533J6676J1331L921l959j1044j6342j8603j7536j3607p493RP578J3705J7399
$$ 13533 30209 41540 45461 41502 30458 14116 -4487 -22023 -35630 -43123 -43114 -35536 -21831 -4432
875d432J8166J5878J0716L681m045j0987j6016j8089j7165j3162o834N72P743
$$ -4432 13734 29612 40328 44009 39964 28977 12961 -5128 -22293 -35455 -42289 -41717 -33974
888c3974J3521J7013J7500J5017R882L237m071j0650j5495j7541j6533j2670o641
$$ -33974 -20453 -3440 14060 29077 38959 42196 38125 27475 11980 -5561 -22094 -34764 -41405
901d1405N89P859J3500J6682J7053J4563R379K669m431j0698j5135j6844j5764
$$ -41405 -40816 -32957 -19457 -2775 14278 28841 38220 40889 36458 25760 10625 -6219 -21983
914b1983j2053o105J013P726J3105J6291J6742J3998Q855K316m615j0807j5068
$$ -21983 -34036 -40141 -39128 -31402 -18297 -2006 14736 28734 37589 39905 35290 24483 9415
927I415j6433j5223j1266n370J381P750J2950J5860J5865J3233Q452K041m776
$$ 9415 -7018 -22241 -33507 -38877 -37496 -29746 -16796 -936 14929 28162 36614 38655 33879
940C3879j0624j4596j6114j4870j0748m909J564P924J2952J5455J5331J2693P781
$$ 33879 23255 8659 -7455 -22325 -33073 -37982 -36418 -28494 -15542 -87 15244 27937 35718
953C5718J557m802j0363j4305j5514j4059j0354m871J656P887J2526J5014J5014
$$ 35718 37275 32473 22110 7805 -7709 -21768 -32122 -36993 -35337 -27450 -14924 90 15104
966A5104J2301P414J398m957j0418j3852j4845j3608r914m268J903P549J2102
$$ 15104 27405 34819 36217 31260 20842 6990 -7855 -21463 -31377 -35645 -33742 -26193 -14091
979a4091J4597J4438J1726P203J341m979j0158j3520j4639j3224r376m021J950
$$ -14091 506 14944 26670 33873 35214 30235 20077 6557 -8082 -21306 -30682 -34703 -32753
992c2753P709J2064J4060J3798J1352O746Q95m892r725j3222j4258j2745r078
$$ -32753 -25044 -12980 1080 14878 26230 32976 33871 28979 19254 6032 -8226 -20971 -30049
1005c0049l847K170P745J1720J3871J3599J0771O038O14m909r806j2927j3567
$$ -30049 -33896 -31726 -23981 -12261 1610 15209 25980 32018 32632 27723 17917 4990 -8577
1018h577j2025q481l437K188P350J1455J3460J2963J0345O079N94n206r757j2503
$$ -8577 -20602 -29083 -32520 -30332 -22982 -11527 1933 14896 25241 31320 31914 26708 16951 4448
1032D448j3329j1678p910l090K243P448J1170J2838J2397J0137N800L25m885r326
$$ 4448 -8881 -20559 -28469 -31559 -29316 -21868 -10698 2140 14537 24674 30474 30799 25914 16588
1046A6588j2364j2999j1298p847l047K547P659J0948J2513J2182R469N057J17
$$ 16588 4224 -8775 -20073 -27920 -30967 -28420 -20761 -9813 2700 14882 24351 29408 29525
1059B9525m935r283j1792j2227j0914p687k646K671P236J0653J2492J1902Q988
$$ 29525 24590 15307 3515 -8712 -19626 -27313 -29959 -27288 -20052 -9399 3093 14995 23983
1072B3983M861j08n174r264j1436j1896j0555o988k233K504O999J0442J1974J1379
$$ 23983 28844 28736 23562 14298 2862 -9034 -19589 -26577 -28810 -26306 -19307 -8865 3109 14488
1086A4488Q909M877j81n068r033j1543j1955j0080o560k058K794P144J0254J1512
$$ 14488 23397 28274 28093 23025 13992 2449 -9506 -19586 -26146 -28204 -25410 -18266 -8012 3500
1100C500J0915Q367M409j59m842q847j1189j1393r755o496k049K801P179J0212
$$ 3500 14415 22782 27191 27032 22190 13343 2154 -9239 -18994 -25490 -27539 -24738 -17559 -7347
1114g347J1332J0440P942M160m81n050q575j0446j0808r455o258k044K477O857
$$ -7347 3985 14425 22367 26527 26046 20996 12421 1975 -8833 -18288 -24546 -26590 -24113 -17256
1128a7256R883J0951J0340Q042M144p12m953q321j0436j0664q944n832j836K661
$$ -17256 -7373 3578 13918 21960 26104 25392 20439 12118 1682 -8982 -17926 -23758 -25594 -22933
1142b2933O684R252J0300J0069P726L948m63m583q145j0267j0413q867n723j469
$$ -22933 -16249 -6997 3303 13372 21098 25046 24583 20000 11855 1588 -8825 -17692 -23415 -24884
1156b4884K911O454R008J0182R618O988L500l40m313p821r758r960q569n535j611
$$ -24884 -21973 -15519 -6511 3671 13289 20277 23777 23437 19124 11303 1545 -8415 -16984 -22519 -24130
1171b4130K529O283R107J0159R263O787L419o23m645p781r357r390q009n238j564
$$ -24130 -21601 -15318 -6211 3948 13211 19998 23417 22794 18149 10368 1011 -8379 -16388 -21626 -23190
1186b3190K421O093Q697R703Q985O779L396o24m663p734r225r125p746m879j212
$$ -23190 -20769 -14676 -5979 3724 12709 19488 22884 22260 17597 9863 638 -8487 -16233 -21112 -22324
1201b2324K686O078Q288R056Q383O471L337o25m455p296q781r093p766m740r67
$$ -22324 -19638 -13560 -5272 3784 12167 18638 21975 21350 16895 9599 818 -8275 -16041 -20781 -21748
1216b1748K824O014Q129Q819Q113O043K820r25m162o732q501q710p270m528j148
$$ -21748 -18924 -12910 -4781 4038 12151 18194 21014 20089 15927 9195 694 -8016 -15286 -19814 -20962
1231b0962K471N722P989Q778Q096N897K531j030m191o812q318q241o688m127j020
$$ -20962 -18491 -12769 -4780 3998 12094 17991 20522 19492 15301 8489 171 -8070 -14758 -18885 -19905
1246a9905K320N385P502Q399P764N676K669o60m016o872q300p977o453m051q96
$$ -19905 -17585 -12200 -4698 3701 11465 17141 19810 19150 15134 8262 -38 -8015 -14468 -18519 -19415
1261a9415K560N495P319P885P129N335K658n89l910o480p709p681o637m223q57
$$ -19415 -16855 -11360 -4041 3844 10973 16308 18966 18377 14467 7987 278 -7403 -14040 -18263 -19120
1276a9120K697N462P217P773P065N063K266r41l980o196p277p308o280l905p29
$$ -19120 -16423 -10961 -3744 4029 11094 16157 18423 17482 13502 7306 29 -7279 -13559 -17464 -18193
1291a8193K406N091O943P667O960N042K160j117m042o133p166p178n859l312m19
$$ -18193 -15787 -10696 -3753 3914 10874 15916 18076 16959 12917 6784 -382 -7560 -13419 -16731 -17150
1306a7150K357M751O595P286O631M756K096q99l692n956p252p144n584l093m57
$$ -17150 -14793 -10042 -3447 3839 10470 15226 17322 16423 12731 6775 -477 -7621 -13205 -16298 -16755
1321a6755K367M966O626O886O047M346J980p91l484n640o820o702n444l378p02
$$ -16755 -14388 -9422 -2796 4090 10137 14483 16463 15672 12188 6548 -272 -6974 -12418 -15796 -16498
1336a6498K297M978O473O825N975M229J775j015l662n594o440o134n100l259o53
$$ -16498 -14201 -9223 -2750 4075 10050 14279 16054 15039 11377 5783 -657 -6791 -11891 -15150 -15803
1351a5803K230M590O008O492O001M438J846j076l704n474o295o190n061k878j71
$$ -15803 -13573 -8983 -2975 3517 9518 13956 15802 14726 11022 5548 -747 -6937 -11998 -14876 -15047
1366a5047K375M308N631O184N734M061J692q45l266n195o270o178n018k771j26
$$ -15047 -12672 -8364 -2733 3451 9185 13246 14938 14093 10827 5632 -638 -6816 -11834 -14605 -14731
1381a4731K410M384N744O199N330L562J383r00l161m928n819n845m720k684l49
$$ -14731 -12321 -7937 -2193 4006 9336 12898 14281 13381 10220 5292 -527 -6372 -11092 -13776 -14125
1396a4125K013M254N813O142N183L463J402j030l366n068n668n398m230k444m48
$$ -14125 -12112 -7858 -2045 4097 9280 12743 14145 13115 9749 4681 -987 -6385 -10615 -13059 -13507
1411a3507J961M089N410N642M987L742J580r88l381m989n626n346m204k409q2
$$ -13507 -11546 -7457 -2047 3595 8582 12324 13904 12916 9535 4546 -1080 -6426 -10630 -13039 -13121
1426a3121K221M069N023N233M781L480J483q93l026m551n424n328m404k506q1
$$ -13121 -10900 -6831 -1808 3425 8206 11686 13169 12276 9250 4699 -725 -6053 -10457 -12963 -13044
1441a3044K312M070N031N332M704L206J060j092k935m229n043n106m134k315k03
$$ -13044 -10732 -6662 -1631 3701 8405 11611 12671 11579 8644 4415 -628 -5734 -9868 -12183 -12386
1456a2386J904L699N011N441M742L103J010j064k953m457n156m826l608k046k08
$$ -12386 -10482 -6783 -1772 3669 8411 11514 12524 11460 8507 4050 -1106 -5932 -9540 -11586 -11794
1471a1794J780L541M711N053M445L086J303p66k883m498n127m747l689k101n6
$$ -11794 -10014 -6473 -1762 3291 7736 10822 12125 11359 8476 3978 -1149 -5896 -9585 -11686 -11742
1486a1742J962L652M592M743M037K934J339p06k766m141m727m653l773k253j76
$$ -11742 -9780 -6128 -1536 3207 7244 10178 11517 10811 8045 3904 -823 -5476 -9249 -11502 -11678
1501a1678J948L698M534M647M091K947J055j043k706l822m434m387l622k123j22
$$ -11678 -9730 -6032 -1498 3149 7240 10187 11242 10199 7493 3671 -763 -5150 -8772 -10895 -11017
1516a1017J807L319M296M745M211K866R57j014k650l901m507m331l371j773K1
$$ -11017 -9210 -5891 -1595 3150 7361 10227 11184 10170 7520 3619 -888 -5219 -8590 -10363 -10342
1531a0342J721L092M138M527L942K696J047p39k487l869m512m399l303j683o1
$$ -10342 -8621 -5529 -1391 3136 7078 9774 10821 10082 7595 3726 -786 -5185 -8488 -10171 -10232
1546a0232J682L246M135M347L563K488R91o70k392l635m325m040l193j912k07
$$ -10232 -8550 -5304 -1169 3178 6741 9229 10220 9550 7158 3523 -802 -4842 -8035 -9947 -10154
1561a0154J717L259M097M106L544K484R13q95k577l631l977l716l049j781J4J742
$$ -10154 -8437 -5178 -1081 3025 6569 9053 9966 9071 6494 2863 -1114 -4830 -7879 -9660 -9646 -7904
1577g904L013L764M037L528K507Q86r74k560l541l956l763l025j523K14J767K994
$$ -7904 -4891 -1127 2910 6438 8945 9831 8857 6297 2756 -1200 -4963 -7988 -9511 -9297 -7530 -4536
1593d536L641L876L398K328O89r36k310l285l932l790k917j438J62J669K931L709
$$ -4536 -895 2981 6379 8707 9396 8460 6150 2865 -1067 -4857 -7774 -9212 -9050 -7381 -4450 -741
1609g41L958L284K043M92r25k254l302l855l478k625j396R4J566K888L666L808
$$ -741 3217 6501 8544 9036 8111 5857 2555 -1300 -4778 -7403 -8799 -8705 -7139 -4251 -585 3223
1625C223L088J974O61r33k415l384l724l336k447j289J96J591K845L468L490K906
$$ 3223 6311 8285 8946 8013 5598 2214 -1510 -4846 -7293 -8582 -8386 -6795 -3950 -482 3008 5914
1641E914K060P71q35k353l292l619l334k562j333K77J789K918L360L313K828J925
$$ 5914 7974 8745 7910 5557 2265 -1354 -4688 -7250 -8583 -8306 -6517 -3599 -239 3074 5902 7827
1657G827N00j002k249k976l304l301k560j257K51J644K722L393L510K906J752
$$ 7827 8327 7325 5076 2100 -1204 -4505 -7065 -8322 -8071 -6427 -3705 -312 3198 6104 7856
1672G856L06j094k259k967l276l129k268j100K37J422K549L239L422K909J825
$$ 7856 8162 7068 4809 1842 -1434 -4563 -6831 -7931 -7694 -6272 -3723 -484 2938 5847 7672
1687G672M27r65k180l094l473l075k137r16L30J544K549L125L153K553J607N56
$$ 7672 8099 7134 4954 1860 -1613 -4688 -6825 -7741 -7411 -5867 -3318 -193 2960 5513 7120 7676
1703G676p36k053l025l361k994k152j093K95J738K752L146L021K407J530L53r81
$$ 7676 6940 4887 1862 -1499 -4493 -6645 -7738 -7443 -5705 -2953 193 3214 5621 7151 7504 6523
1719F523k094k824l002k777k249j208K54J593K604L179L161K607J560K76j132
$$ 6523 4429 1605 -1397 -4174 -6423 -7631 -7377 -5784 -3180 -1 3160 5767 7327 7603 6471
1734F471k234k830k960k695k061r78L41J469K298K917L100K586J682L07j016k101
$$ 6471 4237 1407 -1553 -4248 -6309 -7287 -6946 -5477 -3179 -262 2838 5424 7106 7413 6397 4296
1750D296k821l072k889j947p24N26J485K337K855K865K284J414L43q21j895k696
$$ 4296 1475 -1597 -4486 -6433 -7157 -6631 -5146 -2809 46 2911 5195 6609 6952 6131 4236 1540
1766A540l091k800k012q00L31J590K550L021K846K191J316J98r24j931k614k893
$$ 1540 -1551 -4351 -6363 -7163 -6832 -5242 -2692 329 3175 5366 6682 6880 5956 4025 1411 -1482
1782a482k606j906r78J70J430K473K969K907K341J436K79j061k098k672k788k477
$$ -1482 -4088 -5994 -6972 -6802 -5372 -2899 70 2977 5318 6754 7033 5972 3874 1202 -1586 -4063
1798d063j743r12K87J482K251K630K757K353J494K92r72j992k619k876k548j840
$$ -4063 -5806 -6718 -6431 -4949 -2698 -68 2689 5042 6536 6828 5856 3864 1245 -1631 -4179 -6019
1814f019p23N04J580K261K627K692K170J231J77q82j862k525k838k557j882p50
$$ -6019 -6742 -6238 -4658 -2397 230 2922 5092 6323 6500 5618 3756 1231 -1607 -4164 -6046 -6796
1830f796M95J547K329K819K769K097J140L9r54j897k488k715k442j714p16L39
$$ -6796 -6301 -4754 -2425 394 3163 5260 6400 6439 5485 3588 1100 -1615 -4057 -5771 -6487 -6148
1846f148J346K267K822K732K075J191K21r80j992k605k705k291j593o88L71J381
$$ -6148 -4802 -2535 287 3019 5094 6285 6506 5526 3534 929 -1776 -4067 -5660 -6348 -5977 -4596
1862d596K258K580K525K077J300K73r40j914k449k708k381j700p12M24J477K218
$$ -4596 -2338 242 2767 4844 6144 6417 5477 3563 1114 -1594 -3975 -5675 -6387 -5963 -4486 -2268
1878b268K577K464J979J193J34q95j784k290k513k350j653p90L92J376K174K500
$$ -2268 309 2773 4752 5945 6079 5184 3400 1110 -1403 -3753 -5406 -6196 -5804 -4428 -2254 246
1894B46K507K035J139kj021j749k262k518k171j446n79L82J313K018K462K445
$$ 246 2753 4788 5927 5925 4904 3155 893 -1625 -3796 -5242 -5821 -5439 -4126 -2108 354 2799
1910B799J927J078Q1r18j794k441k563k106j463m99N18J402K061K422K321J788
$$ 2799 4726 5804 5885 4967 3173 732 -1831 -3937 -5400 -5899 -5381 -3979 -1918 504 2825 4613
1926D613R98J35q28j744k331k478k138j511o06M72J428K108K459K248J687R24
$$ 4613 5611 5746 4918 3174 843 -1635 -3773 -5284 -5890 -5418 -3990 -1882 577 2825 4512 5436
1942E436N9r04j709k156k219k009j463o42L97J318K035K338K336J745R54n8j032
$$ 5436 5495 4591 2882 726 -1493 -3502 -4965 -5607 -5210 -3892 -1857 481 2817 4562 5516 5458 4426
1959D426j764k192k226j916j324m19M69J308J886K222K249J801R77K6r79j770
$$ 4426 2662 470 -1756 -3672 -4996 -5415 -4946 -3638 -1752 470 2719 4520 5497 5523 4544 2774
1975B774k234k368j997j304l36N66J347J933K218K094J601Q94L7q55j588k084
$$ 2774 540 -1828 -3825 -5129 -5465 -4899 -3552 -1619 599 2693 4294 5188 5225 4370 2782 698
1991F98k321k042j293m28M98J370K058K247K039J515P05j22q82j597k039k108
$$ 698 -1623 -3665 -4958 -5386 -4888 -3518 -1460 787 2826 4341 5046 4924 4042 2445 406 -1702
2007a702j744j240n38M36J314J949K215K131J575P74j22j022j722k069k062j711
$$ -1702 -3446 -4686 -5224 -4788 -3474 -1525 690 2821 4396 5170 5048 4026 2304 235 -1827 -3538
2023c538j163l66M99J199J834K091K083J571Q91pr67j676k116k158j815j132k56
$$ -3538 -4701 -5067 -4568 -3369 -1535 556 2639 4210 5101 5094 4127 2451 335 -1823 -3638 -4770 -5026
2040e026O05J319J801K008J893J448P99q1q94j490k023k116j786j160l11N98J366
$$ -5026 -4421 -3102 -1301 707 2600 4048 4847 4766 3872 2382 359 -1757 -3543 -4703 -5014 -4416 -3050
2057c050J878K091J911J322O33j82r11j528j936j974j678j100l70M88J292J859
$$ -3050 -1172 919 2830 4152 4785 4603 3692 2164 228 -1746 -3424 -4524 -4894 -4406 -3114 -1255
2073a255K138J944J371O44k15j028j591j939j893j615r83k22M44J212J796K032
$$ -1255 883 2827 4198 4842 4627 3599 2008 69 -1824 -3439 -4422 -4644 -4200 -2988 -1192 840
2089H40J834J402O88j57j025j609j983j939j560q93k27O25J293J702J880J790
$$ 840 2674 4076 4764 4607 3582 1973 -10 -1949 -3509 -4402 -4629 -4004 -2711 -1009 871 2661
2105B661J302O50j36r09j516j970j951j605r35j58O31J297J747J870J717J188
$$ 2661 3963 4613 4477 3568 2052 82 -1869 -3474 -4409 -4567 -3936 -2639 -892 978 2695 3883
2121C883N52j33q94j417j816j863j553r75k13N81J235J780J868J679J167M56l33
$$ 3883 4435 4302 3408 1991 175 -1688 -3241 -4216 -4429 -3848 -2613 -833 1035 2714 3881 4337 4004
2138D004r59j416j721j764j372p97k18N54J194J706J853J683J161M20l90r99j602
$$ 4004 3045 1629 -92 -1856 -3228 -4025 -4243 -3689 -2495 -789 1064 2747 3908 4328 3938 2939 1337
2155A337j796j708j279p31m7O38J248J636J761J646J145M63k51r92j595j860j808
$$ 1337 -459 -2167 -3446 -4177 -4224 -3586 -2338 -702 1059 2705 3850 4313 4062 3070 1475 -385 -2193
2172b193j394o94NP41J296J643J749J500J059M29k28q85j425j780j715j421p81
$$ -2193 -3587 -4281 -4276 -3535 -2239 -596 1153 2653 3712 4141 3913 3028 1603 -177 -1892 -3313 -4094
2189d094p6P03J360J687J724J459R74L14l56r29j369j631j592j297p21r4N94J216
$$ -4094 -4170 -3467 -2107 -420 1304 2763 3737 4051 3695 2766 1397 -234 -1826 -3123 -3844 -3938 -3344 -2128
2207b128J666J789J540R94K75m38j030j480j660j519j150n98m5O08J111J538J654
$$ -2128 -462 1327 2867 3861 4136 3698 2668 1188 -472 -1991 -3141 -3739 -3784 -3176 -2065 -527 1127
2224A127J480J006L85l42j005j459j695j577j189n17J09O91J158J498J507J273
$$ 1127 2607 3613 3998 3656 2651 1192 -503 -2080 -3269 -3786 -3677 -2986 -1828 -330 1177 2450
2240B450R46L32l04q68j398j594j547j234n79Q0P62J253J565J496J247Q24J99
$$ 2450 3396 3728 3424 2556 1158 -436 -1983 -3217 -3796 -3716 -2954 -1701 -136 1360 2607 3431 3630
2257C630l89q72j274j504j464j147o34qO38J195J567J566J359Q00J66m32r69j331
$$ 3630 3241 2369 1095 -409 -1873 -3020 -3654 -3662 -3024 -1829 -262 1304 2663 3463 3629 3197 2228 897
2275H97j463j317r91n60mO23J077J378J527J344Q56K44l97j005j351j525j339
$$ 897 -566 -1883 -2874 -3434 -3438 -2815 -1738 -360 1167 2511 3367 3611 3214 2209 858 -667 -2006
2292b006r61m49J77O68J068J315J393J155P73K97l34q95j290j497j380j036m61
$$ -2006 -2967 -3416 -3239 -2571 -1503 -188 1205 2360 3133 3430 3096 2201 911 -586 -1966 -3002 -3463
2309c463J85P55J169J352J351J044O59J58l59q53j165j354j284j010m95J22O64
$$ -3463 -3278 -2523 -1354 -2 1349 2393 3052 3210 2851 1998 833 -521 -1805 -2815 -3310 -3188 -2524
2326b524J159J389J368J073N99J20n13r23j176j260j145q73l65R2N90J075J330
$$ -2524 -1365 24 1392 2465 3064 3184 2671 1748 572 -688 -1833 -2706 -3071 -2979 -2389 -1314 16
2343A6J298J142O50J05m74r73j272j328j161p46l14J78O57J025J243J218J011
$$ 16 1314 2456 3106 3211 2737 1764 492 -836 -1997 -2743 -3057 -2879 -2222 -1197 46 1264 2275
2360B275O56J63m20q96j213j316j196p86l24K13P59J044J214J132R39N49P7l91
$$ 2275 2931 3094 2674 1778 565 -751 -1947 -2733 -3057 -2844 -2085 -1041 173 1305 2244 2793 2870 2479
2378B479q11j123j238j093p95l40J79P36J036J249J159Q94M34j5m52q81j095j114
$$ 2479 1668 545 -693 -1786 -2581 -2921 -2742 -2006 -970 279 1438 2332 2766 2751 2299 1418 323 -791
2396g91r98p38k97J90O58J021J196J205R36M60J3n41r57j118j124r94o82k21K63
$$ -791 -1789 -2527 -2824 -2634 -1976 -955 241 1446 2382 2842 2855 2314 1357 239 -885 -1879 -2561 -2782 -2519
2415b519O61R00J152J115Q75M99R5m71q52j135j170r90o41k42K73O65R40J063
$$ -2519 -1858 -958 194 1309 2184 2683 2778 2307 1455 320 -850 -1840 -2481 -2723 -2450 -1785 -845 218
2433B18J022Q27M47K5l78p99j037j075j018o54j99K55O71R62J113R56P37L60l6
$$ 218 1240 2067 2514 2539 2161 1362 325 -750 -1768 -2422 -2621 -2366 -1695 -733 380 1336 2073 2433 2397
2452B397m48p70r63j041q56n92k06K16O41R60J064R86O92L82r4n15p89r58j002
$$ 2397 1949 1179 216 -825 -1681 -2273 -2479 -2263 -1622 -662 402 1388 2080 2462 2368 1853 1064 106 -896
2471h96q03m78j62K20O08Q75R84R49P46L49q1m78p95j026r92p57m89j19L11O81
$$ -896 -1699 -2177 -2339 -2119 -1511 -636 348 1297 2043 2392 2311 1833 1038 12 -980 -1737 -2226 -2345 -2034 -1353
2491a353Q05R45R07O95K87m6m39p64r96r77q36m90p8L29O94Q76R29Q76O17K55
$$ -1353 -548 397 1304 1999 2286 2240 1801 1037 41 -936 -1772 -2262 -2340 -2011 -1317 -441 488 1364 1981 2236
2511B236q3m22p69r06r41p32n04j16K63O28Q58R46Q66N94K55j20m64p15q88q40
$$ 2236 2153 1731 962 56 -885 -1617 -2121 -2237 -1974 -1346 -488 458 1324 1918 2173 2053 1589 874 -14 -854
2531h54p13m23r0K38N67Q04R21Q13N63K90q7m63p64q88q47o81l56n1K91O01P87
$$ -854 -1567 -1990 -2080 -1842 -1275 -471 450 1263 1826 2116 2029 1566 802 -86 -933 -1614 -1970 -2021 -1730 -1129 -342
2552c42Q34O98N54K67r1m55o86q12q48o53m05o4L24N86Q25P98O69N48J70j44m44
$$ -342 492 1190 1744 2011 1920 1465 779 -33 -881 -1534 -1939 -2003 -1679 -1093 -268 530 1199 1747 1917 1773 1329
2573A329o48p83p73o11l63p1K98N84P31Q49P40M63J78j61m83o44q02p36n90l25
$$ 1329 681 -102 -875 -1486 -1849 -1920 -1622 -1038 -307 542 1282 1745 1923 1762 1279 635 -167 -903 -1493 -1818
2593a818J7K80N44P17P95O90M60J87j55m04o69p80p48o10k84%K78N60P58P01O20
$$ -1818 -1801 -1521 -977 -260 535 1225 1685 1872 1717 1313 644 -136 -884 -1494 -1778 -1778 -1500 -940 -182 519 1139
2614A139M22J77j20l84o28p09p07n45l55J2K46N61O85P29O08L92J70j70m37o05
$$ 1139 1561 1738 1618 1234 606 -103 -810 -1355 -1710 -1698 -1452 -891 -206 523 1131 1523 1693 1523 1086 481
2634D81o57o45n02k59L3K63M69O53O95N76M17J59j98m41o24o61o26m62k58O9L37
$$ 481 -176 -821 -1323 -1582 -1549 -1286 -817 -164 531 1107 1524 1683 1485 1044 420 -241 -867 -1329 -1587 -1518 -1181
2655a181M67O14O44N23L70R6j48l92n65o20o72m55k46O4L23N34O13O62M58L05
$$ -1181 -714 -100 544 1067 1437 1533 1385 993 428 -192 -864 -1319 -1565 -1501 -1178 -644 -31 631 1089 1394
2675A394N9j89l93n26o05n89l85j97L3K66N09O22O35M84K81M2k34m18n67o03m86
$$ 1394 1453 1264 871 345 -260 -849 -1234 -1431 -1398 -1132 -623 -1 634 1118 1399 1441 1207 789 222 -381 -867
2696h67l21j63O8K54M96N51N66M65K88Q6k47m29n66n82m95l58r1J12L57M82N49
$$ -867 -1188 -1351 -1283 -1029 -533 18 584 1049 1337 1423 1176 747 181 -401 -896 -1254 -1345 -1233 -876 -394 155
2717A55M85L79K45N0k13m00m91n63m90m05j33J64L35N08N48N17M01J34qk34l94
$$ 155 640 1019 1264 1314 1101 701 210 -353 -843 -1248 -1381 -1217 -882 -374 174 691 1092 1226 1218 984 590
2738E90m53n03m68l34j17J00K92M63N54N19M39J84k8k59m08n06n46l82k39n0J06
$$ 590 137 -366 -834 -1168 -1285 -1185 -893 -430 124 643 1082 1266 1238 979 571 65 -481 -863 -1102 -1152 -1046
2759a046K92L80N16M87L74J50J5k29l58n35n16l99k36o4J60L34M47M89L77L08
$$ -1046 -754 -374 142 629 1003 1153 1168 939 581 46 -470 -869 -1105 -1169 -1009 -675 -228 261 638 946
2779I46J70J1k53l57m71m59l81k74n4J19L59M65M75M29K62J25r0k46m02m00m16
$$ 946 1116 1127 874 517 46 -413 -794 -1068 -1122 -1003 -644 -179 296 725 987 1112 1022 776 374 -26 -442
2800d42l28k27n2J13L25M23M45M34K89J35j03k56m36m24m04l49j93K0J89K88L92
$$ -442 -770 -997 -1049 -936 -611 -188 257 691 980 1115 1012 756 320 -104 -508 -857 -1050 -1030 -841 -553 -161
2821a61M10L91L04J16j10k25l81m42m43l63j71M9J73L53L98M38L55K14Q1j21k06
$$ -161 249 640 944 1060 950 725 344 -98 -541 -904 -1075 -1026 -853 -500 -102 336 691 905 986 865 659
2842F59l55m15m14k80j86LJ61L09M42M38L53K18M7r8k66l83m01l56k50j51JJ92
$$ 659 304 -111 -525 -805 -991 -988 -827 -518 -76 362 715 933 980 882 616 233 -168 -524 -774 -925 -924 -732
2864g32L04L87L97L41K26M2j09k70l67l86l43k72j42O2K01L10L60L54K94K13M1
$$ -732 -428 -41 356 697 923 965 856 586 219 -167 -510 -782 -924 -862 -661 -351 9 363 657 870 911
2885I11j12k51l60l35l52k91j34L1K55L23L54L68L06J55J0j09k93l39l19l65k45
$$ 911 799 548 188 -147 -499 -790 -924 -893 -638 -315 39 407 713 868 878 769 476 137 -182 -547 -792
2906g92p4O8J72K99L53L94K58J83J0j47k66l37l59l01k35o6P4K16K66L45L76K32
$$ -792 -866 -798 -626 -327 26 420 678 861 871 724 458 121 -238 -539 -774 -840 -766 -550 -284 61 437 669
2928F69J48kj48k05l33l72k96j98m7O4J71L28L46L08K07J24Pj63k23l23l00k66
$$ 669 817 815 667 462 129 -243 -539 -737 -784 -720 -549 -221 125 433 640 764 771 608 385 62 -238 -504
2950e04k35k4P7K09K67L06K88K43J28j6j98k50k67l25k59j15m2Q2K19K56K50K80
$$ -504 -739 -763 -686 -477 -210 96 384 627 755 739 541 291 24 -301 -560 -675 -717 -635 -416 -160 90 370
2972C70K24J19j9j67k29l05k98k28j21l0J09K34K52K67K80J28Q0n9j31k17k62
$$ 370 594 713 694 527 298 -7 -305 -533 -654 -684 -575 -341 -89 178 458 586 666 607 476 259 -3
2993ck97k21j39OP6K27K87K80K42J64Ln4j67j96l04k16j65j16OR9J80L03K17K44
$$ -3 -300 -521 -660 -654 -578 -351 -64 216 458 622 625 571 404 208 -96 -312 -477 -593 -587 -488 -308 -5 212 456
3017D56J46M1n7k10k82k26k56j62l3nJ95J82K51K14K08J10P0j05j96k83k44k07
$$ 456 602 643 586 376 94 -132 -388 -550 -583 -588 -393 -211 40 254 462 572 642 537 341 58 -186 -393
3039c93j60q3O5J87K22K65K06J77J21l6j33j80k08k18j81k05m5Q7J40K25K52K78
$$ -393 -553 -636 -571 -384 -162 103 309 486 607 571 438 258 50 -168 -349 -554 -599 -512 -372 -147 105 383
3061C83J49P6j4j62k11k10k46j67j55K7M8J80J90K26K06J60J06m3j20j97k41k89
$$ 383 532 608 594 432 221 11 -235 -402 -557 -530 -482 -302 -112 114 320 480 586 543 423 226 -15 -304
3083c04j78r1%J12J69K19K58J88J35M1k7j41j85k43k31j74r4jP3K01K43K29K31
$$ -304 -482 -573 -573 -461 -292 -73 185 373 508 549 522 381 196 -47 -278 -452 -546 -547 -474 -273 -30 199 430
3106D30J00J6m1j48k00k27k29j30j08JR0J87K24K32K19J02P0j18j41k10k45j90
$$ 430 530 546 505 357 157 -70 -299 -429 -537 -536 -446 -259 -35 197 416 518 588 470 329 119 -126 -316
3128c16j54o8L2J05K00J74K40J89R1K9o8j48j74k40j99j88n2N0J06J98K61J70
$$ -316 -470 -538 -506 -401 -201 -27 213 402 493 522 454 306 132 -108 -307 -495 -547 -497 -391 -193 68 238
3150B38J85J16m0n9j57j89k20k05j28o7J3J46J64K48K27J57J02rr5j79j75k44
$$ 238 423 539 499 440 283 94 -126 -331 -459 -526 -513 -367 -203 45 272 429 531 522 427 248 73 -171
3172a71j59j44m6P2J06J55K48K05J69P3J8p6j95k06k31j68j07o9O2J31K21K30
$$ -171 -330 -474 -520 -448 -342 -187 61 266 435 508 526 450 255 49 -182 -350 -457 -526 -464 -333 -112 118
3194A18J57J34R5mq8j83j78k13j86j49NN7J23J79K56J79J48O4o3r0j40k19j94
$$ 118 275 409 504 500 412 229 51 -162 -348 -497 -492 -435 -312 -133 123 302 450 514 451 361 221 2 -192
3217a92j81j03k7N6J39J81K10J81J96P1k8j33j89j89k08j79q1MQ9J34J69K05J63
$$ -192 -373 -476 -503 -447 -308 -127 83 264 460 531 503 370 181 -8 -216 -395 -476 -472 -383 -249 -80 125 288
3240B88J51M8m0j05j63j83k49j44p8mQ7J55J85J94J50J57j%j21j61j83k07j11
$$ 288 439 487 447 342 179 -4 -253 -397 -475 -479 -392 -237 -52 142 292 449 448 448 327 166 -17 -224 -335
3263c35j21qN5J42K32J89J72R8L2k9j35j67j70j95j05q9K4O7J22J91J75J75R2
$$ -335 -456 -464 -409 -267 -35 154 326 424 456 427 292 125 -45 -240 -345 -434 -410 -343 -221 -30 145 320 412
3286D12M7n0j07j88j77j62j55n0qJ04J74J69J50J58P2J5n0j30j26j72j70j54j6
$$ 412 459 409 302 114 -63 -225 -380 -430 -438 -334 -160 9 159 317 389 404 354 224 98 -74 -244 -398 -414
3309d14J3J15J48J61J72J18Q7op1j21j79j33j45r9l7PJ16J44J37J84J38P1j4q2
$$ -414 -401 -286 -138 23 195 313 400 394 323 202 23 -110 -255 -354 -391 -384 -268 -124 13 197 335 406 392 310
3333C10j39j44j89j16p7k8L4J08J62J48J59J11M0j0o3j28j72j57j54n5m4Q1J03
$$ 310 171 27 -162 -278 -355 -383 -349 -241 -79 69 228 339 379 369 306 178 6 -151 -305 -360 -404 -323 -220
3356b20J50J75J21J10N6j4p9j53j67j43j31p7j8N5J44J38K01J07J22L3o8p4j36
$$ -220 -70 105 226 336 392 378 299 146 -21 -164 -295 -372 -390 -335 -191 -53 148 255 377 410 342 268 132
3379A32j77j72j11o3j8R2J42J23J67J46J33K3n1j37j33j55j52j51n9QJ34J20J39
$$ 132 -45 -217 -328 -391 -409 -317 -175 -52 115 261 394 417 366 229 96 -59 -211 -362 -421 -413 -279 -159 -20
3402b0J72J37P3L7m4j04j24k10j64j19m5J5R7J20J65K28P6J06J9o9j06j66j62
$$ -20 152 289 362 399 355 251 127 -83 -247 -366 -411 -396 -299 -179 -14 214 290 396 415 346 240 74 -88
3425h8j65q9p2K5P0J44J74J86J60N7Km6j19j61j76j72q5p4J8Q8J88J37J80J15
$$ -88 -253 -342 -414 -389 -319 -175 -1 185 345 402 404 358 239 78 -98 -270 -355 -429 -411 -323 -135 2 182 297
3449B97J11L8p7j28j71j95j39r8r9P3J09J24J88J51J32R5%q5q9j60j89j81j02
$$ 297 408 446 369 241 70 -125 -264 -362 -461 -388 -279 -155 33 184 316 411 411 326 237 77 -112 -293 -395
3472c95m7K3J30J37J92J63J54M8j0n3j13k01j33j68j37J5J0R9J52J96J55J38R1
$$ -395 -442 -419 -289 -152 40 203 357 405 395 342 229 28 -105 -273 -410 -395 -385 -286 -134 62 217 355 446
3495D46Pj01j21k15j87j60p9k9N6J04J57K08J50J18P7oq5j18j88j70j72q2n7M5
$$ 446 453 352 231 16 -171 -331 -410 -439 -383 -279 -122 86 236 354 431 425 340 222 34 -136 -308 -390 -447 -402
3519d02J25J54J84J82J18R3Or5j41j96j71j62r1m7L5J26J78J77J71J23J08o6o4
$$ -402 -277 -123 61 243 361 454 460 365 224 28 -143 -305 -396 -443 -408 -282 -104 73 244 367 475 409 345
3542C45j39k14j64j34j18k8M3J36J53J92J98J17Q7l9p3j83j73k17j24j12jM3J42
$$ 345 206 -8 -172 -306 -424 -452 -409 -273 -120 72 270 387 474 435 362 179 6 -211 -335 -447 -448 -405 -263
3565b63J96J43J91J33O5j4q1j89j64j44k07j07j6M0J18K06J97J82J43L8l1p8j22
$$ -263 -67 76 267 400 465 451 370 181 17 -127 -334 -441 -457 -417 -299 -93 104 286 429 467 436 358 236
3588B36k31j92j50j08l0Q0J28J63K09J81J14P5pj13j65j90j89j52j21K4K1J47
$$ 236 5 -187 -337 -445 -475 -395 -267 -104 105 286 400 475 468 355 190 0 -189 -341 -462 -438 -417 -270
3610b70J93J80J65J34Q1k0j26j64j71k14j38j17OK6J47J76K03J86J42O7l7j01
$$ -270 -77 103 268 402 483 463 337 173 2 -212 -350 -467 -461 -435 -288 -112 91 277 419 486 449 348
3632C48j67j93j85j64o1n9J08J33J61K07J69J18M8k4q9j89j95j64j69r0K4P8J18
$$ 348 181 -12 -197 -361 -422 -481 -373 -240 -79 128 297 415 463 439 350 161 -34 -198 -367 -457 -433 -355 -237
3655b37J74K06J55J41K4k1j29j69j97j71j25r7J4R2J15J67J82J87R1O4n0j08j65
$$ -237 -63 143 298 439 463 442 313 144 -53 -224 -349 -446 -432 -340 -225 -58 124 311 402 466 416 308 143
3678A43k05j87j50l7j3P4J61J70K22J49Q2L7j9j31j56k06j58j61q3M9P3J32K15
$$ 143 -62 -249 -399 -436 -449 -375 -214 -44 178 327 409 446 427 296 140 -66 -224 -385 -468 -419 -346 -214 1
3701AJ73J69R8L6n6j40j62k16j77j32m3nR5J64J74K12J76R8K2n0j54j86j83k03
$$ 1 174 343 441 477 421 281 119 -97 -274 -406 -449 -454 -359 -195 -21 191 367 465 487 437 283 97 -86 -289
3725b89j33n6J4R8J84J89J94J91M9M0q0j07j94k21j59j58o3M5R2J73K26J70J74
$$ -289 -422 -478 -464 -366 -182 7 201 392 441 481 401 294 100 -121 -280 -438 -501 -456 -364 -191 35 205 379
3748C79P8L4m7j74j57k09j85j42o5k7J20J91J97K18J82J04J2n1j53j92k07k24
$$ 379 457 491 444 270 113 -96 -281 -423 -488 -515 -395 -204 -7 211 393 497 509 458 305 113 -94 -318
3770c18j25q2M2R4J69K28K06J68J03K3l9j77j69k02k14j53p5L9J11J73K04K15
$$ -318 -443 -525 -483 -389 -220 8 214 382 485 508 469 292 123 -79 -293 -446 -521 -482 -371 -198 6 221
3792B21J86J10J8o5j56k17k16j73j94m4K6P3K21K13K11J74J20K1p1j38k20k21
$$ 221 407 517 535 470 314 97 -119 -292 -486 -530 -504 -431 -210 3 214 388 508 529 458 320 100 -121
3814a21k25j02j10L1J30J74K18K33J91J09J8j00j48j96k24k06j44l2J8Q6J71K66
$$ -121 -346 -448 -558 -527 -397 -223 -5 228 419 528 546 446 298 102 -122 -328 -472 -504 -486 -400 -229 37
3836C7K07J67R5K6j03j19k24k38j62j92m6LJ55J87K21K53J54Q8N0j24j29k10k33
$$ 37 244 411 506 532 429 310 86 -152 -314 -506 -552 -549 -394 -207 14 267 421 509 559 435 306 96 -137
3859a37k07j47p3L4J54J51K54K13J61J28J4p6j68j92k55k11j23q0L7J26K19K00
$$ -137 -344 -491 -564 -530 -376 -225 29 242 403 531 545 469 301 109 -146 -357 -480 -560 -523 -397 -178 22
3881B2K13J84J10j3o1j78j91k39j77j53o9N3J06K06K60J89J93R4j2p7j81k03k42
$$ 22 235 419 529 516 455 277 86 -153 -330 -483 -552 -499 -393 -187 73 262 455 549 537 460 279 76 -166
3904a66j94j40j8LJ24K38K02K18J78J11Qj01j64k17k24k05j42o3O9J19K14J97
$$ -166 -360 -500 -518 -515 -391 -153 49 267 445 556 564 463 299 82 -142 -347 -489 -552 -483 -364 -150 47
3926D7K32J81Q3or3j82k19k08j87j47j9kJ56J96K13K26J54J33l3r1j80k38j91
$$ 47 279 460 543 537 444 262 43 -165 -352 -499 -518 -520 -364 -168 45 271 425 558 525 434 254 16 -175
3949a75j95j52j3N1J70J79K00K46J44J01j8j10j73k12k32k09q8m1M4J53K02K14
$$ -175 -370 -522 -535 -484 -314 -135 65 311 455 556 538 428 255 43 -189 -398 -486 -527 -483 -330 -128 86
3971H6K13J83O8l3j22k08j63k48j86j02k0Q1J20K43K03K11J33R2m6j08j94k14
$$ 86 299 482 550 517 395 187 24 -224 -410 -512 -532 -451 -331 -88 115 326 459 551 505 397 203 -11
3993a1j85k05q1l0O8J37J97K24K12J44O7o3q4j99k12j88k00o3l7R7J33K13K34
$$ -11 -196 -401 -482 -512 -444 -307 -110 114 326 470 537 474 390 191 -21 -209 -409 -472 -509 -412 -279 -66 168
4016A68J64J34L8l5r3k06k14j97j97n7QP0J67K02K02J89J18N3p0r9j84k10k37
$$ 168 332 466 504 469 376 170 -44 -241 -438 -495 -487 -417 -250 -48 154 343 461 514 444 345 161 -49 -286
4039b86j36o5k4J19J54K05K23J67J27M0p4j16j87k12k11j43r2K5J08J44K21K09
$$ -286 -422 -487 -511 -392 -238 -33 190 357 484 524 450 334 147 -65 -276 -419 -511 -486 -378 -234 -13 196
4061A96J65J29N0j05j39j93j95k09j23o9J6R0J82K02K30J77J00K8n6j44k27k27
$$ 196 361 490 540 435 296 103 -92 -301 -424 -493 -477 -387 -205 -3 227 404 504 532 476 332 105 -122
4083a22j95j06q1J3J00K01J98K34J77J01J0p9j47k12k22j87j48p4K8J08K12K21
$$ -122 -317 -423 -504 -491 -391 -190 8 242 419 520 530 451 304 92 -130 -317 -465 -539 -511 -403 -191 30
4105C0J92J86R3M4r0j72k04j94k23j56k0RR5K26K36J80J79J15K7r2j72j86k76
$$ 30 222 408 501 545 455 283 79 -115 -338 -494 -514 -505 -410 -184 52 232 411 526 553 461 289 103 -173
4128a73j60j66n7L7J28K06K25J86K05J10J2j01j67k10k24k05j49m9J1J51J83K63
$$ -173 -333 -499 -556 -519 -391 -185 40 226 431 541 553 452 285 75 -149 -354 -503 -552 -541 -390 -207 56
4150E6K15J68Q3J7q8j70j91k32k10j37k8J6J44K02K10K17J70J08k8j00j51j88
$$ 56 271 439 522 539 451 281 90 -142 -352 -489 -517 -501 -357 -155 55 272 442 550 522 422 271 83
4172H3k46j86j46m6O4J04K11J93K74J24R9L1j14j52k47j97k11j17o7O6J32K07
$$ 83 -163 -349 -495 -541 -477 -373 -162 31 305 429 528 559 445 293 46 -151 -362 -479 -546 -480 -348 -141
4194a41J82K60J57N6Lr5j87j88k33j77j24m5M4J31K21K45J92J68M1Qj05j66k14
$$ -141 41 301 458 514 517 422 235 47 -186 -363 -487 -532 -488 -357 -136 109 301 469 510 518 413 247 33
4217C3k28j80j34j1M3J36J96K12K28J33J17k4j20j69k08k13k00j06m9Q1J36K13
$$ 33 -195 -375 -509 -520 -477 -341 -145 67 295 428 545 521 401 232 24 -189 -389 -495 -544 -463 -327 -114
4239a14K20J79J85M5j9j12j53k26j96j86j12k0N9J41K08J95K32J20R5m7r6j70
$$ -114 106 285 470 515 496 384 231 5 -191 -377 -489 -509 -450 -309 -101 94 326 446 541 494 398 228
4261B28k28k11j67j36K2L6J64J91K22K15J33L2pj09j93k14j93j75j02l0O3J53
$$ 228 0 -211 -378 -514 -492 -456 -292 -101 121 336 469 501 494 385 192 -22 -215 -390 -492 -522 -459 -306
4283c06J93K46K03J48N0m9j07k00k08k07j76q7mQ9J43K08K09J68J49N8l5j29k08
$$ -306 -113 133 336 484 534 485 378 178 -30 -237 -413 -500 -504 -415 -272 -64 145 313 462 520 485 356 148
4306A48j78k14j59j08J9P2J47K05K29J85J17M8n9j29j59j98k46j37q0J0J23J12
$$ 148 -30 -244 -403 -511 -492 -420 -273 -68 161 346 463 511 452 323 164 -34 -280 -417 -497 -487 -364 -252
4328b52K21K09J64J18L2l5j61j63k01j83j62p5L3R2J63J76J81J90Q6L9n8r6j66
$$ -252 -31 178 342 460 492 457 296 133 -68 -251 -413 -488 -455 -363 -200 -24 157 347 433 472 414 318 152
4351A52k27j98j28p4J9P7J64K05K13J61Q0N0q6j24j80k09j87j53l0J9J05J69J81
$$ 152 -75 -273 -401 -475 -456 -379 -215 -10 203 364 444 494 408 284 104 -105 -292 -445 -475 -456 -351 -182 -1
4374aJ86K17N2J7q9j21j87j67j92j59l8M2J13J71K06J71J37J03J5p0j52j86k19
$$ -1 185 402 454 471 382 261 74 -93 -285 -444 -482 -440 -327 -156 50 221 358 461 476 406 254 68 -151
4397a51j84j03n9N3J25J61K30J76J71N6Qj05j50j69k01j90p9n7N4Q2K02J98J78
$$ -151 -335 -438 -497 -444 -319 -158 72 248 419 475 483 378 228 59 -142 -332 -411 -468 -414 -332 -130 68 246
4420B46J80N5ro9j82k13j61j92j10l0Q0J25J48K16J85J29O4j0q3j70j80k18j50
$$ 246 426 481 472 403 221 8 -153 -345 -455 -485 -405 -280 -132 84 269 398 462 452 369 199 19 -199 -349
4443c49j14l3N8J50J88K18J60J51M4l4q9j44k22j89j52j03pK6J50J96K31J75J57
$$ -349 -463 -496 -438 -288 -100 118 278 429 473 439 350 206 -16 -205 -357 -460 -467 -441 -291 -95 136 311 468
4466D68J0j7j21j46k02j91k08o6j0O9J48J78K31J66J07Q7l6j08j87j99k06j11
$$ 468 478 461 340 194 -8 -199 -407 -473 -483 -414 -266 -88 143 309 416 503 467 359 172 -27 -233 -344
4488c44j29J6M1J50K02K04J72J41K8k0j15j95j85k02j33q7kP1J34J90K02J70J61
$$ -344 -473 -457 -416 -266 -64 140 312 453 481 461 346 151 -34 -236 -369 -456 -458 -387 -253 -63 139 309 470
4511D70L0m6j34j49k03j85j71q9QQ9J74J44K16J71Q7O0m3j01j89j95j71j71p6
$$ 470 500 454 320 171 -32 -217 -388 -477 -469 -380 -206 -62 154 325 412 472 429 328 139 -56 -227 -398 -474
4534d74LR8J57J78J80K05J24Mm0j18k03j90j61j57q1K6Q8J34K09J77J90R3L0m4
$$ -474 -471 -373 -216 -38 142 347 471 475 435 317 114 -76 -237 -394 -475 -449 -361 -227 -18 159 349 442 472 428
4558D28j05k04j87j76j37r5K4J14J58J84J81J66R4J9m1j59j52k24j65j36m1L9
$$ 428 323 119 -68 -244 -381 -476 -452 -338 -180 4 185 351 445 464 423 264 112 -112 -277 -413 -454 -415
4580d15P6J63J84K12J49P7M1p3j34j90j67j91j25r2N4J12J67J87J62J68J06Kj00
$$ -415 -339 -176 8 220 369 446 487 414 280 90 -77 -268 -393 -485 -431 -319 -152 35 197 365 471 473 373
4603C73j25j52j79k37p3n3K4J11J73J35K20J40R7K5r4j71j47j93j83j15l7L0J09
$$ 373 248 96 -83 -320 -393 -446 -422 -311 -138 -3 217 357 454 479 385 214 67 -126 -309 -424 -461 -431 -322
4626c22J52K26J64J51J04l4p9j03k03k03j68j03k7K4J36J54J95J59J61P7Mq6j66
$$ -322 -170 56 220 371 475 441 362 259 56 -147 -315 -418 -445 -421 -285 -131 64 223 384 461 465 379 213
4649B13j56j93j89q6n1M1J12J68K10J70J46O5kr5j13k14j94j76q2l2Q9O5J82J90
$$ 213 57 -136 -325 -411 -462 -421 -309 -141 69 239 385 450 448 353 240 26 -168 -344 -426 -458 -369 -304 -122 68
4673F8J94J44M4j4r9j23j70k09j79p5j6OJ76J75J67J70J44N4k9n0k04j70j96j61
$$ 68 262 406 450 436 337 214 44 -165 -344 -419 -435 -429 -253 -78 89 259 403 457 428 378 174 4 -192 -353
4697c53p1k6N7J12K07J64J80J40K1kq7j72j76j92j43q8l7Q0J40J69K10J41J56
$$ -353 -424 -450 -393 -281 -74 90 270 410 431 429 342 170 -6 -198 -341 -429 -466 -386 -246 -77 133 274 430
4720D30M3n0r2j61j94j80j50r9lO7J47J71K07J62J31jl3q0j69j77j78j56p4j8
$$ 430 473 423 331 170 -24 -204 -354 -453 -456 -389 -242 -71 136 298 429 428 395 315 146 -31 -209 -365 -439 -457
4744d57R1J47J64J79J63J40O0n7j02j91j63k13j25j03J1R5J49J88J97J62R7N9
$$ -457 -366 -219 -55 124 287 427 487 430 328 137 -26 -239 -364 -467 -456 -361 -212 -24 173 335 432 491
4766D91o1j21j70j88k01j39p9J4Q9J64J82K02J65J04Qk1j27j94j81k16j34p3R
$$ 491 430 309 139 -49 -250 -389 -468 -454 -365 -201 -19 183 348 452 460 439 312 118 -63 -279 -413 -486 -477
4789d77R5J82J85J85J79R4L8m3j37j81j95k01j13p5NP7J70K30J59J70J05J8k8
$$ -477 -382 -200 -15 170 349 443 481 438 301 120 -75 -276 -389 -464 -459 -382 -212 18 177 347 452 470 442
4812D42j72j71j83j73j52n2J6P9J73J87J92J69R7M3o6j47j73k00j75j58n0J0Q0
$$ 442 270 99 -84 -257 -409 -461 -445 -366 -193 -6 186 355 452 495 429 282 109 -91 -266 -424 -474 -464 -384
4835c84K07J56K04J77J00J8p2j00k07j85j80j62o3M6P1J94J59K04J88Q8L2q9j11
$$ -384 -177 -21 183 360 460 478 406 306 99 -86 -266 -428 -491 -445 -374 -180 -21 183 371 459 491 402 291
4858B91j75k18j82j34l1J2P8J97J72J88J57J12J6q5j05j90j99j79j65o0M4R8J81
$$ 291 116 -102 -284 -418 -449 -437 -359 -162 10 198 355 467 483 398 293 103 -96 -275 -440 -500 -456 -358 -177
$$ [...]
8191F42
##END NTUPLES=NMR FID
##END=
