##TITLE=1H_LY-O-xylene
 
 8 sc, 
 5.04.2022
##JCAMPDX= 6.0         $$ Bruker NMR JCAMP-DX V2.0
##DATA TYPE= NMR FID
##DATA CLASS= NTUPLES
##ORIGIN= UXNMR, Bruker Analytische Messtechnik GmbH
##OWNER= root
$$ XWIN-NMR		Version 3.5
$$ Tue Apr  5 12:58:56 2022 Russian Standard Time (UT+4h)  she@DPX200
##.OBSERVE FREQUENCY= 200.131346
##.OBSERVE NUCLEUS= ^1H
##.DELAY= (6, 6)
##.ACQUISITION MODE= SIMULTANEOUS
##.ACQUISITION SCHEME= undefined
##.AVERAGES= 8
##.DIGITISER RES= 18
##SPECTROMETER/DATA SYSTEM= spect
##.PULSE SEQUENCE= zg30
##.SOLVENT NAME= CDCl3
##.SHIFT REFERENCE= (INTERNAL, CDCl3, 0, 15.7039)
##AUDIT TRAIL= $$ (NUMBER, WHEN, WHO, WHERE, WHAT)
$$ ##TITLE= Audit trail, XWIN-NMR		Version 3.5
$$ ##JCAMPDX= 5.01
$$ ##ORIGIN= Bruker BioSpin GmbH
$$ ##OWNER= she
$$ F:/spectra/data/she/nmr/H-F/1/audita.txt
$$ ##AUDIT TRAIL=  $$ (NUMBER, WHEN, WHO, WHERE, WHAT)
(   1,<2022-04-05 12:57:04.60 +0400>,<she>,<DPX200>,
      <created by zg, POWCHK disabled, PULCHK disabled
       configuration hash MD5:
       00 E9 B6 7A A2 85 ED C7 34 08 36 98 17 FE 4E 26
       data hash MD5: 16K
       8B B1 F4 2C 81 EE 25 55 21 2D 1D B8 55 E7 81 0E>)
$$ ##END=
$$ 
$$ hash MD5
$$ 18 68 E1 E8 24 2A 65 FA 88 13 BD E2 E6 AA 4B 21
##$RELAX= 
##$RELAX= 
##$RELAX= 
##$RELAX= 
##$RELAX= 
##$RELAX= 
$$ Bruker specific parameters
$$ --------------------------
##$DU= <F:/spectra>
##$EXPNO= 1
##$NAME= <H-F>
##$PROCNO= 1
##$TYPE= <nmr>
##$USER= <she>
##$AMP= (0..31)
100 100 100 100 100 100 100 100 100 100 100 100 100 100 100 100 100 100 
100 100 100 100 100 100 100 100 100 100 100 100 100 100 
##$AQSEQ= 0
##$AQ_mod= 1
##$AUNM= <au_zg>
##$AUTOPOS= <>
##$BF1= 200.13
##$BF2= 200.13
##$BF3= 200.13
##$BF4= 200.13
##$BF5= 200.13
##$BF6= 200.13
##$BF7= 200.13
##$BF8= 200.13
##$BYTORDA= 1
##$CFDGTYP= 0
##$CFRGTYP= 5
##$CHEMSTR= <none>
##$CNST= (0..31)
1 1 145 1 1 1 1 1 1 1 1 1 1 1 1 1 1 1 1 1 1 1 1 1 1 1 1 1 1 1 1 1 
##$CPDPRG= <>
##$CPDPRG1= <>
##$CPDPRG2= <>
##$CPDPRG3= <>
##$CPDPRG4= <mlev>
##$CPDPRG5= <mlev>
##$CPDPRG6= <mlev>
##$CPDPRG7= <mlev>
##$CPDPRG8= <mlev>
##$CPDPRGB= <>
##$CPDPRGT= <>
##$D= (0..31)
0 1.2 0 0 0 0 0 0 0 0.06 0 0.03 0 0 0 0 0.0002 0 0 0 0 0 0 0 0 0 0 0 0 
0 0 0 
##$DATE= 1649149024
##$DBL= (0..7)
120 120 120 120 120 120 120 120 
##$DBP= (0..7)
150 150 150 150 150 150 150 150 
##$DBP07= 0
##$DBPNAM0= <>
##$DBPNAM1= <>
##$DBPNAM2= <>
##$DBPNAM3= <>
##$DBPNAM4= <>
##$DBPNAM5= <>
##$DBPNAM6= <>
##$DBPNAM7= <>
##$DBPOAL= (0..7)
0.5 0.5 0.5 0.5 0.5 0.5 0.5 0.5 
##$DBPOFFS= (0..7)
0 0 0 0 0 0 0 0 
##$DE= 6
##$DECBNUC= <off>
##$DECIM= 32
##$DECNUC= <off>
##$DECSTAT= 4
##$DIGMOD= 1
##$DIGTYP= 9
##$DL= (0..7)
0 120 120 120 120 120 120 120 
##$DP= (0..7)
150 150 150 150 150 150 150 150 
##$DP07= 0
##$DPNAME0= <>
##$DPNAME1= <>
##$DPNAME2= <>
##$DPNAME3= <>
##$DPNAME4= <>
##$DPNAME5= <>
##$DPNAME6= <>
##$DPNAME7= <>
##$DPOAL= (0..7)
0.5 0.5 0.5 0.5 0.5 0.5 0.5 0.5 
##$DPOFFS= (0..7)
0 0 0 0 0 0 0 0 
##$DQDMODE= 0
##$DR= 18
##$DS= 0
##$DSLIST= <SSSSSSSSSSSSSSS>
$$ [...]
##$SUBNAM2= <"">
##$SUBNAM3= <"">
##$SUBNAM4= <"">
##$SUBNAM5= <"">
##$SUBNAM6= <"">
##$SUBNAM7= <"">
##$SUBNAM8= <"">
##$SUBNAM9= <"">
##$SW= 18.0517287032376
##$SWIBOX= (0..15)
0 0 2 0 0 0 0 0 0 0 0 0 0 0 0 0 
##$SW_h= 3612.71676300578
##$TD= 16384
##$TD0= 1
##$TE= 0
##$TE2= 300
##$TE3= 300
##$TEG= 300
##$TL= (0..7)
0 120 120 120 120 120 120 120 
##$TP= (0..7)
150 150 150 150 150 150 150 150 
##$TP07= 0
##$TPNAME0= <>
##$TPNAME1= <>
##$TPNAME2= <>
##$TPNAME3= <>
##$TPNAME4= <>
##$TPNAME5= <>
##$TPNAME6= <>
##$TPNAME7= <>
##$TPOAL= (0..7)
0.5 0.5 0.5 0.5 0.5 0.5 0.5 0.5 
##$TPOFFS= (0..7)
0 0 0 0 0 0 0 0 
##$TUNHIN= 0
##$TUNHOUT= 0
##$TUNXOUT= 0
##$USERA1= <user>
##$USERA2= <user>
##$USERA3= <user>
##$USERA4= <user>
##$USERA5= <user>
##$V9= 5
##$VALIST= <valist>
##$VCLIST= <CCCCCCCCCCCCCCC>
##$VD= 0
##$VDLIST= <DDDDDDDDDDDDDDD>
##$VPLIST= <PPPPPPPPPPPPPPP>
##$VTLIST= <TTTTTTTTTTTTTTT>
##$WBST= 1024
##$WBSW= 4
##$XGAIN= (0..3)
0 0 0 0 
##$XL= 0
##$YL= 0
##$YMAX_a= 269857
##$YMIN_a= -244133
##$ZGOPTNS= <>
##$ZL1= 120
##$ZL2= 120
##$ZL3= 120
##$ZL4= 120
##$ABSF1= 10
##$ABSF2= 0
##$ABSG= 5
##$ABSL= 3
##$ALPHA= 0
##$AQORDER= 0
##$ASSFAC= 0
##$ASSFACI= 0
##$ASSFACX= 0
##$ASSWID= 0
##$AUNMP= <proc_1d>
##$AZFE= 0.1
##$AZFW= 0.1
##$BCFW= 1
##$BC_mod= 2
##$BYTORDP= 1
##$COROFFS= 0
##$CY= 11.3945322036743
##$DATMOD= 1
##$DC= 2
##$DFILT= <>
##$DTYPP= 0
##$F1P= 2.36226072786647
##$F2P= -0.459571619588291
##$FCOR= 0.5
##$FTSIZE= 0
##$FT_mod= 4
##$GAMMA= 1
##$GB= 0.15
##$INTBC= 1
##$INTSCL= 1
##$ISEN= 128
##$LB= 0.24
##$LEV0= 0
##$LPBIN= 0
##$MAXI= 10000
##$MC2= 0
##$MEAN= 0
##$ME_mod= 0
##$MI= 1.114404
##$NCOEF= 0
##$NC_proc= 0
##$NLEV= 6
##$NOISF1= 3.799351
##$NOISF2= 2.8
##$NSP= 1
##$NTH_PI= 0
##$NZP= 0
##$OFFSET= 15.70392
##$PC= 1
##$PHC0= -17744.42
##$PHC1= 8.00078
##$PH_mod= 1
##$PKNL= yes
##$PPARMOD= 0
##$PSCAL= 0
##$PSIGN= 0
##$REVERSE= no
##$SF= 200.130013532006
##$SI= 16384
##$SIGF1= 3
##$SIGF2= 2
##$SINO= 400
##$SIOLD= 16384
##$SREGLST= <1H.CDCl3>
##$SSB= 0
##$STSI= 0
##$STSR= 0
##$SW_p= 3612.71676300578
##$SYMM= 0
##$S_DEV= 0
##$TDeff= 0
##$TDoff= 0
##$TI= <>
##$TILT= no
##$TM1= 0
##$TM2= 0
##$TOPLEV= 0
##$USERP1= <user>
##$USERP2= <user>
##$USERP3= <user>
##$USERP4= <user>
##$USERP5= <user>
##$WDW= 1
##$XDIM= 8192
##$YMAX_p= 0
##$YMIN_p= 0
$$ End of Bruker specific parameters
$$ ---------------------------------
##NTUPLES= NMR FID
##VAR_NAME=  TIME,          FID/REAL,        FID/IMAG
##SYMBOL=    X,             R,               I
##VAR_TYPE=  INDEPENDENT,   DEPENDENT,       DEPENDENT
##VAR_FORM=  AFFN,          ASDF,            ASDF
##VAR_DIM=   8192,          8192,            8192
##UNITS=     SECONDS,       ARBITRARY UNITS, ARBITRARY UNITS
##FACTOR=    0.0002768,     1,               1
##FIRST=     0,             0,               0
##LAST=      2.2672688,     0,               0
##MIN=       0,             -244133,         0
##MAX=       2.2672688,     269857,          0
$$ Real data points
##PAGE= N=1
##DATA TABLE= (X++(R..R)), XYDATA
$$ plain form
0 0 0 0 0 0 0 0 0 0 0 0 0 0 0 0 0 -8 8 -8 8 -8 8 -8 12 -16 16 -16 20 -24 27 -32 35 -40 43 -48 52 -60 67 -74
38 -74 82 -89 98 -108 117 -130 143 -156 172 -188 206 -226 249 -275 305 -340 376 -421 473 -536 614
59 614 -711 832 -993 1212 -1517 1976 -2709 4008 -6688 14045 -67884 -183776 59929 -215411
73 -215411 -79682 131880 -105541 195525 140926 -69572 171560 -121265 -148590 44545
83 44545 -225515 26111 108489 -68723 234436 52348 -51971 129804 -190625 -86242
93 -86242 15132 -195794 111189 71030 -21633 233435 -29501 -25779 70917 -223125 -22447
104 -22447 -16916 -141012 168613 29163 27408 199338 -95045 2066 5904 -219383 34937
115 34937 -45323 -70489 193392 -11489 69356 138457 -136335 27564 -54977 -180790 77274
$$ packed form
0@%%%%%%%%%%%%%%%qJ6j6J6j6J6j6K0k8L2l2L6m4N1n9O7p5Q3r1J00j12J27j41
38g4J56j71J87k06K25k47K73k99L28l60L94m32M75n24N80o45P16p97Q94j009J150
59F14j325J543j825K205k729L493m685O717j0696K0733q1929j15892K43705k75340
73b15411J35729K11562k37421L01066n4599k10498K41132k92825k7325J93135
83D4545k70060K51626Q2378j77212L03159j82088j04319J81775l20429J04383
93h6242J01374k10926L06983m0159r2663K55068k62936L722R6696k94042K00678
104b2447N531j24096L09625j39450j755J71930k94383R7111L838k25287K54320
115C4937q0260k5166K63881k04881Q0845O9101k74792J63899q2541j25813K58064
$$ plain form
126 77274 -65421 3829 182015 -42667 97685 63384 -147211 44106 -101373 -119187 97290
137 97290 -73733 69159 143301 -58174 109828 -11562 -131292 47733 -129156 -48907
147 -48907 95489 -67773 117094 89284 -57997 104392 -74847 -97808 39984 -135507
157 -135507 18471 77987 -50989 142459 30097 -46916 84338 -119047 -53776 25658 -122169
168 -122169 74188 49283 -27920 144534 -26357 -27231 54414 -140107 -6323 5649 -92771
179 -92771 111081 14573 -363 125121 -70309 -2169 17471 -137210 34910 -17475 -51407
190 -51407 124743 -17534 28787 88101 -94901 20755 -21220 -112554 61902 -36838 -5489
201 -5489 116008 -39987 51846 41824 -99581 36462 -53273 -73989 73796 -48528 36089
$$ packed form
126G7274j42695O9250J78186k24682J40352l4301k10595J91317j45479j7814K16477
137I7290j71023J42892P4142k01475J68002j21390j19730J79025j76889Q0249
147d8907J44396j63262J84867k7810j47281J62389j79239k2961J37792j75491
157a35507J53978N9516j28976J93448j12362p7013J31254k03385O5271P9434j47827
168a22169J96357k4905p7203J72454j70891q74Q1645j94521J33784J1972r8420
179i2771K03852r6508j4936J25484j95430O8140J9640j54681J72120n2385l3932
190e1407J76150j42277M6321N9314j83002J15656m1975r1334J74456r8740L1349
201e489J21497j55995R1833j0022j41405J36043q9735k0716J47785j22324Q4617
$$ plain form
212 36089 90458 -52201 65736 -4835 -87826 44565 -75184 -29245 71717 -52872 68670
223 68670 54215 -53428 70310 -46154 -62994 43836 -85759 15046 56753 -48175 89354
234 89354 13376 -43350 64006 -77071 -30216 33007 -82722 52563 32682 -33611 94423
245 94423 -24736 -24767 46395 -92583 3410 15248 -66057 76926 5681 -12718 83835 -53690
257 -53690 -3110 21624 -91538 31766 -4968 -40105 86001 -18703 9858 61249 -70057
268 -70057 17120 -5277 -76807 51003 -23363 -10056 81050 -36924 30173 31826 -73855 32528
280 32528 -30238 -52256 60108 -37196 19848 64549 -47126 45437 -725 -65783 41170
291 41170 -50067 -21235 58098 -43971 45794 38791 -47534 52685 -31510 -46994 40636 -61123
$$ packed form
212C6089N4369j42659J17937p0571q2991J32391j19749M5939J00962j24589J21542
223F8670j4455j07643J23738j16464j6840J06830j29595J00805M1707j04928J37529
234H9354p5978n6726J07356j41077M6855O3223j15729J35285j9881o6293J28034
245I4423j19159l1P1162j38978R5993J1838q1305J42983p1245j8399R6553j37525
257e3690N0580K4734j13162J23304l6734l5137J26106j04704K8561N1391j31306
268g0057Q7177k2397p1530J27810p4366J3307R1106j17974O7097J653j05681J06383
280C2528o2766k2018J12364r7304N7044M4701j11675R2563m6162o5058J06953
291D1170r1237K8832P9333j02069Q9765p003q6325J00219q4195j5484Q7630j01759
$$ plain form
303 -61123 11188 45337 -41526 62830 8689 -37884 49694 -54868 -21978 31110 -60619 38521
315 38521 25796 -30376 68010 -19165 -22243 37586 -67078 3247 16506 -50145 57007 4837
327 4837 -14642 62304 -41134 -4767 20256 -68564 25353 302 -32739 65880 -15045 2873
339 2873 47849 -55440 12325 97 -59748 41904 -15587 -10677 63973 -30784 19936 26155
351 26155 -59575 26014 -20020 -41492 49495 -27838 12863 51244 -39012 32802 965 -52764
363 -52764 32885 -35881 -17406 47219 -33294 32821 31045 -38703 38604 -22512 -37894 32445
375 32445 -44398 7297 37174 -31928 46021 7990 -31688 37212 -40592 -18591 26204 -45275
387 -45275 28776 22322 -25069 51273 -14301 -20132 29950 -51377 1783 15928 -39127 44478
$$ packed form
303f1123P2311L4149q6863J04356n4141m6573Q7578j04562L2890N3088r1729R9140
315C8521j2725n6172R8386q7175l078N9829j04664P0325J3259o6651J07152n2170
327D837j9479P6946j03438L6367K5023q8820R3917k5051l3041R8619q0925J7918
339B873M4976j03289O7765j2228n9845J01652n7491M910P4650r4757N0720O219
351B6155q5730Q5589m6034k1472R0987p7333M0701L8381r0256P1814l1837n3729
363e2764Q5649o8766J8475O4625q0513O6115j776o9748P7307o1116j5382P0339
375C2445p6843N1695K9877o9102P7949l8031l9678O8900p7804K2001M4795p1479
387d5275P4051o454m7391P6342o5574n831N0082q1327N3160J4145n5055Q3605
$$ plain form
399 44478 5121 -14293 48555 -32756 -5928 17931 -53708 20474 3109 -26855 52117 -11696
411 -11696 -826 37929 -44431 8545 2743 -46820 33796 -9966 -10062 50125 -24613 12639 21189
424 21189 -46911 19883 -12721 -32321 39300 -20069 7663 39644 -31095 23004 2135 -41198
436 -41198 25956 -24983 -14002 37516 -25560 22875 24222 -31701 28818 -15685 -29816 27318
448 27318 -32791 4919 30231 -26752 34001 6171 -27211 30275 -30396 -14389 23928 -35617
460 -35617 22282 17983 -23293 39611 -11927 -17588 26424 -39564 2694 15572 -32280 34652
472 34652 3128 -14853 38116 -26354 -4952 17411 -41179 17386 4250 -23071 39858 -10555
484 -10555 -3695 30096 -34492 7211 5513 -35817 27304 -6836 -10571 38081 -20831 7501 17914
$$ packed form
399D4478l9357j9414O2848q1311K6828K3859p1639P4182j7365k9964P8972o3813
411a1696J0870L8755q2360N2976n802m9563Q0616m3762r6O0187p4738L7252Q550
424B1189o8100O6794l2604j9600P1621n9369K7732L1981p0739N4099k0869m3333
436d1198O7154n0939J0981N1518o3076M8435J347n5923O0519m4503j4131N7134
448B7318o0109L7710K5312n6983O0753k7830l3382N7486o0671J6007L8317n9545
460c5617N7899m299m1276O2904n1538n661M4012o5988M2258J2878m7852O6932
472C4652l1524j7981N2969o4470K1402K2363n8590N8565j3136k7321O2929n0413
484a0555O860L3791o4588M1703j698m1330O3121l4140l735M8652n8912K8332J0413
$$ plain form
497 17914 -36367 17076 -6639 -25335 31922 -16336 2874 30581 -26979 17194 3808 -32294
509 -32294 23712 -17505 -11768 30953 -22999 15395 18739 -28105 24220 -10237 -23168 25782
521 25782 -25591 2970 24497 -25366 25302 4551 -23690 26803 -22191 -10498 22450 -29060
533 -29060 16413 13858 -22261 30426 -9395 -14818 23920 -29465 2883 14608 -26865 25866
545 25866 1693 -14902 29754 -20259 -3962 16768 -31078 14298 4821 -20307 30015 -9513
557 -9513 -5584 24518 -26827 6583 7585 -27952 22518 -5248 -11272 29599 -18526 4372 16082
570 16082 -29011 15784 -2813 -20934 26768 -14437 -314 24549 -23952 13904 5011 -26136
582 -26136 21644 -12946 -10371 25757 -20486 10656 15285 -24183 20280 -6674 -18548 22617
$$ packed form
497A7914n4281N3443k3715j8696N7257m8258J9210K7707n7560M4173j3386l6102
509c2294N6006m1217N737M2721n3952L8394L344m6844N2325l4457j2931M8950
521B5782n1373K8561K1527m9863N0668k0751k8241N0493m8994J1693L2948n1510
533b9060M5473k555l6119N2687l9821n423L8738n3385L2348J1725m1473N2731
545B5866k4173j6595M4656n0013J6297K0730m7846M5376r477k5128N0322l9528
557i513L929L0102n1345L3410J002l5537N0470k7766o024M0871m8125K2898J1710
570A6082m5093M4795j8597j8121M7702m1205J4123K4863m8501L7856q893l1147
582b6136M7780l4590K575L6128m6243L1142M629l9468M4463k6954j1874M1165
$$ plain form
594 22617 -20079 1383 19894 -21890 18891 4011 -19829 22223 -16093 -8419 19294 -22999
606 -22999 11815 11213 -19358 23270 -6832 -12511 20412 -22310 2165 13065 -22216 19733 1378
619 1378 -13781 24077 -15950 -3579 15425 -24983 11824 4809 -18019 24389 -8153 -5941 21046
632 21046 -22189 5618 7819 -23623 19038 -4015 -10716 24778 -15844 2778 14409 -24285
644 -24285 13306 -1080 -17978 22431 -11719 -1661 20572 -20033 10590 5323 -21687 17947
656 17947 -9292 -9403 21311 -16593 7185 13014 -20096 15893 -3938 -15496 18818 -15329 -34
669 -34 16674 -18164 14160 4137 -16780 18273 -11949 -7570 16668 -18743 8692 9851 -16913
682 -16913 18886 -4890 -11158 17856 -18018 1277 11934 -19294 15968 1574 -12845 20509
$$ packed form
594B2617m2696K1462J8511m1784M0781j4880k3840M2052l8316P674K7713m2293
606b2999L4814o02l0571M2628l0102n679L2923m2722K4475J0900l5281M1949j8355
619A378j5159L7858m0027J2371J9004m0408L6807p015k2828M2408l2542K212K6987
632B1046m3235K7807K201l1442M2661k3053o701L5494m0622J8622J1631l8694
644b4285L7591j4386j6898M0409l4150J0058K2233m0605L0623n267k7010L9634
656A7947k7239j11L0714l7904K3778N829l3110L5989j9831j1558L4314l4147J5295
669c4J6708l4838L2324j0023k0917L5053l0222M379K4238l5411K7435J159k6764
682a6913L5799k3776o268K9014l5874J9295J0657l1228L5262j4394j4419L3354
$$ plain form
694 20509 -12993 -3506 14306 -20896 9709 4879 -16256 20032 -6801 -6213 18247 -18047 4511
707 4511 8004 -19606 15478 -2804 -10353 19967 -12940 1232 12894 -19201 10883 714 -15160
720 -15160 17754 -9334 -3185 16636 -16224 7952 6027 -17184 14983 -6339 -8801 17069 -14163
733 -14163 4108 11027 -16734 13458 -1425 -12558 16591 -12384 -1396 13485 -16711 10723
745 10723 3916 -14217 16793 -8414 -5885 15056 -16449 5818 7458 -16092 15385 -3379 -8859
758 -8859 17084 -13595 1363 10441 -17516 11414 273 -12274 17155 -9308 -1902 14098 -15934
771 -15934 7625 3851 -15449 14267 -6325 -6294 15895 -12753 4985 8883 -15409 11701 -3159
784 -3159 -11143 14416 -11199 530 12533 -13573 10685 2569 -12877 13394 -9546 -5564 12550
$$ packed form
694B0509l3502R487J7812l5202L0605m830k1135L6288k6833N88K4460l6294K2558
707D511L493k7610L5084j8282p549L0320l2907J4172J1662l2095L0084j0169j5874
720a5160L2914k7088O149J9821l2860K4176j925k3211L2167k1322k462K5870l1232
733a4163J8271O919k7761L0192j4883j1133K9149k8975J0988J4881l0196K7434
745A0723o807j8133L1010k5207K529K0941l1505K2267J640k3550L1477j8764n480
758h859K5943l0679J4958R078k7957K8930j1141j2547K9429k6463P406J6000l0032
771a5934K3559l774j9300K9716k0592L1K2189k8648J7738L898k4292K7110j4860
784c159p984K5559k5615J1729J2003k6106K4258q116j5446K6271k2940L982J8114
$$ plain form
797 12550 -13870 7398 7746 -12264 14534 -4304 -8768 12635 -14559 951 8868 -13887 13296
810 13296 1806 -8733 15572 -10696 -3398 9175 -16784 7217 3731 -10738 16682 -3974
822 -3974 -3563 13160 -14844 1870 3803 -15576 11693 -1211 -5313 16891 -8262 1577 8202
835 8202 -16367 5819 -1789 -11679 14095 -5032 787 14541 -11043 5684 1947 -15629 8566
848 8566 -6706 -5943 14665 -7673 6693 9929 -12324 8551 -4793 -12582 9887 -10331 1009
861 1009 13056 -8770 11511 3615 -11570 9531 -10864 -7523 9322 -11767 7846 9418 -7803
874 -7803 14089 -3215 -9009 8202 -14900 -1518 7049 -10538 13216 4671 -5229 13720 -9235
887 -9235 -5373 5039 -16077 4348 3971 -7103 16108 -369 -1959 10761 -13539 -1409 1059
$$ packed form
797A2550k6420K1268L48k0010K6798j8838m464K1403k7194J5510P917k2755K7183
810A3296j1490j0539K4305k6268P298J2573k5959K4001l486j4469K7420k0656
822c974M11J6723k8004J6714J933j9379K7269j2904m102K2204k5153R839O625
835H202k4569K2186p608r890K5774j9127N819J3754k5584J6727l737j7576K4195
848H566j5272P63K0608k2338J4366L236k2253K0875j3344p789K2469k0218J1340
861A009J2047k1826K0281p896j5185K1101k0395L341J6845k1089J9613J572j7221
874g803K1892j7304n794J7211k3102J3382Q567j7587K3754q545r900J8949k2955
887i235L862J0412k1116K0425l77j1074K3211j6477j590J2720k4300J2130K468
$$ plain form
900 1059 -14447 9227 701 -2484 16418 -4973 1322 6097 -15730 2431 -2941 -10691 12683
913 12683 -2386 2546 14338 -8726 4287 422 -15618 5692 -6561 -5152 14164 -4876 7378
926 7378 9892 -10871 6356 -5599 -12838 7581 -8961 1409 13003 -5966 10852 3734 -10784
939 -10784 6739 -10467 -7961 7641 -9328 7384 9781 -5516 12051 -2536 -8923 5597 -13218
952 -13218 -2344 6455 -7944 11760 5430 -4143 11337 -8007 -5960 3601 -13955 3345 4356
965 4356 -5456 14404 466 -2090 8960 -12272 -2103 920 -12623 8407 1450 -1913 14736
978 14736 -4449 504 5047 -14363 1890 -2182 -9136 11696 -1583 2056 12478 -8048 3009
991 3009 298 -13740 5052 -4853 -4236 12557 -3905 5613 8284 -9760 4728 -4285 -10841 6811
$$ packed form
900A059j5506K3674q526l185J8902k1391O295M775k1827J8161n372p750K3374
913A2683j5069M932J1792k3064J3013l865j6040K1310j2253J409J9316j9040J2254
926G378K514k0763J7227j1955p239K0419j6542J0370J1594j8969J6818p118j4518
939a0784J7523j7206K506J5602j6969J6712K397j5297J7567j4587o387J4520j8815
952a3218J0874Q799j4399J9704o330r573J5480j9344K047R561j7556J7300J011
965D356r812J9860j3938k556J1050k1232J0169L023j3543K1030o957l363J6649
978A4736j9185M953M543j9410J6253m072o954K0832j3279L639J0422k0526J1057
991C009k711j4038J8792r905O17J6793j6462R518K671j8044J4488r013o556J7652
$$ plain form
1005 6811 -6591 1058 11217 -5169 8071 3029 -9628 5411 -7986 -6488 7206 -7157 5890
1018 5890 8201 -5431 9242 -2346 -7963 5187 -10363 -1396 6351 -6694 9620 4082 -4705
1031 -4705 9096 -7143 -4969 4133 -11189 3702 4256 -5181 11779 -613 -2885 7531 -10499
1044 -10499 -1141 2036 -10105 7819 1297 -2553 11735 -4741 -368 4483 -11698 2445 -550
1057 -550 -7164 10011 -1528 584 9588 -7465 1885 795 -10803 5045 -2855 -3345 10385 -3701
1071 -3701 3379 6198 -8741 3715 -2727 -8405 6720 -4694 744 9213 -5320 5745 2054
1084 2054 -8617 5082 -5942 -4747 7224 -5968 4786 6522 -5860 7314 -2439 -6931 5372
1097 5372 -8225 -412 6219 -5996 7974 2824 -5070 7432 -6315 -4138 4331 -8903 3685
$$ packed form
1005F811j3402P649J0159j6386J3240n042j2657J5039j3397J498J3694j4363J3047
1018E890K311j3632J4673j1588n617J3150j5550Q967P747j3045J6314n538q787
1031d705J3801j6239K174R102j5322J4891N54r437J6960j2392k272J0416j8030
1044a0499R358L177j2141J7924o522l850J4288j6476M373M851j6181J4143k995
1057e50o614J7175j1539K112R004j7053R350j090j1598J5848p900m90J3730j4086
1071c701P080K819j4939J2456o442n678J5125j1414N438Q469j4533J1065l691
1084B054j0671J3699j1024J195J1971j3192J0754J736j2382J3174r753m492J2303
1097E372j3597P813O631j2215J3970n150p894J2502j3747K177Q469j3234J2588
$$ plain form
1110 3685 4146 -4700 9545 -987 -3342 6068 -8843 -952 2534 -7962 6849 1608 -2540 9439
1124 9439 -4310 -1186 3682 -9791 2103 337 -5710 8804 -945 44 7873 -6805 1027 680
1138 680 -9296 4625 -1884 -2581 9403 -3163 2676 5144 -8200 2913 -2564 -7450 6294 -3778
1152 -3778 1068 8585 -4688 4954 1491 -8245 4107 -5504 -4300 6760 -4780 4682 6302 -5112
1166 -5112 6182 -2469 -6829 4177 -7337 -462 5974 -4517 7356 3117 -4447 5959 -5851
1179 -5851 -4562 3272 -7713 3163 4439 -3264 8759 -215 -3227 4655 -8307 -1907 1847 -6919
1193 -6919 6309 2469 -1427 8921 -3493 -1587 2550 -9671 993 72 -4941 8643 146 856
1207 856 7639 -6258 271 -295 -9412 3639 -1745 -1850 9472 -1901 3098 4858 -7821 1746
$$ packed form
1110C685M61q846J4245j0532k355R410j4911P891L486j0496J4811n241m148J1979
1124I439j3749L124M868j3473J1894j766o047J4514r749R89P829j4678P832l47
1138F80r976J3921o509o97J1984j2566N839K468j3344J1113n477m886J3744j0072
1152c778M846P517j3273R642l463r736J2352r611J204J1060j1540R462J620j1414
1166e112J1294q651m360J1006j1514O875O436j0491J1873m239p564J0406j1810
1179e851J289P834j0985J0876J276p703J2023q974l012P882j2962O400L754q766
1193f919J3228l840l896J0348j2414J906M137j2221J0664r21n013J3584q497P10
1207H56O783j3897O529n66r117J3051n384j05J1322j1373M999J760j2679R567
$$ plain form
1221 1746 -3243 -7492 5294 -2947 1665 8687 -3172 4620 1280 -8010 2418 -5577 -4495 5949
1235 5949 -3330 4867 6690 -3686 5225 -2435 -7086 2431 -6963 -903 5705 -2941 7337 3817
1249 3817 -3556 4896 -5790 -5156 1973 -7268 2823 4627 -1935 8685 414 -2822 3686 -8280
1263 -8280 -2571 1047 -6354 6072 2906 -463 8673 -2934 -1651 1661 -9444 254 -213 -4270
1277 -4270 8222 924 1367 7131 -5567 -325 -877 -8966 2662 -1398 -1308 8881 -800 3001 4393
1292 4393 -6967 713 -3284 -7043 4280 -2143 1768 8143 -2070 4065 1140 -7286 1413 -5126
1306 -5126 -4246 5134 -2492 4511 6300 -2952 4540 -2235 -6560 1839 -6330 -879 5169 -2438 6730
1321 6730 3524 -3154 4352 -5351 -4739 1683 -6560 2608 4212 -1702 7844 331 -2587 3235 -7426
$$ packed form
1221A746m989m249J2786q241M612P022j1859P792l340r290J0428p995J082J0444
1235E949r279Q197J823j0376Q911p660m651R517r394O060O608q646J0278l520
1249C817p373Q452j0686O34P129r241J0091J804o562J0620q271l236O508j1966
1263h280N709L618p401J2426l166l369R136j1607J283L312j1105R698m67m057
1277d270J2492p298M43N764j2698N242n52q089J1628m060R0J0189r681L801J392
1292D393j1360P680l997l759J1323o423L911O375j0213O135k925q426Q699o539
1306e126Q80R380p626P003J789r252P492o775m325Q399q169N451O048p607R168
1321F730l206o678P506r703O12O422q243R168J604n914R546p513k918N822j0661
$$ plain form
1336 -7426 -2302 968 -5561 5363 2686 -405 7547 -2516 -1611 1467 -8132 85 20 -3687 7031
1351 7031 989 972 6116 -4686 -504 -550 -7655 2222 -953 -1326 7570 -679 2304 3882 -6050 641
1367 641 -2541 -6075 3851 -1852 1301 6997 -2101 3376 1058 -6393 1565 -4250 -3628 4739 -2376
1382 -2376 3773 5376 -2951 3978 -1887 -5697 2000 -5361 -700 4683 -2359 5643 3001 -3063 3824
1397 3824 -4471 -4138 1814 -5533 2159 3823 -1693 6536 347 -2524 2850 -6173 -2107 1150 -4705
1412 -4705 4478 2512 -623 6332 -2097 -1692 1366 -6916 30 366 -3168 6101 998 588 5270 -4202
1428 -4202 -664 -359 -6713 2102 -570 -1122 6859 -624 1845 3345 -5633 425 -2250 -5456 3671
1443 3671 -1437 1300 6452 -1926 2861 791 -6025 1163 -3830 -3240 4453 -1745 3525 5035 -2612
$$ packed form
1336g426N124L270o529J0924k677l091P952j0063R05L078r599Q217o5l707J0718
1351G031o042j7N144j0802M182m6p105R877l175l73Q896q249K983J578r932O691
1367F41l182l534R926n703L153N696r098N477k318p451P958n815O22Q367p115
1382b376O149J603q327O929n865l810P697p361M661N383p042Q002k642o064O887
1397C824q295L33N952p347P692J664n516Q229o189k871N374r023M066L257n855
1412d705R183j966l135O955q429M05L058q282O946L36l534R269n103m10M682r472
1428d202L538L05o354Q815k672n52P981p483K469J500q978O058k675l206R127
1443C671n108K737N152q378M787k070o816P188m993N90P693o198N270J510p647
$$ plain form
1458 -2612 3202 -1858 -5491 1409 -4609 -638 4561 -1486 5118 2982 -2856 2819 -4194 -4263 1322
1473 1322 -4622 2045 4080 -905 5952 542 -2684 1903 -5974 -2475 977 -3895 4468 3005 -31
1488 -31 5867 -2038 -2128 516 -6859 -342 422 -2379 6245 1623 963 4761 -4257 -1390 -1124 -6627 1737
1505 1737 -75 -283 7028 180 1817 2764 -5744 -659 -2682 -5260 3406 -393 1967 6659 -1087
1520 -1087 2276 222 -6296 -92 -3791 -3055 4425 -396 3914 5292 -2049 2191 -2338 -5976 298
1535 298 -4227 -420 4884 -173 5278 3224 -2722 1683 -4621 -4865 647 -4022 2349 4695 175
1550 175 5922 634 -2987 804 -6320 -2997 769 -3104 4826 3791 685 5555 -2040 -2771 -442
1565 -442 -6931 -787 671 -1494 6398 2446 1204 4175 -4184 -2297 -1731 -6365 1272 606 421 6950
$$ packed form
1458b612N814n060l633O900o018L971N199o047O604k136n838N675p013o9N585
1473A322n944O667K035m985O857n410l226M587p877L499L452m872Q363j463l036
1488c1N898p905r0K644p375O517P64k801Q624m622o60L798r018K867K66n503Q364
1505A737j812k08P311o848J637R47q508N085k023k578Q666l799K360M692p746
1520a087L363k054o518O204l699P36P480m821M310J378p341M240m529l638O274
1535B98m525L807N304n057N451k054n946M405o304k44N512m669O371K346m520
1550A75N747n288l621L791p124L323L766l873P930j035l106M870p595p31K329
1565d42o489O144J458k165P892l952j242K971q359J887N66m634P637o66j85O529
$$ plain form
1581 6950 1003 1522 2183 -5624 -1664 -2756 -4913 3054 541 2287 6527 -489 1618 -135 -6244
1596 -6244 -842 -3454 -2754 4347 404 3883 5125 -1824 1529 -2494 -5892 -44 -3714 -201 4838
1611 4838 279 4928 2974 -2701 1122 -4417 -4637 571 -3387 2283 4554 312 5207 542 -3001
1626 -3001 464 -5608 -2835 908 -2510 4273 3622 491 4684 -1752 -2789 -380 -5895 -774 957
1641 957 -1221 5479 2249 725 3505 -3597 -2159 -1218 -5311 1165 776 183 5801 700 941 1911
1657 1911 -4782 -1240 -1938 -4084 2783 376 1534 5323 -826 1229 128 -5152 -188 -2553 -2322
1672 -2322 3766 -131 2760 4070 -1940 1438 -1646 -4620 639 -2868 -325 3907 -447 3573 2284
1687 2284 -2442 1373 -3049 -3426 1082 -2779 1483 3392 -545 3807 439 -2429 1084 -3895 -1914
$$ packed form
1581F950n947N19O61p807L960j092k157P967k513J746M240p016K107j753o109
1596f244N402k612P00P101l943L479J242o949L353m023l398N848l670L513N039
1611D838m559M649j954n675L823n539k20N208l958N670K271m242M895m665l543
1626c001L465o072K773L743l418O783o51l131M193o436j037K409n515N121J731
1641I57k178O700l230j524K780p102J438R41m093O476l89n93N618n101K41R70
1657A911o693L542o98k146O867k407J158L789o149K055j101n280M964k365K31
1672b322O088l897K891J310o010L378l084k974N259l507K543M232m354M020j289
1687B284m726L815m422l77M508l861M262J909l937M352l368k868L513m979J981
$$ plain form
1702 -1914 1172 -2373 2889 2407 -456 3641 -1296 -1930 660 -4242 -254 902 -1705 3850 1092
1717 1092 -87 3053 -2684 -999 12 -4004 1287 284 -782 4147 -266 506 2052 -3465 -13
1732 -13 -772 -3230 2311 -425 284 3799 -1313 1101 813 -3584 838 -1530 -2065 2796 -1029 1292
1748 1292 2918 -1904 1609 -418 -3108 1346 -2124 -735 2683 -1384 2152 1744 -1990 1874 -1581
1763 -1581 -2218 1480 -2451 586 2135 -1412 2729 434 -1682 1853 -2481 -1119 1240 -2502 1753
1778 1753 1251 -1166 2987 -845 -1044 1520 -3069 91 679 -2204 2614 219 -548 2840 -1880 -170
1794 -170 834 -3145 1125 -106 -1465 2984 -669 249 2214 -2425 601 -54 -2734 1771 -775 -509
1810 -509 2850 -1277 994 1290 -2570 1120 -923 -1990 2072 -1311 494 2377 -1640 1572 211
$$ packed form
1702a914L086l545N262m82k863M097m937o34K590m902L988J156k607N555k758
1717A092j179L140n737J685J011m016N291j003j066M929m413P72J546n517L452
1732a3p59k458N541k736P09L515n112K414k88m397M422k368n35M861l825K321
1748A292J626m822L513k027k690M454l470J389L418m067L536m08l734L864l455
1763a581o37L698l931L037J549l547M141k295k116L535m334J362K359l742M255
1778A753n02k417M153l832j99K564m589L160N88k883M818k395p67L388m720J710
1794a70J004l979M270j231j359M449l653R18J965m639L026o55k680M505k546K66
1810e09L359m127K271K96l860L690k043j067M062l383J805J883m017L212j361
$$ plain form
1825 211 -2359 1472 -1722 -964 2032 -1629 1513 1521 -1678 1967 -968 -1749 1479 -2280 228 1621
1841 1621 -1575 2314 474 -1333 1967 -1961 -885 1127 -2404 1307 976 -1201 2672 -574 -804
1856 -804 1570 -2582 12 595 -2115 2115 232 -587 2568 -1474 -194 888 -2772 842 -17 -1450
1872 -1450 2559 -501 116 2044 -2082 431 35 -2487 1499 -606 -523 2606 -1046 817 1201 -2332
1888 -2332 931 -815 -1827 1885 -1079 490 2225 -1438 1397 156 -2224 1254 -1576 -880 1938
1903 1938 -1376 1442 1459 -1555 1704 -951 -1724 1300 -2044 222 1609 -1337 2106 465 -1332 1647
1919 1647 -1827 -954 1049 -2087 1225 1092 -1005 2372 -475 -900 1291 -2339 -121 644 -1775 1960
1935 1960 425 -520 2283 -1336 -369 728 -2534 706 114 -1231 2405 -324 74 1819 -1967 265
$$ packed form
1825B11k570L831l194P58K996l661L142Ql199L645k935p81L228l759K508J393
1841A621l196L889j840j807L300l928J076K012l531L711l31k177L873l246k30
1856h04K374m152K594N83k710M230j883q19L155m042J280J082l660L614q59j433
1872a450M009l060O17J928m126K513l96k522L986k105Q3L129l652J863L84l533
1888b332L263j746j012L712k964J569J735l663K835j241k380L478k830O96K818
1903A938l314K818J7l014L259k655p73L024l344K266J387k946L443j641j797K979
1919A647l474Q73K003l136L312j33k097L377k847m25K191l630K218P65k419L735
1935A960j535r45K803l619R67J097l262L240n92j345L636k729L98J745l786K232
$$ plain form
1951 265 2 -2298 1391 -485 -421 2422 -965 714 1035 -2211 803 -769 -1663 1756 -942 461
1967 461 2035 -1310 1213 130 -2065 1094 -1371 -820 1783 -1170 1247 1382 -1390 1483 -774 -1608
1983 -1608 1141 -1762 86 1489 -1196 1812 542 -1195 1494 -1515 -916 953 -1881 935 944 -980
1999 -980 2087 -318 -756 1256 -2011 -145 550 -1719 1620 309 -517 2100 -1054 -187 810 -2216
2015 -2216 581 7 -1290 2027 -340 73 1794 -1573 390 145 -2088 1127 -581 -620 2059 -850
2031 -850 687 1185 -1756 833 -557 -1630 1349 -1024 122 1764 -1075 1181 458 -1626 1044 -1154
2047 -1154 -1002 1322 -1255 851 1301 -1055 1534 -295 -1280 1065 -1635 -257 1083 -1291 1487 674
2063 674 -848 1642 -1056 -750 828 -1914 511 616 -1035 1934 -62 -421 1445 -1627 -160 345
$$ packed form
1951B65k63k300L689j876O4K843l387J679L21l246L014j572q94L419k698J403
1967D61J574l345K523j083k195L159k465N51K603k953K417J35k772K873k257q34
1983a608K749k903J848J403k685L008j270j737K689l009N99J869k834K816Rj924
1999i80L067k405m38K012l267J866O95k269L339j311q26K617l154Q67R97l026
2015b216K797n74j297L317k367M13J721l367J963k45k233L215j708l9K679k909
2031h50J537M98k941K589j390j073K979k373J146J642k839K256p23k084K670k198
2047a154J52K324k577K106M50k356K589j829r85K345k700J378J340k374K778q13
2063F74j522K490k698L06J578k742K425J05j651K969j996l59J866l072J467N05
$$ plain form
2079 345 -1860 1109 82 -557 2022 -647 84 994 -1894 351 -194 -1492 1509 -341 40 1843
2095 1843 -1067 549 385 -1900 754 -705 -924 1665 -692 662 1422 -1278 874 -349 -1637 946
2111 946 -1115 -189 1552 -853 1219 742 -1262 1021 -1027 -1130 948 -1338 579 1223 -831 1566
2127 1566 1 -1050 986 -1570 -486 776 -1326 1259 712 -612 1692 -728 -652 721 -1850 217
2143 217 444 -1060 1733 135 -251 1492 -1321 -195 282 -1818 802 70 -575 1881 -390 123 1029
2160 1029 -1649 206 -192 -1481 1219 -288 -11 1739 -801 487 442 -1718 578 -630 -944 1449
2176 1449 -597 567 1354 -1091 798 -245 -1498 843 -1024 -224 1408 -781 1088 723 -1131 944
2192 944 -895 -1028 884 -1205 483 1097 -783 1374 7 -959 885 -1348 -442 746 -1175 1065
$$ packed form
2079C45k205K969j027o39K579k669P31R10k888K245n45j298L001j850L81J803
2095A843k910J616j64k285K654j459k19K589k357J354P60k700K152j223j288K583
2111I46k061R26J741k405K072m77k004K283k048j03K078k286J917O44k054K397
2127A566j565j051K036k556J084J262k102K585n47j324K304k420P6J373k571K067
2143B17K27j504K793j598l86J743k813J126M77k100K620p32o45K456k271N13R06
2160A029k678J855l98j289K700j507K77J750k540J288m5k160K296j208l14K393
2176A449k046J164P87k445J889j043j253K341j867Q00J632k189J869l65j854K075
2192I44j839j33J912k089J688O14j880K157j367r66J844k233R06J188j921K240
$$ plain form
2208 1065 653 -636 1431 -627 -669 709 -1556 176 511 -948 1457 146 -375 1271 -1146 -248
2224 -248 382 -1525 758 173 -558 1594 -396 -33 900 -1443 212 -31 -1228 1156 -205 -85 1455
2241 1455 -840 306 360 -1504 608 -426 -747 1345 -530 385 1084 -1100 603 -189 -1295 861
2257 861 -747 -157 1288 -749 804 546 -1138 787 -703 -854 944 -919 446 1004 -792 1054
2273 1054 -49 -958 797 -1055 -326 830 -932 909 578 -690 1119 -607 -666 663 -1269 230
2289 230 601 -798 1264 72 -497 1028 -1083 -244 418 -1261 758 239 -507 1397 -434 -146 738
2306 738 -1332 220 70 -1027 1117 -120 -92 1283 -810 198 308 -1364 548 -287 -634 1267 -421
2323 -421 296 971 -1028 446 -153 -1206 775 -573 -161 1223 -635 662 516 -1090 628 -622
$$ packed form
2208A065m12j289K067k058m2J378k265J732L35j459K405j311n21J646k417Q98
2224b48O30j907K283n85p31K152j990L63R33k343J655k43j197K384j361J20J540
2241A455k295J146N4j864K112j034l21K092j875R15O99k184J703p92j106K156
2257H61j608N90J445k037J553k58j684J925j490j51J798j863J365N58j796J846
2273A054j103r09J755j852P29J156j762J841l31j268J809j726n9J329j932J499
2289B30L71j399K062j192n69J525k111Q39O62j679K019n19p46J904j831K88Q84
2306G38k070J552j50j097K144j237K8J375k093J008J10j672J912q35l47J901j688
2323d21P17O75j999J474n99j053J981j348M12J384j858J297j46j606J718j250
$$ plain form
2339 -622 -842 854 -771 389 991 -693 946 -24 -951 663 -995 -341 768 -807 871 593 -584
2356 -584 1039 -547 -666 559 -1217 181 545 -682 1203 165 -392 947 -1004 -320 303 -1236
2372 -1236 630 264 -412 1362 -285 -121 685 -1296 48 -9 -1028 993 -24 -21 1298 -619 171
2389 171 276 -1344 341 -321 -645 1174 -254 381 1027 -841 371 -188 -1213 547 -590 -191 1172
2406 1172 -437 713 602 -948 527 -654 -925 659 -751 349 995 -496 969 56 -871 511
2422 511 -1040 -476 610 -763 832 680 -406 1058 -453 -656 387 -1231 18 465 -589 1169
2438 1169 309 -252 938 -870 -389 184 -1213 472 271 -326 1301 -106 -54 662 -1171 -66 -74 -1019
2456 -1019 824 8 2 1242 -480 170 254 -1254 241 -357 -640 1032 -204 377 968 -705 353 -177
$$ packed form
2339f22k20J696j625J160O02j684J639r70r27J614j658O54J109j575J678k78j177
2356e84J623j586j19J225j776J398L64j227J885j038n57J339j951O84O23j539
2372a236J866l66o76J774j647J64Q06j981J344n7j019K021j017LJ319j917P90
2389A71J05j620J685o62l24J819j428O35O46j868J212n59j025J760j137L99J363
2406A172j609J150j11j550J475j181k71J584j410J100O46j491J465r13r27J382
2422E11j551N64J086j373J595j52j086J464j511k03J043j618J249M47j054J758
2438A169q60n61J190j808M81N73j397J685k01n97J627j407N2P16j833J105qr45
2456a019J843q16oJ240j722O50Q4j508J495n98k83J672j236N81N91j673J058n30
$$ plain form
2474 -177 -1118 450 -548 -190 1052 -365 662 570 -807 474 -552 -830 578 -684 277 893 -451
2491 -451 844 98 -761 508 -860 -408 556 -696 685 577 -434 888 -363 -555 420 -1001 29
2508 29 429 -570 931 197 -320 799 -706 -274 286 -963 428 234 -386 1015 -198 -133 607 -921
2526 -921 70 95 -813 734 -48 -162 944 -539 111 310 -966 397 -153 -522 860 -353 99 676
2544 676 -752 331 -10 -794 618 -366 -185 797 -546 335 358 -766 522 -258 -496 710 -503 145
2562 145 608 -655 503 5 -639 653 -475 -140 657 -624 416 270 -657 625 -332 -386 652 -612
2580 -612 227 451 -651 579 -116 -529 632 -578 -14 556 -619 523 159 -564 609 -466 -297
2597 -297 551 -660 348 390 -541 705 -180 -431 559 -714 17 414 -629 664 133 -382 732 -519
$$ packed form
2474a77r41J568r98L58J242j417J027r2j377J281j026k78J408j262R61O16j344
2491d51J295p46q59J269j368M52R64j252J381j08j011J322j251j92R75j421J030
2508B9M00r99J501p34n17J119j505M32N60j249J391j94o20J401j213O5P40j528
2526i21R91K5r08J547p82j14J106j483O50J99j276J363n50l69J382j213M52N77
2544F76j428J083l41p84J412r84J81R82j343Q81K3j124J288p80k38J206j213O48
2562A45M63j263J158m98o44J292j128L35P97j281J040j46r27J282r57n4J038j264
2580f12Q39K24j102J230o95m13J161j210N64N70j175J142l64p23J173j075J69
2597b97Q48j211J008M2r31J246q85k51R90j273P31L97j043J293n31n15J114j251
$$ plain form
2615 -519 -221 390 -810 318 218 -452 828 -147 -178 574 -757 12 148 -742 573 14 -205 836
2633 836 -400 23 333 -855 234 -83 -536 759 -186 86 743 -566 235 39 -820 425 -301 -225
2651 -225 799 -336 355 464 -664 359 -291 -632 519 -453 131 687 -403 548 117 -632 401 -551
2669 -551 -350 499 -498 433 481 -404 622 -204 -502 374 -697 -35 428 -465 668 221 -309 624 -498
2688 -498 -282 287 -744 290 265 -344 796 -85 -172 503 -706 -27 115 -660 528 37 -170 762 -338
2707 -338 10 294 -767 204 -74 -477 651 -166 42 628 -513 200 68 -705 382 -254 -229 688 -322
2726 -322 256 415 -580 355 -169 -518 485 -387 42 560 -420 419 139 -524 436 -383 -271 480 -475 275
2746 275 345 -430 523 -126 -375 435 -511 -19 358 -500 448 114 -348 557 -344 -152 374 -586 239 181 -443
$$ packed form
2615e19K98O11j200J128j00o70J280r75l1P52j331P69J36q90J315n59k19J041
2633H36j236M23L10j188J089l17m53J295r45K72O57j309Q01j96q59J245p26P6
2651b25J024j135O91J09j128J023o50l41J151r72N84N56j090R51m31p49J033r52
2669e51K01Q49r97R31M8q85J026q26k98Q76j071O62M63q93J133m47n30R33j122
2688d98K16N69j031J034k5o09J140q81q7O75j209O79J42p75J188m91k07R32j100
2707c38L48K84j061R71k78m03J128q17K08N86j141P13j32p73J087o36K5R17j010
2726c22N78J59r95R35n24l49J003q72M29N18r80Q39k80o63R60q19J12P51r55P50
2746B75P0p75R53o49k49Q10r46M92L77q58R48l34m62R05r01J92N26r60Q25n8o24
$$ plain form
2767 -443 574 -140 -186 509 -506 97 226 -556 431 -59 -282 575 -338 9 378 -546 293 38 -445 507
2787 507 -258 -112 483 -459 208 203 -504 418 -160 -285 498 -422 79 338 -501 378 -2 -373 502 -336 -70
2808 -70 404 -488 274 134 -419 499 -207 -169 469 -449 154 225 -489 413 -94 -282 504 -355 40 356 -493
2829 -493 312 15 -405 458 -292 -102 425 -438 240 180 -459 421 -197 -263 444 -425 117 308 -433 421 -16
2850 -16 -333 437 -371 -63 338 -463 311 123 -325 506 -214 -150 369 -484 121 171 -420 453 -44 -176 496
2871 496 -359 11 215 -536 263 -15 -315 524 -199 1 407 -478 148 15 -502 368 -186 -116 513 -298
2891 -298 208 244 -483 272 -194 -357 412 -284 125 453 -316 352 40 -433 291 -369 -173 377 -320 321
2911 321 304 -304 409 -202 -351 258 -482 27 311 -300 478 120 -242 384 -410 -210 171 -506 256 194 -183
$$ packed form
2767d43J017p14m6O95j015O03J29p82R87m90k23Q57r13L47L69r24Q39k55m83R52
2787E07p65J46N95r42O67np07R22n78j25P83r20N01K59q39Q79l80l71Q75q38K66
2808g0M74q92P62j40n53R18p06L8O38r18O03P1p14R02n07j88P86q59L95L16q49
2829d93Q05k97m20Q63p50J90N27q63O78o0o39Q80o18o6P07q69N42J91p41Q54m37
2850a6l17P70q08L08M01q01P74j88m48Q31p20O4N19q53O05N0n91Q73m97j32O72
2871D96q55L70K04p51P99k78l00Q39p23K00M06q85O26j33n17Q70n54P0O29q11
2891b98N06L6p27P55m66j63P69o96M09L28p69O68l12m73P24o60J96N50o97O41
2911C21j7o08P13o11j49O09p40N09K84o11P78l58l62O26p94K00L81o77P62o2l77
$$ plain form
2932 -183 585 -81 -120 285 -551 -35 52 -424 435 74 -22 568 -231 2 135 -591 112 -69 -292 536 -46
2953 -46 112 461 -394 61 -75 -578 221 -189 -101 547 -147 246 270 -467 152 -269 -439 313 -246 157 506
2974 506 -196 351 41 -447 177 -394 -232 334 -249 349 367 -218 382 -181 -379 180 -464 -4 316 -216
2994 -216 488 181 -201 348 -402 -255 124 -491 221 221 -153 539 -56 -137 233 -531 -78 52 -401 384 92
3015 92 -54 506 -256 -59 116 -545 120 -17 -240 499 -23 56 390 -370 46 -16 -473 272 -86 -94 506 -167
3037 -167 138 214 -454 147 -163 -344 349 -178 93 406 -275 222 6 -430 222 -249 -138 375 -232 246
3057 246 237 -317 253 -171 -304 263 -296 83 322 -242 318 48 -303 267 -291 -138 279 -298 254 206 -230
3078 -230 349 -153 -228 236 -378 57 225 -267 373 31 -198 298 -322 -103 171 -365 239 130 -173 418
$$ packed form
2932a83P68o66l9M05q36N16Q7m76Q59l61r6N90p99K33J33p26P03j81k23Q28n82
2953d6J58L49q55M55j36n03P99m10Q8O48o94L93K4p37O19m21j70P52n59M03L49
2974E06p02N47l10m88O24n71J62N66n83N98J8n85O00n63j98N59o44M60L20n32
2994b16P04l07l82N49p50J47L79o15P12%l74O92n95q1L70p64M53J30m53P85k92
3015I2j46N60p62J97J75o61O65j37k23P39n22P9L34p60M16o2m57P45l58qO00o73
3037a67L05P6o68O01l10j81O93n27K71L13o81M97k16m36O52m71J11N13o07M78
3057B46rn54N70m24j33N67n59L79K39n64N60k70l51N70n58J53M17n77N52m8m36
3078b30N79n02p5M64o14M35J68m92O40l42k29M96o20K19K74n36O04j09l03N91
$$ plain form
3098 418 -139 -130 206 -413 54 112 -264 389 32 -65 364 -292 -36 102 -420 201 38 -131 459 -98 16
3119 16 244 -418 60 -37 -332 320 -49 20 412 -220 93 61 -443 119 -151 -194 374 -100 165 311 -280 144
3141 144 -107 -388 183 -213 -10 397 -120 283 169 -314 175 -256 -279 224 -246 196 336 -147 341 -22
3161 -22 -304 148 -393 -120 204 -224 330 216 -123 332 -219 -240 70 -431 40 157 -152 431 89 -70 262
3182 262 -348 -144 23 -401 200 103 -47 475 -53 -8 169 -425 -22 -45 -292 333 33 68 428 -172 49
3203 49 18 -455 75 -137 -168 380 -40 175 307 -263 89 -118 -400 126 -195 -16 373 -85 252 166 -277
3224 -277 123 -243 -297 179 -196 149 341 -112 313 20 -265 137 -332 -144 194 -204 285 238 -88 328 -147
3245 -147 -207 86 -384 5 133 -163 363 99 -58 266 -270 -127 20 -375 118 70 -87 397 -17 1 206
$$ packed form
3098D18n57RL36o19M67N8l76O53l57r7M29o56K56J38n22O21j63j69N90n57J14
3119A6K28o62M78r7k95O52l69O9L92o32L13l2n04N62k70m3N68m74K65J46n91M24
3141A44k51k81N71l96K03M07n17M03j14m83M89m31k3N03m70M42J40m83M88l63
3161b2k82M52n41K73L24m28N54j14l39M55n51k1L10n01M71J17l09N83l42j59L32
3182B62o10K04J67m24O01r7j50N22n28M5J77n94M03k3k47O25l00L5L60o00K21
3203D9l1m73N30k12l1N48m20K15J32n70L52k07k82N26l21J79L89m58L37q6m43
3224b77M00l66n4M76l75L45J92m53M25k93k85M02m69J88L38l98M89m7l26M16m75
3245a47o0K93m70L89J28k96N26k64j57L24n36J43J47l95M93m8j57M84m14J8K05
$$ plain form
3266 206 -340 -29 -36 -315 233 9 8 385 -111 86 94 -367 70 -111 -201 309 -51 121 318 -184 135 -41
3288 -41 -339 117 -184 -85 303 -97 200 209 -210 148 -169 -277 130 -240 43 270 -119 278 78 -209 160
3309 160 -260 -168 132 -231 186 204 -92 313 -50 -152 135 -315 -44 100 -180 286 106 -40 285 -166 -68
3330 -68 69 -337 69 34 -119 319 10 15 221 -257 -20 -3 -305 163 -22 -41 329 -85 62 133 -303 58
3352 58 -84 -224 240 -63 77 293 -141 136 16 -285 122 -163 -112 253 -102 166 205 -158 153 -99 -234
3373 -234 133 -182 14 232 -109 224 87 -176 152 -191 -151 139 -203 138 180 -109 246 -43 -163 132 -268
3394 -268 -36 113 -184 239 96 -63 241 -147 -87 90 -256 76 76 -102 285 -1 -21 193 -235 -27 18 -237
3416 -237 157 26 -39 276 -94 7 99 -278 37 -34 -189 222 -38 31 244 -171 53 19 -271 113 -85 -78
$$ packed form
3266B06n46L11pk79N48k24jL77m96J97Qm61M37j81r0N10l60J72J97n02L19j76
3288d1k98M56l01R9L88m00K97Rm19L58l17j08M07l70K83K27l89L97k00k87L69
3309A60m20R2L00l63M17J8k96M05l63j02K87m50K71J44k80M66j80j46L25m51R8
3330f8J37m06M06l5j53M38l09NK06m78K37J7l02M68j85j9L70m14J47P1m36L61
3352E8j42j40M64l03J40K16m34K77j20l01M07k85N1L65l55K68L9l63L11k52j35
3373b34L67l15J96K18l41L33j37k63L28l43M0K90l42L41M2k89L55k89j20K95m00
3394b68K32J49k97M23j43j59L04l88O0J77l46L32%j78L87k86k0K14m28K08M5k55
3416b37L94j31o5L15l70J01R2l77L15p1j55M11k60O9K13m15K24l4k90L84j98P
$$ plain form
3438 -78 253 -83 107 155 -201 90 -81 -214 160 -124 31 231 -103 154 58 -218 103 -155 -128 160 -133
3459 -133 124 182 -131 166 -55 -182 110 -211 -16 153 -122 202 94 -125 173 -164 -128 81 -221 84 117
3480 117 -92 246 10 -74 142 -215 -55 51 -186 173 78 -33 251 -94 -36 78 -256 20 18 -136 229 5
3502 5 -8 202 -169 -6 -2 -257 96 -39 -78 252 -56 43 136 -215 43 -67 -207 149 -70 24 229 -93 100
3525 100 59 -210 82 -123 -124 166 -87 101 176 -110 135 -32 -192 93 -155 -48 158 -103 175 107 -125 137
3547 137 -126 -144 90 -198 49 119 -103 207 17 -90 131 -196 -66 52 -192 127 72 -57 221 -49 -34
3568 -34 100 -207 8 27 -144 187 15 -16 200 -113 5 47 -220 60 -17 -95 210 -48 33 150 -171 55
3590 55 -26 -194 115 -92 -33 189 -93 97 79 -172 84 -86 -143 132 -111 50 169 -95 137 16 -146 98
$$ packed form
3438g8L31l36J90M8l56K91j71j33L74k84J55K00l34K57r6k76L21k58K7K88k93
3459a33K57N8l13K97k21j27K92l21J95J69k75L24j08k19K98l37L6K09l02L05L3
3480A17k09L38k36q4K16l57J60J06k37L59r5j11K84l45N8J14l34K76kj54L65k24
3502Ej3K10l71J63Mk55L53j35l9L30l08R9R3l51K58j10j40L56k19R4K05l22J93
3525A00m1k69K92k05jK90k53J88P5k86K45j67j60K85k48J07K06k61K78o8k32K62
3547A37k63j8K34k88K47P0k22L10j90j07K21l27J30J18k44L19n5j29K78k70J5
3568c4J34l07K15J9j71L31j72l1K16l13J18M2k67K80p7p8L05k58Q1J17l21K26
3590E5q1j68L09k07N9K22k82J90j8k51K56j70n7K75k43J61J19k64K32j21j62K44
$$ plain form
3612 98 -129 -69 122 -107 118 124 -85 162 -45 -114 97 -174 2 98 -112 166 41 -67 147 -129 -67 55
3634 55 -189 63 32 -89 184 -31 -22 123 -159 5 26 -166 111 10 -35 190 -67 18 78 -183 52 -17 -111
3657 -111 149 -34 22 172 -101 68 17 -170 95 -69 -76 154 -81 69 118 -130 91 -50 -149 100 -105 -3
3679 -3 130 -104 103 46 -120 95 -90 -91 101 -128 62 92 -92 136 -4 -87 114 -120 -10 82 -119 111 42
3702 42 -67 148 -68 -44 96 -131 48 32 -103 128 -25 -45 133 -116 9 56 -128 99 -13 -82 127 -90
3724 -90 -15 85 -135 58 29 -113 121 -48 -48 117 -108 35 58 -105 118 -21 -58 132 -94 6 75 -126 75
3747 75 11 -69 141 -61 -4 84 -127 35 11 -121 113 -33 -24 122 -91 13 43 -146 51 -34 -77 118 -55 34
3771 34 118 -102 55 -16 -132 70 -70 -26 145 -58 91 77 -109 77 -72 -85 98 -85 44 123 -50 122
$$ packed form
3612I8k27O0J91k29K25Ok09K47k07o9K11k71J76R6k10K78j25j08K14k76O2J22
3634E5k44K52l1j21K73k15RJ45k82J64K1j92K77j01m5K25k57Q5O0k61K35o9r4
3657a11K60j83N6J50k73J69n1j87K65j64pK30k35J50M9k48K21j41r9K49k05J02
3679cJ33k34K07n7j66K15j85jJ92k29J90L0j84K28j40q3K01k34J10R2k01K30o9
3702D2j09K15k16K4J40k27J79j6j35K31j53k0J78k49J25M7j84K27j12o9K09k17
3724i0P5J00k20J93k9j42K34j69%J65k25J43K3j63K23j39l7J90k26J00O9k01K01
3747G5o4q0K10k02N7Q8k11J62k4j32K34j46RJ46k13J04L0j89J97q5m3J95j73Q9
3771C4Q4k20J57p1j16K02j40M4J71k03J49j4j86J86j49j3J83j83J29P9j73J72
$$ plain form
3793 122 9 -101 51 -126 -68 63 -97 107 87 -47 119 -46 -100 18 -149 -21 59 -65 141 54 -21 104
3815 104 -98 -70 4 -136 55 53 -8 182 17 7 71 -142 -32 -31 -126 101 31 42 179 -33 10 20 -168 -11 -64
3840 -64 -87 123 6 71 135 -73 8 -59 -187 -3 -79 -31 137 -1 98 90 -106 15 -97 -139 39 -68 45 147
3864 147 -1 135 38 -95 22 -122 -83 56 -49 118 121 3 120 -29 -105 -4 -157 -39 57 -23 145 93 -4
3887 -4 103 -87 -99 -26 -158 12 53 -12 164 44 -5 59 -145 -66 -23 -124 87 53 38 161 1 7 19 -140 -18
3912 -18 -29 -61 128 34 70 135 -46 7 -34 -157 -7 -57 -23 124 16 80 82 -88 4 -66 -135 28 -48 21 131 0
3938 0 93 38 -98 6 -101 -77 65 -34 78 101 -13 84 -14 -91 9 -107 -29 63 -6 113 90 -24 66 -63 -80
3963 -80 11 -112 29 54 -17 102 26 -23 48 -110 -54 -7 -96 68 46 -3 119 -23 -23 30 -114 -10 -7 -64 106 27
$$ packed form
3793A22j13j10J52j77N8J31j60K04k0j34J66j65n4J18j67J28Q0j24K06q7p5J25
3815A04k02K8P4j40J91ko1J90j65j0O4k13J10Jr5K27p0J1J37k12M3J0j88J57n3
3840f4k3K10j17O5O4k08Q1o7j28J84p6M8J68j38R9qj96J21j12m2J78j07J13J02
3864A47j48J36r7j33J17j44L9J39j05J67Lj18J17j49p6J01j53J18R6q0J68n2r7
3887dJ07j90j2P3j32J70M1o5J76j20m9O4k04P9M3j01K11l4j5J23j60OJ2j59J22
3912a8j1l2J89r4L6O5j81N3m1j23J50n0L4J47j08O4Kj70R2p0o9J63p6O9J10j31
3938@R3n5j36J04j07K4J42r9J12K3j14R7r8p7J00j16P8R2o9J19k3j14R0j29j7
3963h0R1j23J41K5p1J19p6m9P1j58N6M7q9J64k2m9J22j42%N3j44J04Ln7J70p9
$$ plain form
3989 27 26 102 -48 -4 1 -109 30 -5 -12 113 8 47 65 -67 9 -28 -85 55 -8 18 107 -23 40 21 -101 17 -54
4016 -54 -52 66 -25 54 76 -52 50 -16 -88 20 -71 -16 76 -15 85 69 -39 47 -44 -62 40 -46 30 76 -6 96 26
4043 26 -46 30 -79 -39 35 -53 66 68 -7 81 -41 -53 8 -105 -2 23 -37 92 40 -1 64 -76 -44 -6 -99 24 22
4070 22 3 105 19 8 44 -94 -17 -19 -73 72 21 37 131 -7 12 11 -111 -4 -24 -40 97 20 55 92 -39 8 -46
4097 -46 -124 -3 -48 -10 98 19 76 61 -72 -6 -64 -85 13 -42 41 98 9 87 30 -64 2 -91 -59 36 -26 81 100 23
4125 23 81 -13 -72 -14 -108 -30 35 -8 105 74 13 69 -64 -76 -40 -110 4 36 15 122 39 20 38 -108 -64 -52 -91 41
4153 41 57 44 137 24 17 7 -116 -33 -56 -56 90 53 82 126 -7 7 -35 -131 -27 -59 -17 98 41 89 88 -50 -16 -87
4181 -87 -123 -16 -48 27 106 40 97 41 -66 -12 -88 -94 16 -30 78 110 43 98 10 -62 -21 -110 -42 40 -2 112 99 23
$$ packed form
3989B7jP6j50M4Nj10J39l5pJ25j05L9J8j32P6l7n7J40o3K6Q9j30O3j9j22J18p1
4016e4KJ18r1P9K2j28J02o6p2J08r1N5R2r1J00j6j08Q6r1j8J02q6P6M6q2J02p0
4043B6p2P6j09M0P4q8J19Kp5Q8j22j2O1j13J03K5o0J29n2m1O5j40L2L8r3J23k
4070B2j9J02q6j1L6j38P7kn4J45n1J6R4j38J9jj22J07k0j6J37p7L5L7j31M7n4
4097d6p8J21m5L8J08p9N7j5j33O6n8k1R8n5Q3N7q9P8n7r4O6r3L2R5o2J07J9p7
4125B3N8r4n9N8r4P8O5m3J13l1o1N6j33j2L6p0J14L2k1J07q3j9J8j46M4J2l9J32
4153D1J6j3R3j13pj0j23Q3k3%J46l7K9M4j33J4m2r6J04l2M2J15n7M8jj38L4p1
4181h7l6J07l2P5P9o6N7n6j07N4p6oJ10m6J08L2o7N5q8p2M1q9O8Q2m2J14j3p6
$$ plain form
4209 23 75 -42 -64 -36 -113 -5 32 31 147 53 19 51 -77 -60 -49 -95 38 31 41 106 25 16 11 -109 -50 -58 -71 64 43
4238 43 68 113 3 11 -31 -114 -28 -43 -14 104 51 88 92 -22 4 -51 -99 -15 -33 21 96 33 80 40 -41 -16 -89 -81 0 -29
4268 -29 55 81 16 61 3 -66 -19 -77 -38 16 0 82 82 24 68 -32 -47 -13 -84 -11 34 19 108 54 23 40 -45 -40 -43 -70 27
4299 27 24 27 92 15 14 15 -79 -29 -29 -49 51 25 36 73 -12 -1 -16 -90 -23 -32 -17 68 21 53 60 -33 5 -25 -70 2 -24 14 66
4332 66 19 63 44 -35 14 -52 -48 12 -7 38 66 15 51 4 -47 -20 -55 -28 13 -13 52 47 12 34 -31 -47 -12 -51 -13 23 13
4363 13 70 38 3 30 -49 -23 -6 -32 28 33 23 85 19 15 13 -52 -21 -24 -22 50 32 27 51 -6 -13 -20 -61 -23 -18 -10 49 13 34 36 -38 -8
4399 -8 -45 -60 2 -15 10 65 28 49 21 -33 -6 -31 -36 22 4 46 68 22 34 -13 -46 -14 -47 -18 24 7 55 56 4 14 -25 -47
4431 -47 -34 -40 -8 21 17 55 26 -13 0 -59 -42 -27 -44 25 38 29 60 22 -1 -20 -60 -24 -11 -2 53 41 47 59 0 -7 -18 -64 -19
$$ packed form
4209B3N2j17k2K8p7J08L7jJ16r4l4L2j28J7J1m6J33pJ0O5q1rnj20N9qj3J35k1
4238D3K5M5j10Qm2q3Q6j5K9J18n3L7Mj14K6n5m8Q4j8N4P5o3M7m0q1K5p3QQ1k9
4268b9Q4K6o5M5n8o9M7n8L9N4j6Q2%n8M4j00j5L4p1P3M5j5Q9n4l1J7q5Nlk7R7
4299B7lLO5p7jJr4N0%k0J00k6J1L7q5J1j5p4O7rJ5Q5m7L2Pr3L8l0m5P2k6L8N2
4332F6m7M4j9p9M9o6MO0j9M5K8n1L6m7n1K7l5K7M1k6O5nl5K2o5j6L5l9L8L6j0
4363A3N7l2l5K7p9K6J7k6O0Nj0O2o6mko5L1lKP2j8nK4n7ppm1L8NQN9l6K1Kp4L0
4399hl7j5O2j7K5N5l7K1k8n4K7k5nN8j8M2K2m6J2m7l3L2l3K9M2j7M8Jn2J0l9k2
4431d7J3oL2K9mL8k9l9J3n9J7J5j7O9J3rL1l8k3j9m0L6J3RN5j2OJ2n9pj1m6M5
$$ plain form
4464 -19 -1 18 62 38 51 28 -24 -23 -52 -57 1 -8 19 65 34 28 4 -47 -38 -68 -57 9 7 51 63 20 30 -15 -47 -30 -54 -15 33
4497 33 16 68 66 19 27 -29 -38 -33 -35 11 54 43 72 39 1 -5 -57 -62 -34 -43 11 32 28 66 14 -14 -26 -69 -43 -35 -25 34 41 44 50 -9 -12
4534 -12 -35 -62 -16 -13 12 66 51 39 45 -18 -33 -42 -45 -7 5 30 64 40 37 18 -41 -30 -52 -64 7 2 25 48 20 22 -9 -61 -36 -45
4568 -45 -30 12 8 49 46 14 9 -11 -35 -26 -39 0 33 37 49 44 9 4 -25 -36 -10 -26 16 26 17 59 23 1 -8 -50 -37 -20 -22 19 11 21
4604 21 43 2 -3 -16 -50 -13 -22 -6 36 30 20 33 -1 -7 -15 -37 -4 5 10 54 16 34 24 -3 9 -5 -28 21 0 19 44 8 24 19
4638 19 -16 -3 -25 -23 7 -6 28 21 -3 21 -3 -20 5 -21 -10 12 -8 24 7 5 25 -6 -3 1 -18 3 11 1 31 30 15 32 -18 13
4672 13 -3 -13 7 -7 2 27 3 28 10 -22 -2 -10 -21 2 -5 -1 25 -3 21 6 -7 -6 -25 -16 0 -15 5 18 -7 28 7 -17 2
4705 2 -19 -8 21 1 28 27 15 34 0 -4 1 -14 -1 6 -4 36 14 7 23 -14 -2 -3 -31 -7 -7 -1 20 5 18 2 -27 -16 -18 -27 19 7
$$ packed form
4464a9J8J9M4k4J3k3n2Jk9nN8rK7M6l1ok4n1Rl0J1O6kM4J2m3J0m5l2J7k4L9M8
4497C3j7N2km7Qn6rNkM6M3j1K9l3l8on2nK8rN4K1mL8n2k8j2m3K6QJ0N9PLOn9l
4534a2k3k7M6LK5N4j5j2Oo3j5rlL8J2K5L4k4lj9n9J1k2j2P1nK3K3k8Kl1n2K5r
4568d5J5M2mM1ll2nk0k4Rj3L9L3MJ2nl5nk9j1K6j6M2J0rM2l6k2rm2J3J7kM1qJ0
4604B1K2m1nj3l4L7rJ6M2oj0J3l4oqk2L3RNM4l8J8j0k7J2j4k3M9k1J9K5l6J6n
4638A9l5J3k2KL0j3L4pk4K4k4j7K5k6J1K2k0L2j7kK0l1LMj9K1Qj0L0jj5J7n0L1
4672A3j6j0K0j4RK5k4K5j8l2K0qj1K3pMK6k8K4j5j3Jj9RJ6j5K0J3k5L5k1k4J9
4705Bk1J1K9k0K7jj2J9l4mNj5J3Pj0M0k2pJ6l7J2jk8K4%OK1j5J3j6k9J1krM6j2
$$ plain form
4741 7 16 28 11 5 8 -23 -5 -9 -8 19 10 29 31 7 22 -4 -24 4 -18 0 23 8 29 21 7 2 -31 -9 -16 -25 6 18 7 26 -5 -13 4
4778 4 -28 -16 -7 -19 18 15 24 23 0 -5 8 -21 0 14 6 37 22 23 30 2 7 2 -21 12 7 6 24 -2 3 20 -32 -12 -16 -16 10 -11 17 23 7
4817 7 9 -12 -25 -3 -20 -16 21 3 18 35 -4 14 -10 -11 17 -12 12 19 -3 25 14 1 20 -10 0 6 -16 15 16 2 26 -4 -8 4
4851 4 -19 -10 0 -15 11 9 8 12 -14 -13 -23 -33 6 2 1 13 13 17 22 -14 -10 -9 -14 14 7 25 24 7 15 7 -7 4 8 0 21 5 22 32 -5 13
4891 13 7 -20 -15 -26 2 8 -3 17 7 -10 -3 -13 -24 -2 -20 7 20 7 24 6 -3 4 -15 -1 10 -8 18 30 7 23 -4 -2 -9 -13 6
4926 6 10 12 37 14 10 17 -9 -21 -14 -21 2 7 8 17 -2 0 1 -28 -17 -8 -14 12 6 12 38 0 4 -4 -9 -2 -12 -3 22 10 21 23 6 11 -4 -17 -2 3
4968 3 8 28 13 36 11 -1 -1 -21 -17 -11 -16 4 20 2 3 -1 -21 -24 -34 -14 -11 -1 14 21 13 10 -12 -10 -8 -18 7 17 3 44 19 19 15 -4 -8
5007 -8 -15 -15 -1 2 25 32 17 19 1 -10 -11 -20 -15 1 9 8 21 -4 10 -13 -30 -16 -18 -4 12 13 29 32 4 8 -26 -21 0 -13 27 12 21 35 19
$$ packed form
4741GRJ2j7oLl1J8mJK7rJ9Kk4J5k6k0K8k2J8K3j5K1qj4nl3K2prL1J2j1J9l1qJ7
4778Dl2J2Rj2L7lRjk3nJ3k9K1J4qL1j5JPk8Nnk3L3njJ8k6NJ7n2K0m%K6k1K8Oj6
4817GKk1j3K2j7ML7j8J5J7l9J8k4jK8k9K4Pk2K8j1j3J9l0J0Ok2L1Jj4K4l0mJ2
4851Dk3RJ0j5K6kjMk6Jj0j0L9mjJ2%MNl6MJnK8pJ8jj7Qqj4J1MqK1j6J7J0l7J8
4891A3ok7Nj1K8Oj1K0j0j7Pj0j1K2j8K7J3j3J7j8rPj9J4J1j8K6J2k3J6k7KpmJ9
4926FMKK5k3mPk6j2PpK3NJRj9KJk9J1RoK6oOK6l8MqnPj0RK5j2J1Kj7Nj5j3J5N
4968CNK0j5K3k5j2%k0MOnK0J6j8Jmk0lj0K0LJ0J5Pqlk2KKj0K5J0j4M1k5%mj9m
5007hp%J4LK3Pj5Kj8j1jrNJ6QjJ3k5J4k3j7J4kJ4J6JJ6Lk8Ml4NK1j3M0j5RJ4j6
$$ plain form
5046 19 10 5 -17 -6 1 -9 23 29 32 39 6 -1 -12 -19 -15 4 -1 18 3 6 15 -13 -12 -20 -36 -20 -3 -6 20 10 15 9 -14 -22 -20 -13 -9 0 20 41 19
5087 19 14 8 -6 -2 -10 -13 5 19 26 20 -3 15 -12 -24 -19 -16 -1 8 1 11 13 -6 -11 -25 -29 -22 -26 -5 11 7 27 4 -4 4 -23 -19 -7 -6 16 16 22 32
5129 32 7 6 0 -24 -4 2 8 19 14 18 6 -8 -16 -26 -28 -10 0 -6 20 8 15 2 -33 -30 -27 -28 -11 -9 7 11 6 2 -12 -21 -15 -22 -15 8 14 12 19 2
5171 2 10 -8 -18 5 -11 5 20 9 20 14 -4 4 -26 -19 -13 -23 -2 21 -5 21 3 -11 -10 -26 -17 -20 -16 11 6 7 9 -13 -16 -17 -20 -15 -1 7 27
5210 27 15 9 33 -11 1 -13 -13 10 -1 -4 20 22 19 2 -13 -3 -12 -23 0 1 9 16 -1 -1 -21 -27 -11 -20 -4 8 9 23 8 -14 1 -25 -27
5247 -27 6 -8 15 16 25 33 11 -6 0 2 -15 1 3 24 35 13 33 4 -4 -2 -16 -14 -1 0 17 7 7 2 -12 -18 -16 -32 -4 6 5 21 2 21
5285 21 3 -17 -12 -10 -12 2 3 17 27 7 17 7 -23 -9 -7 -12 11 22 25 27 10 12 -6 -23 -10 -17 -9 16 13 27 11 -13 -12 -25 -27 -9 -18 7
5323 7 17 9 16 10 -27 -8 -23 -20 -8 -2 25 26 9 29 8 -12 -6 -28 -1 3 15 33 28 21 32 5 -22 -9 -31 -10 -1 16 27 13 6 9 -24
$$ packed form
5046A9rnk2J1Pj0L2OLPl3pj1pMJ9nJ9j5LRk8Jqj6J6J7lK6j0Nok3qKPMRK0K1k2
5087A9noj4MqlJ8J4Pok3J8k7j2NLJ5RpJ0Kj9nj4mPmK1J6mK0k3qQk7MJ2JK2%OJ0
5129C2k5jok4K0OOJ1nMj2j4qj0kJ8J0oK6j2Pj3l5LLjJ7KJ6Mnmj4rOpPK3OkPj7
5171BQj8j0K3j6J6J5j1J1oj8Ql0POj0K1K3k6K6j8j4Jj6RlMK7nJKk2ljlNJ4QK0
5210B7j2oK4m4J2j4%K3j1lK4Klj7j5J0rj1K3JQPj7%k0oJ6rJ6J2JJ4j5k2J5k6k
5247b7L3j4K3JRQk2j7OKj7J6KK1J1k2K0k9qKj4KJ3JJ7j0%nj4oKj6K8J0jJ6j9J9
5285B1j8k0NKkJ4JJ4J0k0J0j0l0J4KnK3J1LKj7Kj8j7J3pQK5lJ4j6k4Jj3kJ8rK5
5323GJ0qPol7J9j5LJ2OK7Jj7K0k1k0Ok2K7MJ2J8npJ1k7k7J3k2K1RJ7J1j4pLl3
$$ plain form
5360 -24 -21 -22 -31 -6 -6 9 30 4 3 -22 -24 -15 -26 -24 20 20 28 35 18 2 -2 -33 -12 -8 -1 12 16 31 28 -1 8 -27 -25 2 -23 6 12 12 23 1
5400 1 -17 -19 -36 -31 -12 -1 15 5 11 21 -9 -33 -19 -36 -23 -3 -9 27 20 13 20 -6 -10 -10 -26 3 14 13 32 13 17 2 -16 -8 -13 -34 15
5437 15 6 14 32 7 5 -9 -27 -19 -26 -29 16 4 2 28 7 0 -7 -38 -8 -5 0 12 13 27 27 0 20 -2 -17 17 -9 11 32 14 39 10 6
5474 6 6 -23 -16 7 5 24 27 12 25 -9 -9 0 -34 -22 14 -5 24 13 -7 18 -10 -15 -10 -21 -5 -3 5 42 15 4 5 -4 -15 -8 -15 15 7 9 30
5513 30 13 20 24 -11 -1 -1 -7 28 7 24 23 -6 2 -7 -26 -9 -14 -1 8 -10 3 10 -10 10 -21 -22 9 -7 9 21 -5 25 4 -8 18 -16
5549 -16 -6 18 -1 31 38 20 28 6 -5 4 -14 -3 15 1 25 10 7 20 -18 -18 -8 -23 2 -6 -13 28 -2 -7 8 -24 -10 -6 -18 16 10
5584 10 3 22 2 13 2 -13 13 -12 -3 31 11 39 32 -5 0 3 -24 7 1 4 22 4 17 16 -14 -1 -9 -15 -5 -4 13 13 -9 6 6 -18 3
5621 3 -2 -7 14 -24 21 14 7 17 -9 -4 10 -8 8 22 24 29 20 15 16 -1 -3 9 -10 21 17 20 23 15 0 3 -21 -1 -4 -24 7 3 8 8 -4 0 -4 -32
$$ packed form
5360b4LjrK5%J5K1k6jk5kRj1KM4%QPj7j6ml1K1MPJ3MJ5lk9Rl5KK7k5K9O%J1k2
5400Aj8kj7NJ9J1J6j0OJ0l0k4J4j7J3K0oL6ppPk6m%j6K9J1jJ9j9Mj5j8Qnk1M9
5437A5rQJ8k5kj4j8QplM5j2kK6k1ppl1L0LNJ2JJ4%k7K0k2j5L4k6K0K1j8K5k9m
5474F%k9PK3kJ9Lj5J3l4%Rl4J2L6j9K9j1k0K5k8nNj1J6KQL7k7j1Jrj1PpL0qKK1
5513C0j7PMl5J0%oL5k1J7jk9Qrj9J7nJ3Rj8J3Pk0K0l1jL1j6J6J2k6L0k1j2K6l4
5549a6J0K4j9L2Pj8Qk2j1Rj8J1J8j4K4j5lJ3l8%J0j5K5qpM1l0nJ5l2J4Mj2L4o
5584A0pJ9k0J1j1j5K6k5RL4k0K8pl7NLk7L1oLJ8j8J3jl0J3qoJ0JJ7%k2J5%k4K1
5621CnnK1l8M5ppJ0k6NJ4j8J6J4KNrnJj7kJ2j9L1mLLqj5Lk4K0lk0L1mN%j2Mmk8
$$ plain form
5663 -32 1 -10 -5 25 9 6 19 -18 13 1 -22 8 8 11 33 2 24 25 -3 -1 -8 0 7 6 17 35 -1 16 0 -23 6 -23 -10 4 -1 8
5699 8 16 -4 16 -12 -19 -5 -14 -7 12 2 20 3 5 14 -12 -9 4 -22 21 20 14 44 24 33 29 -5 -2 6 -3 29 17 12 31 10 6 8 -27 -4 -9 -7
5739 -7 24 1 6 14 -14 5 -20 -28 -7 -16 -3 26 0 13 17 -7 7 -3 -21 8 0 12 34 20 28 17 -14 13 -16 -7 13 1 29 23 7
5774 7 21 -2 -24 -1 -14 -1 6 -15 16 0 0 16 -19 -3 -5 -23 6 2 9 32 16 3 11 -17 -6 2 -13 16 6 11 33 12 10 4 -3 0 -1
5811 -1 -7 24 6 16 18 -13 4 -4 -25 -3 -2 -9 15 -14 6 15 -14 -4 -16 -24 0 -19 0 27 -9 17 7 -6 12 -4 2 12 7 15 23 13
5847 13 28 7 3 14 -15 1 21 -2 26 18 1 31 -9 -1 -3 -28 -5 7 -2 11 13 6 11 -21 -17 -12 -20 6 -15 0 25 4 13 25 -13 -2
5883 -2 -8 1 16 4 8 33 -10 2 11 -5 14 -2 3 17 3 17 23 -18 8 -7 -32 -1 -14 -10 12 -17 5 0 -27 6 -21 -27 -1 -17 -2
5918 -2 1 -14 7 -5 -9 11 -11 -1 9 2 14 23 -1 13 5 -3 11 -10 4 16 -17 28 0 -2 18 -18 -7 0 -30 -4 -7 -15 15 -13 -4 -1 -21
$$ packed form
5663c2L3j1NL0j6lJ3l7L1j2k3L0%LK2l1K2Jk8KpQPjJ1J8l6J7j6k3K9k9J3J4nR
5699HQk0K0k8pJ4rPJ9j0J8j7KRk6LJ3k6M3joL0k0Rml4LQrL2j2nJ9k1mKl5K3nK
5739gL1k3NQk8J9k5qK1rJ3K9k6J3Mk4J4j0j8K9qJ2K2j4Qj1l1K7k9RK0j2K8oj6
5774GJ4k3k2K3j3J3Pk1L1j6%J6l5J6kj8K9mPK3j6j3Qk8J1Qj5K9j0NK2k1kopLj
5811aoL1j8J0Kl1J7qk1K2JpK4k9K0Rk9J0j2qK4j9J9K7l6K6j0j3J8j6OJ0nQQj0
5847A3J5k1mJ1k9J6K0k3K8qj7L0m0Qkk5K3J2rJ3KpNl2MNqK6k1J5K5k1RJ2l8J1
5883boRJ5j2MK5m3J2Rj6J9j6NJ4j4J4Om1K6j5k5L1j3MK2k9K2nk7L3k7oK6j6J5
5918bLj5K1j2mK0k2J0J0pJ2Rk4J4qqJ4k1J4J2l3M5k8kK0l6J1Pl0K6lqL0k8RLk0
$$ plain form
5955 -21 -6 -5 -18 9 1 4 12 -10 -1 14 -10 17 -12 -8 22 5 13 31 -8 18 18 -9 17 -10 6 15 -11 2 5 -21 15 -11 -16 -6 -12 -10 -2
5992 -2 -9 0 -4 -21 -5 -18 -11 12 -15 8 14 -13 3 0 -12 7 -14 6 22 4 35 13 4 22 -3 4 20 0 12 13 -3 22 15 -4 17 -17
6028 -17 3 8 -27 9 3 1 8 -17 -9 4 -23 3 -10 -5 14 8 -2 13 -22 -16 -12 -18 8 -10 1 21 -6 21 28 -18 11 -7 -4 14 -6 7
6064 7 15 2 15 12 -5 7 -12 -4 10 -11 4 15 -8 7 -9 -24 -2 -22 -3 1 -13 21 12 -14 9 -15 -12 6 -21 6 6 0 27 9 0
6099 0 9 -9 -2 10 -1 11 9 7 25 -7 6 4 -13 -5 -2 -21 11 -6 1 13 -8 -1 -15 -18 -11 -10 -14 16 2 2 11 -10 13 -7 -14 1 -17 7 21
6138 21 4 23 11 -7 16 2 5 17 -10 12 15 -2 11 2 -8 -1 -17 7 9 -17 4 4 -1 12 -16 -20 -3 -34 1 -3 -15 17 0 2 17
6173 17 -9 1 2 -20 3 6 2 26 14 14 15 -2 7 5 -7 22 8 15 33 0 13 6 -25 5 -26 -16 8 -6 9 10 -17 1 -10 -32 -2
6208 -2 -26 -10 -10 -3 14 4 -11 21 -15 -11 5 -14 9 18 6 21 17 -5 16 -3 2 9 -11 22 11 5 15 2 -2 0 -23 0 6 -22 15 6 -6
$$ packed form
5955b1J5Jj3K7qLQk2RJ5k4K7k9ML0j7QJ8l9K6%k7K6k7J6Rk6J3Lk6L6k6nJ0oKQ
5992bpRmj7J6j3PK3k7K3Ok7J6lj2J9k1K0J6j8L1k2rJ8k5PJ6k0J2Jj6K5pj9K1l4
6028a7K0Nl5L6okPk5QJ3k7K6j3NJ9oj0J5l5OMoK6j8J1K0k7K7Pm6K9j8LJ8k0J3
6064GQj3J3lj7J2j9QJ4k1J5J1k3J5j6j5K2k0J9Mj4L4rk6K3k4LJ8k7K7%oK7j8r
6099@Rj8PJ2j1J2kkJ8l2J3kj7QLj9L2j7PJ2k1Pj4lPJmL0j4%Rk1K3k0pJ5j8K4J4
6138B1j7J9j2j8K3j4LJ2k7K2Lj7J3rj0Pj6K4Kk6K1%nJ3k8mJ7l1L5mj2L2j7KJ5
6173A7k6J0Jk2K3LmK4j2%Jj7Rkj2K9j4PJ8l3J3pl1L0l1J0K4j4J5Jk7J8j1k2L0
6208bk4J6%PJ7j0j5L2l6MJ6j9K3Rj2J5mk2K1j9NPk0L3j1oJ0j3mKk3K3Ok8L7rj2
$$ plain form
6245 -6 11 -17 -9 -7 -19 -2 -2 -12 17 4 3 13 -8 1 -22 -18 4 0 14 25 3 18 6 -17 26 -8 -17 21 6 12 25 -3 20 -3 -22
6280 -22 3 -16 -6 11 -15 7 7 -14 4 -15 -12 0 -23 -9 12 6 22 1 -11 23 -8 1 13 -11 5 18 5 29 -5 -9 7 -4 2
6313 2 12 -15 17 6 16 29 -8 2 3 -19 -4 -8 -20 6 -4 -7 4 -23 -2 -7 -20 -3 -20 2 17 -8 6 10 -22 9 -8 -9 21 1
6347 1 11 26 6 8 5 -19 6 -9 3 16 6 13 13 -8 14 -9 -16 8 -15 -2 1 0 27 -1 -11 -1 -19 -12 2 -10 -2 11 -9 3 10 -13
6383 -13 10 -20 2 18 -14 23 11 20 21 11 3 10 2 13 7 -4 31 1 16 30 -6 -1 -7 -9 3 6 1 -5 -3 2 11 -25 -3 -18 -33 4 -8 0
6421 0 22 -7 4 -6 -13 12 -8 -8 26 6 14 28 2 16 3 -10 11 -7 3 20 -16 19 20 -4 1 -12 -4 4 -22 21 15 -4 9 -7 -7
6456 -7 2 -30 -13 3 -13 0 -6 -8 15 -3 -12 4 -16 -6 -4 -5 22 4 0 26 -12 -6 13 -18 14 3 11 30 3 1 23 -11 8 -3 -19 19
6492 19 -8 9 21 -9 9 -7 -33 -7 -13 -21 11 -3 3 8 -11 0 -16 -10 1 -18 6 21 -7 26 21 1 17 -12 -3 21 -10 26 21 4
$$ packed form
6245fJ7k8QKj2J7%j0K9j3jJ0k1Rk3MK2mJ4J1k2J5j2k3M3l4rL8j5OJ3k8K3k3j9
6280b2K5j9J0J7k6K2%k1J8j9LJ2k3J4K1oJ6k1j2L4l1RJ2k4J6J3j3K4l4mJ6j1O
6313BJ0k7L2j1J0J3l7J0Jk2J5mj2K6j0lJ1k7K1nj3J7j7K2J5k5J4Ml2L1j7jL0k0
6347AJ0J5k0Klk4K5j5J2J3j0P%k1K2k3pK4k3J3LjK7k8j0J0j8PJ4j2QJ3k0J2Pk3
6383a3K3l0K2J6l2L7j2RJj0qPqJ1oj1L5l0J5J4l6NokJ2LnoKNRl6K2j5j5L7j2Q
6421@K2k9J1j0pK5k0%L4k0QJ4k6J4j3j3K1j8J0J7l6L5Jk4Nj3QQk6M3oj9J3j6%
6456gRl2J7J6j6J3okK3j8rJ6k0J0KjK7j8mK6l8OJ9l1L2j1QJ9k7kK2l4J9j1j6L8
6492A9k7J7J2l0J8j6k6K6oqL2j4ONj9J1j6OJ1j9K4J5k8L3nk0J6k9RK4l1L6nj7
$$ plain form
6526 4 29 11 -7 19 -9 -9 -3 -9 7 7 1 13 -2 -14 1 -27 -6 -6 -19 17 -3 7 9 -11 -5 1 -21 13 4 2 24 -2 8 22 -14 13
6562 13 9 -19 21 7 26 38 12 17 8 -19 9 -6 -6 15 1 5 13 -13 0 3 -28 5 -21 -6 23 -14 24 17 -9 13 -8 -13 12 -9 -2
6597 -2 25 -1 22 4 -4 17 -6 -1 11 -7 28 12 -4 33 0 -1 14 -10 2 2 -1 8 6 -9 9 -14 -16 -5 -32 -9 4 -2 18 -3 -8 15
6633 15 -31 7 -6 -9 18 -6 12 28 -14 15 7 -7 9 -3 -8 22 11 21 19 1 24 6 -8 15 -11 2 16 -8 9 11 -18 -2 -7
6666 -7 -28 -5 -22 -11 14 -13 9 2 -14 3 -18 -17 7 -9 8 16 -3 32 6 -6 6 -21 1 13 -4 22 3 9 31 -6 -1 14 -22
6699 -22 -2 6 -4 26 -11 1 10 -25 2 -15 -31 5 -8 -3 15 -7 -4 1 -25 5 -8 -16 20 -3 5 28 3 17 5 -11 15 6 9 12 9 15
6735 15 17 3 10 -4 -5 5 -5 9 4 -5 6 0 -16 11 -15 -8 3 -22 -5 -6 -19 -2 -6 -23 4 -17 -15 2 -16 13 4 -8 9 -10 -11 15
6771 15 -12 10 18 6 21 1 4 6 -4 -1 7 -14 25 -3 -7 16 -13 -5 0 -22 0 -6 -12 18 -14 -11 9 -20 -10 -5 -15 11 -7 -3 20 -3 3
$$ packed form
6526DK5j8j8K6k8%OoJ6%oJ2j5j2J5k8K1%j3L6k0J0Kk0OOk2L4rkK2k6J0J4l6K7
6562A3mk8M0j4J9J2k6Nrk7K8j5%K1j4MQk6J3Ll1L3k6J5K9l7L8pk6K2k1nK5k1P
6597bK7k6K3j8qK1k3NJ2j8L5j6j6L7l3jJ5k4J2%lRkj5J8k3kJ1k7K3J3oK0k1nK3
6633A5m6L8j3lK7k4J8J6m2K9qj4J6j2nL0j1J0kj8K3j8j4K3k6J3J4k4J7Kk9J6n
6666gk1K3j7J1K5k7K2pj6J7k1JK4j6J7Qj9L5k6j2J2k7K2J2j7K6j9OK2l7NJ5l6
6699b2K0Qj0L0l7J2Rl5K7j7j6L6j3NJ8k2LNk6L0j3qL6k3QK3k5J4j2j6K6rLLlO
6735A5Kj4Pj4jJ0j0J4nrJ1oj6K7k6PJ1k5J7jj3J7mj7K7k1KJ7j8K9rj2J7j9jK6
6771A5k7K2Qj2J5k0LKj0LQk1L9k8mK3k9QNk2K2ooL0l2LK0k9J0Nj0K6j8MK3k3O
$$ plain form
6808 3 12 -18 2 -7 -5 18 -7 6 20 -7 16 6 1 21 -1 -1 11 -11 9 11 -14 10 -8 -18 2 -10 -8 1 -17 11 6 -16 -1 -17 -4
6843 -4 1 -21 10 14 -2 13 6 -2 10 -8 1 22 1 29 14 10 33 -14 7 16 -11 19 2 0 22 14 -1 13 -6 -2 -2 -28 6 -8 1 15 -7
6880 -7 -5 5 -17 -7 -6 -21 6 -17 6 21 3 3 -3 -8 17 5 11 30 3 14 15 3 18 -4 -3 11 4 9 21 -10 10 6 -8 18 -22 -10
6916 -10 -2 -24 -5 8 -18 10 1 -7 17 -10 -12 -2 -17 12 2 0 12 3 9 16 -11 10 -6 -4 30 9 16 29 0 12 14 -3 19 8 4 25
6952 25 10 13 14 -13 12 -7 -13 14 -8 -4 17 -4 -6 4 -21 9 -21 -21 17 -15 8 19 3 11 2 -2 11 5 3 12 1 27 13 4 28 0 4
6989 4 14 -4 10 12 -8 16 11 -8 13 -16 0 4 -14 8 -6 -8 24 -11 -1 11 -17 -1 -6 -11 23 7 6 16 0 7 17 -5 20 18 4
7024 4 18 5 24 25 0 18 15 -7 21 4 12 21 -8 18 20 -13 9 -1 -13 0 -13 -4 3 -10 5 -8 -16 -5 -15 -4 11 0 0 6 -6 6
7060 6 6 -2 14 -7 8 11 4 35 17 3 30 5 6 18 -6 6 18 -1 17 4 0 10 -1 -5 8 -21 8 -9 -11 9 -20 -4 4 -15 3
$$ packed form
6808CRl0K0rKK3k5J3J4k7K3j0nK0k2%J2k2K0Kk5K4j8j0K0j2KRj8K8nk2J5j6J3
6843dNk2L1Mj6J5pqJ2j8RK1k1K8j5mK3m7K1Rk7L0j7kK2qj5J4j9M%k6L4j4RJ4k2
6880gKJ0k2J0Jj5K7k3K3J5j8%onK5j2OJ9k7J1Jj2J5k2JJ4pNJ2l1K0mj4K6m0J2
6916a0Qk2J9J3k6K8rqK4k7kJ0j5K9j0kJ2rOPk7K1j6KL4k1PJ3k9J2Kj7K2j1mK1
6952B5j5LJk7K5j9oK7k2MK1k1kJ0k5L0l0%L8l2K3J1j6QrmJ3okRj1K6j4rK4k8M
6989DJ0j8J4Kk0K4nj9K1k9J6Mj8K2j4kL2l5J0J2k8J6nnL4j6jJ0j6PJ0k2K5kj4
7024DJ4j3J9Jk5J8lk2K8j7QRk9K6Kl3K2j0j2J3j3RPj3J5j3qJ1j0J1J5j1%Oj2J2
7060F%qJ6k1J5LpL1j8j4K7k5JJ2k4J2J2j9J8j3mJ0j1mJ3k9K9j7kK0k9J6Qj9J8
$$ plain form
7095 3 -1 -12 9 -12 -4 7 -3 0 -1 -7 13 -2 5 20 -3 20 11 -10 14 14 -6 19 1 11 17 -7 -3 3 -5 2 -11 0 2 -9 5 -7 -16 11
7133 11 -12 -22 3 -20 -13 -6 -16 0 -6 -18 15 -12 -14 9 -10 5 7 -8 29 4 10 7 2 9 4 -4 14 7 13 10 -12 -9 -2 -9 -1 5 -17 5 -10 -8
7173 -8 7 -21 0 -9 -27 -4 -8 -2 3 -7 5 10 -14 0 4 -4 11 1 15 16 7 23 11 2 21 13 10 12 -4 9 11 -6 11 -7 -6 12 -13 -1
7211 -1 10 -22 -1 -5 -15 5 -11 -9 -1 -25 5 -7 -19 5 -2 2 22 -3 8 11 -5 12 9 2 20 14 3 16 0 8 11 4 22 -1 2 12 0
7248 0 0 8 -19 11 0 -9 1 -9 -7 2 -16 9 -9 -17 0 -16 -8 4 -10 6 10 -1 15 -1 -9 14 2 13 18 7 25 13 1 16 6 -1
7284 -1 12 -9 20 14 -11 10 -1 -10 3 -16 -1 2 -11 19 0 -11 1 -13 -5 5 -5 4 0 -7 20 -1 9 3 -11 2 9 0 21 12 13 40 16
7321 16 11 12 5 14 10 2 17 10 6 28 -8 16 8 -14 13 -8 -4 -6 -2 -3 2 -15 12 -2 -17 3 -10 7 13 -8 13 5 -5 17 -14 1 21 -5
7359 -5 19 22 20 21 3 -2 23 -7 18 14 2 19 10 17 10 -4 5 15 -14 12 2 2 24 0 8 13 -11 -6 2 -14 9 4 -3 9 -8 5 10 -5 16
$$ packed form
7095Cmj1K1k1QJ1j0LjoK0j5PJ5k3K3rk1K4%k0K5j8J0Ok4MOqPj3J1Kj1J4j2rK7
7133A1k3j0K5k3PPj0J6oj2L3k7kK3j9J5Kj5L7k5OlnPnqJ8pOlk2LPpQOk2K2j5K
7173hJ5k8K1rj8K3mONj0J2Nk4J4MqJ5j0J4JrJ6j2rJ9qlKj6J3Kj7J7j8JJ8k5J2
7211aJ1l2K1mj0K0j6KQk4L0j2j2K4pMK0k5J1Lj6J7lpJ8oj1J3j6QLpJ8k3LJ0j2
7248@%Qk7L0j1rJ0j0KRj8K5j8qJ7j6QJ2j4J6Mj1J6j6qK3j2J1Nj1J8j2j2J5j0p
7284aJ3k1K9ok5K1j1rJ3j9J5Lj3L0j9j1J2j4QJ0j0RmpK7k1J0oj4J3PrK1rJK7k4
7321A6nJpRmqJ5pmK2l6K4qk2K7k1MkMjNj7K7j4j5K0j3J7Ok1K1qj0K2l1J5K0k6
7359eK4LkJj8nK5l0K5mj2J7rPpj4RJ0k9K6j0%K2k4QNk4NQj6K3npJ2j7J3Nj5K1
$$ plain form
7398 16 18 5 22 5 15 28 6 10 7 -2 16 7 8 13 6 14 12 -6 12 -13 -3 13 -11 0 14 -2 10 -1 -14 3 -11 -9 -6 -19 7 6 1
7435 1 18 6 -12 21 -7 9 23 6 24 6 12 21 7 7 18 4 27 17 -4 26 19 10 31 0 13 -2 -12 11 0 -5 12 -9 4 12
7469 12 -9 -2 2 -8 3 -5 1 16 2 15 11 -10 19 2 7 23 11 27 23 6 17 13 -6 27 -1 15 24 0 3 9 5 11 -3 5 8 -9 1 9
7507 9 -9 11 -5 -10 -10 -6 -1 1 -9 18 11 5 10 -6 8 13 -9 8 13 -5 17 6 16 27 6 17 25 5 26 10 3 24 6 12 16 0 9 18 6
7546 6 18 1 10 13 -5 2 3 -14 9 -13 -7 8 -4 13 10 -10 15 4 1 14 5 1 14 1 8 4 -6 18 2 -1 26 10 21 16 0 10 7 4
7584 4 14 -2 -5 12 -9 1 4 -13 11 -8 -4 5 -16 1 10 -3 11 -12 4 11 -5 3 0 -2 17 14 5 25 7 6 7 3 16 18 8 11 7 21 16 0
7624 0 11 1 -4 8 6 -7 14 3 6 10 -6 13 -3 -8 4 -12 8 10 -1 1 6 2 7 -1 -3 25 2 4 15 -1 13 4 0 14 7 19 11 6 23 9
7664 9 1 8 5 2 23 4 6 -3 -11 1 2 -2 8 -16 -7 -3 -20 -8 -1 -7 11 -1 -3 8 -18 -1 -4 -5 15 3 3 23 1 7 18 -2 21 11 -2 22
$$ packed form
7398A6Kj3J7j7J0J3k2MlrJ8rJNpQkj8J8k5J0J6k4J1J4j6J2j1j3J7j4KLj3K6jn
7435AJ7j2j8L3k8J6J4j7J8j8ORj4%J1j4K3j0k1L0prK1l1J3j5j0K3j1nJ7k1J3Q
7469A2k1PMj0J1qOJ5j4J3mk1K9j7NJ6j2J6mj7J1mj9L3k8J6Rk4LOmOj4QLj7J0Q
7507Ij8K0j6n%MNKj0K7poNj6J4Nk2J7Nj8K2j1J0J1k1J1Qk0K1j6pK1j8OMj6RRj2
7546FJ2j7RLj8PJj7K3k2OJ5j2J7lk0K5j1lJ3rmJ3j3Pmj0K4j6lK7j6J1nj6J0ll
7584DJ0j6lJ7k1J0Lj7K4j9MRk1J7Rj3J4k3J6Pj6QlkJ9lrK0j8jJmJ3Kj0LmJ4nj6
7624@J1j0nJ2kj3K1j1LMj6J9j6nJ2j6K0Kj1KNmNqkK8k3KJ1j6J4rmJ4pJ2qnJ7j4
7664IqPllK1j9KrqJ2JmJ0k4RMj7J2PoJ8j2kJ1k6J7ljK0j2%K0k2OJ1k0K3j0j3K4
$$ plain form
7704 22 7 12 11 10 10 8 2 12 -8 -5 2 -14 -3 1 -19 -4 -11 -10 19 -10 -11 7 -17 -1 -1 -4 11 -7 8 11 -4 15 5 -3 6 -2 6 14 -2 13
7744 13 19 7 13 3 0 21 6 7 10 -6 -2 -11 -3 1 -14 -11 7 -14 -7 -10 -20 -3 -19 -16 16 -3 -2 -5 -14 10 -3 -5 12 0 1 19 12 13 5 -1 11
7785 11 4 1 11 -2 10 8 -13 12 4 -3 6 -5 13 14 -12 -1 0 -17 -6 -12 -10 7 -15 6 5 -14 6 -11 3 4 -6 -12 5 -8 9 9 -1
7822 -1 22 1 14 8 -5 19 12 1 12 8 8 29 -7 22 10 1 14 -4 10 10 -7 -1 -3 -15 4 -9 -15 -6 -14 -16 8 -18 -7 -1 -5 11 -1 -7
7860 -7 21 -7 13 14 4 17 8 3 17 -2 8 13 0 15 12 -2 19 1 -3 12 -5 8 3 -8 10 -14 -5 -4 -13 1 12 -19 5 -5 -17 1
7896 1 -7 -4 3 -11 13 1 -2 22 -4 9 14 -4 1 3 0 13 10 12 16 0 16 9 -4 4 8 -7 13 -11 -6 3 -11 -4 -4 -14 -7 -10 -12 -6 -26 -1 2 -7 9
7939 9 -6 -1 1 -13 1 6 6 9 11 6 22 6 12 21 1 17 8 8 7 -1 4 22 -1 11 17 -6 17 6 -12 -1 -10 -5 -3 -16 1 -5 -8 12 13 2 7 -8
7981 -8 0 7 -4 10 3 1 13 3 5 9 0 13 16 10 6 -6 -2 10 -2 11 2 0 15 0 1 1 -8 -2 0 -15 5 -9 -15 1 -7 2 -7 -12 2 -7 -12 0 -12
$$ packed form
7704B2j5Njj%koJ0k0LPj6J1Mk0J5pJK9k9jJ8k4J6%lJ5j8J5Lj5J9j0qRqQQj6J5
7744A3Oj2Oj0lK1j5JLj6MrQMj5LJ8k1Plj0J7j6LL2j9JlrK4j3kJ7j2JJ8pJqoJ2
7785A1plJ0j3J2kk1K5qpRj1J8Jk6J1Jj7J1oKJ7k2K1jj9K0j7J4Jj0oJ7j3J7%j0
7822aK3k1J3oj3K4pj1J1m%K1l6K9j2rJ3j8J4%j7Okj2J9j3oRqkK4k6J1OmJ6j2o
7860gK8k8K0Jj0J3rnJ4j9J0Nj3J5lj4K1j8mJ5j7J3nj1J8k4RJrJ4J1l1K4j0j2J8
7896AqLPj4K4j2lK4k6J3Nj8NKlJ3lKMj6J6pj3QMj5K0k4NRj4P%j0PlkOk0K5LrJ6
7939Ij5NKj4J4N%LKnJ6j6ORk0J6r%jqNJ8k3J2Ok3K3j1j8J1rNKj3J7olK0Jj1Nj5
7981hQPj1J4pkJ2j0KMrJ3Lomj2MJ2j2J3rkJ5j5J%rOKj5K0j4oJ6qRrnJ4rnJ2j2
$$ plain form
8024 -12 -7 -7 -14 6 12 -8 8 -2 1 13 8 6 18 1 9 9 15 23 -1 11 10 -4 11 -4 4 11 2 6 1 -14 -1 -2 -7 -3 0 -3 0 -14 -19 -7 -10 -5 6
8067 6 -7 3 3 2 11 0 12 17 -3 19 -3 19 23 16 13 22 5 25 6 1 12 -1 7 7 2 7 3 -6 16 -13 -3 1 -20 1 8 -20 8 -8 -6 5
8107 5 2 3 3 -10 23 4 -1 10 -1 6 9 7 14 12 4 28 10 8 14 6 10 17 -5 18 2 -4 6 -7 -7 8 1 -4 -4 -20 5 -12 -14 7 -10 3 -8
8148 -8 -10 0 -5 -2 9 -5 -2 11 5 23 5 3 19 6 14 17 -5 19 17 9 17 9 5 23 1 13 4 1 5 10 -3 0 -3 -10 4 -6 0 11 -4 -5 -4 -12 14
$$ packed form
8024a2N%pK0Ok0J6j0LJ2nkJ2j7Q%OQk4J2jj4J5j5QPrMnj5J3jnMLlLj4nJ2lNJ1
8067Fj3J0%jRj1J2Nk0K2k2K2MplRj7K0j9nJ1j3Q%nNmrK2k9J0Mk1K1Pk8K8j6KJ1
8107ElJ%j3L3j9nJ1j1PLkPkqK4j8kOqMPk2K3j6oJ0j3%J5pn%j6K5j7kK1j7J3j1
8148hkJ0nLJ1j4LJ3oJ8j8kJ6j3QLk2K4kqQqmJ8k2J2rlMNj3LlpJ4j0OJ1j5jJqK6
8191A4
$$ Imaginary data points
##PAGE= N=2
##DATA TABLE= (X++(I..I)), XYDATA
$$ plain form
0 0 0 0 0 0 0 0 0 0 0 0 7 -8 8 -8 9 -16 16 -24 29 -32 40 -48 56 -70 80 -96 112 -128 145 -169 193 -217 249
33 249 -281 319 -359 402 -451 504 -564 627 -697 771 -855 947 -1045 1156 -1272 1404 -1545
50 -1545 1700 -1873 2064 -2276 2516 -2782 3086 -3433 3834 -4307 4869 -5555 6410 -7510 8983
65 8983 -11075 14278 -19877 32515 -119895 5381 -3676 -103659 269857 -3721 72789 171025
77 171025 -180754 -471 -55218 -244133 105477 -54925 5477 247928 -41421 98923
87 98923 85142 -209427 34830 -119009 -161277 135875 -65508 84181 204305 -75119 118611
98 118611 -13161 -193083 47737 -152900 -71946 145058 -67383 147848 133847 -85941
108 -85941 115361 -96348 -153403 50581 -164015 19267 128462 -55022 182332 53096
$$ packed form
0@%%%%%%%%%%Pj5J6j6J7k5L2m0N3o1P2q8J04j26J50j76K08k40K73l14L62m10M66
33B49n30O00o78P61q53R55j068J191j324J468j626J802j992K201k428K676k949
50a545L245l573L937m340M792n298N868o519P267q141R176j0424J1965j3920J6493
65H983k0058K5353l4155N2392j52410J25276r057r9983L73516k73578P6510R8236
77A71025l51779J80283n4747j88915L49610j60402O0402K42451k89349J40344
87I8923j3781k94569K44257j53839m2268K97152k01383J49689J20124k79424J93730
98A18611j31772j79922K40820k00637Q0954K17004k12441K15231j4001k19788
108h5941K01302k11709n7055K03984k14596J83282J09195j83484K37354j29236
$$ plain form
118 53096 -81005 95539 -156795 -93204 41062 -148316 95920 91746 -32827 184341 -25129
129 -25129 -59733 60988 -184016 -27534 22110 -111180 145889 45198 -3732 158315 -86357
140 -86357 -29647 17870 -179792 30394 -2221 -60183 166072 809 26840 111841 -123884
151 -123884 216 -25830 -150128 72903 -24345 -5180 158994 -35623 51731 54865 -137118
162 -137118 25451 -61913 -102429 97800 -41285 44330 129059 -61220 68217 -3493 -126965
173 -126965 43989 -86819 -45147 102396 -51119 83238 82669 -71389 74603 -55214 -96867
184 -96867 50573 -98449 12436 87356 -49930 107164 29060 -64305 67966 -93428 -54854
195 -54854 43317 -93537 60592 58831 -37037 112070 -20988 -45630 49429 -112387 -10734
$$ packed form
118E3096j34101J76544k52334O3591J34266j89378K44236m174j24573K17168k09470
129b5129l4604J20721k45004J56482M9644j33290K57069j00691m8930J62047k44672
140h6357N6710M7517j97662K10186l2615n7962K26255j65263K6031Q5001k35725
151a23884J24100k6046j24298K23031r7248J9165J64174j94617Q7354L134j91983
162a37118J62569q7364m0516K00229j39085Q5615Q4729j90279J29437p1710j23472
173a26965J70954j30808M1672J47543j53515J34357n69j54058J45992j29817m1653
184i6867J47440j49022J10885P4920j37286J57094p8104r3365J32271j61394L8574
195e4854R8171j36854J54129j761r5868J49107j33058k4642R5059j61816J01653
$$ plain form
206 -10734 27476 -74524 92674 24985 -18024 99706 -60666 -21095 24987 -112699 28973
217 28973 7441 -46981 107243 -9066 3575 75036 -86204 5419 -2203 -97009 59234
228 59234 -14195 -14535 104258 -37507 25621 41305 -95144 28620 -29308 -68014 75351
239 75351 -32674 19401 84819 -54987 43283 3088 -86729 42949 -51129 -30585 75724
250 75724 -43027 48221 53512 -59304 52390 -32458 -64714 46696 -63339 7845 62543
261 62543 -44096 67431 17380 -51896 51950 -59690 -34941 40850 -65067 40990 40723
272 40723 -36854 75309 -17297 -36306 43166 -76056 -3330 28026 -57052 65357 14745
283 14745 -23382 71898 -46400 -15884 27422 -80392 26179 10530 -40301 78161 -11492
$$ packed form
206a0734L8210j02000J67198o7689m3009J17730j60372L9571M6082j37686J41672
217B8973k1532n4422J54224j16309J2641P1461j61240R1623p622r4806J56243
228E9234p3429l40J18793j41765O3128J5684j36449J23764n7928l8706J43365
239G5351j08025N2075O5418j39806R8270m0195q9817J29678r4078K0544J06309
250G5724j18751R1248N291j12816J11694q4848l2256J11410j10035P1184N4698
261F2543j06639J11527n0051o9276J03846j11640K4749P5791j05917J06057k67
272D0723p7577J12163r2606j9009P9472j19222P2726L1356q5078J22409n0612
283A4745l8127R5280j18298L0516M3306j07814J06571j5649n0831J18462q9653
$$ plain form
294 -11492 -5376 57227 -65874 5970 6626 -71442 48426 -8489 -16657 77004 -32828 13778
306 13778 33333 -71926 24280 -15477 -50853 59266 -24167 9145 62741 -44924 29271
317 29271 5343 -65227 35184 -33546 -23910 58792 -33370 31671 40389 -47988 38272 -21270
329 -21270 -49500 38927 -45216 4320 49701 -36243 48255 13830 -43401 40859 -43431 -27588
341 -27588 35872 -49582 30542 33354 -32600 56975 -13301 -31506 36069 -57925 -2612 26021
353 26021 -45205 50372 12533 -22153 55513 -36276 -14755 24035 -61598 20356 11552 -32317
365 -32317 60027 -8013 -7696 44168 -50706 2517 7804 -54543 37166 -3412 -14421 58910 -24561
378 -24561 7160 26301 -55598 17149 -8854 -39392 46256 -16316 4797 48933 -35368 19799
$$ packed form
294a1492O116O2603j23101P1844O56p8068J19868n6915q168R3661j09832M6606
306A3778J9555j05259R6206l9757l5376J10119q3433L3312N3596j07665P4195
317B9271k3928p0570J00411o8730R636Q2702r2162O5041Q718q8377Q6260n9542
329b1270k8230Q8427q4143M9536M5381q5944Q4498l4425n7231Q4260q4290J5843
341b7588O3460q5454Q0124K812o5954Q9575p0276j8205O7575r3994N5313K8633
353B6021p1226R5577l7839l4686P7666r1789K1521L8790q5633Q1954q804m3869
365c2317R2344o8040L17N1864r4874N3223N287o2347R1709m0578j1009P3331q3471
378b4561L1721J9141q1899P2747k6003l0538Q5648o2572K1113M4136q4301N5167
$$ plain form
390 19799 5534 -51623 27584 -23289 -19429 47503 -25510 22393 32287 -39673 28717 -15040
402 -15040 -40032 32554 -33641 2571 40955 -29763 35945 11442 -36638 32226 -32503 -22425
414 -22425 30860 -37902 22920 27526 -27570 42851 -9881 -26763 29122 -43350 -2523 22742
426 22742 -34857 37766 10601 -19602 41721 -27260 -13002 20341 -46028 15388 11255 -25768
438 -25768 45048 -5912 -8659 34038 -38677 1179 8809 -41576 29240 -1122 -13418 45273
450 45273 -20161 3117 21822 -43636 14492 -3872 -31319 37709 -13106 847 38442 -30330
462 -30330 14648 6486 -41011 24529 -16221 -16244 38781 -22308 14942 25390 -33633 23251 -9520
475 -9520 -31159 28621 -25359 683 32402 -26040 25904 9083 -30065 26671 -22804 -16999
$$ packed form
390A9799j4265n7157P9207n0873L860O6932p3013M7903R894p1960O8390m3757
402a5040k4992P2586o6195L6212L8384p0718O5708k4503m8080O8864o4729J0078
414b2425N3285o8762O0822M606n5096P0421n2732j6882N5885p2472M0827K5265
426B2742n7599P2623k7165l0203O1323o8981J4258L3343o6369O1416m133l7023
438b5768P0816n0960k747M2697p2715L9856P630n0385P0816l0362j2296N8691
450D5273o5434K3278J8705o5458N8128j8364k7447O9028n0815J3953L7595o8772
462c0330M4978q162m7497O5540m0750k3N5025o1089L7250J0448n9023N6884l2771
475i520k1639N9780n3980K6042L1719n8442N1944j6821l9148N6736m9475N805
$$ plain form
487 -16999 26532 -29364 16020 21232 -24412 31755 -7061 -21640 25159 -31562 -1511 20052
499 20052 -28455 27701 7501 -18755 32560 -20910 -10193 19702 -35082 13114 10337 -23399
511 -23399 34483 -6552 -9969 28558 -30565 2611 11065 -33215 24584 -1092 -14543 35494
523 35494 -18601 828 20039 -34501 14182 76 -25866 30875 -11939 -2983 30284 -26054
535 -26054 11311 8011 -31956 21922 -10734 -14297 30744 -19526 8772 20097 -27791 18859
547 18859 -4642 -23944 24644 -18867 -1279 25254 -22802 18060 7655 -24555 22691 -15455
559 -15455 -13002 23138 -23601 10810 16335 -22370 24364 -4961 -17698 23008 -23641 -707
571 -707 17855 -24838 20934 5182 -17991 26932 -16455 -7876 19100 -28055 11169 9142 -21398
$$ packed form
487a6999M3531n5896M5384N212m5644N6167l8816j4579M6799n6721L0051K1563
499B0052m8507N6156k0200k6256N1315n3470J0717K9895n4784M8196k777l3736
511b3399N7882m1035l417L8527n9123L3176Q454m4280N7799k5676j3451N0037
523C5494n4095J9429J9211n4540M8683j4106k5942N6741m2814Q956L3267n6338
535b6054L7365l300l9967N3878l2656l563M5041n0270K8298J1325m7888M6650
547A8859k3501j9302M8588m3511J7588K6533m8056M0862j0405l2210M7246l8146
559a5455K453L6140m6739L4411N525l8705M6734k9325j2737M0706m6649K2934
571g07J8562m2693M5772j5752k3173M4923m3387Q579K6976m7155L9224k027l0540
$$ plain form
584 -21398 27240 -6339 -9932 24432 -24366 2824 11276 -27006 20070 -795 -13842 28028
596 28028 -15528 -449 17404 -27077 11897 1940 -21111 24450 -9573 -4412 23926 -21114
608 -21114 8243 8096 -25080 18151 -7072 -12413 24583 -16174 5177 16503 -22909 15274 -2015
621 -2015 -19495 21087 -14784 -2237 20894 -19884 13877 6920 -20928 19594 -11685 -11066 20301
634 20301 -19962 8073 13943 -19872 20063 -3532 -15357 20213 -19088 -1069 15797 -21199
646 -21199 16624 4739 -16063 22260 -12812 -7164 16822 -22533 8534 8516 -18334 21505 -4578
659 -4578 -9354 20200 -19018 1625 10539 -21764 15620 295 -12439 22367 -12141 -1578 15041
672 15041 -21589 9269 2915 -17802 19739 -7338 -5021 19968 -17359 6129 7946 -20986 15202
$$ packed form
584b1398M8638l3579l593L4364m8798K7190Q452l8282M7076k0865j3047M1870
596B8028m3556J5079J7853m4481L8974r957k3051M5561l4023N161K8338m5040
608b1114K9357j47l3176M3231k5223n341L6996m0757K1351J1326l9412L8183j7289
621b015j7480M0582l5871J2547K3131m0778L3761o957k7848M0522l1279O19L1367
634B0301m0263K8035N870l3815L9935k3595j1825L5570l9301J8019J6866l6996
646b1199L7823j1885k0802L8323l5072N648K3986l9355L1067j8k6850L9839k6083
659d578m776K9554l9218K0643Q914l2303L7384j5325j2734L4806l4508J0563J6619
672A5041l6630L0858o354k0717L7541k7077K317K4989l7327K3488J817k8932L6188
$$ plain form
685 15202 -4933 -11360 20760 -13706 3161 14563 -19692 12847 -457 -16812 18433 -12031
697 -12031 -2984 17935 -17425 10739 6580 -18024 16940 -8489 -9661 17633 -16538 5376 11755
710 11755 -17357 15843 -1800 -12881 17416 -14341 -1531 13472 -17761 11922 4201 -14052
722 -14052 17940 -8983 -6040 14986 -17484 6004 7358 -16202 16256 -3449 -8674 17362 -14336
735 -14336 1537 10291 -18007 12261 102 -12237 17907 -10314 -1755 14206 -17141 8726
747 8726 3803 -15696 15976 -7286 -6252 16506 -14848 5604 8766 -16612 13941 -3442 -10912
760 -10912 16323 -13004 769 12299 -16033 11784 2099 -13011 15918 -9869 -4595 13346
772 13346 -15882 7265 6402 -13787 15492 -4355 -7407 14646 -14286 1702 8145 -15678 12199
$$ packed form
685A5202k0135o427L2120l4466J6867J1402l4255L2539j3304j6355L5245l0464
697a2031R047K0919l5360K8164m159k4604L4964k5429j172K7294l4171K1914O379
710A1755k9112L3200j7643j1081L0297l1757J2810J5003l1233K9683p721j8253
722a4052L1992k6923K943K1026l2470K3488J354k3560L2458j9705n225K6036l1698
735a4336J5873Q754k8298L0268j2159j2339L0144k8221Q559J5961l1347K5867
747H726m923j9499L1672k3262J034K2758l1354K0452L162k5378L0553j7383p470
760a0912K7235k9327J3773J1530k8332K7817r685j5110K8929k5787N274J7941
772A3346k9228K3147q63k0189K9279j9847l052K2053k8932J5988O443k3823K7877
$$ plain form
785 12199 226 -9128 16528 -9551 -1323 10777 -16531 7072 2063 -12966 15397 -5293 -3118
798 -3118 15096 -13425 4423 5050 -16447 11256 -4113 -7849 16470 -9671 3471 10973 -15185
811 -15185 9074 -1910 -13473 13325 -9176 -944 14599 -11716 9292 4669 -14137 11194
823 11194 -8426 -8164 12583 -11744 6016 10481 -11021 12704 -2219 -10955 10544 -13008 -1970
836 -1970 9985 -11503 11653 5266 -8596 13476 -8538 -6774 8083 -15210 4388 6428 -9235
849 -9235 15489 -505 -5175 11843 -13705 -1818 4390 -14899 10197 2154 -5193 16889 -6194
862 -6194 -1045 7948 -16701 3143 -157 -11792 14266 -2066 -2 15268 -10479 2875 2300
875 2300 -16830 6967 -4456 -6407 15775 -5172 5198 10893 -12718 5554 -3813 -14051 9124
$$ packed form
785A2199j1973r354K5656k6079Q228J2100k7308K3603n009j5029K8363k0690K175
798c118J8214k8521J7848O27k1497K7703j5369l736K4319k6141J3142P502k6158
811a5185K4259j0984j1563K6798k2501Q232J5543k6315K1008m623j8806K5331
823A1194j9620K62K0747k4327J7760M465k1502K3725j4923q736K1499k3552J1038
836a970J1955k1488K3156o387j3862K2072k2014J764J4857k3293J9598K040j5663
849i235K4724j5994m670J7018k5548J1887O208j9289K5096q043p347K2082k3083
862f194N149Q993k4649J9844l300j1635K6058j6332K064J5270k5747J3354n75
875B300j9130K3797j1423j951K2182k0947J0370N695k3611J8272r367j0238K3175
$$ plain form
888 9124 -7421 154 14697 -6773 9127 4748 -12806 6689 -9071 -9163 9660 -8608 6511
901 6511 11465 -7060 11254 -1911 -11105 6485 -12723 -3104 8827 -8299 11783 6789 -6242
914 -6242 11548 -8302 -7931 5155 -14471 3361 6658 -6476 15343 1102 -4279 9815 -13400
927 -13400 -3575 2585 -13663 9222 3435 -3076 16131 -4465 -1477 5932 -15908 973 -579
940 -579 -10142 12973 62 1011 13900 -8582 1183 1045 -15476 4657 -3359 -5110 14324 -2728
954 -2728 4669 9665 -11047 3308 -3749 -12865 7329 -5469 458 13574 -4972 7602 4181
967 4181 -11830 4875 -8059 -8391 8807 -6825 6025 10718 -6224 9468 -1997 -10536 5487
980 5487 -11110 -2620 8472 -6868 10527 6130 -6010 9629 -7513 -7395 4731 -12127 3161
$$ packed form
888I124j6545P575J4543k1470J5900m379j7554J9495j5760r2J8823j8268J5119
901F511M954j8525J8314j3165r194J7590j9208R619J1931j7126K0082m994j3031
914f242J7790j9850L71J3086j9626J7832L297j3134K1819j4241n381J4094k3215
927a3400R825O160j6248K2885n787o511J9207k0596K988P409k1840J6881j552
940e79r563K3115j2911R49J2889k2482R765j38j6521K0133q016j751J9434j7052
954b728P397M996k0712J4355p057r116K0194j2798N927J3116j8546J2574l421
967D181j6011J6705j2934l32J7198j5632J2850M693j6942J5692j1465q539J6023
980E487j6597Q490J1092j5340J7395m397j2140J5639j7142J18J2126j6858J5288
$$ plain form
993 3161 6514 -5475 12917 949 -4486 8000 -11314 -3347 2948 -10992 7860 3566 -3005
1006 -3005 13012 -3859 -2229 4990 -12999 827 606 -8138 10924 334 -73 11088 -7668
1019 -7668 324 1329 -12615 4567 -1824 -4187 12148 -2811 2895 7652 -10026 2844 -2438
1032 -2438 -10345 7377 -4134 241 11353 -5380 5581 3108 -10505 4887 -5932 -6413 8533
1045 8533 -5786 4627 8490 -6586 7301 -1817 -8877 5618 -8320 -1567 7809 -6050 7950
1058 7950 4409 -6166 7469 -6020 -5897 5032 -9020 2993 5803 -5104 9698 114 -4745
1071 -4745 6429 -8886 -2291 3690 -8374 6765 3079 -3485 9998 -3995 -2576 4571 -10452
1084 -10452 1589 1645 -6603 9454 -264 -1176 8833 -7376 166 1793 -10295 5036 -868 -3629
$$ packed form
993C161L353j1989J8392j1968n435J2486j9314P967O295j3940J8852m294o571
1006c005J6017j6871J630P219j7989J3826k21q744J9062j0590m07J1161j8756
1019g668P992J005j3944J7182o391k363J6335j4959N706M757j7678J2870n282
1032b438p907J7722j1511M375J1112j6733J0961k473j3613J5392j0819m81J4946
1045H533j4319J0413L863j5076J3887r118p060J4495j3938O753R376j3859J4000
1058G950l541j0575J3635j3489J23J0929j4052J2013K810j0907J4802r584m859
1071d745J1174j5315O595N981j2064J5139l686o564J3483j3993J419P147j5023
1084a0452J2041N6q248J6057r718r12J0009j6209P542J627j2088J5331n904k761
$$ plain form
1098 -3629 10429 -3288 1575 6099 -9215 2672 -1434 -8315 7187 -3063 53 9505 -5279
1111 -5279 3886 2369 -9244 4283 -4256 -5023 7870 -4417 3533 7058 -6124 5355 -1589 -7779
1125 -7779 4944 -6257 -1101 7216 -4857 6350 3668 -5895 5811 -5183 -5257 4682 -7244 2879
1139 2879 5541 -4363 8228 -162 -4728 5284 -8037 -2078 3572 -7051 6456 3103 -3025 8844
1153 8844 -3891 -2798 3690 -9648 1352 1761 -5512 8939 296 -914 7789 -6876 -544 1175
1167 1175 -9455 4284 -287 -2722 9744 -2187 1324 5186 -8447 1357 -1627 -7617 6184
1180 6184 -1869 536 8976 -3912 3106 1819 -8765 2685 -4031 -4733 7118 -2915 3758 7078
1194 7078 -4955 4343 -1870 -7890 3494 -5952 -1066 7092 -3421 6595 4002 -5219 4830 -5523
$$ packed form
1098c629J4058j3717M863M524j5314J1887m106o881J5502j0250L116R452j4784
1111e279R165j517j1613J3527q539p67J2893j2287P950L525j3182J1479o944o190
1125g779J2723j1201N156Q317j2073J1207k682r563J1706j0994p4R939j1926J0123
1139B879K662r904J2591q390m566J0012j3321N959N650j0623J3507l353o128J1869
1153H844j2735J093O488j3338J1000M09p273J4451q643j210Q703j4665O332J719
1167A175j0630J3739m571k435J2466j1931L511L862j3633R804k984n990J3801
1180F184q053K405Q440j2888P018j287j0584J1450o716p02J1851j0033O673L320
1194G078j2033R298o213o020J1384r446M886Q158j0513J0016k593r221J0049j0353
$$ plain form
1208 -5523 -5786 3539 -6842 2931 5853 -3030 8329 268 -4480 4082 -8231 -2816 2734 -6269
1222 -6269 6332 3815 -1762 8441 -3268 -3139 2348 -9427 229 1506 -4401 8578 1584 -96
1236 -96 7099 -6077 -1580 42 -9125 2997 192 -1717 9481 -637 1571 4614 -7925 4
1250 4 -2314 -7433 5209 -1083 1310 8975 -2650 2974 1336 -8542 1427 -4386 -4604 6549 -2009
1265 -2009 4235 7105 -4082 3873 -2225 -7857 2378 -5827 -980 6755 -2355 6592 4128 -4543
1279 -4543 3925 -5473 -5911 2577 -6145 2699 5805 -1896 7755 681 -4131 2992 -7644 -3235 2088
1294 2088 -5251 5690 4118 -934 7533 -2567 -3156 1472 -8569 -384 1300 -3574 7708 2009
1308 2009 211 6277 -5304 -1798 -279 -8300 2427 234 -1362 8655 -361 1501 4089 -7203
$$ packed form
1208e523k63R325j0381R773K922q883J1359q061m748Q562j2313N415N550r003
1222f269J2601k517n577J0203j1709J29N487j1775R656J277n907J2979o994j680
1236i6P195j3176M497J622r167J2122k805j909J1198j0118K208L043j2539P929
1250Dk318n119J2642o292K393P665j1625N624j638r878R969n813k18J1153q558
1265b009O244K870j1187P955o098n632J0235q205M847P735r110Q947k464q671
1279d543Q468r398m38Q488q722Q844L106p701R651p074m812P123j0636M409N323
1294B088p339J0941j572n052Q467j0100n89M628j0041Q185J684m874J1282n699
1308B009j798O066j1581L506J519q021J0727k193j596J0017r016J862K588j1292
$$ plain form
1322 -7203 -129 -2236 -6715 4727 -913 1288 8140 -2396 2673 1130 -7738 1255 -3944 -4051 5902
1337 5902 -1706 3757 6294 -3599 3258 -1918 -6951 2032 -4895 -945 5949 -1932 5498 3692 -4031
1352 -4031 3240 -4489 -5225 2276 -5105 2112 5111 -1724 6430 716 -3722 2674 -6379 -2820 2066
1367 2066 -4565 4795 3524 -1110 6471 -2279 -2781 1598 -7337 -119 1358 -3311 6701 1497 -172
1382 -172 5507 -4786 -1442 93 -7183 2399 327 -1420 7494 -577 992 3640 -6337 -14 -1558
1397 -1558 -5831 4240 -687 800 7005 -2214 2017 1161 -6682 1116 -3003 -3570 5157 -1320 2889
1412 2889 5465 -3234 2552 -1412 -6067 1822 -3897 -885 5319 -1610 4492 3231 -3724 2642 -3820
1427 -3820 -4657 2199 -4264 1900 4704 -1599 5575 532 -3594 2281 -5725 -2524 2069 -3959 4473
$$ packed form
1322g203P074k107m479J1442n640K201O852j0536N069j543q868Q993n199j07R953
1337E902p608N463K537r893O857n176n033Q983o927L950O894p881P430j806p723
1352d031P271p729p36P501p381P217K999o835Q154n714m438O396r053L559M886
1367B066o631R360j271m634P581q750n02M379q935P218J477m669J0012n204j669
1382a72N679j0293L344J535p276R582k072j747Q914q071J569K648r977O323j544
1397a558m273J0071m927J487O205r219M231q56p843P798m119n67Q727o477M209
1412B889K576q699N786l964m655P889n719L012O204o929O102j261o955O366o462
1427c820q37O856o463O164K804o303P174n043m126N875q006L201M593o028Q432
$$ plain form
1442 4473 3349 -1050 5736 -2221 -2803 1283 -6688 -120 1445 -2728 6236 1625 -150 4771 -4420
1457 -4420 -1769 -140 -6428 2045 766 -908 6904 -42 681 2962 -5873 -737 -1532 -5169 3802
1472 3802 132 1101 6580 -1619 1354 677 -6501 297 -2748 -3128 5007 -409 3058 5276 -2892 1789
1488 1789 -1872 -6148 1168 -3541 -482 5455 -698 4625 3115 -3658 1748 -4228 -4881 1701 -3664
1503 -3664 2313 5119 -647 5385 458 -3839 1148 -5899 -2905 1869 -2977 4720 4045 -311 5150
1518 5150 -2218 -3499 134 -6568 -600 1732 -1597 6338 2539 158 3966 -4440 -2799 -980 -6131
1533 -6131 1673 1496 153 7021 800 549 2156 -6057 -1840 -2009 -4832 3716 1130 1920 6716 -1066
1549 -1066 834 -110 -6874 -653 -2820 -2698 5219 653 3574 5313 -2677 935 -2530 -6519 434
$$ packed form
1442D473j124m399O786p957n82M086p971O568J565m173Q964m611j775M921r191
1457d420K651J629o288Q473j279j674P812o946P23K281q835N136p95l637Q971
1472C802l670R69N479q199K973o77p178O798l045l80Q135n416L467K218q168M681
1488A789l661m276P316m709L059N937o153N323j510o773N406n976o53O582n365
1503c664N977K806n766O032m927m297M987p047K994M774m846P697o75m356N461
1518E150p368j281L633o702N968K332l329P935l799k381L808q406J641J819n151
1533f131P804j77j343O868o221k51J607q213M217j69k823Q548k586P90M796p782
1549a066J900r44o764O221k167J22P917m566K921J739p990L612l465l989O953
$$ plain form
1564 434 -3167 -50 5795 354 4656 3057 -3659 640 -4486 -5179 1214 -2809 2505 5517 249
1579 249 4900 504 -4067 69 -5702 -3236 1762 -1972 4652 4544 174 4411 -2082 -3954 -574
1594 -574 -6111 -876 1995 -816 6118 2896 168 3297 -4345 -3213 -1254 -5639 1562 1855 556
1609 556 6640 926 291 1640 -5830 -2037 -1859 -4255 3556 1436 1924 6141 -958 413 -276 -6312
1625 -6312 -761 -2276 -2315 4824 914 3040 4720 -2454 454 -2142 -5828 367 -2405 -96 5213
1640 5213 411 3731 2678 -3364 360 -3632 -4509 1257 -2175 2003 4784 -15 3897 433 -3653
1655 -3653 246 -4563 -2624 1795 -1743 3732 3681 -322 3651 -1732 -3244 60 -4911 -484 1855
1670 1855 -1114 4879 2051 -328 2942 -3524 -2318 -377 -4543 1488 1430 -191 5181 320 -67 1726
$$ packed form
1564D34l601L117N845n441M302j599o716M299n126o93O393m023N314L012n268
1579B49M651m396m571M136n771K466M998l734O624j08m370M237o493j872L380
1594e74n537N235K871k811O934l222k728L129p642J132J959m385P201K93j299
1609E56O084n714o35J349p470L793J78k396P811k120M88M217p099J371o89o036
1625f312N551j515l9P139l910K126J680p174K908k596l686O195k772K309N309
1640E213m802L320j053o042L724l992q77N766l432M178K781m799L912l464m086
1655c653L899m809J939M419l538N475n1m003L973n383j512L304m971M427K339
1670A855k969N993k828k379L270o466J206J941m166O031n8j621N372m861l87J793
$$ plain form
1686 1726 -4510 -1137 -894 -3524 2896 806 778 4648 -1123 280 406 -4691 -18 -1337 -2120 3675
1702 3675 105 1620 3615 -2189 692 -903 -4218 987 -1786 -557 3809 -597 2396 2120 -2737
1717 -2737 1098 -2139 -3143 1601 -2099 1030 3273 -1059 2934 440 -2639 1291 -3067 -1674 1721
1732 1721 -2136 2356 2229 -1105 3054 -1101 -2040 1152 -3490 -172 1389 -1842 3221 999 -805
1747 -805 2786 -2272 -1118 723 -3447 1146 751 -1222 3558 -222 -228 2128 -2979 -139 31 -2957
1763 -2957 2051 -59 -391 3374 -1208 470 1183 -3206 754 -741 -2123 2591 -799 552 2781
1778 2781 -1904 1189 107 -2935 1447 -1520 -995 2659 -1403 1518 1808 -2114 1738 -1045 -2239
1793 -2239 1704 -2123 240 2209 -1588 2289 641 -1855 1865 -2010 -1266 1499 -2312 1317 1476
$$ packed form
1686A726o236L373K43k630O420k090k8L870n771J403J26n097M673j319p83N795
1702C675l570J515J995n804K881j595l315N205k773J229M366m406K993k76m857
1717b737L835l237j004M744l700L129K243m332L993k494l079L930m358J393L395
1732A721l857M492j27l334M159m155r39L192m642L318J561l231N063k222j804
1747h05L591n058J154J841m170M593l95j973M780l780oK356n107K840J70k988
1763b957N008k110l32L765m582J678P13m389L960j495j382M714l390J351K229
1778B781m685L093j082l042M382k967N25L654m062K921K90l922L852k783j194
1793b239L943l827K363J969l797L877j648k496L720l875P44K765l811L629J59
$$ plain form
1808 1476 -1395 2611 -494 -1331 1615 -2594 -249 1049 -2106 2148 625 -931 2609 -1470 -641
1823 -641 1124 -2841 769 418 -1593 2718 -293 -221 2216 -2228 192 339 -2671 1614 -337 -748
1839 -748 2836 -1101 559 1409 -2584 893 -577 -2046 2104 -958 255 2457 -1600 1188 357 -2510
1855 -2510 1309 -1338 -1113 2220 -1348 1199 1731 -1801 1579 -700 -2028 1485 -1851 -18 1983
1870 1983 -1419 1922 749 -1657 1672 -1646 -1249 1351 -2019 1065 1405 -1214 2306 -320 -1261 1421
1886 1421 -2314 -310 972 -1871 1969 650 -817 2330 -1338 -661 946 -2628 665 442 -1388
1901 -1388 2544 -200 -234 1963 -2108 32 252 -2482 1504 -164 -595 2662 -946 402 1206 -2446
1917 -2446 661 -483 -1842 1993 -674 286 2292 -1429 896 276 -2383 1068 -1091 -984 2119 -999
$$ packed form
1808A476k871M006l105q37K946m209K345J298l155M254j523j556L540m079Q29
1823f41J765l965L610l51k011M311l011P2K437m444K420J47l010M285j951m11
1839g48L584l937J660Q50l993L477j470j469M150l062J213K202m057K788q31k867
1855b510L819k647K25L333l568K547N32l532L380k279j328L513l336J833K001
1870A983l402L341j173k406L329l318L97K600l370L084L40k619L520k626r41K682
1886A421l735K004J282k843L840j319j467L147l668O77J607l574L293k23j830
1901a388L932k744l4K197m071K140K20k734L986j668m31L257l608J348Q04l652
1917b446L107j144j359L835k667R60K006l721K325o20k659L451k159J07L103l118
$$ plain form
1933 -999 1049 1627 -1668 1227 -666 -1973 1285 -1552 6 1926 -1175 1721 696 -1617 1380
1948 1380 -1544 -1212 1260 -1774 1036 1376 -1087 2111 -333 -1217 1260 -2144 -282 920 -1642 1844
1964 1844 637 -742 2102 -1230 -651 853 -2361 589 463 -1246 2285 -105 -260 1770 -1855 -56
1980 -56 281 -2215 1258 -63 -615 2368 -761 273 1185 -2145 528 -349 -1728 1688 -586 125 2080
1997 2080 -1203 829 398 -2071 960 -961 -999 1777 -971 862 1505 -1392 1238 -446 -1691 1148
2013 1148 -1463 -155 1593 -1154 1508 727 -1317 1423 -1230 -1092 1078 -1749 703 1127 -1061 1913
2029 1913 -87 -925 1322 -1781 -356 735 -1699 1365 527 -697 2007 -777 -404 967 -2035 299
2045 299 263 -1389 1773 -49 -208 1817 -1288 106 427 -2044 850 -270 -867 1956 -576 379 1387
$$ packed form
1933i99K048N78l295K895j893j307L258k837J558J920l101K896j025k313K997
1948A380k924L32K472l034K810L40k463L198k444q84K477l404J862J202k562L486
1964A844j207j379K844l332N79J504l214K950j26j709L531k390j55K030l625J799
1980e6L37k496L473j321n52K983l129J034R12l330K673q77j379L416k274P11J955
1997B080l283K032m31k469L031j921l8K776k748J833O43k897K630j684j245K839
2013A148k611J308J748k747K662p81k044K740k653J38K170k827K452M24k188K974
2029A913k000q38K247l103J425J091k434L064q38j224K704k784L73J371l002K334
2045B99l6j652L162j822j59K025l105J394L21k471K894j120n97K823k532R55J008
$$ plain form
2062 1387 -1629 594 -253 -1763 1207 -803 -146 1846 -952 977 693 -1650 938 -951 -1193 1307
2078 1307 -1124 621 1452 -1042 1385 -59 -1391 997 -1461 -499 1159 -1218 1271 906 -915 1544
2094 1544 -791 -1002 862 -1773 196 842 -1051 1746 259 -614 1438 -1407 -474 498 -1796 875
2110 875 411 -667 1955 -368 -179 1052 -1790 63 43 -1525 1392 -59 -117 1870 -904 253 494
2127 494 -1904 561 -445 -1008 1669 -470 453 1484 -1259 629 -185 -1730 897 -871 -312 1665
2143 1665 -762 988 882 -1378 850 -856 -1273 1021 -1117 429 1397 -811 1327 141 -1239 872
2159 872 -1332 -647 964 -1124 1065 934 -732 1451 -560 -938 744 -1623 30 759 -978 1533
2175 1533 357 -529 1352 -1195 -480 467 -1658 726 369 -643 1764 -303 -169 993 -1607 50
$$ packed form
2062A387l016K223q47j510K970k010O57J992k798J929k84k343K588j889k42K500
2078A307k431J745Q31k494K427j444j332K388k458R62J658k377K489l65j821K459
2094A544k335k11J864k635J969O46j893K797j487q73K052k845R33R72k294K671
2110H75m64j078K622k323J89J231k842J853k0j568K917j451n8J987k774J157K41
2127D94k398K465j006n63K677k139R23J031k743J888q14j545K627j768N59J977
2143A665k427J750j06k260K228j706m17K294k138J546R68k208K138j186j380K111
2159H72k204O85J611k088K189j31j666K183k011l78J682k367J653P29j737K511
2175A533j176q86J881k547P15R47k125K384l57j012K407k067J34J162k600J657
$$ plain form
2191 50 58 -1403 1234 -52 -158 1664 -819 196 487 -1690 504 -316 -910 1488 -399 319 1320
2208 1320 -1140 494 -71 -1515 842 -634 -326 1503 -661 735 776 -1269 715 -624 -1109 992
2224 992 -868 318 1243 -819 1042 110 -1157 809 -1055 -511 959 -946 878 779 -794 1153
2240 1153 -543 -847 751 -1301 135 778 -864 1292 221 -618 1107 -1068 -399 550 -1343 729
2256 729 431 -616 1472 -348 -324 853 -1393 87 235 -1129 1149 15 -263 1371 -810 17 432
2273 432 -1448 508 -97 -740 1339 -335 125 1060 -1111 317 -7 -1286 822 -414 -258 1345 -636
2290 -636 491 601 -1229 597 -480 -927 1005 -671 306 1117 -808 822 31 -1111 736 -878
2306 -878 -399 981 -799 798 687 -801 960 -537 -819 676 -1121 156 762 -749 1135 201
$$ packed form
2191E0Qj461K637j286j06J822k483J015K91k177K194q20n94K398j887P18J001
2208A320k460J634n65j444K357j476L08J829k164J396M1k045J984j339m85K101
2224I92j860J186R25k062J861r32j267J966j864N44J470j905J824r9j573J947
2240A153j696l04J598k052J436O43j642K156j071q39J725k175O69R49j893K072
2256G29k98j047K088j820K4J177k246J480J48j364K278j134k78J634k181Q27M15
2273D32j880J956o05o43K079j674M60R35k171J428l24j279K108j236J56J603j981
2290f36J127J10j830J826j077m47J932j676R77Q11j925J630p91j142J847j614
2306h78M79J380j780J597j11j488J761j497k82J495j797J277O06j511J884r34
$$ plain form
2322 201 -643 927 -971 -451 534 -1151 653 484 -541 1303 -288 -382 727 -1278 7 281 -1008
2339 -1008 1067 121 -242 1268 -728 -60 390 -1373 416 -68 -664 1285 -234 139 1013 -1023 237
2356 237 -72 -1254 698 -381 -217 1282 -501 510 594 -1146 462 -509 -952 858 -590 302 1133
2373 1133 -642 809 71 -1082 571 -882 -482 871 -686 777 782 -634 921 -457 -849 512
2389 512 -1104 20 723 -606 1111 352 -500 864 -911 -543 352 -1160 501 493 -414 1297 -114
2406 -114 -316 652 -1226 -171 128 -1007 926 193 -105 1292 -551 -31 310 -1361 222 -180 -676
2423 -676 1200 -101 263 1050 -851 203 -133 -1264 518 -409 -204 1238 -313 559 634 -991 341
2440 341 -537 -995 671 -547 260 1107 -453 770 152 -991 426 -861 -574 711 -607 707 805
$$ packed form
2322B01q44J570j898N20R85j685J804j69j025J844j591r4J109k005J285K74j289
2339a008K075r46l63J510j996O68M50j763J789m84n96J949j519L73Q74k036J260
2356B37l09j182J952j079J64J499j783J011Q4j740J608r71m43J810j448Q92Q31
2373A133j775J451p38j153J653j453M00J353j557J463Nj416J555j378l92J361
2389E12j616J124P03j329J717p59q52J364j775L68Q95j512J661qr07J711j411
2406a14k02R68j878J055K99j135J933p33k98J397j843N20L41j671J583m02m96
2423f76J876j301L64P87j901J054l36j131J782r27K05J442j551Q72P5j625J332
2440C41q78m58J666j218Q07Q47j560J223o18j143J417j287K87J285j318J314R8
$$ plain form
2457 805 -481 862 -346 -804 416 -1052 -53 634 -532 1053 388 -388 804 -801 -505 280 -1062
2474 -1062 430 436 -345 1186 -71 -249 601 -1087 -165 97 -934 791 175 -120 1147 -453 -35 313
2492 313 -1181 208 -118 -628 1029 -110 153 913 -750 195 -20 -1053 500 -310 -226 1040 -341
2509 -341 407 557 -871 363 -347 -776 655 -461 146 870 -505 582 146 -816 492 -603 -422
2526 -422 696 -582 489 577 -586 700 -284 -610 529 -767 45 566 -591 743 159 -498 694
2543 694 -602 -269 477 -793 442 320 -494 818 -237 -323 604 -783 89 331 -699 678 8 -381
2561 -381 781 -552 -72 448 -817 423 113 -536 786 -326 -168 616 -759 229 214 -684 677 -160
2579 -160 -271 733 -604 85 339 -761 510 -15 -411 789 -398 -25 520 -768 305 68 -634
$$ packed form
2457H05j286J343j208m58J220j468R99O87j166J585o65p76J192j605K96P85j342
2474a062J492Op81J531j257j78Q50j688R22K62j031J725o16k95J267j600M18L48
2492C13j494J389l26n10J657j139K63P60j663R45k15j033J553q10Q4J266j381
2509c41P48J50j428J234p10m29J431j116O07P24j375J087m36r62J308j095J81
2526d22J118j278J071Q8j163J286r84l26J139j296Q12N21j157J334n84o57J192
2543F94j296L33P46j270J235j22q14J312j055q6R27j387Q72K42j030J377o70l89
2561c81J162j333M80N20j265J240l10o49J322j112J58P84j375R88j5q98J361q37
2579a60j11J004j337O89K54j100J271n25l96J200j187L73N45j288J073k37p02
$$ plain form
2596 -634 711 -234 -124 724 -598 207 221 -808 483 -214 -370 786 -411 192 526 -732 379 -128
2614 -128 -679 594 -410 -10 730 -493 439 207 -702 466 -445 -412 617 -499 338 558 -500 581
2632 581 -147 -584 458 -632 -84 545 -484 627 301 -441 621 -492 -395 374 -744 265 388 -409
2650 -409 798 -51 -309 521 -762 -125 208 -694 574 162 -223 840 -347 -118 317 -860 149 25
2668 25 -508 754 -45 -7 706 -569 72 76 -833 370 -134 -256 818 -243 202 483 -687 235 -176
2687 -176 -673 522 -302 30 725 -399 391 173 -703 353 -420 -388 561 -418 326 524 -439 508 -138
2706 -138 -542 389 -571 -71 492 -425 554 252 -392 544 -405 -336 367 -636 226 336 -399 657 -39 -280
2726 -280 500 -611 -81 239 -612 458 106 -278 672 -315 -98 363 -677 175 69 -487 589 -121 -109
$$ packed form
2596f34J345r45J10Q48j322Q05J4j029J291o97j56J156j197O03L34j258J111n07
2614a28n51J273j004M00P40j223R32k32r09J168r11L3J029j116Q37K20j058J081
2632E81p28m37J042j090N48O29j029J111l26p42J062j113R7P69j118J009J23p97
2650d09J207q49k58Q30j283O37L33r02J268m12l85J063j187K29M35j177J009j24
2668B5n33J262p99L8P13j275O41Mr09J203n04j22J074j061M45K81j170R22m11
2687a76m97J195q24L32O95j124P90k18q76J056p73L2R49r79P44J98r63R47o46
2706a38m04R31r60N00N63r17R79l02o44R36r49O9P03j003Q62J10p35J056o96k41
2726b80P80j111N30L20q51J070l52l84R50r87K17M61j040Q52j06n56J076p10J2
$$ plain form
2745 -109 584 -471 101 188 -625 359 -114 -305 613 -302 94 424 -545 295 -12 -499 489 -304 -85 541
2765 541 -441 279 205 -522 435 -230 -296 487 -454 138 347 -487 440 -38 -383 485 -396 -59 394 -510 326
2786 326 138 -415 507 -251 -187 441 -491 158 226 -485 459 -80 -267 515 -401 31 335 -517 345 27 -394
2807 -394 512 -294 -86 431 -485 255 147 -455 456 -198 -220 462 -450 128 269 -470 415 -48 -306 470
2827 470 -377 -25 344 -488 303 83 -375 494 -243 -121 421 -473 169 160 -456 442 -99 -212 504 -376 76
2848 76 282 -515 314 -38 -348 495 -262 13 420 -441 246 63 -476 369 -236 -172 456 -357 201 264 -423
2869 -423 350 -149 -360 382 -383 28 386 -366 384 97 -362 396 -345 -187 320 -445 252 243 -302 498 -123
2890 -123 -228 339 -489 4 195 -427 425 72 -161 501 -299 -94 212 -558 159 46 -318 527 -63 -4
$$ packed form
2745a09O93j055N72Q7q13R84m73j91R18r15L96L30r69Q40l07m87R88p93K19O26
2765E41r82P20p4p27R57o65o6P83r41N92K09q34R27m78l45Q68q81L37M53r04Q36
2786C26j88n53R22p58O4O28r32O49O8p11R44n39j87P82r16M32L04q52Q62l18m21
2807c94R06q06K08N17r16P40j08o02R11o54k2O82r12N78J41p39Q85m63k58P76
2827D70q47L52L69q32P91k20m58Q69p37J22N42q94O42ro16Q98n41j13P16q80M52
2848G6K06p97Q29l52l10Q43p57K75M07q61O87j83n39Q45o05O4O28q13N58O3o87
2869d23P73m99k11P42p65M11L58p52P50k87m59P58p41J58N07p65O97rn45Q00o21
2890a23j05N67q28M93J91o22Q52l53k33O62q00K05L06p70P17j13l64Q45n90N9
$$ plain form
2910 -4 437 -431 29 18 -558 291 -85 -141 582 -186 140 294 -515 153 -154 -435 391 -187 85 524 -274
2931 -274 278 57 -512 218 -335 -247 422 -239 304 385 -288 339 -177 -443 194 -439 -20 389 -228 469 204
2952 204 -277 328 -382 -304 187 -460 206 302 -163 555 -12 -205 260 -543 -123 108 -395 428 175 -65 555
2973 555 -229 -118 133 -588 58 28 -267 530 46 45 443 -399 -30 -30 -561 220 -67 -103 571 -104 145 269
2995 269 -499 62 -182 -434 350 -143 99 523 -229 229 66 -499 167 -291 -227 414 -184 284 372 -267 280
3016 280 -165 -420 203 -360 -2 383 -199 392 157 -300 277 -330 -274 215 -365 204 286 -210 432 -53 -257
3037 -257 237 -437 -71 192 -330 369 145 -165 423 -249 -132 167 -473 140 116 -223 471 -30 -80 311 -392
3058 -392 3 72 -394 304 26 -107 442 -212 -8 184 -446 132 -22 -263 406 -111 5 351 -331 86
$$ packed form
2910dM41q68M60j1n76Q49l76n6P23p68L26J54q09O68l07k81Q26n78K72M39p98
2931b74N52k21n69P30n53Q8O69o61N43Q1o73O27n16k66O37o33M19M09o17O97k65
2952B04m81O05p10P8M91o47O66R6m65P18n67j93M65q03M20K31n03Q23k53k40O20
2973E55p84J11K51p21O46l0k95P97m84jL98q42L69%n31P81k87l6O74o75K49J24
2995B69p68N61k44k52P84m93K42M24p52M58j63n65O66m58O4O41n98M68Q8o39N47
3016B80m45k55O23n63L58L85n82N91k35m57N77o07N6M89n80N69Q2m96O42m85k04
3037b57M94o74L66K63n22O99k24l10N88o72J17K99o40O13k4l39O94n01n0L91p03
3058c92L95O9m66O98k78j33N49o54K04J92o30N78j54k41O69n17J16L46o82M17
$$ plain form
3078 86 35 -417 260 -106 -109 424 -205 112 191 -405 169 -112 -277 340 -168 70 355 -283 183 6 -379 222
3100 222 -209 -101 373 -193 213 209 -329 210 -180 -286 247 -262 85 327 -220 298 18 -327 214 -323 -145
3121 -145 242 -256 278 232 -196 332 -173 -250 155 -393 39 213 -195 399 94 -142 285 -330 -146 92 -370
3142 -370 212 145 -94 445 -73 -82 181 -449 -33 18 -319 339 56 8 415 -212 -20 39 -484 79 -64 -187
3164 -187 432 -30 116 310 -323 45 -108 -428 176 -127 -7 436 -99 211 157 -363 90 -219 -304 249 -153
$$ packed form
3078H6n1m52O77l66lN33o29L17P9n96N74k81j65O17n08K38K85o38M66j77l85O01
3100B22m31J08M74n66M06mn38N39l90j06N33n09L47K42n47N18k80l45N41n37J78
3121a45L87m98N34m6m28N28n05p7M05n48M32J74m08N94l05k36M27o15J84K38m62
3142c70N82o7k39N39n18rK63o30M16N1l37O58k83m8M07o27J92N9n23N63j43j23
3164a87O19m62J46J94o33L68j53l20O04l03J20M43n35L10n4n20M53l09q5N53m02
$$ [...]
8191a0
##END NTUPLES=NMR FID
##END=
