##TITLE=1H_LY-Ni_600_Hex-240
 CDCl3, 8 sc, 
 17.1.2019
##JCAMPDX= 6.0         $$ Bruker NMR JCAMP-DX V2.0
##DATA TYPE= NMR FID
##DATA CLASS= NTUPLES
##ORIGIN= UXNMR, Bruker Analytische Messtechnik GmbH
##OWNER= root
$$ XWIN-NMR		Version 3.5
$$ Thu Jan 17 14:01:29 2019 Russian Standard Time (UT+4h)  she@DPX200
##.OBSERVE FREQUENCY= 200.1313
##.OBSERVE NUCLEUS= ^1H
##.DELAY= (6, 6)
##.ACQUISITION MODE= SIMULTANEOUS
##.ACQUISITION SCHEME= undefined
##.AVERAGES= 8
##.DIGITISER RES= 18
##SPECTROMETER/DATA SYSTEM= spect
##.PULSE SEQUENCE= zg30
##.SOLVENT NAME= CDCl3
##.SHIFT REFERENCE= (INTERNAL, CDCl3, 0, 15.7039)
##AUDIT TRAIL= $$ (NUMBER, WHEN, WHO, WHERE, WHAT)
$$ ##TITLE= Audit trail, XWIN-NMR		Version 3.5
$$ ##JCAMPDX= 5.01
$$ ##ORIGIN= Bruker BioSpin GmbH
$$ ##OWNER= she
$$ F:/spectra/data/she/nmr/H-F/1/audita.txt
$$ ##AUDIT TRAIL=  $$ (NUMBER, WHEN, WHO, WHERE, WHAT)
(   1,<2019-01-17 14:00:28.84 +0400>,<she>,<DPX200>,
      <created by zg, POWCHK disabled, PULCHK disabled
       configuration hash MD5:
       00 E9 B6 7A A2 85 ED C7 34 08 36 98 17 FE 4E 26
       data hash MD5: 16K
       3E 7A 17 DC 31 75 B5 9E 25 FA 1E C5 42 6C 82 79>)
$$ ##END=
$$ 
$$ hash MD5
$$ 35 6A A8 2A FD D0 00 BD 96 88 7D D6 56 E7 65 93
##$RELAX= 
##$RELAX= 
##$RELAX= 
##$RELAX= 
##$RELAX= 
##$RELAX= 
$$ Bruker specific parameters
$$ --------------------------
##$DU= <F:/spectra>
##$EXPNO= 1
##$NAME= <H-F>
##$PROCNO= 1
##$TYPE= <nmr>
##$USER= <she>
##$AMP= (0..31)
100 100 100 100 100 100 100 100 100 100 100 100 100 100 100 100 100 100 
100 100 100 100 100 100 100 100 100 100 100 100 100 100 
##$AQSEQ= 0
##$AQ_mod= 1
##$AUNM= <au_zg>
##$AUTOPOS= <>
##$BF1= 200.13
##$BF2= 200.13
##$BF3= 200.13
##$BF4= 200.13
##$BF5= 200.13
##$BF6= 200.13
##$BF7= 200.13
##$BF8= 200.13
##$BYTORDA= 1
##$CFDGTYP= 0
##$CFRGTYP= 5
##$CHEMSTR= <none>
##$CNST= (0..31)
1 1 145 1 1 1 1 1 1 1 1 1 1 1 1 1 1 1 1 1 1 1 1 1 1 1 1 1 1 1 1 1 
##$CPDPRG= <>
##$CPDPRG1= <>
##$CPDPRG2= <>
##$CPDPRG3= <>
##$CPDPRG4= <mlev>
##$CPDPRG5= <mlev>
##$CPDPRG6= <mlev>
##$CPDPRG7= <mlev>
##$CPDPRG8= <mlev>
##$CPDPRGB= <>
##$CPDPRGT= <>
##$D= (0..31)
0 1.2 0 0 0 0 0 0 0 0 0 0.03 0 0 0 0 0 0 0 0 0 0 0 0 0 0 0 0 0 0 0 0 
##$DATE= 1547719228
##$DBL= (0..7)
120 120 120 120 120 120 120 120 
##$DBP= (0..7)
150 150 150 150 150 150 150 150 
##$DBP07= 0
##$DBPNAM0= <>
##$DBPNAM1= <>
##$DBPNAM2= <>
##$DBPNAM3= <>
##$DBPNAM4= <>
##$DBPNAM5= <>
##$DBPNAM6= <>
##$DBPNAM7= <>
##$DBPOAL= (0..7)
0.5 0.5 0.5 0.5 0.5 0.5 0.5 0.5 
##$DBPOFFS= (0..7)
0 0 0 0 0 0 0 0 
##$DE= 6
##$DECBNUC= <off>
##$DECIM= 32
##$DECNUC= <off>
##$DECSTAT= 4
##$DIGMOD= 1
##$DIGTYP= 9
##$DL= (0..7)
0 120 120 120 120 120 120 120 
##$DP= (0..7)
150 150 150 150 150 150 150 150 
##$DP07= 0
##$DPNAME0= <>
##$DPNAME1= <>
##$DPNAME2= <>
##$DPNAME3= <>
##$DPNAME4= <>
##$DPNAME5= <>
##$DPNAME6= <>
##$DPNAME7= <>
##$DPOAL= (0..7)
0.5 0.5 0.5 0.5 0.5 0.5 0.5 0.5 
##$DPOFFS= (0..7)
0 0 0 0 0 0 0 0 
##$DQDMODE= 0
##$DR= 18
##$DS= 0
##$DSLIST= <SSSSSSSSSSSSSSS>
$$ [...]
##$SUBNAM2= <"">
##$SUBNAM3= <"">
##$SUBNAM4= <"">
##$SUBNAM5= <"">
##$SUBNAM6= <"">
##$SUBNAM7= <"">
##$SUBNAM8= <"">
##$SUBNAM9= <"">
##$SW= 20.0189088683792
##$SWIBOX= (0..15)
0 0 2 0 0 0 0 0 0 0 0 0 0 0 0 0 
##$SW_h= 4006.41025641026
##$TD= 16384
##$TD0= 1
##$TE= 0
##$TE2= 300
##$TE3= 300
##$TEG= 300
##$TL= (0..7)
0 120 120 120 120 120 120 120 
##$TP= (0..7)
150 150 150 150 150 150 150 150 
##$TP07= 0
##$TPNAME0= <>
##$TPNAME1= <>
##$TPNAME2= <>
##$TPNAME3= <>
##$TPNAME4= <>
##$TPNAME5= <>
##$TPNAME6= <>
##$TPNAME7= <>
##$TPOAL= (0..7)
0.5 0.5 0.5 0.5 0.5 0.5 0.5 0.5 
##$TPOFFS= (0..7)
0 0 0 0 0 0 0 0 
##$TUNHIN= 0
##$TUNHOUT= 0
##$TUNXOUT= 0
##$USERA1= <user>
##$USERA2= <user>
##$USERA3= <user>
##$USERA4= <user>
##$USERA5= <user>
##$V9= 5
##$VALIST= <valist>
##$VCLIST= <CCCCCCCCCCCCCCC>
##$VD= 0
##$VDLIST= <DDDDDDDDDDDDDDD>
##$VPLIST= <PPPPPPPPPPPPPPP>
##$VTLIST= <TTTTTTTTTTTTTTT>
##$WBST= 1024
##$WBSW= 4
##$XGAIN= (0..3)
0 0 0 0 
##$XL= 0
##$YL= 0
##$YMAX_a= 180608
##$YMIN_a= -182697
##$ZGOPTNS= <>
##$ZL1= 120
##$ZL2= 120
##$ZL3= 120
##$ZL4= 120
##$ABSF1= 10
##$ABSF2= 0
##$ABSG= 5
##$ABSL= 3
##$ALPHA= 0
##$AQORDER= 0
##$ASSFAC= 0
##$ASSFACI= 0
##$ASSFACX= 0
##$ASSWID= 0
##$AUNMP= <proc_1d>
##$AZFE= 0.1
##$AZFW= 0.1
##$BCFW= 1
##$BC_mod= 2
##$BYTORDP= 1
##$COROFFS= 0
##$CY= 11.3945322036743
##$DATMOD= 1
##$DC= 2
##$DFILT= <>
##$DTYPP= 0
##$F1P= 18.9103706918063
##$F2P= -1.10871071338519
##$FCOR= 0.5
##$FTSIZE= 0
##$FT_mod= 4
##$GAMMA= 1
##$GB= 0.15
##$INTBC= 1
##$INTSCL= 1
##$ISEN= 128
##$LB= 0.24
##$LEV0= 0
##$LPBIN= 0
##$MAXI= 10000
##$MC2= 0
##$MEAN= 0
##$ME_mod= 0
##$MI= 1.114404
##$NCOEF= 0
##$NC_proc= 0
##$NLEV= 6
##$NOISF1= 3.799351
##$NOISF2= 2.8
##$NSP= 1
##$NTH_PI= 0
##$NZP= 0
##$OFFSET= 15.70392
##$PC= 1
##$PHC0= -9128.22
##$PHC1= 12.00004
##$PH_mod= 1
##$PKNL= yes
##$PPARMOD= 0
##$PSCAL= 0
##$PSIGN= 0
##$REVERSE= no
##$SF= 200.130013532006
##$SI= 16384
##$SIGF1= 3
##$SIGF2= 2
##$SINO= 400
##$SIOLD= 16384
##$SREGLST= <1H.CDCl3>
##$SSB= 0
##$STSI= 0
##$STSR= 0
##$SW_p= 3612.71676300578
##$SYMM= 0
##$S_DEV= 0
##$TDeff= 0
##$TDoff= 0
##$TI= <>
##$TILT= no
##$TM1= 0
##$TM2= 0
##$TOPLEV= 0
##$USERP1= <user>
##$USERP2= <user>
##$USERP3= <user>
##$USERP4= <user>
##$USERP5= <user>
##$WDW= 1
##$XDIM= 8192
##$YMAX_p= 0
##$YMIN_p= 0
$$ End of Bruker specific parameters
$$ ---------------------------------
##NTUPLES= NMR FID
##VAR_NAME=  TIME,          FID/REAL,        FID/IMAG
##SYMBOL=    X,             R,               I
##VAR_TYPE=  INDEPENDENT,   DEPENDENT,       DEPENDENT
##VAR_FORM=  AFFN,          ASDF,            ASDF
##VAR_DIM=   8192,          8192,            8192
##UNITS=     SECONDS,       ARBITRARY UNITS, ARBITRARY UNITS
##FACTOR=    0.0002496,     1,               1
##FIRST=     0,             0,               0
##LAST=      2.0444736,     0,               0
##MIN=       0,             -182697,         0
##MAX=       2.0444736,     180608,          0
$$ Real data points
##PAGE= N=1
##DATA TABLE= (X++(R..R)), XYDATA
0 0 0 0 0 0 0 0 0 0 0 0 0 0 0 0 5 -8 8 -8 8 -8 13 -16 16 -21 24 -24 32 -37 40 -48 56 -61 69 -80 89 -99 110
37 110 -125 139 -155 172 -191 213 -232 257 -286 313 -347 381 -420 463 -511 561 -621 686 -763
56 -763 848 -947 1066 -1206 1377 -1588 1865 -2232 2755 -3541 4869 -7505 14659 -72389 -182697
71 -182697 116540 153859 -132587 -131783 149914 98066 -152952 -69734 152619 39310 -140355
82 -140355 -15828 125941 -3484 -103984 14085 82719 -18549 -60127 13880 41188 -4719
93 -4719 -26498 -11196 17920 28365 -16100 -47374 21740 64346 -33017 -77589 50823 86077
105 86077 -71127 -87528 94186 82309 -116404 -70394 136041 51681 -152016 -29072 161380
116 161380 2383 -164780 24757 160786 -51052 -149824 74725 133583 -93007 -112082
126 -112082 106074 88617 -111939 -64105 111252 40886 -104691 -21192 92499 5480 -77462
137 -77462 4067 60169 -8085 -43254 6301 28416 800 -16556 -11168 9830 24422 -7780
149 -7780 -37935 11209 50466 -19583 -60688 31548 66632 -46764 -68419 62822 64878 -78820
161 -78820 -56507 93152 44022 -104121 -27751 111509 9715 -113897 9395 111660 -27838
172 -27838 -104904 44136 93881 -57737 -80236 67055 64351 -72249 -48098 72975 32646
183 32646 -69382 -18829 62711 8299 -53156 -923 42585 -2416 -31796 1959 21922 1480
195 1480 -14477 -7925 9396 15527 -7904 -23933 9624 31792 -14309 -37895 21888 42079 -30860
208 -30860 -43000 41049 41093 -50981 -36120 59791 28226 -67118 -18657 71527 7250 -73592 4293
221 4293 72470 -15688 -68629 26089 62652 -34377 -54425 40915 45500 -44578 -35845 45910 26597
234 26597 -44963 -18478 41727 11508 -37454 -6828 31907 3855 -26384 -3053 21238 4143
246 4143 -16855 -6405 14174 9987 -12767 -13683 13298 17420 -15358 -20528 18701 22358 -23289
259 -23289 -23115 28147 22022 -33345 -19582 37997 15660 -41810 -10473 44641 4711 -45860 1689
272 1689 45842 -7877 -44289 13685 41474 -18820 -37777 22769 33221 -25734 -28467 27402
284 27402 23639 -27920 -19049 27534 15110 -26214 -11788 24433 9369 -22347 -7825 20171
296 20171 7010 -18313 -7039 16762 7499 -15830 -8362 15537 9349 -15843 -10174 16825 10845
309 10845 -18200 -10984 19999 10646 -21998 -9737 23914 8120 -25832 -6117 27232 3481
321 3481 -28339 -605 28841 -2471 -28695 5678 28096 -8582 -26734 11427 25056 -13751
333 -13751 -22923 15647 20530 -17120 -18123 17928 15596 -18404 -13333 18344 11168 -17999 -9357
346 -9357 17400 7920 -16587 -6769 15819 6094 -15010 -5614 14443 5466 -14063 -5489 13919
359 13919 5523 -14136 -5642 14517 5516 -15223 -5297 16049 4765 -17004 -3947 17984 2826
372 2826 -18829 -1355 19548 -329 -19951 2283 20047 -4320 -19730 6399 19018 -8364
384 -8364 -17928 10115 16497 -11607 -14844 12679 12982 -13420 -11175 13691 9367 -13628 -7759 13264
398 13264 6422 -12642 -5381 11940 4726 -11161 -4367 10551 4339 -10104 -4516 9943 4805
411 4805 -10110 -5148 10554 5291 -11357 -5324 12278 4954 -13412 -4292 14521 3269 -15478
424 -15478 -1830 16292 199 -16684 1760 16789 -3709 -16353 5696 15510 -7525 -14266
436 -14266 8995 12623 -10150 -10857 10784 8940 -10979 -7157 10688 5579 -10002 -4306 9081
449 9081 3533 -7948 -3165 6913 3288 -6013 -3816 5397 4580 -5257 -5581 5500 6509 -6314 -7337
464 -7337 7504 7790 -9066 -7830 10816 7328 -12590 -6246 14230 4682 -15528 -2630 16395
477 16395 331 -16665 2134 16336 -4558 -15414 6726 13897 -8542 -11976 9802 9763 -10458
490 -10458 -7428 10448 5196 -9810 -3253 8637 1783 -7060 -891 5301 684 -3535 -1123 1963
504 1963 2196 -780 -3706 213 5478 -318 -7382 1096 9100 -2602 -10476 4623 11258 -7082 -11342
519 -11342 9700 10620 -12261 -9121 14509 6942 -16198 -4190 17198 1154 -17350 1987 16651
532 16651 -4942 -15158 7445 12965 -9344 -10340 10412 7441 -10687 -4587 10069 2000 -8721
545 -8721 104 6778 -1479 -4422 2128 2006 -1856 405 798 -2382 995 3730 -3293 -4313 5821
560 5821 3997 -8457 -2855 10728 834 -12532 1778 13551 -4860 -13683 8098 12905 -11152
573 -11152 -11132 13871 8656 -15816 -5470 16974 1993 -17111 1545 16231 -4865 -14484 7586
586 7586 11908 -9583 -8860 10579 5549 -10623 -2356 9685 -460 -7881 2647 5479 -3977 -2644
600 -2644 4451 -213 -3894 2918 2457 -5115 -303 6586 -2395 -7236 5303 6849 -8238 -5588 10783
615 10783 3422 -12772 -602 13933 -2640 -14160 6064 13432 -9260 -11694 12098 9220 -14161
628 -14161 -6075 15386 2584 -15609 929 14790 -4254 -13100 6988 10552 -9006 -7556 10036
641 10036 4279 -10075 -1064 9161 -1740 -7330 3945 4924 -5271 -2060 5689 -850 -5123 3566
655 3566 3658 -5789 -1480 7262 -1251 -7918 4154 7595 -7050 -6379 9585 4323 -11520 -1628 12705
670 12705 -1413 -12958 4643 12330 -7636 -10773 10267 8502 -12216 -5699 13362 2563 -13632
683 -13632 576 12963 -3529 -11517 5988 9355 -7803 -6733 8770 3875 -8892 -1062 8142
696 8142 -1456 -6638 3420 4552 -4675 -2091 5126 -461 -4716 2852 3518 -4838 -1648 6204 -677
711 -677 -6824 3218 6613 -5745 -5614 7973 3878 -9709 -1612 10787 -1020 -11063 3792 10583
725 10583 -6371 -9292 8625 7434 -10316 -5046 11338 2448 -11590 200 11090 -2630 -9958
738 -9958 4645 8216 -6160 -6166 6968 3900 -7111 -1688 6585 -272 -5455 1865 3910 -2874 -2029
753 -2029 3331 82 -3058 1787 2183 -3374 -791 4433 -995 -4980 2912 4846 -4879 -4133 6623
768 6623 2866 -7995 -1122 8909 -840 -9180 3008 8904 -5013 -7981 6816 6613 -8195 -4851
782 -4851 9043 2841 -9369 -854 9076 -1063 -8315 2638 7084 -3825 -5591 4556 3970 -4737
796 -4737 -2311 4482 888 -3756 294 2710 -1066 -1425 1407 47 -1315 1229 724 -2357 182 3140
812 3140 -1395 -3529 2752 3491 -4081 -3006 5352 2157 -6325 -959 7033 -440 -7322 1937 7168
827 7168 -3416 -6630 4734 5689 -5812 -4518 6525 3158 -6881 -1713 6830 352 -6402 853
841 853 5673 -1783 -4697 2394 3598 -2679 -2517 2581 1490 -2186 -664 1529 71 -725 206 -157
857 -157 -167 1025 -140 -1722 746 2271 -1493 -2544 2394 2536 -3279 -2249 4116 1695 -4801 -926
873 -926 5303 11 -5537 1004 5549 -2000 -5226 2939 4697 -3735 -3974 4325 3091 -4691 -2179 4778
889 4778 1224 -4658 -376 4291 -355 -3780 888 3132 -1194 -2392 1320 1735 -1164 -1110 856 655
905 655 -385 -384 -161 294 701 -462 -1239 735 1611 -1235 -1879 1795 1949 -2401 -1812 3041 1547 -3543
923 -3543 -1039 4005 433 -4250 279 4350 -1031 -4291 1712 3944 -2412 -3568 2897 2966 -3312 -2348
939 -2348 3538 1674 -3574 -991 3467 416 -3141 119 2777 -450 -2295 652 1786 -715 -1318
954 -1318 568 861 -334 -586 -56 403 468 -397 -878 559 1285 -843 -1541 1260 1727 -1737 -1721 2266
972 2266 1592 -2769 -1279 3209 827 -3557 -279 3758 -357 -3796 1011 3656 -1643 -3384 2201
987 2201 2931 -2630 -2413 2915 1795 -3049 -1181 3026 589 -2835 -66 2529 -328 -2096 612 1634
1003 1634 -698 -1152 671 700 -471 -338 136 68 254 6 -728 33 1152 -275 -1531 644 1817 -1113
1021 -1113 -1919 1674 1889 -2218 -1649 2751 1289 -3183 -769 3468 117 -3632 527 3549 -1236 -3344
1037 -3344 1843 2922 -2351 -2367 2722 1748 -2882 -1043 2887 417 -2675 176 2310 -623 -1833 930
1053 930 1285 -1034 -725 974 166 -743 260 346 -587 144 722 -692 -680 1248 451 -1716 -35 2088
1071 2088 -494 -2273 1121 2301 -1777 -2121 2383 1729 -2930 -1197 3308 521 -3505 217 3493
1086 3493 -969 -3275 1664 2859 -2241 -2269 2649 1575 -2846 -814 2840 89 -2592 564 2171
1101 2171 -1072 -1591 1413 933 -1498 -244 1386 -404 -1069 930 565 -1296 43 1443 -726 -1397
1117 -1397 1379 1127 -1946 -640 2411 50 -2647 689 2713 -1412 -2512 2137 2132 -2744 -1552 3187
1133 3187 830 -3421 -53 3430 -763 -3213 1503 2775 -2120 -2157 2569 1426 -2748 -599 2757
1148 2757 -152 -2474 893 2016 -1417 -1368 1780 626 -1877 133 1729 -857 -1364 1458 793 -1864
1164 -1864 -91 2039 -665 -1965 1430 1668 -2054 -1147 2563 476 -2870 297 2922 -1128 -2764
1179 -2764 1865 2338 -2538 -1740 2996 1001 -3249 -161 3270 -648 -3027 1417 2594 -2016 -1957 2453
1195 2453 1227 -2651 -427 2621 -345 -2344 1041 1860 -1579 -1232 1902 490 -2011 290 1859
1210 1859 -1009 -1484 1609 933 -2035 -226 2224 -547 -2194 1308 1891 -1991 -1382 2494 712 -2828
1226 -2828 41 2892 -845 -2736 1600 2341 -2231 -1748 2698 1031 -2944 -254 2956 -526 -2729
1241 -2729 1243 2322 -1828 -1724 2229 1022 -2397 -282 2367 -436 -2090 1058 1659 -1533 -1080 1819
1257 1819 387 -1916 301 1791 -951 -1463 1482 964 -1873 -336 2063 -335 -2054 1043 1832 -1643
1273 -1643 -1394 2125 809 -2439 -152 2536 -548 -2430 1223 2115 -1791 -1637 2230 1010 -2460 -330
1289 -330 2515 -354 -2339 1019 2017 -1489 -1471 1883 890 -2029 -236 2001 -370 -1785 917 1395
1305 1395 -1344 -901 1592 327 -1684 254 1566 -792 -1290 1264 887 -1563 -371 1750 -180 -1736
1321 -1736 739 1560 -1239 -1254 1639 782 -1914 -279 1996 -314 -1937 851 1713 -1315 -1348 1680 881
1338 881 -1880 -315 1954 -213 -1825 733 1575 -1144 -1174 1449 714 -1598 -212 1580 -289 -1452
1354 -1452 736 1152 -1087 -765 1309 313 -1389 159 1309 -584 -1109 950 793 -1213 -408 1355
1370 1355 -25 -1355 441 1230 -840 -1002 1146 665 -1359 -284 1443 -140 -1407 547 1264 -915
1386 -915 -1007 1177 663 -1346 -280 1418 -118 -1335 504 1198 -809 -911 1069 601 -1202 -219 1224
1403 1224 -148 -1147 474 957 -765 -706 934 381 -1044 -35 1018 -296 -899 577 712 -783 -417
1420 -417 937 123 -959 194 895 -487 -746 724 518 -894 -250 980 -60 -990 355 884 -619
1437 -619 -705 838 502 -965 -201 1067 -65 -1013 347 934 -576 -762 775 524 -886 -289 947
1454 947 22 -912 209 799 -429 -650 591 436 -688 -216 712 -26 -665 237 556 -418 -380 540 182
1473 182 -600 40 599 -255 -519 447 375 -597 -190 687 -16 -711 228 666 -422 -564 602 414 -718
1492 -718 -223 801 14 -814 191 759 -382 -664 549 511 -661 -334 717 126 -735 48 672 -230
1510 -230 -594 368 437 -481 -289 517 119 -513 59 461 -205 -348 327 224 -395 -60 430 -97 -390 252
1530 252 314 -382 -180 480 38 -521 132 533 -289 -465 438 372 -559 -229 642 62 -668 99 659 -274 -607
1551 -607 402 481 -547 -339 593 171 -626 -25 615 -116 -537 267 436 -365 -303 412 156 -434 -14 400
1571 400 -125 -331 222 220 -311 -110 352 -42 -338 172 294 -287 -197 402 90 -449 67 455 -203 -435 351
1592 351 355 -461 -260 539 106 -594 29 580 -197 -544 323 448 -448 -340 508 181 -561 -44 540 -125 -495
1613 -495 239 397 -349 -273 398 131 -411 13 382 -142 -308 248 202 -331 -82 341 -52 -365 182 291 -307
1634 -307 -207 382 102 -435 41 460 -171 -417 319 348 -418 -246 497 116 -533 20 525 -186 -493 279
1654 279 380 -407 -276 462 139 -505 0 497 -123 -422 263 345 -353 -212 407 66 -424 64 388 -208
1674 -208 -316 288 204 -371 -69 394 -59 -365 208 318 -309 -210 394 91 -436 55 429 -177 -394 300 320
1695 320 -410 -217 464 66 -503 62 482 -214 -432 327 337 -424 -215 486 78 -503 51 483 -195 -421
1715 -421 306 318 -380 -176 437 48 -440 97 393 -210 -312 319 217 -373 -81 399 -66 -373 206 306
1735 306 -324 -207 400 78 -414 70 417 -190 -365 325 281 -407 -156 460 12 -494 117 454 -266 -402
1755 -402 371 294 -456 -170 510 25 -516 124 483 -231 -412 351 302 -410 -157 447 52 -445 100 413 -209
1776 -209 -312 300 210 -368 -77 370 -34 -349 165 289 -266 -198 340 65 -372 71 370 -189 -315 307 241
1797 241 -404 -126 448 -7 -467 138 438 -278 -371 370 262 -454 -151 486 12 -485 116 448 -239 -374
1817 -374 327 282 -394 -149 418 35 -393 106 350 -189 -271 272 169 -307 -56 315 -61 -296 149 230 -241
1838 -241 -144 298 41 -329 69 318 -192 -275 278 188 -358 -112 397 -18 -416 135 384 -241 -319 330 229
1859 229 -409 -133 430 11 -422 103 385 -203 -315 289 235 -328 -128 357 12 -340 89 291 -172 -216 233
1880 233 138 -259 -23 271 -63 -240 148 187 -213 -98 259 5 -277 75 260 -177 -232 239 161 -297 -70
1901 -70 334 -11 -333 113 319 -199 -250 279 193 -317 -103 354 15 -335 83 309 -169 -252 235 193 -272 -96
1923 -96 293 17 -268 74 241 -146 -171 205 112 -217 -28 222 -57 -186 127 152 -189 -82 209 12 -226
1944 -226 63 214 -127 -173 187 126 -234 -56 255 -18 -252 94 254 -165 -204 221 145 -232 -68 260 18
1965 18 -260 70 246 -112 -193 171 150 -209 -87 207 10 -211 42 187 -96 -136 146 87 -155 -28 164 -35
1987 -35 -149 95 108 -139 -71 156 12 -173 41 151 -115 -132 144 93 -184 -45 202 -12 -204 64 192 -109
2009 -109 -147 170 114 -196 -47 222 8 -196 61 181 -86 -143 128 109 -158 -73 157 7 -167 32 135 -83
2031 -83 -104 97 71 -114 -12 126 -9 -102 59 88 -88 -55 114 8 -122 36 118 -73 -98 108 75 -130 -39
2054 -39 145 -10 -143 51 139 -93 -113 114 93 -128 -39 165 28 -137 34 143 -62 -125 100 79 -124 -50 118
2077 118 18 -110 23 108 -43 -86 77 58 -75 -25 94 -5 -84 29 74 -54 -33 80 29 -78 20 81 -48 -67
2101 -67 57 55 -79 -28 94 9 -105 42 104 -56 -56 96 68 -97 -26 117 3 -105 39 123 -45 -82 87 70
2125 70 -90 -43 107 16 -93 18 86 -41 -79 55 50 -62 -28 71 14 -55 17 50 -24 -30 53 27 -36 2 52 -15 -35 41
2153 41 33 -49 -17 70 -4 -71 36 62 -46 -57 64 53 -69 -10 86 11 -82 24 89 -37 -69 65 60 -62 -40 76 29
2180 29 -82 -1 73 -20 -67 31 52 -49 -19 52 16 -38 12 48 -15 -18 36 30 -33 21 29 -22 -17 44 17 -39 2 61 -17 -50 43
2211 43 56 -29 -32 66 43 -68 -15 76 -5 -75 29 78 -41 -60 46 62 -49 -41 56 11 -65 -4 67 -5 -41 23 42 -22 -24
2240 -24 35 12 -23 10 36 -14 -3 31 5 -20 31 43 -23 -8 53 26 -34 10 60 -13 -49 33 48 -41 -43 64 28 -62 -18 69
2270 69 -4 -66 20 68 -31 -48 50 43 -40 -18 57 20 -52 -1 52 -9 -31 25 28 -14 -8 24 8 -21 20 14 -21 0 40 3 -21 27
2302 27 29 -22 -11 45 8 -37 2 46 -18 -54 44 53 -53 -40 56 20 -72 -2 63 -14 -69 24 63 -38 -41 48 31 -55 -19 61 9
2333 9 -40 7 41 -15 -25 46 20 -28 15 35 -13 -14 30 20 -24 2 42 1 -27 42 42 -19 -16 56 6 -43 5 48 -16 -49 30 54
2365 54 -45 -32 53 8 -57 -12 60 -18 -64 23 45 -43 -37 55 31 -45 3 45 -7 -33 23 32 -39 -5 48 13 -52 12 39 -8 -32
2396 -32 38 18 -39 3 48 -12 -30 28 34 -29 -8 58 11 -50 19 52 -26 -36 44 38 -43 -20 51 6 -63 -5 45 -17 -47 40 35 -52
2428 -52 -22 59 13 -59 12 58 -18 -43 48 42 -37 -15 49 2 -46 6 43 -29 -22 47 16 -56 -7 55 4 -46 35 31 -39 -17 48 7
2460 7 -62 16 61 -31 -37 58 35 -55 -27 65 2 -62 5 59 -29 -59 48 30 -58 -21 59 4 -65 15 60 -24 -48 42 37 -41 -7
2491 -7 55 8 -39 28 44 -24 -28 47 11 -43 10 58 -16 -45 28 33 -41 -20 52 2 -51 10 65 -28 -47 48 36 -54 -15 66 6 -64
2523 -64 11 60 -30 -50 44 32 -57 -14 62 3 -63 18 51 -35 -36 45 30 -39 -15 42 6 -37 31 48 -26 -20 53 8 -43 9 50
2554 50 -14 -50 38 35 -36 -18 46 6 -51 19 49 -29 -44 39 42 -51 -29 60 4 -60 20 60 -15 -54 37 39 -48 -29 69 -1 -49 10
2586 10 57 -14 -37 31 30 -35 -12 57 -2 -43 14 29 -31 -23 37 13 -44 3 53 -19 -41 33 31 -46 -34 56 5 -59 3 49 -32 -48
2618 -48 36 37 -44 -9 57 6 -50 8 62 -16 -34 42 39 -31 -11 52 12 -45 19 49 -21 -34 41 28 -43 -12 52 -4 -35 21 40
2649 40 -22 -24 45 21 -44 -8 48 -6 -34 28 37 -37 -18 48 18 -43 -1 41 -3 -35 33 28 -44 -10 56 22 -39 23 51 -19 -30 32
2681 32 34 -35 -22 45 12 -49 16 46 -27 -18 30 36 -31 -18 41 0 -45 11 44 -13 -30 41 16 -45 -7 45 -1 -41 16 44 -31 -20
2713 -20 42 16 -46 -10 32 -16 -38 16 33 -31 -16 52 16 -26 1 53 -8 -36 18 33 -37 -17 43 7 -36 7 50 -13 -33 36
2743 36 20 -38 -20 34 2 -37 8 25 -24 -32 25 26 -37 -1 44 -5 -34 17 28 -31 -23 30 14 -39 2 41 -10 -34 19 28 -28 -29 35
2776 35 14 -45 7 39 -2 -24 25 36 -24 -12 40 5 -41 8 43 -25 -27 27 25 -38 -14 45 3 -42 14 30 -6 -36 31 27 -32 0
2808 0 34 1 -43 12 39 -14 -10 48 28 -29 3 39 0 -32 19 38 -24 -21 40 4 -38 1 50 -11 -33 35 39 -25 -9 65 22 -30
2840 -30 0 36 -15 -40 32 26 -36 -19 32 16 -50 3 40 -19 -33 31 19 -45 -8 39 12 -36 21 41 -23 -20 40 29 -26 2 41
2871 41 -8 -38 26 43 -28 -20 46 19 -47 3 47 -11 -29 29 35 -32 -15 42 12 -41 9 55 -17 -40 37 35 -47 -19 56 2 -43 14
2903 14 37 -28 -41 36 26 -43 -3 46 -3 -36 23 54 -19 -12 51 23 -53 8 48 -15 -34 38 42 -41 -21 52 19 -46 9 58 -16
2934 -16 -49 34 33 -38 -29 48 3 -43 21 53 -34 -31 42 26 -46 -13 51 -10 -52 26 38 -38 -34 35 16 -44 -7 52 -12 -45 28 39
2966 39 -32 -24 49 12 -42 -1 55 -7 -42 36 45 -34 -28 49 8 -53 12 66 -33 -52 22 30 -62 -19 52 5 -59 24 55 -22 -38 41
2998 41 24 -52 -5 44 1 -48 28 46 -33 -26 43 18 -61 4 55 -17 -51 19 37 -48 -26 57 19 -56 8 63 -19 -42 40 43 -49
3029 -49 -22 59 7 -61 21 52 -35 -41 40 30 -42 -6 56 -1 -65 12 47 -42 -38 37 31 -58 -10 52 2 -59 34 42 -32 -34 49 20 -55
3062 -55 5 50 -21 -56 36 30 -38 -33 48 4 -65 2 56 -13 -50 45 38 -59 -15 53 -3 -66 9 49 -35 -47 39 27 -36 -21 50 -6
3094 -6 -55 14 48 -39 -44 49 21 -59 -4 50 4 -51 31 54 -37 -32 46 25 -53 1 54 -6 -43 35 50 -44 -25 57 20 -47 5 57
3126 57 -21 -42 38 40 -48 -24 62 4 -53 9 51 -34 -52 40 25 -65 -9 56 -2 -63 16 44 -41 -52 41 17 -58 -9 63 -7 -59
3157 -59 22 54 -34 -41 56 17 -49 -10 69 -12 -47 32 49 -29 -31 52 5 -64 1 49 -19 -49 35 32 -45 -26 53 9 -62 7 57 -37
3189 -37 -43 47 35 -58 -29 57 -3 -72 10 57 -17 -45 41 35 -56 -11 52 -1 -52 19 52 -22 -19 59 38 -53 -12 60 -2 -59 19 51
3221 51 -36 -34 53 22 -46 -11 53 -16 -50 23 43 -36 -31 53 18 -53 5 50 -29 -52 36 38 -56 -26 58 4 -63 7 68 -28 -49 37
3253 37 38 -47 -23 53 1 -60 10 65 -25 -49 42 33 -46 -22 63 17 -47 4 46 -31 -43 40 19 -45 -12 41 -4 -60 28 39 -40
3284 -40 -33 46 29 -52 -5 45 -18 -55 31 41 -35 -30 46 17 -53 3 57 -22 -40 43 36 -39 -36 60 8 -59 4 46 -22 -51 28 40
3316 40 -42 -23 50 15 -52 -4 48 -26 -44 41 30 -51 -18 42 -12 -51 10 45 -27 -35 40 29 -58 -8 44 -18 -44 21 46 -35 -25
3347 -25 54 16 -52 4 57 -15 -41 20 47 -37 -38 50 5 -46 -4 51 -16 -42 35 43 -49 -26 47 0 -58 2 44 -20 -58 29 41
3378 41 -47 -25 54 6 -56 1 40 -29 -37 28 29 -44 -23 42 -11 -56 15 39 -23 -38 46 19 -54 -2 45 1 -45 20 35 -41 -35 43
3410 43 17 -49 -7 51 -19 -53 27 35 -45 -26 53 21 -66 -3 50 -16 -45 28 36 -52 -26 41 16 -55 0 42 -18 -44 24 30 -52 -12
3442 -12 43 5 -53 23 44 -21 -41 50 27 -39 -9 51 -1 -40 40 49 -40 -31 47 13 -57 -10 53 -11 -54 23 31 -45 -30 56 18 -56
3474 -56 0 50 -15 -54 18 35 -38 -27 53 0 -47 0 55 -14 -44 15 30 -23 -13 37 14 -40 11 47 -22 -36 41 29 -44 -6
3504 -6 53 -6 -45 23 48 -39 -36 42 7 -53 -9 49 -29 -62 16 41 -44 -31 26 24 -53 -14 59 -14 -50 18 36 -33 -29 43 17 -50
3536 -50 4 63 0 -34 37 39 -35 -20 54 9 -39 15 35 -21 -42 31 31 -27 -2 53 8 -40 20 37 -28 -37 31 22 -53 -14 54 -5
3568 -5 -50 24 43 -37 -36 33 20 -59 -14 53 -7 -62 16 55 -29 -35 32 28 -42 3 46 14 -39 33 40 -28 -19 30 8 -36 -1 35 -14
3601 -14 -34 47 25 -40 -3 47 -4 -46 21 41 -39 -41 40 23 -59 -17 58 -18 -47 15 34 -35 -35 35 24 -58 -16 50 -6 -48 17
3632 17 50 -35 -37 41 25 -35 0 56 -1 -35 27 36 -42 -14 31 9 -32 7 57 -17 -31 28 34 -37 -14 43 -5 -49 18 50 -27 -49
3664 -49 36 16 -53 -12 54 3 -59 7 55 -33 -43 43 34 -44 -23 47 1 -50 8 46 -27 -39 42 17 -31 5 48 -2 -38 18 41
3695 41 -22 -25 43 31 -38 10 48 -14 -29 30 32 -38 -25 44 3 -51 12 50 -31 -33 43 27 -44 -27 51 -1 -55 27 55 -26 -42 44
3727 44 35 -46 -19 57 7 -46 16 52 -28 -29 48 28 -37 -8 57 -3 -42 26 43 -27 -18 42 14 -32 -3 52 -14 -41 17 33 -27 -18
3759 -18 30 3 -47 7 48 -20 -40 33 31 -43 -29 57 0 -47 1 58 -17 -42 52 47 -31 -21 53 16 -50 15 49 -20 -25 24 36 -32
3791 -32 -20 50 -5 -46 9 45 -22 -28 37 18 -45 -11 35 -19 -39 18 32 -31 -23 50 7 -49 -3 39 -24 -53 17 16 -45 -31 40 9
3823 9 -46 -5 65 -15 -53 45 45 -42 -21 43 11 -42 12 55 -11 -45 32 32 -43 -28 47 13 -35 6 36 -24 -34 36 25 -35 -9 47
3855 47 -5 -35 5 28 -24 -23 41 12 -38 -6 42 -14 -58 18 33 -37 -41 38 30 -50 0 49 -11 -40 31 41 -28 -31 49 23 -49 0
3887 0 37 -2 -34 26 30 -41 -24 44 16 -43 -7 41 -18 -42 25 33 -27 -4 43 -5 -35 17 33 -22 -30 37 25 -47 -4 50 -5 -44
3919 -44 21 43 -22 -28 35 24 -44 -9 58 6 -50 22 52 -30 -24 42 23 -30 -16 48 -2 -31 20 38 -35 -20 42 12 -39 -2 41
3950 41 -11 -36 20 26 -40 -22 43 8 -43 10 46 -25 -38 23 19 -34 -18 45 7 -40 17 41 -9 -32 25 29 -39 -16 53 1 -46 24
3982 24 37 -14 -34 35 24 -41 -1 57 3 -37 18 38 -22 -31 27 8 -43 -10 30 -7 -34 14 39 -29 -21 44 4 -30 6 42 -6
4013 -6 -34 29 36 -27 -15 49 17 -38 -1 50 -14 -39 28 37 -39 -24 48 12 -44 13 49 -19 -36 36 43 -39 -13 42 1 -42 10 50
4045 50 -26 -31 29 24 -33 -9 56 -3 -33 17 39 -24 -26 41 18 -31 -5 52 -2 -30 26 38 -19 -19 40 9 -38 8 47 -9 -31 40
4077 40 22 -40 -26 44 5 -41 5 46 -13 -35 34 28 -38 -24 47 11 -52 4 39 -20 -55 30 30 -30 -17 46 0 -48 13 41 -28
4108 -28 -31 30 19 -33 -14 36 4 -43 24 49 -16 -21 44 23 -34 10 48 -8 -34 33 39 -29 -35 48 12 -39 7 47 -20 -45 15 33
4140 33 -43 -36 30 7 -48 5 38 -18 -37 25 36 -29 -24 46 -2 -52 9 38 -15 -38 27 23 -39 -6 40 4 -39 19 37 -31 -27 57
4172 57 27 -36 1 58 -6 -37 35 31 -27 -31 51 16 -58 -7 54 -19 -45 10 29 -39 -40 36 7 -30 -2 43 -18 -39 17 34 -35 -20
4204 -20 42 -5 -45 2 35 -30 -37 35 24 -49 -5 46 -8 -49 15 49 -31 -38 51 21 -33 -2 52 -6 -52 19 43 -36 -35 40 24 -48
4236 -48 -8 50 -17 -43 18 44 -37 -26 38 10 -48 -7 41 -13 -44 38 34 -34 -11 39 -1 -38 16 41 -15 -30 44 19 -37 -2 53
4267 53 -15 -48 13 37 -28 -38 41 23 -47 -10 56 -7 -57 15 46 -26 -28 52 19 -49 -9 47 -7 -51 20 35 -27 -24 45 12 -48
4298 -48 1 39 -15 -28 19 29 -30 -17 52 -8 -36 23 44 -26 -28 43 23 -47 -7 60 -13 -52 22 39 -33 -36 40 23 -41 -18 51
4329 51 1 -39 17 44 -28 -41 40 14 -51 -3 48 -8 -36 18 38 -24 -19 29 15 -41 -9 40 -21 -33 24 35 -25 -11 48 0 -30
4360 -30 13 45 -15 -26 47 21 -44 1 56 -3 -44 22 34 -40 -37 45 24 -58 -19 40 -5 -56 8 40 -26 -34 43 26 -41 -10 41
4391 41 -10 -49 25 30 -34 -13 41 14 -45 -3 47 -15 -19 30 25 -37 -14 50 14 -43 10 32 -20 -30 46 26 -57 -12 55 2 -46 17
4423 17 43 -33 -36 44 29 -54 -15 41 -4 -52 2 29 -39 -43 39 14 -49 0 39 -4 -30 20 33 -14 -25 36 5 -33 0 44 -10
4454 -10 -32 23 24 -29 -12 37 9 -37 16 36 -11 -35 27 28 -36 -10 33 -4 -40 11 39 -24 -41 21 18 -39 -16 43 -9 -50 5 39
4486 39 -24 -25 30 20 -39 1 45 1 -37 19 38 -25 -8 44 17 -36 2 41 -7 -26 26 36 -40 -29 38 -1 -37 8 41 -13 -20
4517 -20 23 29 -30 -15 42 -5 -45 2 42 -23 -43 27 4 -41 -22 29 1 -42 14 34 -26 -32 28 22 -29 -8 42 -1 -39 16 39 -18
4549 -18 -17 39 30 -24 -5 38 -8 -33 17 29 -36 -19 30 16 -36 -5 33 -6 -30 22 23 -24 -22 35 3 -45 6 31 -13 -36 26 18 -34
4582 -34 -14 38 11 -41 3 40 -14 -39 27 17 -33 -10 43 9 -34 17 47 -14 -25 28 34 -26 -5 49 -6 -33 18 44 -18 -26 18
4613 18 11 -36 1 38 -2 -38 13 36 -23 -24 27 12 -38 5 35 -12 -24 28 41 -24 -16 33 14 -29 2 34 -14 -46 37 37 -41 -10
4645 -10 40 12 -38 8 35 -10 -19 29 24 -32 -8 46 6 -35 18 49 -16 -33 38 21 -43 -8 24 -6 -46 9 22 -32 -34 24 5 -40
4677 -40 -11 50 0 -32 29 34 -33 -12 37 9 -31 7 53 -3 -20 26 21 -24 -17 53 12 -41 4 35 -19 -26 31 26 -34 0 41 14 -41
4710 -41 20 46 -14 -33 22 22 -31 -13 41 1 -41 -8 38 -25 -38 23 15 -39 -13 39 3 -45 22 42 -32 -17 38 15 -27 3 46
4741 46 -13 -34 32 25 -29 -10 43 8 -50 8 46 -23 -36 33 33 -30 -21 45 9 -49 7 49 -22 -39 31 24 -44 -20 31 1 -40 2
4773 2 35 -23 -42 28 26 -35 -7 39 4 -40 10 33 -31 -12 42 20 -39 7 42 -12 -27 27 33 -28 -14 36 9 -45 -1 31 -19 -47
4805 -47 36 22 -37 -16 41 5 -46 14 34 -20 -41 24 28 -34 -11 42 6 -35 16 39 -21 -33 30 17 -32 -4 41 -12 -28 26 25
4836 25 -17 -16 45 -1 -26 10 40 -8 -25 33 38 -35 -5 48 4 -54 16 45 -24 -37 44 22 -37 -21 32 2 -47 10 44 -9 -40
4867 -40 34 25 -35 -16 45 -1 -47 15 32 -20 -19 33 7 -38 -15 41 -7 -33 20 31 -23 -21 39 6 -31 10 38 -8 -33 33 27 -51
4899 -51 -9 45 -1 -45 16 39 -23 -40 42 12 -57 -25 38 -1 -55 6 35 -31 -40 29 28 -41 -12 39 4 -32 12 27 -27 -24 38 -2
4931 -2 -30 3 33 -11 -39 22 17 -27 -15 32 4 -43 16 36 -16 -19 40 33 -34 -18 43 8 -40 3 42 -24 -39 26 19 -33 -10 40 0
4964 0 -49 6 39 -11 -22 23 23 -36 -1 35 -2 -31 20 28 -20 -12 24 20 -25 10 37 -18 -28 25 14 -39 -11 39 3 -47 5 35 -14
4997 -14 -33 28 27 -29 -20 40 9 -28 9 36 -19 -31 16 24 -31 -9 29 8 -35 9 36 -15 -11 29 17 -32 1 37 -9 -25 20 26 -13
5030 -13 -22 23 8 -27 2 26 -14 -33 18 24 -32 -16 41 7 -28 10 32 -19 -22 25 29 -32 -15 35 4 -42 7 47 -13 -31 34 31 -27
5063 -27 -14 27 3 -32 14 32 -9 -29 6 18 -22 -2 39 5 -30 26 39 -14 -11 30 17 -33 9 29 -6 -35 17 18 -26 -12 33
5094 33 4 -34 -2 29 -22 -20 8 15 -36 -19 21 0 -35 9 32 -12 -30 41 27 -26 -5 30 17 -30 10 26 -20 -22 26 14 -28 -9
5126 -9 34 3 -31 22 32 -13 -24 26 23 -19 -4 26 -13 -37 15 25 -16 -20 32 4 -38 -14 31 -8 -18 12 14 -28 -10 26 6 -26
5158 -26 0 38 -3 -28 21 25 -30 -23 31 13 -47 5 36 -8 -28 26 28 -21 -11 36 6 -31 7 32 -17 -34 24 32 -24 -10 27 12
5190 12 -26 8 28 -14 -18 28 21 -25 5 33 -6 -30 11 24 -29 -16 28 13 -26 8 36 -1 -23 19 40 -18 0 45 18 -21 17
5221 17 42 -12 -23 32 34 -17 -15 33 20 -29 0 34 -10 -31 21 27 -27 -20 37 24 -37 9 35 -7 -22 27 26 -26 -9 43 -1 -31 19
5254 19 33 -20 -18 30 19 -33 1 33 -2 -28 22 36 -17 -19 36 31 -26 9 47 -5 -30 30 39 -10 -27 27 15 -43 -14 24 -7 -27
5286 -27 7 31 -27 -22 30 16 -31 11 39 -7 -26 31 17 -14 -1 37 6 -27 18 38 -20 -19 33 15 -32 -7 45 4 -34 23 45
5317 45 -32 -20 46 29 -40 -1 53 0 -48 16 29 -23 -23 33 20 -39 1 33 -14 -33 17 24 -23 -20 33 9 -33 -1 44 -8 -29 24
5349 24 20 -26 -5 45 11 -28 23 33 -4 -30 21 13 -30 -4 46 -4 -25 16 40 -21 -17 54 17 -26 3 47 4 -30 17 39 -18 -22
5381 -22 39 26 -38 2 41 -4 -32 6 26 -28 -21 31 5 -39 -9 38 -8 -19 24 28 -23 3 33 4 -17 10 36 -14 -24 24 12
5412 12 -31 -15 27 -6 -27 16 25 -21 -29 25 8 -40 -5 34 0 -41 12 32 -15 -26 28 13 -40 1 19 -2 -24 7 16 -26 -24 22
5444 22 3 -32 8 28 -19 -29 19 18 -24 -1 34 4 -19 26 40 -15 -19 27 25 -28 8 31 3 -33 22 38 -35 -26 33 17 -32 -5
5476 -5 31 -8 -27 23 38 -13 -23 21 12 -24 -2 29 -3 -29 24 9 -21 -13 26 14 -18 4 27 -1 -16 30 16 -12 8 39 15 -21
5508 -21 22 28 -13 -12 30 26 -27 2 37 -5 -29 19 20 -29 -17 28 11 -32 -3 30 -12 -24 19 28 -17 -21 19 15 -23 5 31 1 -28 25
5542 25 26 -10 -14 19 15 -18 21 21 8 -14 18 25 -18 0 28 -5 -12 15 33 -10 -9 36 19 -26 4 33 -12 -29 19 24 -13 -19 17 20 -29
5577 -29 -10 38 -1 -26 1 21 -20 -14 31 17 -20 -3 27 -1 -12 12 25 -18 -10 32 16 -10 -4 19 -2 -8 14 10 -8 -12 12 0 -12
5610 -12 8 17 -15 -24 22 14 -28 -3 32 -7 -20 25 35 -15 -15 25 25 -15 -1 30 -3 -27 2 28 -12 -17 7 17 -11 -6 23 11 -13 11
5644 11 25 2 -8 28 13 -15 13 22 -2 -3 13 23 -11 -3 28 4 -28 7 29 -24 -13 25 20 -20 0 31 15 -28 15 28 -7 -26
5676 -26 20 18 -28 -9 27 5 -33 -3 11 -9 -19 20 23 -24 -9 27 8 -24 4 20 2 -4 25 10 -16 -1 16 -7 -19 8 19 -18
5708 -18 -12 23 -10 -34 2 17 -15 -31 19 14 -27 -6 28 6 -26 12 26 -16 -32 19 9 -20 -22 24 -1 -28 5 20 -5 -21 11 15
5740 15 -16 -11 21 3 -18 7 30 1 -7 24 31 -8 9 34 4 -24 18 32 -20 -8 20 7 -25 9 31 -3 -26 21 24 -24 -18 33 12
5773 12 -28 15 35 -9 -25 24 26 -29 -20 32 12 -8 12 26 -20 -32 7 18 -20 -3 26 5 -18 12 29 -8 -9 31 24 -5 -12 23 0
5806 0 -19 14 19 -35 -15 29 -2 -22 4 30 -15 -30 21 22 -28 -24 37 15 -33 0 38 -5 -23 17 29 -15 -10 41 12 -19 2 29 -6
5839 -6 -19 20 19 -16 3 30 4 -25 9 22 -10 -11 16 17 -18 3 25 -5 -7 22 28 -18 -9 32 9 -27 -2 29 -16 -26 18 40 -22 -8
5873 -8 33 6 -22 4 41 -3 -21 22 37 -25 1 35 6 -20 11 16 -9 -15 28 20 -12 -4 30 4 -37 15 26 -16 -23 17 3 -15 0
5906 0 23 -1 -24 5 16 -7 -5 31 0 -19 12 28 -14 -19 8 24 -23 -12 22 15 -31 3 34 0 -22 26 36 -11 -11 33 20 -14 8
5939 8 30 -6 -14 29 24 -26 5 24 7 -26 6 14 -8 -24 27 15 -26 0 19 4 -26 10 27 -5 -6 22 10 -23 1 29 -9 -15 10
5972 10 22 -14 -17 25 0 -19 4 34 -14 -18 13 16 -10 -7 24 9 -20 1 24 13 -8 21 30 -12 -1 24 10 -22 2 25 -10 -9 14
6005 14 7 -18 5 28 2 -12 12 12 -14 -4 25 9 -23 7 22 1 -13 24 17 -13 -3 26 14 -15 5 22 -4 -20 18 29 -16 2
6037 2 21 8 -16 9 32 -2 -7 13 31 -13 -13 18 -2 -17 11 23 -9 -8 16 3 -30 -13 28 -1 -17 -1 2 -6 -17 20 9 -12 15
6070 15 26 -1 -6 15 13 -8 -1 29 15 -10 10 27 1 -19 15 30 -6 -14 28 23 -12 21 32 7 -17 12 27 -4 0 25 15 -4 9
6103 9 11 3 -11 8 6 -7 1 17 3 -9 5 17 1 1 32 16 -2 7 24 4 2 22 17 -2 2 24 9 -10 3 27 6 4 11 16 -11 -6 29
6140 29 6 -14 0 16 -6 -15 8 19 -7 1 23 10 -8 11 21 0 -11 -5 12 -10 -7 10 -8 -19 -4 18 -14 0 25 12 -1 0 18
6173 18 3 -4 6 21 -2 17 23 18 0 10 33 16 2 16 20 -3 -1 21 12 -9 -2 10 -9 -20 12 18 -12 -1 15 4 -17 2 15 0
6207 0 -4 17 3 -6 -1 22 11 -15 18 13 2 7 16 1 -1 6 21 10 12 9 23 -2 0 31 14 6 12 26 1 1 8 13 -7 -12 17 -2 -16 3 30
6246 30 1 -16 11 27 -5 -3 27 22 -6 -3 15 4 0 19 22 -13 11 21 24 -8 -4 19 -12 -9 22 16 -6 4 20 9 0 7 16 -4 0 19 10
6283 10 -4 6 26 -1 -21 -5 11 -11 -11 3 8 -3 0 15 -5 -19 9 13 -3 -10 17 0 -12 11 30 7 -9 9 21 2 18 20 7
6316 7 -12 9 20 -1 0 18 13 -3 3 17 -1 -9 5 10 2 -8 19 4 -10 3 26 3 -9 14 26 -11 -2 28 7 -11 5 20 -7 -19
6350 -19 6 9 -8 -9 18 17 -6 11 18 -3 -18 16 22 -5 4 23 13 -12 7 23 -2 13 16 23 -8 1 19 -3 -1 11 22 -10 -10 10 13 -20
6386 -20 1 18 8 -9 12 18 2 3 26 5 -12 6 11 -2 -21 -4 9 -14 -9 21 13 -11 8 14 5 -11 16 18 -8 11 19 12 3 8 17 5 3
6423 3 13 20 -12 -3 20 -6 -4 6 14 -13 -7 23 21 -10 13 17 11 -4 11 24 6 3 16 28 -17 -9 16 1 -5 7 23 -2 -6 18 10 -9 3
6460 3 20 2 -18 13 11 0 2 27 13 0 -4 25 1 1 19 10 -5 1 21 4 -6 15 13 -15 6 14 5 -15 5 15 0 -11 18 18 -2 1
6496 1 23 21 4 14 28 5 -8 11 22 3 -6 22 13 1 5 24 2 -7 7 14 -11 -4 19 10 -4 17 27 4 -6 3 16 -1 -5 16 -1 -7
6532 -7 7 13 1 -8 8 12 -12 0 26 4 -19 4 4 -5 -3 19 22 1 7 38 16 6 14 27 0 2 23 19 -6 6 23 10 -5 11 17 12 3 12
6570 12 13 6 7 15 11 -5 26 15 -4 9 26 5 -6 4 13 5 -2 14 14 -3 -1 6 8 -6 13 29 12 1 2 7 0 10 19 14 15 13 12 12 11 22 11
6611 11 -4 10 17 -2 -7 17 17 1 -2 15 12 -5 4 14 3 -11 22 3 -3 2 21 15 -1 12 14 -4 4 10 18 -12 -9 12 4 -11 7 24 -1 2
6649 2 19 21 0 3 17 8 -2 11 21 12 9 23 16 4 15 6 4 3 11 11 0 3 11 7 -18 2 5 -2 -3 11 14 2 13 15 7 2 10 13 8 -6 5 6 -3 2
6693 2 19 1 0 -1 17 6 -3 10 5 -8 7 17 2 2 3 19 5 -4 15 12 8 12 18 8 7 18 21 -15 -4 8 1 -12 3 5 1 -3 17 5 -5
6732 -5 6 9 14 5 4 15 11 8 18 1 5 9 10 6 -3 10 2 2 0 9 10 -7 4 5 5 -14 9 10 11 0 19 11 -5 -1 7 1 0 12 3 -14 -3 15 0 -14
6776 -14 2 15 5 -8 -1 4 -9 -6 -3 6 -9 14 27 6 2 5 15 8 14 23 0 1 8 18 5 -4 10 1 -2 11 15 4 0 10 18 4 0 14 19 -6
6816 -6 10 10 6 5 -3 6 -4 9 13 3 -6 7 14 1 -2 3 12 -8 -1 13 12 -7 3 16 6 13 19 17 1 9 20 17 2 3 11 5 4 11 15 -3 0 4 -2 6 3
6861 3 5 -6 4 14 0 -7 2 8 3 2 6 15 5 15 15 8 11 -2 10 10 -5 15 1 -6 0 0 17 6 10 17 -2 -9 21 15 2 0 14 12 -5 11 17 2
6903 2 8 18 15 4 2 1 5 -6 5 4 -14 -15 10 1 -18 9 14 0 -6 8 15 -1 0 24 -2 0 9 14 1 -5 2 14 -1 5 6 3 -2 14 12 5 11 20 11 -5
6947 -5 18 15 10 2 22 19 0 -6 7 6 -2 -4 8 -4 -12 -2 16 -8 1 8 5 -7 3 11 4 1 6 15 -11 1 6 6 -15 8 10 5 4 23 20 6 2 15 4
6990 4 -7 -5 12 -1 -5 10 5 -6 -1 15 8 -1 17 22 -6 0 12 2 2 -1 5 4 -13 4 21 -2 -7 14 -3 -9 0 9 0 -5 3 10 -8 13 14 13 14 7 23
7033 23 12 17 7 7 0 3 13 6 -8 3 14 -3 4 9 24 5 8 10 3 -8 8 12 1 -3 11 14 -1 7 11 3 -11 12 15 2 -2 2 16 6 -8 9
7073 9 -2 1 12 16 9 4 14 11 -1 0 23 18 6 10 22 -4 -4 20 2 -6 7 20 4 1 17 12 -5 0 17 4 -23 -4 6 0 -4 17 4 -8
7111 -8 8 16 5 -3 -5 21 -9 -1 15 7 3 2 5 3 2 10 15 1 4 14 10 2 14 16 11 -6 11 22 11 7 21 8 -5 17 17 14 -1 9 -4 -3 4 10
7153 10 6 -6 7 10 -1 -4 15 5 -2 -2 14 12 2 8 18 -2 9 9 7 0 5 29 3 -9 2 18 0 4 21 13 -4 6 13 2 5 2 4 -9 6
7192 6 16 16 -2 6 10 -8 3 14 8 5 5 4 4 5 7 14 -12 -4 5 9 0 -11 16 7 -10 6 4 12 -1 19 6 4 2 14 6 5 9 16 6 0 16 10 -4 13
7236 13 13 8 -9 15 11 7 3 13 10 2 3 12 -5 -3 3 -7 -1 2 11 10 -12 3 7 -1 0 5 12 10 -1 10 10 4 9 11 6 0 16 22 -2 14 9 8 -3 8 8 2
7282 2 -7 10 5 -3 7 6 -7 -9 10 4 -4 -1 12 7 -5 8 13 4 -8 -5 9 5 6 12 -3 -9 -3 16 -7 -9 2 -2 -4 -14 0 7 -10 7 18 4 19
7323 19 15 21 10 27 16 8 -6 12 5 8 -11 6 9 -4 0 4 2 -2 2 6 2 -5 7 -10 -5 0 5 -5 -3 12 19 2 5 9 19 5 -4 9 -3 1 14 6
7365 6 1 11 20 16 6 7 19 7 -1 23 18 6 6 21 11 5 13 11 6 -1 10 8 -1 -1 3 8 0 2 14 -15 -1 13 -7 -4 5 19 4 -3 12 9 8 6 18
7408 18 13 6 3 2 4 2 6 11 -6 -4 13 8 -7 9 19 -7 -7 20 2 -1 -7 6 11 -5 7 7 1 8 3 17 0 4 13 5 -10 3 9 -13 -4 9 -3 -8
7450 -8 2 11 0 -5 7 7 -9 9 13 -3 2 7 15 4 -6 7 4 -18 -1 13 9 -4 16 17 7 -6 7 3 -11 5 22 9 -5 8 16 3 3
7487 3 24 -1 1 -2 1 -5 4 6 8 -9 7 21 -5 -13 2 18 -17 -8 15 10 -2 0 24 5 -5 5 30 15 10 23 7 -8 5 14 8 -8 6 6
7525 6 3 -1 5 9 -10 6 9 3 -5 -2 5 -6 -12 15 3 -15 1 19 0 -1 -1 12 -6 5 11 5 -1 7 7 -9 -10 2 24 3 -4 20 11 -5 8 6 11 -4
7567 -4 0 6 5 1 8 19 -5 9 14 -11 -13 5 -4 -7 2 6 2 -8 8 11 3 1 11 10 -14 9 24 9 -5 15 23 1 10 13 1 4 16 9 9 1 9 17 6
7610 6 6 13 5 3 6 22 -1 -1 9 20 8 5 17 10 -11 3 11 -7 3 3 16 -16 -6 9 4 -1 6 7 -3 -7 26 10 2 7 15 9 -4 5 14 -6 9
7651 9 21 16 4 22 20 7 -5 17 16 -6 -6 10 10 0 8 18 8 -1 6 21 -3 -1 18 13 3 1 10 -3 2 7 3 1 -8 14 -3 1 8 10 -1 -9 9
7692 9 14 -2 5 18 4 0 5 22 8 5 22 12 5 9 17 4 -1 8 14 -5 1 6 6 -4 -6 10 -2 3 0 14 -2 8 18 13 -8 4 17 -1 -17 0
7732 0 6 -10 -4 -7 7 -11 -2 1 10 -19 -4 7 -5 -5 13 3 -9 13 23 -1 1 16 15 7 -5 13 1 -2 9 13 -1 -2 5 1 0 -5 10 -9 -2 7
7772 7 16 -12 -1 9 14 -6 -1 7 0 -12 -4 -1 -7 -8 4 3 -9 -2 10 -4 -3 4 6 3 0 7 4 -2 7 21 0 2 20 16 6 -3 19 9 -5 4 16 -13 5
7815 5 5 3 -5 -6 5 -2 -7 3 8 -5 -15 7 5 -7 8 7 2 -14 6 9 7 2 1 6 2 -4 9 -3 7 4 8 -9 -5 7 10 -5 -5 15 1 6 10 -1 7
7858 7 16 16 4 3 11 18 5 -2 10 2 -5 2 16 -6 -17 8 14 -5 0 7 4 -8 -7 14 14 -6 9 15 3 4 9 14 2 -7 11 12 4 11 7 0 8 7 15 1 8
7903 8 10 -4 -2 2 16 4 9 3 -1 -8 1 5 6 6 8 5 -10 7 11 1 3 2 8 -2 -9 7 11 -2 3 8 11 -6 5 9 6 7 27 14 7 -1 5 13 7 11 21 10
7949 10 6 11 3 -5 3 -1 -3 3 15 1 3 9 12 16 7 11 18 12 -8 8 11 -4 2 7 4 -12 2 -1 -6 -11 10 15 -3 6 17 3 -9 9 7 8 12 13 25 -8 9
7994 9 21 13 -1 12 10 7 9 12 -2 0 14 8 2 -5 16 11 -4 6 14 6 -1 8 11 1 -5 17 20 6 0 7 5 -6 8 15 -5 -11 10 -6 -3 -2 10 5 0 1
8038 1 8 1 6 2 15 2 15 25 13 1 8 17 -4 -14 10 15 -4 5 8 2 -13 7 11 -6 2 3 6 -14 2 15 -6 -1 8 13 -1 7 23 3 1 -1 19
8079 19 -8 -2 12 12 -2 7 27 -2 -1 6 15 8 1 22 16 7 12 17 2 -1 7 6 3 -1 11 11 5 0 19 0 -9 6 1 -9 -3 20 8 -4 8 13 -8 -6 11
8122 11 3 1 9 12 2 -10 9 14 -3 4 12 10 8 0 20 13 -1 8 16 -6 -11 5 4 -12 -1 3 6 -10 7 9 4 -1 7 12 5 8 9 9 1 13 7 4 -11 7 2
8167 2 1 -1 10 -10 -2 10 10 -7 2 19 12 -2 10 21 2 -7 8 12 13 9 23 10 -6 6
8191F
$$ Imaginary data points
##PAGE= N=2
##DATA TABLE= (X++(I..I)), XYDATA
0 0 0 0 0 0 0 0 0 0 0 0 0 0 2 -8 8 -8 8 -9 16 -16 24 -24 32 -33 40 -48 56 -65 73 -86 97 -113 127 -145 161
35 161 -183 205 -230 256 -287 320 -354 394 -436 483 -533 589 -650 717 -787 867 -957 1055
53 1055 -1162 1285 -1423 1579 -1757 1962 -2205 2496 -2849 3291 -3863 4633 -5732 7436 -10449
68 -10449 17302 -64404 78599 180608 -133307 -137473 137557 119184 -155669 -80740 151482
79 151482 56523 -149143 -25001 132340 6794 -116635 10859 92308 -16433 -72224 17735
90 17735 49367 -9471 -33823 -2253 20900 20034 -16445 -37475 17863 56596 -26789 -71214 41205
103 41205 82783 -60807 -87550 82369 85792 -105700 -77199 126463 61711 -144776 -40860
114 -40860 157485 16088 -163925 11313 163742 -38043 -156039 63468 142379 -84549
124 -84549 -123321 100295 100480 -109943 -76414 112332 52131 -108748 -30566 99151 12720
135 12720 -85249 135 69024 -6715 -51466 7991 35577 -3254 -21949 -5617 12524 17521
147 17521 -8252 -31323 8743 44323 -14941 -56056 25108 64198 -38879 -68077 54805 67369
159 67369 -70847 -61165 86373 50825 -99048 -36218 108352 18866 -113391 -264 113265
170 113265 -18888 -108914 36230 99779 -51418 -87378 62947 72513 -70141 -56120 73266
181 73266 40303 -71555 -25330 66491 13188 -58168 -4149 47926 -1291 -37198 2554 26600
193 26600 -674 -17939 -4470 11525 11565 -8223 -19696 8393 28042 -11568 -35042 17868 40335
206 40335 -26190 -42924 35890 42413 -46120 -39026 55517 32447 -63762 -23684 69642 13075
218 13075 -72911 -1473 73428 -10049 -70850 21103 65929 -30461 -58717 37948 50046 -43082
230 -43082 -40694 45541 31125 -45728 -22370 43587 14803 -39699 -8870 34804 5125 -29095
242 -29095 -3184 23747 3394 -18915 -5157 15267 8044 -13314 -11889 12751 15560 -14177 -19109
255 -19109 16866 21611 -20862 -22877 25739 22822 -30696 -20933 35794 17806 -40023 -13208 43359
268 43359 7616 -45497 -1599 45969 -4882 -45294 10834 43014 -16361 -39716 20984 35641
280 35641 -24326 -30779 26796 26111 -27736 -21244 27889 17010 -26979 -13393 25330 10394 -23485
293 -23485 -8565 21167 7256 -19249 -6970 17455 7214 -16209 -7866 15642 8901 -15563
305 -15563 -9752 16293 10584 -17446 -10983 19053 10863 -21024 -10305 22927 8956 -24932 -7214
318 -7214 26569 4846 -27850 -2054 28682 -878 -28810 4115 28492 -7138 -27463 10073
330 10073 25946 -12651 -24038 14764 21744 -16451 -19338 17581 16858 -18232 -14435 18421 12210
343 12210 -18220 -10239 17708 8572 -17025 -7322 16174 6349 -15428 -5833 14684 5498 -14235
356 -14235 -5471 13943 5513 -13963 -5568 14314 5606 -14824 -5407 15628 5060 -16528 -4393
369 -4393 17490 3415 -18444 -2157 19186 523 -19806 1293 20050 -3278 -19917 5389
381 5389 19467 -7367 -18488 9308 17275 -10873 -15686 12196 13919 -13123 -12096 13579 10204
394 10204 -13760 -8587 13430 7007 -13019 -5880 12286 4991 -11547 -4490 10867 4352 -10265
407 -10265 -4370 10007 4690 -9956 -4967 10298 5237 -10928 -5356 11774 5165 -12855 -4688
420 -4688 13949 3808 -15023 -2590 15935 1068 -16525 780 16818 -2694 -16590 4753
432 4753 16001 -6614 -14914 8296 13471 -9644 -11789 10515 9869 -10977 -8068 10845 6291 -10403
446 -10403 -4922 9541 3853 -8536 -3282 7420 3179 -6418 -3479 5678 4179 -5248 -5057 5343
460 5343 6071 -5852 -6952 6854 7604 -8268 -7879 9917 7624 -11714 -6844 13445 5533 -14917
474 -14917 -3708 16041 1538 -16596 924 16608 -3350 -15944 5689 14717 -7687 -12990
486 -12990 9223 10866 -10226 -8619 10506 6265 -10233 -4205 9259 2423 -7908 -1262 6188
499 6188 707 -4367 -806 2720 1598 -1305 -2880 441 4571 -167 -6432 624 8278 -1759 -9843
514 -9843 3566 10948 -5812 -11377 8396 11077 -11005 -9964 13436 8110 -15432 -5622 16813
527 16813 2713 -17375 440 17115 -3492 -15994 6272 14134 -8492 -11717 9980 8912 -10659
540 -10659 -6008 10474 3221 -9506 -887 7787 -910 -5661 1885 3195 -2095 -767 1429 -1451
554 -1451 32 3178 -2058 -4086 4564 4294 -7128 -3520 9649 1949 -11700 396 13139 -3294
568 -3294 -13752 6462 13401 -9667 -12136 12578 9974 -14938 -7102 16527 3780 -17141 -174
581 -174 16818 -3238 -15443 6316 13272 -8699 -10441 10170 7179 -10769 -3964 10235 854
594 854 -8912 1634 6722 -3456 -4102 4344 1223 -4269 1633 3306 -4063 -1432 5984 -961 -6996
609 -6996 3852 7176 -6792 -6344 9553 4589 -11882 -2113 13444 -986 -14190 4335 13913
622 13913 -7707 -12673 10767 10558 -13209 -7689 14901 4363 -15620 -802 15318 -2657 -14074
635 -14074 5686 11882 -8125 -9134 9619 5895 -10220 -2672 9728 -413 -8355 2932 6186
648 6186 -4733 -3514 5618 605 -5511 2275 4504 -4740 -2618 6655 181 -7699 2708 7885 -5614
663 -5614 -7095 8370 5442 -10632 -3040 12211 136 -12952 3034 12750 -6187 -11656 9015
676 9015 9723 -11324 -7159 12893 4150 -13612 -967 13412 -2103 -12347 4839 10497 -6997
689 -6997 -8105 8372 5299 -8951 -2468 8595 -266 -7492 2514 5649 -4154 -3344 5017 827
703 827 -5000 1710 4227 -3890 -2623 5636 553 -6595 1944 6827 -4497 -6222 6902 4819 -8927
718 -8927 -2827 10320 307 -11048 2379 10914 -5105 -10027 7556 8430 -9538 -6280 10913
731 10913 3758 -11552 -1114 11431 -1449 -10607 3684 9125 -5492 -7249 6614 5026 -7146
744 -7146 -2796 6916 658 -6088 1140 4741 -2433 -2968 3217 1084 -3228 905 2719 -2606 -1521
759 -1521 3982 -67 -4766 1947 4987 -3920 -4571 5772 3557 -7376 -2054 8514 164 -9127 1915
774 1915 9125 -4017 -8511 5950 7352 -7561 -5760 8682 3862 -9301 -1859 9280 -135 -8771
788 -8771 1878 7733 -3305 -6378 4247 4771 -4721 -3133 4661 1584 -4150 -246 3280 -723 -2064
803 -2064 1322 750 -1401 629 1088 -1818 -306 2793 -754 -3393 2054 3547 -3416 -3317 4719 2614
819 2614 -5898 -1599 6719 268 -7225 1181 7285 -2703 -6941 4094 6204 -5315 -5146 6221 3850
834 3850 -6768 -2441 6889 1007 -6677 258 6062 -1365 -5194 2142 4161 -2571 -3030 2689 2006
849 2006 -2391 -1022 1906 351 -1127 122 301 -210 598 47 -1385 413 2029 -1101 -2451 1920
865 1920 2576 -2846 -2455 3691 1989 -4493 -1348 5087 483 -5463 483 5565 -1502 -5423 2485 4993
881 4993 -3374 -4383 4036 3538 -4559 -2645 4755 1684 -4768 -795 4498 -14 -4048 657 3481
896 3481 -1072 -2742 1302 2073 -1238 -1387 1049 878 -617 -487 122 312 449 -345 -970 575 1443 -984
914 -984 -1763 1485 1934 -2104 -1921 2704 1684 -3308 -1317 3784 737 -4169 -87 4313 -656 -4333
930 -4333 1386 4140 -2075 -3776 2669 3283 -3127 -2669 3450 2007 -3588 -1325 3524 696 -3332 -137
946 -137 2982 -289 -2522 595 2060 -685 -1515 699 1118 -442 -695 173 488 259 -391 -688 446
963 446 1074 -706 -1452 1005 1623 -1514 -1772 1985 1664 -2525 -1453 3002 1076 -3387 -551 3686 -36
980 -36 -3788 688 3748 -1332 -3558 1917 3156 -2448 -2703 2780 2102 -3020 -1484 3075 889 -2930
996 -2930 -295 2710 -129 -2300 507 1902 -661 -1380 719 915 -593 -520 305 182 44 -21 -498 -29
1014 -29 922 -151 -1371 430 1672 -875 -1888 1376 1919 -1946 -1798 2490 1485 -2985 -1039 3338
1030 3338 456 -3575 199 3613 -892 -3471 1539 3156 -2110 -2660 2571 2080 -2807 -1391 2919
1045 2919 735 -2800 -97 2513 -408 -2084 803 1563 -995 -992 1038 440 -872 64 557 -438 -110
1062 -110 659 -441 -740 955 557 -1504 -283 1883 -242 -2232 795 2306 -1450 -2231 2085 1957
1078 1957 -2664 -1465 3155 880 -3421 -148 3538 -592 -3418 1321 3084 -1978 -2588 2472 1937
1093 1937 -2779 -1209 2873 447 -2736 273 2424 -829 -1872 1283 1279 -1467 -570 1469 -99 -1266
1109 -1266 662 798 -1171 -300 1352 -403 -1472 1021 1259 -1698 -923 2179 348 -2560 314 2710
1125 2710 -1052 -2629 1792 2366 -2460 -1876 2980 1206 -3339 -440 3453 -363 -3362 1136 3027
1140 3027 -1828 -2475 2382 1817 -2677 -1001 2798 224 -2641 545 2275 -1169 -1715 1625 1012 -1860
1156 -1860 -261 1831 -522 -1588 1158 1070 -1700 -471 1960 -293 -2048 1035 1825 -1776 -1438 2334
1172 2334 823 -2752 -95 2920 -713 -2860 1499 2575 -2217 -2054 2800 1397 -3140 -571 3293
1187 3293 -229 -3180 1051 2852 -1724 -2298 2263 1609 -2573 -814 2666 40 -2506 720 2126
1202 2126 -1339 -1566 1767 859 -1995 -98 1954 -676 -1716 1318 1203 -1866 -606 2150 -171 -2257
1218 -2257 924 2065 -1657 -1665 2273 1084 -2677 -337 2900 -440 -2826 1241 2574 -1925 -2064 2493
1234 2493 1414 -2835 -639 2994 -147 -2872 902 2549 -1559 -2028 2053 1378 -2335 -652 2404
1249 2404 -83 -2244 755 1899 -1328 -1399 1699 712 -1925 -72 1862 -648 -1674 1219 1208 -1729
1265 -1729 -668 1979 -20 -2101 695 1962 -1350 -1630 1913 1122 -2299 -481 2515 -190 -2496
1280 -2496 911 2284 -1520 -1881 2045 1332 -2367 -676 2524 -9 -2449 681 2193 -1264 -1757 1701
1296 1701 1197 -1961 -571 2035 -75 -1910 643 1585 -1166 -1173 1472 606 -1672 -51 1620 -546
1312 -546 -1477 1028 1089 -1450 -646 1677 95 -1768 469 1672 -983 -1410 1459 1039 -1773 -515 2000
1329 2000 -6 -1988 597 1849 -1084 -1540 1513 1122 -1804 -605 1937 62 -1904 485 1718
1344 1718 -943 -1386 1320 956 -1543 -470 1612 -44 -1550 518 1305 -937 -992 1190 533 -1372
1360 -1372 -104 1345 -393 -1240 771 958 -1094 -609 1303 190 -1366 242 1318 -639 -1115 1023
1376 1023 853 -1261 -466 1421 84 -1437 354 1362 -736 -1143 1045 854 -1272 -478 1396 81
1392 81 -1398 316 1283 -672 -1067 949 744 -1142 -429 1209 24 -1208 295 1050 -643 -851 851
1409 851 520 -1008 -205 1030 -134 -977 436 805 -697 -560 876 271 -948 55 938 -336 -825
1426 -825 640 642 -811 -375 963 105 -998 212 949 -489 -811 730 597 -929 -371 1007 72 -1060
1444 -1060 191 968 -489 -860 678 642 -859 -423 918 148 -945 93 864 -342 -743 505 545
1461 545 -655 -340 692 88 -717 123 619 -330 -469 498 300 -572 -52 623 -136 -546 373 460 -518 -293
1481 -293 649 92 -702 114 690 -335 -628 504 489 -674 -326 762 124 -824 78 791 -298 -724 465
1500 465 581 -633 -436 689 223 -765 -50 698 -156 -650 293 513 -431 -361 498 197 -509 -21 498 -120
1520 -120 -400 284 305 -350 -135 422 -15 -402 192 345 -323 -254 423 117 -505 45 537 -217 -505 363 413
1541 413 -515 -304 591 146 -675 1 667 -206 -649 332 526 -483 -438 574 259 -630 -106 622 -40 -584
1561 -584 200 488 -314 -379 403 241 -420 -74 440 -55 -354 191 285 -272 -154 347 45 -351 104 329 -243
1582 -243 -262 337 149 -437 -33 437 -136 -473 254 381 -418 -313 496 176 -581 -53 576 -116 -577 255
1602 255 481 -403 -393 478 251 -565 -122 548 -45 -518 181 446 -281 -311 391 214 -396 -45 417 -62 -333
1623 -333 208 278 -276 -143 337 20 -357 105 322 -247 -269 338 153 -428 -43 427 -129 -464 224 373 -376
1644 -376 -320 447 173 -524 -54 529 -99 -513 233 455 -357 -343 438 223 -503 -65 504 -56 -457 207 402
1665 402 -311 -271 398 158 -412 21 424 -114 -345 263 257 -340 -131 383 -5 -394 126 341 -270 -298 333
1686 333 146 -436 -47 426 -119 -433 229 348 -361 -266 446 146 -492 -10 496 -137 -469 275 398 -391
1706 -391 -284 470 159 -501 -19 503 -129 -438 251 373 -336 -244 437 128 -435 33 427 -155 -365 265
1726 265 251 -357 -156 387 -1 -406 121 333 -266 -271 339 135 -425 -25 410 -138 -421 244 310 -393 -222
1747 -222 426 74 -499 44 474 -195 -438 318 346 -411 -222 496 112 -495 44 505 -163 -445 307 361 -376
1768 -376 -230 439 93 -448 34 420 -149 -362 244 265 -336 -154 346 6 -374 93 304 -247 -250 292 110
1789 110 -389 -15 360 -140 -363 249 276 -345 -180 428 58 -466 86 457 -200 -404 328 322 -409 -194 484
1810 484 77 -490 57 482 -173 -397 290 331 -363 -206 406 87 -399 28 372 -158 -320 224 199 -304 -140
1831 -140 300 -11 -335 106 243 -230 -197 273 85 -327 20 318 -128 -311 232 239 -318 -155 386 47 -399
1852 -399 74 412 -178 -343 299 291 -355 -168 427 69 -424 61 422 -148 -361 254 278 -320 -184 354 60
1873 60 -352 22 311 -150 -270 198 158 -273 -91 254 -34 -263 94 198 -197 -159 234 60 -286 19 276
1894 276 -119 -255 203 204 -267 -114 319 33 -323 70 333 -137 -273 246 241 -288 -129 337 57 -339 41
1915 41 335 -119 -275 206 223 -269 -153 262 45 -302 6 237 -125 -239 144 131 -228 -88 203 -25 -220
1936 -220 85 173 -154 -132 196 47 -221 27 216 -99 -188 161 145 -217 -84 247 33 -262 59 262 -122
1957 -122 -217 193 181 -229 -108 271 47 -277 27 260 -103 -238 154 180 -206 -130 202 35 -235 -4 184
1978 184 -96 -172 110 91 -157 -74 147 -11 -173 52 126 -113 -94 150 44 -175 23 177 -69 -142 132 128 -157
2001 -157 -51 202 28 -195 50 211 -88 -179 138 133 -186 -89 190 31 -206 21 191 -87 -179 108 127 -151
2023 -151 -92 154 28 -165 -4 135 -67 -142 71 81 -129 -62 115 2 -125 30 109 -80 -60 112 44 -97
2045 -97 29 133 -38 -103 113 107 -103 -35 157 22 -141 42 147 -60 -129 114 92 -135 -75 148 17 -157 1
2068 1 135 -60 -141 68 92 -117 -88 103 20 -132 -3 100 -46 -98 64 71 -86 -51 90 5 -79 20 75 -48 -54
2093 -54 73 41 -65 15 93 -28 -61 63 75 -68 -26 110 14 -105 19 100 -54 -100 61 69 -98 -65 95 13 -125
2118 -125 -3 92 -43 -111 51 65 -93 -72 78 10 -107 -2 92 -19 -80 55 62 -56 -44 71 26 -52 7 68 -13
2143 -13 -27 55 50 -40 5 62 0 -27 54 49 -41 -17 60 -9 -81 15 67 -53 -77 51 39 -79 -35 79 -2 -111 -10 72
2171 72 -36 -92 40 65 -69 -55 72 28 -77 -14 83 -5 -66 25 51 -55 -35 46 35 -36 -4 49 6 -16 29 24 -16 4
2199 4 42 -14 -18 46 23 -37 -14 56 -7 -56 14 51 -53 -58 49 33 -79 -43 61 7 -83 -16 64 -33 -81 31 60 -52 -61
2228 -61 65 46 -58 -5 62 -6 -48 20 52 -22 -34 38 40 -18 7 42 -9 0 36 17 -16 6 34 -11 -17 30 7 -45 -2 48 -13
2259 -13 -70 19 40 -41 -55 47 29 -70 -29 49 -6 -84 8 63 -33 -56 39 50 -45 -37 54 19 -47 1 65 6 -31 27 43 -13
2289 -13 3 46 13 -9 27 35 -1 -13 33 6 -29 11 31 -33 -23 42 -1 -65 -16 49 -22 -71 20 39 -53 -47 44 17 -82 -17 68
2320 68 -9 -68 2 55 -25 -45 50 38 -44 -13 62 15 -43 21 47 -11 -9 45 29 -17 3 47 3 -13 25 26 -24 -9 37 0 -40
2351 -40 9 26 -40 -37 32 4 -52 -14 42 -27 -69 7 42 -55 -51 40 16 -67 -13 57 -15 -59 28 52 -34 -33 54 26 -42 5 69 4
2383 4 -37 29 50 -22 -21 58 29 -35 1 43 -12 -31 32 26 -42 2 40 -21 -44 17 17 -43 -39 30 -3 -59 -13 30 -34 -78 14 28 -58
2416 -58 -32 49 23 -58 9 67 -5 -51 25 52 -43 -27 67 30 -55 9 60 -10 -38 39 50 -27 -22 56 17 -37 11 46 -15 -45 27
2447 27 10 -56 -14 36 -18 -53 1 28 -37 -41 25 -6 -66 -22 39 -30 -62 26 35 -56 -29 65 9 -59 13 68 -9 -46 42 51 -37 -29
2479 -29 66 23 -44 26 70 -3 -35 38 43 -31 -17 49 11 -52 11 38 -26 -38 24 10 -49 -21 38 -24 -62 19 32 -55 -40 36 7
2510 7 -73 -8 54 -30 -52 34 40 -48 -33 62 15 -68 10 77 -12 -55 45 52 -50 -24 68 39 -40 22 71 -19 -45 27 30 -49 -24
2541 -24 35 -7 -48 1 31 -34 -42 25 -6 -61 -13 41 -26 -64 17 25 -53 -39 41 -4 -57 2 51 -24 -56 34 44 -47 -27 51 25
2572 25 -51 7 66 -7 -35 43 58 -32 -20 68 21 -51 13 52 -19 -53 23 15 -45 -25 33 -14 -61 4 25 -46 -53 14 4 -54 -27
2603 -27 35 -24 -60 13 23 -53 -38 30 14 -61 -3 43 -10 -49 33 42 -39 -27 63 14 -52 6 75 -8 -36 39 51 -32 -21 66 16
2634 16 -43 -6 48 -21 -45 20 26 -65 -27 27 -14 -56 -14 33 -38 -49 14 -4 -51 -33 37 -12 -56 19 25 -36 -33 42 15 -45 2 49
2666 49 -8 -29 46 54 -22 -23 56 36 -37 14 60 -14 -29 28 48 -21 -26 37 17 -53 -3 45 -11 -43 18 26 -38 -32 26 -5 -56 -12 22
2699 22 -32 -40 13 14 -55 -22 37 -4 -39 10 45 -22 -13 32 24 -37 16 50 3 -26 35 54 -8 -9 46 23 -34 6 59 -2 -30 15 27
2732 27 -34 -28 38 9 -49 1 29 -21 -41 15 17 -50 -34 24 -1 -49 -6 31 -19 -47 13 16 -36 -18 30 3 -39 4 41 -10 -20 34
2764 34 30 -37 7 51 8 -25 28 52 -16 -9 41 22 -42 -1 52 -18 -41 18 15 -25 -35 25 8 -53 -21 30 -32 -52 12 18 -39 -41 30
2797 30 -11 -47 -4 38 -25 -37 25 33 -38 -13 37 14 -32 7 45 -18 -36 30 32 -17 -5 60 7 -28 26 47 -17 -23 33 19 -47 -7
2829 -7 46 -14 -46 12 28 -43 -41 19 -11 -64 -10 30 -17 -54 8 29 -42 -32 25 3 -47 -2 38 -14 -36 35 33 -36 -13 52 5 -40
2861 -40 6 37 -10 -22 35 29 -40 -8 42 -14 -33 11 35 -33 -40 41 7 -46 -8 41 -17 -58 3 16 -56 -39 27 -6 -64 -12 30
2892 30 -34 -57 11 18 -53 -29 41 3 -44 7 42 -25 -34 42 29 -35 -5 49 -3 -41 25 55 -16 -32 35 22 -42 -6 52 -10 -49
2923 -49 7 29 -42 -47 31 7 -62 -14 39 -38 -58 18 21 -53 -47 32 -3 -60 0 39 -21 -51 31 21 -32 -14 45 -2 -46 20 57 -13
2955 -13 -34 59 32 -43 1 67 14 -41 24 55 -30 -28 46 31 -50 -6 50 -15 -56 16 38 -56 -45 42 4 -66 -14 49 -22 -52 23
2986 23 32 -51 -31 50 9 -54 -2 48 -30 -49 39 39 -41 -17 61 9 -33 16 58 -9 -29 43 40 -47 1 59 10 -49 25 48 -40 -33
3018 -33 44 18 -52 1 41 -22 -61 15 33 -52 -34 34 6 -82 -20 40 -44 -63 19 21 -64 -41 33 -4 -59 9 57 -33 -42 42 30
3049 30 -51 -7 58 6 -49 29 41 -19 -32 53 33 -48 9 69 1 -56 26 53 -51 -46 49 5 -69 -4 38 -29 -66 15 27 -50
3079 -50 -49 43 -4 -77 -12 53 -36 -53 22 21 -57 -34 45 0 -59 12 44 -20 -29 52 45 -37 -8 61 -2 -49 34 54 -24 -31 49 41 -45
3112 -45 -8 51 -13 -59 20 49 -50 -47 36 9 -69 -24 35 -34 -65 19 38 -50 -41 39 -7 -75 -5 47 -38 -47 35 31 -46 -14 58 12
3144 12 -54 17 77 -24 -34 62 49 -38 -10 65 15 -46 22 60 -32 -44 46 24 -56 -12 52 -8 -61 3 34 -38 -48 37 11 -75
3174 -75 -11 35 -26 -66 6 28 -49 -41 40 7 -59 -10 60 -18 -58 36 50 -46 -18 63 25 -47 13 71 -24 -44 53 36 -37 -12 67
3205 67 14 -64 15 60 -25 -44 31 30 -62 -29 49 -6 -62 8 45 -44 -57 32 16 -64 -24 29 -18 -63 14 38 -59 -44 32 24 -59
3236 -59 -18 54 -11 -49 29 40 -37 -25 53 26 -55 10 53 -11 -49 39 47 -38 -18 52 6 -57 -6 45 -29 -69 14 36 -62 -37 39
3267 39 -5 -68 -15 50 -36 -67 37 20 -56 -28 33 -11 -67 1 44 -33 -37 44 20 -48 -6 60 7 -55 32 62 -20 -32 51 34
3297 34 -42 11 64 -6 -45 25 43 -35 -44 43 14 -68 -27 45 -14 -68 22 26 -61 -45 34 11 -64 -17 35 -39 -55 23 29 -40 -30 36
3329 36 2 -59 0 51 -14 -43 38 33 -32 -12 60 6 -37 17 65 -22 -32 47 37 -38 -6 54 -3 -54 22 42 -33 -38 41 14 -80
3360 -80 -21 47 -20 -65 6 20 -52 -52 30 3 -69 -15 39 -24 -59 17 23 -43 -40 54 6 -38 -6 48 -2 -42 37 46 -31 -13 63 22
3392 22 -31 12 48 -18 -31 35 34 -45 -13 40 -8 -48 8 50 -36 -50 31 13 -54 -20 46 -14 -60 15 41 -46 -50 31 14 -68 -5
3423 -5 52 -14 -42 24 46 -26 -29 45 17 -35 11 60 -5 -35 43 46 -33 -12 42 32 -35 12 49 -11 -37 36 31 -37 -16 28 -11 -63
3455 -63 5 41 -47 -39 24 12 -66 -19 42 -18 -63 7 30 -48 -36 41 26 -52 -3 52 -15 -53 20 56 -19 -31 44 32 -45 0 66
3486 66 1 -31 27 51 -16 -17 57 19 -46 12 41 -15 -30 28 33 -51 -26 47 -6 -65 0 42 -34 -47 18 10 -65 -28 43 -8 -68 11
3518 11 54 -40 -46 40 41 -41 -9 63 4 -44 20 57 -25 -25 46 38 -37 7 51 10 -30 27 49 -19 -12 45 16 -46 -1 43 -25 -50 18
3551 18 17 -46 -28 37 -16 -60 2 30 -31 -54 30 11 -55 -27 46 -3 -55 21 34 -38 -44 45 40 -33 -4 58 6 -45 30 65 -18 -30
3583 -30 31 50 -36 0 57 2 -33 26 43 -33 -27 39 15 -51 -8 42 -24 -49 12 26 -50 -34 33 -12 -68 6 38 -28 -42 21 23
3614 23 -57 -21 51 -8 -49 16 52 -32 -31 41 40 -41 -10 60 16 -46 13 62 -12 -26 39 37 -34 -15 48 6 -56 6 33 -29 -41 16
3646 16 17 -52 -16 32 -18 -49 8 26 -42 -33 30 -5 -60 2 47 -21 -49 31 39 -40 -9 54 5 -45 9 55 -11 -31 38 53 -33 -22
3678 -22 59 19 -44 12 63 -20 -29 38 34 -30 -10 48 4 -45 14 41 -32 -42 27 6 -51 -19 41 -22 -51 11 22 -52 -42 38 1
3709 1 -62 -14 53 -23 -40 37 35 -34 -26 48 9 -49 9 68 4 -33 35 38 -26 -22 58 22 -43 13 40 -13 -39 30 32 -45 -16 38 -3
3742 -3 -43 4 20 -34 -51 13 9 -59 -32 24 -15 -48 17 29 -36 -38 39 16 -52 4 41 -5 -40 31 39 -23 -22 66 22 -52 1 68 -7
3775 -7 -53 37 56 -25 -12 70 26 -44 10 47 -14 -44 21 29 -37 -29 32 -4 -52 -4 29 -29 -54 22 13 -39 -25 31 -18 -52 0 24
3807 24 -32 -38 34 5 -51 0 47 4 -36 33 37 -26 -26 52 21 -36 -6 64 6 -41 34 55 -40 -16 55 26 -50 -13 40 -9 -51 10
3839 10 27 -26 -33 23 8 -64 -35 25 -34 -51 17 15 -40 -25 22 -13 -45 18 37 -15 -17 34 33 -28 -3 65 7 -42 28 56 -21 -28 58
3872 58 34 -32 2 51 10 -45 21 58 -19 -37 37 29 -40 -12 31 -15 -61 9 26 -31 -37 26 9 -44 -3 31 -25 -47 14 18 -33 -11
3904 -11 26 8 -45 2 41 -15 -32 36 43 -30 -5 61 18 -29 17 52 -17 -28 39 30 -38 -20 51 3 -57 6 44 -30 -45 28 19 -46
3936 -46 -22 22 -10 -62 10 30 -27 -42 27 4 -49 -15 29 -15 -43 5 22 -37 -24 47 16 -44 2 45 5 -22 38 50 -28 -9
3966 -9 58 18 -27 7 52 -7 -43 45 32 -36 -15 47 5 -38 -3 22 -19 -54 17 16 -49 -28 32 1 -50 -10 32 -37 -40 21 14 -56
3998 -56 -18 47 0 -40 13 38 -19 -14 50 30 -37 4 51 6 -29 33 37 -13 -15 50 22 -33 7 53 -3 -35 20 34 -44 -26 44 2
4030 2 -51 -8 37 -25 -52 4 14 -52 -28 28 6 -57 -2 34 -18 -41 28 27 -35 -17 54 12 -28 15 37 -14 -11 37 28 -32 5 51
4062 51 -2 -24 32 51 -16 -33 41 17 -37 -1 54 -15 -38 15 17 -43 -33 30 4 -52 -22 27 -25 -58 9 24 -50 -35 34 4 -50
4093 -50 -6 28 -18 -37 24 41 -32 -12 56 17 -34 3 48 -2 -25 39 35 -26 2 56 5 -40 18 49 -30 -31 41 26 -42 -18 32
4124 32 -19 -54 9 44 -33 -44 18 18 -59 -17 41 -14 -56 13 34 -40 -38 31 12 -41 -8 43 -6 -50 27 33 -21 -15 53 23 -23 20
4156 20 52 5 -35 20 40 -32 -2 52 -2 -36 4 43 -28 -37 33 22 -51 -23 39 -11 -64 8 42 -36 -40 31 9 -51 -24 41 -11
4187 -11 -42 16 34 -34 -34 38 16 -33 -9 56 -12 -39 27 33 -26 -16 38 19 -34 13 50 -4 -28 39 24 -42 -21 46 5 -44 14
4218 14 33 -33 -49 29 11 -62 -28 40 -10 -67 6 39 -43 -46 33 24 -47 -20 44 -12 -53 25 40 -32 -31 33 25 -33 -10 44 1 -32
4250 -32 27 35 -22 -16 51 19 -36 14 50 -14 -31 41 26 -36 -17 53 -4 -49 2 31 -34 -48 24 22 -67 -30 30 -6 -71 -2 33 -53
4282 -53 -63 30 17 -51 -18 53 -4 -49 3 41 -18 -33 37 27 -42 -1 60 -4 -25 21 39 -28 -6 39 4 -40 18 40 -13 -33
4312 -33 39 27 -45 -19 47 -11 -59 9 30 -44 -46 23 15 -55 -25 37 -10 -64 3 34 -34 -64 39 28 -52 -13 59 4 -37 16 57
4343 57 -12 -20 51 33 -31 0 53 5 -32 27 33 -19 -15 47 -1 -37 14 42 -26 -44 28 18 -58 -27 36 -12 -60 -4 26 -52 -57 21
4375 21 21 -67 -22 40 -21 -67 -7 40 -29 -42 37 28 -35 -8 36 19 -35 31 44 -5 -16 42 30 -36 -1 46 -2 -33 33 29 -28 -19
4407 -19 31 8 -52 1 32 -29 -46 26 15 -53 -21 30 -7 -57 8 39 -32 -63 18 22 -47 -15 42 -4 -41 12 54 -6 -40 40 43
4438 43 -25 -6 53 18 -38 13 49 -15 -15 41 23 -24 9 40 -15 -27 26 33 -31 -13 25 -4 -39 0 37 -31 -51 19 18 -43 -26 27
4470 27 -1 -53 -3 44 -20 -49 30 31 -41 -19 44 6 -41 8 50 0 -27 51 35 -22 11 49 11 -25 25 40 -14 -5 48 23 -27
4501 -27 -1 31 -8 -42 23 32 -27 -27 25 14 -38 -13 24 -14 -37 7 23 -35 -22 27 6 -36 -2 34 -21 -38 20 29 -24 -15 41 13
4533 13 -41 21 51 -1 -19 41 41 -26 7 40 22 -26 13 54 -13 -28 33 34 -34 -16 33 -2 -44 15 11 -37 -35 15 5 -45 -13 25
4565 25 -6 -46 13 14 -26 -31 27 5 -41 1 45 -10 -32 28 31 -27 -3 64 26 -19 17 61 3 -12 30 41 -16 -11 35 17 -30 8
4597 8 37 -11 -33 27 20 -35 -25 33 -6 -48 4 31 -30 -43 17 8 -53 -21 28 -3 -49 1 35 -32 -15 32 22 -26 3 45 -1 -25
4629 -25 30 48 -24 -5 47 31 -14 13 52 6 -21 35 30 -21 -16 32 13 -39 -10 34 -12 -34 11 19 -29 -28 24 -5 -55 -8 24 -26
4661 -26 -38 16 18 -44 -21 30 10 -40 -3 39 -13 -23 29 18 -28 -6 56 -2 -31 20 35 -7 0 45 30 -31 5 57 -3 -34 16
4692 16 34 -21 -16 46 16 -38 -14 33 -27 -52 10 17 -47 -42 41 -10 -63 -9 34 -18 -45 19 19 -47 -25 39 1 -48 1 31 -20 -37
4724 -37 35 28 -28 -7 43 8 -29 27 37 -15 -24 39 18 -38 2 46 4 -23 24 37 -29 -27 31 4 -65 -6 32 -25 -54 4 13 -47
4756 -47 -29 24 -5 -61 -11 34 -21 -47 17 35 -43 -25 42 20 -36 6 42 -5 -22 55 28 -26 -4 42 4 -26 24 33 -18 -14 42
4787 42 26 -25 9 42 -14 -40 27 31 -34 -26 34 5 -48 -13 26 -33 -56 9 24 -51 -36 33 8 -53 3 46 -18 -38 30 26 -27 -23
4819 -23 49 30 -25 19 40 -6 -14 35 27 -23 -7 45 21 -31 15 41 -25 -25 30 12 -39 -13 30 -8 -43 12 24 -40 -33 30 0 -58
4851 -58 -11 34 -38 -50 16 27 -49 -22 56 -6 -50 9 51 -31 -36 29 47 -24 -8 46 16 -24 20 48 -8 -15 36 38 -22 -6 50 4
4883 4 -27 11 35 -25 -21 28 0 -41 1 28 -34 -48 12 13 -41 -30 32 2 -51 -9 36 -17 -43 32 19 -38 -13 39 1 -39 8 37
4915 37 -2 -31 28 45 -12 -1 49 9 -26 21 42 -3 -17 44 31 -30 -2 39 -1 -26 13 28 -27 -24 25 -2 -44 -10 21 -22 -41
4946 -41 6 1 -46 -31 34 14 -48 -3 37 -21 -40 33 30 -27 -16 49 14 -28 23 54 -8 -25 38 33 -11 -3 28 11 -34 16 32 -11
4978 -11 -23 38 18 -25 -2 30 -9 -26 32 23 -30 -25 27 1 -47 -14 34 -30 -49 25 18 -38 -17 37 7 -47 4 36 -19 -29 35 28
5010 28 -23 -6 42 15 -24 21 54 8 -15 36 36 -25 -3 41 14 -26 7 32 -2 -23 27 19 -38 -3 31 -17 -49 17 13 -33 -34 15
5042 15 -6 -45 -14 33 -10 -35 18 16 -26 -15 27 14 -33 6 42 -11 -23 33 32 -18 4 51 23 -12 17 47 1 -18 28 31 -16 3
5074 3 38 6 -28 18 25 -21 -26 22 11 -29 -12 24 -15 -40 3 18 -26 -44 17 7 -36 -14 27 -6 -43 15 18 -29 -14 35 21 -30
5106 -30 5 37 0 -22 43 37 -10 5 43 15 -16 20 40 0 -27 26 29 -18 -12 31 7 -28 4 23 -13 -33 23 9 -37 -22 30 -4
5138 -4 -40 6 23 -18 -22 19 6 -28 -3 35 3 -19 23 37 1 -6 32 24 -15 -2 40 14 -10 39 31 -10 -8 37 31 -19 4 50 -3 -31
5172 -31 16 39 -20 -12 32 12 -37 -3 26 -11 -32 9 15 -41 -24 22 -7 -30 -4 20 -7 -23 22 16 -16 -13 37 12 -21 16 37 -2
5204 -2 -15 42 27 -25 10 51 20 -23 33 45 -16 -24 40 12 -31 9 51 -2 -31 14 14 -34 -27 28 6 -38 -11 24 -15 -45 13 32
5236 32 -34 -31 12 12 -33 -4 29 -22 -33 26 23 -11 -9 43 20 -31 16 41 -3 -13 35 30 -24 3 51 9 -25 14 43 -17 -29 33 20
5269 20 -42 -10 34 -4 -42 12 25 -27 -44 22 4 -44 -18 21 -13 -44 7 21 -26 -33 28 18 -36 -10 44 -8 -22 22 22 -15 -7 44
5301 44 19 -18 27 45 2 -23 42 31 -28 3 37 -1 -37 12 44 -19 -35 29 23 -42 -24 40 -12 -52 -1 21 -35 -44 19 7 -45
5332 -45 -14 32 -10 -45 5 22 -27 -24 16 10 -29 2 41 -10 -22 34 36 -11 -10 36 21 -17 15 45 0 -13 43 28 -32 -3 44 4
5364 4 -40 9 30 -35 -33 25 7 -46 -29 31 -17 -54 0 29 -41 -43 10 2 -35 -18 43 2 -35 0 35 -18 -24 33 15 -27 0 33 5
5397 5 -23 29 35 -19 -6 45 17 -21 14 37 -5 -22 34 25 -20 -22 36 5 -41 4 25 -26 -39 16 0 -48 -14 22 -17 -43 11 31
5429 31 -31 -27 19 23 -32 -6 28 -9 -27 15 26 -12 -14 40 19 -26 10 41 0 -14 33 26 -5 -1 42 13 -36 10 39 -13 -13 32 27 -28
5463 -28 -7 31 0 -37 3 19 -39 -48 5 1 -41 -24 36 -16 -53 5 29 -30 -25 23 12 -22 -16 28 0 -19 16 23 -9 -8 35 34 -14 13
5497 13 31 2 -17 25 27 -15 -7 29 0 -20 11 28 -14 -19 23 8 -42 -14 21 -10 -40 -1 21 -38 -45 17 -3 -40 -19 19 -15 -49
5529 -49 2 31 -22 -30 22 21 -22 -20 28 -3 -16 14 38 0 -2 34 26 -6 7 32 -1 -18 24 16 -17 -6 30 5 -32 -3 17 -27 -28 13
5563 13 10 -35 -22 14 -18 -44 -6 12 -31 -37 15 4 -31 -13 24 2 -30 6 20 -15 -20 24 26 -19 -14 31 12 -6 22 32 -5 -11 24
5596 24 29 -10 8 18 5 -12 17 15 -25 -4 15 -9 -19 -9 6 -22 -28 3 -10 -35 -28 9 -10 -41 -6 17 -19 -21 15 20 -31 -21 26
5629 26 9 -18 4 33 1 -10 23 27 -20 -8 28 18 -12 14 32 16 -4 20 30 -9 2 24 1 -17 7 11 -22 -6 10 3 -33 -9
5661 -9 17 -18 -28 10 3 -40 -18 17 -2 -27 4 23 -18 -25 10 21 -20 0 37 11 -18 16 37 6 -13 20 27 -4 -4 36 14 -8 18
5694 18 22 -3 -3 29 15 -13 6 18 -1 -14 4 8 -19 -19 25 -1 -37 -14 9 -23 -25 7 12 -26 -16 14 -7 -40 0 32 -13 -15 17 30
5728 30 -8 -8 33 13 -32 8 22 2 -10 19 36 -10 -11 20 11 -19 13 37 -11 -18 15 9 -20 -2 14 -15 -30 5 9 -22 -22 7 -7 -36
5762 -36 -13 17 -18 -31 14 10 -17 -26 33 16 -22 -2 28 -14 -20 15 21 -13 -9 46 26 -2 7 44 18 -7 27 39 -12 -11 34 6 -19 -2
5796 -2 26 -13 -17 14 5 -26 -18 4 -3 -30 5 7 -31 -18 17 4 -38 -9 26 -9 -27 12 26 -22 -25 31 14 -28 4 37 14 -22 32 36
5830 36 -2 0 40 28 -17 3 37 5 -13 17 29 -19 -18 22 10 -25 8 10 -14 -25 12 7 -35 -27 11 -6 -42 1 8 -27 -25 14 -5 -31
5864 -31 0 26 2 -20 8 32 -9 -19 31 15 -25 -6 40 2 -28 28 34 -7 -4 37 16 -19 -9 27 -3 -21 16 14 -20 -19 19 -6
5896 -6 -29 -7 9 -23 -25 -1 -3 -32 -30 3 -12 -43 0 15 -21 -23 15 -7 -27 -1 25 0 -12 18 30 -19 -16 31 17 -18 10 44 5
5929 5 -13 20 28 -15 -16 33 8 -20 -5 19 -1 -26 12 10 -33 -24 15 -17 -26 -8 14 -22 -21 0 -6 -33 -18 6 -9 -32 8 12 -13 -18 14
5964 14 13 -20 -3 23 4 -17 16 41 -5 -8 31 23 -12 8 27 4 -29 23 26 -13 -9 11 16 -24 0 22 -12 -25 12 4 -24 -30 4 -4 -37
5999 -37 -6 5 -13 -32 -5 -1 -21 -17 9 -9 -29 3 12 -11 -12 16 18 -19 0 21 0 -9 21 31 -2 1 30 21 -4 7 26 -7 -20 15
6033 15 8 -21 -22 13 8 -15 -10 18 -9 -25 -6 -1 -21 -17 4 -4 -27 -11 7 -12 -27 6 5 -16 0 16 0 -12 12 21 -1 -6 27 22 -18 -10
6069 -10 24 12 3 21 38 2 4 26 23 -14 7 33 -7 -17 11 12 -20 -17 10 -12 -24 -12 16 -11 -29 0 7 -20 -15 -2 -2 -22 -11 12
6103 12 -10 -20 7 23 -9 2 26 9 -7 10 24 8 10 25 15 0 5 30 7 -6 25 28 -4 1 18 9 -12 2 16 -8 -14 0 18
6136 18 -16 -14 21 7 -27 -15 8 -15 -25 -11 2 -17 -20 -3 -2 -30 -10 10 1 -22 10 15 -5 -3 17 14 1 3 18 2 5 18 7 -1 14
6171 14 18 2 -5 12 10 -17 -13 -1 -2 -14 -6 6 -4 -15 2 8 -25 -31 1 3 -36 -13 5 -8 -28 -5 13 -11 -20 4 7 -15 -8 13 3 -10
6207 -10 17 18 3 9 17 9 2 8 24 4 1 9 17 1 1 13 -5 -5 -4 13 -14 -25 5 -11 -22 -16 3 -19 -29 -5 5 -25 -24 1 -6 -22 -17 7
6245 7 -18 -18 0 3 -11 -24 0 10 -21 6 23 1 -14 14 20 4 7 16 13 2 19 20 9 2 22 23 -13 2 16 -6 -20 3 7 -6 -10 16
6281 16 7 -23 -16 8 -19 -25 -13 4 -25 -12 3 8 -15 -10 9 0 -13 9 16 -9 -9 20 6 -2 3 30 10 -7 16 15 2 0 27 5 -9 4
6317 4 26 5 -16 18 4 -20 0 19 -1 -16 2 5 -18 -16 4 1 -17 -18 3 -10 -32 -10 2 -21 -23 4 12 -23 -12 15 1 -13 16 19
6351 19 2 1 24 23 1 6 12 14 -4 15 30 -3 -1 29 11 -12 5 9 -3 -12 6 0 -17 -17 12 -9 -19 -14 6 -25 -30 -8 -5 -31 -22 8 -11
6388 -11 -24 -9 4 -9 -19 12 13 -16 -7 25 21 -7 9 29 0 12 16 15 -8 3 34 -2 -10 4 19 -1 -17 15 7 -22 0 10 -9 -27
6422 -27 -1 1 -18 -23 4 -20 -29 -9 0 -28 -32 8 -10 -26 -8 1 -13 -20 5 13 -10 -12 12 13 4 4 26 12 -5 10 29 16 -3 28 15 -5
6458 -5 7 21 6 -9 2 10 -19 -17 -6 -5 -8 0 14 -13 -19 -1 3 -23 -21 18 -9 -18 -16 6 -10 -31 -5 -7 -19 -13 4 4 -21 -3 16 -1 1 23
6496 23 18 -9 -2 9 6 -12 14 24 -5 6 19 22 0 13 25 10 -5 2 10 -9 -2 6 -6 -13 -13 5 -10 -24 -16 -3 -16 -23 -3 -6 -17 4 3
6533 3 -11 -13 8 8 -14 6 17 11 -2 18 23 5 -8 21 9 2 7 28 15 -5 8 33 6 1 14 6 -6 3 8 5 -12 1 6 -9 -12 12 -2
6570 -2 -27 -2 3 -23 -15 -7 -5 -15 -25 -2 -2 -17 -2 2 -17 -12 9 15 -3 -1 24 3 -7 18 17 6 -4 19 15 4 -7 13 16 -4 13 12 -6
6607 -6 -13 8 6 -7 -4 1 -14 -22 4 0 -13 -14 -8 -15 -26 -19 0 -27 -15 -3 -3 -18 -19 0 -6 -5 -4 11 3 -8 12 8 6 15 18 11 4 14 27 6 0 22
6649 22 17 -4 2 17 -2 -6 -3 12 -1 -7 -1 -2 -14 -5 2 -13 -26 6 -2 -15 -8 -1 -2 -30 -1 -10 -11 -17 -2 1 -8 -2 13 -2 -11 11 10 7 -6 17 23 13
6691 13 9 18 17 1 12 20 4 8 8 12 -1 3 14 1 -5 15 -3 -12 -18 2 -6 -18 1 -6 -11 -5 -7 -4 -9 -11 3 -3 -18 -16 13 -8 2 2 15 -7 -3 15
6733 15 3 -8 4 15 7 12 14 17 5 17 19 19 7 15 24 2 9 4 17 -2 6 9 0 -18 0 -6 -2 -14 -4 -15 -12 -3 5 -5 -14 -4 -1 -1 -8 3 0 -2
6775 -2 5 12 -2 -8 13 19 7 5 13 9 0 20 24 16 3 13 20 7 7 19 6 -8 16 11 8 -10 3 7 -14 -10 6 -2 -12 -13 -7 -21 -15 -23 -12 -25 -13
6816 -13 0 -15 -15 -6 -8 -2 -8 -7 8 -13 8 18 -4 -6 16 19 3 8 13 11 -1 9 21 -1 0 10 5 4 0 10 -2 -10 9 16 -7 -14 -6 0 -10 -12 -9
6857 -9 -19 -20 -6 -3 -9 -26 -10 -9 -20 -4 0 -8 -15 0 10 -9 3 9 22 4 11 16 6 5 23 14 4 5 16 16 4 21 14 10 4 8 10 -10 -7 10 8
6898 8 -10 3 3 -4 -15 -7 2 -26 -19 5 -10 -14 -2 6 -16 -17 -2 5 -18 -15 -5 -10 -16 0 5 -5 2 18 6 1 5 14 1 3 10 20 7 10 13 18 6 13
6940 13 18 8 -8 0 4 -3 0 2 -9 -7 -1 -4 -1 -7 -12 -5 -21 -17 10 -4 -15 -17 1 -10 -19 -1 0 -11 0 10 -6 -13 7 18 2 10 18 15 3 5 17
6981 17 15 5 12 34 6 12 16 19 2 8 14 6 -10 -4 8 -9 -13 9 -7 -18 -9 -6 -12 -25 3 6 -17 -7 -7 -22 -18 0 2 -16 -11 16 8 -13 -1 22
7021 22 13 -5 4 25 8 4 25 19 -3 7 11 11 4 18 3 0 0 -3 0 -8 -5 11 -8 -22 16 -3 -21 -12 -5 -8 -30 -1 -8 -9 -32 -7 -12 -28 -21 -2
7061 -2 -11 -9 4 11 8 0 20 2 -5 9 20 12 2 19 26 10 17 17 12 6 0 16 10 -19 3 -3 -10 -1 6 -2 -15 -7 -4 -9 -19 -13 -6 -10 -13 -5 0 -9 -3 7 -13 -24
7107 -24 -3 -1 -14 -5 5 2 -7 5 18 -5 3 7 19 3 9 23 5 -5 8 18 6 8 17 4 -2 2 15 4 4 -2 10 -5 -4 -2 0 -12 -1 3 -22
7146 -22 -14 -9 -3 -21 -10 -5 -5 -18 -3 2 -11 -6 -1 5 -7 -5 5 4 -6 3 16 -1 8 16 17 11 9 15 13 1 7 21 -11 -5 10 4 -4 -8 8 4 -6 -7 3
7189 3 -7 -13 -9 -9 -19 -4 -4 -13 -21 -9 4 -8 3 8 -2 -15 -7 11 -1 -6 13 5 -3 7 14 7 2 3 12 5 -6 17 13 5 13 20 8 1 9 10 2 -3 -7 -1 -10
7234 -10 -4 2 -21 -11 -17 -3 -15 -23 -16 -16 -26 -7 -8 -14 -23 -13 -4 -14 1 -1 -8 -4 -9 21 -6 3 23 10 5 0 14 8 1 10 12 1 -1 18 21 2 2 17
7276 17 5 -4 4 -6 4 -2 5 -3 -13 -6 -7 -15 -15 4 1 -11 -23 1 -6 -16 -10 -2 -14 -12 9 4 -6 3 14 1 9 4 19 16 2 16 22 4 6 19 20
7317 20 4 8 17 13 4 20 13 7 2 19 3 -10 -1 16 3 5 3 -3 -4 -4 -7 -7 -15 -9 3 -17 -21 -8 -9 -24 -16 -5 -10 -13 7 8 -5 1 4 15 3 5 26
7360 26 3 1 18 17 13 8 7 9 9 7 13 0 0 4 10 2 -3 5 1 -10 -18 -3 -13 -11 2 -4 -21 -9 10 -13 -12 -19 -4 -16 -10 1 -4 -3 2 17 2 -13 6
7403 6 4 3 6 19 3 -1 12 19 2 -7 16 9 5 7 20 18 -2 5 14 6 -12 2 -3 -22 -18 -2 -6 -16 -12 -9 -25 -12 -4 -8 -15 -18 0 -9 -24 1 -2 -11 -5 1
7447 1 5 -7 2 13 -9 4 6 4 -1 -1 15 10 -3 3 15 11 -1 25 11 -3 -2 10 4 -14 4 6 -11 -10 -14 4 -14 -15 9 -5 -17 -12 -6 -21 -13 0
7487 0 -5 -13 -12 -11 -5 -3 11 5 1 6 13 10 -4 7 15 0 -5 11 16 -8 3 17 17 -3 5 8 -1 2 3 4 -2 -1 1 -1 -13 -7 17 -21 -23 -7 -5 -27 -24 -2 -19
7532 -19 -15 -13 2 -22 -23 -5 -6 -17 -20 -2 3 -5 9 10 -3 4 11 19 9 15 15 6 6 21 9 -1 -4 14 4 -11 12 13 14 -7 6 6 -10 -9 1 -1 2
7573 2 -8 1 -9 -6 -6 -3 -11 -15 3 2 -15 -8 -1 -8 -12 2 2 -13 -3 10 5 -4 17 11 -2 -7 14 7 -1 5 21 15 11 21 13 -1 6 10 7 -17 -5 13 -9
7616 -9 -13 7 9 -13 -20 -5 1 -21 -11 9 -1 -15 -15 4 -7 -13 3 -8 -16 2 10 -8 0 3 14 -6 2 14 16 0 9 19 5 2 12 21 5 13 18
7655 18 12 -6 10 19 0 -7 16 9 -5 -4 14 -2 -18 -9 0 -23 -22 -11 -5 -22 -15 1 -7 -32 5 2 -12 -19 -1 11 -9 3 12 0 8 15 4 -4 0
7694 0 11 20 -4 11 9 -8 7 13 7 0 -6 11 1 -7 15 18 3 -4 2 -2 -20 -12 1 -7 -18 0 -1 -29 -18 1 -13 -23 -15 3 -7 -17 -6 2 -7
7733 -7 -19 10 3 -11 0 2 -3 -4 6 18 6 3 13 10 -14 12 11 -6 -2 5 11 -4 0 16 -2 -3 -2 -4 -18 -20 4 -10 -23 -15 2 -12 -36 -9 2
7772 2 -26 -27 -6 -5 -17 -12 -7 -18 -9 -13 6 -1 -5 17 5 0 2 12 9 1 20 15 3 6 16 10 4 -1 10 9 3 8 6 -6 11 7 -9 -25 1 -1 -8 -13 -5 -2
7816 -2 -23 -19 -7 -7 -22 -4 7 -13 -15 -9 -2 -14 -10 2 -10 -12 5 6 3 4 11 14 2 9 10 3 8 4 17 5 3 10 8 0 -3 4 -10 -13 17 10 -16 -13 3 7
7860 7 -24 -17 -3 -23 -20 -1 -9 -11 -15 4 -7 -21 3 12 1 -15 2 10 -10 -8 5 3 -8 2 17 4 6 12 15 -1 5 24 14 1 16 12 8 9 14
7899 14 10 -8 -2 10 11 -5 -3 1 -8 -16 -6 -9 -15 -11 -8 -16 -9 -3 -7 -11 -14 0 2 -11 -3 4 -15 -5 -5 3 -6 -6 19 3 6 -2 16 4 5 10 13 1 -1 13 6 -1
7945 -1 0 12 -7 -7 8 0 -4 -6 4 -12 -17 0 -10 -13 -15 -9 -11 -36 -7 -4 -10 -31 -2 -4 -21 -14 8 -9 -8 2 10 1 2 13 13 7 10 15 6 -12 5 10 3
7988 3 -2 6 0 -6 2 11 -6 -5 -6 1 -3 -19 3 2 -16 -11 3 -16 -12 -5 -14 -13 -18 -3 -16 -14 -8 -7 -6 -21 -3 0 -19 -12 4 -10 -1 -5 13 -5 -6 12 18 4
8032 4 11 13 3 -3 10 19 3 -3 7 11 -6 3 9 3 -2 -7 3 -2 -15 -8 -10 -19 -12 -10 -13 -17 -13 -3 -18 -16 -3 -13 -16 -7 -8 -15 -17 0 -4 -16 3 7 -2 -11 14 15
8078 15 3 -3 16 13 -7 11 12 10 1 15 19 -5 -6 0 10 -8 -13 5 -14 -16 -10 -3 -19 -20 -7 -13 -17 -22 5 -6 -22 -12 -6 -13 -15 -2 2 -16 -11 9 4
8119 4 -8 14 10 0 -3 16 16 -2 15 15 0 -8 4 20 1 10 17 -3 -7 -2 4 -9 -7 9 12 -6 -19 4 -4 -21 -15 -3 -14 -21 -19 -11 -11 -17 -1 -11
8159 -11 -4 -6 -5 -5 -5 6 6 -12 -4 5 0 -10 10 16 -4 -6 16 10 -5 15 8 5 -10 0 14 -3 -2 8 -6 -9 -8 -4
8191d
##END NTUPLES=NMR FID
##END=
