##TITLE=1H_LY-Ni_600_Hex-120
 CDCl3, 8 sc, 
 17.1.2019
##JCAMPDX= 6.0         $$ Bruker NMR JCAMP-DX V2.0
##DATA TYPE= NMR FID
##DATA CLASS= NTUPLES
##ORIGIN= UXNMR, Bruker Analytische Messtechnik GmbH
##OWNER= root
$$ XWIN-NMR		Version 3.5
$$ Thu Jan 17 14:06:11 2019 Russian Standard Time (UT+4h)  she@DPX200
##.OBSERVE FREQUENCY= 200.1313
##.OBSERVE NUCLEUS= ^1H
##.DELAY= (6, 6)
##.ACQUISITION MODE= SIMULTANEOUS
##.ACQUISITION SCHEME= undefined
##.AVERAGES= 8
##.DIGITISER RES= 18
##SPECTROMETER/DATA SYSTEM= spect
##.PULSE SEQUENCE= zg30
##.SOLVENT NAME= CDCl3
##.SHIFT REFERENCE= (INTERNAL, CDCl3, 0, 15.7039)
##AUDIT TRAIL= $$ (NUMBER, WHEN, WHO, WHERE, WHAT)
$$ ##TITLE= Audit trail, XWIN-NMR		Version 3.5
$$ ##JCAMPDX= 5.01
$$ ##ORIGIN= Bruker BioSpin GmbH
$$ ##OWNER= she
$$ F:/spectra/data/she/nmr/H-F/1/audita.txt
$$ ##AUDIT TRAIL=  $$ (NUMBER, WHEN, WHO, WHERE, WHAT)
(   1,<2019-01-17 14:04:28.87 +0400>,<she>,<DPX200>,
      <created by zg, POWCHK disabled, PULCHK disabled
       configuration hash MD5:
       00 E9 B6 7A A2 85 ED C7 34 08 36 98 17 FE 4E 26
       data hash MD5: 16K
       CB 9E 73 52 D2 B5 A6 85 60 F8 AF EF E3 53 67 08>)
$$ ##END=
$$ 
$$ hash MD5
$$ 68 C4 BE 2B FA 01 58 4C 5D 54 48 7A 35 86 8D E8
##$RELAX= 
##$RELAX= 
##$RELAX= 
##$RELAX= 
##$RELAX= 
##$RELAX= 
$$ Bruker specific parameters
$$ --------------------------
##$DU= <F:/spectra>
##$EXPNO= 1
##$NAME= <H-F>
##$PROCNO= 1
##$TYPE= <nmr>
##$USER= <she>
##$AMP= (0..31)
100 100 100 100 100 100 100 100 100 100 100 100 100 100 100 100 100 100 
100 100 100 100 100 100 100 100 100 100 100 100 100 100 
##$AQSEQ= 0
##$AQ_mod= 1
##$AUNM= <au_zg>
##$AUTOPOS= <>
##$BF1= 200.13
##$BF2= 200.13
##$BF3= 200.13
##$BF4= 200.13
##$BF5= 200.13
##$BF6= 200.13
##$BF7= 200.13
##$BF8= 200.13
##$BYTORDA= 1
##$CFDGTYP= 0
##$CFRGTYP= 5
##$CHEMSTR= <none>
##$CNST= (0..31)
1 1 145 1 1 1 1 1 1 1 1 1 1 1 1 1 1 1 1 1 1 1 1 1 1 1 1 1 1 1 1 1 
##$CPDPRG= <>
##$CPDPRG1= <>
##$CPDPRG2= <>
##$CPDPRG3= <>
##$CPDPRG4= <mlev>
##$CPDPRG5= <mlev>
##$CPDPRG6= <mlev>
##$CPDPRG7= <mlev>
##$CPDPRG8= <mlev>
##$CPDPRGB= <>
##$CPDPRGT= <>
##$D= (0..31)
0 1.2 0 0 0 0 0 0 0 0 0 0.03 0 0 0 0 0 0 0 0 0 0 0 0 0 0 0 0 0 0 0 0 
##$DATE= 1547719468
##$DBL= (0..7)
120 120 120 120 120 120 120 120 
##$DBP= (0..7)
150 150 150 150 150 150 150 150 
##$DBP07= 0
##$DBPNAM0= <>
##$DBPNAM1= <>
##$DBPNAM2= <>
##$DBPNAM3= <>
##$DBPNAM4= <>
##$DBPNAM5= <>
##$DBPNAM6= <>
##$DBPNAM7= <>
##$DBPOAL= (0..7)
0.5 0.5 0.5 0.5 0.5 0.5 0.5 0.5 
##$DBPOFFS= (0..7)
0 0 0 0 0 0 0 0 
##$DE= 6
##$DECBNUC= <off>
##$DECIM= 32
##$DECNUC= <off>
##$DECSTAT= 4
##$DIGMOD= 1
##$DIGTYP= 9
##$DL= (0..7)
0 120 120 120 120 120 120 120 
##$DP= (0..7)
150 150 150 150 150 150 150 150 
##$DP07= 0
##$DPNAME0= <>
##$DPNAME1= <>
##$DPNAME2= <>
##$DPNAME3= <>
##$DPNAME4= <>
##$DPNAME5= <>
##$DPNAME6= <>
##$DPNAME7= <>
##$DPOAL= (0..7)
0.5 0.5 0.5 0.5 0.5 0.5 0.5 0.5 
##$DPOFFS= (0..7)
0 0 0 0 0 0 0 0 
##$DQDMODE= 0
##$DR= 18
##$DS= 0
##$DSLIST= <SSSSSSSSSSSSSSS>
$$ [...]
##$SUBNAM2= <"">
##$SUBNAM3= <"">
##$SUBNAM4= <"">
##$SUBNAM5= <"">
##$SUBNAM6= <"">
##$SUBNAM7= <"">
##$SUBNAM8= <"">
##$SUBNAM9= <"">
##$SW= 20.0189088683792
##$SWIBOX= (0..15)
0 0 2 0 0 0 0 0 0 0 0 0 0 0 0 0 
##$SW_h= 4006.41025641026
##$TD= 16384
##$TD0= 1
##$TE= 0
##$TE2= 300
##$TE3= 300
##$TEG= 300
##$TL= (0..7)
0 120 120 120 120 120 120 120 
##$TP= (0..7)
150 150 150 150 150 150 150 150 
##$TP07= 0
##$TPNAME0= <>
##$TPNAME1= <>
##$TPNAME2= <>
##$TPNAME3= <>
##$TPNAME4= <>
##$TPNAME5= <>
##$TPNAME6= <>
##$TPNAME7= <>
##$TPOAL= (0..7)
0.5 0.5 0.5 0.5 0.5 0.5 0.5 0.5 
##$TPOFFS= (0..7)
0 0 0 0 0 0 0 0 
##$TUNHIN= 0
##$TUNHOUT= 0
##$TUNXOUT= 0
##$USERA1= <user>
##$USERA2= <user>
##$USERA3= <user>
##$USERA4= <user>
##$USERA5= <user>
##$V9= 5
##$VALIST= <valist>
##$VCLIST= <CCCCCCCCCCCCCCC>
##$VD= 0
##$VDLIST= <DDDDDDDDDDDDDDD>
##$VPLIST= <PPPPPPPPPPPPPPP>
##$VTLIST= <TTTTTTTTTTTTTTT>
##$WBST= 1024
##$WBSW= 4
##$XGAIN= (0..3)
0 0 0 0 
##$XL= 0
##$YL= 0
##$YMAX_a= 100629
##$YMIN_a= -102138
##$ZGOPTNS= <>
##$ZL1= 120
##$ZL2= 120
##$ZL3= 120
##$ZL4= 120
##$ABSF1= 10
##$ABSF2= 0
##$ABSG= 5
##$ABSL= 3
##$ALPHA= 0
##$AQORDER= 0
##$ASSFAC= 0
##$ASSFACI= 0
##$ASSFACX= 0
##$ASSWID= 0
##$AUNMP= <proc_1d>
##$AZFE= 0.1
##$AZFW= 0.1
##$BCFW= 1
##$BC_mod= 2
##$BYTORDP= 1
##$COROFFS= 0
##$CY= 11.3945322036743
##$DATMOD= 1
##$DC= 2
##$DFILT= <>
##$DTYPP= 0
##$F1P= 18.9103706918063
##$F2P= -1.10871071338519
##$FCOR= 0.5
##$FTSIZE= 0
##$FT_mod= 4
##$GAMMA= 1
##$GB= 0.15
##$INTBC= 1
##$INTSCL= 1
##$ISEN= 128
##$LB= 0.24
##$LEV0= 0
##$LPBIN= 0
##$MAXI= 10000
##$MC2= 0
##$MEAN= 0
##$ME_mod= 0
##$MI= 1.114404
##$NCOEF= 0
##$NC_proc= 0
##$NLEV= 6
##$NOISF1= 3.799351
##$NOISF2= 2.8
##$NSP= 1
##$NTH_PI= 0
##$NZP= 0
##$OFFSET= 15.70392
##$PC= 1
##$PHC0= -9128.07
##$PHC1= 12.00004
##$PH_mod= 1
##$PKNL= yes
##$PPARMOD= 0
##$PSCAL= 0
##$PSIGN= 0
##$REVERSE= no
##$SF= 200.130013532006
##$SI= 16384
##$SIGF1= 3
##$SIGF2= 2
##$SINO= 400
##$SIOLD= 16384
##$SREGLST= <1H.CDCl3>
##$SSB= 0
##$STSI= 0
##$STSR= 0
##$SW_p= 3612.71676300578
##$SYMM= 0
##$S_DEV= 0
##$TDeff= 0
##$TDoff= 0
##$TI= <>
##$TILT= no
##$TM1= 0
##$TM2= 0
##$TOPLEV= 0
##$USERP1= <user>
##$USERP2= <user>
##$USERP3= <user>
##$USERP4= <user>
##$USERP5= <user>
##$WDW= 1
##$XDIM= 8192
##$YMAX_p= 0
##$YMIN_p= 0
$$ End of Bruker specific parameters
$$ ---------------------------------
##NTUPLES= NMR FID
##VAR_NAME=  TIME,          FID/REAL,        FID/IMAG
##SYMBOL=    X,             R,               I
##VAR_TYPE=  INDEPENDENT,   DEPENDENT,       DEPENDENT
##VAR_FORM=  AFFN,          ASDF,            ASDF
##VAR_DIM=   8192,          8192,            8192
##UNITS=     SECONDS,       ARBITRARY UNITS, ARBITRARY UNITS
##FACTOR=    0.0002496,     1,               1
##FIRST=     0,             0,               0
##LAST=      2.0444736,     0,               0
##MIN=       0,             -102138,         0
##MAX=       2.0444736,     100629,          0
$$ Real data points
##PAGE= N=1
##DATA TABLE= (X++(R..R)), XYDATA
0 0 0 0 0 0 0 0 0 0 0 0 0 0 0 0 0 0 0 0 8 -8 8 -8 8 -8 16 -16 16 -21 24 -24 32 -32 40 -44 48 -56 64 -69 77 -87
40 -87 96 -107 117 -131 145 -158 175 -194 214 -234 258 -286 313 -347 384 -425 474 -530 596 -674
60 -674 770 -887 1042 -1248 1540 -1982 2725 -4206 8219 -40610 -102138 66481 84941 -76380
74 -76380 -70485 86856 49662 -88431 -31639 87771 12889 -80253 1091 71157 -12224 -58340
86 -58340 17354 46001 -18569 -33621 14334 24064 -7420 -17238 -2439 14764 12377 -16210 -21943
99 -21943 21980 28953 -30709 -32686 42149 32222 -54302 -27370 66364 18283 -76521 -5759 83692
112 83692 -9498 -87041 25738 85735 -42028 -79908 56673 69850 -68568 -56271 76891
123 76891 40553 -80860 -23771 80680 7712 -76333 6565 68688 -17768 -58662 25183 47387
135 47387 -28542 -36130 27857 25951 -23897 -17926 17404 12673 -9602 -10583 1756 11670 5035 -15570
149 -15570 -9747 21699 11697 -29119 -10541 36877 6269 -43946 759 49448 -9844 -52556
161 -52556 20225 52831 -30847 -49983 40827 44129 -49295 -35743 55501 25351 -59071 -13945
173 -13945 59765 2389 -57639 8446 53136 -17537 -46589 24475 38894 -28621 -30613 30075
185 30075 22637 -28934 -15609 25623 9987 -20945 -6343 15437 4620 -10195 -4961 5725
197 5725 6968 -2742 -10283 1645 14399 -2410 -18547 5162 22278 -9388 -24909 14778 26031
210 26031 -20688 -25440 26464 22914 -31683 -18751 35711 13087 -38341 -6455 39341 -611
222 -611 -38611 7651 36446 -13941 -32903 19226 28474 -22973 -23424 25148 18217 -25705 -13266
235 -13266 24721 8774 -22664 -5217 19712 2554 -16516 -1037 13349 532 -10728 -991
247 -991 8874 2171 -8024 -3796 8211 5611 -9333 -7210 11258 8364 -13674 -8775 16304 8300
261 8300 -18852 -6879 21031 4541 -22607 -1446 23435 -2225 -23468 6130 22702 -9982
273 -9982 -21190 13497 19091 -16379 -16483 18507 13637 -19684 -10630 20023 7700 -19564 -4960
286 -4960 18405 2499 -16900 -562 15079 -1031 -13406 1980 11825 -2533 -10675 2616 9907
299 9907 -2337 -9564 1902 9675 -1334 -10045 905 10656 -659 -11327 779 11957 -1328
312 -1328 -12500 2279 12788 -3704 -12863 5422 12631 -7353 -12095 9356 11332 -11198 -10235
325 -10235 12841 8973 -14040 -7457 14815 5815 -15118 -4055 14930 2230 -14423 -504 13562
338 13562 -1200 -12618 2612 11524 -3853 -10543 4732 9623 -5305 -8863 5573 8278 -5535
351 -5535 -7788 5376 7484 -5043 -7224 4782 7042 -4613 -6872 4645 6708 -4946 -6527 5493
365 5493 6317 -6291 -6061 7275 5739 -8335 -5309 9408 4768 -10329 -4038 11067 3160 -11501
379 -11501 -2074 11640 840 -11473 511 11011 -1946 -10366 3300 9475 -4597 -8627 5612
392 5612 7666 -6410 -6797 6859 6016 -6986 -5291 6848 4725 -6470 -4214 6044 3863 -5547
406 -5547 -3557 5213 3325 -5060 -3139 5128 2956 -5481 -2799 6058 2574 -6808 -2301 7639 1926
421 1926 -8410 -1387 9086 706 -9491 176 9640 -1199 -9453 2336 8931 -3549 -8190 4700
435 4700 7179 -5809 -6135 6634 4981 -7268 -3923 7502 2974 -7438 -2182 7069 1620 -6408
449 -6408 -1209 5690 1049 -4904 -976 4295 1076 -3875 -1205 3780 1345 -3991 -1427 4512 1382
464 1382 -5309 -1252 6231 897 -7164 -355 7975 -393 -8531 1357 8755 -2449 -8570 3666 7962
479 7962 -4891 -7019 6034 5767 -7028 -4384 7696 2884 -8102 -1545 8052 304 -7696 617
493 617 6945 -1242 -5934 1567 4838 -1534 -3689 1301 2749 -785 -2027 230 1722 400 -1833
508 -1833 -909 2382 1284 -3289 -1409 4403 1227 -5634 -759 6782 -32 -7684 1097 8205 -2372
523 -2372 -8221 3788 7732 -5198 -6761 6508 5374 -7597 -3712 8309 1892 -8667 -187 8486
537 8486 -1381 -7920 2579 6911 -3410 -5620 3779 4162 -3712 -2676 3297 1387 -2517 -341 1603
552 1603 -217 -563 357 -368 73 1168 -933 -1672 2143 1808 -3564 -1564 4946 927 -6186 37 7066
569 7066 -1300 -7480 2779 7336 -4300 -6620 5787 5404 -7037 -3789 7963 1916 -8476 -14
583 -14 8444 -1828 -7966 3279 6943 -4417 -5597 5020 3999 -5103 -2309 4745 740 -3965 597
598 597 2932 -1484 -1673 1922 472 -1769 653 1139 -1493 -44 2007 -1332 -2114 2796 1778 -4209
614 -4209 -1079 5322 29 -6082 1276 6337 -2719 -6035 4181 5199 -5513 -3906 6582 2285
628 2285 -7286 -492 7543 -1330 -7336 2945 6609 -4273 -5487 5125 4019 -5514 -2405 5405
642 5405 763 -4841 730 3941 -1879 -2771 2634 1537 -2822 -275 2572 -753 -1800 1545 671 -1975
658 -1975 673 2004 -2062 -1647 3293 911 -4268 77 4797 -1261 -4883 2528 4477 -3761 -3634 4825
674 4825 2419 -5633 -970 6106 -594 -6176 2055 5835 -3359 -5104 4342 4026 -4961 -2743 5154
689 5154 1315 -4954 101 4421 -1313 -3571 2297 2583 -2850 -1473 3031 467 -2709 469 2061
704 2061 -1132 -1089 1525 -51 -1581 1209 1310 -2277 -787 3035 -38 -3514 965 3548 -2001 -3189
720 -3189 2987 2461 -3868 -1469 4520 290 -4898 918 4933 -2102 -4659 3083 4032 -3856 -3165 4314
736 4314 2085 -4477 -921 4312 -210 -3908 1240 3289 -2030 -2499 2534 1702 -2657 -855 2490 149
752 149 -1978 429 1247 -789 -399 909 -522 -828 1305 461 -1943 67 2257 -785 -2328 1543
768 1543 2065 -2318 -1532 3000 760 -3561 131 3874 -1072 -3921 1957 3682 -2734 -3221 3291 2511
784 2511 -3658 -1647 3801 705 -3701 236 3405 -1045 -2936 1710 2379 -2094 -1744 2247 1158 -2102
800 -2102 -587 1748 141 -1218 160 578 -331 41 295 -639 -127 1061 -241 -1307 681 1299 -1232
817 -1232 -1108 1776 727 -2285 -170 2706 -463 -2962 1136 3034 -1774 -2875 2315 2525 -2751 -1976
833 -1976 3024 1314 -3130 -555 3092 -184 -2898 877 2606 -1383 -2193 1752 1777 -1864 -1297 1824
849 1824 879 -1559 -501 1183 211 -744 -47 280 -32 110 -44 -425 222 572 -534 -578 885 423 -1281
868 -1281 -136 1644 -250 -1958 671 2164 -1127 -2223 1552 2110 -1919 -1852 2225 1432 -2415 -926
884 -926 2512 332 -2515 263 2419 -793 -2219 1223 1985 -1505 -1652 1662 1332 -1614 -978 1476
900 1476 655 -1223 -373 901 140 -587 -43 275 -13 -89 -94 -39 238 33 -513 43 791 -245 -1089 484
920 484 1336 -770 -1494 1080 1555 -1348 -1470 1607 1266 -1815 -938 1965 529 -2056 -42 2079 -408
937 -408 -2010 865 1916 -1202 -1721 1470 1509 -1565 -1205 1578 919 -1476 -593 1276 298 -1054 -84
954 -84 789 -123 -574 171 376 -182 -292 51 226 114 -283 -381 379 624 -535 -863 725 1021 -932 -1087
974 -1087 1138 1064 -1324 -879 1509 601 -1657 -238 1744 -168 -1772 595 1763 -978 -1653 1294
990 1294 1520 -1507 -1278 1612 1018 -1619 -700 1524 368 -1352 -65 1142 -211 -918 385 667 -510
1007 -510 -502 478 339 -387 -282 181 246 51 -304 -341 393 581 -519 -761 708 855 -881 -830 1091 697
1027 697 -1268 -437 1421 86 -1536 306 1597 -696 -1575 1079 1500 -1367 -1303 1596 1062 -1684 -730
1044 -730 1680 390 -1567 -32 1371 -318 -1144 567 845 -767 -624 835 383 -804 -207 632 68
1061 68 -412 -23 105 30 202 -112 -463 247 690 -420 -779 635 782 -837 -638 1075 373 -1260 -46
1080 -46 1410 -351 -1466 778 1461 -1136 -1334 1442 1144 -1636 -841 1730 503 -1697 -98 1560
1096 1560 -302 -1357 650 1047 -939 -760 1073 427 -1138 -172 1017 -69 -834 207 513 -314 -185
1113 -185 291 -196 -214 520 46 -756 175 866 -417 -832 694 686 -949 -416 1180 64 -1335 341 1425
1132 1425 -755 -1407 1143 1280 -1431 -1044 1648 716 -1714 -306 1691 -118 -1540 535 1293 -900
1148 -900 -989 1170 633 -1323 -298 1310 -31 -1197 271 908 -487 -562 563 141 -561 263 465 -594
1166 -594 -271 854 32 -954 285 960 -584 -761 911 473 -1147 -90 1330 -326 -1408 772 1389
1183 1389 -1136 -1216 1437 953 -1619 -585 1708 156 -1646 293 1475 -719 -1224 1075 880 -1347
1199 -1347 -536 1448 163 -1434 160 1232 -457 -943 623 544 -752 -129 742 -297 -638 650 436
1216 436 -885 -152 1012 -163 -960 520 797 -828 -471 1119 88 -1294 339 1358 -767 -1293
1232 -1293 1133 1113 -1423 -808 1581 417 -1629 29 1538 -485 -1361 890 1064 -1244 -746 1436
1248 1436 367 -1528 -31 1425 -328 -1250 569 895 -770 -507 842 91 -835 325 728 -653
1264 -653 -514 887 254 -961 85 908 -401 -707 730 438 -983 -54 1156 -359 -1206 732 1145
1281 1145 -1066 -947 1302 631 -1449 -260 1462 -180 -1378 595 1150 -989 -888 1269 547 -1458
1297 -1458 -210 1449 -151 -1370 424 1117 -679 -801 821 402 -904 -9 874 -355 -746 656
1313 656 551 -823 -271 896 4 -808 312 638 -581 -352 813 39 -962 309 1002 -636 -930
1330 -930 903 753 -1108 -486 1198 134 -1202 239 1092 -614 -908 950 667 -1188 -388 1301 70
1347 70 -1324 205 1176 -478 -961 656 639 -807 -301 863 -66 -822 392 728 -610 -527 766 311
1365 311 -783 -30 710 -216 -521 462 302 -627 -13 760 -260 -792 504 730 -715 -574 836 318
1383 318 -909 -36 867 -284 -799 563 620 -840 -440 997 194 -1101 25 1067 -253 -965 461
1400 461 742 -623 -486 732 188 -759 121 740 -356 -632 566 523 -640 -300 681 115 -585 122 466
1419 466 -302 -250 473 53 -559 175 590 -362 -528 512 403 -601 -220 635 -31 -587 265 505 -522
1438 -522 -390 709 235 -838 -65 887 -133 -864 279 732 -444 -572 560 339 -636 -97 669 -128
1456 -128 -650 336 596 -461 -478 567 349 -555 -155 500 18 -387 187 254 -305 -69 402 -70 -430 211
1476 211 394 -322 -311 384 148 -404 30 368 -230 -315 414 230 -573 -118 681 -7 -723 138 662 -271 -589
1497 -589 379 415 -488 -228 546 45 -589 157 592 -303 -526 426 459 -470 -323 500 207 -430 -23 365 -100
1518 -100 -239 233 136 -320 -1 356 -90 -360 153 269 -228 -174 234 5 -257 152 206 -323 -161 441 78
1539 78 -528 13 558 -127 -532 210 433 -339 -317 419 153 -497 17 523 -172 -531 294 498 -399 -409 457
1560 457 309 -460 -171 424 38 -343 113 261 -234 -158 322 50 -369 20 340 -130 -283 149 170 -203 -57
1581 -57 189 -106 -179 252 141 -372 -83 450 2 -496 76 442 -187 -369 279 242 -380 -111 454 -37 -485
1602 -485 179 493 -303 -439 409 387 -433 -257 448 145 -414 26 351 -160 -255 270 169 -357 -68 381 -28
1623 -28 -375 92 286 -165 -183 179 42 -222 94 178 -242 -157 341 86 -431 -29 424 -77 -413 171 313
1644 313 -274 -190 367 71 -417 108 472 -210 -449 334 415 -397 -316 458 207 -426 -69 414 -86 -332 220
1665 220 254 -332 -141 408 26 -428 59 378 -155 -311 200 169 -254 -36 234 -134 -242 246 172 -364 -120
1686 -120 401 6 -422 78 367 -194 -276 280 156 -358 -3 421 -123 -433 256 412 -359 -340 434 243 -440
1707 -440 -117 440 -30 -375 181 295 -311 -196 405 80 -466 8 445 -126 -402 181 292 -252 -183 270
1727 270 10 -292 123 241 -271 -206 354 112 -401 -24 393 -91 -341 198 227 -297 -98 367 -42 -393 188
1748 188 403 -298 -338 406 274 -444 -142 451 19 -401 126 352 -261 -252 382 153 -453 -39 466 -78 -473
1769 -473 155 372 -245 -285 275 122 -317 2 294 -156 -277 270 196 -357 -118 381 15 -363 88 306 -182
1790 -182 -183 286 77 -323 90 358 -206 -345 328 307 -385 -193 429 83 -411 56 377 -192 -289 326 198
1811 198 -401 -82 462 -42 -476 109 412 -215 -341 256 216 -307 -106 303 -51 -312 155 241 -274 -190 321
1832 321 95 -345 -13 309 -90 -243 179 134 -229 -19 287 -87 -298 209 292 -295 -225 350 142 -361 -28
1853 -28 360 -88 -298 206 231 -311 -142 388 35 -422 51 405 -154 -366 207 267 -277 -181 282 20 -299
1874 -299 76 261 -194 -223 263 157 -311 -74 301 1 -273 103 204 -145 -116 227 19 -239 100 259 -166
1895 -166 -228 254 191 -269 -90 304 12 -259 94 235 -196 -159 273 87 -331 -18 358 -79 -353 129 281
1916 281 -218 -225 230 104 -262 -15 245 -102 -237 165 186 -251 -140 268 62 -261 11 229 -75 -157 149
1937 149 94 -195 9 227 -63 -210 160 192 -205 -138 229 78 -224 3 212 -85 -166 157 111 -239 -59 273
1959 273 -23 -293 68 258 -135 -232 164 148 -208 -80 207 -30 -222 104 180 -170 -149 216 109 -234 -56
1980 -56 228 -14 -202 80 144 -121 -66 153 7 -184 60 178 -118 -156 165 114 -178 -51 178 -7 -158 74
2002 74 126 -147 -84 199 30 -235 20 229 -92 -232 98 175 -149 -130 152 33 -190 21 158 -106 -159 135
2024 135 132 -189 -101 196 47 -180 14 163 -46 -104 108 68 -130 -2 161 -39 -143 94 149 -119 -89 144
2046 144 49 -120 8 118 -77 -99 110 51 -170 -30 179 -25 -198 56 156 -101 -148 115 81 -147 -32 137
2068 137 -44 -145 92 112 -146 -112 160 84 -172 -41 165 -2 -133 48 96 -81 -40 118 0 -123 50 148
2090 148 -65 -124 102 88 -102 -59 101 3 -82 43 70 -91 -53 121 -4 -160 4 144 -52 -133 66 103 -93
2113 -93 -65 94 -2 -117 45 115 -90 -108 130 94 -136 -53 162 33 -127 14 117 -43 -65 87 50 -98 9
2136 9 133 -32 -105 68 118 -79 -71 97 51 -66 -11 65 -25 -59 54 24 -106 -20 110 -27 -108 27 82 -52 -69
2161 -69 60 26 -82 0 73 -59 -90 87 66 -116 -53 129 44 -103 1 116 6 -78 64 62 -75 -20 99 -2
2185 -2 -99 49 122 -53 -96 65 65 -80 -40 67 10 -67 23 58 -55 -27 73 1 -85 -1 76 -11 -81 38 47 -53 -16
2212 -16 62 -26 -55 46 58 -82 -47 104 53 -96 -3 108 5 -79 33 80 -37 -43 97 29 -80 29 111 -22 -88
2237 -88 57 95 -54 -74 66 34 -62 -6 32 -27 -40 36 9 -77 -14 68 -31 -77 11 48 -37 -40 39 6 -44 31 42 -60 -47
2266 -47 73 34 -81 -19 95 5 -77 30 78 -19 -40 69 36 -56 -1 86 -3 -78 47 84 -43 -59 40 42 -52 -34 39
2293 39 1 -47 10 24 -56 -21 44 -3 -65 0 38 -29 -42 19 21 -34 -4 34 -33 -38 46 21 -60 -14 73 5 -72 7 71 -8 -30
2324 -30 45 38 -35 8 68 -13 -52 34 69 -44 -57 43 52 -49 -26 48 4 -39 12 18 -36 -30 42 3 -55 -3 51 -14 -45 26 30
2355 30 -36 -1 26 -7 -26 28 24 -34 -10 49 22 -43 13 60 -12 -30 41 41 -20 2 55 10 -30 25 48 -23 -40 40 33 -35 -15 50
2387 50 4 -32 1 23 -31 -33 32 -11 -52 4 38 -17 -49 8 31 -22 -21 15 5 -28 4 12 -19 -13 32 25 -24 -8 47 13 -24 7 34
2420 34 -6 0 31 12 -26 24 41 -13 -19 30 39 -31 -31 34 20 -40 0 22 -16 -23 13 -11 -40 -17 29 -7 -39 4 39 -19 -34 11 13
2453 13 -24 8 24 -4 -20 30 10 -32 -10 48 23 -29 12 39 4 -13 26 27 -20 10 39 -9 -31 20 27 -29 -26 39 23 -32 -8 18
2485 18 -1 -26 14 27 -20 -22 26 -6 -40 -5 30 -11 -39 13 23 -20 -6 21 5 -9 3 16 -21 -10 33 8 -20 -2 30 -1 -16
2516 -16 13 21 -12 9 33 10 -9 20 41 -7 -11 26 12 -21 -16 34 9 -27 9 16 -12 -17 19 12 -40 7 28 -14 -34 18 18 -15 -20 17
2550 17 11 -18 -5 17 -3 -11 37 27 -14 -4 42 20 -4 25 27 -2 5 28 4 -17 9 27 -4 -11 20 23 -29 -3 26 9 -26 -9 21
2583 21 -7 -17 4 -11 -25 -9 21 -24 -33 14 19 -10 -22 3 1 -14 -4 11 3 -1 13 9 -11 9 33 20 -10 28 27 11 -7 18 17 -3
2617 -3 10 16 -12 -3 11 24 -12 -15 11 24 -25 -16 21 -8 -17 -3 -3 -19 -10 2 0 -35 4 14 -18 -25 1 3 -8 -9 10 -2 -7 7 18 -7 11
2654 11 29 21 -11 9 35 -2 -8 13 15 -6 -1 25 0 6 9 14 -8 -11 30 3 -16 -9 13 -8 -17 -3 6 -13 -2 5 -10 -15 8 12 -10 -19 20 10
2692 10 -13 -10 16 14 -16 12 10 3 14 28 1 -11 20 27 11 -7 9 25 -1 7 18 4 -2 20 11 -3 -3 18 11 -11 5 10 -4 -12 -6 4 -2
2729 -2 -7 -2 -13 -26 4 14 -17 -2 7 10 -16 -5 17 -5 -15 7 13 -2 -1 23 21 3 8 22 -1 -4 12 18 5 4 16 18 -1 23 4 -2 -6 -9
2767 -9 -2 -6 -11 2 -3 -20 -6 -4 -8 -25 -12 1 -19 -12 -1 -13 -11 -1 6 -3 -15 7 6 -14 0 -7 1 -5 13 3 -2 5 11 10 -4 14 17 10 -14 1 8
2808 8 -4 2 1 0 -5 13 9 6 2 17 2 -13 -10 9 -15 -3 -9 4 -9 -5 0 -14 -8 -2 11 -10 -10 -3 0 -3 -1 -5 0 1 2 5 -2 9 4 3 -4 8 13 10 -9
2853 -9 5 14 10 0 6 15 -9 5 8 4 -2 0 3 -8 -7 5 -2 -13 -22 -8 -20 -13 -14 -8 -12 -17 12 -7 -19 -4 3 -2 -10 10 2 2 -6 12 -2 0 13 7 8 9
2897 9 20 21 -6 9 20 -4 -1 14 16 -4 6 4 3 -10 5 8 -10 -11 2 -5 -14 -21 3 -9 -15 -3 -3 -13 -23 -2 -3 -6 -8 7 0 -9 8 12 0 -2
2937 -2 13 16 -5 -3 11 -6 1 19 10 8 8 22 17 0 -7 14 1 -2 10 16 -15 1 9 -8 -14 7 11 -20 -15 2 1 -10 -17 4 -13 -14 3 -5 -9 -6 11
2978 11 -6 -12 -3 20 5 -7 8 16 -5 -2 12 -1 0 21 22 11 2 21 11 -5 4 23 7 -8 5 21 -5 -9 11 1 -16 8 13 -20 -24 4
3014 4 -9 -25 -13 14 -17 -23 -1 -4 -21 -9 13 -5 -15 9 23 -6 -15 26 17 0 -2 18 8 -8 16 26 2 3 25 22 -10 -2 34 -1 -6
3049 -6 4 26 4 -5 22 0 -12 -5 13 -13 -17 16 7 -25 -16 7 -7 -29 -7 11 -28 -10 19 -1 -29 -4 23 -10 -16 2 15 -9 2 18
3083 18 5 -16 11 17 -8 -7 40 23 -11 5 36 18 -10 15 20 -1 -11 10 6 -18 7 12 -22 -11 13 12 -33 -23 11 -8 -29 -3 1 -12
3117 -12 -24 7 -6 -28 10 19 -14 -26 27 31 -22 -12 21 25 -12 -2 26 6 4 38 24 -4 14 39 23 -20 18 39 -7 -11 33 0 -10
3150 -10 -4 24 3 -20 19 14 -37 -19 25 0 -24 -4 15 -14 -19 7 9 -31 -7 25 -4 -28 13 21 -19 -9 21 19 -9 3 27 10 -7
3183 -7 24 27 -3 12 51 15 -25 18 33 -6 -14 20 10 -13 6 26 -6 -16 3 25 -18 -19 18 4 -37 -14 14 -6 -25 6 11 -22 -15
3216 -15 25 -7 -18 9 25 -11 -22 31 21 -21 -9 26 18 -7 9 22 -2 11 25 10 -14 10 36 -1 -20 20 28 -5 -8 14 9 -27
3248 -27 -7 18 -24 -20 21 8 -35 -13 19 -4 -37 1 19 -17 -21 28 2 -33 1 29 -7 -25 15 31 -8 -15 40 20 -12 8 39 10
3280 10 -7 28 23 -8 11 43 -2 -19 15 33 -11 -20 23 22 -8 6 18 -7 -29 9 18 -29 -21 26 10 -31 1 21 -7 -24 1 11 -21
3313 -21 -8 16 -5 -32 22 21 -19 -19 32 37 -10 1 36 18 -9 23 27 -18 0 47 21 -22 4 41 -3 -27 27 24 -11 -6 10 -3 -30
3346 -30 21 33 -25 -21 26 1 -38 -18 25 -9 -27 0 13 -24 -11 18 9 -22 9 31 -4 -30 25 38 -26 -7 22 18 -12 12 47 1
3378 1 -10 42 24 -28 9 43 -1 -29 14 44 -13 -17 19 17 -17 -6 20 -12 -31 11 13 -35 -30 21 0 -40 -6 17 -24 -29 13 6 -30 8
3412 8 43 -10 -38 20 35 -26 -20 35 30 -7 7 41 8 -14 26 36 -8 -3 45 14 -37 12 45 -9 -39 12 23 -21 -18 21 -1 -20 12
3445 12 19 -30 -22 20 -5 -45 -8 17 -11 -32 1 16 -17 -22 20 -2 -31 12 47 -15 -22 44 29 -19 -7 34 5 -13 12 36 -16 -12 27
3478 27 20 -32 13 37 -5 -39 12 36 -22 -23 22 13 -21 3 14 -21 -34 15 18 -42 -18 25 -5 -56 -10 9 -16 -22 20 8 -27 10 30
3511 30 -20 -32 26 40 -25 -9 45 16 -27 8 37 0 -9 40 18 -26 9 50 -5 -45 19 39 -27 -34 27 13 -26 -4 21 -13 -35
3542 -35 13 9 -46 -26 29 -4 -47 -7 29 -14 -26 16 14 -29 -7 24 -16 -26 24 38 -30 -14 33 15 -15 -7 38 9 -19 28 14 -27
3574 -27 10 49 5 -34 16 39 -21 -39 32 26 -31 -19 39 0 -25 10 15 -45 -34 30 -3 -46 -11 38 -4 -35 6 18 -28 -8 25
3605 25 -23 -20 21 33 -20 -12 39 28 -17 10 37 -6 -16 29 32 -10 2 33 2 -34 13 54 -15 -37 24 34 -18 -26 22 18 -38 8 31
3638 31 -20 -35 34 12 -43 -11 39 6 -52 -1 28 -13 -20 17 6 -11 19 24 -19 -17 28 28 -27 -17 55 13 -10 17 38 0 -1 43 8
3671 8 -26 15 48 -10 -36 19 28 -24 -25 34 18 -35 2 24 -7 -30 27 11 -43 -17 35 3 -54 -5 29 -7 -30 21 16 -19 5 29
3703 29 -4 -22 20 32 -22 -8 37 12 -20 10 35 2 -10 33 22 -18 8 50 2 -34 26 42 -16 -30 35 25 -35 -11 17 -16
3733 -16 -36 10 12 -33 -31 32 -2 -50 -9 33 -1 -40 17 18 -8 -7 25 4 -22 23 20 -13 -26 37 27 -24 -8 39 17 -10 19 33 -9
3766 -9 3 42 2 -23 21 38 -18 -29 21 38 -24 -19 39 6 -34 -1 10 -35 -26 18 3 -40 -12 40 -10 -42 8 29 6 -21 16 24
3798 24 -30 8 26 -3 -30 32 28 -20 -19 38 28 -20 9 39 10 -7 24 9 -23 6 33 -9 -40 26 41 -25 -16 33 24 -23 -7 18
3830 18 -16 -31 26 16 -51 -19 50 -2 -41 2 42 -4 -25 23 25 -23 3 34 1 -21 28 36 -20 -13 39 33 -21 0 31 11 -5 17
3862 17 14 -14 -1 29 2 -41 8 27 -18 -24 28 10 -25 -13 17 -7 -27 -6 3 -32 -19 35 -3 -51 -10 37 -5 -47 19 27 -10 -12 27
3895 27 15 -24 15 40 -1 -15 31 36 -18 -6 42 18 -15 18 25 0 -10 31 6 -22 11 40 -17 -28 18 31 -25 -23 20 8 -33 2
3927 2 18 -20 -11 19 8 -45 -7 27 -4 -47 6 33 -7 -15 16 25 -16 -5 29 -3 -22 29 37 -13 -9 48 31 -18 4 35 7 -5 17
3960 17 21 -18 7 30 -12 -27 16 34 -25 -30 13 12 -18 -13 15 -25 -28 1 11 -41 -23 34 14 -43 -5 34 -3 -18 7 22 -25 8 35
3993 35 4 -28 23 44 -13 -12 42 27 -24 -6 57 11 -7 15 28 -1 -15 28 6 -32 2 27 -11 -38 8 20 -36 -27 15 -10 -19 -4
4025 -4 1 -26 -16 25 -1 -34 -8 32 -4 -44 9 27 -12 -17 2 6 -22 18 33 -14 -21 36 33 -19 11 38 19 -17 6 32 1 -17 20
4058 20 7 -33 -1 29 -9 -39 7 23 -17 -31 5 3 -23 -17 -6 -21 -26 9 -14 -31 -19 18 -3 -39 0 24 -10 -25 11 13 -13 1
4090 1 22 2 -19 23 22 -20 -15 39 21 -24 7 35 8 -10 13 15 -14 -16 26 -9 -32 14 19 -16 -32 12 20 -27 -19 14 -7 -23 0 1 -35
4125 -35 -8 24 2 -38 -5 35 -5 -28 9 18 -26 -15 18 14 -18 21 21 -11 -16 42 30 -23 -2 45 18 -14 0 15 -10 -4 22 6 -29
4158 -29 -1 22 -10 -46 15 14 -20 -18 8 -4 -17 -15 -1 -22 -10 11 2 -36 -17 32 -6 -29 9 13 -2 -7 24 12 -16 8 21 -9 -16 33
4192 33 34 -27 -14 32 15 -14 2 27 -2 -9 12 4 -15 2 17 -4 -34 13 25 -17 -33 5 10 -18 -11 -10 -17 -21 5 11 -34 -5 24 6 -32
4227 -32 5 22 -5 -17 15 18 -10 5 33 0 -5 29 29 -34 -5 36 20 -31 1 40 3 -5 12 23 -6 -4 28 -7 -28 -2 23 -27 -29
4260 -29 9 9 -31 -27 18 -11 -21 -15 -12 -21 -13 17 -6 -28 15 28 -1 -25 18 19 -10 -1 27 4 -12 25 21 -8 -8 35 27 -25 -1 42 1 -18
4296 -18 7 22 -7 -6 12 13 -26 11 29 -23 -36 12 19 -25 -29 6 0 -28 -1 5 -23 -11 12 -6 -30 6 24 -5 -16 18 23 -11 -10 19
4330 19 5 -9 19 20 -19 -3 32 22 -26 5 42 16 -18 11 30 -12 -12 18 14 -35 2 20 -15 -19 17 17 -28 -25 18 9 -19 -14 -7 -13 -14 -2
4366 -2 -4 -36 -6 21 -14 -20 13 26 -4 -4 22 5 -7 9 20 -12 -5 37 12 -26 8 39 16 -20 4 35 -5 -18 17 14 -26 11 15 -19
4400 -19 -29 9 11 -26 -14 7 2 -26 -18 5 -7 -16 8 -3 -19 -4 8 0 -24 7 31 -6 -12 13 18 -9 -1 19 0 -7 29 13 -16 7 40
4435 40 17 -21 14 35 13 -9 7 24 -15 0 17 -10 -18 10 13 -21 -23 19 2 -26 -9 18 -7 -17 3 3 -6 -6 13 -4 -22 6 27
4468 27 -9 -13 8 30 -3 8 17 3 2 27 24 -7 3 34 17 -15 10 35 10 -8 12 16 -1 -13 12 4 -19 9 19 -16 -24 12 13 -26
4502 -26 -13 11 -1 -27 -9 16 -12 -10 12 0 -18 5 17 -13 -19 12 22 -2 -17 22 24 2 2 21 1 4 20 14 -1 10 41 4 -13
4535 -13 13 28 -5 -8 9 5 -19 2 13 -7 -23 18 5 -30 -12 21 -1 -26 -4 24 -3 -19 13 -1 -15 -3 28 4 -15 8 36
4566 36 -1 -6 28 15 -8 4 11 4 0 18 16 7 7 24 14 -16 6 18 -2 -21 11 0 -12 -7 4 -9 -12 19 -1 -25 -25 11 3 -34 -10 9
4602 9 -18 -26 0 20 -12 -6 12 4 -13 15 12 8 -6 32 27 -8 0 22 8 0 11 16 8 9 20 15 -2 11 25 1 -14 17 15 0 -15 12 1
4639 1 -12 3 9 -19 -20 8 5 -26 -16 15 3 -24 -9 8 -4 -12 -4 -1 -13 4 20 -5 -11 20 22 1 -6 29 18 4 15 22 21 -2 26 24 -7
4676 -7 5 23 -1 -15 6 22 0 -10 9 5 -11 6 7 -10 -11 -1 -2 -21 -20 11 -6 -30 6 2 -4 -11 0 8 -14 9 15 -1 -5 24 20 -4 -7
4713 -7 32 17 0 1 24 14 -2 20 18 2 6 14 4 -1 7 15 0 -9 -1 10 -11 -11 10 -4 -11 6 1 -7 -6 10 3 -17 -7 18 -9 -28 -11 5
4751 5 -7 -10 3 8 -9 14 16 -7 -11 21 24 -12 8 19 14 -1 0 20 -2 -8 30 5 -10 10 29 -5 -17 4 14 -12 -14 11 1 -22 -7
4786 -7 -2 -19 -22 1 5 -23 -6 10 -10 -25 -12 10 -7 -15 9 4 -23 9 13 -3 -13 14 26 5 2 21 9 -17 5 6 3 -5 17 4 -5 2 23
4823 23 5 -20 2 10 -14 -18 3 3 -21 -11 4 -18 -19 9 -8 -29 -22 7 -1 -28 -6 14 -8 -24 -12 0 -6 3 16 -9 -7 19 19 -13 -6 23
4859 23 22 -15 -11 8 1 7 19 11 0 14 33 -5 -20 5 35 9 -18 8 7 -10 -12 8 -16 -16 -10 -5 -23 -15 18 5 -16 -15 15 -15 -17 2 3
4896 3 -12 -10 1 0 -5 3 24 -4 -1 24 7 -8 2 26 11 -4 17 18 2 5 13 6 -7 5 17 -11 -20 8 9 -11 -16 5 -4 -8 -6 9 -18 -6
4934 -6 8 5 -23 -8 8 -5 -33 9 8 -9 0 8 -1 -6 15 15 -12 -2 31 9 -11 0 27 15 -11 15 21 7 7 23 14 -11 7 22 -4 -16
4970 -16 10 18 -18 -22 -2 -3 -18 -10 5 -11 -5 12 -2 -24 -12 7 -2 -17 0 9 -2 -9 -8 3 -3 10 -3 -6 -3 20 21 -6 7 11 12 -11 14 19
5008 19 5 0 19 27 3 3 15 4 -8 18 23 -6 -19 7 -1 -8 -6 7 -16 -10 8 -8 -17 -12 15 -11 -24 -11 5 -12 -25 12 6 -8 -3 8
5044 8 1 -1 10 13 -16 3 21 3 -10 4 10 6 8 7 2 -6 15 11 9 -13 5 5 -25 -29 1 3 -18 -15 -2 -10 -18 -10 -9 -10 -9 1 -6 -19 -9 8 -9 -21
5086 -21 -6 -2 1 -5 -6 0 -7 7 11 -5 -2 22 12 -3 1 23 3 -6 4 18 5 -8 14 7 -3 7 8 -12 -7 5 2 -19 -19 4 2 -15 -10 -4 -7 -19
5126 -19 1 -6 -26 -9 -1 -13 -30 -3 -4 -8 -7 6 9 -7 -9 -3 -2 -7 13 12 5 6 23 16 3 9 23 6 5 5 -1 -11 1 9 -11 -4 -14 -13 -16 -16 -8 -5 -7
5169 -7 -19 -2 -10 -18 -12 -4 -16 -2 -11 -13 -24 -10 -7 -11 -9 3 -1 2 -3 6 3 0 10 12 -3 -3 19 19 -14 0 26 6 -11 3 4 7 6 3 -7 -20 -2 -2
5211 -2 -18 -21 1 -5 -16 -25 -10 -9 -15 -8 -17 -19 -9 -8 -23 -23 -11 0 -18 -14 5 6 0 -15 2 7 -8 2 15 7 -10 14 10 -2 17 19 17 -4 9 18
5251 18 12 6 -2 4 2 8 7 -10 -15 -1 -1 -22 -14 -14 7 -10 -10 -9 8 -9 2 -5 -3 -5 -1 -13 -22 -6 12 -3 -3 9 16 -5 4 4 -2 12 5 17 -5 4 16
5294 16 15 -3 3 25 20 -8 5 0 2 6 4 -1 -6 4 7 -11 -9 8 -8 -22 -9 -7 -16 -13 -16 -13 -19 -11 3 -8 -23 -4 -3 -11 -15 -3 7 7 1 16 8 6 20
5337 20 11 1 7 21 22 -1 -3 14 7 -2 10 15 5 0 14 -2 -4 0 -8 -13 -21 -8 -2 -13 -15 -9 -13 -3 -5 -12 -15 -15 -11 -5 -23 -9 1 -14 -18 -5 4 2 1 3
5381 3 5 -4 14 24 6 4 23 15 -3 9 18 12 5 14 11 4 -7 -3 3 -4 1 7 -6 -1 2 9 -14 -7 -9 -9 -10 -19 -7 0 -6 -1 -14 -16 -1 1 -2 -12 -7 1 1 -8 6
5428 6 4 10 -4 8 15 3 4 11 -5 6 20 5 0 -12 8 -1 3 8 7 15 5 6 0 -2 -5 9 6 -5 -13 -5 -27 -17 -4 -9 -12 -10 -5 -11 -14 -4 -15 -8 -6 4
5472 4 -1 -3 -1 3 2 -2 14 18 4 2 27 5 5 11 14 3 10 14 12 14 10 18 18 2 -6 -3 1 -3 5 -1 -14 -6 -11 -10 -13 -18 -16 -5 -20 -14 -8 -5 2 -2 -10 -2 9 -4 -3 1
5522 1 11 0 8 -1 3 12 2 14 11 9 13 4 12 -1 16 13 3 9 18 15 0 6 4 -1 6 -3 3 -15 -17 -1 -8 -11 -4 -6 -4 -1 -3 -9 -10 -15 1 -10 -13 0 -11 -6 0
5569 0 6 -7 -4 6 9 11 14 5 9 8 11 19 6 3 10 4 6 12 6 8 3 9 2 0 1 -3 -1 -6 -7 -1 -8 -15 -19 -7 -13 -6 -4 -10 -10 -6 -10 -14 -13 -6 -10 -10 -11 0 3 -7 7 19 -3
5622 -3 9 0 1 -5 4 7 8 11 16 2 9 1 14 -2 16 13 2 -3 1 -5 4 -4 -10 -12 -9 -10 -10 -10 -10 -13 -12 1 -11 2 -11 -8 4 -8 1 3 -8 -7 -9 1 3 12 5
5669 5 9 -10 10 14 -1 3 3 8 6 8 6 0 4 11 -4 11 10 7 0 2 1 -5 1 1 -3 -10 -6 1 -1 -12 -6 -7 -16 -10 -17 -4 -6 -7 -11 -6 -11 3 2 5 -6 5 13 5 14 6 4
5720 4 4 5 12 8 3 18 6 14 16 11 7 7 4 4 4 -1 5 5 -10 -2 -6 -10 -4 1 -19 -4 5 -7 -4 -11 -9 5 -1 2 2 5 0 1 0 -4 1 3 3 -1 5 7 18 4 8 11 6 12
5772 12 12 5 -2 14 12 -5 9 5 0 -3 -2 4 2 -13 -17 -5 -17 -8 -7 -18 -14 -5 -4 -10 -6 -5 -2 -2 -7 -3 0 10 -1 -12 -5 2 1 5 -2 7 0 4 3 2 17 2 6 11
5820 11 7 11 8 3 14 2 5 17 5 5 8 2 7 -9 1 0 -8 -8 -13 -18 -1 -3 -12 -8 -9 -7 -15 -10 -2 -6 -9 -11 -6 -9 3 1 -4 6 1 6 13 7 9 14 11 7 12 20 -1 11
5870 11 7 11 -2 6 10 10 10 1 -4 6 -6 -2 -6 -11 -8 -9 0 -2 -2 -3 -8 -2 -14 -17 -10 -16 3 -10 -16 -20 -2 -7 -4 -13 13 -8 1 7 7 5 -2 7 7 4 9 7 5 5 9 5 4
5921 4 -5 5 2 8 1 7 -3 -2 -4 -4 -7 -2 3 -14 -14 -13 -8 -14 -8 -6 -13 -7 0 -13 -8 -6 -3 -1 -10 -6 -2 8 3 3 8 1 -6 5 11 3 -4 -2 10 5 1 4 -2 3 10 2 7 -2 7 4
5975 4 1 9 -5 -3 -14 -6 -14 -6 -18 -8 -9 -11 -12 -6 -15 -13 -6 -12 -6 -2 -7 -10 -9 2 -8 -10 3 6 6 7 17 4 3 -4 14 0 13 14 10 8 4 11 4 0 -2 -1 4 6 2
6024 2 3 -3 -1 -11 -7 -19 -12 1 -13 -20 -16 -10 -10 -8 -4 -6 -22 2 -2 -4 -10 -5 2 4 -6 -3 2 -5 15 17 4 10 9 6 3 4 6 8 10 12 6 -5 -2 9 2 4 -3 -2 -8 2
6074 2 -15 2 -13 -1 -13 -7 -2 -20 -10 -18 -10 1 -5 -16 2 -3 -11 -10 -9 -10 0 2 1 -6 -7 10 5 5 4 20 17 8 8 9 5 5 14 -6 7 6 10 -3 3 0 0
6119 0 -9 -7 -10 -7 -5 -13 -25 -10 -12 -12 -7 -18 -9 -10 -7 -8 -11 -1 -7 -10 -4 -4 -11 -8 1 -3 2 -8 2 9 3 13 14 5 2 20 5 3 12 6 7 3 0 10 5 1 1 -4 -6 4
6169 4 3 -8 0 -21 -9 -21 -7 -6 -14 -16 -6 -12 -23 -5 -4 -15 -17 -3 -2 -2 2 -7 -5 -4 -1 6 7 9 20 12 4 12 11 15 9 0 13 4 5 2 13 12 -4 4 5 1 -10
6216 -10 5 -3 -1 -2 -12 -11 -17 -5 -7 -14 -9 -11 -16 -7 -7 -6 -11 -16 1 -13 2 -3 2 -2 1 9 -9 11 19 7 7 3 -2 16 7 4 9 2 6 8 12 0 -2 1 6 -4 -5 -11
6264 -11 -6 -3 -13 -14 -9 -12 -4 -7 -13 -9 -2 -1 -15 -7 -7 -7 -14 -6 -6 -6 -5 3 -5 0 5 -1 9 4 9 8 14 15 8 18 10 14 19 12 12 18 -1 16 15 2 13 7 4 -1 -4 -3 7
6315 7 1 -10 -5 -6 -5 1 4 -4 -10 -16 -1 -2 -4 -13 0 -13 -3 2 -11 3 -5 8 5 6 8 4 2 8 20 8 -2 4 14 5 10 19 1 0 -9 10 2 8 6 -3 -7 5
6361 5 6 -5 -9 -5 -7 -6 -5 1 -4 -11 -10 -9 -6 -5 -8 -9 1 1 -3 2 -6 4 -4 12 10 10 1 0 21 15 15 7 14 8 6 4 19 9 3 -1 7 3 3 13 3 3 -3 -2 2 -9 -11
6412 -11 7 -7 -9 0 -11 -11 -8 -1 -10 -13 -10 -11 -13 -13 -9 -13 -10 -19 2 -6 1 -3 11 2 -1 13 15 -2 4 5 19 12 10 9 -3 -1 13 8 -2 3 1 7 -6 6 1 -6 2
6459 2 0 -13 -6 -7 -13 -19 -8 -12 -8 3 -6 4 -4 -11 1 -15 -10 -2 2 10 12 2 8 1 -3 8 8 8 2 6 7 -4 8 13 13 13 12 5 0 5 9 0 -10 5 -2 -10 -6 2 -10
6508 -10 -10 8 -6 2 -5 5 0 -9 4 -1 0 -3 2 -5 -2 -1 5 6 -7 4 1 14 5 11 6 6 9 -1 7 7 15 14 1 8 8 9 0 8 1 -3 9 13 0 -1 -1 2 -3 -12 -1
6557 -1 -4 -21 -13 3 -9 -21 -10 -13 -12 0 -2 3 -13 -12 0 2 -1 9 6 0 -4 2 11 -9 8 11 12 8 11 11 10 7 14 12 6 5 11 5 11 11 5 -9 -1 4 -4 -14 -3
6604 -3 -10 4 -17 -3 -8 -14 -2 -1 -9 -11 -1 -8 -3 0 2 7 3 -1 4 -4 0 -3 7 6 7 11 3 5 15 20 10 3 9 15 3 -3 6 6 6 6 7 -3 1 -5 -7 -4 -10 -3 8 -12
6654 -12 -9 -8 -13 -7 -5 0 -1 -11 -2 -7 -22 1 -8 -1 -2 2 8 3 4 5 5 0 12 8 6 3 16 7 7 19 12 6 9 8 6 6 16 1 6 7 -6 4 -10 4 -7 -6 -6
6701 -6 -12 2 -8 -12 -8 -3 1 -3 -10 -6 -12 3 -4 -8 4 4 -1 6 8 4 13 7 7 18 10 6 15 5 14 13 13 9 12 8 19 8 11 12 0 -3 8 15 -3 5 6 5 -6 -5 0
6750 0 -16 -8 -7 6 -11 -7 -7 -9 -2 7 -2 7 0 -4 2 0 1 16 1 6 17 9 1 12 7 13 15 13 11 9 11 11 0 3 2 13 8 3 8 0 1 12 1 1 -7 9 -2 3
6798 3 -3 -6 2 0 -3 1 -9 -7 -13 -2 1 3 2 0 4 -5 1 -9 3 -3 9 10 20 8 14 20 5 10 3 21 20 13 6 7 10 16 2 0 4 12 -3 -1 -10 -3 -8 4 -6 -10
6846 -10 -7 -10 -18 -9 -12 -10 1 -10 4 0 0 -5 4 1 -6 8 0 -1 5 3 11 13 10 26 14 20 17 10 11 17 19 12 6 22 19 6 -4 2 -1 -3 6 4 -3 0 -8 -6 -18 4 3
6895 3 -2 -19 -7 -4 5 -9 -4 1 -6 -1 -3 9 -4 -1 13 7 12 16 9 20 7 3 10 11 12 15 15 12 14 6 13 16 6 -3 6 4 3 6 6 2 2 -8 3 2 -2 -8 -2 -2 -4 -8
6945 -8 -14 2 -12 7 -1 1 0 -5 -6 2 0 2 7 7 16 13 13 12 8 16 11 11 18 13 13 13 12 16 16 12 22 12 8 3 0 2 6 3 0 12 8 -3 3 -4 -9 4 5 0 -10 -3 -14
6996 -14 4 -5 6 6 -2 1 -1 -4 0 6 19 9 1 14 17 18 13 15 21 19 11 21 20 11 8 12 5 5 13 6 7 12 5 -2 -1 -2 -2 0 -7 -12 -10 -11 -9 1 -9 2 -4 -1 -3 0 3
7047 3 0 5 0 3 4 1 6 4 9 3 14 9 10 26 9 9 16 17 19 12 10 10 7 7 14 7 3 9 -7 2 4 4 -10 -5 7 1 2 1 -3 -18 -12 -8 -6 -3 -9 -5 -2 6 -12 8 5 10
7099 10 8 5 -4 12 7 0 18 5 22 12 14 17 10 20 13 8 20 20 14 12 10 14 8 6 13 5 -4 6 5 -9 -2 -7 5 -8 -8 -12 -6 -9 -16 -14 -14 7 2 -6 -3 10 2
7146 2 11 8 10 -3 20 6 11 7 10 16 10 -3 8 9 5 20 11 8 21 11 15 7 5 7 12 0 -15 4 9 -3 1 -4 -6 -4 7 -6 -4 -1 -4 -8 -16 -12 -10 -7 -4 -1 -9
7193 -9 -5 1 5 1 1 10 6 3 5 19 4 13 7 15 0 2 7 13 13 9 20 10 2 -4 -2 -2 2 0 9 3 2 -15 -8 -7 -8 -5 -3 -10 -5 -11 -4 -7 -6 -6 -5 -1 -6 1 -8 0 -1 3 -3 0 8
7248 8 2 11 4 11 10 6 20 22 16 11 16 9 4 0 14 4 -1 3 4 8 13 -3 2 -3 -6 7 -2 -4 -10 -5 -9 -16 -7 -16 3 -12 -2 -7 -14 -2 0 1 8 3 1 -7 10 2 -1 1 15
7299 15 10 16 13 2 16 11 10 15 16 17 17 8 4 9 0 2 7 -3 0 -3 10 4 -13 -3 -4 -5 -9 -8 -11 -9 -15 -16 0 -2 -6 -2 -6 6 0 11 8 -1 7 4 6 15 6 9 9 12 7
7350 7 14 14 5 10 14 9 12 4 4 9 14 6 1 6 1 6 -8 -3 0 -9 -12 -13 -6 -10 -14 -6 -15 -11 -5 -28 -5 -11 -11 -3 -9 -3 -2 1 3 -1 14 1 0 2 -2 6 16 22 13 11 10 14 13 9 4
7405 4 8 15 -4 17 2 10 6 -2 5 0 10 -9 5 -2 -5 -7 -5 -8 -7 -6 -10 -10 7 -2 2 3 3 2 5 7 0 4 2 7 5 0 18 -1 3 12 10 15 12 15 12 19 20 10 13 2
7455 2 1 1 4 -4 -6 1 7 2 -11 5 -7 2 3 -3 -5 -5 -16 -16 -15 -12 -2 -2 -10 3 3 -6 -5 0 6 1 2 10 7 13 14 3 18 8 17 14 12 6 3 7 9 1 13 -3 6 1
7505 1 0 -1 -5 -2 -3 -7 -9 -5 -4 -3 -11 -15 -14 -8 -9 -6 -16 -6 7 -2 -7 -12 -2 -4 1 10 0 6 10 6 6 -11 1 6 3 4 10 8 0 9 8 9 13 12 11 -3 6 2 -3 0 -2 1 -6
7558 -6 -9 -2 -15 -13 -18 -9 -4 -6 -11 -12 -19 -5 -3 -13 -5 -5 -17 -14 -1 -6 7 2 2 7 -3 5 3 -8 1 -1 14 13 -1 0 7 11 1 9 6 8 8 4 3 11 13 0 -9 3
7606 3 -11 3 -6 -1 -9 -12 -1 -16 -14 3 -9 -7 -13 -12 2 -6 -6 -2 -10 7 -3 -6 2 0 -1 2 -7 1 6 18 6 6 8 18 5 7 9 14 6 4 1 4 -7 5 -1 1
7652 1 -8 4 -2 -9 1 5 -12 -16 -11 -15 -18 -17 -15 -8 -4 -11 -4 -8 -3 2 -5 -7 4 1 15 7 7 4 0 8 12 4 4 10 12 3 4 7 8 6 -7 8 1 2 -9 9 -6 -5 -2 -1 -12
7703 -12 5 5 2 -4 -19 -1 -15 -15 -12 -19 -12 -11 -9 -13 -9 -3 -3 -7 4 7 8 1 6 -2 -5 6 15 12 13 22 13 15 14 8 9 8 13 3 2 1 6 2 -3 -2 10 3 -13 -9 3 -4
7753 -4 -11 0 -11 -7 -6 -3 0 -12 -7 -13 -12 -16 -16 -14 -8 -3 5 5 11 3 -3 5 -1 6 2 15 5 1 12 9 16 14 18 11 17 5 10 5 12 9 -1 -2 2 -5 -8 0 -5 -4 -5 -9 0 -7 -6
7806 -6 -8 -16 -22 -13 -12 -12 -15 -3 4 -6 3 -5 3 7 6 5 11 5 -4 12 16 14 6 3 17 17 12 4 12 16 5 7 10 0 -3 5 0 -5 -7 -11 -1 -7 -5 -11 -7 -15 -11 -2 -18 -8 -12 -11
7858 -11 -3 -1 -7 -7 -2 -1 10 4 -1 9 -7 9 9 8 14 2 -6 0 -3 8 11 13 9 4 10 7 4 2 0 -2 2 -7 -13 6 10 -11 -12 1 -10 -8 -2 -1 -6 2 -18 1 -5 1
7906 1 -12 -17 -4 -13 10 -12 2 7 -3 7 -9 5 3 -3 -1 2 14 4 5 18 18 22 8 6 9 3 5 11 1 -1 -1 4 -2 -7 -1 3 -5 -3 -5 -5 -4 -5 1 -12 -6 -11
7952 -11 -7 -19 -13 0 -8 -1 -2 5 -14 3 1 -12 2 -4 5 5 5 14 4 15 15 7 3 11 11 8 15 2 18 8 5 -1 7 -2 0 -3 8 2 7 -9 -9 -8 -10 -6 -14 -10 -19
7999 -19 -9 -14 -10 -14 -2 -2 -10 -1 -4 3 12 -4 1 10 5 -6 2 9 9 6 2 16 19 8 8 9 15 8 12 17 0 -1 17 5 -5 8 5 7 -3 3 -1 -1 2 -4 0 -8 1 -6
8047 -6 -17 -2 -9 -14 -8 -12 -5 -8 2 -3 8 3 -5 10 10 17 1 11 13 6 13 7 3 -1 12 11 11 16 6 4 -2 7 -3 4 -6 3 0 3 -8 -13 -3 -8 -3 -11 -8 -14 -10 -16
8095 -16 -7 -8 -15 -8 0 -5 -6 1 -3 0 7 7 4 3 5 15 13 10 5 6 7 13 14 4 16 8 14 8 -8 1 13 -1 -9 1 -3 -2 -7 -1 -1 -5 -5 -10 -5 -11 -2 -7 -9 -16 -9 -5 -4 -10 -11
8148 -11 -9 -2 1 -2 -1 3 6 -8 1 3 2 15 9 4 5 4 15 12 9 13 12 4 8 10 8 5 3 0 9 -1 -2 -6 -8 1 0 0 4 -13 8 0 -11 -13 -3
8191c
$$ Imaginary data points
##PAGE= N=2
##DATA TABLE= (X++(I..I)), XYDATA
0 0 0 0 0 0 0 0 0 0 0 0 0 0 0 0 0 -8 8 -8 8 -8 10 -16 16 -17 24 -25 32 -37 41 -48 56 -64 73 -81 90 -105 114
37 114 -129 145 -162 179 -200 223 -247 272 -302 331 -368 403 -443 491 -540 596 -657 725 -803
56 -803 892 -993 1108 -1245 1410 -1608 1856 -2179 2614 -3238 4196 -5894 9755 -36337 44433
71 44433 100629 -76429 -74741 79571 62434 -90174 -38929 87320 23245 -85616 -4417
82 -4417 75202 -6430 -65654 16082 51566 -18033 -40130 17405 28067 -10903 -20549 2948 15175
95 15175 7653 -15200 -17172 18438 25975 -26123 -31161 36109 33102 -48276 -30251 60412 23402
108 23402 -71779 -12338 80527 -1582 -85910 17607 86976 -33951 -83394 49649 75356
119 75356 -63034 -63439 73207 48580 -79439 -32223 81254 15550 -78987 -264 72865 -12598
131 -12598 -63897 21991 53126 -27356 -41671 28692 30845 -26235 -21615 20886 14902 -13613 -11252
144 -11252 5568 10697 1800 -13340 -7733 18384 11082 -25300 -11510 33037 8798 -40526 -3012
157 -3012 47017 -5045 -51303 14978 53095 -25547 -51770 35995 47401 -45317 -40240 52664
169 52664 30694 -57671 -19750 59749 8093 -59065 3177 55661 -13244 -50059 21336 42885
181 42885 -26884 -34758 29720 26550 -29804 -18967 27507 12573 -23427 -7929 18209 5204
193 5204 -12791 -4577 7795 5757 -4047 -8503 1947 12279 -1766 -16502 3582 20540 -7087
206 -7087 -23731 12010 25698 -17691 -25927 23641 24418 -29174 -21018 33864 16067 -37230 -9880
219 -9880 39027 2924 -39210 4153 37686 -10954 -34850 16724 30763 -21314 -26010 24276
231 24276 20835 -25610 -15668 25405 10954 -23794 -6857 21264 3746 -18142 -1674 14871
243 14871 636 -11979 -687 9672 1477 -8342 -2957 7987 4702 -8639 -6435 10247 7879
256 7879 -12378 -8622 15023 8684 -17597 -7695 20007 5834 -21886 -3088 23100 -369 -23594
269 -23594 4122 23150 -8114 -22056 11782 20188 -15047 -17830 17535 15088 -19190 -12126 19970
282 19970 9155 -19865 -6275 19049 3680 -17685 -1463 16000 -296 -14231 1566 12568
294 12568 -2337 -11202 2619 10220 -2520 -9688 2146 9585 -1609 -9817 1114 10348 -737
307 -737 -10980 696 11677 -991 -12248 1764 12670 -2959 -12860 4525 12768 -6397 -12412
320 -12412 8341 11712 -10332 -10835 12035 9618 -13510 -8247 14476 6655 -15024 -4934 15089
333 15089 3157 -14709 -1340 14036 -361 -13103 1930 12065 -3279 -11035 4312 10070
345 10070 -5069 -9234 5472 8550 -5588 -8027 5476 7643 -5187 -7330 4926 7147 -4654
358 -4654 -6933 4612 6796 -4760 -6615 5177 6421 -5877 -6222 6746 5877 -7826 -5569 8855
372 8855 5031 -9901 -4423 10716 3606 -11329 -2634 11616 1476 -11593 -147 11276 -1229
385 -1229 -10694 2635 9937 -3969 -9057 5123 8127 -6059 -7227 6679 6386 -6956 -5637 6959
399 6959 5009 -6679 -4461 6263 4059 -5766 -3691 5375 3448 -5085 -3225 5065 3056 -5291 -2877
414 -2877 5735 2682 -6445 -2473 7187 2100 -8060 -1687 8752 1049 -9338 -288 9593 -669
428 -669 -9578 1743 9228 -2935 -8592 4142 7714 -5276 -6673 6256 5548 -6999 -4449 7421
442 7421 3425 -7518 -2552 7292 1867 -6775 -1396 6082 1114 -5290 -980 4599 1039 -4037 -1119
457 -1119 3791 1279 -3835 -1387 4212 1416 -4909 -1360 5737 1074 -6723 -666 7580 -14 -8322
472 -8322 831 8678 -1894 -8719 3050 8317 -4265 -7521 5491 6430 -6537 -5073 7421 3646
486 3646 -7936 -2197 8131 895 -7921 193 7357 -993 -6474 1453 5395 -1593 -4250 1454 3208
501 3208 -1049 -2338 531 1841 103 -1712 -662 2063 1129 -2794 -1378 3810 1324 -5034 -1056
516 -1056 6204 372 -7289 512 7983 -1722 -8276 3063 8039 -4500 -7297 5879 6123 -7078
530 -7078 -4552 8023 2836 -8533 -1020 8653 -614 -8260 2029 7459 -3061 -6302 3647 4897
544 4897 -3806 -3404 3532 2008 -2928 -808 2087 17 -1077 369 105 -181 809 -454 -1448 1519
560 1519 1779 -2860 -1753 4253 1264 -5615 -501 6652 -667 -7356 1998 7469 -3545 -7048 5067
575 5067 6067 -6430 -4615 7568 2880 -8248 -945 8551 -908 -8251 2612 7527 -3908 -6323
589 -6323 4779 4840 -5122 -3148 4980 1497 -4384 -22 3479 -1107 -2308 1779 1066 -1902 132 1523
605 1523 -1108 -637 1812 -605 -2115 2060 1995 -3535 -1503 4795 564 -5786 573 6254 -2011 -6265
621 -6265 3448 5664 -4869 -4608 6083 3128 -6984 -1380 7490 -417 -7478 2193 7047 -3628
635 -3628 -6078 4765 4794 -5374 -3221 5522 1564 -5181 10 4428 -1352 -3390 2324 2152 -2812
650 -2812 -893 2767 -271 -2223 1203 1284 -1810 -30 2032 -1385 -1875 2695 1303 -3848 -449 4571
666 4571 -675 -4919 1879 4726 -3167 -4112 4308 3049 -5264 -1702 5928 212 -6180 1356 6074
681 6074 -2737 -5502 3922 4626 -4699 -3403 5128 2036 -5102 -600 4726 -721 -4023 1856 3099
696 3099 -2630 -2023 2995 949 -2939 39 2450 -835 -1611 1363 538 -1592 639 1485 -1773 -1100
712 -1100 2677 390 -3318 477 3544 -1491 -3431 2505 2867 -3455 -1994 4227 911 -4739 329
727 329 4963 -1529 -4830 2631 4403 -3499 -3618 4145 2651 -4437 -1507 4434 343 -4149 756 3615
743 3615 -1665 -2906 2319 2088 -2646 -1268 2618 488 -2265 155 1638 -635 -837 881 -75 -903
759 -903 919 656 -1651 -221 2130 -414 -2352 1144 2230 -1935 -1834 2677 1172 -3298 -317 3758
775 3758 -590 -3911 1540 3854 -2352 -3470 3056 2894 -3492 -2077 3768 1184 -3773 -240 3569
790 3569 -658 -3190 1412 2658 -1932 -2067 2203 1441 -2208 -871 1949 352 -1514 28 898 -278
806 -278 -279 338 -361 -236 870 -48 -1216 441 1325 -955 -1239 1504 943 -2043 -445 2513 -133 -2838
824 -2838 820 3030 -1440 -2957 2090 2738 -2548 -2244 2918 1653 -3092 -936 3124 176 -3012 536
840 536 2754 -1155 -2424 1576 1975 -1839 -1543 1859 1082 -1703 -686 1388 351 -971 -117 492 -16
857 -16 -76 -10 -303 104 496 -383 -604 689 508 -1086 -294 1482 -41 -1807 471 2088 -880 -2193
875 -2193 1371 2214 -1721 -1977 2104 1676 -2331 -1188 2482 628 -2530 -35 2472 -544 -2338 1016
891 1016 2096 -1393 -1832 1606 1486 -1658 -1155 1573 802 -1357 -505 1064 245 -742 -72 426 2 -181
909 -181 -40 -2 153 37 -388 -1 646 -137 -936 352 1223 -617 -1404 944 1552 -1207 -1499 1500 1401
928 1401 -1698 -1099 1906 748 -2000 -285 2073 -185 -2058 636 1969 -1050 -1819 1342 1607 -1544
944 -1544 -1366 1586 1046 -1554 -758 1388 454 -1177 -178 918 -48 -685 162 479 -197 -334 123 242
962 242 15 -259 -245 330 508 -451 -754 636 963 -812 -1064 1048 1095 -1217 -959 1431 764 -1577 -426
981 -426 1711 47 -1765 373 1780 -796 -1733 1117 1588 -1420 -1416 1557 1125 -1637 -868 1572 531
998 531 -1453 -223 1243 -69 -1027 293 790 -454 -585 497 413 -437 -300 303 265 -63 -269 -193 344
1017 344 471 -442 -660 634 836 -772 -847 992 784 -1163 -567 1349 268 -1478 103 1575 -520
1034 -520 -1603 894 1526 -1244 -1423 1489 1171 -1673 -923 1671 559 -1642 -213 1466 -147 -1267
1050 -1267 447 986 -668 -727 805 489 -821 -285 741 121 -546 -39 273 26 43 -46 -337 189 605
1069 605 -314 -748 536 816 -733 -710 959 518 -1169 -214 1353 -157 -1453 561 1491 -965 -1429
1086 -1429 1301 1241 -1569 -1023 1689 672 -1741 -302 1649 -117 -1482 473 1210 -803 -908 1016
1102 1016 582 -1128 -298 1100 32 -936 160 683 -249 -334 314 -16 -247 377 149 -629 70 837 -273
1121 -273 -856 582 788 -826 -570 1069 248 -1281 135 1397 -573 -1445 945 1346 -1314 -1188 1542
1138 1542 878 -1708 -528 1705 85 -1631 319 1416 -725 -1157 1041 815 -1264 -480 1328 122
1154 122 -1269 163 1063 -391 -751 541 351 -568 67 534 -443 -376 760 177 -913 129 979 -435
1172 -435 -857 754 647 -1035 -297 1260 -115 -1397 540 1399 -979 -1321 1274 1085 -1565 -798 1672
1189 1672 357 -1689 65 1569 -526 -1356 922 1055 -1227 -717 1427 348 -1450 3 1358 -302
1205 -302 -1102 552 762 -700 -339 765 -85 -699 484 556 -775 -291 983 21 -997 365 905 -674
1223 -674 -638 981 293 -1210 113 1336 -565 -1352 934 1206 -1302 -995 1501 597 -1629 -211 1583
1240 1583 -263 -1460 696 1226 -1082 -909 1352 559 -1502 -190 1505 -160 -1345 462 1086 -679
1256 -679 -711 832 305 -863 138 804 -491 -640 783 389 -921 -83 956 -245 -821 585 589 -862
1274 -862 -243 1070 -150 -1202 528 1178 -921 -1077 1175 799 -1402 -474 1451 26 -1437 385
1290 385 1257 -806 -1031 1140 718 -1379 -375 1488 36 -1429 292 1259 -553 -961 783 613 -862
1307 -862 -189 905 -173 -813 528 659 -751 -417 873 140 -869 157 736 -467 -503 711 204
1324 204 -905 140 998 -485 -994 769 845 -1035 -636 1145 310 -1215 43 1145 -446 -1006 787
1341 787 780 -1072 -515 1265 222 -1329 85 1269 -336 -1091 596 821 -734 -464 852 128 -845
1358 -845 234 786 -505 -627 699 436 -789 -170 765 -80 -638 339 419 -561 -172 699 -132 -804 380
1377 380 761 -628 -677 777 446 -908 -203 893 -127 -846 424 709 -721 -545 927 321 -1075
1394 -1075 -79 1102 -147 -1026 380 868 -547 -617 686 353 -747 -31 759 -223 -696 470 584 -605
1412 -605 -413 670 211 -645 -2 518 -218 -374 382 132 -544 57 571 -281 -592 438 451 -581 -324
1431 -324 608 89 -637 140 550 -401 -461 608 311 -779 -140 874 -38 -884 219 815 -365 -657 505
1450 505 466 -589 -218 656 -13 -659 232 629 -398 -536 519 420 -562 -254 538 84 -452 86 307 -247
1470 -247 -176 362 -10 -441 127 411 -292 -380 337 223 -407 -77 398 -143 -355 332 278 -503 -176 636 69
1491 69 -691 88 711 -196 -620 333 516 -434 -333 525 139 -563 61 594 -241 -567 381 487 -464 -400 486
1512 486 266 -475 -127 401 -45 -318 175 189 -302 -92 339 -57 -381 122 312 -211 -248 226 74 -268 46
1533 46 221 -246 -198 393 117 -498 -30 560 -54 -547 189 515 -256 -365 391 243 -450 -68 518 -92 -538
1554 -538 236 516 -369 -473 422 359 -468 -244 440 98 -406 28 300 -192 -225 265 113 -362 -24 347 -74
1575 -74 -327 121 222 -183 -131 186 -40 -205 173 158 -310 -117 420 49 -460 50 480 -122 -404 241 321
1596 321 -320 -166 432 33 -471 128 497 -252 -491 363 417 -436 -338 431 185 -447 -80 362 -94 -320 207
1617 207 196 -327 -125 365 4 -397 46 325 -144 -254 184 109 -207 19 195 -179 -174 308 138 -388 -65
1638 -65 429 -21 -416 132 373 -216 -257 325 147 -392 18 459 -139 -464 281 434 -380 -393 429 254 -457
1659 -457 -134 414 -27 -387 148 269 -289 -199 364 84 -433 2 407 -125 -354 179 240 -224 -109 244 -46
1680 -46 -241 191 200 -321 -141 394 63 -415 39 405 -114 -318 236 225 -315 -89 404 -55 -424 193 429
1701 429 -309 -390 396 285 -447 -181 447 37 -420 93 325 -265 -277 347 131 -446 -44 447 -72 -446 145
1722 145 359 -232 -231 264 85 -286 67 279 -206 -232 321 156 -381 -60 404 -31 -370 154 298 -227 -159
1743 -159 331 32 -394 116 403 -253 -379 357 312 -420 -217 443 77 -446 54 377 -207 -325 308 194
1763 194 -433 -98 459 -30 -479 115 421 -217 -334 253 194 -303 -66 313 -79 -279 213 236 -313 -151 378
1784 378 76 -361 57 352 -137 -238 242 131 -300 13 356 -145 -355 267 314 -360 -250 412 133 -435
1804 -435 -26 393 -133 -349 247 244 -374 -166 423 20 -477 64 438 -180 -390 239 277 -304 -158 310 16
1825 16 -299 108 282 -224 -206 311 171 -337 -46 343 -32 -271 145 205 -200 -78 280 -32 -306 148 297
1846 297 -251 -264 333 181 -377 -103 349 -35 -338 140 254 -269 -194 341 80 -421 8 421 -99 -398 189
1867 189 323 -243 -227 266 104 -295 34 278 -136 -236 242 191 -292 -101 326 53 -280 57 256 -112 -143
1888 -143 198 61 -228 46 259 -134 -246 211 199 -293 -150 288 39 -291 41 247 -168 -213 223 106 -311
1909 -311 -51 341 -47 -358 108 315 -172 -261 218 166 -234 -56 258 -46 -243 143 224 -214 -150 278 112
1930 112 -264 -20 267 -44 -195 128 136 -162 -36 209 -34 -202 116 213 -181 -169 206 108 -241 -54 216 -60
1952 -60 -197 107 117 -214 -98 250 4 -293 44 287 -117 -260 157 203 -182 -107 216 39 -203 74 210
1973 210 -136 -161 201 146 -225 -75 242 27 -215 49 167 -88 -90 150 34 -173 28 181 -95 -170 128 145
1995 145 -171 -100 178 15 -185 32 135 -133 -112 163 46 -228 -8 227 -51 -233 81 193 -137 -155 165
2016 165 90 -174 -2 179 -51 -152 132 155 -160 -109 219 95 -188 -16 174 -27 -132 75 77 -113 -26 146
2038 146 -28 -172 72 144 -119 -134 133 66 -149 -36 114 -40 -116 80 69 -150 -48 172 2 -201 38 182
2060 182 -75 -160 108 116 -124 -44 145 -8 -131 78 147 -104 -99 169 104 -164 -51 172 26 -134 33 121 -68
2083 -68 -59 92 28 -130 14 132 -56 -145 87 93 -109 -80 93 17 -100 8 74 -64 -66 100 20 -138 4 144
2107 144 -33 -145 60 122 -77 -75 106 34 -104 27 119 -64 -103 123 103 -117 -42 167 63 -125 3 146 -32
2130 -32 -89 80 66 -104 -22 121 -26 -126 48 114 -79 -115 72 59 -90 -39 54 -17 -72 48 42 -84 -18 95 4
2155 4 -115 22 103 -36 -77 60 53 -67 -3 84 -13 -65 83 90 -85 -61 129 50 -118 -19 127 -3 -99 41 77 -67
2181 -67 -40 94 10 -112 29 112 -57 -116 49 83 -82 -80 51 22 -82 -4 33 -53 -49 57 0 -94 2 93 -14 -74
2207 -74 37 71 -38 -33 66 11 -48 47 79 -52 -44 98 51 -101 -27 108 13 -99 25 77 -41 -65 62 30 -82 -3
2233 -3 87 -35 -102 42 78 -67 -83 54 40 -78 -30 42 -19 -55 25 26 -56 -20 66 -5 -67 19 62 -17 -41 29 17 -34 16
2262 16 57 -29 -30 67 55 -69 -12 91 23 -81 3 68 -25 -58 38 38 -85 -17 62 -24 -88 31 69 -54 -86 40 46 -66
2290 -66 -46 42 2 -53 9 20 -45 -28 43 -4 -73 6 44 -21 -48 34 31 -30 3 42 -1 -17 50 37 -38 -15 79 19 -62 7 64
2321 64 -13 -51 22 29 -41 -22 51 -8 -71 11 46 -48 -63 27 34 -66 -42 39 10 -48 -3 33 -30 -28 29 -1 -47 5 50 -4 -51
2352 -51 18 30 -18 -24 25 3 -17 20 37 -23 -11 60 20 -46 13 70 3 -40 23 36 -16 -26 37 9 -53 5 42 -39 -57 21 26
2383 26 -57 -40 29 10 -53 -9 24 -21 -25 32 6 -43 -2 47 -2 -29 18 41 -12 -25 20 15 -29 7 37 -6 -17 36 23 -34 2
2414 2 49 8 -40 6 39 -12 -20 25 15 -34 3 32 -26 -45 14 31 -41 -39 15 12 -50 -11 24 -8 -36 18 16 -34 -12 33 3 -32 10
2447 10 47 -4 -28 15 41 -10 3 27 10 -8 17 18 -21 -7 41 21 -36 -3 33 -3 -23 0 20 -10 -12 18 -11 -24 9 31 -24
2478 -24 -33 14 18 -45 -25 22 -7 -31 2 0 -20 -21 15 17 -42 3 32 -11 -23 26 40 -14 -11 22 18 -11 19 35 -7 -4 33 23 -22 3
2512 3 33 -1 -27 8 21 -11 -21 14 -14 -47 9 12 -20 -33 15 19 -53 -27 12 4 -34 -2 13 -12 -18 12 2 -24 -1 29 -3 -30 1
2545 1 35 -7 -15 18 31 -6 13 29 8 2 18 11 -17 7 37 14 -28 -2 22 -12 -18 1 -1 -28 -3 0 -23 -37 1 7 -33 -35 0 -8 -35
2580 -35 -20 19 -11 -24 6 7 -16 -5 14 -12 -23 13 31 -12 -20 14 16 -11 -3 15 -2 -9 15 18 -4 0 17 2 -21 -2 30 -4 -17 -2
2614 -2 8 -8 -15 5 -21 -17 -1 -5 -30 -39 12 -6 -37 -24 1 -10 -18 -5 7 -6 -9 11 -5 -14 11 30 -6 -17 11 15 -8 5 14 9 -4 8
2650 8 9 2 -1 25 5 -15 -2 24 -8 -21 3 2 -10 -17 5 -4 -19 1 -3 -26 -37 -3 -10 -31 -27 9 -10 -24 -10 3 -12 -19 4 1 -9 2
2686 2 24 0 -5 21 20 0 6 15 11 -11 10 17 0 -7 10 4 -12 4 13 5 -24 -1 10 -11 -12 -3 11 -17 -8 4 -15 -14 -7 -10 -36 -30 -6 -10 -33 -2
2726 -2 -3 -15 -12 -3 -2 -15 -5 13 -11 2 21 20 -2 5 22 13 0 4 14 4 9 6 6 -9 -1 7 -3 -17 1 16 -15 -23 -7 6 -20 -9 -14 -17 -22
2765 -22 -4 -9 -28 -17 -1 -12 -13 -11 -5 -21 -19 -3 -8 -10 -19 4 -7 1 5 2 -12 -5 5 2 -1 -6 19 15 7 18 18 -1 1 9 5 -2 -2 8 -2 -11 -4 2 -19
2808 -19 -29 -4 -16 -18 -7 -14 -21 -24 -4 -4 -10 -20 -1 -8 -8 -5 -1 11 -1 -5 -10 -3 6 13 -11 5 -1 7 1 -2 12 -2 -5 4 18 12 17 8 9 5 -2 21 9 -6
2852 -6 -5 -2 -7 -7 -16 -15 -7 -6 -13 -15 -27 -9 -1 -17 -17 4 -11 -18 -24 -4 -14 6 2 9 5 0 6 3 6 10 12 1 -7 10 15 -2 -2 11 -8 7 5 1 2 -8 15
2897 15 12 -7 -15 10 -9 -5 -3 -2 -13 -13 1 3 -4 -12 -3 -20 -22 -5 -8 -20 -13 2 -9 -16 -5 -1 -7 -10 2 2 3 8 11 7 7 14 17 2 5 12 28 6 14 10 9
2942 9 -2 5 16 -11 1 4 -1 -20 -15 6 -4 -12 -4 -8 -10 -5 -10 -13 -12 -8 15 -24 -18 -2 2 -20 -11 15 -6 -10 -2 10 -3 -5 17 19 -8 14 22 1 -17
2983 -17 14 24 12 4 18 8 7 15 3 -6 -14 3 4 -19 -16 11 -1 -28 -6 13 -20 -15 7 -14 -24 7 7 -22 -20 -1 4 -19 -19 9 -2 -17
3019 -17 3 11 -24 -11 18 -4 -21 8 18 5 -11 18 26 3 -5 29 14 -5 3 24 -1 -4 7 8 -18 -10 15 -10 -32 -3 -1 -19 -10 10 -7
3054 -7 -34 -1 -10 -19 -24 2 6 -24 -15 15 4 -28 6 4 -7 -1 16 13 -19 -1 27 -3 -8 6 20 -8 -5 24 11 -12 13 23 -3 -1 27 12
3090 12 -21 -6 25 1 -31 1 23 -11 -26 5 -7 -29 -8 8 -25 -32 1 -6 -30 -36 18 -2 -20 1 24 -5 -14 22 14 -12 9 28 -6
3123 -6 -6 20 26 0 -8 35 15 -3 8 31 10 -10 21 8 -21 -4 13 0 -38 6 19 -13 -34 2 5 -32 -11 6 -19 -33 3 -4 -32
3156 -32 -19 17 -9 -44 -17 20 -9 -21 3 20 -12 -5 14 10 -14 19 34 -5 -13 29 26 -13 6 29 6 -14 13 7 -12 -5 19 -4 -33
3189 -33 2 21 -10 -27 5 24 -25 -14 20 0 -32 1 2 -19 -17 13 4 -40 -5 18 1 -24 8 14 -20 -2 22 -6 -20 11 25 9
3221 9 -14 29 32 -11 -7 28 7 -16 14 27 -3 -9 7 6 -25 -3 20 -17 -38 -3 7 -19 -34 5 4 -28 -5 16 -15 -18 12 11 -31 -24 32
3256 32 10 -30 -10 22 -6 -19 14 10 -23 -4 30 5 -12 36 40 1 -21 39 9 -19 5 24 -10 -17 21 11 -21 -11 24 -11 -35 -5
3288 -5 17 -27 -40 10 17 -25 -24 7 -18 -35 11 9 -25 -21 23 3 -36 -7 37 -1 -16 4 26 -1 1 30 7 -15 19 31 -5 -20 25
3321 25 21 0 -7 29 7 -14 10 28 -9 -17 36 23 -30 2 21 -15 -48 1 17 -31 -41 -1 4 -32 -13 2 -27 -30 22 -2 -38 -7 38
3354 38 11 -22 16 35 -2 -8 33 23 -13 17 37 -1 -11 31 36 -17 -12 31 20 -15 -1 28 3 -21 11 13 -29 -8 34 -4 -40 -3
3386 -3 13 -19 -51 -2 4 -30 -27 0 -28 -38 -4 10 -42 -33 19 7 -30 1 37 -2 -19 15 25 -5 10 38 14 -26 23 43 -17 -15 43
3419 43 35 -16 6 34 5 -29 11 17 -27 -20 31 4 -33 -6 41 -23 -44 -2 15 -34 -27 15 -8 -36 2 14 -37 -21 11 9 -35 -13 29
3452 29 9 -29 9 37 -14 -12 23 12 -13 14 42 -9 -15 39 29 -30 -11 31 15 -20 4 20 -20 -26 26 4 -54 -5 30 -26 -60 9
3484 9 24 -27 -38 10 5 -24 -13 25 -17 -28 25 21 -34 -15 33 13 -41 2 30 -2 -14 16 6 -35 9 36 -10 -29 35 47 -18 -5
3516 -5 50 20 -30 -3 35 -10 -16 24 7 -52 -20 22 -9 -54 -2 33 -34 -45 -1 23 -36 -32 22 -11 -33 7 18 -38 -19 37 8 -32
3548 -32 -10 42 2 -27 11 19 -8 1 31 6 -21 22 28 -25 -21 39 26 -22 -4 29 5 -27 18 20 -31 -12 38 -4 -43 6 30 -21 -49
3581 -49 16 10 -49 -28 22 -6 -35 3 16 -28 -20 33 16 -40 0 45 7 -25 19 47 -3 -3 27 17 -20 12 39 -13 -14 32 29 -32 -10
3614 -10 42 8 -35 21 22 -23 -14 27 -8 -36 -1 38 -19 -51 22 31 -39 -35 30 7 -42 -13 6 -12 -32 18 15 -42 -26 43 1 -38 3
3647 3 50 10 -10 31 20 -9 18 39 -2 -14 31 38 -14 -20 36 15 -31 2 22 -22 -13 21 3 -43 -9 38 -23 -43 14 35 -34 -43 23
3680 23 13 -41 -25 26 -14 -29 5 17 -35 -34 39 15 -44 4 45 6 -24 14 33 -12 6 42 8 -16 29 28 -16 -15 40 29 -27 -9
3712 -9 33 -5 -35 3 2 -38 -23 14 -18 -55 4 25 -30 -43 12 13 -40 -19 19 -7 -28 10 25 -29 -26 45 2 -44 -2 48 2 -42
3744 -42 14 38 -9 -12 30 11 -13 6 35 -13 -23 39 32 -23 -15 38 14 -35 -2 25 -21 -22 16 -8 -36 1 21 -27 -52 -1 15 -44
3776 -44 -37 15 7 -45 -12 23 -20 -19 39 19 -33 -8 47 10 -38 5 46 -10 -23 15 26 -18 5 32 -17 -27 13 26 -34 -13 43 12
3808 12 -31 0 25 -9 -22 9 -11 -32 -13 24 -15 -51 -1 16 -31 -43 15 5 -38 -16 16 -15 -29 18 18 -28 -14 38 21 -41 1
3839 1 51 -1 -28 16 37 -15 -1 37 4 -33 3 33 -14 -26 25 28 -36 -23 35 -1 -34 2 5 -27 -14 22 -14 -36 6 31 -23 -42
3871 -42 17 16 -28 -27 18 4 -38 5 15 -23 -19 24 17 -42 9 48 8 -35 14 44 -10 -15 35 17 -16 6 33 -11 -24 27 29 -28 -29 29
3905 29 6 -42 -20 13 -16 -29 7 1 -37 -15 14 -16 -39 5 32 -32 -32 8 15 -36 -10 8 -19 -19 17 11 -27 -2 44 3 -31 4 45
3938 45 -5 -21 27 31 -10 2 35 9 -24 17 30 -32 -17 33 20 -38 -20 16 -9 -33 5 7 -29 -24 19 -12 -47 2 24 -24 -44 14
3970 14 22 -30 -28 8 -10 -32 4 17 -25 -19 30 10 -35 7 48 4 -32 6 25 -18 -3 36 10 -4 19 33 -21 -29 25 35 -24 -16 19
4003 19 -1 -35 -9 -1 -27 -28 15 -1 -42 3 23 -37 -40 4 24 -33 -32 22 2 -28 -2 18 -19 -2 27 10 -19 -3 43 1 -29 14
4035 14 26 -12 -20 28 9 -13 4 29 -11 -27 25 22 -28 -6 34 18 -31 -13 21 -7 -34 3 -4 -37 -21 11 -20 -36 -8 22 -25 -33
4067 -33 5 13 -23 -20 4 -12 -12 15 8 -17 3 36 17 -16 9 45 9 -13 14 24 -17 -4 26 5 -22 24 29 -28 -25 22 17 -37 -6 30
4101 30 -4 -33 -11 -3 -26 -25 11 -16 -41 -18 16 -23 -45 3 10 -35 -30 8 9 -22 0 10 -23 -9 29 5 -29 2 35 2 -21 11 34
4134 34 2 -2 22 1 -16 5 20 -22 -17 22 1 -37 -30 22 -4 -47 -18 13 -18 -30 -6 -7 -31 -9 25 -16 -36 15 9 -33 -28 7 -1 -17
4168 -17 -3 15 -14 -10 6 4 -17 4 27 3 -20 11 33 -1 -9 9 7 -28 -2 17 -4 -17 25 16 -28 -28 8 2 -44 -16 12 -13 -37 -12
4202 -12 -8 -42 -16 9 -13 -34 2 18 -26 -33 21 5 -35 -19 12 5 -22 6 20 -13 -10 26 5 -30 -2 32 -12 -18 13 15 -16 1 26
4235 26 -1 -19 15 9 -21 -16 18 10 -40 -17 13 -22 -44 -15 -4 -32 -26 4 -15 -34 -14 -2 -33 -44 1 9 -19 -23 7 0 -18 5 21 -11
4269 -11 -8 28 12 -24 11 32 -5 -16 7 30 -10 -3 29 9 -9 8 18 -10 -18 30 14 -28 -10 31 -1 -40 -18 9 -16 -15 2 -14
4301 -14 -35 -5 15 -25 -44 10 13 -27 -27 12 3 -14 7 21 -4 2 28 13 -22 13 42 -3 -14 15 28 -2 -10 17 9 -10 9 16 -10 -28
4335 -28 20 6 -31 -20 25 6 -47 -15 22 -11 -23 2 -7 -32 -17 12 -26 -33 -4 2 -22 -39 5 8 -29 2 9 -5 -8 8 12 -13 3 26
4369 26 7 -17 18 32 -4 -21 13 23 -5 -2 8 -11 -15 26 3 -31 -23 22 -12 -48 -19 11 -15 -34 -7 -1 -26 -20 6 -28 -23 -2 18
4402 18 -33 -37 12 8 -26 -17 14 -7 -23 1 7 -17 -6 33 8 -18 16 36 -9 -5 22 16 -10 3 13 7 0 16 9 -17 -9 31 1 -45 -12
4437 -12 14 -17 -47 -11 5 -23 -25 -5 -18 -27 0 9 -24 -36 10 0 -30 -14 9 7 -19 1 16 -2 1 19 1 -4 0 39 -12 -10 20 19 -9
4472 -9 -11 16 21 -5 9 6 -14 -4 23 1 -32 -9 22 -15 -33 -19 5 -22 -27 -2 -17 -34 -18 1 -33 -30 12 7 -29 -14 22 3 -15 -2
4506 -2 25 12 -2 10 5 0 7 32 6 -22 9 30 -10 -9 17 14 -16 -6 16 -2 -9 19 10 -20 -11 8 -5 -28 -10 10 -21 -13 -11 -10 -26 -14
4542 -14 4 -26 -32 -5 8 -30 -19 18 -3 -19 -16 23 0 -6 18 22 -7 7 36 -1 -13 22 28 -7 -17 20 19 -13 -11 11 -2 -10 5 -7
4576 -7 -14 -10 11 -10 -24 -4 19 -14 -25 0 3 -21 -24 1 -4 -23 9 8 -23 -19 14 2 -28 -3 13 -1 -23 8 16 2 -1 26 9 -4 16
4611 16 26 4 -11 27 26 -11 -7 5 1 -12 3 1 -10 0 2 -7 -26 -15 7 -11 -20 -3 3 -19 -25 7 -13 -19 -5 0 -8 -12 13 5 -16 -13 13 1
4649 1 -23 -6 17 10 -4 6 15 -11 13 21 -3 -9 22 34 -2 -6 22 24 -1 -3 20 -7 -15 2 1 -20 -9 10 -9 -36 -6 8 -16 -22 -16 -3
4685 -3 -22 -14 -2 6 -10 13 9 -15 -8 21 16 -13 0 32 10 -3 5 13 -3 4 20 14 -7 9 26 -10 -25 26 22 -11 -11 17 8 -12 1 6 -20
4722 -20 -14 13 -9 -35 -25 8 -21 -29 -10 -5 -24 -22 -5 -10 -16 -2 5 -13 -17 13 7 -20 -1 20 13 -13 6 25 -1 -7 25 7 -9 17 15 -5
4758 -5 -19 10 16 -3 -8 13 4 -11 -2 -1 -8 -17 1 -12 -32 -10 9 -11 -32 1 10 -22 -31 -5 -2 -12 -19 -11 -25 -26 9 6 -22 -20 14 0 -25 0
4796 0 24 -1 -5 11 21 -5 14 34 0 -11 7 31 -7 -14 19 13 -27 -4 3 -10 -15 3 9 -27 -12 2 -8 -29 -9 9 -5 -24 -4 1
4830 1 -22 -10 12 -15 -19 8 -3 -27 -11 12 3 -24 -3 18 1 -3 10 13 5 8 23 10 -3 20 31 5 -2 16 26 -8 -11 7 -1 -16 -3
4865 -3 -1 -21 -9 1 -17 -30 -4 13 -25 -28 0 11 -12 -13 3 2 -6 8 7 -16 -16 13 7 -11 1 11 11 -10 5 9 -4 7 6 9 3 20 23 13
4903 13 5 22 15 -7 -8 25 7 -15 1 10 -10 -19 3 -4 -35 -10 13 -30 -39 -11 1 -31 -29 -5 1 -18 -1 15 -7 -13 12 18 -17 4 21 7
4939 7 -12 8 17 7 -1 11 18 1 14 13 2 4 14 16 -22 -7 8 9 -14 -2 16 0 -18 6 3 -29 -7 3 -15 -33 -2 2 -26 -27 -10 -4
4975 -4 -22 -16 3 -19 -13 6 4 -12 -1 16 7 -1 11 26 10 -3 16 29 -1 6 20 5 -11 18 4 -2 -1 17 0 -18 2 8 6 -8 -2 0 -15
5012 -15 -8 11 -16 -26 -5 8 -25 -30 -1 0 -18 -20 -2 -5 -26 -2 4 -18 -7 4 -1 -21 -1 18 6 -12 6 18 4 -2 21 1 7 20 11
5047 11 -12 -10 20 7 -18 3 14 0 -17 -8 6 -18 -2 -7 -13 -16 -9 10 -18 -25 1 9 -11 -5 7 0 -10 -7 -9 -6 -2 8 0 -13 0 13 -4 -18
5085 -18 14 13 -1 -9 11 9 9 8 11 6 4 24 17 -12 -9 13 8 -32 -13 -6 -10 -20 -5 -15 -26 -13 -13 -29 -30 1 3 -20 -15 3 0 -24 -7 9 -12
5124 -12 -15 -3 -4 -24 -8 17 -1 -16 1 14 -9 6 7 1 4 4 8 3 -3 2 17 -14 1 14 -5 -14 -2 8 0 -9 -3 -13 -17 -16 -6 -20 -25 -9 -6
5163 -6 -30 -22 -5 -7 -6 -14 -5 -3 -14 9 2 -12 2 7 7 -7 4 16 1 -12 15 11 3 2 17 2 -7 8 14 -8 -10 10 12 -10 -9 10 -2 -9 -1 -7 -9
5204 -9 -10 -11 -11 -26 -17 -22 -24 -28 -10 -8 -11 -27 1 4 -14 -19 -2 -1 -10 14 -9 -12 16 15 11 -7 10 17 5 6 7 8 -8 -1 -8 8 4 13 6 -23 -16 7 -1 -8 -4
5249 -4 2 -12 -18 -9 -6 -12 -8 1 -19 -16 -4 3 -27 -20 4 -4 -26 -6 -1 -5 -11 2 -10 -12 -3 5 -2 -6 8 19 17 6 17 9 -3 6 7 1 5 17 16 -8 -1 18
5293 18 -3 -16 -10 5 -4 -23 -23 -6 -24 -9 -12 -6 -20 -7 2 -17 -17 -3 8 -13 -6 -4 1 -5 3 -3 -8 -9 9 -7 -2 0 15 4 3 12 23 14 7 9 7 11
5335 11 8 20 6 -4 -4 -5 -20 -9 -2 3 -22 -12 -10 -16 -21 -21 -11 -22 -16 -12 -14 -9 -5 1 -19 -20 -1 6 -3 -5 -5 -3 -10 6 2 -7 -7 13 -2 0 -5 9 12 -3
5379 -3 9 12 3 5 13 4 7 15 10 4 -10 16 4 -6 -4 0 -15 -16 -18 -13 -21 -21 -15 -20 -21 -3 5 -13 -23 -3 -4 -3 -19 1 -2 -5 5 4 -2 15 11 5 -1 9 13 4
5425 4 -2 13 8 8 13 -2 5 -2 4 -1 0 -14 3 -9 -13 -13 -1 -10 -24 -17 -11 -12 -13 -20 -21 -26 -10 -21 -25 -16 -17 -11 -10 -6 -4 0 -5 -5 10 8 8 -3 -1 7 7 13 3 7 7
5474 7 9 7 0 8 13 2 -4 -1 -5 -2 0 -6 -18 -18 1 -9 -14 -9 0 -15 -21 -10 -21 -10 -8 -9 -19 -22 -13 -12 -16 -14 -6 -5 -6 -4 -10 -5 -13 -6 1 -6 7 1 9 13 6 13 5 14 0
5525 0 5 9 8 3 -2 0 -3 6 -23 -11 4 -6 -15 -7 -10 -12 -20 -14 -13 -14 -7 -14 -7 -23 -7 0 -4 -16 -6 -3 -4 -7 -7 0 -17 -4 -12 4 7 6 8 3 8 21 2 3 4 13
5573 13 12 3 -4 8 1 2 2 -7 0 5 -13 -9 -7 -10 -20 -20 -19 -17 -16 -22 -16 -16 -6 -11 -13 -11 -7 -6 0 3 -7 5 -1 -1 -15 -4 -9 1 4 3 2 1 10 1 9 -2 11 3 2
5622 2 2 2 1 3 -4 -7 2 -3 1 8 -10 -3 -8 -19 -12 -10 -8 -6 -19 -13 -22 -17 -7 -21 -16 -6 4 -6 2 -10 -7 -2 -6 2 4 -3 0 2 10 4 -3 12 3 6 4 6 4 -3 -6 -5 0
5673 0 -9 -4 -5 -5 2 3 -6 -11 3 -9 -6 -1 -6 -19 -8 -14 -15 -14 -15 -15 -12 -18 -14 -14 -23 0 -15 -7 -3 -5 16 0 0 3 -2 2 6 14 13 11 5 8 -1 -12 8 5 3 -1 0 -1 -4
5724 -4 -1 -11 -20 -4 -9 -9 -13 1 -11 -12 -18 -10 -12 -20 -11 -28 -14 -14 -19 -14 -11 -22 -11 -13 -8 -9 -2 -2 -5 -12 13 3 7 9 0 12 9 10 3 13 16 3 -1 -6 -2 -6 -11 -17
5772 -17 -7 -19 -6 -15 -12 -30 -18 -13 -14 -19 -14 -19 -7 -13 -15 -10 -11 -19 -11 -15 -12 -7 -9 -13 -8 -10 -6 -12 -10 -2 -12 -7 0 0 2 5 4 -2 7 2 8 -7 -3 -1 1 1 -10 -7 -2 -2 -9
5823 -9 -8 -11 -15 -17 -4 -13 -8 -14 -18 -15 -18 -18 -8 -10 -14 -10 -6 -8 -6 -8 -14 5 -3 -5 -5 -7 -5 5 -2 -3 16 3 4 -4 6 13 0 4 -1 -11 19 9 1 3 -5 -4 -24 -11
5871 -11 -6 -8 4 -7 -17 -8 -14 -16 -19 -5 -9 -19 -13 -19 -8 -3 5 -5 -2 -6 0 -2 0 -6 -7 10 12 2 12 12 7 4 8 6 8 4 9 1 -1 -1 6 -7 2 2 -13 2 2
5918 2 -11 -5 -5 -6 0 -10 -8 0 -13 -17 -10 -9 -14 -10 -22 -17 -16 -9 -4 -7 -8 0 -2 -3 3 1 -6 1 9 2 3 13 5 23 -7 8 11 0 -2 5 -1 -7 -5 -1 -10 -4 -4 -1 -9 -4 7
5969 7 -6 -7 -8 -21 -9 0 -12 -11 -15 -6 -16 -10 -15 -1 -9 -3 -20 -6 -9 -8 5 2 -10 -4 1 1 6 9 17 -1 9 15 17 13 4 15 11 -2 5 -1 -3 -8 -2 -7 -20 -8
6015 -8 -5 -13 -10 -10 -8 -17 -8 2 -23 -8 -8 -8 -18 -15 -3 -1 3 -9 11 10 -5 -2 1 9 -2 3 3 7 0 11 9 0 18 18 16 16 15 15 1 11 17 9 -4 4 3 5 -9
6062 -9 -6 -4 -9 -9 -17 -11 -6 -21 -21 -17 -16 -1 -10 -16 -22 -5 -12 -13 -5 -9 2 0 -7 -3 -1 -1 -4 1 -4 4 5 -3 10 4 6 9 -6 8 6 1 6 7 -2 -3 7 8 1 4 -6 -5 -16
6113 -16 -6 -15 -22 -13 -15 -23 -13 -12 -10 -13 -29 -11 -14 -17 -15 -5 -6 -6 0 -3 -7 -11 4 7 6 17 11 22 12 15 0 10 3 5 6 7 7 -1 1 -2 -1 -5 -5 -8 7 -6 -4
6160 -4 -9 -15 -14 -9 -4 -25 -17 -9 -16 -23 -15 -12 -13 -14 -1 -5 -17 -11 -14 -6 -8 -7 5 0 3 14 6 6 0 1 6 12 7 10 -2 4 2 16 -5 -5 5 6 -9 -8 -8 -15 -1 -10 -3 -2
6210 -2 -11 -12 -5 -19 -19 -11 -9 -17 -7 -11 -17 -8 -3 -14 -22 -9 -13 -13 -21 -4 -8 -10 5 1 0 0 -7 -2 8 6 14 -3 11 8 -3 7 0 5 -1 -16 -2 -8 -7 -14 -16 -4 -23
6257 -23 -25 -23 -18 -23 -21 -11 -24 -22 -19 -11 -17 -16 -19 -8 -1 1 -7 6 -10 -5 -2 -11 6 4 9 10 -8 0 3 7 13 12 4 14 12 4 4 12 11 4 6 -10 5 -5 -1 -2 -20 -14
6305 -14 -11 -27 -15 -20 -16 -19 -12 -23 -17 -19 -11 -7 -9 -1 -9 6 2 -6 3 9 7 -6 1 1 -2 6 14 -3 5 10 5 -2 3 0 4 -2 9 10 2 -5 -2 -1 -8 -9 -4 -1 -4 -3 -8 -11 -23 -2
6357 -2 -18 -21 -11 -8 -10 -20 -24 -11 -12 -6 -13 -1 -12 -6 0 5 -9 1 12 2 6 8 6 3 0 12 6 -2 5 8 0 0 11 -2 -8 -10 8 -12 -9 2 -2 -18 -14 -7
6401 -7 -16 -18 -13 -9 -10 -19 -8 -19 -28 -11 -5 -20 -12 -21 -7 -3 -5 -2 1 -9 0 5 -1 7 22 5 3 -1 10 3 2 3 1 2 13 2 -11 -15 -9 -1 -21 -7 -8 -12 -19 -15 -9
6448 -9 -13 -10 -12 -2 -13 -9 -18 -10 -13 -14 -6 -16 -20 -2 -14 -11 -9 -1 1 2 -1 2 2 -12 5 0 10 5 2 3 11 -4 15 8 7 10 2 4 -7 13 -9 -14 2 10 -3 2
6494 2 -11 -12 -18 -13 -8 -13 -20 -1 -10 -11 -3 -8 -8 -9 2 -3 -10 -5 3 -1 -8 3 2 -4 -4 -6 8 8 2 11 9 10 11 9 10 2 5 -1 0 0 8 -15 2 -3 -4 -6 -15 4 -6 -5 -8 -11
6546 -11 -12 -23 -16 -10 -15 -12 -18 -18 -24 -6 0 -13 -18 1 0 -17 -7 6 4 -4 3 10 -5 -4 0 0 -5 11 -3 8 2 6 4 1 2 6 -2 -3 -5 0 -3 -6 -6 -14 -17 -10 -6 -9 -18
6595 -18 -15 -18 -33 -18 -23 -16 -20 -21 -17 -19 -16 -7 -10 -12 -5 -6 1 -3 4 8 2 6 6 15 3 2 3 7 7 -1 3 -8 -7 -4 1 -16 8 -4 -13 -11 -6 -14 -13 -8 -12 -3 -15 -10 -5 -14 -16 -12
6647 -12 -13 -7 -19 -16 -10 -14 -11 -8 -20 -12 -7 -4 -3 2 0 -2 5 6 -1 -5 2 2 5 -9 2 15 4 6 6 2 -6 -4 -9 -14 -12 -4 -3 -11 -5 -10 -13 -11 -14 -4 -17 -20 -20 -18 -21 -9 -13
6698 -13 -12 -16 -8 -12 -16 -12 -14 -12 -3 -5 -7 -14 -9 6 -2 -3 -4 4 7 -4 11 8 5 7 9 4 13 17 7 -1 -3 -6 -12 -14 -15 -11 -16 -15 -19 -10 -12 -19 -22 -22 -12 -15 -10 -10 -16 -19 -13 -10 -8 1 -6
6753 -6 3 8 -2 -9 -5 -9 10 9 5 10 -2 1 1 1 7 9 9 5 9 7 4 -1 5 -2 -4 1 -4 2 1 -11 -15 -9 -9 -17 -25 -13 -9 -17 -9 -19 -19 -13 -12 -15 -11 6 -5 -8 -7 6 3 2
6805 2 6 3 8 5 -1 7 3 4 0 -7 -7 6 7 2 -6 -1 4 8 5 -4 1 -8 3 -3 -14 -10 -11 3 -12 -10 -2 -17 -12 -20 -13 -10 -11 -22 -17 -22 -8 -2 -13 -5 -2 4 -11 2 1 -3
6855 -3 1 8 1 6 15 5 8 -9 23 7 -4 -7 2 12 -5 -4 7 -8 -13 -9 -13 -23 -4 -7 -29 -13 -4 -4 -8 -16 -21 -11 -16 -13 -10 -10 -6 -10 -5 -14 -14 -9 7 -1 -2 -1
6901 -1 3 7 6 13 10 14 7 5 8 18 10 8 6 -2 12 -5 -3 5 -1 -9 -1 0 -12 -6 -3 -1 -11 -16 -12 -9 -13 -11 -21 -14 -19 -5 -5 -23 -12 -12 -10 -14 -1 -10 -14 -1 7 -5 0
6950 0 0 2 4 11 -5 5 -4 -4 5 11 -8 11 10 12 5 4 0 1 1 -7 -10 -12 -7 -28 5 -16 -6 -15 -8 -20 -16 -24 -13 -5 -15 -7 -8 -13 -2 -7 -13 -7 -2 -5 -2 0 -5 -6 6
6999 6 -8 -7 2 0 -3 7 0 6 4 3 6 14 2 4 7 -3 2 1 -5 -11 -11 -11 -19 -12 -3 -28 -13 -18 -11 -21 -24 -12 -22 -15 -17 -14 -11 -13 -8 2 -8 -1 -8 -6 -6 8 10 9 14
7048 14 1 7 3 9 12 7 3 6 3 -5 -1 2 2 -7 -2 -13 4 -3 -5 -6 -9 -10 -14 -14 -17 -5 -18 -25 -18 -20 -11 -18 -13 -13 -7 2 -13 -14 -3 -6 -10 -6 -7 0 3 6 2 0 6 5 6 3 2
7101 2 5 2 6 -1 1 2 4 6 -1 8 4 -12 -8 1 -17 -15 -7 -16 -15 -11 -2 -21 -13 -4 -15 -12 -9 -20 -15 -19 -17 -15 -14 -8 -4 -9 -8 -1 -9 2 0 0 3 12 15 -2 11 1 2 6 9 6
7153 6 10 -3 0 0 6 1 2 -9 -12 -3 -8 -15 -8 -10 -16 -15 -17 -14 -12 -10 -17 -14 -11 -27 -12 -13 -8 -1 -4 -5 -15 -11 -5 -10 1 -3 -2 7 5 6 11 7 -4 -4 9 11 6 -4 3 -2 12
7204 12 14 1 0 7 1 -6 -23 -23 -8 -12 -14 -9 -10 -19 -3 -16 -12 -28 -12 -16 -7 -13 -8 -9 -9 8 0 -10 -4 0 0 1 5 10 -2 7 5 3 5 5 -2 7 5 1 1 -1 10 11 0
7253 0 -1 2 -4 0 -9 -8 -11 -6 -8 -16 -2 -11 2 -16 -18 -3 -18 -17 -19 -15 -8 -11 -17 -9 -4 -5 1 -10 1 -1 4 7 11 4 1 11 -6 -1 -2 8 10 3 -2 -8 2 -2 1 -10 -4
7302 -4 -6 1 0 -12 -10 -8 -16 -16 -17 -11 -18 -5 -5 -26 -10 -28 -17 -16 -20 -12 -18 -12 -18 -19 -13 -16 -6 1 -6 -9 4 10 6 -4 16 15 12 24 8 7 -1 0 4 10 6 7 -11 2
7350 2 -2 -10 4 -18 -9 -18 -10 -17 -3 -14 -8 -26 -13 -12 -19 -9 -15 -8 -10 -3 -15 -2 -8 -5 -1 -9 5 5 -5 -6 -3 -1 11 9 4 3 10 13 10 8 6 11 4 13 8 -7 -9 -6
7398 -6 -1 -11 -8 -12 -5 -12 -16 -16 -12 -12 -13 -14 -6 -17 -15 -18 -5 -11 -7 -12 -16 -3 -9 1 -12 -10 2 -2 -7 -1 -5 -3 3 6 6 -1 1 9 11 17 9 16 21 6 -3 2 0 3 10 2 -6 -10 -9
7451 -9 -7 -14 -28 -24 -9 -13 -15 -14 -25 -19 -13 -15 -15 -1 -13 -11 -17 -2 -11 -5 5 -1 -1 -3 1 6 -4 -1 0 1 5 9 2 0 -6 4 7 5 1 3 -11 -3 -4 10 -3 -1 -4 -10 -11
7500 -11 -10 -16 -19 -12 -11 -22 -24 -14 -26 -15 -14 -4 -17 -24 -17 -13 -15 -7 -1 0 -3 0 -4 7 -3 -4 3 -5 4 3 3 3 6 1 11 5 1 6 4 -5 -4 -10 -9 2 -9 -11 -6 -4 0
7549 0 -4 -8 -10 -3 -14 1 -9 -12 -4 -20 -14 -20 -13 -13 -13 -17 -9 -19 -11 -7 -5 -4 3 2 1 4 2 12 2 9 6 4 13 15 9 15 6 8 -6 -5 -8 -1 -2 -6 -13 -14 -24 -13 -12 -7 -12
7600 -12 -18 -6 -7 -10 -15 -13 -13 -5 -18 -11 -2 -20 -17 -7 -8 -1 2 0 -1 -7 6 -9 1 4 3 13 11 10 0 -4 12 14 -2 -6 -1 -6 -9 -6 5 -12 -14 -14 -12 -13 -22 -18 -25
7647 -25 -7 -10 -19 -17 -12 -3 -16 -14 -9 -8 -7 -4 -8 4 2 -4 0 -4 -3 0 10 -5 1 10 7 -11 6 11 11 6 -1 7 4 12 4 0 -2 0 1 5 5 4 -2 -11 -19 -20 -21 -23 -10 -12 -4 -11
7699 -11 -8 -12 -10 -14 -11 -5 -2 -9 -10 1 -5 -8 -10 1 -2 3 6 4 3 13 1 4 8 8 11 5 3 15 17 1 -5 8 -8 12 -9 -13 2 8 -3 -13 -3 -5 -13 -10 -7 -8
7745 -8 -8 -16 -17 -18 -17 -13 -3 -15 -20 -13 -18 -13 1 -4 4 2 8 7 -2 -2 12 -1 0 2 7 -1 6 -10 8 9 7 5 4 -6 -5 0 -10 -5 5 -12 -1 -5 -15 -5 -1 -6 -15
7792 -15 -4 -19 -7 -11 -18 -8 -1 -12 -4 -10 -19 -17 2 -3 -14 -12 1 4 9 10 14 8 17 12 13 7 1 15 1 6 5 6 14 0 10 5 -5 0 7 0 -9 -4 -7 -14 -21 -11
7838 -11 -5 0 -11 -10 -19 -7 -3 -7 -8 -2 1 -8 -4 -23 -10 -3 -16 1 -7 15 1 -2 1 17 7 6 5 -2 20 10 10 17 2 11 -1 17 11 4 8 5 1 -6 -5 -3 -7
7883 -7 -11 -8 -14 -13 -22 -23 -17 -12 -10 -21 -13 -14 -12 -12 -6 -12 -5 -6 -7 -7 -11 -4 -2 0 -6 -1 5 4 -5 -2 10 6 1 8 0 13 5 5 1 0 1 15 0 -3 -3 7 -14 -26 -23 -18 -26 -14
7935 -14 -17 -17 -16 -16 -18 -21 -19 -12 -17 -11 -15 -13 -5 2 -6 -5 5 -9 8 -4 7 1 8 -6 0 6 8 7 12 0 -1 3 1 8 7 7 4 -9 3 3 -5 -2 -3 -7 -3 -7 -12 -25 -13
7984 -13 -25 -28 -24 -28 -10 -24 -20 -21 -15 -2 -14 -13 -14 -5 0 -5 -3 7 8 5 20 5 8 8 8 19 1 10 5 12 -9 3 -2 3 -1 13 -5 -15 -5 0 -12 -5 -3
8027 -3 -9 -11 -13 -3 -17 -14 -11 -20 -9 -4 -4 -14 -20 -12 -7 -10 -11 -7 2 -5 -4 0 -11 0 3 13 12 17 28 14 16 12 22 3 9 14 13 4 5 -2 14 3 -3 -6 -11 -5 -8 -11
8075 -11 -5 -13 -7 -12 -16 -5 -6 -6 -15 -26 -14 -2 1 0 -12 -11 -13 -8 -3 -10 8 11 7 -1 0 11 15 13 8 8 17 9 14 16 10 10 12 4 17 8 11 8 0 2 -1 -5 -10 -10 -5 -6 -15 -10
8127 -10 -9 -13 -23 -16 -22 -18 -11 -18 -7 -11 -8 -1 4 3 2 9 -4 -6 0 7 12 5 10 1 5 6 1 13 11 5 5 13 13 12 13 5 5 11 12 10 -6 -2 0 -11 -12 -11 -16 -28 -14 -5 -9 -13
8179 -13 -10 -8 -14 -11 -6 -6 -1 -6 -7 -7 -6 -1
8191a
##END NTUPLES=NMR FID
##END=
