##TITLE=1H_LY-NiMg-ac-240
 CDCl3, 8 sc, 
 5.2.2019
##JCAMPDX= 6.0         $$ Bruker NMR JCAMP-DX V2.0
##DATA TYPE= NMR FID
##DATA CLASS= NTUPLES
##ORIGIN= UXNMR, Bruker Analytische Messtechnik GmbH
##OWNER= root
$$ XWIN-NMR		Version 3.5
$$ Tue Feb  5 14:37:42 2019 Russian Standard Time (UT+4h)  she@DPX200
##.OBSERVE FREQUENCY= 200.1313
##.OBSERVE NUCLEUS= ^1H
##.DELAY= (6, 6)
##.ACQUISITION MODE= SIMULTANEOUS
##.ACQUISITION SCHEME= undefined
##.AVERAGES= 8
##.DIGITISER RES= 18
##SPECTROMETER/DATA SYSTEM= spect
##.PULSE SEQUENCE= zg30
##.SOLVENT NAME= CDCl3
##.SHIFT REFERENCE= (INTERNAL, CDCl3, 0, 15.7039)
##AUDIT TRAIL= $$ (NUMBER, WHEN, WHO, WHERE, WHAT)
$$ ##TITLE= Audit trail, XWIN-NMR		Version 3.5
$$ ##JCAMPDX= 5.01
$$ ##ORIGIN= Bruker BioSpin GmbH
$$ ##OWNER= she
$$ F:/spectra/data/she/nmr/H-F/1/audita.txt
$$ ##AUDIT TRAIL=  $$ (NUMBER, WHEN, WHO, WHERE, WHAT)
(   1,<2019-02-05 14:36:17.28 +0400>,<she>,<DPX200>,
      <created by zg, POWCHK disabled, PULCHK disabled
       configuration hash MD5:
       00 E9 B6 7A A2 85 ED C7 34 08 36 98 17 FE 4E 26
       data hash MD5: 16K
       9A B2 DA 33 5A D4 0E AD 42 35 F9 F2 FF EB A1 96>)
$$ ##END=
$$ 
$$ hash MD5
$$ 93 CF F0 64 39 5A D2 50 D6 54 54 B1 A2 9B 2F 75
##$RELAX= 
##$RELAX= 
##$RELAX= 
##$RELAX= 
##$RELAX= 
##$RELAX= 
$$ Bruker specific parameters
$$ --------------------------
##$DU= <F:/spectra>
##$EXPNO= 1
##$NAME= <H-F>
##$PROCNO= 1
##$TYPE= <nmr>
##$USER= <she>
##$AMP= (0..31)
100 100 100 100 100 100 100 100 100 100 100 100 100 100 100 100 100 100 
100 100 100 100 100 100 100 100 100 100 100 100 100 100 
##$AQSEQ= 0
##$AQ_mod= 1
##$AUNM= <au_zg>
##$AUTOPOS= <>
##$BF1= 200.13
##$BF2= 200.13
##$BF3= 200.13
##$BF4= 200.13
##$BF5= 200.13
##$BF6= 200.13
##$BF7= 200.13
##$BF8= 200.13
##$BYTORDA= 1
##$CFDGTYP= 0
##$CFRGTYP= 5
##$CHEMSTR= <none>
##$CNST= (0..31)
1 1 145 1 1 1 1 1 1 1 1 1 1 1 1 1 1 1 1 1 1 1 1 1 1 1 1 1 1 1 1 1 
##$CPDPRG= <>
##$CPDPRG1= <>
##$CPDPRG2= <>
##$CPDPRG3= <>
##$CPDPRG4= <mlev>
##$CPDPRG5= <mlev>
##$CPDPRG6= <mlev>
##$CPDPRG7= <mlev>
##$CPDPRG8= <mlev>
##$CPDPRGB= <>
##$CPDPRGT= <>
##$D= (0..31)
0 1.2 0 0 0 0 0 0 0 0 0 0.03 0 0 0 0 0 0 0 0 0 0 0 0 0 0 0 0 0 0 0 0 
##$DATE= 1549362976
##$DBL= (0..7)
120 120 120 120 120 120 120 120 
##$DBP= (0..7)
150 150 150 150 150 150 150 150 
##$DBP07= 0
##$DBPNAM0= <>
##$DBPNAM1= <>
##$DBPNAM2= <>
##$DBPNAM3= <>
##$DBPNAM4= <>
##$DBPNAM5= <>
##$DBPNAM6= <>
##$DBPNAM7= <>
##$DBPOAL= (0..7)
0.5 0.5 0.5 0.5 0.5 0.5 0.5 0.5 
##$DBPOFFS= (0..7)
0 0 0 0 0 0 0 0 
##$DE= 6
##$DECBNUC= <off>
##$DECIM= 32
##$DECNUC= <off>
##$DECSTAT= 4
##$DIGMOD= 1
##$DIGTYP= 9
##$DL= (0..7)
0 120 120 120 120 120 120 120 
##$DP= (0..7)
150 150 150 150 150 150 150 150 
##$DP07= 0
##$DPNAME0= <>
##$DPNAME1= <>
##$DPNAME2= <>
##$DPNAME3= <>
##$DPNAME4= <>
##$DPNAME5= <>
##$DPNAME6= <>
##$DPNAME7= <>
##$DPOAL= (0..7)
0.5 0.5 0.5 0.5 0.5 0.5 0.5 0.5 
##$DPOFFS= (0..7)
0 0 0 0 0 0 0 0 
##$DQDMODE= 0
##$DR= 18
##$DS= 0
##$DSLIST= <SSSSSSSSSSSSSSS>
##$DSPFIRM= 0
$$ [...]
##$SUBNAM2= <"">
##$SUBNAM3= <"">
##$SUBNAM4= <"">
##$SUBNAM5= <"">
##$SUBNAM6= <"">
##$SUBNAM7= <"">
##$SUBNAM8= <"">
##$SUBNAM9= <"">
##$SW= 20.0189088683792
##$SWIBOX= (0..15)
0 0 2 0 0 0 0 0 0 0 0 0 0 0 0 0 
##$SW_h= 4006.41025641026
##$TD= 16384
##$TD0= 1
##$TE= 0
##$TE2= 300
##$TE3= 300
##$TEG= 300
##$TL= (0..7)
0 120 120 120 120 120 120 120 
##$TP= (0..7)
150 150 150 150 150 150 150 150 
##$TP07= 0
##$TPNAME0= <>
##$TPNAME1= <>
##$TPNAME2= <>
##$TPNAME3= <>
##$TPNAME4= <>
##$TPNAME5= <>
##$TPNAME6= <>
##$TPNAME7= <>
##$TPOAL= (0..7)
0.5 0.5 0.5 0.5 0.5 0.5 0.5 0.5 
##$TPOFFS= (0..7)
0 0 0 0 0 0 0 0 
##$TUNHIN= 0
##$TUNHOUT= 0
##$TUNXOUT= 0
##$USERA1= <user>
##$USERA2= <user>
##$USERA3= <user>
##$USERA4= <user>
##$USERA5= <user>
##$V9= 5
##$VALIST= <valist>
##$VCLIST= <CCCCCCCCCCCCCCC>
##$VD= 0
##$VDLIST= <DDDDDDDDDDDDDDD>
##$VPLIST= <PPPPPPPPPPPPPPP>
##$VTLIST= <TTTTTTTTTTTTTTT>
##$WBST= 1024
##$WBSW= 4
##$XGAIN= (0..3)
0 0 0 0 
##$XL= 0
##$YL= 0
##$YMAX_a= 143326
##$YMIN_a= -134992
##$ZGOPTNS= <>
##$ZL1= 120
##$ZL2= 120
##$ZL3= 120
##$ZL4= 120
##$ABSF1= 10
##$ABSF2= 0
##$ABSG= 5
##$ABSL= 3
##$ALPHA= 0
##$AQORDER= 0
##$ASSFAC= 0
##$ASSFACI= 0
##$ASSFACX= 0
##$ASSWID= 0
##$AUNMP= <proc_1d>
##$AZFE= 0.1
##$AZFW= 0.1
##$BCFW= 1
##$BC_mod= 2
##$BYTORDP= 1
##$COROFFS= 0
##$CY= 11.3945322036743
##$DATMOD= 1
##$DC= 2
##$DFILT= <>
##$DTYPP= 0
##$F1P= 18.9103706918063
##$F2P= -1.10871071338519
##$FCOR= 0.5
##$FTSIZE= 0
##$FT_mod= 4
##$GAMMA= 1
##$GB= 0.15
##$INTBC= 1
##$INTSCL= 1
##$ISEN= 128
##$LB= 0.24
##$LEV0= 0
##$LPBIN= 0
##$MAXI= 10000
##$MC2= 0
##$MEAN= 0
##$ME_mod= 0
##$MI= 1.114404
##$NCOEF= 0
##$NC_proc= 0
##$NLEV= 6
##$NOISF1= 3.799351
##$NOISF2= 2.8
##$NSP= 1
##$NTH_PI= 0
##$NZP= 0
##$OFFSET= 15.70392
##$PC= 1
##$PHC0= -9114.095
##$PHC1= 6.000039
##$PH_mod= 1
##$PKNL= yes
##$PPARMOD= 0
##$PSCAL= 0
##$PSIGN= 0
##$REVERSE= no
##$SF= 200.130013532006
##$SI= 16384
##$SIGF1= 3
##$SIGF2= 2
##$SINO= 400
##$SIOLD= 16384
##$SREGLST= <1H.CDCl3>
##$SSB= 0
##$STSI= 0
##$STSR= 0
##$SW_p= 3612.71676300578
##$SYMM= 0
##$S_DEV= 0
##$TDeff= 0
##$TDoff= 0
##$TI= <>
##$TILT= no
##$TM1= 0
##$TM2= 0
##$TOPLEV= 0
##$USERP1= <user>
##$USERP2= <user>
##$USERP3= <user>
##$USERP4= <user>
##$USERP5= <user>
##$WDW= 1
##$XDIM= 8192
##$YMAX_p= 0
##$YMIN_p= 0
$$ End of Bruker specific parameters
$$ ---------------------------------
##NTUPLES= NMR FID
##VAR_NAME=  TIME,          FID/REAL,        FID/IMAG
##SYMBOL=    X,             R,               I
##VAR_TYPE=  INDEPENDENT,   DEPENDENT,       DEPENDENT
##VAR_FORM=  AFFN,          ASDF,            ASDF
##VAR_DIM=   8192,          8192,            8192
##UNITS=     SECONDS,       ARBITRARY UNITS, ARBITRARY UNITS
##FACTOR=    0.0002496,     1,               1
##FIRST=     0,             0,               0
##LAST=      2.0444736,     0,               0
##MIN=       0,             -134992,         0
##MAX=       2.0444736,     143326,          0
$$ Real data points
##PAGE= N=1
##DATA TABLE= (X++(R..R)), XYDATA
0@%%%%%%%%%%%%%%%%%%%nJ3j6J6j6J6j8K6l2L2l7M5m8N4o2O9p7Q8j01J09j20J36
$$ 0 0 0 0 0 0 0 0 0 0 0 0 0 0 0 0 0 0 0 0 -5 8 -8 8 -8 8 -10 16 -16 16 -21 24 -24 30 -32 37 -40 48 -53 56 -64 72
41G2j49J62j81K04k25K46k71K99l31L65m01M43m90N41o00O67p44Q35r43J075j239
$$ 72 -77 85 -96 108 -117 129 -142 157 -174 191 -210 233 -257 284 -316 351 -393 442 -501 574 -665
62f65J449j731K122k704L670n539J0370m4653r7311J50924J18767j27487j41238
$$ -665 784 -947 1175 -1529 2141 -3398 6972 -37681 -134992 15932 134699 7212 -134026
75a34026J07746J53662q0860j66473N6835J71827k9213j76199M012J74623K2967
$$ -134026 -26280 127382 46522 -119951 -63116 108711 79498 -96701 -92689 81934 104901
86A04901j71297m7730J62734P2843j51667r5268J35863J16329j17479j33564R5526
$$ 104901 -66396 -114126 48608 121451 -30216 -125484 10379 126708 9229 -124335 -28809
97b8809J47821p2002j57481M6809J63439k1588j65075l602J63295K7765j58029
$$ -28809 119012 47010 -110471 -63662 99777 78189 -86886 -90488 72807 100572 -57457
108e7457n1080J49858P2987j38698r3550J24699J12237j07784j28654Q8151J42132
$$ -57457 -108537 41321 114308 -24390 -117940 6759 118996 11212 -117442 -29291 112841
119A12841o6159j52046M2447J58068j7839j59903o722J57697L0537j51852n2928
$$ 112841 46682 -105364 -62917 95151 77312 -82591 -89313 68384 98921 -52931 -105859
130a05859J42749P3568j30887r2228J16558J08749j00085j23000Q1563J34684
$$ -105859 36890 110458 -20429 -112657 3901 112650 12565 -110435 -28872 105812
140A05812o1243j43471L9409J48968j6523j50772o706J48719K9562j42847n1149
$$ 105812 44569 -98902 -59493 89475 72952 -77820 -84526 64193 93755 -49092 -100241
151a00241J33500P0862j21245q8235J06657J03093r0338j15466P2653J25331n3863
$$ -100241 33259 104121 -17124 -105359 1298 104391 14053 -101413 -28760 96571 42708
162D2708j32752L4088J37497j3463j39355p689J38032K8926j33309m9502J25182
$$ 42708 -90044 -55956 81541 68078 -71277 -78966 59066 87992 -45317 -94819 30363
173C0363O8815j13920q6080R9943J00877q3837j12893O6216J22025m7595j28371
$$ 30363 99178 -14742 -100822 -879 99998 16161 -96732 -30516 91509 43914 -84457
184h4457K8347J31948q771j32874j0956J31060L0567j26383m9708J18721O7897
$$ -84457 -56110 75838 67067 -65807 -76763 54297 84864 -41519 -91227 27494 95391
195I5391j08026q4474R4523R8815p8599j10278O0857J18611m2042j23717K2839
$$ 95391 -12635 -97109 -2586 96229 17630 -92648 -31791 86820 44778 -78939 -56100
206e6100J25715l813j24927j4690J21541L2447j15830m9358J07864O5181r7683
$$ -56100 69615 65802 -59125 -73815 47726 80173 -35657 -85015 22849 88030 -9653
217i653p9617Q5305R2355p0828j02910N4648J10854l7133j15856J8936J17842
$$ -9653 -89270 -3965 88390 17562 -85348 -30700 80154 43021 -72835 -53899 63943
228F3943o82j16869j7042J13185L3779j07204m9337R9182O3578q9456p6444P8065
$$ 63943 63261 -53608 -70650 42535 76314 -30890 -80227 18955 82533 -6923 -83367 -5302
240e302Q7871o5104r7612N0568J05380l4593j10695J7578J13270l5j12861j7391
$$ -5302 82569 17465 -80147 -29579 75801 41208 -69487 -51909 61361 61326 -51535 -68926
252f8926J09486L4105j03433m9505R5012O3230q4710p5198P2951Q5225n9990r3408
$$ -68926 40560 74665 -28768 -78273 16739 79969 -4741 -79939 -6988 78237 18247 -75161
264g5161M6004R9673l1138j03851J5525J05858N43j05363j6665J02259L2410r6517
$$ -75161 -29157 70516 39378 -64473 -48948 56910 57453 -47910 -64575 37684 70094 -26423
276b6423m7112Q8337O0282p8084p1567O6263Q0655n3336q7670L9792R2601k5849
$$ -26423 -73535 14802 75084 -3000 -74567 -8304 72351 19015 -68655 -28863 63738 37889
288C7889r5700J1657R6971K710r6375j7112R3768L1346q8987m4991Q2028N7639
$$ 37889 -57811 -46154 50817 53527 -42848 -59960 33808 65154 -23833 -68824 13204 70843
300G0843p2941o8778O1997P8008m9615q5121L6322Q9935k2549r2603Q671R3239
$$ 70843 -2098 -70876 -8879 69129 19514 -65607 -29285 60650 38101 -54502 -45831 47408
312D7408M969r2015j8310Q9040L1214q4302m3562P7833N5134o9484o5595N9377
$$ 47408 52377 -39638 -57948 31092 62306 -21996 -65558 12275 67409 -2075 -67670 -8293
324h293P4527m7616q1513L4665Q6221k0993q8596P198Q8587O258q6518j9038Q2633
$$ -8293 66234 18618 -62895 -28230 57991 36998 -51598 -44400 44187 50445 -36073 -55111 27522
337B7522L0916p7230m1876P0489N1850o2459o0767N3187O8541m2734p4815L1185
$$ 27522 58438 -18792 -60668 9821 61671 -788 -61555 -8368 60173 17439 -57376 -26191
349b6191P9381j8785q1965N956Q2406O882q0733j9271P7077L0777p1748m1197
$$ -26191 53190 34405 -47560 -41604 40802 47684 -33049 -52320 24757 55534 -16214 -57411
361e7411O5013N0437n7212n8456M8452O5352l8913p0974K8513P5336j7354p8108
$$ -57411 7602 58039 827 -57629 -9177 56175 17262 -53712 -25199 50137 32783 -45325
373d5325N589P9081O566p8052j8626P4927L0163o9843m0708O3017M9923n4866
$$ -45325 -39736 39345 45911 -32141 -50767 24160 54323 -15520 -56228 6789 56712 1846
385A846n7670M5710O3844l5878o8513K5569P1729j4934p3512M080P3822O940p2534
$$ 1846 -55824 -10114 53730 17852 -50661 -25092 46637 31703 -41809 -37729 36093 43033 -29501
398b9501j7888O9570K8512o4855l8439N8458M7256n0570n4674M1553O0415l1837
$$ -29501 -47389 22181 50693 -14162 -52601 5857 53113 2543 -52131 -10578 49837 18000
410A8000o4472K1741O6954j1623o7968J586O7712Q263o6192j7934O3508K7342
$$ 18000 -46472 -24731 42223 30600 -37368 -35782 31930 40193 -25999 -43933 19575 46917
422D6917n9465l6325N4042M4658m7227n1992L9114N8027l0009o2468K0183O5187
$$ 46917 -12548 -48873 5169 49827 2600 -49392 -10278 47749 17740 -44728 -24545 40642
434D0642j0082o6270L1O5761R702o3878j8955O0780K7664n6545l5805N1261M3289
$$ 40642 30560 -35710 -35679 30082 39784 -24094 -43049 17731 45395 -11150 -46955 4306 47595
447D7595m4887m9935L7414N5599k8904n9931J9546O2682r669o3739l36O3027J0043
$$ 47595 2708 -47227 -9813 45786 16882 -43049 -23503 39179 29510 -34229 -34565 28462 38505
460C8505o0712j9148N7027K7383n2238l4717M6596M1155m0207m6684L3184N1311
$$ 38505 -22207 -41355 15672 43055 -9183 -43900 2696 43851 3644 -43040 -9856 41455
472D1455k5462n4980J7169N7495q359n8683p60N8414R872n6628j8675N3366K6805
$$ 41455 15993 -38987 -21818 35677 27318 -31365 -32125 26289 36161 -20467 -39142 14224 41029
485D1029m8831l4042M3233M0222l6876m5365L0005M9469k2680n2615J5029N4838
$$ 41029 -7802 -41844 1389 41611 4735 -40630 -10625 38844 16164 -36451 -21422 33416
497C3416p030n5998j277N6031R741n4710j8188N1937K6265m7753l3638M2267L9965
$$ 33416 26386 -29612 -30889 25142 34883 -19827 -38015 13922 40187 -7566 -41204 1063 41028
510D1028l5763m5083K8529M8898k0868n1483J3089N2890n247n3218k519N2543
$$ 41028 5265 -39818 -11289 37609 16741 -34742 -21653 31237 25990 -27228 -29747 22796
522B2796J0212n0823j7726M8048K4942m4143l1662L9087L7605l3001m2558K6055
$$ 22796 33008 -17815 -35541 12507 37449 -6694 -38356 731 38336 5335 -37223 -11168
534a1168M6240j8565m8628J0857M9676l199m9576m166M8447J1220m6472j7857
$$ -11168 35072 16507 -32121 -21264 28412 25213 -24363 -28529 19918 31138 -15334 -33191
546c3191M3729K4171m0180l0099L5821L5541l0545m0342K4426M4191j7574m6958
$$ -33191 10538 34709 -5471 -35570 251 35792 5247 -35095 -10669 33522 15948 -31010
558c1010J0222M8412k654m8594m807M7505J1947m5352j8528M2259K4581l8419
$$ -31010 -20788 27624 24970 -23624 -28431 19074 31021 -14331 -32859 9400 33981 -4438
570d438l0000L3937L4836k8828l8992K3089M2440j6757m4993R874M6450k632m6717
$$ -4438 -34438 -501 34335 5507 -33485 -10396 32044 15287 -29706 -19832 26618 23986 -22731
583b2731m702M5615J1825m3307j8441L9895K4323l5625k9364L0771L3561k5478
$$ -22731 -27433 18182 30007 -13300 -31741 8154 32477 -3148 -32512 -1741 31820 6342
595F342l6933J9893L9562j3992m1455P843M2566j434m2783n135M1982J1668m0126
$$ 6342 -30591 -10698 28864 14872 -26583 -18740 23826 22392 -20391 -25526 16456 28124 -12002
608a2002j7982L7186K3755l3259k8848K8577L2999k3288l6229J7686L8584j1898
$$ -12002 -29984 7202 30957 -2302 -31150 -2573 30426 7138 -29091 -11405 27179 15281
620A5281m0091O071M0832j60m0876n775M0160J1730l8564j7614L6016K3199l2490
$$ 15281 -24810 -18739 22093 21933 -18943 -24718 15442 27172 -11392 -29006 7010 30209 -2281
633b281k8287K7997L2587k2756l5937J6975L8207j0915l9420M847L9647J118l9041
$$ -2281 -30568 -2571 30016 7260 -28677 -11702 26505 15590 -23830 -18983 20664 21782 -17259
646a7259o798L7700J2240l5647j7412L2933K2252k9535k6679K5420L0531k0622
$$ -17259 -24057 13643 25883 -9764 -27176 5757 28009 -1526 -28205 -2785 27746 7124
658G124l3658J5238L5871r480l7087L574L7241K242l6433p742L4830J2860l2592
$$ 7124 -26534 -11296 24575 15095 -21992 -18418 18823 21065 -15368 -23110 11720 24580 -8012
671h012j7483K9839K1685k6630k5472K2969K8839j8796l1766J4112L4051q969
$$ -8012 -25495 4344 26029 -601 -26073 -3104 25735 6939 -24827 -10715 23336 14367
683A4367l5540L425L6113K230l5706p818L4317J3099l2056j7879K9126K2067k5607
$$ 14367 -21173 -17748 18365 20595 -15111 -22929 11388 24487 -7569 -25448 3678 25745 138
696A38k5624K1717K8562j7452l0963J2907L2789q079l3980K969L4448K294l4065
$$ 138 -25486 -3769 24793 7341 -23622 -10715 22074 13995 -19985 -17016 17432 19726 -14339
709a4339p639L2761J2779l0546j7488K7454K1617k3705k4979J9520K7561j5074
$$ -14339 -21978 10783 23562 -6984 -24472 2982 24599 894 -24085 -4565 22996 7922
721G922k9399J0529L0629n946l1241J331L1316L280l0810p921K9639J2471k7801
$$ 7922 -21477 -10948 19681 13735 -17506 -16175 15141 18421 -12389 -20310 9329 21800 -6001
734f001j6800K5183K0753k1874k4151J7995K6824j3682k8730R174K9872m600l0323
$$ -6001 -22801 2382 23135 1261 -22890 -4895 21929 8247 -20483 -11309 18563 13963 -16360
747a6360J45L0141M224k9439q439K8248J2506k6504j6451K4178K0152k1233k3473
$$ -16360 -16215 13926 18150 -11289 -19728 8520 21026 -5478 -21929 2249 22401 1168 -22305
760b2305J7626K6234j3481k8268Q921K9483m191k9841m81K9401M967k8252r126
$$ -22305 -4679 21555 8074 -20194 -11273 18210 14019 -15822 -16303 13098 18065 -10187 -19313
773a9313K6569J2898k4389j6330K1815J9402j8866k2097J5455K4419j1714k6199
$$ -19313 7256 20154 -4235 -20565 1250 20652 1786 -20311 -4856 19563 7849 -18350
785a8350P584K7347l216k7751j245K7358N602k6210r636K4401J3266k2074j6407
$$ -18350 -10766 16581 13365 -14386 -15631 11727 17329 -8881 -18517 5884 19150 -2924 -19331
798a9331J9403J9081j6463k1326J3322K3208r978k4711O377K5789k564k6333j461
$$ -19331 72 19153 2690 -18636 -5314 17894 7916 -16795 -10418 15371 12807 -13526 -14987
811a4987K6228N549k5403r556K3875J3261k1661j6543J8926J9305j5796k1471
$$ -14987 11241 16790 -8613 -18169 5706 18967 -2694 -19237 -311 18994 3198 -18273
823a8273J2414K3111q911k4231N355K4849j745k5038j933K4738N624k3894r288
$$ -18273 -5859 17252 8341 -15890 -10535 14314 12569 -12469 -14402 10336 15960 -7934 -17222
836a7222K2413J2811k0337j5962J7629J8676j4467k0754J1005K2167p378k2952
$$ -17222 5191 18002 -2335 -18297 -668 18008 3541 -17213 -6208 15959 8581 -14371
848a4371L801K3172l10k2937l015K2282O216k1270r321J9891J2253j8068j5054
$$ -14371 -10570 12602 12292 -10645 -13660 8622 14838 -6432 -15753 4138 16391 -1677 -16731
861a6731J5787J7552j3054j9642R968K1190o581k2121L065K2465M01k2177l752
$$ -16731 -944 16608 3554 -16088 -6120 15070 8489 -13632 -10567 11898 12299 -9878 -13630
874a3630K1414O855k0241r718J8745J2343j6949j4789J4852J6997j2442j8910
$$ -13630 7784 14639 -5602 -15320 3425 15768 -1181 -15970 -1118 15879 3437 -15473
886a5473R632K0450o486k1487L105K1906M04k1684l814K0854P005j9461r886J7675
$$ -15473 -5841 14609 8123 -13364 -10259 11647 12051 -9633 -13447 7407 14412 -5049 -14935 2740
900B740J2401j5586j4511J3263J6260j0787j7705Q139J8823n327j9584K316J9954
$$ 2740 15141 -445 -14956 -1693 14567 3780 -13925 -5786 13037 7710 -11874 -9558 10396
913A0396P67j9798l898J9104O957j7875r736J6153J2206j4082j4203J1728J5777
$$ 10396 11163 -8635 -12533 6571 13528 -4347 -14083 2070 14276 194 -14009 -2281 13496
926A3496r263j6959O743J7783m185j8333J579J8574J101j8525l856J8072O607
$$ 13496 4233 -12726 -5983 11800 7615 -10718 -9139 9435 10536 -7989 -11845 6227 12834
939A2834j7132r299J5744J1773j3845j3928J1606J5642r064j6862O388J7630l694
$$ 12834 -4298 -13597 2147 13920 75 -13853 -2247 13395 4331 -12531 -6143 11487 7793
952G793j7958J021J7911J558j7554m067J6883O495j5903q858J4561J1080j2827
$$ 7793 -10165 -9144 8767 10325 -7229 -11296 5587 12082 -3821 -12679 1882 12962 135
965A35j3085J0733J4741q284j5960N628J6705k908j6877K00J6615K342j5996m691
$$ 135 -12950 -2217 12524 4240 -11720 -6092 10613 7705 -9172 -8972 7643 9985 -6011 -10702
979a0702J5097O804j3966q753J2618J0553j1075j2211R286J3670p245j4838M961
$$ -10702 4395 11199 -2767 -11520 1098 11651 576 -11635 -2349 11321 4076 -10762 -5801
992e801J5663k501j6030m7J5970K561j5451m928J4564P073j3371q947J1944J0568
$$ -5801 9862 7361 -8669 -8716 7254 9815 -5636 -10564 4000 11073 -2298 -11245 699 11267
1006A1267j0383j1980Q683J3167o819j4182M781J4937k566j5385J94J5448K226
$$ 11267 884 -11096 -2413 10754 3935 -10247 -5466 9471 6905 -8480 -8286 7162 9388
1019I388j5023m621J4204O814j2927q770J1376J0357r596j1622P713J2571n772
$$ 9388 -5635 -10256 3948 10762 -2165 -10935 441 10798 1202 -10420 -2707 9864 4092
1032D092j3245L779J3662j774j3861k64J3802K354j3448m444J2767O461j1704
$$ 4092 -9153 -5374 8288 6514 -7347 -7611 6191 8545 -4903 -9347 3420 9881 -1823
1045a823q299J0305R912q625j1187O779J2080m834j2653K898J2926j026j2969
$$ -1823 -10122 183 10095 1470 -9717 -2938 9142 4308 -8345 -5447 7479 6453 -6516
1058f516q06J2809K582j2465m361J1918O117j1095p823R975R402q552j0755O858
$$ -6516 -7322 5487 8069 -4396 -8757 3161 9278 -1817 -9640 335 9737 1185 -9570 -2712
1072b712J1815m959j2509K974J2824r77j2794r45J2471K732j1919m403J1171N939
$$ -2712 9103 4144 -8365 -5391 7433 6456 -6338 -7283 5188 7920 -3999 -8402 2769 8708
1086H708j0257p388R177Q722p864r921O349J0900m599j1597K711J1958p43j1939
$$ 8708 -1549 -8937 240 8962 1098 -8823 -2474 8426 3827 -7770 -5059 6899 6156 -5783
1100e783j187J1571K972j0894m588J0016N972r003p174P878Q228o695r134N369
$$ -5783 -6970 4601 7573 -3321 -7909 2107 8079 -924 -8098 -220 8008 1313 -7821 -2452
1114b452R941l940j0584K389J1001p02j1148j044J1016K768j0546m409R781N893
$$ -2452 7489 3549 -7035 -4646 6355 5653 -5495 -6539 4477 7245 -3301 -7710 2071 7964
1128G964q784p154P626Q161o361r000N068R620l708j0116K291J0467p94j0619
$$ 7964 -820 -7974 -348 7813 1452 -7548 -2480 7140 3432 -6684 -4393 6074 5280 -5339
1142e339p77J0557K390j0183m013R530N536q556o887P360P949n991q723M521R242
$$ -5339 -6116 4441 6831 -3352 -7365 2165 7701 -855 -7742 -382 7567 1576 -7147 -2626 6616
1157F616l064r529J623R614k23r548j160R340K516q958l862Q411N142p594o364
$$ 6616 3552 -5977 -4354 5260 5037 -4511 -5671 3669 6185 -2773 -6635 1776 6918 -676 -7040
1172g040O586P425n388q241M010Q796k567r080J122R133K29q975j503Q688K684
$$ -7040 -454 6971 1583 -6658 -2648 6148 3581 -5499 -4377 4756 4985 -3990 -5493 3195 5879
1187E879q280l824P777M920p121n960O291O967n302p807M091Q479k740q909J325
$$ 5879 -2401 -6225 1552 6472 -649 -6609 -318 6649 1347 -6460 -2369 6110 3370 -5539 -4214
1202d214R051R5q918j481Q561K735q030l838P329M844o562n726N714O482m748
$$ -4214 4837 4932 -3986 -5467 3094 5829 -2201 -6039 1290 6134 -428 -6154 -440 6042 1294
1217A294p171L682P754k517q133J207Q340J31q244j496P919K744p347l886O624
$$ 1294 -5877 -2195 5559 3042 -5091 -3884 4456 4587 -3657 -5153 2766 5510 -1837 -5723 901
1232I01M810n763n574M862O179l922o679K966P084j963p373R09P565J99p584j380
$$ 901 5711 -52 -5626 -764 5415 1493 -5186 -2220 4864 2901 -4472 -3563 4002 4201 -3383 -4763
1248d763P437K530p052l640O451M651n669n511M750O159l769o622K756O932j752
$$ -4763 2674 5204 -1848 -5488 963 5614 -55 -5566 -816 5343 1574 -5048 -2292 4640 2888
1263B888p121P66P200K39p180j249P013K311o705l339O182M337n454n226M578
$$ 2888 -4233 -3467 3733 3972 -3208 -4457 2556 4867 -1838 -5177 1005 5342 -112 -5338 -760
1278g60N908l548o409K452O680j383o738L38O660O34o450j542O154K417n766l243
$$ -760 5148 1600 -4809 -2357 4323 2940 -3798 -3460 3200 3834 -2616 -4158 1996 4413 -1353 -4596
1294d596N298M020m693m768L987N413l148n916K187O241j157o391J33O322Q33
$$ -4596 702 4722 29 -4739 -752 4661 1513 -4403 -2216 4025 2868 -3523 -3390 2932 3765
1309C765o092j737N754K525n335l221M853L874m325m479L741N040l048n533K242
$$ 3765 -2327 -4064 1690 4215 -1120 -4341 512 4386 61 -4418 -677 4363 1315 -4218 -1976
1324a976N923j348o139L46O194O43o027j609N691K475n206l241M638L870m001
$$ -1976 3947 2599 -3540 -3194 3000 3643 -2384 -3993 1698 4173 -1033 -4274 364 4234 233
1339B33m374L322M783k609n114J886N368j086n532K31N576O68n473j575N205K396
$$ 233 -4141 -819 3964 1355 -3759 -1873 3495 2409 -3123 -2892 2684 3352 -2121 -3696 1509 3905
1355C905m730l161M130L784l480m241K744M557k013m766J333M906o48m964l4M961
$$ 3905 -825 -3986 144 3928 448 -3793 -1049 3508 1495 -3271 -1938 2968 2320 -2644 -2678 2283
1371B283P44m893j470M722K214m421k928L978L554l402m067K713M468j992m709
$$ 2283 3027 -1866 -3336 1386 3600 -821 -3749 229 3783 381 -3686 -973 3495 1503 -3206
1386c206J245M808n15m792j70M716Q06m559j431M348K054m073k668L711L228l196
$$ -3206 -1961 2847 2332 -2460 -2630 2086 2892 -1667 -3098 1250 3304 -769 -3437 274 3502 306
1402C06l755K583M145j873m404J091M517l39m477l90M302J060m060j601L733K095
$$ 306 -3449 -866 3279 1406 -2998 -1907 2610 2271 -2206 -2596 1706 2766 -1294 -2895 838 2933
1418B933l372k546K995K966k576l327K088L657j516l926R00M073k20m116m37L983
$$ 2933 -439 -2985 10 2976 400 -2927 -839 2818 1302 -2624 -1724 2349 2129 -1987 -2424 1559
1434A559J101l779j662L446K157l078k542K668K878k269l124J828L387j392l575
$$ 1559 2660 -1119 -2781 665 2822 -256 -2798 -130 2748 479 -2645 -817 2570 1178 -2397
1449b397Q78L746l32l835k67L799Q94l661j486L367K025k977k477K524K785k008
$$ -2397 -1519 2227 1895 -1940 -2207 1592 2486 -1175 -2661 706 2731 -246 -2723 -199 2586 578
1465E78l035J526L186j036l272N62L312q5l298l96L239Q99l118j389K882J876
$$ 578 -2457 -931 2255 1219 -2053 -1491 1821 1736 -1562 -1958 1281 2180 -938 -2327 555 2431
1481B431k567k284K139K618j649k860J139K975o37k986J87K941K27k866n99K758
$$ 2431 -136 -2420 -281 2337 688 -2172 -1033 1942 1305 -1681 -1494 1447 1674 -1192 -1791 967
1497I67R65k631j335K474J685k255k041J959K353j595k613J150K800o86k882K12
$$ 967 1932 -699 -2034 440 2125 -130 -2171 -212 2141 546 -2067 -917 1883 1197 -1685 -1473
1513a473K862K36k758o18K599R75k418j268K208J541j979j797J727K053j432k285
$$ -1473 1389 1625 -1133 -1751 848 1823 -595 -1863 345 1886 -93 -1890 -163 1890 458 -1827
1529a827J082K455o65k570K23K577K30k486o61K323R97k068j283J788J528j522
$$ -1827 -745 1710 1045 -1525 -1302 1275 1505 -981 -1642 681 1678 -390 -1673 115 1643 121
1545A21j690J242J836r91j955P32K040m38k120J15K162K27k137n80K028R18j856
$$ 121 -1569 -327 1509 518 -1437 -705 1335 897 -1223 -1108 1054 1281 -856 -1436 592 1510 -346
1562c46j218J630J455j356j616J081J727q13j788N72J830l48j849J07J877J35
$$ -346 -1564 66 1521 165 -1451 -370 1357 544 -1244 -672 1158 810 -1039 -932 945 1080
1578A080j866m29J835P10j721j010J553J263j316j466J035J612p44j666M49J658
$$ 1080 -786 -1215 620 1330 -391 -1401 152 1415 99 -1367 -332 1280 536 -1130 -681 977
1594I77j68j633n9J569K51j494m52J429O40j331q34J202J027j032j224Q24J353
$$ 977 809 -824 -883 686 937 -557 -1009 420 1060 -271 -1105 97 1124 92 -1132 -308 1045
1611A045n60j447L00J463l6j413j89J314L94j198n35J097O38r91p59R23Q43q09
$$ 1045 485 -962 -662 801 765 -648 -837 477 871 -327 -862 235 873 -118 -877 46 889 80
1629H0r76O82J096n39j183L49J261j39j282p0J238K82j157m52J038N87q99o98
$$ 80 -896 -214 882 343 -840 -491 770 631 -651 -721 517 799 -358 -810 228 815 -84 -782
1647g82P76P46o53q09N60Q49m34r36L33R58j49j017j2J007J95r48l93Q66N32p14
$$ -782 -6 740 87 -722 -162 687 253 -683 -350 608 459 -558 -570 437 632 -316 -709 157 689 -25
1667b5o26N54O91l96p26L02O84j70o89R1O75j1o83o1O74J69o75k76O45L81n70
$$ -25 -651 -97 594 198 -528 -226 458 288 -401 -310 365 354 -329 -390 284 453 -222 -498 147 528 -42
1688d2m83M61N75l66n95K27O06j16n88N3N40On16n1M86R7m90j39M78K10m64k89
$$ -42 -525 -64 511 145 -450 -223 383 267 -321 -268 272 278 -238 -289 197 294 -196 -335 143 353 -111 -400
1710d00M34L60l44m43K64M68j45m75M7M40M6l80r8L17J37k78j40K19J40j95j44
$$ -400 34 394 50 -393 -129 339 194 -281 -234 206 252 -128 -226 91 228 -50 -190 29 169 -26 -170
1731a70J84J66j64k08J38K43q4k75K4K57N5k26j16J72J49j06j47M5J32l2p5J6
$$ -170 14 180 16 -192 -54 189 105 -170 -146 111 166 -60 -176 -4 145 39 -108 -63 69 37 -38 -22
1753b2N5m3l7N6M6o8o8O0J10n4j15K6J08K4r4l6N5N2k5k2j5j7L7N6k4r6nJ04N1
$$ -22 33 -10 -47 9 55 -13 -81 -21 89 35 -80 -54 54 78 -16 -52 3 55 30 8 -7 -24 13 69 45 -51 -56 48 99
1782I9j12p2O6J00o5p7N0O3m6p0O9P2r2j02J32J37j32j95J14K34o6k67kK78O9
$$ 99 -13 -85 -19 81 16 -61 -11 52 6 -64 5 77 -15 -117 15 152 20 -175 -61 173 107 -160 -162 116 185
1807A85k78j24K39J76k06j86J58K05j29k05J25K24r6k69Q6K84l2l38j6L65R9l65
$$ 185 -93 -217 22 198 -8 -194 -36 169 40 -165 -40 184 88 -181 -95 189 157 -181 -197 168 267 -98
1829i8j81L26K57k82l17K16L58j55l78R6L79n0l68LL70L7l98n7M16J15m31j92
$$ -98 -279 47 304 22 -295 -79 279 124 -254 -158 221 171 -197 -194 176 213 -185 -242 174 289 -142 -334
1851c34M30K74m21l51L70M39l07m91K15N36j19n44J5N57M4n36j08N33J47n01k27
$$ -334 96 370 -51 -402 -32 407 100 -391 -176 360 241 -303 -288 269 313 -223 -331 202 349 -152 -379
1872c79M89L26m81l86M07M93l59n57K59O32j68o58K7O71R5o53k01O02K91n48l66
$$ -379 110 436 -45 -431 -24 469 110 -447 -188 444 276 -382 -355 316 411 -242 -443 159 450 -98 -464
1893d64M96M18m39m79L79N67l39o14K47O88j63p26M6P43R7p50k21P18L36o51m51
$$ -464 32 450 11 -468 -89 478 139 -475 -228 460 297 -429 -383 360 457 -293 -514 204 540 -111 -562
1914e62N88N26n00n87M26O53l62o80K45P47j69p89P0Q11O7q35j98Q22L33p66m80
$$ -562 26 552 52 -535 -109 544 182 -498 -253 494 325 -464 -394 417 484 -351 -549 273 606 -160 -640
1935f40O83O11o07o89M77P68l56q06K27Q21j09q28j0Q47J11q43k43Q17M00p92
$$ -640 43 654 47 -642 -165 603 247 -559 -332 489 380 -448 -458 389 500 -343 -586 231 631 -161
1955a61n14P20O40o18p59M94Q56l60q98K13R19n9r17p8Q93K24q83l22Q36M33p84
$$ -161 -675 45 685 67 -692 -198 658 298 -600 -387 532 473 -444 -522 371 595 -288 -610 226 659 -125
1976a25n60P34O71o55p79N36Q80m08r65K56J006j03j017o9J014K20r57l71Q99
$$ -125 -685 49 720 65 -714 -178 702 294 -671 -415 591 488 -529 -598 416 636 -321 -692 207
1995B07M94q19o08P22P31o51q04N27Q97m05r57K44J035q1j069q4J067K47j010
$$ 207 701 -118 -726 -4 727 76 -728 -201 696 291 -666 -422 613 532 -537 -621 446 693 -317
2014c17m16R32N78q67o70P21Q08o12q84M90R34l45j008K15J034n3j083r4J081
$$ -317 -733 199 777 -90 -760 -39 769 157 -727 -237 697 352 -656 -441 593 540 -543 -637 444
2033D44K51j037m44R92N96q86p42P75Q45o26r46M84J016l42j038J70J096m8j091
$$ 444 695 -342 -786 206 802 -84 -826 -51 794 168 -778 -294 722 380 -658 -488 608 560 -531
2052e31j08J088K69j065m26J008N89r25p34Q06Q67o60r88N08J074l49j099J59
$$ -531 -639 449 718 -347 -773 235 824 -101 -835 -29 838 178 -810 -302 772 423 -676 -517
2070e17J127J3j121j78J092L26j050m83R80O22q91p67P90Q88o52j005M96J089
$$ -517 610 623 -498 -676 416 742 -308 -791 189 811 -80 -847 -57 831 179 -826 -330 759
2088G59l25j137J43J173L6j158k19J107L90j056n21R66O64q61p91P56R08o39r93
$$ 759 434 -703 -560 613 649 -509 -728 379 769 -287 -808 158 822 -39 -830 -74 834 195 -798
2107g98M85J088l41j148J67J169L0j187j95J139M04j097n54R91O99q67q32P50
$$ -798 -313 775 434 -714 -547 622 652 -535 -730 409 813 -284 -838 153 852 -15 -847 -97
2125i7R26o17j016M72J074l07j144J60J161K0j178j91J139L92j073n72R77P44
$$ -97 829 212 -804 -332 742 435 -709 -549 612 632 -546 -737 402 794 -279 -851 126 870
2143H70q72q66P29R72n68j055M25J094k47j128P1J160O8j138k49J129L93j052
$$ 870 -2 -868 -139 833 265 -790 -365 729 482 -646 -575 585 653 -485 -734 395 788 -264
2161b64n68R72P25q64q57P36R72n79j078M16J129k42j158Q0J161P3j133k64J097
$$ -264 -832 140 865 1 -856 -120 852 273 -805 -389 740 498 -660 -580 581 654 -479 -743 354
2180C54M26j036n67R54P08q52q53P39R53n73j058M16J123k46j149N3J171J14j122
$$ 354 780 -256 -823 131 839 -13 -866 -127 826 253 -805 -389 734 488 -661 -608 563 677 -445
2199d45k94J078M45r89o03R08P34p99q59O80R52n47j037L88J112k30j130L8J161
$$ -445 -739 339 784 -205 -808 100 834 35 -824 -144 808 261 -776 -388 724 494 -636 -598 563
2218E63J30j124l24J080M67r92o19Q95P49p80q58O34R55n02j021L57J082k22j096
$$ 563 693 -431 -755 325 792 -200 -819 76 825 45 -813 -179 776 274 -747 -390 692 470 -626
2237f26L3J126J31j117k80J059M54r74o24Q93P62p82q67O37R49m75j021L40J064
$$ -626 -593 533 664 -453 -733 326 780 -194 -818 75 837 55 -812 -175 774 299 -722 -382 682
2256F82j83j087L5J067J37j054k94J022M30r57n82Q56P36p48q53O15R44m75j000
$$ 682 499 -588 -553 514 651 -403 -697 325 755 -202 -784 72 808 60 -793 -178 766 291 -709
2275g09L16J031j51j053jJ043J52j014l07R71M41r00n87Q31P10p27q23O20Q99
$$ -709 -393 638 487 -566 -567 476 628 -386 -693 278 719 -181 -768 63 773 46 -777 -157 742
2294G42m61r79L07J040j54j053mJ048J56j005l02R47M32q69n66P84O88o93p79
$$ 742 281 -698 -391 649 495 -558 -562 486 642 -363 -665 282 714 -155 -721 63 751 58 -721
2313g21N77Q60m48r52L22R84j67j018K1R96J65r95k97R35M53q76n70P81O63o60
$$ -721 -144 716 268 -684 -362 622 455 -563 -542 454 619 -376 -673 262 715 -161 -731 50 713 53
2333E3p58N32Q54m23r10L03R35j52r63J0R77J33r62k74R01M29q30n57P48O60o33
$$ 53 -705 -173 681 258 -652 -349 586 434 -529 -519 458 591 -371 -645 256 685 -145 -702 46 706 73
2354G3p50N13Q22m00q72K86Q95j52r21K2R20J22r21k56Q92L83q21n23P42O35o49
$$ 73 -677 -164 658 258 -614 -328 567 415 -506 -484 436 558 -363 -619 273 656 -165 -688 54 689 40
2375D0p42N34Q19m15q41K61Q88j47r00K2Q95J14q74k30Q26L65p95m65P09N94o31
$$ 40 -702 -168 651 236 -605 -344 544 397 -503 -481 414 528 -346 -576 250 615 -180 -645 64 658 27
2396B7o77N19P67m11q26K87Q47j47q64J7Q64J15q42k33Q02L45p55m50O86N50o07
$$ 27 -650 -131 636 225 -601 -314 533 386 -478 -461 403 518 -324 -557 245 590 -165 -615 71 621 14
2417A4o23N09P02m06p77K92Q26j71q39K9Q43R9q28k11P78L28p33m31O71N33o05
$$ 14 -609 -100 602 196 -581 -289 537 366 -473 -444 399 498 -330 -541 237 565 -168 -599 72 605 0
2438@n93N14O63l95p38K93P79j73q09N7Q16O9q12j90P80K92p13m14O47N03n79
$$ 0 -593 -79 584 189 -549 -256 523 350 -459 -402 414 483 -329 -519 261 553 -160 -574 73 576 -3
2459cn74M89O34l69p15K98P41j92p54N7P86L9p58j57P36K72p01l96O47M89n85
$$ -3 -577 -88 546 177 -538 -240 501 309 -445 -388 398 437 -321 -478 258 530 -171 -567 80 569 -16
2480a6n50M94O03l83o70K87P18j83p38R3P31K0p32j34P40K29o94l30O41M19n69
$$ -16 -566 -72 531 148 -522 -235 483 300 -438 -345 386 406 -326 -460 280 509 -185 -515 126 545 -24
2501b4n25N01N90m08o45L16O71k09p02J09P08%p07j13P09J97o74k86O25L77n88
$$ -24 -549 -48 542 134 -511 -195 476 267 -435 -326 382 382 -325 -438 271 468 -206 -492 133 510 -78
2522g8m51N15N35m20o18L33O58k35o99J32P11l3o95n2O71J79o66k54O07L66n90
$$ -78 -529 -14 521 101 -517 -184 474 239 -460 -328 383 350 -345 -397 274 453 -213 -467 140 506 -84
2543h4m15N11M95m35n64L57O06k49o59J66O76n9o92l8O67J42o48k48O25L11n64
$$ -84 -499 12 507 72 -492 -135 471 222 -437 -271 405 346 -346 -384 283 425 -223 -471 154 465 -99
2564i9l81N00M68m39n42L68N92k76o46J92O64r4o67oO65J19o56k15O12L02n60
$$ -99 -480 20 488 49 -493 -125 467 191 -455 -263 401 307 -360 -366 299 418 -238 -453 159 461 -99
2585i9l89N14M68m61m98L68N52k77o12K10O40j28o52K7O65N9o49j65O29K61n75
$$ -99 -488 26 494 33 -465 -97 455 178 -434 -224 416 288 -364 -337 328 387 -262 -427 202 463 -112
2606a12l71N29M24m50m87L78N39l06n81K18O14j41o31N0O41L8o29j31O13K29n76
$$ -112 -483 46 470 20 -467 -89 450 144 -437 -219 395 254 -377 -327 314 352 -277 -408 205 434 -142
2627a42l22N31L95m68m60M00N18l22n65K44N91j62o07O5O26L2o42q9N89K14n80
$$ -142 -464 67 462 -6 -466 -66 452 130 -435 -191 400 238 -369 -304 322 354 -288 -377 212 426 -154
2648a54k80N24L69m94m32M25N05l59n38K55N87j80o10R8O00K6o19r6O07J67n84
$$ -154 -434 90 459 -35 -467 -42 463 104 -434 -179 408 228 -382 -284 316 342 -277 -373 234 401 -183
2669a83k53N34L46m93m20M41M80l77n22L00N53k01n90J17O21l4o04p0N96J48n66
$$ -183 -436 98 444 -49 -469 -28 452 75 -447 -147 406 205 -385 -268 353 319 -285 -355 241 389 -177
2690a77k51N52L17m94l73M25M45l68m98K90N43k13n85J46N84n7o06l2O13J24n96
$$ -177 -428 124 441 -53 -426 -1 444 76 -422 -132 411 198 -387 -241 343 286 -320 -352 261 385 -211
2711b11j98N46K81n07l53M59M11l76m89L30N20k50n66J83N70p4n98MN99Q5n82
$$ -211 -409 137 418 -89 -442 17 428 52 -437 -107 413 163 -403 -220 350 276 -322 -318 281 366 -216
2732b16j68N52K50n16l23M67L91m15m44L39N11k71n53J94N65j05n88K0N83N4n70
$$ -216 -384 168 418 -98 -421 46 437 22 -422 -83 428 157 -396 -202 363 258 -330 -310 273 327 -243
2753b43j45N55K24n20k92M73L61m21m19L55M83k99n18K13N54j21n84N0N75L7n58
$$ -243 -388 167 391 -129 -421 52 413 -8 -427 -72 411 112 -406 -193 361 240 -344 -294 281 318 -240
2774b40j29N51K09n28k78N05L37m51m09L85M65l08m97K30N36j45n74P9N70J1n71
$$ -240 -369 182 391 -137 -415 90 427 -24 -433 -48 417 109 -388 -158 378 233 -341 -262 308 319 -252
2795b52j09N58J81n44k42N01L22m44l95L96M49l43m91K62N21j71n57Q9N83k4n75
$$ -252 -361 197 378 -166 -408 93 415 -29 -424 -28 421 78 -413 -151 370 199 -358 -269 314 290 -285
2816b85o0N81J25n51k09N22K94m75l58M15M11l52m75K96N26k34n47J53N67n4n78
$$ -285 -345 236 361 -190 -399 123 417 -58 -416 -1 410 58 -417 -121 405 171 -376 -223 344 290 -288
2837b88k3N65J21n72j92N31K69m92l21M26L98l83m64L10N18k43n40J56N59p9n82
$$ -288 -311 254 375 -197 -389 142 411 -81 -402 24 422 39 -425 -115 403 160 -380 -224 335 256 -326
2858c26MN81Q5n66j62N31K42n10l07M68L77l93m55L39N21k79n45K01N71j21n81
$$ -326 -322 259 344 -222 -384 147 389 -121 -428 40 417 24 -431 -92 429 150 -395 -194 377 256 -325
2879c25K9N78O8n82j46N67K23n39k98M95L76m37m43L70M98l13n33K27N65j40n90
$$ -325 -296 282 350 -232 -378 189 412 -127 -425 70 446 9 -434 -64 434 121 -412 -185 380 240 -350
2900c50N4O07K9n97j20N78K01n64k63N04L60m61m29M09M72l12n43K50N70j68o12
$$ -350 -296 311 340 -257 -377 201 402 -162 -425 79 439 -22 -451 -42 430 118 -425 -175 395 227 -385
2921c85R3O12J6o10j02O08J83n69k84N46L39m72m24M25M84l62n25K69N97k00o19
$$ -385 -292 320 336 -274 -376 232 415 -154 -438 108 447 -25 -449 -24 460 98 -427 -158 439 239 -380
2942c80J09O22k8o33o8O25J64o01k39N40L46n07m04M30M82l72n48L05N80k09o10
$$ -380 -271 351 323 -310 -378 247 411 -190 -429 111 457 -50 -454 -24 458 86 -462 -157 423 214 -396
2963c96J17O29k1o64l6O39J54o19k47N89L21n23m09M65M83l97n43L21N84k17o29
$$ -396 -279 350 329 -335 -371 268 422 -197 -444 145 466 -57 -466 -1 482 85 -458 -137 447 230 -399
2984c99J43O46m9o66o0O62J42o39k38O12L36n60m24M95M95m32n59L48O05k51o50
$$ -399 -256 390 341 -325 -385 277 419 -220 -458 154 490 -70 -494 1 496 64 -495 -147 458 207 -443
3005d43J71O66o8o76l9O60J59o64k38O36L16n83m01N25M81m36n73L67O22k66o65
$$ -443 -272 394 326 -350 -389 271 430 -234 -472 164 480 -103 -504 21 502 66 -507 -140 482 216 -449
3026d49J73O92p3o95l6O98J30o75k27O46L17n95m19N42M93m76n55L78O31k89o93
$$ -449 -276 416 343 -352 -388 310 440 -235 -462 184 501 -94 -513 29 522 46 -509 -131 500 211 -482
3047d82K03P04r3p23k1P29J31p05k32O63L55o28m33N60N06m80n86L99O49l06o94
$$ -482 -279 425 332 -391 -412 317 448 -257 -489 174 529 -99 -532 28 534 54 -532 -133 516 210 -484
3068d84J97P25q7p53jP35J34p12k57O88L49o30m45N78N23n03n97M02O67l11p19
$$ -484 -287 438 351 -402 -403 332 466 -246 -503 185 534 -96 -541 37 560 57 -540 -138 529 218 -501
3089e01K17P25q9p55j4P55J23p48k35P15L49o61m59O06N33n12o14M21O91l28p29
$$ -501 -284 441 352 -403 -417 338 461 -287 -522 193 542 -119 -578 28 561 49 -565 -144 547 219 -510
3110e10K22P49j01p68j4P67J36p62k35P23L55o81m63O27N34n35o20M45O84l30
$$ -510 -288 461 360 -408 -422 345 481 -281 -516 207 562 -119 -582 45 579 44 -576 -131 553 223
3130B23p54K38P71j07p95lP89J18p66k30P28L56o95m57O18N42n44o26M59O88l35
$$ 223 -531 -293 478 371 -424 -427 362 480 -286 -516 212 568 -127 -584 34 576 32 -594 -135 553 218
3151B18p57K29P83j06q13LP94J37p74k62P48L73o98m63O21N64n38o42M36P12l36
$$ 218 -539 -310 473 367 -446 -443 351 488 -286 -548 200 573 -125 -588 33 597 59 -583 -147 565 229
3172B29p67K32Q01r2q27l3Q17J60p93k83P62L68o80m89O05N89n40o47M36P18l18
$$ 229 -538 -306 495 403 -424 -457 360 520 -273 -556 206 574 -106 -595 10 599 59 -588 -152 566 248
3193B48p86K15Q05r5q28l4Q24J59p89k93P60M04o92n10O16O10n25o82M19P45l02
$$ 248 -538 -323 482 387 -441 -475 349 508 -281 -574 186 590 -102 -612 4 614 89 -593 -174 571 269
3214B69p90J98Q14p3q39l5Q11J73p92k92P60M05p10n10O28O07n32o96M27P56l11
$$ 269 -521 -323 491 418 -421 -456 355 528 -264 -556 204 609 -101 -611 17 624 92 -604 -177 579 268
3235B68q00K02Q14p8q25l6Q15J65q17k79P66M00p10n14O40N99n29o78M14P62l33
$$ 268 -532 -330 484 406 -419 -455 360 525 -292 -571 195 595 -115 -629 11 610 81 -597 -183 579 246
3256B46p86J94Q22n1q53n5Q38J74q04k76P47M02o80n16O16O11n46o81M32P46l18
$$ 246 -540 -346 476 425 -428 -483 355 529 -275 -551 196 598 -82 -598 18 629 83 -598 -166 580 262
3277B62q05K02Q29o8q35o8Q35J80p93l16P61M15o87n09O01O04n35o67M17P37l07
$$ 262 -543 -341 488 420 -415 -483 352 532 -261 -577 184 599 -88 -597 4 608 73 -594 -177 560 253
3298B53q00J99Q18n3q37n9Q25J81p86l12P43M26o71n36N93O29n10o93M09P55l02
$$ 253 -547 -348 470 417 -420 -479 346 527 -259 -571 172 598 -73 -609 -16 613 103 -590 -181 574 272
3319B72p85J87Q22p8q24o8Q29J74p96k98P52M09o83n24N96O17n02o91L93P53k88
$$ 272 -513 -326 496 418 -406 -474 355 529 -267 -565 187 596 -87 -611 -15 602 100 -591 -198 555 267
3340B67p87J77Q08n8q22p9Q24J76p73l00P54M20p01n13O00O20n17o96M02P59k85
$$ 267 -520 -343 465 407 -415 -494 330 506 -267 -567 187 607 -94 -607 -7 613 96 -600 -198 561 276
3361B76p85J57Q15l1q35o9Q00J97p78l02P39M05o77n17O01O15n00o92L95P41k86
$$ 276 -509 -352 463 432 -403 -472 328 525 -253 -555 184 589 -88 -605 -4 611 111 -581 -186 555 269
3382B69p86J63Q21m9q20p5Q01J86p63l16P12M24o51n22N92O04n02o65L93P38k87
$$ 269 -517 -354 467 418 -402 -477 324 510 -253 -569 143 567 -84 -606 -14 590 88 -577 -184 554 267
3403B67p76J75P97m5q15p7Q02K11p81l11P12M46o56n28N76N86m81o58L83P28l03
$$ 267 -509 -334 463 418 -397 -474 328 539 -242 -553 159 605 -51 -579 -3 583 102 -556 -173 555 252
3424B52p54J70P90m7q10o5P93J95p70l19P20M21o52n29N86N97m79o80L96P30k91
$$ 252 -502 -332 458 411 -399 -464 329 524 -246 -565 155 576 -76 -605 -19 578 99 -581 -185 545 254
3445B54p61J74P71l4p98o1Q03J64p55l05P15M14o58n05N82N90m87o72L91P28k78
$$ 254 -507 -333 438 404 -394 -455 348 512 -243 -548 167 581 -77 -582 0 590 103 -569 -178 550 272
3466B72p56J63P76o6p71o6P74J64p41k88P07M02o55m91N74N81m92o62L92P18k63
$$ 272 -484 -321 455 389 -382 -448 326 490 -251 -539 168 570 -85 -576 -2 579 87 -575 -183 535 272
3487B72p76J64P72l9p89o2P64J99p54k91O97L96o32m94N63N86m96o52M03P06k82
$$ 272 -504 -340 432 393 -396 -458 306 505 -249 -540 157 553 -79 -573 -10 576 80 -572 -169 537 255
3508B55p51J66P74l9p82p9P72J87p35l05P00L89o29m85N57N70m77o44L70P20k79
$$ 255 -496 -330 444 405 -377 -456 316 503 -232 -537 163 552 -77 -562 -5 565 88 -556 -186 534 255
3529B55p50J63P70m6p86p0P78J85p32l11O98M05o37m93N61N59m59o37L69P00k77
$$ 255 -495 -332 438 392 -394 -464 314 499 -233 -544 154 559 -78 -571 -10 549 90 -547 -178 522 245
3550B45p33J70P51m7p74m0P40J91p45k92P05M05o45m92N56N81m75o45L55P03k65
$$ 245 -488 -318 433 386 -388 -428 312 503 -242 -534 171 576 -69 -561 -5 576 101 -544 -189 514 249
3571B49p25J52P53l8p72o3P51J75p24k83O95L81o38m76N55N72m61o45L64P09k67
$$ 249 -476 -324 429 391 -381 -444 307 482 -242 -525 170 551 -87 -563 -8 564 103 -542 -178 531 264
3592B64p36J43P63n1p59n9P50J74p24k76O73L86o22m82N60N60m70o29L68O97k56
$$ 264 -472 -329 434 383 -376 -435 315 489 -235 -511 162 548 -74 -556 4 564 94 -535 -167 530 274
3613B74p55J73P48l6p59r1P49J83p06k94O63L91o06m77N39N52m59o38L86O70k67
$$ 274 -481 -308 440 404 -355 -446 303 486 -220 -514 149 540 -66 -543 -4 548 89 -549 -163 507 240
3634B40p24J63P48l5p65p0P45J83p19k83O71L95o16m89N42N54m35o28L65O70k60
$$ 240 -484 -321 427 392 -373 -443 302 485 -234 -517 154 549 -67 -556 -14 540 105 -523 -158 512 252
3655B52p07J52P33m9p48n5P32J81p24k80O69L85o04m71N22N64m50o24L52O74k65
$$ 252 -455 -303 430 381 -367 -422 310 491 -233 -513 156 541 -63 -534 -12 552 102 -522 -170 504 239
3676B39o99J49P35o0p38n7P34J71p18k70O70L79o16m57N36N56m50o19L43O74k45
$$ 239 -460 -311 424 364 -374 -431 303 474 -244 -514 156 535 -81 -538 -2 554 104 -515 -172 502 257
3697B57o99J40P34m4p41o7P24J68o84k85O58L81o09m65N45N39m59o10L50O82k58
$$ 257 -442 -302 432 388 -353 -420 304 472 -212 -497 161 542 -67 -532 13 552 93 -517 -167 515 257
3718B57p18J40P31m1p24p4P26J66o84k77O37L71n83m74N23N47m34o22L58O65k40
$$ 257 -461 -321 410 369 -355 -429 297 463 -221 -498 139 510 -73 -547 -24 523 89 -533 -175 490 250
3739B50p14J52P16k7p27r1P20J96o80k92O37L85n83m66N17N38m30o09L29O69k34
$$ 250 -464 -312 404 377 -350 -441 279 475 -205 -497 140 525 -58 -524 -7 531 101 -508 -179 490 256
3760B56p07J39P13j1p37r1P13J98o80l05O31L93n71m70M97N46m16n95L13O51k16
$$ 256 -451 -312 401 390 -347 -438 275 473 -207 -512 119 512 -59 -529 -32 514 98 -497 -184 467 251
3781B51o85J20P13k1p19q2P02J94o80l06O43M06n86m81N04N59m05o29L16O67k14
$$ 251 -434 -314 399 378 -341 -423 279 473 -207 -513 130 536 -50 -531 -27 532 127 -502 -186 481 267
3802B67o94J18O83oo92p9O76J92o79k86O30L90n68m79M99N34m01o06K97O68k01
$$ 267 -427 -309 374 368 -324 -403 273 465 -214 -500 130 520 -48 -527 -28 506 105 -501 -204 464 263
3823B63o95R3P05J6p07j04O70K21o63k87O04L93n66m51M73N36l98o01L09O49k02
$$ 263 -432 -339 366 382 -325 -429 241 462 -201 -488 116 509 -57 -508 -35 501 103 -498 -189 460 258
3844B58o95J20O98lo94j00O61K27o50l07N92L91n34m62M55N49l99n95L16O28k03
$$ 258 -437 -317 381 378 -316 -416 245 472 -178 -485 107 498 -36 -498 -43 506 107 -488 -172 456 253
3865B53o80J03O97Ko99j13O75K05o34k98N87L96n29m74M68N28l68n86K78O35j92
$$ 253 -427 -324 373 375 -324 -437 238 443 -191 -489 98 494 -35 -509 -41 487 119 -467 -189 446 254
3886B54o64R9O72J0o79r5O38K15o18l06N83L99n33m58M36N28l53n82K73O17j68
$$ 254 -410 -311 361 371 -308 -403 235 450 -168 -474 109 508 -25 -483 -47 481 128 -454 -181 436 268
3907B68o57Q1O62J1o63j04O43K08o18k96N65L90n19m65M41N22l43n85K56O15j66
$$ 268 -389 -308 354 365 -298 -402 241 449 -169 -465 100 490 -29 -494 -53 469 126 -459 -203 412 246
3928B46o35P4O46K6o43j06O09K10o02k77N37L88n01m48M32N19l49n65K63N92j53
$$ 246 -389 -315 331 357 -286 -392 217 427 -175 -452 85 473 -28 -476 -44 475 126 -439 -176 416 263
3949B63o42O6O50J6o36j20O19K04n87k73N40L66m82m39M19M93l51n43K59N90j65
$$ 263 -379 -313 337 353 -283 -403 216 420 -167 -440 100 466 -16 -455 -36 457 106 -437 -178 412 247
3970B47o23P0O33K2o30j13N93K16n64k98N27L71m59m34L91M93l17n49K57N79j63
$$ 247 -376 -306 327 349 -281 -394 199 415 -149 -447 80 451 -8 -442 -51 442 125 -424 -167 412 249
3991B49o16Q1O13K6o28j07N98K03n61k83M99L80m70m49M08M88l20n20K35N47j38
$$ 249 -367 -286 327 353 -275 -382 216 419 -142 -425 74 454 -16 -465 -57 431 111 -409 -174 373 235
4012B35n89O9N88K7o05j02N71K06n55k90N11L68m45m23L84M71l11n11K18N61j49
$$ 235 -354 -285 303 330 -275 -377 194 400 -155 -445 66 434 -11 -434 -50 421 110 -401 -183 378 229
4033B29n77O2N90K8n81j07N60J96n38k77M95L55m48m09L71M72l00n22K20N54j37
$$ 229 -348 -286 304 332 -249 -356 204 400 -138 -415 80 435 -13 -422 -51 421 121 -401 -181 373 236
4054B36n76N1N78L0n68r7N30J97n22k67M78L39m30m07L75M58l12n00K36N42j46
$$ 236 -340 -289 289 319 -249 -346 184 381 -141 -408 70 409 -21 -428 -53 405 93 -407 -171 371 225
4075B25n59N5N55L4n51j10N44J83n05k71M80L14m11l87L65M35k89m93K33N06j41
$$ 225 -334 -279 276 310 -241 -351 193 376 -129 -400 80 394 -17 -404 -39 396 107 -386 -153 353 212
4096B12n51Q4N33K3n50r2N31J73m94k52M53L10l92l89L51M19k86m56K18M91j43
$$ 212 -339 -255 278 301 -249 -341 190 363 -131 -383 70 380 -12 -401 -50 369 83 -373 -155 336 193
4117A93n25P3N32J5n31r5N13J87n07k48M61L20m05l81L52M20k67m61K06M88j39
$$ 193 -332 -259 273 288 -243 -338 175 362 -145 -393 68 388 -17 -398 -46 374 107 -354 -148 340 201
4138B01n06M8N33J5n14q5M99J56m87k39M53L05l92l69L46M09k76m54K09M75j37
$$ 201 -305 -257 276 291 -223 -308 191 347 -140 -379 74 379 -13 -382 -36 373 97 -357 -148 327 190
4159A90n09O1N08J9m94r4M87J66m82k07M33K93m01l44L32M16k75m61K16M87j38
$$ 190 -319 -258 250 269 -225 -319 168 334 -148 -355 78 371 -30 -374 -42 374 99 -362 -146 341 203
4180B03n05O7N00K3n04q6M74J66m60k14M10K87l78l46L35L91k71m45K13M70j34
$$ 203 -302 -235 265 288 -216 -302 172 338 -122 -336 74 361 -17 -363 -28 363 92 -353 -140 330 196
4201A96n05O5N11J5m93r6M64J76m56k25M07K82l65l28L16L78k61m25K04M55j42
$$ 196 -309 -244 267 282 -211 -307 157 333 -123 -348 59 341 -24 -352 -36 342 81 -344 -140 315 173
4222A73m65N8M89K5n03p9M68J69m50k25L98K93l42l49L01L76k39m23J93M39j14
$$ 173 -292 -234 255 280 -223 -302 166 335 -115 -340 58 351 9 -340 -39 337 98 -325 -132 307 193
4243A93m76N8M67J0m60r4M70J58m30k33L91K80l39l49L00L80k34m17J74M37j08
$$ 193 -283 -225 242 252 -208 -302 168 326 -104 -337 54 334 -5 -354 -54 326 92 -325 -151 286 178
4264A78m49L9M60J9m49r6M38J62m16k25L92K81l53l26L09L67k24m21J58M47r6
$$ 178 -271 -232 228 247 -202 -298 140 302 -114 -339 53 334 -19 -345 -36 331 107 -314 -156 291 195
4285A95m45K5M61J1m41j00M47J53m15k18L76K84l35l27K87L59k24m07J65M29r4
$$ 195 -250 -225 236 247 -194 -294 153 306 -109 -327 49 333 -2 -329 -42 317 93 -314 -149 280 186
4306A86m49K7M56K5m18j14M18J69m00k08L51K67l13l25K85L48k03m02J67M13r4
$$ 186 -263 -236 220 245 -173 -287 131 300 -100 -308 43 310 -3 -328 -43 305 102 -300 -133 280 186
4327A86m39K9M50L8m20j23M05J79l82k32L57K75l03l23K46L57j91m07J53M09q4
$$ 186 -253 -224 226 264 -156 -279 126 305 -77 -309 48 323 20 -303 -57 300 109 -298 -145 264 180
4348A80m19J7M23M1m15j10M08J61l75k33L58K67k90l28K49L51j83l89J49L89o9
$$ 180 -239 -222 201 242 -173 -283 125 286 -89 -322 36 303 13 -315 -66 285 102 -287 -138 251 182
4369A82m02kM05N6l95j21L96J64l63k17L35K74k80l26K28L56j81l78J25L90o2
$$ 182 -220 -222 183 239 -156 -277 119 283 -80 -297 38 312 32 -294 -66 290 109 -269 -144 246 184
4390A84l99lL95N5l76j18L70J68l53k20L26K50k77l09K35L43j73l71J17L92o0
$$ 184 -215 -218 177 232 -144 -262 108 276 -77 -297 29 279 2 -307 -72 271 98 -273 -156 236 176
4411A76l89NL74O5l66j22L55J66l20k17K85K69k63k86K12L26j65l65J28L53m3
$$ 176 -213 -208 166 231 -135 -257 98 264 -56 -273 12 281 18 -268 -56 270 105 -260 -132 221 178
4432A78l91LL78O1l62j16L39J61k94k23K93K35k36k93K12L10j65l24R6L58n3l65
$$ 178 -213 -210 168 229 -133 -249 90 251 -43 -266 27 262 26 -267 -55 255 90 -234 -138 220 167 -198
4454a98mL80M4l51j33L54J48l02k04K69K53k37k78J94L16j45l25R7L47p1l34o
$$ -198 -202 178 222 -129 -262 92 240 -62 -266 3 256 19 -259 -65 251 106 -219 -122 225 154 -180 -186
4476a86L52M2l37j00L11J52l02j95K84K26k32k77K07K87j36l19J04L21n0l29j0
$$ -186 166 208 -129 -229 82 234 -68 -263 21 247 15 -262 -55 232 96 -223 -119 202 152 -177 -187
4497a87L38L8l15j08L15J32k76j82K54K31k23k65J92K92j54l02J07L13o1l22M
$$ -187 151 189 -126 -234 81 213 -63 -245 9 240 17 -248 -56 236 82 -220 -113 200 139 -183 -179
4518a79L13O4l04j01K97J47l01j67K58K16k31k38J74K74j33l14J05L09m2l28J3
$$ -179 134 198 -106 -207 90 237 -64 -231 27 243 12 -226 -52 222 89 -225 -120 189 147 -181 -168
4539a68L08N0l10r0K92J29k68j84K55K19k26k34J70K64j35k95J01L14n2l14NL27
$$ -168 140 190 -120 -210 82 211 -57 -241 14 233 7 -227 -57 207 72 -223 -122 192 140 -174 -169 158
4561A58J8k91q3K76J44k72j70K37K12k03k36J68K51j31k74R3L02o3k93kK98M2
$$ 158 176 -115 -198 78 222 -50 -220 17 229 26 -210 -42 209 78 -196 -103 199 136 -157 -159 139 181
4583A81k89q3K76J17k61j76K49J99j87k59J77K55j28k73R3K86n1k98J3K92L0k74
$$ 181 -108 -191 85 202 -59 -235 14 213 26 -233 -56 199 71 -202 -109 177 126 -172 -159 133 163 -111
4605a11p4K80J11k67j66K49J91j97k33J67K57j20k88J07K80n8k74lK83M3k97n7
$$ -111 -185 95 206 -61 -227 22 213 16 -217 -50 207 87 -201 -94 186 128 -146 -149 134 177 -120 -177
4627a77K66J17k62j37K27J79k17j93J65K40j36k66Q7K80n0k85J2K82K1k80n8K69
$$ -177 89 206 -56 -193 34 213 -4 -197 -32 208 72 -194 -107 173 123 -162 -150 132 153 -127 -185 84
4649H4R4k40j34K24J73k03j98J75K18j25k46Q4K62m2k65JK74L7k77p4K57J22k39
$$ 84 178 -62 -196 28 201 -2 -200 -25 193 68 -178 -94 168 126 -139 -138 136 173 -104 -178 79 201 -38
4672c8j60K27J78j96k11J66K24j18k57R0K64m5k83J6K73L5k70p1K58J01k53j37
$$ -38 -198 29 207 11 -200 -34 190 72 -185 -95 169 124 -159 -143 130 165 -105 -176 82 183 -70 -207
4694b07K22J85j90k20J70K18j08k46R1K63o1k66J3K75J7k61p6K63J14k50j34K19
$$ -207 15 200 10 -210 -40 178 70 -176 -85 178 117 -149 -136 139 156 -105 -181 82 196 -54 -188 31
4716C1J83k01k09J63K28j35k50R3K66m1k74J0K73J5k56n8K42J08k43j53K28J85
$$ 31 214 13 -196 -33 195 60 -190 -97 169 128 -146 -136 137 152 -104 -162 80 188 -55 -208 20 205
4738B05j98k16J66K34j29k60R2K77m7k81J1K77L2k79o6K69R7k33j60K34J81j98
$$ 205 7 -209 -43 191 62 -198 -106 171 124 -157 -146 131 163 -116 -182 87 184 -49 -209 25 206 8
4760Hk03J68K30j30k56R2K73o0k69MK75K6k63p9K68J01k31j60K33J69j85k09J63
$$ 8 -195 -27 203 73 -183 -91 182 122 -147 -143 132 158 -105 -184 84 185 -46 -206 27 196 11 -198 -35
4783c5K28j19k64R2K66n0k73J4K71K6k60r3K64J26k39j64K21J89j88k17J43K51
$$ -35 193 74 -190 -98 168 118 -155 -141 130 156 -104 -197 67 193 -46 -210 11 200 12 -205 -62 189
4805A89j13k60P1K84l5k72j1K84L2k67r6K72J26k46j53J98K00j69k31J47K38r5
$$ 189 76 -184 -113 171 136 -136 -147 137 169 -98 -194 78 204 -42 -195 3 203 34 -197 -50 188 93
4827I3k72O9K67l1k79j2K85L3k60q5K48J42k45j60K04K05j73k30J36K62j17k57
$$ 93 -179 -110 157 126 -153 -165 120 153 -107 -192 56 198 -47 -207 -3 202 29 -201 -65 197 80 -177
4849a77O6K67j7k74j6K71N9k76j01K59J38k26j68J97K05j70k26J31K53r5k88O8
$$ -177 -111 156 139 -135 -151 120 179 -97 -198 61 199 -27 -195 2 207 37 -189 -58 195 100 -188 -120
4871a20K76j4k81l2K85O0k52j27K41J49k11j81J91K00j59k36J43K44r3k61M3K96
$$ -120 156 142 -139 -171 114 174 -78 -205 36 185 -26 -207 -16 184 25 -211 -68 176 83 -178 -135 161
4893A61pk95l3K73P6k50j14K36J59k23j81J84K11j41k45J12K67p5k95N1K83kk78
$$ 161 154 -141 -174 99 175 -75 -189 47 206 -17 -198 -14 197 56 -189 -77 190 115 -180 -129 154 152 -126
4916a26m1K70Q6k60j30K21J76j95k06J82K23j38k44R2K60n7k71PK84J4k68n6K56
$$ -126 -167 103 189 -71 -201 20 196 1 -205 -23 200 62 -182 -90 170 113 -158 -151 133 147 -121 -177 79
4939G9J02k48j31K16J79k03k08J71K39j36k44Q5K65l9k86J7K66L8k73o6K52J22
$$ 79 181 -67 -198 18 197 -6 -214 -43 196 60 -184 -99 166 127 -159 -142 124 162 -111 -177 75 197
4961A97k42j54K18J76j91k07J59K30j23k53R2K63l4k69j9K68N0k60r7K59J09k13
$$ 197 -45 -199 19 195 4 -203 -44 186 63 -190 -98 165 131 -138 -157 111 161 -99 -196 63 172 -41
4983d1j67K06J82j64k24J54K27r5k57P6K59l3k62k2K69N7k66r4K57J28k09j84
$$ -41 -208 -2 180 16 -208 -54 173 78 -179 -103 156 123 -139 -161 108 165 -101 -195 62 190 -19 -203
5005b03K01K01j60k31J37K40r9k59N4K69k0k69j6K62N9k63q9K36J33k11j78J97
$$ -203 -2 199 39 -192 -55 185 86 -173 -119 150 130 -139 -155 107 166 -97 -186 50 183 -28 -206 -9
5027iJ91j45k31J24K43p5k61M4K56ok65l8K66Q3k62j10K25J49k14j63J82K03j55
$$ -9 182 37 -194 -70 173 98 -163 -119 137 131 -134 -172 94 177 -85 -195 30 179 -35 -198 -16 187 32
5050C2k16J14K62r5k50L2K72rk56n0K50Q0k38j23K23J64k20j53J56K09j36k44
$$ 32 -184 -70 192 97 -153 -121 151 142 -114 -164 86 166 -72 -195 28 192 -28 -181 -25 184 48 -196
5072a96J13K41p0k48K4K65J5k65m9K45R2k30j37K22J67j85j94J70J98j41k25R8
$$ -196 -83 158 88 -160 -136 129 144 -121 -170 75 167 -63 -200 22 189 4 -190 -20 178 37 -188 -90
5094i0K50n4k61L2K58J6k66n9K69Q8k37j43K12J69j82j96J56K27j40k06O8K41
$$ -90 160 106 -155 -123 135 151 -115 -174 95 183 -54 -197 15 184 2 -194 -38 189 49 -157 -89 152
5116A52m2k50LK52L3k45p4K28J05k15j53K09J71j65k09J43K23j02k40O9K57m3
$$ 152 110 -140 -137 115 148 -97 -171 57 162 -53 -206 3 174 9 -200 -57 166 64 -176 -107 150 107
5138A07k52kK69J4k36p4K31J13k21j27J83J76j71j94J37K15j01k36O3K52l1k45
$$ 107 -145 -147 122 136 -100 -174 57 170 -51 -178 5 181 10 -184 -47 168 67 -169 -106 146 115 -130
5160a30j4K37O1k46q4K34J08k16j41J78J89j64k11J40K11q7k36N7K45k5k45rK43
$$ -130 -144 93 154 -92 -176 58 166 -50 -191 -13 176 12 -199 -59 152 65 -171 -114 131 106 -139 -148 95
5183I5N6k40q6K28J21k00j63J88J79j47k05J38K04r4k33M9K47k0k48j9K51M9k32
$$ 95 151 -89 -175 53 174 -26 -189 -1 178 31 -174 -36 168 74 -159 -110 137 117 -131 -150 101 150 -82
5206h2r4K13J26j85j71J94J78j52k05J05K27q8k23M7K39l1k23l2K49M8k26q8K08
$$ -82 -176 37 163 -22 -193 1 179 27 -178 -73 154 66 -157 -110 129 98 -125 -157 92 140 -86 -174 34
5229C4J35j93j66J74J90j41k16J14K23o5k49M7K40J9k65k8K43O6k34q4K09J33
$$ 34 169 -24 -190 -16 174 33 -183 -69 154 89 -160 -113 127 146 -119 -147 96 162 -72 -156 53 186
5251A86k03j68J78J80j37k12J04K25p2k42M5K45ok44k9K24Q1k30r4K06J29j82
$$ 186 -17 -185 -7 173 36 -176 -72 153 81 -161 -116 129 123 -121 -150 74 155 -75 -169 37 166 -16
5273a6j63J63J71j21k19J15K12o6k29M9K26Lk43m0K40P8k33j02K11J47j86j74
$$ -16 -179 -16 155 34 -185 -70 142 76 -153 -104 122 125 -118 -158 82 160 -73 -175 36 183 -3 -177
5295a77J60J73j24k09R7K35o1k43K9K46Jk41l4K30Q5k41j09J94J50j77j78J53
$$ -177 -17 156 32 -177 -80 155 94 -149 -120 126 127 -114 -148 82 167 -74 -183 11 161 -16 -194 -41
5317d1J99j18k17R3K34n5k42K3K45Jk30n6K32R3k29j19K06J52j71j87J50K08j14
$$ -41 158 40 -177 -84 150 95 -147 -124 121 122 -108 -164 68 161 -68 -187 19 171 0 -187 -37 171 57
5340E7k26J05K29o4k42K0K35K3k34n6K36Q0k23j19K01J57j81j85J46K10j16k29
$$ 57 -169 -64 165 101 -141 -121 114 137 -97 -153 83 163 -60 -179 22 179 -2 -187 -41 169 53 -176
5362a76Q2K30l5k46oK56L5k50o5K44R1k10j36K04J63j96j72J50K21j23k29Q5K34
$$ -176 -94 136 101 -145 -151 105 140 -110 -175 69 160 -50 -186 18 181 -15 -187 -37 184 61 -168 -83 151
5385A51m0k44mK58L6k44q0K43J06k21j45K07J72j91j75J35K18j10k37P4K45m2
$$ 151 111 -133 -137 121 157 -87 -167 76 182 -39 -184 23 195 4 -171 -36 182 72 -165 -91 154 112
5407A12k48LK47L8k53p6K54R2k14j57K12J70j75j99J45K27j03k61Q9K52l3k68
$$ 112 -136 -133 114 152 -101 -177 77 169 -45 -202 10 180 5 -194 -49 178 75 -186 -97 155 122 -146
5429a46JK61M5k60n9K43J07k33j52K12J75j79k05J48K22r9k55P2K49k2k64j6K60
$$ -146 -145 116 161 -99 -158 85 192 -41 -193 19 194 15 -190 -42 180 81 -174 -102 147 125 -139 -155 105
5452A05P3k57r6K37J28k27j68K01J95j61k21J30K41j03k47N8K56j5k66k7K63P0
$$ 105 178 -79 -175 62 190 -37 -205 -4 191 30 -191 -61 180 77 -170 -112 144 129 -137 -164 99 169
5474A69k65q1K28J40k25j59J94J99j68k24J34K49r9k52M4K80j7k83k5K73O7k48
$$ 169 -96 -177 51 191 -34 -193 1 200 32 -192 -58 191 92 -160 -116 164 147 -136 -161 112 179 -69
5496f9j20K40J41k07j82J90K08j68k36J41K45j04k64N0K76Nk75m1K69Q6k65j13
$$ -69 -189 51 192 -15 -197 -7 201 33 -203 -62 183 79 -185 -135 141 146 -129 -170 99 185 -80 -193
5518a93K33J55k19j82J91K14j66k29J20K50p3k68L8K76jk65n6K77Q1k61j13K39
$$ -193 40 195 -24 -206 -15 199 33 -196 -76 174 101 -167 -129 147 146 -119 -175 102 183 -78 -191 48
5540D8J62k16j98J89K12j48k53J19K63p4k73L1K77K1k90n7K85Q7k72j29K38J76
$$ 48 210 -6 -204 -15 197 49 -204 -85 178 104 -169 -138 139 160 -130 -187 98 185 -87 -216 22 198
5562A98k01k18J74K42j35k63R8K76o8k76K0K89J9k79n7K63J16k61j43K33J72j83
$$ 198 -3 -221 -47 195 60 -203 -105 171 103 -173 -153 136 155 -124 -181 82 198 -63 -206 27 199 16
5584A6k28J85K19j41k47J00K72m9k80PK78L7k79q6K80J14k50j57K15J90j87k29
$$ 16 -212 -27 192 51 -196 -96 176 127 -153 -146 132 169 -110 -196 84 198 -52 -209 6 196 9 -220
5606b20J69K47j33k72R3K85l8k87mK90M4k87q5K67J36k59j62K35K04j93k24J37
$$ -220 -51 196 63 -209 -116 169 131 -156 -160 130 174 -113 -198 69 205 -54 -216 19 223 30 -194 -57
5628e7K62j22k75R0K85l4l09mK90N2k86q7K72J29k59j54K12K11j86k43J61K56
$$ -57 205 83 -192 -102 183 149 -160 -164 126 178 -108 -195 77 206 -53 -207 5 216 30 -213 -52 204
5650B04j25k64O8K72k0k92oK85N8k90q5K65J39k44j75K19K08j92k43J43K70r8
$$ 204 79 -185 -117 155 135 -157 -163 122 180 -110 -195 70 209 -35 -210 9 217 25 -218 -75 195 97
5672I7k77N1K96ml09pK69O8k58j22K59J45k30j88K10K26j95k44J45K70r8k84N1
$$ 97 -180 -129 167 163 -146 -153 116 184 -74 -196 63 208 -22 -210 0 226 31 -213 -68 202 104 -180 -129
5695a29K90kk99l0K87O9k70j02K33J56k18k04K11K01j61k37J21K69r2k73M5K88
$$ -129 161 159 -140 -170 117 186 -84 -186 47 203 -15 -219 -8 193 32 -205 -84 185 93 -180 -135 153
5717A53rk79n1K88R7k93j14K51J63k18k08K16K23j69k50J26K61r1k74M6K84Ok88
$$ 153 144 -135 -186 102 199 -94 -208 43 206 -12 -220 -4 219 50 -200 -74 187 96 -178 -132 152 158 -130
5740a30n4K86Q6k69j20K53J57k23k02J92K30j48k68J30K62o9k94L2K99%k89m5
$$ -130 -184 102 188 -81 -201 52 209 -14 -216 -24 206 58 -210 -80 182 113 -181 -149 150 150 -139 -184
5762a84K75J04k67j37K47J70k19k09J83K48j59k49J12K78o6k97L9K71L9k95o0
$$ -184 91 195 -72 -209 38 208 -11 -220 -37 211 52 -197 -85 193 127 -170 -131 140 179 -116 -176
5783a76K66J10k62j47K48J68k16k07J82K50j70k56J04K84o6k77J8K93K1l01o2
$$ -176 90 200 -62 -209 39 207 -9 -216 -34 216 46 -210 -106 178 112 -165 -147 146 167 -134 -196
5804a96K74J16k55j58K42J81k01k23J75K52j35k80J02K84n3k94K4K78L3k82q5
$$ -196 78 194 -61 -219 23 204 3 -220 -45 207 72 -208 -106 178 125 -169 -145 133 166 -116 -201
5825b01K94J08k55j58K41J89k03k19J61K53j42k54Q6K74n6k86J3K86M1k95o6K54
$$ -201 93 201 -54 -212 29 218 15 -204 -43 210 68 -186 -100 174 118 -168 -155 131 172 -123 -189 65
5847F5J29k52j56K29J96k16k23J78K53j39k64Q9K84m9k83%K75N2k72q5K75J19
$$ 65 194 -58 -214 15 211 -5 -228 -50 203 64 -200 -111 173 124 -159 -159 116 168 -104 -189 86 205
5869B05k55j61K27K05k08k31J76K52j34k69P0K92l5k99NL00K9k66r8K66J31k56
$$ 205 -50 -211 16 221 13 -218 -42 210 76 -193 -123 169 134 -165 -160 140 169 -97 -195 71 202 -54
5891e4j67K28K01k10k29J70K55j34k63Q7K84l9k86rK81N2k86q4K74J30k37j81
$$ -54 -221 7 208 -2 -231 -61 194 60 -203 -116 168 129 -157 -166 115 167 -119 -203 71 201 -36 -217
5913b17K24K02j87k50J80K51j15k85Q4K85m7k81j0K94P1l09r4K73J40k67j65K27
$$ -217 7 209 22 -228 -48 203 88 -197 -113 172 125 -156 -166 128 199 -110 -204 69 209 -58 -223 4
5935DK09j86k55J61K70j31k78P4L08l6l06jK77P0k93r9K76J45k48j91K28K07j83
$$ 4 213 27 -228 -67 203 72 -206 -132 176 140 -166 -167 110 180 -113 -212 64 209 -39 -230 -2 205 22
5958B2k35J51K55j11k82P5L03k1l03j4K88N8k87j04K63J43k29j85K05K26j79k65
$$ 22 -213 -62 193 82 -200 -125 178 157 -146 -160 128 186 -101 -205 58 201 -28 -213 -8 218 39 -226
5980b26J58K68r7k98O4K88j8k94k4K94P0k90j15K84J47k45k09K32K31j93k45J43
$$ -226 -68 200 103 -195 -131 157 139 -155 -179 115 185 -105 -220 64 211 -34 -243 -11 220 27 -218 -75
6002g5K77j03k98O5K99j3l13k0K97P3k77j21K71J54k53j95K16K31j64k66J51K67
$$ -75 202 99 -199 -134 165 152 -161 -181 116 189 -88 -209 62 216 -37 -232 -16 215 51 -215 -64 203
6024B03j06k83N9K91ll03m0K87J02k99j28K68J73k56j98K12K33j77k54J33K85
$$ 203 97 -186 -127 164 161 -142 -182 105 207 -92 -220 48 221 -35 -233 -21 212 35 -219 -86 199
6045A99r6l06P5K91nl05m3L13P8k98j20K58J81k37k18K16K30j64k69J38K95r9
$$ 199 103 -203 -128 163 158 -147 -190 123 201 -97 -217 41 222 -15 -233 -17 213 49 -220 -82 213 114
6067A14l02N5L10j0l04n1L06R1k95j33K66J70k35k14J99K56j75k66J35K77q2k91
$$ 114 -188 -133 177 167 -137 -188 118 209 -86 -219 47 217 -18 -232 -33 223 48 -218 -83 194 112 -179
6089a79L1L01J9l22l3K86J04k88j50K72J96k49k21K06K59j65k86J31K95p4l05
$$ -179 -148 153 172 -150 -183 103 207 -81 -231 41 237 -12 -233 -27 232 67 -219 -88 207 133 -172
6110a72K1L16J1l00o7K89J14k80j60K69J94k34k21J85K72j74k76J11L03o6l20
$$ -172 -151 165 176 -124 -191 98 212 -68 -228 41 235 1 -220 -35 237 63 -213 -102 201 135 -185
6131a85K4L11K7l11q2K95J38k98j57K62K01k25k30J88K50j44k83J16K97p1l06
$$ -185 -161 150 177 -134 -216 79 217 -81 -238 24 225 0 -230 -42 208 64 -219 -103 194 123 -183
6152a83NL25L4l16o8K99J26k77j68K47K13k26k42J84K71j46k97J03L01n0l02j2
$$ -183 -178 147 181 -135 -203 96 222 -55 -223 24 237 11 -231 -47 224 78 -219 -116 185 135 -167 -179
6174a79L21M8l07r0K92J40k90j69K49K08k20k37J73K75j33l04J04L02n3l01j3
$$ -179 142 190 -117 -207 85 225 -65 -234 15 223 3 -234 -61 214 81 -223 -119 183 130 -171 -184
6195a84L17M6l05q6L00J33k71j87K40K37k24k50J75K82j29l05Q1L17m1l18kL10
$$ -184 133 179 -126 -212 88 221 -50 -237 3 240 16 -234 -59 223 94 -211 -130 187 146 -172 -174 136
6217A36M8l07r9K94J41k64j78K39K08k05k44J66K73j10l05P2L13k6l27j2L14O5
$$ 136 184 -123 -222 72 213 -51 -229 10 218 13 -231 -65 208 98 -207 -135 178 152 -175 -187 127 192
6239A92l05j14K85J55k53k08K47K21k11k49J67K88j37k83O3L27k1l22k7L11Q1
$$ 192 -113 -227 58 213 -40 -248 -1 220 9 -240 -73 215 78 -205 -142 185 164 -158 -185 126 207
6260B07l01j14K72J58k49k03K25K28j86k61J54K80j12k88N1K98rk99m0L02Q1k87
$$ 207 -94 -208 64 222 -27 -230 -5 223 37 -224 -70 210 98 -190 -139 159 150 -149 -189 113 194 -93
6282i3j12K65J64k49j96K16K21j78k57J39K73r8k92O9K85ml00l1L05O3k83j20
$$ -93 -205 60 224 -25 -221 -5 216 38 -219 -80 193 95 -197 -128 157 153 -147 -178 127 190 -93 -213
6304b13K72J67k41k11K20K32j78k65J36K90j03k99N2L06j1k99l2K96P7k83j30
$$ -213 59 226 -15 -226 -6 226 48 -217 -81 209 106 -193 -141 165 154 -145 -177 119 196 -87 -217
6325b17K67J68k42k10K12K29j66k62J31K82q6k98N0K85J7k98m5K84R3k79j23K49
$$ -217 50 218 -24 -234 -22 207 41 -221 -90 192 106 -192 -142 143 160 -138 -183 101 194 -85 -208 41
6347D1J58k15k08K10K24j53k56J16K68p3k98M9K90J2k92n8K79J10k80j37K54J65
$$ 41 199 -16 -224 -14 210 57 -199 -83 185 112 -186 -137 153 165 -127 -185 94 204 -76 -213 41 206
6369B06k07k12J88K34j51k62J12K64o5k85L6K82J7k84o3K84J05k79j21K38J70
$$ 206 -1 -213 -25 209 58 -204 -92 172 107 -178 -142 140 157 -127 -190 94 199 -80 -201 37 207
6390B07k17k16J86K49j55k48J07K72p6k91L9K92Nk86m1K74J00k66j46K40J86k26
$$ 207 -10 -226 -40 209 54 -194 -87 185 109 -182 -143 149 154 -132 -173 101 201 -65 -211 29 215 -11
6412a1k05J85K36j53k53J23K47n5k89L8K78J0k72n6K63Q7k34j49K43J73k20k00
$$ -11 -216 -31 205 52 -201 -78 169 114 -175 -137 141 151 -121 -177 86 173 -61 -210 33 206 -14 -214
6434b14J79K31j43k60J11K69n8k89L1K74K8k92m8K64J06k49j39K28J74k12j98
$$ -214 -35 196 53 -207 -96 173 115 -174 -143 131 159 -133 -181 83 189 -60 -199 29 203 -9 -207
6455b07J74K39j47k51J02K51n0k74K7K69K5k79o5K58J05k41j35K20J67j99j84
$$ -207 -33 206 59 -192 -90 161 111 -163 -136 133 158 -121 -186 72 177 -64 -199 21 188 -11 -195
6476a95J55K36j44k38J00K52n5k72K4K58L4k74o4K53J10k45j36K21J80j95k13
$$ -195 -40 196 52 -186 -86 166 111 -161 -137 121 155 -119 -183 70 180 -65 -201 20 200 5 -208
6497b08J67K25j20k51R0K58n3k53J1K65J8k59p5K67R0k33j33K19J67k00j96J60
$$ -208 -41 184 64 -187 -97 161 108 -145 -134 131 149 -110 -185 82 172 -61 -194 25 192 -8 -204 -44
6519d4K15j16k32P4K62n5k44pK67J9k42n8K41R4k28j30K03J63j94j72J43K21j24
$$ -44 171 55 -177 -103 159 104 -140 -147 120 139 -103 -161 80 174 -54 -184 19 182 -12 -184 -41 180 56
6542E6k28Q9K53n3k66K3K51K4k58n2K42R5k33j33K17J67j80k00J49K28j25k54
$$ 56 -172 -83 170 117 -149 -126 125 149 -109 -161 81 176 -57 -190 27 194 14 -186 -37 191 66 -188
6564a88J04K40m8k60K1K55K3k43q0K57J02k26j48K10J59j75j94J50K17j12k39
$$ -188 -84 156 108 -152 -131 124 147 -96 -176 81 183 -43 -191 19 178 3 -191 -41 176 64 -175
6585a75Q9K44m5k52QK58J1k38o7K41R1k21j28K18J46j77j85J49K07j14k28R2K32
$$ -175 -86 158 113 -139 -131 127 138 -100 -167 74 165 -56 -184 34 180 3 -182 -33 174 60 -168 -76 156
6608A56m8k40RK45J3k48n8K32J05k12j36J98J67j80j91J51K09j25k29R4K38l7
$$ 156 108 -132 -123 122 135 -113 -171 61 166 -46 -182 16 183 3 -188 -37 172 47 -182 -88 150 113
6630A13k53PK50K9k53o2K47R3k24j28J96J60j68j97J62K06j25k18P1K38m5k33
$$ 113 -140 -133 117 146 -107 -169 78 171 -53 -181 15 175 7 -190 -28 178 53 -165 -94 144 99 -134
6652a34PK49K3k37p1K38R6k18j29J94J59j73j90J53K03j10k21O9K20k5k59K0K52
$$ -134 -127 122 145 -92 -163 75 171 -47 -176 18 177 4 -186 -33 170 60 -161 -92 128 103 -156 -136 116
6675A16K8k38p3K25J12k16j24J81J62j71j78J55K08j21k22Q0K26m3k46J0K41K7
$$ 116 144 -94 -167 58 170 -46 -170 11 173 2 -176 -21 187 66 -156 -76 150 107 -139 -129 112 139
6697A39k38n8K21J06k16j37K01J52j65j83J42J96j05k17P6K32m9k33J2K39J7k29
$$ 139 -99 -157 64 170 -46 -183 18 170 5 -178 -36 160 55 -162 -86 146 97 -136 -124 115 132 -97
6719i7p3K39R0k14j24J88J49j50j82J36J99j00k10O0K30m1k27jK29L7k26p0K27
$$ -97 -170 69 159 -55 -179 9 158 8 -174 -38 161 61 -149 -89 141 100 -127 -128 101 138 -88 -158 69
6742F9J02k16j30J91J65j85j55J20K09j01k26O8K39m4k41PK51K2k49m8K11J05
$$ 69 171 -45 -175 16 181 -4 -159 -39 170 69 -157 -89 150 106 -135 -128 123 145 -104 -152 59 164
6764A64k08j24J96J44j82j61J33K08j21k05O7K28l8k35J5K18M0k14o8K08R7k04
$$ 164 -44 -168 28 172 -10 -171 -38 170 49 -156 -89 139 101 -134 -119 99 139 -75 -143 65 162 -42
6786d2j28J92J42j54j73J25J97j02k17P0K25k3k25jK13L3k20o2K14R5k02j22J80
$$ -42 -170 22 164 10 -163 -38 159 57 -160 -90 135 112 -113 -114 99 132 -88 -150 64 159 -43 -165 15
6809A5J53j63j80J36J96r5k09N5K31m5k26NK23L9k18q0K18J07k08j30J90J52j57
$$ 15 168 5 -175 -39 157 62 -147 -92 139 94 -132 -127 96 135 -83 -163 55 162 -46 -176 14 166 9
6832Ij76J25J92r1k10P1K18l9k30OK21M4k29p0K11R6j89j23J81J45j49j73J31
$$ 9 -167 -42 150 59 -151 -80 138 99 -131 -125 96 140 -89 -159 52 148 -41 -164 17 162 13 -160 -29
6855b9J64q6k00N7K18m0k03MK07L6k16n9K09Q6j98j14J72J54j57j73J22J90q6
$$ -29 135 49 -151 -94 124 84 -119 -115 92 128 -88 -147 62 148 -50 -164 8 162 5 -168 -46 144 58
6878E8k05P6K00l3k24QK21K2k04n7J86R9j89j15J70J45j50j61J15J86r8k09P3
$$ 58 -147 -71 129 96 -128 -120 101 123 -81 -138 48 147 -42 -157 13 158 8 -153 -38 148 50 -159 -86
6901h6K14m2k12NK08L2k13m7K03P5j82j12J76J28j44j53J06J79r0j86N7K15m2
$$ -86 128 86 -126 -121 87 119 -94 -141 62 137 -45 -157 19 147 3 -150 -44 135 45 -141 -84 131 89
6924H9k03NK03K2k01o0J99Q1j80j20J84J34j43j70J32J79j07j90O7K06l2k10L
$$ 89 -114 -109 94 116 -85 -145 54 135 -45 -165 19 153 10 -160 -28 151 44 -146 -79 127 95 -115 -112
6947a12K13K3k15l3J80Q8j94r3J57J26j38j55J22J81j05j80O7J99n0j93J8J98
$$ -112 101 124 -91 -124 56 144 -50 -143 14 140 2 -153 -31 150 45 -135 -68 131 81 -112 -94 104
6969A04Mj91m1J73Q2j71j05J66J27j46j49J31J64j03j82Q1J70l3j90RJ95Rj93
$$ 104 108 -83 -124 49 131 -40 -145 21 148 2 -147 -16 148 45 -137 -56 114 81 -109 -100 95 104 -89
6992h9m2J90P4j75r8J63J11j30j45J23J61j04j64O9J79n4j87L1J91Lj94l5J94
$$ -89 -131 59 133 -42 -140 23 134 4 -141 -18 143 39 -125 -56 123 69 -118 -87 104 107 -87 -122 72
7015G2M9j86q2J72J24j69j22J22J62j12j80R5J83n3k01K7K02jk06j6J83O7j69
$$ 72 121 -65 -147 25 149 -20 -142 -20 142 30 -150 -55 128 75 -126 -99 103 102 -104 -120 63 130 -39
7038c9r4J61J16j60j31J31J49j01j86R3J91o3j91L6J94Mk07l0J97O0j84q8J73
$$ -39 -133 28 144 -16 -147 -16 133 32 -154 -61 130 67 -124 -88 106 110 -97 -127 70 130 -54 -142 31
7061C1J07j50j44J43J52j13j74R9J82o9j81K2J98kk00k4K02M8j80p5J70J00j57
$$ 31 138 -12 -156 -13 139 26 -148 -49 133 64 -117 -95 103 101 -99 -123 79 127 -53 -128 42 142 -15
7084a5j31J33J64j27j75J09J70o0k00M4J96%k12nJ84M5j82p7J64J05j53j30J40
$$ -15 -146 -13 151 24 -151 -42 128 68 -132 -88 108 108 -104 -109 75 120 -62 -139 25 130 -23 -153 -13
7107a3J51j17j70J00J78o6j88N2J84qk00nJ81M4j79q2J85R6j66j23J44J46j24
$$ -13 138 21 -149 -49 129 63 -125 -73 111 103 -97 -102 79 123 -56 -138 47 143 -23 -146 -2 144 20
7130B0j68R9J90q4j76K8K04nk12j9K00M8j81q4J73R8j59j20J42J43j25j63J01
$$ 20 -148 -49 141 57 -119 -91 113 108 -104 -123 77 125 -56 -140 33 131 -28 -148 -6 137 12 -151 -50
7153e0J83o6k10N4J86j3j89k0J91O4j95p9J89J03j73j16J35J45j24j56Q9J89p5
$$ -50 133 67 -143 -89 97 84 -105 -125 66 130 -65 -144 45 148 -25 -141 -6 139 15 -141 -52 137 62
7176F2k02O2J92qk10k4K16M0j96p9J80J07j63j27J41J54j19j78J03J91q6j92O1
$$ 62 -140 -78 114 106 -104 -128 88 128 -68 -147 33 140 -23 -150 -9 145 26 -152 -49 142 56 -136 -75
7199g5K02l5k09nJ96M9k04o7J98Q7j64j31J52J67j28j79J01J85p2j95N2J98j4
$$ -75 127 92 -117 -122 74 123 -81 -148 50 137 -27 -158 -6 161 33 -146 -45 140 68 -127 -75 123 109
7222A09k10oJ96L3j83p0J82R6j84j04J45J50j36j59J05J83q4j97M7K04j9j98j7
$$ 109 -101 -107 89 122 -61 -131 51 147 -37 -141 4 154 18 -141 -36 147 63 -134 -87 117 98 -100 -117
7245a17J91N3j88q5J97J01j72j39J62J43j39j57R3K02p9k02M6J98Kk18k1K21M7
$$ -117 74 127 -61 -146 51 152 -20 -159 3 146 7 -150 -57 145 66 -136 -90 108 110 -108 -129 92 139
7268A39j90r4J90R6j60j23J48J53j34j68R7J83p4j94L7K09rk13j0J98O0k04q1
$$ 139 -51 -145 45 141 -19 -142 6 159 25 -143 -46 137 63 -131 -94 115 106 -107 -117 81 141 -63 -144
7291a44J79J09j68j28J45J61j35j60R3J80o3j94M7J92j7k01k2K20M1k01p1J80
$$ -144 35 144 -24 -152 -7 154 19 -141 -48 132 69 -125 -78 114 97 -104 -126 94 135 -66 -137 43
7313D3J01j61j34J52J56j39j68R9J95p1k06N3K00j7k03j6K08M3k02o9J80R8j60
$$ 43 144 -17 -151 1 157 18 -150 -51 144 73 -133 -80 120 103 -100 -116 92 135 -67 -136 44 142 -18
7336a8j37J51J62j29j81J07J75p2j88L5K09j6k03j6K05L3j70r2J76J04j53j24
$$ -18 -155 -4 158 29 -152 -45 130 58 -130 -95 114 98 -105 -121 84 117 -53 -145 31 135 -18 -142
7358a42J36J43j16j73Q8J96p4j85K8K04rk06j5K11N2j97q2J82J09j71j36J62J42
$$ -142 -6 137 21 -152 -64 132 58 -127 -99 105 96 -110 -125 86 138 -59 -141 41 150 -21 -157 5 147
7381A47j19j79Q8J98p0j91L6K00rj98k4J91N4j86q0J78J05j60j32J37J50j18j63
$$ 147 28 -151 -63 135 65 -126 -90 110 101 -97 -121 70 124 -62 -142 36 141 -19 -151 -14 136 18 -145
7404a45R1J88q7j70L0K05%k04l0J96N7j90p3J69J13j68j29J42J41j04j69R6J75
$$ -145 -54 134 47 -123 -93 112 112 -92 -122 74 131 -59 -132 37 150 -18 -147 -5 136 32 -137 -41 134
7427A34p0j94L9K00mj95l3K04M5j77q3J70J02j61j15J31J42j10j68Q1J87o5j92
$$ 134 64 -130 -91 109 105 -90 -123 81 126 -51 -134 36 138 -23 -138 -7 135 25 -143 -62 125 60 -132
7450a32M1J85J1k03j8J86N4j76p9J63J15j52j44J48J48j20j55Q9J64n3j82K4J91
$$ -132 -91 94 105 -98 -116 70 124 -52 -131 32 147 -5 -149 -1 147 27 -128 -39 125 72 -110 -86 105
7473A05lj90k0J89L3j73p8J71J05j51j40J48J42j08j76R5J80p3j80L5J91j0j81
$$ 105 102 -88 -108 81 114 -59 -137 34 139 -12 -152 -4 138 30 -146 -51 129 56 -124 -89 102 92 -89
7496h9l5J86O6j85q1J70J02j56j23J40J44j10j65R5J72o2j87M2J87Jj99k8K00
$$ -89 -124 62 128 -57 -138 32 134 -22 -145 -5 139 29 -136 -41 131 69 -118 -76 111 112 -87 -115 85
7519H5N0j81r5J71J08j60j14J28J44j05j59Q0J78o9j84M3J81rj87j4J73O6j72
$$ 85 135 -46 -141 30 138 -22 -136 -8 136 31 -128 -48 130 61 -123 -80 101 92 -95 -109 64 130 -42
7542d2q9J64Q8j46j13J29J48j17j46Q1J74p1j71K9J90j2j72m3J97N8j81q1J61
$$ -42 -131 33 121 -25 -138 -9 139 22 -124 -43 131 60 -111 -82 108 96 -76 -119 78 136 -45 -126 35
7565C5J05j58j13J23J41j02j63P8J87p2j77K5J84Qj91j3J77L8j85n1J49J07j47
$$ 35 140 -18 -131 -8 133 31 -132 -54 133 61 -116 -91 93 101 -90 -103 74 112 -73 -124 25 132 -15
7588a5j12J09J41j01j55Q6J74n6j76K9J64Nj75k9J78M2j61o9J51R2j33j28J34
$$ -15 -127 -18 123 22 -133 -47 127 71 -105 -76 88 93 -82 -111 67 109 -52 -121 30 122 -11 -139 -5
7611eJ34j02j46Q2J61n7j73K4J78Jj79j5J62N8j78o7J54Q5j31j00J19J17j01j50
$$ -5 129 27 -119 -37 124 67 -106 -82 96 97 -82 -97 65 123 -55 -122 32 117 -14 -114 5 122 21 -129
7635a29R1J51n1j82M7J69j5j68j8J79L5j55p7J57R0j31j29J23J42r9j56P6J58
$$ -129 -38 113 62 -120 -73 96 81 -87 -105 74 109 -46 -123 34 124 -7 -136 -13 129 30 -126 -50 108
7658A08n4j58J8J78Oj74j5J70M1j65q5J60R2j29j15J24J29j07j39P2J65o1j61
$$ 108 54 -104 -86 92 98 -76 -91 79 120 -45 -130 30 122 -7 -122 2 131 24 -115 -43 122 61 -100
7681a00K8J65j2j74j5J75M9j69p1J60R3j42j25J30J42r9j59Q4J62o6j59M0J65
$$ -100 -72 93 81 -93 -108 67 116 -53 -124 36 129 -13 -138 -8 134 35 -124 -40 122 56 -103 -63 102
7704A02j0j72j2J61L9j59n7J55Q1j42r8J14J24j02j42P8J59n7j61L3J68j8j67
$$ 102 92 -80 -92 69 108 -51 -108 47 128 -14 -112 2 126 24 -118 -40 119 62 -99 -66 102 84 -83
7727h3j5J72L5j62o6J53Q3j26j14J07J42j05j34Q1J38n1j53L3J60j2j73JJ51M1
$$ -83 -98 74 109 -53 -119 34 117 -9 -123 -16 126 21 -113 -32 106 55 -98 -65 95 83 -90 -89 62 103
7751A03j50p1J54R8j39j16J16J31r5j50R2J41m7j72L6J67j2j67j0J46M9j57o4
$$ 103 -47 -118 36 134 -5 -121 -5 126 31 -119 -27 114 67 -105 -69 98 86 -81 -91 55 104 -53 -117
7774a17J57R0j36j21J25J21q9j47Q6J41n1j63L4J63pj67%J42L5j48o3J49Q3j27
$$ -117 40 130 -6 -127 -2 119 30 -117 -31 110 59 -104 -70 93 86 -81 -81 61 96 -52 -115 34 117 -10
7798a0j13J15J25r6j22O3J58n8j68M5J57nj58k6J51M8j62n6J44Q8j40j00J13J27
$$ -10 -123 -8 117 21 -101 -38 120 62 -106 -61 96 91 -67 -93 58 106 -56 -112 32 120 -20 -120 -7 120
7822A20j04j39Q4J53o0j54K4J74j4j69j5J65L8j47p1J49Q5j31j08J15J22r7j28
$$ 120 16 -123 -39 114 54 -100 -76 98 84 -85 -100 65 103 -44 -115 34 119 -12 -120 -5 117 20 -108
7845a08P1J50n3j52K1J58Kj52k6J61K6j44n4J43O6j12r9R9J23r4j23P2J33n9j40
$$ -108 -37 113 60 -92 -71 87 89 -63 -89 72 98 -46 -100 43 109 -3 -102 -3 120 26 -97 -25 108 49 -91
7870i1K8J53j1j49k1J56M1j50p3J33Q8j25r6J14J15q8j22N9J53m8j69M7J40rj54
$$ -91 -63 90 79 -70 -91 65 106 -44 -117 16 104 -21 -117 -3 112 24 -98 -39 114 66 -103 -56 84 75 -79
7895g9j5J54M7j54n4J37Q2j34r5J20J10r0j24N8J42n5j40L3J56j3j49j7J39M8
$$ -79 -94 60 107 -47 -101 36 118 -16 -111 9 119 29 -95 -37 105 50 -90 -57 99 86 -63 -80 59 107
7919A07j54l9J15P6j21r4J08J10p5j39P0J39n5j44L9J27Jj50JJ47K0j34m8J25
$$ 107 -47 -86 29 105 -16 -110 -2 108 33 -106 -36 103 48 -96 -57 70 71 -79 -78 69 89 -45 -93 32
7943C2O7j13q6R8J18q5j26P4J15m2j53M4J52l3j35kJ35L5j40m7J21Q4j21r6J07
$$ 32 99 -14 -100 -2 116 31 -95 -21 94 52 -101 -57 95 62 -73 -75 60 95 -45 -92 29 113 -8 -104 3
7968CJ07r5j12P5J29n8j39L3J39j3j40j8J42L0j43l1J27N6j09r1J09J09j03r8
$$ 3 110 15 -97 -22 107 49 -90 -57 82 69 -71 -89 53 83 -60 -91 36 92 -17 -108 1 110 7 -91
7992i1O9J23n3j25K3J44j7j46MJ28K4j24n7J22O7j00r1J00R9r3j02P7J14n7j22
$$ -91 -22 101 48 -77 -54 90 73 -73 -69 59 83 -41 -98 24 91 -9 -100 0 99 6 -96 -19 95 38 -84
8017h4K5J38j7j26j1J34J9j27m3J22O4j07q2R9Q7p6j22R3J04n9j19L4J32j4j25
$$ -84 -59 79 62 -64 -75 59 78 -49 -92 30 94 -13 -95 4 91 15 -107 -14 90 31 -88 -54 78 64 -61
8042f1j2J41Qj20l6J20O1j25p5J13P6q2j00P7J14o4j17M1J21j0j33lJ31J8j26
$$ -61 -73 68 76 -44 -80 40 101 -24 -99 14 90 8 -92 -15 99 35 -82 -41 80 70 -63 -66 65 83 -43
8067d3l7J16N3j13p5R7J01r2r9P9J00n1j18L5J30k4j35J9J27J3j24l7J04O9j18
$$ -43 -80 36 89 -24 -99 -2 99 7 -92 -13 87 36 -82 -47 83 59 -76 -57 70 83 -41 -78 26 95 -23
8092b3p6J07Q7r2q8P5J10o1j19M5J12j9j20pJ28J8j20l6J25M3j11o4J05P4r9q2
$$ -23 -99 8 95 3 -85 -10 100 39 -80 -35 77 58 -62 -69 59 77 -43 -79 46 89 -22 -86 19 93 -6 -88
8118h8P3R7n3j11M1J28k9j30J1J18J7j38qJ08N7j08o9J03O9q2q3O3J04n7j24O4
$$ -88 -15 82 29 -82 -41 87 58 -72 -61 57 74 -64 -72 36 93 -15 -84 19 88 6 -77 -14 90 33 -91 -27
8144b7J09l3j19J1J20Rj15k8J11N0j12n9J03O6q4r5Q0J01n8j19O0J10l6j20PJ25
$$ -27 82 49 -70 -59 61 70 -45 -73 38 88 -24 -83 20 86 2 -93 -13 88 30 -89 -29 81 45 -75 -68 57
8170E7J5j30j6J16M8j20n4J07P9r3q6Q2R2p2j09N8J05j1j36K8J06
$$ 57 72 -58 -74 42 90 -30 -84 23 102 9 -77 5 97 25 -84 -26 79 68 -68 -40 66
8191F6
$$ Imaginary data points
##PAGE= N=2
##DATA TABLE= (X++(I..I)), XYDATA
0@%%%%%%%%%%%%%%Qj6J6j6J6j7K5l2L8m6M9n7P2q1R0j06J22j38J59j83K07k31
$$ 0 0 0 0 0 0 0 0 0 0 0 0 0 0 0 8 -8 8 -8 8 -9 16 -16 22 -24 25 -32 40 -41 49 -57 65 -73 86 -97 110 -121
36a21K58k91L26l64M07m54N03n55O15o82P52q28R16j012J111j222J348j487J640
$$ -121 137 -154 172 -192 215 -239 264 -291 324 -358 394 -434 482 -530 581 -641 707 -780 860
55H60j815K015k240K498k800L163l601M141m836N768p077R066j2492J9964o3773
$$ 860 -955 1060 -1180 1318 -1482 1681 -1920 2221 -2615 3153 -3924 5142 -7350 12614 -51159
70e1159O2735J31750j53029j21123J10723J53818r9369j56402O5359J72820m5853
$$ -51159 11576 143326 -9703 -130826 -20103 133715 34346 -122056 -56697 116123 70270
81G0270j71969J4382J77874P708j71791l6942J68811N9220j56602q5312J45132
$$ 70270 -101699 -87317 90557 98265 -73526 -110468 58343 117563 -39039 -124351 20781
92B0781J05288j26350j26052J07439J40608q3447j53612N9918J60642l3867j65019
$$ 20781 126069 -281 -126333 -18894 121714 38267 -115345 -55427 105215 71348 -93671
103i3671R218J64389J6003j61226l9399J54184O2310j44761q3388J31983J03180
$$ -93671 -84453 79936 95939 -65287 -104686 49498 111808 -32953 -116341 15642 118822
114A18822j16668j20719R8234J35800p7447j47549N4461J55593l0219j59479N515
$$ 118822 2154 -118565 -20331 115469 38022 -109527 -55066 100527 70308 -89171 -83656
125h3656J59322J8763j55196m1918J47694O3492j37144q3135J24023J00748j08607
$$ -83656 75666 94429 -60767 -102685 45009 108501 -28643 -111778 12245 112993 4386
136D386j16168R1054J29150p1627j39483N0492J46633k8066j50354M909J50242
$$ 4386 -111782 -20728 108422 36795 -102688 -52196 94437 66371 -83983 -79074 71168
147G1168J8233j46249m0523J38594O1300j27696p9843J14224R5987r8709j09578
$$ 71168 89401 -56848 -97371 41223 102523 -25173 -105016 9208 105195 6486 -103092
158a03092Q1668J20690o3403j29370M4092J35442k3877j38837K929J39112J8327
$$ -103092 -21424 99266 35863 -93507 -49415 86027 62150 -76687 -73758 65354 83681
169H3681j36130l9326J29670N9387j19931p7709J07246R3842r2128j07217P5205
$$ 83681 -52449 -91775 37895 97282 -22649 -100358 6888 100730 8602 -98615 -23410
180b3410J17813n6994j25529L8023J30480j8589j32756j082J32289K0773j29103
$$ -23410 94403 37409 -88120 -50097 80383 61794 -70962 -72044 60245 81018 -48085
191d8085m0235J22915N8962j13759p6432J01620R1968q6837j04890O9920J14861
$$ -48085 -88320 34595 93557 -20202 -96634 4986 96954 10117 -94773 -24853 90008
202I0008n1527j21562L2472J25111j3292j25672n502J23544K3658j18992m1031
$$ 90008 38481 -83081 -50609 74502 61210 -64462 -69964 53580 77238 -41754 -82785
213h2785J12128N7396j03070p2586R1740Q6238p8335r7940O2950J07239m6013
$$ -82785 29343 86739 -16331 -88917 2823 89061 10726 -87214 -24264 82975 36962
224C6962j13724K8096J17243r778j17686q251J15346K5547j10456m1728J03434
$$ 36962 -76762 -48666 68577 58799 -58887 -67138 48208 73755 -36701 -78429 25005
235B5005N6623r4552p0204Q3967Q2338p1808r2991N8022J01773m2746j08372K6214
$$ 25005 81628 -12924 -83128 839 83177 11369 -81622 -23600 78173 35427 -72945 -46731
247d6731J12349q834j13442q724J11550K5887j06758m1986R9492N6609r0089o9454
$$ -46731 65618 56784 -56658 -65382 46168 72055 -34703 -76689 22803 79412 -10677 -80131
259h0131P9005Q0450o6612q9590N3127R6768l8674j02063K3412J05158p542j05927
$$ -80131 -1126 79324 12712 -76878 -23751 73017 34343 -67720 -44308 60850 53308 -52619
271e2619q632J04158K4631r9708l9912R2742N3920q3428o6161P2342P6368n9911
$$ -52619 -61251 42907 67538 -32170 -72082 20660 74580 -8848 -75009 -2667 73701 13790
283A3790q4413M6637R0375l2871r4411J8776R6564m501r6935r924R5340K4274
$$ 13790 -70623 -23986 66389 33518 -60893 -42117 54447 49946 -46989 -56913 38427 62701
295F2701r1683l8250Q5785N1467p7728o3395O7681P3667n5947q1832M3068Q7794
$$ 62701 -28982 -67232 18553 70020 -7708 -71103 -3422 70245 14298 -67534 -24466 63328
307F3328k9461r1542J5618R3152j828r2859j1701R0733K4815q6912l7478Q1300
$$ 63328 33867 -57675 -42057 51095 49267 -43592 -55293 35440 60255 -26657 -64135 17165
319A7165M9468p3894o0526O4642P0290n3669p8280M1281Q4185k7879q7706J4090
$$ 17165 66633 -7261 -67787 -3145 67145 13476 -64804 -23523 60662 32783 -54923 -40833
331d0833Q8877m06q7794j2750Q4783K5080q0140l6517P4012M6984o6629n6465
$$ -40833 48044 47638 -40156 -52906 31877 56957 -23183 -59700 14312 61296 -5333 -61798
343f1798N7971O4823m8120p1857L7078P7342k5079q0905J2410Q2455N12q1825
$$ -61798 -3827 60996 12876 -58981 -21903 55439 30360 -50545 -38135 44320 44832 -36993
355c6993j3151P9151K5125p4598l6132O8537M5956o1246n4616N2946O2051m3820
$$ -36993 -50144 29007 54132 -20466 -56598 11939 57895 -3351 -57967 -5021 57030 13210
367A3210o8322L3820P3337k3042p6929J1548P8847M80p8814j2621P6750K4494
$$ 13210 -55112 -21292 52045 29003 -47926 -36378 42469 42949 -35865 -48486 28264 52758
379E2758p2619l5567O6623M5506n9094n3993N0381O0943m0867o6363L0754P0276
$$ 52758 -19861 -55428 11195 56701 -2393 -56386 -6005 54938 14071 -52292 -21538 48738
391D8738k0282p2813R530P3847J413p3381j2422P1271K3279o7439l3563O1859
$$ 48738 28456 -44357 -34827 39020 40433 -32948 -45370 25901 49180 -18259 -51822 10037
403A0037M3012n4682n1134M6186N7763l6767o2652K6796O5915j6690o7632O579
$$ 10037 53049 -1633 -52767 -6581 51182 14415 -48237 -21441 44474 27784 -39848 -33269
415c3269O7969L347o7095j3127O4998K2670o1654l1882N6927M0612n0805m8453
$$ -33269 34700 38047 -29048 -42175 22823 45493 -16161 -48043 8884 49496 -1309 -49762
427d9762M3335N5164l4646o0432K5159O4033j5148o5948N039O6192M874o4985
$$ -49762 -6427 48737 14091 -46341 -21182 42851 27703 -38245 -33206 32986 37860 -27125
439b7125j4396O2459K3373n8818l1804N4043L9615m8205m6717M1288N2914l3266
$$ -27125 -41521 20938 44311 -14507 -46311 7732 47347 -858 -47575 -6287 46627 13361
451A3361n7948K4336O1524j4630o3431M664O3587N250o2061j4701N9019K3390
$$ 13361 -44587 -20251 41273 26643 -36788 -32124 31463 36713 -25348 -40049 18970 42360
463D2360n4782l1174M9516L8039m3495m4024L6763M9108k9395n3263K1386N6401
$$ 42360 -12422 -43596 5920 43959 464 -43560 -6797 42311 12916 -40347 -18961 37440
475C7440j2801n8259L820N8752N339n7704j4345N5175K2844n1257l0530M6130
$$ 37440 24639 -33620 -29800 28952 34291 -23413 -37758 17417 40261 -10996 -41526 4604
487D604L7257m0140m2941L3487M7531k6391n1155J8885N3858j1082n5556K923
$$ 4604 41861 1721 -41220 -7733 39798 13407 -37748 -18863 34995 23913 -31643 -28720
499b8720N6186N493n5542j3977N3515K2296n0005l0059M5161L6943l9123m2690
$$ -28720 27466 32959 -22583 -36560 16955 39251 -10754 -40813 4348 41291 2168 -40522
511d0522L2203M7153k4757n0339J6977N2318r161n3184J355N3009O382n1818j3990
$$ -40522 -8319 38834 14077 -36262 -19285 33033 23872 -29312 -27957 25052 31434 -20384 -34374
524c4374M9594K1379m6238k8368M1752L4763l6164m0226K9613M4574k2359m7609
$$ -34374 15220 36599 -9639 -38007 3745 38508 2344 -37882 -8269 36305 13946 -33663
536c3663J4701M9301p004m9761n38M9119P734m7578j4579M5201K1062m2055k7188
$$ -33663 -18962 30339 23335 -26426 -26964 22155 29889 -17689 -32268 12933 33995 -8060 -35248
549c5248L8115L2907l3300l8023K7598M2405k1080m5722J3941M7841o455m8664
$$ -35248 2867 35774 2474 -35549 -7951 34454 13374 -32348 -18407 29434 22979 -25685
561b5685j092M8179Q432m6568j5317M3915K1616m0417k7371L6253L2490l1444
$$ -25685 -26777 21402 29834 -16734 -32051 11864 33480 -6937 -34308 1945 34435 2991
573B991l6996K6035M0815j9970m3839J3372M5879o278m6756j026M6324Q312m4624
$$ 2991 -34005 -7970 32845 12875 -30964 -17592 28287 22009 -24747 -25773 20551 28863 -15761
586a5761j5214M1711K1477l7854k6961L3261L1551k8171l5335K2714L8344j6972
$$ -15761 -30975 10736 32213 -5641 -32602 659 32210 4039 -31296 -8582 29762 12790
598A2790m0597J0959M2127m666m2780j832M2518Q412m1175j4876L8779K0943l5334
$$ 12790 -27807 -16848 25279 20613 -22167 -23999 18519 26931 -14244 -29120 9659 30602 -4732
611d732k6406L0982L1043k5975l4774K0522L7533j4814l9444Q993M0565l124m0957
$$ -4732 -31138 -156 30887 4912 -29862 -9340 28193 13379 -26065 -17072 23493 20369 -20588
624b0588k790M0622Q761l9468j4685L7422K0446l4375k5821L0349L0554k5462
$$ -20588 -23378 17244 26005 -13463 -28148 9274 29720 -4655 -30476 -127 30427 4965
636D965l4399J9906L7188j3960l8939P862L9658j856l9452l984L8459R566l6749
$$ 4965 -29434 -9528 27660 13700 -25239 -17377 22281 20425 -19027 -23011 15448 25014 -11735
649a1735j4869L4383J9888l1321k4524K7574K8695k3100l2200J7976L4903j2406
$$ -11735 -26604 7779 27667 -3654 -28178 -604 28091 4991 -27209 -9233 25670 13264
661A3264l6596O509L7290o44l6953n059L5743J0340l3776j5226L1277J9631k8278
$$ 13264 -23332 -16823 20467 19823 -17130 -22189 13554 23894 -9882 -25108 6169 25800 -2478
674b478k3623K4863K7229k0962l0367J6528L3003j1608l4890O227L5946o04l6038
$$ -2478 -26101 -1238 25991 5029 -25338 -8810 24193 12585 -22305 -16078 19868 19264 -16774
687a6774n069L5111J0528l3302j5582L0684K0041k7418k3910K3696K7171j9603
$$ -16774 -21843 13268 23796 -9506 -25088 5596 25637 -1781 -25691 -1995 25176 5573
699E573k9841J5240L1941j0530l3457N559L4313l49l4367m991L3544J0246l1764
$$ 5573 -24268 -9028 22913 12383 -21074 -15515 18798 18449 -15918 -20909 12635 22881 -8883
712h883j5226K9090J9659k5668k3401K1652K6367j7318k8571J2806L0098q244
$$ -8883 -24109 4981 24640 -1028 -24429 -2777 23590 6272 -22299 -9493 20605 12361
724A2361l0982L639L1348R91l1130n616L0303J0225k8820j4666K6574J8834k3613
$$ 12361 -18621 -14982 16366 17357 -13773 -19389 10914 21139 -7681 -22347 4227 23061 -552
737e52k2540J9992K5580j5892k7872J1451K9389o890l0177K358L0304K082k9864
$$ -552 -23092 -3100 22480 6588 -21284 -9833 19556 12666 -17511 -15153 15151 17233 -12631
750a2631o345K8906J0509k7445j4513K5438J8342k2802k1852J9499K4919j5606
$$ -12631 -18976 9930 20439 -7006 -21519 3919 22261 -541 -22393 -2894 22025 6419
762F419k7362J1225K8990o573k9771J834K9694K782k8921p063K7469J1058k5542
$$ 6419 -20943 -9718 19272 12699 -17072 -15238 14456 17238 -11683 -18746 8723 19781 -5761
775e761j4636K3148J7908k0374k0791J7208K3318j3638k5380R686K6853n428k7648
$$ -5761 -20397 2751 20659 285 -20506 -3298 20020 6382 -18998 -9312 17541 12113 -15535
788a5535R73K7649L444k6872p659K5368J1513k3302j4876K0770J7790j7951k0251
$$ -15535 -14562 13087 16531 -10341 -18000 7368 18881 -4421 -19297 1473 19263 1312 -18939
801a8939J4939K2302j1657k4010Q212K5317m507k6130N59K6370L496k5923p566
$$ -18939 -4000 18302 6645 -17365 -9153 16164 11657 -14473 -13914 12456 15952 -9971 -17537
814a7537K4723J1449k2840j4975K0344J8000j7391k0461J4123K2361j0673k3724
$$ -17537 7186 18635 -4205 -19180 1164 19164 1773 -18688 -4565 17796 7123 -16601
826a6601P149K4601l535k5028q4K4961L772k4401p457K3236J1062k1447j4446
$$ -16601 -9452 15149 11614 -13414 -13498 11463 15235 -9166 -16623 6613 17675 -3772 -18218
839a8218J9036J7386j6092j9793J2755K1532r171k2650N587K3142k051k3088j374
$$ -18218 818 18204 2112 -17681 -4926 16606 7435 -15215 -9628 13514 11463 -11625 -12999
852a2999K2653M651k1829p784K0635J0811j9032j3694J6974J6353j4495j8643
$$ -12999 9654 14305 -7524 -15308 5327 16138 -2894 -16588 386 16739 2244 -16399
864a6399J1532K0493q291k1736M813K2376j317k2373k108K1863N322k0859q319
$$ -16399 -4867 15626 7335 -14401 -9588 12788 11471 -10902 -13010 8853 14175 -6684 -15003
877a5003J9535J1063j7889j3598J5964J5901j3682j8000J1059J9748q103k1034
$$ -15003 4532 15595 -2294 -15892 72 15973 2291 -15709 -4650 15098 6995 -14039
889a4039M818K1772j366k1882k113K1343N440k0212q497J8606J1205j6647j3482
$$ -14039 -9221 12551 11185 -10697 -12810 8533 13973 -6239 -14736 3870 15075 -1572 -15054
902a5054J4426J5440j2035j7027R476J8305o745j9268L848J9826p99j9945k336
$$ -15054 -628 14812 2777 -14250 -4774 13531 6786 -12482 -8634 11192 10393 -9552 -11888
915a1888J9519N441j8569q365J7069J1015j5154j3253J2939J5043j0513j6415
$$ -11888 7631 13072 -5497 -13862 3207 14222 -932 -14185 -1246 13797 3284 -13131
927a3131Q015J7415n487j8080K896J8491k58j8584k469J8341N231j7680p961J6489
$$ -13131 -5116 12299 6812 -11268 -8372 10119 9861 -8723 -11192 7149 12380 -5300 -13261 3228
941C228J0563j4835j2910J2781J4818j0344j6313P745J7303n033j7836K349J7994
$$ 3228 13791 -1044 -13954 -1173 13645 3301 -13012 -5267 12036 7003 -10833 -8484 9510
954I510K71j7761k829J7254N288j6437p702J5290R976j3736j2131J1837J3951
$$ 9510 9781 -7980 -10809 6445 11733 -4704 -12406 2884 12860 -876 -13007 -1170 12781
967A2781r553j5402O978J6390m265j6843J530J6817J089j6350l542J5580N756
$$ 12781 3228 -12174 -5196 11194 6929 -9914 -8384 8433 9522 -6828 -10370 5210 10966
980A0966j4531p798J3314R684j1882j1425J0227J2961q313j4285O139J5284l754
$$ 10966 -3565 -11363 1951 11635 -247 -11672 -1445 11516 3203 -11082 -4943 10341 6587
993F587j5897J229J6068J313j5761l770J5059O026j3998q033J2702R778j1185
$$ 6587 -9310 -8081 7987 9300 -6461 -10231 4828 10854 -3144 -11177 1525 11303 118
1006A18j1295R536J2605p767j3716N812J4597l697j5193J367J5476J014j5295
$$ 118 -11177 -1641 10964 3197 -10519 -4707 9890 6193 -9000 -7633 7843 8857 -6438
1019f438l421J4659N746j3600p827J2178R608j0507j1037Q671J2144o748j2929
$$ -6438 -9859 4800 10546 -3054 -10881 1297 10905 398 -10639 -1968 10176 3428 -9501
1032i501M765J3491k798j3796P66J3856J307j3660l399J3139N446j2264p413J1048
$$ -9501 -4736 8755 5957 -7839 -7073 6783 8090 -5570 -8969 4170 9616 -2648 -10061 987
1046I87R161r505j0588P735J1684n818j2407L873J2813j953j2970J03J2921J685
$$ 987 10148 643 -9945 -2210 9474 3656 -8751 -4878 7935 5982 -6988 -6885 6036 7721
1060G721j2672l473J2207N244j1538o977J0569Q629r295j0122P742J1337n949
$$ 7721 -4951 -8424 3783 9027 -2511 -9488 1081 9710 415 -9707 -1965 9372 3423
1073C423j2188L979J2715j980j2836PJ2670J844j2218l588J1576N178j0739o682
$$ 3423 -8765 -4786 7929 5949 -6887 -6880 5790 7634 -4584 -8172 3404 8582 -2157 -8839
1087h839R733Q079q552r348P140J0432n503j1284L682J1832j745j1984k28J1795
$$ -8839 894 8973 421 -8927 -1787 8645 3142 -8142 -4460 7372 5627 -6357 -6585 5210
1101E210K099j1265l793J0482N303r518o607Q451P719p296q711O052R561m690
$$ 5210 7309 -3956 -7749 2733 8036 -1482 -8089 362 8081 785 -7926 -1874 7687 2997
1115B997j0287L171J0819j551j1115j56J1122J906j0800l616J0189N195r321o535
$$ 2997 -7290 -4119 6700 5149 -5966 -6122 5000 6906 -3894 -7510 2679 7874 -1447 -7982
1129g982Q236P688p030q597N723R328m399r881K996J0300j555j0551PJ0608J597
$$ -7982 254 7942 912 -7685 -1962 7366 2967 -6914 -3918 6382 4827 -5724 -5717 4891 6488
1144F488j0405l224R909M774r059o225P996P423o681q365N264R011l794r403K338
$$ 6488 -3917 -7141 2768 7542 -1517 -7742 254 7677 996 -7369 -2105 6906 3112 -6291 -3953
1159c953R583r17r594m86R469J834r175l193Q705M504q010n780P122O914n995
$$ -3953 5630 4713 -4881 -5367 4102 5936 -3239 -6432 2273 6777 -1233 -7013 109 7023 1028
1174A028p866M715Q548l272q982J849R130m34r074q93Q855K102q491l280Q039
$$ 1028 -6838 -2123 6425 3153 -5829 -3980 5150 4716 -4358 -5251 3604 5706 -2785 -6065 1974
1189A974M375p452n454O729O467n821p394M718Q180l451q707K031R034o27r009
$$ 1974 6349 -1103 -6557 172 6639 818 -6576 -1858 6322 2871 -5836 -3805 5229 4602 -4407
1204d407q05Q769K132q323l303P687M359o966n293O145O120n257o850M224P494
$$ -4407 -5212 3557 5689 -2634 -5937 1750 6109 -857 -6150 -5 6115 858 -5992 -1768 5726
1219E726l118p957J863Q276n58q307q16Q136K116p665l324O998M370o203n211
$$ 5726 2608 -5349 -3486 4790 4232 -4075 -4891 3245 5361 -2304 -5628 1370 5740 -463 -5674
1234e674N324N880m380o455L438O891k466p244J450P495l70p596p91P542J959
$$ -5674 -350 5530 1150 -5305 -1867 5024 2558 -4686 -3236 4259 3889 -3707 -4498 3044 5003
1249E003p254l118O775M168o065n099N213N859m261o420L264O798k260p040J242
$$ 5003 -2251 -5369 1406 5574 -491 -5590 -377 5482 1221 -5199 -1935 4863 2603 -4437 -3195
1264c195P192k95p185p48P118J773o874k835O477L851n849m799N065N580m083
$$ -3195 3997 3702 -3483 -4231 2887 4660 -2214 -5049 1428 5279 -570 -5369 -304 5276 1193
1279A193o184L019O567j941o713Q48O720J44o550j098O304J977n972k818N540
$$ 1193 -4991 -1972 4595 2654 -4059 -3211 3509 3653 -2897 -3995 2309 4286 -1686 -4504 1036
1294A036L649n032m402M360N104l574n692K679O111j678o330O34O385L54o224
$$ 1036 4685 -347 -4749 -389 4715 1141 -4551 -1872 4239 2561 -3769 -3135 3250 3604 -2620
1309b620j290N924K128n542k892N103L555m601m189M048M781l407n308K666N744
$$ -2620 -3910 2014 4142 -1400 -4292 811 4366 -235 -4424 -376 4405 998 -4310 -1644 4100
1324D100j790o061Q51O193J43o118j149N882K045n458k867M926L553m314m125
$$ 4100 2310 -3751 -2900 3293 3436 -2682 -3831 2051 4096 -1362 -4229 697 4250 -64 -4189
1339d189L666M568k975m948K245N269j487n473O72N558K23n551j102N355J988
$$ -4189 -523 4045 1070 -3878 -1633 3636 2149 -3324 -2652 2906 3129 -2422 -3524 1831 3819
1354C819m980k799M442L497l814m024L094M413k384m682J685M830r80m928L00
$$ 3819 -1161 -3960 482 3979 165 -3859 -765 3648 1264 -3418 -1733 3097 2117 -2811 -2511
1369b511M974L78m926j104M829J832m571k585M220L243l688l846L088M284k364
$$ -2511 2463 2841 -2085 -3189 1640 3472 -1099 -3684 536 3779 91 -3755 -667 3617 1253
1384A253m598J613M776q93m819J85M756M90m638j132M477J734m220k357L904K954
$$ 1253 -3345 -1732 3044 2151 -2668 -2483 2273 2763 -1875 -3007 1470 3204 -1016 -3373 531 3485
1400C485l465l504K907L977k241m309J501M477p27m519k6M398P21m192j321L892
$$ 3485 20 -3484 -577 3400 1159 -3150 -1649 2828 2101 -2418 -2444 1954 2675 -1517 -2838 1054
1416A054J858l549k338L199K765k790l153K336L504j816l799J214M015n71m100
$$ 1054 2912 -637 -2975 224 2989 199 -2954 -618 2886 1070 -2729 -1515 2500 1929 -2171
1431b171j18M076P87l905j389L610J916l270k352K879K705k482k995K065L261
$$ -2171 -2289 1787 2574 -1331 -2720 890 2806 -464 -2816 63 2768 286 -2709 -644 2617
1446B617j607l497J135L672o05l797K8L833N93l743j215L523J779l199k262K762
$$ 2617 1010 -2487 -1352 2320 1715 -2082 -2054 1779 2372 -1371 -2586 937 2716 -483 -2745 17
1462A7K643k273k934J781L120j286l219P83L301l30l311j40L287O31l183j142
$$ 17 2660 387 -2547 -766 2354 1068 -2151 -1368 1933 1603 -1708 -1848 1439 2070 -1113 -2255
1478b255L012J642k738k090K356K483j905k755J387K927q97k990M11K982J5k908
$$ -2255 757 2399 -339 -2429 -73 2410 505 -2250 -863 2064 1167 -1823 -1412 1570 1585 -1323
1494a323m10K801P92k696j153K571J495k360j865K104K204j778k494J362K739
$$ -1323 -1733 1068 1860 -836 -1989 582 2077 -283 -2148 -44 2160 382 -2112 -750 1989
1509A989r29k866M62K886kk800m35K678P95k505j110K309J395k096j664J856J943
$$ 1989 1060 -1806 -1344 1542 1540 -1260 -1695 983 1778 -727 -1837 472 1867 -229 -1893 -37 1906
1526A906j579k184J268K381q75k531M36K595Ok543m50K388Q41k177j173J935J410
$$ 1906 327 -1857 -589 1792 917 -1614 -1178 1417 1423 -1120 -1570 818 1659 -518 -1691 244 1654
1543A654j648j619J392J761j109j893Q57J998n94k088K82K152O0k162m02K090
$$ 1654 6 -1613 -221 1540 431 -1462 -605 1393 799 -1289 -1007 1145 1205 -957 -1359 731
1559G31P62j968j072J753J330j481j552J223J681r46j763O85J803m50j835K30
$$ 731 1493 -475 -1547 206 1536 55 -1497 -274 1407 461 -1302 -617 1186 736 -1099 -869
1575h69J862K8j892k74J869N76j797q75J659J134j443j384J179J554q89j650N86
$$ -869 993 1021 -871 -1145 724 1300 -497 -1372 287 1421 -22 -1406 -227 1327 438 -1212 -626
1592f26J694l12j669P0J595J64j541l39J434N55j369p44J267R50j129j137R36
$$ -626 1068 756 -913 -843 752 916 -625 -964 470 1025 -344 -1088 179 1129 0 -1137 -201
1609b01J290o78j415M24J461j74j435q4J371K89j258m66J158N93j047p01R67P96
$$ -201 1089 411 -1004 -580 881 707 -728 -812 559 848 -410 -876 282 875 -172 -873 94 890
1627H90q45r40P63J034o26j151M58J245k73j260K9J257J92j214l82J109N28r73
$$ 890 45 -895 -132 902 276 -875 -417 828 555 -705 -676 581 773 -441 -823 286 814 -159
1645a59o34Q41P07p13p65N86Q35n03q83L98R36k34r99P5J018J01r85l02R18M56
$$ -159 -793 48 755 42 -723 -137 698 195 -688 -290 646 412 -587 -512 506 607 -378 -680 238 694
1665F94p84n83O27O72m64p11L25P25k34o89J33O77l8o78k4O64J08o65k33O79L22
$$ 694 -90 -673 -46 626 162 -549 -224 501 267 -422 -289 388 350 -328 -352 312 420 -245 -478 201 523
1686E23o19m26N16N28l97o11K89O20j68n93N4N65mn25m3N15P4n05r5M74J75m82
$$ 523 -96 -522 -6 522 125 -486 -197 423 255 -338 -284 281 277 -248 -291 224 298 -207 -302 172 347 -135
1708a35k44M62L27l96m10L07M44j90m70Q5M58Mm00q4L46J35l03j31K42J32j98
$$ -135 -379 83 410 14 -396 -89 355 165 -305 -220 238 242 -158 -242 104 239 -64 -195 47 179 -19
1729a9j47J85J67j75j95J54K36j07k71M9K60K7k49j02K12J42j50j50Q2J53l3j17
$$ -19 -166 19 186 11 -184 -30 206 99 -172 -123 137 164 -85 -187 25 167 17 -133 -51 102 69 -48
1751d8J6P1j5n3M4M4o3n7O0Q5o2j11M6J11j0r5l1Q9L5l5l3j2K8J7L1k3p0%R6L0
$$ -48 -32 39 24 -29 15 59 -4 -61 -1 84 22 -89 -43 68 58 -37 -68 21 56 21 -12 -24 4 21 52 29 -41 -41 55 85
1781H5j07o0R0Q5p0r3N2P9n4n3N6N7r2o7J16R8j19j52J22K08q5k58K8K88L3l00
$$ 85 -22 -82 8 93 23 -70 -18 61 7 -46 10 67 -25 -92 24 122 3 -149 -27 181 96 -162 -134 154 187 -113
1807a13q8K58J53k12j87J63K12j50j96J22K09j10k25P7K82p5l08K1L65K8l44j48
$$ -113 -201 57 210 -2 -189 -26 186 36 -160 -38 171 61 -164 -87 195 120 -188 -167 198 226 -118 -266
1829b66L55K12l25k87K54L59j98l77J32L80o9l81L4L68Kl82l4L93R5m26j50M53
$$ -266 89 301 -24 -311 -57 302 104 -273 -141 239 170 -211 -177 191 193 -189 -223 170 265 -161 -311 142
1851A42K25m29l10L85M08l40m75K54N15j51n53Q3N35Ln38n9N19J31n09j96N01
$$ 142 367 -62 -372 13 421 81 -394 -140 375 224 -329 -246 289 292 -246 -305 214 345 -164 -360 141
1872A41K75m85l58M48M56l95n50L15O16k08o62J00O64L3o72j49O27K47n74l19
$$ 141 416 -69 -427 21 477 82 -468 -153 463 255 -407 -307 357 390 -282 -431 196 443 -131 -450
1892d50N17L90m57m61M16N21l57n94L12O37k04p06J04P32K5p45j63P34K89o87
$$ -450 67 457 0 -461 -45 476 119 -475 -163 474 270 -436 -332 400 425 -320 -483 251 540 -147
1912a47l97O12M97n44n68M65O20l80o69K96P24k19p65J28Q00lq22j28Q31K59q01
$$ -147 -544 68 565 21 -547 -82 538 158 -511 -215 509 290 -475 -347 453 450 -372 -500 331 590 -211
1933b11m07P38N27o47o39N32P32m36p71K92Q20j75q33N7Q41O7q43j86Q48K90p98
$$ -211 -618 120 647 0 -639 -107 625 189 -582 -290 530 355 -478 -421 420 487 -356 -542 306 596 -202
1954b02m45P55N72o61p03N55Q11m32q84K90R17j49r09j6R21J47r09k60Q61L73
$$ -202 -647 108 680 19 -684 -129 682 250 -634 -344 573 424 -485 -501 420 567 -342 -602 259 632
1974F32q01n01P68O10o91p17N87Q35m75r36L32R90j80j011J9J015J51r99l06R42
$$ 632 -169 -670 98 708 17 -700 -113 722 247 -689 -357 633 453 -558 -539 476 627 -372 -678 264
1994B64M33q64n55Q01O47o99p54N90Q57m82r24L33J007j76j053J3J060J63j034
$$ 264 697 -167 -722 79 726 27 -727 -137 720 238 -686 -353 654 478 -575 -562 498 661 -373
2013c73l40R92M96r01o44P95P48o76q48N55R14m06r79K83J015j35j051k9J087
$$ -373 -713 279 775 -126 -770 25 773 97 -751 -196 718 312 -667 -384 631 496 -555 -584 503
2032E03J77j067l60J024N14r42o70Q33P96o94r04N60R82m17j024K55J059j11j081
$$ 503 680 -387 -747 277 791 -151 -821 12 808 114 -790 -230 752 335 -689 -434 625 514 -567
2051e67l1J092J92j073l51J040N06r73o64Q70Q19p50r35N92J025m27j096K53J129
$$ -567 -598 494 686 -387 -738 302 808 -165 -829 41 860 110 -825 -233 792 365 -731 -478 651
2070F51p7j129q6J101K57j066m02J009N48r38o98Q56Q19p27r45N66J072m34j118
$$ 651 574 -555 -641 460 717 -349 -751 258 806 -132 -830 26 845 118 -827 -261 811 377 -741
2089g41K28J178n8j162j40J147L09j088m65J007O12r28p14Q00Q51p00r55N62J053
$$ -741 -513 665 607 -555 -695 452 761 -327 -792 215 827 -101 -815 -15 836 136 -819 -257 796
2108G96m15j121K51J162o9j196j06J167L13j127m66J032O36r35p69Q08Q80o76
$$ 796 381 -740 -489 673 604 -592 -698 469 782 -345 -811 221 857 -78 -847 -39 841 165
2126A65r83N45J050l99j095K20J145n0j177j13J164K98j117m88J045O65r37q07
$$ 165 -818 -273 777 378 -717 -497 648 598 -579 -692 472 770 -347 -835 210 875 -62 -869
2144h69Q05R20o51j024M96J083l29j134J80J152j5j132j81J141L19j090m77J018
$$ -869 -64 856 205 -819 -323 760 431 -703 -523 629 614 -518 -699 442 761 -329 -806 212
2162B12O43r29p95Q12R26o51j038N01J099l36j136J63J147J0j136j94J119L35
$$ 212 855 -74 -869 -57 869 218 -820 -319 780 444 -692 -529 618 628 -508 -702 417 752
2180G52j058n01R97O43r05p96Q10R10o59j018N00J100l30j149J57J161L8j149
$$ 752 -306 -807 190 833 -72 -868 -58 852 193 -825 -325 775 445 -704 -547 614 652 -497
2198d97k25J115L82j042n15R50O72q61q02P54Q93o17r96M67J080l10j132J39J152
$$ -497 -722 393 775 -267 -782 168 840 -21 -823 -69 824 207 -789 -322 758 448 -684 -545 607
2217F07M2j139k33J107M01j039n61R44O90q19q14P06R09n87r79M39J041k91j082
$$ 607 649 -490 -723 384 785 -254 -815 129 819 0 -814 -108 801 214 -765 -326 715 424 -658
2236f58J26J128K0j102k21J100L70j021n40R48O68q26q03P10Q94n55r72M03J032
$$ -658 -532 596 616 -486 -707 393 763 -258 -798 150 818 -8 -811 -101 793 238 -734 -331 701
2255G01k58j055Q4J085N6j075k15J049L65r91n19R05O69q24p84O97Q88n31r86
$$ 701 443 -612 -528 557 613 -462 -677 372 737 -254 -773 132 801 -23 -807 -110 778 247 -739
2274g39L90J023k24j046O7J049R6j047k38J011L71r42n20Q80O48p92p71O68Q74
$$ -739 -349 674 450 -596 -529 520 616 -431 -669 342 713 -229 -749 131 779 -13 -784 -116 758
$$ [...]
8191E8
##END NTUPLES=NMR FID
##END=
