##TITLE=1H_LY-NiMg-ac-120
 CDCl3, 8 sc, 
 5.2.2019
##JCAMPDX= 6.0         $$ Bruker NMR JCAMP-DX V2.0
##DATA TYPE= NMR FID
##DATA CLASS= NTUPLES
##ORIGIN= UXNMR, Bruker Analytische Messtechnik GmbH
##OWNER= root
$$ XWIN-NMR		Version 3.5
$$ Tue Feb  5 14:31:54 2019 Russian Standard Time (UT+4h)  she@DPX200
##.OBSERVE FREQUENCY= 200.1313
##.OBSERVE NUCLEUS= ^1H
##.DELAY= (6, 6)
##.ACQUISITION MODE= SIMULTANEOUS
##.ACQUISITION SCHEME= undefined
##.AVERAGES= 8
##.DIGITISER RES= 18
##SPECTROMETER/DATA SYSTEM= spect
##.PULSE SEQUENCE= zg30
##.SOLVENT NAME= CDCl3
##.SHIFT REFERENCE= (INTERNAL, CDCl3, 0, 15.7039)
##AUDIT TRAIL= $$ (NUMBER, WHEN, WHO, WHERE, WHAT)
$$ ##TITLE= Audit trail, XWIN-NMR		Version 3.5
$$ ##JCAMPDX= 5.01
$$ ##ORIGIN= Bruker BioSpin GmbH
$$ ##OWNER= she
$$ F:/spectra/data/she/nmr/H-F/1/audita.txt
$$ ##AUDIT TRAIL=  $$ (NUMBER, WHEN, WHO, WHERE, WHAT)
(   1,<2019-02-05 14:30:56.79 +0400>,<she>,<DPX200>,
      <created by zg, POWCHK disabled, PULCHK disabled
       configuration hash MD5:
       00 E9 B6 7A A2 85 ED C7 34 08 36 98 17 FE 4E 26
       data hash MD5: 16K
       C6 69 1B 67 75 01 5A F9 62 F8 82 9A 85 64 4B 5D>)
$$ ##END=
$$ 
$$ hash MD5
$$ 3E 12 F8 18 DD 7A BA D5 03 24 DD CD E9 7F ED 87
##$RELAX= 
##$RELAX= 
##$RELAX= 
##$RELAX= 
##$RELAX= 
##$RELAX= 
$$ Bruker specific parameters
$$ --------------------------
##$DU= <F:/spectra>
##$EXPNO= 1
##$NAME= <H-F>
##$PROCNO= 1
##$TYPE= <nmr>
##$USER= <she>
##$AMP= (0..31)
100 100 100 100 100 100 100 100 100 100 100 100 100 100 100 100 100 100 
100 100 100 100 100 100 100 100 100 100 100 100 100 100 
##$AQSEQ= 0
##$AQ_mod= 1
##$AUNM= <au_zg>
##$AUTOPOS= <>
##$BF1= 200.13
##$BF2= 200.13
##$BF3= 200.13
##$BF4= 200.13
##$BF5= 200.13
##$BF6= 200.13
##$BF7= 200.13
##$BF8= 200.13
##$BYTORDA= 1
##$CFDGTYP= 0
##$CFRGTYP= 5
##$CHEMSTR= <none>
##$CNST= (0..31)
1 1 145 1 1 1 1 1 1 1 1 1 1 1 1 1 1 1 1 1 1 1 1 1 1 1 1 1 1 1 1 1 
##$CPDPRG= <>
##$CPDPRG1= <>
##$CPDPRG2= <>
##$CPDPRG3= <>
##$CPDPRG4= <mlev>
##$CPDPRG5= <mlev>
##$CPDPRG6= <mlev>
##$CPDPRG7= <mlev>
##$CPDPRG8= <mlev>
##$CPDPRGB= <>
##$CPDPRGT= <>
##$D= (0..31)
0 1.2 0 0 0 0 0 0 0 0 0 0.03 0 0 0 0 0 0 0 0 0 0 0 0 0 0 0 0 0 0 0 0 
##$DATE= 1549362656
##$DBL= (0..7)
120 120 120 120 120 120 120 120 
##$DBP= (0..7)
150 150 150 150 150 150 150 150 
##$DBP07= 0
##$DBPNAM0= <>
##$DBPNAM1= <>
##$DBPNAM2= <>
##$DBPNAM3= <>
##$DBPNAM4= <>
##$DBPNAM5= <>
##$DBPNAM6= <>
##$DBPNAM7= <>
##$DBPOAL= (0..7)
0.5 0.5 0.5 0.5 0.5 0.5 0.5 0.5 
##$DBPOFFS= (0..7)
0 0 0 0 0 0 0 0 
##$DE= 6
##$DECBNUC= <off>
##$DECIM= 32
##$DECNUC= <off>
##$DECSTAT= 4
##$DIGMOD= 1
##$DIGTYP= 9
##$DL= (0..7)
0 120 120 120 120 120 120 120 
##$DP= (0..7)
150 150 150 150 150 150 150 150 
##$DP07= 0
##$DPNAME0= <>
##$DPNAME1= <>
##$DPNAME2= <>
##$DPNAME3= <>
##$DPNAME4= <>
##$DPNAME5= <>
##$DPNAME6= <>
##$DPNAME7= <>
##$DPOAL= (0..7)
0.5 0.5 0.5 0.5 0.5 0.5 0.5 0.5 
##$DPOFFS= (0..7)
0 0 0 0 0 0 0 0 
##$DQDMODE= 0
##$DR= 18
##$DS= 0
##$DSLIST= <SSSSSSSSSSSSSSS>
##$DSPFIRM= 0
$$ [...]
##$SUBNAM2= <"">
##$SUBNAM3= <"">
##$SUBNAM4= <"">
##$SUBNAM5= <"">
##$SUBNAM6= <"">
##$SUBNAM7= <"">
##$SUBNAM8= <"">
##$SUBNAM9= <"">
##$SW= 20.0189088683792
##$SWIBOX= (0..15)
0 0 2 0 0 0 0 0 0 0 0 0 0 0 0 0 
##$SW_h= 4006.41025641026
##$TD= 16384
##$TD0= 1
##$TE= 0
##$TE2= 300
##$TE3= 300
##$TEG= 300
##$TL= (0..7)
0 120 120 120 120 120 120 120 
##$TP= (0..7)
150 150 150 150 150 150 150 150 
##$TP07= 0
##$TPNAME0= <>
##$TPNAME1= <>
##$TPNAME2= <>
##$TPNAME3= <>
##$TPNAME4= <>
##$TPNAME5= <>
##$TPNAME6= <>
##$TPNAME7= <>
##$TPOAL= (0..7)
0.5 0.5 0.5 0.5 0.5 0.5 0.5 0.5 
##$TPOFFS= (0..7)
0 0 0 0 0 0 0 0 
##$TUNHIN= 0
##$TUNHOUT= 0
##$TUNXOUT= 0
##$USERA1= <user>
##$USERA2= <user>
##$USERA3= <user>
##$USERA4= <user>
##$USERA5= <user>
##$V9= 5
##$VALIST= <valist>
##$VCLIST= <CCCCCCCCCCCCCCC>
##$VD= 0
##$VDLIST= <DDDDDDDDDDDDDDD>
##$VPLIST= <PPPPPPPPPPPPPPP>
##$VTLIST= <TTTTTTTTTTTTTTT>
##$WBST= 1024
##$WBSW= 4
##$XGAIN= (0..3)
0 0 0 0 
##$XL= 0
##$YL= 0
##$YMAX_a= 85672
##$YMIN_a= -80814
##$ZGOPTNS= <>
##$ZL1= 120
##$ZL2= 120
##$ZL3= 120
##$ZL4= 120
##$ABSF1= 10
##$ABSF2= 0
##$ABSG= 5
##$ABSL= 3
##$ALPHA= 0
##$AQORDER= 0
##$ASSFAC= 0
##$ASSFACI= 0
##$ASSFACX= 0
##$ASSWID= 0
##$AUNMP= <proc_1d>
##$AZFE= 0.1
##$AZFW= 0.1
##$BCFW= 1
##$BC_mod= 2
##$BYTORDP= 1
##$COROFFS= 0
##$CY= 11.3945322036743
##$DATMOD= 1
##$DC= 2
##$DFILT= <>
##$DTYPP= 0
##$F1P= 18.9103706918063
##$F2P= -1.10871071338519
##$FCOR= 0.5
##$FTSIZE= 0
##$FT_mod= 4
##$GAMMA= 1
##$GB= 0.15
##$INTBC= 1
##$INTSCL= 1
##$ISEN= 128
##$LB= 0.24
##$LEV0= 0
##$LPBIN= 0
##$MAXI= 10000
##$MC2= 0
##$MEAN= 0
##$ME_mod= 0
##$MI= 1.114404
##$NCOEF= 0
##$NC_proc= 0
##$NLEV= 6
##$NOISF1= 3.799351
##$NOISF2= 2.8
##$NSP= 1
##$NTH_PI= 0
##$NZP= 0
##$OFFSET= 15.70392
##$PC= 1
##$PHC0= -9113.745
##$PHC1= 6.600039
##$PH_mod= 1
##$PKNL= yes
##$PPARMOD= 0
##$PSCAL= 0
##$PSIGN= 0
##$REVERSE= no
##$SF= 200.130013532006
##$SI= 16384
##$SIGF1= 3
##$SIGF2= 2
##$SINO= 400
##$SIOLD= 16384
##$SREGLST= <1H.CDCl3>
##$SSB= 0
##$STSI= 0
##$STSR= 0
##$SW_p= 3612.71676300578
##$SYMM= 0
##$S_DEV= 0
##$TDeff= 0
##$TDoff= 0
##$TI= <>
##$TILT= no
##$TM1= 0
##$TM2= 0
##$TOPLEV= 0
##$USERP1= <user>
##$USERP2= <user>
##$USERP3= <user>
##$USERP4= <user>
##$USERP5= <user>
##$WDW= 1
##$XDIM= 8192
##$YMAX_p= 0
##$YMIN_p= 0
$$ End of Bruker specific parameters
$$ ---------------------------------
##NTUPLES= NMR FID
##VAR_NAME=  TIME,          FID/REAL,        FID/IMAG
##SYMBOL=    X,             R,               I
##VAR_TYPE=  INDEPENDENT,   DEPENDENT,       DEPENDENT
##VAR_FORM=  AFFN,          ASDF,            ASDF
##VAR_DIM=   8192,          8192,            8192
##UNITS=     SECONDS,       ARBITRARY UNITS, ARBITRARY UNITS
##FACTOR=    0.0002496,     1,               1
##FIRST=     0,             0,               0
##LAST=      2.0444736,     0,               0
##MIN=       0,             -80814,          0
##MAX=       2.0444736,     85672,           0
$$ Real data points
##PAGE= N=1
##DATA TABLE= (X++(R..R)), XYDATA
0@%%%%%%%%%%%%%%%%%%%%%%Oj4J6j6J6j6J6j7K5l2L2l2M0m8M9n7O4o9P7q6R5j05
44e6J17j30J46j62J78j94K10k34K58k82L14l48L86m31M86n49O23p18Q41j005J232
65F82j572K134l222O052k6222n8666Q7598P3567p1589q7925N7180R5641l8480
78C5178j02608K1459J04420k482j04844j4722J01150L2582r5687m8535Q6610O3944
90G6465p5582p6854O1406Q7870m5652r5484K7939J00101r822j00994q526R8708
102C9575K5896r3166m2125Q5152N6590p4762o9261O2631P9867m8781q8321L3576
114c3129R4331j7153r7594o6R7750J7516r4705l4526Q8344N0298p9045o4181O7196
127d964P5654n3492q4436L8476R0460k2702r3769O695R4449R391r2529k5112Q8078
$$ y = [0, 0, 0, 0, 0, 0, 0, 0, 0, 0, 0, 0, 0, 0, 0, 0, 0, 0, 0, 0, 0, 0, 0, 6, -8, 8, -8, 8, -8, 8, -9, 16, -16, 16, -16, 24, -24, 25, -32, 32, -37, 40, -46, 49, -56, 61, -69, 77, -85, 93, -101, 109, -125, 133, -149, 165, -183, 203, -228, 258, -291, 332, -386, 455, -550, 682, -890, 1244, -1978, 4074, -22148, -80814, 6784, 80351, 8762, -79163, -21983, 73658, 35178, -67430, -45971, 58449, 55967, -48877, -63599, 37551, 70133, -25554, -74089, 12521, 76465, 883, -75971, -14565, 73305, 27653, -67831, -39892, 60209, 50387, -50607, -59133, 39575, 65471, -27695, -69820, 15332, 71922, -2840, -72101, -9470, 70397, 21616, -66705, -33129, 61202, 44049, -53545, -53611, 44139, 61655, -33050, -67576, 20768, 71066, -7979, -72160, -4964, 70690, 17198, -67238, -28762, 61698, 38996, -54773, -48078, 46371, 55762, -36767, -61879, 26199]
140B6199M0247q1045n4283P1450O6755n9457p7132M5479Q4814l0098q9528J3938
152d2661R1081K230q9754j7776Q5701L2301p9371m5486P1103N7210o1096o7315
164f3833M9561P5682l6527q1975K2296Q5928p166q7209q360Q5600K3604q1165
176b3564l7996P4013N0875o4643o1869N3409P0716m0930p7293K7564Q1634j3570
188C8346q3709o96Q3586J5088q1027k9194P6042M2656o8552n4868N8667O5264
200F1603m6777p3345L3328P8754j9090q1438M565Q1366R613p8887k3068P4237
212B0861L5537o7629m6811N9321N6812m9357o5202L8001P1787k5348p6204J1827
224c6405P8144K119p7498j5985P4197K9056o8523m0929O0739N1142n1367n9587
$$ y = [26199, 66446, -14599, -68882, 2568, 69323, 9866, -67266, -21787, 63027, 32929, -56599, -42661, 48420, 50650, -39104, -56880, 28821, 61122, -18249, -63735, 7368, 64578, 3482, -63833, -14272, 61410, 24883, -57092, -34796, 51132, 43966, -43243, -51603, 33997, 57601, -23564, -61560, 12453, 63328, -1315, -63184, -9775, 60941, 20011, -57282, -29718, 51916, 38346, -45363, -46059, 37527, 52615, -28412, -57606, 18436, 61092, -7460, -62328, -3661, 61603, 14826, -58519, -25191, 53563, 34473, -46965, -42400, 38966, 48579, -30308, -53376, 20861, 56398, -11231, -58042, 1279, 58091, 8734, -56468, -18467, 53320, 27972, -48232, -36405, 41739, 43858, -33640, -49625, 24572, 53628, -14895, -55824, 4915, 56057, 4690, -54897]
236e4897M0790O6154k9330p0853J7348P3702m786p4569p962P3357K0763o9844
248b0127l3132O4063M4526n6030n4497M6085O2428l4718o8206K2382P1531r738
260C4567p2573k859P1464J4989o8386k6425O3570L7079n7067m6619M8993N5023
272E1756l9396o1802K8494O6692j6568o9421M084O9731Q355o7723k0316O3478
284A7364L1202n7419m0847M9868M9029m1150n5650L1517O0807k1101o4293J0155
296c0518O6135J247o6038j2783O3937K4107n9729l4786N3461M4249m5419n2198
308d8335L5870N8208k5412o2257J4407O4271l292o4412p652O2792J8291n9478
320a6999k8333N4618L7700m8050m6040L9970N3069l0484n8394J9915O1672q732
$$ y = [-54897, -14107, 52047, 22717, -48136, -30788, 42914, 38128, -36441, -44403, 28954, 49717, -20127, -53259, 10804, 55330, -700, -55197, -9112, 53316, 18598, -49608, -27226, 44305, 34567, -38006, -40865, 30599, 45588, -22798, -49223, 14347, 51426, -5641, -52260, -3267, 51756, 12360, -49442, -20948, 45744, 29176, -40245, -36161, 33570, 41925, -25798, -46114, 17364, 48566, -8853, -49700, 168, 49197, 8047, -47603, -16086, 44721, 23620, -40673, -30518, 35617, 36864, -29174, -41957, 21980, 46087, -13642, -48428, 5033, 49282, 3863, -48335, -12465, 45743, 20331, -41926, -27519, 36752, 33460, -30952, -38604, 24188, 42479, -16999, -45332, 9286, 46986, -1064, -47104, -7134, 45935, 15451, -42943, -23028, 38644, 29912]
332B9912o2819k625O1746J3512n8698k3672N3901L2745m7703m0545M0371M7103
344D3228l2106n2280K3128N6128j3457n8397L316N9052P056n7845j7360N4725
356A5188K7075m9806l5855M3180M3274l5359m9168K6590N3383j7337n6002P855
368b6982N7101J712n6693j1142N4898K0396n1564k9192M6748L7345m0406m4433
380d2212L2671N0112k3804n4155J4120N6302m172n6566n716N4994J5107n1834
392a5153k3755M7300L1530m1599l8264L4914M3994k7295m8517J8927N1702r861
404B3923n3357M08N3262R120n1422j8312M7757K6713m2616l4064L6190M0070k8869
417H803m4706K0967M7962j2687m9851M210N0507M410m9830j2911M7769K1265m4242
$$ y = [29912, -32907, -35532, 26214, 39726, -18972, -42644, 11257, 44002, -3701, -44246, -3875, 43228, 11122, -41158, -18030, 38098, 24641, -33756, -30440, 28612, 35668, -22177, -39537, 15188, 42263, -7543, -43398, -218, 43056, 7697, -41471, -14881, 38502, 21165, -34837, -26982, 30119, 31831, -24862, -36004, 18894, 39290, -12274, -41466, 5282, 42627, 2221, -42212, -9541, 40571, 16767, -37388, -23268, 33034, 28862, -27704, -33420, 21574, 36681, -15153, -38908, 8392, 39922, -1677, -39941, -5027, 38967, 11672, -36845, -17918, 33784, 23923, -29434, -29026, 24236, 33356, -18066, -36378, 11379, 38092, -4524, -38588, -2398, 37672, 8803, -35903, -14936, 33026, 20339, -29512, -25302, 25205, 29615, -20215, -33126, 14643, 35908, -8334]
430h334k9136L9238L6198l2837m2146K5248M6616j6855m9443P974N0542R09n0023
443b2049r541M8064J7647m4780k5116M0402L1861l4930l7738K8477M2634k1086
455A3845m6312J2943M8532m287m9168m547M8062J3112m5349k1061M1118K8108
467C4996l5719l3995K9387L8683k2451m2134J5132M4408p511m5487k44M5396Q077
480B8538m4035j5771M1319K3142l7262k9818L1860L5506k5407l9943J8132M2939
492B9200j0415m4485K570M4645N138m3542j2518M1308J9469l7980k5912L3657
504A135L1707k8293l6734K2011M0697j4914m3396P178M4635Q36m4314q764M2463
517A4247J6220l9210k2949L4820K8704k9511l3446K3574L7157j7152l9813J0352
$$ y = [-8334, -37470, 1768, 37966, 5129, -37017, -11769, 34847, 17992, -31451, -23477, 27065, 27974, -22049, -31590, 16474, 34121, -10659, -35775, 4627, 36488, 1558, -36180, -7703, 34931, 13845, -32467, -19524, 29008, 24721, -24447, -28994, 19068, 32180, -13169, -34230, 6888, 34996, -723, -34718, -5331, 33352, 10901, -31233, -16101, 28307, 20796, -24691, -24935, 20461, 28538, -15497, -31268, 10051, 33193, -4069, -33887, -2027, 33479, 8072, -31871, -13739, 29200, 18785, -25700, -23130, 21515, 26653, -16889, -29407, 11901, 31370, -6610, -32522, 1135, 32842, 4549, -32185, -10174, 30523, 15609, -27787, -20609, 24026, 24862, -19452, -28216, 14247, 30467, -8743, -31692, 3128, 31832, 2321, -31125, -7551, 29606, 12454, -27359, -17007]
529a7007M1459l273m1965l984M1273J1198l9246j8166L5925K4539l1414l0011
541c0672K5857L4377j9570l7501J2830L9390n928m0090r36L9695P603l8295j4007
554b7247L5929K0072l2618k5681K8336L0662k3108l4811J7040L7896j0321l9682
566b3533L193M0134L952l9186j0824L6987J7189l3717k2840K9554K7707k4688
578C928l1735J9235L4893j3268l7126O854L8308j26l8330o695L7093J3346l4568
591h191j9532L0865K4955k6161k9399K0715L2738j4787l4961Q651L6085k503l6231
604a7756l605L5477R522l3827j5258L1303K0658k7835k5566K3452K9770j8230
616H105l3005J2336L5160o052l6065l29L5797O530l4404j2360L2046J7702k8893
$$ y = [-17007, 24452, 21179, -20786, -24770, 16503, 27701, -11545, -29711, 6214, 30753, -661, -30672, -4815, 29562, 9992, -27509, -14679, 24711, 18783, -21307, -22243, 17452, 25055, -13240, -27247, 8682, 28754, -3864, -29545, -1209, 29453, 6345, -28466, -11426, 26470, 16149, -23533, -20340, 19794, 23746, -15440, -26264, 10723, 27912, -5805, -28645, 909, 28616, 3928, -27807, -8572, 26321, 13053, -24073, -17219, 21089, 20963, -17367, -24062, 13031, 26377, -8191, -27723, 3142, 28097, 1936, -27463, -6748, 25990, 11203, -23758, -15107, 20978, 18475, -17756, -21361, 14116, 23638, -10189, -25447, 5856, 26514, -1321, -26887, -3435, 26335, 8105, -24900, -12564, 22596, 16544, -19521, -19850, 15947, 22477, -11927, -24287, 7759, 25461, -3432]
629c432k2455K5025K6574k0536l0029J5445L2704r834l4484L803L5209K461l4723
642a4272q712L3035J4677l0181k0003K6310K4488k1657k8036J6488L0571j1018
654A1690l2190N415L2872K00l2703n799L1660J1272k9719j6481K6842K1292k3049
667A302k5411J8455K8709j3209l0966P581L2157j842l2237l822L1317R204k9559
680h321j4179K7035J8668k3848k2692K0057K6136j5692k8908J0748L0929n375
692A4558l1967k91L1957N991l0780j1464K8544J6456k5403k0764K1534K4260j7149
705E482k6956J2402K8826p453k9918K354L0214K800k9671p936K8281J2899k5952
718d628j7492K2776K1534j8759k4808J4146K7176r122k8563L950K8951J153k8474
$$ y = [-3432, -25887, -862, 25712, 5176, -24853, -9408, 23296, 13462, -21022, -17219, 17990, 20451, -14272, -22984, 10051, 24728, -5453, -25456, 854, 25342, 3685, -24351, -7863, 22708, 11690, -20500, -15085, 17787, 17987, -14716, -20515, 11145, 22417, -7302, -23783, 3059, 24351, 1302, -24109, -5654, 23055, 9846, -21120, -13539, 18618, 16776, -15461, -19283, 12034, 21238, -8321, -22500, 4535, 23203, -645, -23337, -3280, 22856, 7164, -21744, -10996, 19933, 14558, -17409, -17700, 14257, 20248, -10532, -21996, 6548, 23004, -2399, -23163, -1629, 22631, 5482, -21474, -9072, 19754, 12301, -17617, -15263, 14951, 17751, -11920, -19856, 8425, 21324, -4628, -22120, 656, 22190, 3431, -21377, -7231, 19945, 10823, -17740, -13790, 15161, 16314, -12160]
731a2160o061K7246J0602k5316j4867K2785J8700j9636k2117J5906K4986j1596
743H472k7141O817K8469j731k8807l439K8158Q442k6537j3111K4104J7196k0991
756i9k0653J7323K3444j3296k5556Q956K6980m369k7724l35K7687N145k6809r856
770a9162K5059J4361k2444j8325J9023K1633j4970k4097J0494K5642n844k6355
782a4985J204K6243L267k5414p574K3979J1578k1918j5319J9298J8665j6075k1506
795a8557J2304K3736q064k5183L519K5759J154k5464n688K4301R927k2405j3755
808a8416J9888J7048j6892j9815J3526K2057r854k3713N878K4809j668k5201k707
821a5060K4857P105k3632j1359K1606J5207j8799j8483J5352K1057j1528k2848
$$ y = [-12160, -18221, 9025, 19627, -5689, -20556, 2229, 20929, 1293, -20824, -4918, 20068, 8472, -18669, -11852, 16617, 14886, -13921, -17360, 10798, 19240, -7297, -20408, 3696, 20892, -99, -20752, -3429, 20015, 6719, -18837, -9881, 17099, 12730, -14994, -15329, 12358, 17503, -9306, -19162, 5897, 20258, -2186, -20511, -1488, 20145, 5175, -18922, -8428, 17214, 11370, -14985, -13781, 12462, 15729, -9685, -17259, 6720, 18298, -3620, -18939, 359, 19024, 2949, -18557, -6253, 17483, 9419, -15764, -12245, 13514, 14668, -10796, -16484, 7817, 17744, -4661, -18416, 1472, 18520, 1628, -18187, -4661, 17396, 7542, -16171, -10293, 14516, 12848, -12353, -15060, 9797, 16902, -6730, -18089, 3517, 18724, -75, -18558, -3206, 17851, 6323, -16525]
833a6525P442K3876l287k4199q62K3862M879k2920q720K1363J2351j9195j5700
846a7635J6472J8598j3156k0911R356K2535n230k3351R68K3317L236k2535p165
859a5501K1017J0763j8973j3917J6490J6623j3641j8889J0494K0667o971k1951
871a3789L220K2621P54k2589m787K1782Q710k0205j2337J7920J5495j5081j8064
884a6350J1775J9990q267k1227M590K1875r07k1928k755K1407O377k0332r848
897a5600J8664J3120j6383j6023J3520J8433j0171k0202O476K1199k614k1472
909a1053j208K1020M845j9925q211J8346J1227j6303j3890J3913J6189j1158j8085
922a4293Q079J9530m719k0411J124K0668K541k0224o159J9086R548j7334j2563
$$ y = [-16525, -9083, 14793, 11506, -12693, -13555, 10307, 15186, -7734, -16454, 4909, 17260, -1935, -17635, -1163, 17435, 4279, -16632, -7276, 15259, 10029, -13322, -12354, 10963, 14199, -8336, -15501, 5516, 16279, -2694, -16611, -121, 16502, 2861, -16028, -5534, 15133, 8162, -13789, -10569, 12052, 12806, -9783, -14570, 7212, 15922, -4283, -16620, 1300, 16795, 1714, -16350, -4575, 15415, 7148, -14079, -9489, 12386, 11479, -10449, -13204, 8203, 14580, -5752, -15600, 3064, 16184, -199, -16222, -2702, 15731, 5560, -14642, -8166, 13033, 10419, -11053, -12261, 8759, 13604, -6321, -14532, 3814, 15041, -1262, -15152, -1239, 14950, 3792, -14293, -6214, 13316, 8597, -11814, -10690, 9978, 12519, -7705, -13864, 5222, 14770, -2564, -15127]
935a5127J4989J5094j2273j7068R272J8538o123j9467K851J9919M87j9878l834
948a2620J9296P166j8112j0365J6307J3322j3948j5822J1039J7753p755j9034
960a2773M280J9602p51j9509k673J8839N892j7650q860J6048J1526j4003j3899
973a3931J1622J5883q846j7491N798J8526k488j8987r55J8782M329j7904p535
986a3197J6433J0395j4471j2824J2132J4793r529j6300O744J7398l832j8057Q21
999i494J8254K276j7951n389J7107Q407j5671j1225J3683J3668j1209j5623Q348
1012d819J7041n294j7801K128J8014R89j7681l978J6896O787j5675r397J4063
1025A273J1764j2044j3865R630J5582o881j6812L825J7457o40j7501k537J6898
$$ y = [-15127, -138, 14956, 2683, -14385, -5113, 13425, 7302, -12165, -9314, 10605, 11092, -8786, -12620, 6676, 13842, -4270, -14635, 1672, 14994, 1046, -14776, -3737, 14016, 6261, -12773, -8493, 11109, 10358, -9151, -11824, 7015, 12907, -4743, -13603, 2445, 13971, -32, -13931, -2309, 13574, 4728, -12763, -6965, 11561, 9073, -9914, -10869, 7913, 12242, -5662, -13197, 3236, 13631, -840, -13664, -1532, 13261, 3732, -12568, -5824, 11574, 7742, -10315, -9494, 8760, 11036, -6915, -12304, 4803, 13210, -2461, -13686, -3, 13665, 2456, -13167, -4819, 12222, 6928, -10873, -8745, 9269, 10258, -7423, -11401, 5495, 12282, -3393, -12790, 1273, 13037, 993, -12872, -3242, 12340, 5459, -11353, -7528, 9929, 9289, -8212, -10749, 6149]
1038F149N554j5744q273J4126J0656j2144j2629R907J4234p460j5437M846J6261
1051A0046k104j6658p57J6592L672j6036o546J4943R228j3288j1637J1181J3605
1064A2241q707j5065O005J6003l194j6423M02J6366K369j5917n018J5067P548
1077A1677j3804r938J2127J2055j0039j3864P540J5232m765j6075J832J6288J160
1090I426j5934l999J5043O629j3686q950J1991J0922j0012j2523P802J3788n414
1103E083j4718K888J5259k65j5323k477J4916N173j4006p690J2588R939j0730
1116F37j1793Q540J3241o186j4180L692J4732j202j4858j290J4626L713j4038
1129d366o090J3075Q342j1733j0397R970J2186p857j3602N417J4556k791j4964
$$ y = [6149, 11703, -4041, -12314, 1812, 12468, 324, -12305, -2398, 11836, 4376, -11061, -6215, 10046, 7942, -8716, -9473, 7119, 10791, -5245, -11791, 3152, 12380, -908, -12545, -1364, 12241, 3534, -11531, -5526, 10477, 7283, -9140, -8738, 7628, 9997, -5920, -10938, 4129, 11677, -2127, -12065, 62, 12117, 2078, -11786, -4246, 10986, 6221, -9854, -8022, 8266, 9426, -6508, -10507, 4536, 11165, -2521, -11471, 520, 11442, 1430, -11093, -3291, 10497, 5083, -9635, -6747, 8512, 8247, -7076, -9553, 5363, 10536, -3470, -11160, 1428, 11367, 637, -11156, -2616, 10625, 4439, -9741, -6049, 8683, 7481, -7377, -8667, 5959, 9672, -4366, -10456, 2619, 10961, -772, -11169, -1199, 10987, 3130, -10472, -5055, 9501, 6710, -8254]
1142h254R3J4873K532j4277m984J3273P202j1906r151J0285J0825q420j2215O320
1156c804J3294m021j3993J538J4270J031j4075l596J3399N991j2188q187J0624
1169B83J0004q706j1455O638J2460m410j3111K146J3389J17j3348k378J2961M585
1183I175j2237o722J1123Q729r639j0477P786J1889n631j2883L299J3424q92j3478
1197f534j480J3119L722j2374n789J1327P668j0026r306Q418J0750o615j1886
1210i006M548J2712k315j3129m7J3134K381j2621m676J1697O752j0381q512Q754
1224g09R925o934j0977M966J1716k968j2132R17J2234J146j2030l232J1528N235
1238H685j0638p132R384Q830p797j0206N941J1237l916j1829J796J2058K82j1891
$$ y = [-8254, -8161, 6712, 9244, -5033, -10017, 3256, 10458, -1448, -10599, -314, 10511, 2091, -10124, -3804, 9490, 5469, -8524, -6986, 7284, 8315, -5760, -9356, 4043, 10034, -2154, -10341, 283, 10287, 1581, -9874, -3236, 9224, 4814, -8297, -6151, 7238, 7355, -5993, -8371, 4590, 9175, -3062, -9784, 1339, 10068, 429, -10048, -2262, 9627, 3996, -8887, -5588, 7836, 6944, -6534, -8014, 5105, 8827, -3547, -9336, 1991, 9659, -367, -9673, -1255, 9495, 2880, -9006, -4458, 8254, 5939, -7190, -7237, 5897, 8278, -4343, -9019, 2678, 9430, -951, -9463, -709, 9216, 2282, -8695, -3729, 7987, 5019, -7113, -6196, 6038, 7184, -4846, -8078, 3450, 8685, -1953, -9085, 299, 9129, 1332, -8874, -2933, 8304, 4388, -7441, -5645, 6413, 6695, -5196]
1252e196k304J1422M201j0658n964R650P566q407r010O923J0234n186j1184L228
1266d685J1787j127j1975j026J1726L151j1066n133J0044O854q722q308P187R430
1280H137n510j0282L724J0863j870j1151n6J1153J993j0796l924J0109N761r062
1294i11p370P680Q733o026r772M227J0434k348j0726M52J0699J366j0381l101
1308g044R823M696q998o231P991P599o732q782N229R757l545j0396J658J0698
1322E723K74j0625k148J0132L942r363n522Q321O862p058q014N656Q920m138r586
1337f624K520J0010p99j0145r76R983K772r478m491Q640O061p465p400O055Q436
1352G099m479r130K807R497j139r588n03R422K060r002l583Q409N003p567o328
$$ y = [-5196, -7500, 3922, 8123, -2535, -8499, 1151, 8717, 310, -8700, -1777, 8457, 3271, -7913, -4685, 7102, 5975, -6000, -7026, 4700, 7851, -3215, -8348, 1696, 8550, -172, -8480, -1293, 8137, 2627, -7655, -3931, 6932, 5062, -6089, -6145, 5008, 7001, -3795, -7719, 2390, 8151, -911, -8281, -601, 8132, 2106, -7666, -3439, 6995, 4647, -6079, -5627, 5072, 6438, -3943, -7044, 2779, 7475, -1523, -7754, 237, 7836, 1104, -7678, -2449, 7308, 3763, -6633, -4975, 5723, 5997, -4628, -6776, 3356, 7298, -2065, -7587, 734, 7596, 538, -7476, -1820, 7100, 2962, -6624, -4104, 5906, 5107, -5038, -6014, 3969, 6741, -2737, -7228, 1412, 7473, 8, -7392, -1337, 7099, 2620, -6510, -3703, 5794, 4655, -4933, -5436, 3986, 6046, -2956, -6539, 1870, 6873, -694, -7022]
1367g022O502P493n212q445L714R109k069r466L55R500J319r188k932Q617M366
1382F641p803n621O774O726n647p604M362Q330k958q838J456R131J51r139j782
1397e821Q827L379q174m862P237O125o050p152M693P876l252q346J778Q556l08
1412D506q527j149Q296K568p870l905P212N155o310o277N191P207l874p905K432
1427c250Q312r28q420n75Q216K012p795l320P164M494o368n513N432O422m397
1442A486p130L211P713j907q078N08Q213R34q029k414P592L752o878m940N945
1457b2N920m836o702L637P249k393p576J105P698K05p652j490P380K776o912l988
1473e601O197N111n282o056M164O786k893p259J545P447k00p371j111P092K317
$$ y = [-7022, -520, 6973, 1761, -6684, -2970, 6139, 4070, -5396, -5041, 4459, 5778, -3410, -6342, 2275, 6641, -1162, -6783, -9, 6717, 1070, -6534, -2172, 6158, 3200, -5638, -4182, 4949, 5100, -4039, -5821, 3006, 6385, -1789, -6651, 586, 6711, 661, -6491, -1798, 6078, 2826, -5520, -3742, 4814, 4506, -4021, -5170, 3126, 5694, -2176, -6081, 1131, 6286, -24, -6301, -1110, 6097, 2223, -5682, -3250, 5062, 4134, -4286, -4861, 3355, 5367, -2428, -5748, 1416, 5910, -458, -5971, -539, 5883, 1486, -5644, -2433, 5280, 3373, -4705, -4197, 4016, 4950, -3079, -5493, 2099, 5851, -1027, -5967, -22, 5898, 1062, -5640, -2003, 5246, 2853, -4723, -3618, 4080, 4285, -3367, -4857, 2523, 5299, -1613, -5601, 596, 5707, 425, -5631, -1467, 5319, 2426, -4833, -3288, 4159, 3959, -3412, -4523, 2569, 4886]
1488D886o633l397O035M387n293n247M407O016l387o622K244P045r94p250l12
1503d115P191J612o876k860O337L947n584m868M677N627l712o187K635O591j537
1518B878o810M01O872P68o758j943O433L082n885m151N122N091m166n833L076
1533a823O313j888o571O95O608M61o428j554O101K580n619l517N022M337m254
1548D63n102L408N688k409o140J316O389j86o385r96O172K101n747l096N132L943
1564D551m400m650L598N199k719n612J800N902q24o067j88O075J226n883k260
1579d252N480L249m883m142M131M848l211n369K209N692j170n821J55N786Q17
1594C519n587j762N271K640m811l454M207M192l468m833K622N299j644n592N89
$$ y = [4886, -1747, -5144, 891, 5278, -15, -5262, -855, 5161, 1774, -4848, -2604, 4441, 3447, -3803, -4115, 3076, 4688, -2188, -5048, 1289, 5236, -348, -5216, -539, 5088, 1376, -4811, -2176, 4415, 2878, -3932, -3531, 3341, 4109, -2649, -4592, 1841, 4923, -962, -5113, 9, 5100, 934, -4899, -1823, 4490, 2602, -3969, -3274, 3334, 3795, -2633, -4187, 1914, 4494, -1125, -4642, 380, 4717, 463, -4639, -1231, 4457, 2048, -4092, -2776, 3613, 3427, -2958, -3954, 2218, 4319, -1428, -4524, 608, 4551, 151, -4499, -901, 4298, 1579, -4033, -2233, 3669, 2845, -3222, -3410, 2665, 3891, -1992, -4252, 1228, 4477, -406, -4548, -417, 4431, 1220, -4149, -1940, 3752, 2582, -3239, -3084, 2702, 3519, -2068, -3830, 1441, 4081, -730, -4184, 23, 4215, 747, -4086, -1464, 3835, 2191, -3401, -2812]
1609b812N671M51n539j466N195K400m730l169M114L848l442m370K698M805j898
1624A756n123J039N300j27n366q07N255J743m944k620M455L414l798m091L045
1639h69M595k209m915J330N092m61n108m01N026J203m785k016M439K772l971l483
1655c761L381M077k637m567J801M867q86m992m0M923R24m684j744M315K470l838
1671c91l077L267L599k649m025J970M349j220m588M39M673M17m626j245M397K058
1687C348l997k763L448L375k815l836K130M141j384m324O40M391P9m369p88M229
1703A505J491l980k209L618K845l129l415K497L888j784m190J002M326j85m311
1718b031n77M133J304l833j951L446K516k994l001K478L408j905l723J260L957
$$ y = [-2812, 2859, 3310, -2229, -3695, 1500, 3900, -830, -3999, 115, 3963, 521, -3849, -1151, 3654, 1756, -3367, -2328, 2972, 2845, -2521, -3328, 1927, 3670, -1274, -3894, 561, 3975, 177, -3914, -869, 3726, 1517, -3398, -2068, 3024, 2563, -2545, -2946, 2080, 3283, -1502, -3518, 921, 3693, -278, -3761, -380, 3697, 1060, -3507, -1706, 3161, 2275, -2717, -2757, 2166, 3090, -1594, -3338, 977, 3447, -391, -3468, -201, 3398, 749, -3276, -1306, 3043, 1823, -2765, -2326, 2347, 2764, -1862, -3107, 1290, 3348, -649, -3412, 36, 3411, 596, -3240, -1110, 3031, 1647, -2677, -2037, 2354, 2433, -1936, -2724, 1505, 2996, -984, -3193, 425, 3270, 141, -3274, -777, 3111, 1327, -2863, -1861, 2465, 2280, -2031, -2608, 1525, 2829, -1004, -2955, 491, 3007, 13, -2988, -510, 2898, 993, -2730, -1470, 2487]
1733B487n67m057j69M033R15l850j619L531K252l064k783K514L201j939l477J326
1749a266L655p14l740Q2L733N12l639j146L472J739l198k303K785K815k273l226
1765b712J683L523j020l672L46L687L03l575r03L353J464l065j955K717K398k317
1781B55k796J846L123j294l360O93L489m8l488o06L361J232l080j811K715K277
1797B508k271k634J774K885j262l059P20L158j98l179l44L126Q58k981j376K739
1813D64J898k425k316J994K678j472k955R52L059l72l071j72K990O84k847j145
1829b056K637J553k359j947K048K281j662k567J216K790o94k937J66K962L79k873
1845a063r15K665J399k364j789J972K116j597k346J165K520p41k621L06K641J56
$$ y = [2487, 1920, -2137, -2306, 1727, 2642, -1208, -2827, 704, 2956, -108, -2891, -377, 2824, 885, -2592, -1266, 2389, 1675, -2065, -1983, 1750, 2262, -1377, -2523, 949, 2688, -510, -2813, -28, 2787, 514, -2712, -1029, 2494, 1474, -2198, -1852, 1835, 2138, -1437, -2340, 1013, 2477, -588, -2543, 174, 2572, 255, -2541, -695, 2428, 1134, -2226, -1533, 1956, 1908, -1580, -2186, 1175, 2407, -673, -2484, 231, 2508, 237, -2397, -623, 2262, 1000, -2059, -1339, 1819, 1621, -1558, -1902, 1224, 2082, -899, -2275, 464, 2362, -63, -2379, -385, 2293, 821, -2134, -1182, 1877, 1505, -1566, -1738, 1252, 1936, -911, -2056, 581, 2134, -225, -2172, -124, 2157, 495, -2072, -856, 1934, 1240, -1697, -1531, 1431, 1810, -1063, -1978, 687, 2086, -278, -2067, -95, 2021, 424, -1922, -757, 1763, 1022, -1599, -1293, 1348, 1504]
1861A504k645n96K549J060k359j504K095J879j717k182J300K416q48k530L88K542
1877A352O7k482m86K377Q63k226j208K000J548j749j844J445K101j088k299O77
1893i52K426k38k451k22K381O73k235j075J983J424j718j678J384J885j059k036
1909a508P10K146l56k189l1K204M24k124q22J982J186j753j514J459J790j099
1925E05j978P33K066l36k092l7K049L55j939o90J824R91j678j236J456J499j208
1942B84j717Q99J897n69k016K04K024J88j977n33J839Q54j651j131J420J354j185
1959A84j510R13J650o50j746L57J815m0j827k80J780O25j680r24J498J204j241
1976A28j438R64J584o29j688L27J683jj667k78J591N34j483p80J361J009j197
$$ y = [1504, -1141, -1737, 812, 1872, -487, -1991, 104, 1983, 266, -1916, -616, 1800, 952, -1578, -1190, 1352, 1419, -1063, -1549, 828, 1691, -535, -1743, 257, 1805, 56, -1788, -343, 1758, 670, -1629, -952, 1474, 1236, -1215, -1437, 944, 1617, -618, -1693, 290, 1714, -4, -1682, -298, 1587, 528, -1508, -798, 1348, 992, -1197, -1228, 976, 1400, -724, -1546, 436, 1622, -131, -1645, -186, 1604, 505, -1473, -740, 1326, 990, -1102, -1139, 910, 1265, -674, -1364, 460, 1451, -227, -1463, -7, 1492, 284, -1433, -534, 1363, 794, -1222, -1018, 1006, 1194, -783, -1316, 523, 1377, -274, -1405, 15, 1369, 184, -1326, -413, 1237, 587, -1159, -802, 1013, 973, -854, -1134, 646, 1271, -409, -1333, 165, 1369, 128, -1310, -346, 1238, 609, -1079, -752, 931, 930, -737, -1015, 576, 1110, -373, -1153, 208, 1217, 20]
1993B0j230R90J410p42j551M44J635j43j651j82J599M70j484p27J318R56j125
2010Gj129R20J271p16j365M93J451k57j492RJ514K52j453n43J375P75j197j025
2028a110R90J204p61j312M91J392k52j384%J364K25j301m40J216O29j111q33R80
2046a3J009q04j167N88J287l49j337O0J349J94j300m24J181O39j029q21Q93R38
2064H94p09j035N35J112l50j176J65J215M4j213k64J177N00j098o99R49Q73p71
2082A49j019N78J099l61j129J47J146L3j100k40J054L88r85n57Q99P05p77q63
2100h33O24R89m38j082K26J128j2j109k03J045M21r48n75Q01P20o65q18N41Q73
2119F85l55r50K15R90m5j010j33R86L11r41m90Q42O60p02q11N39Q97l52r54J82
$$ y = [20, -1210, -220, 1190, 448, -1103, -659, 976, 833, -818, -1000, 599, 1069, -415, -1142, 176, 1132, 7, -1122, -202, 1069, 353, -1012, -519, 932, 675, -817, -808, 706, 958, -495, -1038, 337, 1112, -85, -1110, -120, 1084, 323, -989, -498, 894, 642, -742, -742, 622, 847, -454, -894, 322, 951, -160, -993, -13, 996, 192, -975, -387, 900, 551, -786, -726, 623, 817, -483, -907, 274, 913, -116, -937, -44, 894, 185, -850, -315, 797, 447, -729, -564, 651, 695, -518, -782, 395, 895, -203, -902, 47, 920, 149, -870, -292, 807, 446, -683, -536, 610, 643, -457, -697, 357, 745, -240, -797, 102, 807, 30, -833, -209, 780, 342, -740, -514, 614, 602, -507, -710, 335, 756, -192, -767, 34, 754, 89, -729, -188, 685, 330, -620, -405, 585, 540, -470, -603, 383, 694, -247, -737, 105, 765, 63, -748, -209, 688, 336, -618, -436]
2139d36R48J1r32j63Q79K99q41m14P62N47o62o89N57P91m13q86K39R41n6r45j32
2160e95R17L20q34m74P37N95n98p02M87P54l33q12J91Q48n7q48j05Q42K61q35
2180b41l98P50N44o37o77M93P73l26q49J78Q46Oq34j57P89K80p19l90O38N06n61
2201A4o08M78O76l55p66K27Q03n8q19r7Q00K80p44m29O49N60n36o28M11O77k62
2222B73p47J61P41lp67j09P38K41p07l87O55N12n79o28M45P27l00p88J41Q05L2
2243D56p97j77P44L11o71m15N90N08m96n94L98O67k97p11J66P56k8p66j28P62
2263B78K69o93m36O39N39n08o32L71O97k35p35J13P40Np18j41O88K71o65l84N95
2284E8M93n11o27M10P09k79p60J24P93L4p97j77P45L42o79m58N97N57m88o39L73
$$ y = [-436, 512, 523, -409, -572, 307, 606, -235, -649, 113, 660, -2, -691, -134, 657, 244, -642, -403, 538, 482, -463, -595, 322, 642, -192, -666, 71, 666, 68, -634, -147, 607, 274, -538, -347, 501, 444, -404, -509, 333, 594, -241, -639, 111, 655, 18, -659, -166, 607, 281, -568, -390, 456, 462, -372, -529, 260, 540, -179, -569, 69, 575, 14, -594, -116, 560, 205, -561, -334, 469, 411, -408, -505, 295, 575, -169, -598, 51, 611, 75, -553, -142, 535, 273, -474, -313, 428, 425, -342, -451, 287, 528, -179, -566, 89, 601, 22, -606, -161, 566, 266, -522, -381, 424, 456, -341, -518, 226, 537, -134, -549, 41, 549, 53, -541, -143, 524, 227, -484, -318, 438, 410, -356, -484, 278, 547, -146, -582, 57, 596, 88, -544, -173, 524, 289, -446, -333, 407, 412, -306, -447, 241, 512, -153, -537, 58, 551, 40, -587, -177, 532, 253, -507, -383, 410, 444, -353, -530, 215, 557, -122, -580, 17, 574, 86, -553, -180]
2305a80P01k55p54J35P93Rp92j57P76L15p40m50O51N88n49o89L99P59k45p92R4
2326c83Q04L7p85j77P49K93o90m28O25N49n41o39M19P15k78q07J64Q19J5q40j58
2347e37P92L27p40m51O30N81n15o81M11P38k67p85J34Q33Pq53j39Q29K99p86m58
2368f31P10N95o08p09M63Q07l15q61J39Q83K2q80j67Q32L19p93m47P01N83o07
2388C6o90N02P76l49q84K24R01l0r35j38R11L02q35m67P49O08o40p16N22P91l52
2409B86q61K14R03p4r20q1R07K45q63m30Q18N71p02p25N73Q30m19r14K57R51q1
2430D85r69j00R38K68q78m31Q16N68p04p23O15Q25m86r10L10R82j31j027m5J008
2450D11K67r81m18Q91N90p90p28O48Q52m95r29L51R76j79r94qJ005J91r84l67
$$ y = [-180, 521, 266, -488, -353, 440, 449, -343, -500, 276, 591, -149, -599, 52, 640, 91, -598, -199, 560, 315, -477, -383, 421, 458, -327, -504, 245, 538, -152, -580, 45, 594, 53, -586, -167, 548, 270, -537, -373, 446, 461, -379, -537, 255, 582, -158, -609, 21, 602, 87, -594, -183, 555, 288, -497, -363, 470, 477, -376, -515, 314, 613, -173, -631, 79, 674, 66, -643, -180, 627, 312, -549, -410, 473, 495, -385, -552, 280, 599, -194, -641, 60, 643, 36, -654, -152, 624, 275, -609, -385, 516, 486, -449, -587, 324, 626, -209, -676, 73, 681, 41, -675, -153, 638, 286, -575, -361, 542, 468, -452, -533, 374, 619, -244, -674, 144, 715, 13, -712, -139, 691, 272, -642, -385, 566, 485, -484, -584, 354, 622, -256, -687, 129, 697, -7, -730, -115, 710, 224, -686, -376, 606, 475, -552, -597, 411, 678, -303, -721, 170, 760, -30, -758, -110, 742, 247, -682, -331, 645, 466, -528, -536, 469, 660, -324, -691]
2470f91R31N29q60o94P27Q39n89r39L90J033k27j047J5J051J74j019l48R69N04
2489G48q67o75P69Q08o34r13M63J014k86j079R3J101J17j081l07J037M96r42o61
2508g99Q01Q24o70r21M99J010l26j063J37J096N4j105k36J059M31j007o14R01
2526G1P71p57r21N90J019m03j093K05J124Oj129j97J084L99j018n82R54P22q11
2545C4q86O85R81m86j097L12J160j07j170j30J165L36j096n38R98P20q80q53P20
2564a32R76n55j071L66J132j45j187m8J178K50j141m70J074O40r49q32Q03R77
2582H66o17j084M13J162k10j198j0J208K20j161m11J085O09r85p90Q61R43o88
2600B13j070N03J167k98j234Q9J250J44j224l71J156N71j051p43R04R13p58j042
$$ y = [-691, 240, 769, -91, -785, -58, 781, 192, -747, -357, 676, 449, -598, -583, 468, 642, -377, -725, 244, 748, -119, -794, -25, 783, 149, -764, -301, 713, 427, -652, -559, 542, 659, -422, -729, 308, 804, -138, -799, 2, 826, 156, -765, -266, 744, 418, -645, -508, 588, 642, -463, -699, 360, 791, -216, -830, 71, 842, 85, -836, -246, 773, 370, -723, -518, 606, 612, -517, -714, 370, 769, -249, -831, 123, 845, 34, -852, -167, 814, 328, -769, -457, 703, 596, -574, -704, 461, 797, -299, -837, 161, 881, 1, -852, -132, 844, 289, -782, -416, 716, 571, -616, -664, 514, 764, -377, -847, 227, 867, -82, -914, -111, 866, 249, -835, -422, 740, 530, -668, -678, 530, 750, -411, -822, 263, 872, -113, -903, -42, 901, 213, -857, -354, 813, 515, -719, -630, 620, 764, -460, -831, 325, 896, -155, -898, 6, 919, 161, -881]
2618h81N82J139l90j207J71J240N9j268k56J209M79j128o88J013Q74q74j015O78
2636b63J134m76j218K64J257k3j273j69J227L94j159n94J068P81r22r69P88J082
2654I29n81j214L82J278j39j310j02J294L35j240n51J136P45j007r18Q48J060
2671I45o62j188M68J242k27j324K1J330K17j297m44J217O69j116q65R58J025p48
2689B21j169N56J262l25j326J11J335J32j313l48J256N67j163p80J041R47q58
2706A46j122O69J252m52j336K18J360M0j371k61J302M90j219p06J092Q94r42j061
2724a007P64J192n49j303L36J363r4j386j57J373L86j288o25J182Q36j029j026
2741a032Q51J181o48j281M20J365k00j392m5J394K79j323n28J245P40j118r40
$$ y = [-881, -299, 840, 450, -757, -586, 654, 713, -555, -811, 398, 877, -251, -939, 74, 948, 74, -941, -263, 871, 395, -823, -559, 698, 675, -598, -767, 460, 854, -305, -899, 169, 950, 28, -941, -153, 929, 348, -866, -484, 794, 655, -655, -757, 537, 872, -368, -919, 217, 962, -45, -963, -115, 945, 283, -905, -437, 805, 578, -746, -725, 605, 822, -475, -919, 298, 967, -149, -1014, -56, 969, 221, -948, -392, 870, 545, -781, -670, 665, 797, -516, -864, 392, 959, -204, -984, 57, 1004, 146, -976, -307, 945, 493, -843, -625, 735, 775, -596, -857, 445, 935, -284, -990, 102, 996, 54, -1007, -243, 949, 400, -903, -567, 796, 702, -684, -841, 532, 918, -370, -995, 187, 1023, -6, -1032, -181, 1000, 352, -929, -509, 856, 656, -736, -781, 613, 892, -431, -959, 286, 1026, -92, -1032]
2758a032R61J119p75j256N36J364l10j410L7J429J88j385m33J305O64j192q75
2775a065J045J043q62j185O48J320m18j404J89J437O6j419l48J395N74j269p99
2792a052J123R90r38j170P49J300n23j383K81J423k9j440k19J412M71j337p04
2809a046J213R25j067j106Q71J246o41j371L97J436j61j443j11J443L58j389n97
2826a043J275Q35j144j016R55J208p68j331N41J422k76j479K5J484K43j440n06
2843a015J364P32j215r53J059J127q68j281O53J370l99j457J73J491R1j488l51
2860i67J422O04j317q44J177J039r85j224P74J351n29j459K88J493j8j492k41
2877i28J441M98j365p34J240R52j075j147Q96J302o48j424M09J506j51j524j32
$$ y = [-1032, -71, 1048, 273, -983, -447, 917, 607, -803, -766, 663, 851, -534, -967, 338, 1002, -190, -1065, -20, 1023, 161, -1024, -376, 944, 526, -878, -689, 748, 814, -605, -953, 442, 1016, -253, -1052, 71, 1061, 123, -1047, -298, 1002, 479, -904, -623, 800, 771, -669, -888, 524, 995, -342, -1046, 167, 1092, 25, -1081, -210, 1036, 395, -976, -579, 857, 696, -747, -858, 585, 943, -446, -1043, 232, 1067, -77, -1093, -138, 1070, 302, -1029, -488, 934, 658, -821, -796, 688, 931, -509, -1015, 349, 1081, -134, -1087, -28, 1099, 231, -1050, -397, 973, 574, -883, -710, 781, 872, -616, -967, 455, 1059, -258, -1102, 75, 1114, 129, -1095, -321, 1030, 501, -958, -670, 823, 805, -687, -928, 513, 1011, -354, -1088, 152, 1104, 29, -1118, -222, 1080, 432, -992, -583, 923, 772, -752, -884]
2894h84J501L92j424o48J317Q64j151j081R79J245p67j379N22J469k84j510JJ539
2912G01K50j483n22J380P81j257r97J088J179q79j332O48J449m04j497J21J526
2929G52J36j495m04J451O38j328q62J163J096r91j261P67J403n22j493K49J549
2946H48J7j537k96J489N37j370p88J228J004j062j191Q64J332o39j445L71J524
2963H86j14j545j52J522M32j445o87J318R29j160j126R45J301p29j419M80J489
2980I25k00j526o9J529L32j474n80J386Q22j240j041J050J233q36j383N99J484
2997A011l28j552O2J547K06j505m79J421P18j287r61J136J138r25j314P11J436
3014A035m60j524J95J544Q5j527l52J457O24j353q66J211J074j013j254Q15J382
$$ y = [-884, 617, 1009, -415, -1063, 254, 1118, -33, -1114, -135, 1110, 343, -1036, -514, 955, 671, -839, -838, 701, 951, -532, -1054, 326, 1107, -150, -1147, -59, 1120, 241, -1091, -443, 1006, 602, -895, -774, 752, 888, -607, -1011, 440, 1078, -250, -1112, 51, 1147, 156, -1105, -338, 1065, 543, -950, -701, 848, 865, -672, -968, 521, 1058, -312, -1100, 128, 1132, 70, -1121, -257, 1075, 436, -1009, -638, 886, 772, -773, -925, 597, 1029, -416, -1103, 215, 1144, -16, -1142, -197, 1104, 375, -1044, -564, 925, 725, -801, -870, 659, 991, -483, -1063, 323, 1145, -95, -1136, -86, 1147, 311, -1072, -473, 1011, 683, -869, -807, 740, 946, -559, -1038, 383, 1101, -186, -1147, -11, 1127, 202, -1112, -401, 1035, 575, -949, -754, 790, 875, -652, -1004, 453, 1077, -276, -1142, 69, 1143, 130, -1124, -309, 1073]
3031A073n73j470L16J524m4j530k27J505M77j409p41J294R63j125j161R18J313
3048A103o71j452M34J515j56j556j00J516L60j453o22J343Q58j198j071J017J237
3065A104q01j396N83J488l15j536L7J545K56j502n23J418P63j277r84J108J175
3082A143q94j325O55J445m24j504J66J523J22j517l94J462O36j332q93J184J097
3099A150r91j275P75J383n04j490K50J523Rj510k87J470N44j388p69J251R82j075
3117D8j189Q65J361o34j472L93J518j20j527j60J523M13j433o57J299R17j161
3134a6j112R92J239p36j392M90J491k42j532k3J537K84j481n49J380P87j241j015
3152a139J061J191q42j347O01J468l72j507J02J525J54j489m17J419O68j308q99
$$ y = [1073, 500, -970, -654, 870, 826, -704, -931, 574, 1051, -358, -1099, 195, 1158, 33, -1128, -210, 1103, 432, -1020, -586, 929, 773, -783, -883, 633, 993, -460, -1082, 261, 1119, -79, -1150, -133, 1104, 303, -1093, -510, 978, 663, -873, -836, 709, 965, -537, -1060, 358, 1121, -156, -1140, -32, 1143, 249, -1076, -421, 1024, 600, -904, -738, 785, 907, -610, -1004, 458, 1094, -238, -1131, 53, 1150, 159, -1116, -341, 1042, 538, -952, -702, 821, 830, -680, -967, 503, 1047, -341, -1110, 141, 1123, 48, -1141, -276, 1085, 451, -1021, -628, 890, 770, -757, -917, 606, 1019, -414, -1071, 228, 1145, -16, -1128, -136, 1103, 367, -1025, -535, 956, 714, -818, -841, 696, 980, -501, -1050, 330, 1117, -124, -1139, -78, 1113, 271, -1076, -475, 993, 621, -886, -784, 741, 895, -594, -1011, 408, 1076, -232, -1131]
3169a131J167J086r59j270P55J393m98j481K41J529K6j505l08J460N62j365p92
3186a090J231R90j046j176Q46J317o18j432L67J495r7j532j57J490M27j431o85
3203a101J308R08j134j103R36J266p09j388M69J474k21j508m1J512K82j459n33
3220a042J356P89j225j006J060J191q50j326O02J440l34j515J01J512J71j488
3236e64m18J407O63j285q89J131J079r60j245P34J377n08j460K48J510kj507k71
3254i60J452N38j353p84J233R87j057j166Q39J325o24j395L52J477j06j505j39
3271h86J490L87j405o47J301Q78j153j075R53J259p39j371M78J458k31j487l2
3288h22J472L10j440n41J333P73j209r64J012J165q15j335O21J401l53j479R1
$$ y = [-1131, 36, 1122, 163, -1107, -352, 1041, 543, -938, -697, 832, 858, -647, -955, 505, 1067, -298, -1090, 141, 1131, 85, -1091, -245, 1072, 454, -978, -611, 884, 787, -745, -902, 588, 1015, -416, -1101, 207, 1115, -19, -1122, -186, 1080, 371, -1017, -548, 926, 705, -803, -844, 668, 950, -509, -1042, 314, 1103, -122, -1128, -68, 1123, 273, -1053, -451, 989, 655, -860, -759, 753, 924, -564, -982, 425, 1088, -197, -1086, 45, 1124, 164, -1081, -347, 1030, 522, -938, -690, 820, 818, -689, -960, 492, 1030, -323, -1107, 126, 1113, 56, -1110, -271, 1054, 430, -965, -613, 864, 758, -747, -886, 604, 991, -414, -1061, 240, 1118, -35, -1110, -157, 1102, 363, -1008, -530, 928, 697, -790, -822, 650, 960, -480, -1021, 312, 1085, -124, -1088, -76, 1089, 274, -1061, -440, 961, 608, -871, -780]
3305g80J505J65j465m31J389O87j282q96J109J096r15j246O97J374m63j446K22
3322f80J483M8j484l06J429N62j345p83J191J003j016j184Q12J327n88j419L30
3339f20J467o7j486j68J429M28j362o85J281Q74j119j072R16J257p21j371M76
3356e43J447k11j491m1J480L01j410n55J322P81j186r78J019J156q18j284N90
3373d21J380l32j464Q9J478J64j449m29J377O69j247q96J084J097r01j253O87
3390c67J359m46j438J91J467O6j461l15J407N49j303p84J163J004j013j161P87
3407b95J315n41j432L15J471n7j469k06J442M49j343o84J226Q93j074j075Q94
3424a71J232o66j364M38J436j85j458q9J466L27j416n64J298P87j138j017R76
$$ y = [-780, 725, 890, -575, -1006, 383, 1070, -212, -1108, 1, 1097, 182, -1064, -367, 1007, 544, -902, -680, 803, 851, -633, -939, 490, 1052, -293, -1076, 115, 1118, 102, -1082, -270, 1057, 469, -950, -620, 847, 780, -706, -874, 555, 983, -379, -1064, 217, 1091, -28, -1100, -184, 1073, 352, -1019, -543, 904, 693, -798, -839, 641, 942, -468, -1023, 299, 1080, -106, -1084, -65, 1091, 273, -1011, -421, 959, 627, -837, -748, 730, 894, -555, -984, 393, 1062, -185, -1081, 3, 1100, 199, -1054, -367, 992, 546, -892, -701, 766, 832, -629, -944, 463, 1012, -291, -1075, 88, 1092, 79, -1082, -295, 1020, 479, -953, -638, 833, 776, -693, -899, 543, 992, -351, -1035, 191, 1084, 10, -1065, -171, 1061, 395, -969, -531, 905, 720, -738, -827, 639, 966, -450, -1014, 284, 1071, -67, -1084, -108]
3441a08J162p64j299N26J405l05j435M4J448J99j402m62J346O79j212r00J064
3458a4J087q68j247O66J354m25j408J38J467Q6j418l48J368N77j252q03J133R95
3476A088r71j145P55J287n36j384K95J426m0j435k30J411M61j330o98J196Q99
3493A049j027j088Q53J222o31j338M21J390j65j417q4J404L29j353n61J271P75
3510A050j127r71R39J151p46j269N10J368k65j416K2J409K33j367m71J282O91
3527A023j172q74J018J063q39j212O21J325l96j401J52J414R3j395l50J341N80
3544I91j234q00J094R67r09j122P08J259m98j340K80J384l6j410j93J365M46j267
3562c15o82J160Q88j021j044Q28J188o02j323L93J373j55j382r3J364L20j293
$$ y = [-108, 1054, 290, -1009, -483, 922, 617, -818, -774, 674, 873, -529, -991, 355, 1034, -178, -1078, -14, 1073, 205, -1042, -376, 978, 553, -855, -717, 750, 836, -582, -930, 438, 1015, -237, -1040, 93, 1088, 117, -1028, -273, 1014, 478, -906, -611, 815, 775, -660, -890, 521, 982, -348, -1046, 150, 1049, 22, -1066, -213, 1009, 378, -960, -539, 851, 686, -731, -815, 589, 918, -435, -996, 275, 1050, -77, -1048, -109, 1042, 296, -973, -463, 905, 640, -776, -754, 655, 888, -479, -950, 332, 1023, -149, -1023, -5, 1058, 219, -993, -372, 953, 557, -844, -692, 722, 815, -580, -930, 411, 991, -243, -1043, 51, 1018, 109, -1013, -305, 954, 456, -884, -604, 780, 744, -666, -859, 506, 952, -315, -997, 163, 1051, 30, -1014, -186, 1002, 400, -923, -530, 843, 688, -694, -787, 577, 897, -396]
3579c96n56J200P70j084r43R10J099p14j237N07J318k79j371L8J373K04j332m45
3597i38J261O59j123q68R85J013p97j150O04J256l93j318J69J355Q0j344l26J295
3615D20N39j183p64J079R26r00j094P18J207n06j279K61J347n1j337j84J292M09
3633I00j243o27J142Q16r92r93Q12J146o26j242M07J311j66j344o4J312K99j262
3651d14n23J172P35j052r02R15J031p07j164N15J266l25j287O2J331J57j297l88
3669h75J230O08j130q01R80R70q16j109O16J203m03j279J98J298K1j290k52J257
3687D26M65j168o75J060Q54r11j029P48J146n24j228K93J293p5j301j43J259L70
3705H60j195n68J096P65r71r21Q12J059o30j173M36J240k21j281jJ277K50j243
$$ y = [-396, -952, 248, 1018, -66, -1009, -99, 1000, 286, -951, -444, 874, 595, -776, -738, 635, 839, -493, -938, 323, 982, -141, -1009, -24, 989, 192, -958, -354, 902, 509, -809, -640, 715, 795, -549, -875, 420, 959, -224, -988, 91, 1017, 117, -977, -259, 948, 442, -837, -576, 771, 720, -617, -801, 491, 900, -343, -970, 172, 988, -4, -997, -185, 961, 335, -907, -500, 811, 645, -699, -763, 549, 848, -414, -937, 235, 970, -82, -984, -69, 962, 255, -909, -394, 872, 547, -740, -678, 653, 810, -487, -875, 355, 963, -167, -968, 12, 982, 166, -943, -327, 876, 473, -806, -608, 690, 711, -579, -831, 426, 891, -277, -952, 108, 962, 51, -978, -230, 916, 392, -836, -543, 750, 675, -626, -769, 490, 860, -335, -903, 193, 958, -13, -934, -122, 937, 307, -866, -430, 810, 589, -692, -693, 584, 834, -409]
3723d09m59J152O50j031q50Q74J007p27j107N24J198l18j251J12J262J14j253
3740e12l21J196N23j098p32R81R08q24j030O19J168m42j217K18J244J3j241k28
3758g75J209M35j140o12J022P96q95r54P42J070n41j179L38J248j44j241j01J232
3776E10L09j183n11J087O89r45q74Q12R86o28j111M58J179k55j236N1J237J79
3794G54j201l93J146N68j029p67R21R18p28j051N56J137l60j178J30J217O4j199
3812d95k68J146M75j080o46R67Q14q27r57O49J075m59j173K71J201n2j215j67
3830g41J179L82j113n63J002P31q79q84P26J010n61j100L66J164j61j181n9J205
3848E23K48j151m56J072O56r65q07Q12R57o32j084M61J135k57j172O1J176J48
$$ y = [-409, -868, 284, 934, -97, -947, -73, 934, 207, -900, -376, 822, 504, -747, -635, 627, 741, -512, -833, 363, 886, -212, -944, 37, 945, 121, -909, -290, 878, 436, -781, -563, 681, 694, -547, -775, 434, 869, -271, -883, 139, 935, 40, -914, -172, 898, 357, -822, -484, 764, 620, -621, -722, 510, 819, -364, -875, 212, 901, -44, -918, -106, 880, 252, -859, -401, 778, 523, -713, -662, 575, 754, -447, -840, 306, 874, -155, -922, -1, 917, 189, -862, -306, 831, 471, -707, -577, 640, 704, -495, -763, 383, 858, -222, -868, 99, 913, 86, -871, -222, 853, 394, -779, -508, 693, 641, -574, -741, 438, 820, -293, -856, 146, 877, -2, -886, -160, 850, 289, -811, -445, 719, 558, -623, -682, 523, 771, -380, -836, 236, 892, -73, -880, -68, 889, 257, -827, -366, 769, 512, -660, -599, 577, 725]
3866G25j157l46J087N40j010p02Q72Q71p32j002N58J087l63j151J68J162M9j158
3884e02k41J112M36j036o12R24P71p92r18O50J015m63j095K82J148p8j166j19
3902f84J146L28j079n21R93O83q69q29P07R58n49j045L68J090j71j133j5J141
3920E19J93j099m02J036N73r36p20P88Q81o47r86M59J076k79j106O1J135J15j095
3939d34l09J039M89r58o51Q58Q06p20r20N61J011l81j076J90J112J3j113k16J079
3958C80M00r94n91R12P15p54q61O18R54m55j029K68J071r6j092q9J070K88j035
3977c20m70R59O37q51p79P10R04n32j002L55J046j56j077j8J066J99j026l73R71
3996B43N36q76o81P57Q11o11r25M51J010k81j066J12J061R8j048k73R87M51r24
$$ y = [725, -432, -778, 309, 849, -161, -863, 9, 880, 148, -854, -296, 791, 428, -723, -555, 607, 656, -502, -743, 369, 805, -231, -843, 81, 852, 60, -858, -208, 807, 344, -751, -469, 679, 601, -565, -684, 462, 790, -289, -810, 183, 866, -3, -832, -125, 833, 284, -761, -393, 697, 526, -607, -622, 519, 712, -387, -789, 247, 820, -116, -836, -48, 833, 186, -800, -341, 735, 456, -650, -589, 546, 661, -434, -743, 296, 785, -173, -824, 34, 840, 120, -800, -239, 772, 391, -685, -495, 617, 630, -483, -699, 380, 780, -214, -805, 107, 822, 68, -793, -175, 779, 324, -705, -437, 634, 538, -554, -643, 427, 715, -320, -790, 169, 806, -45, -824, -114, 790, 258, -744, -389, 657, 501, -576, -594, 472, 671, -355, -728, 243, 779, -97, -778, -21, 790, 179, -746, -295, 715, 434, -632, -520, 541, 639, -409, -682, 305, 756, -168]
4015a68n97Q17P25o77q56N25R62l92j001K08J021k9j044j44J025L29r78m83Q76
4034A19O53p56p88O24Q93m63r61L01J004j27j013n8J017K21r71l82Q93N36p95
4053e3o90O89Q11n46r11L92R71k11j012M1J001J31r71l17R36M57q42o10P36P29
4073G31o17q36M70R01l03r61J44R95K1r94j99R62L61q74n14P87O57o74p75N52
4093a66Q57l92r27K40R65q0r64r4R51K51r00m13Q38N59p42o85O16P89m90q75L40
4114c22R23j75r49kR56J47r10l07Q48M65p83n90O95P00n79p95M31Q77k89r23J32
4135d50R38N4r45j98Q94L65q18n09P30O34o20p41N02Q19l56q71K04R17o6r07j05
4156e29Q92K64q60m15P83N37o91o55N64P61m40q16K90Q73j39r06nQ79J67q50l19
$$ y = [-168, -765, 52, 777, 100, -756, -231, 731, 339, -662, -454, 567, 538, -506, -650, 375, 704, -274, -757, 119, 772, 16, -772, -148, 745, 282, -679, -378, 626, 499, -514, -572, 445, 666, -305, -687, 206, 742, -53, -743, -54, 757, 211, -700, -308, 663, 452, -560, -519, 482, 613, -358, -675, 261, 718, -124, -734, 2, 731, 114, -722, -252, 649, 346, -615, -471, 524, 545, -449, -648, 314, 675, -199, -713, 74, 731, 57, -718, -166, 691, 299, -628, -388, 577, 497, -467, -561, 390, 641, -259, -672, 166, 725, -17, -702, -86, 703, 213, -662, -322, 601, 426, -523, -525, 431, 578, -332, -639, 209, 674, -109, -699, -4, 696, 117, -678, -247, 630, 341, -582, -450, 488, 542, -403, -601, 293, 658, -160, -669, 61, 695, 75, -666, -164, 655, 299, -572, -368, 549, 483, -424, -529, 363, 627, -233, -648, 135, 672, -19, -674, -110, 651, 211, -605, -315, 558, 419, -487, -492, 387, 554, -296, -615]
4177f15P98M54p24n66O17O82n11p58L69Q39k19q87P1R06P8q72k27Q22L61p46n01
4198f29O83O02n68o95M34P84l27q33J82Q64l8q62j27Q44K67p94m08P13N35o15
4218A2o55N11P42l87p95K48Q21r0q51l3Q38J78q01l24P56M40o54n69N67O72m57
4239A69p50L24Q02j82q42L6Q57J01q22k42P63L83o93n05O17N95n20o72L86P48
4259E53k65p89J18Q12K9q30j64P98K89p34m34O75N33n61o31M50P06l18p55J91
4279c27P93o2p89p9P86K05p42l43O97M51o07n67N12O58l96p26K71P57j21p92L
4300d18P86J20p41k79P15L77o54m82N57N79m44o77L55P32k36p72R5P80L9p63j84
4321e15P29L13o70m29O03N29m97o09M02O76k83p28J61P61l7p46r7P32K29p11l47
$$ y = [-615, 183, 637, -87, -653, -36, 646, 135, -623, -254, 585, 366, -521, -450, 456, 534, -338, -565, 257, 618, -128, -629, 54, 656, 88, -607, -173, 611, 284, -549, -367, 497, 459, -403, -530, 314, 581, -213, -621, 92, 627, 12, -643, -132, 610, 223, -572, -324, 497, 407, -444, -477, 361, 539, -262, -586, 170, 610, -44, -613, -46, 626, 169, -581, -257, 545, 363, -479, -443, 414, 515, -307, -549, 214, 597, -96, -601, 16, 611, 91, -581, -195, 553, 288, -501, -383, 429, 458, -372, -536, 262, 551, -183, -617, 58, 591, 30, -601, -151, 555, 237, -518, -327, 466, 404, -385, -464, 322, 527, -215, -558, 139, 590, -17, -584, -72, 586, 190, -536, -265, 492, 371, -421, -418, 368, 488, -253, -532, 183, 560, -94, -576, -19, 560, 116, -561, -206, 526, 290, -482, -387, 393, 432, -331, -515, 214, 527, -143, -572, 31, 560, 63, -546, -144, 532, 249, -479, -318, 443, 406, -340, -437, 295, 524, -187, -534]
4342e34O39M63n59n55M65O23l44o94K31P42j19p54k9P49J48p07k70O54L74n93
4362g0m86N22N59m17o33L05O93j86p33N1P46P1p17k03O97L06o15m20N57N06m74
4383E9n72L69O41k59o80J44P16k1p13j12P01K27o56l52O03M40n21n35M26O01l15
4404A91o63K02O98r3p06l6O97J55o58k72O12L84n67m64M72N47l79o18K78O71j50
4425C01p04M8O93P9o61j97O29K96n70l96N07M79m18n60L30O24k36o47J09O73j
4446C78o71j29O57K33o19l36N54M29m67n17L78N71k84o24J82O48p3o52l2O35J64
4467D25o19k75N80L66n11m44M35N30l50n87K46O26j36o40J6O40J00o14k09O04
4487A83K80n38l73M67M56l96n21K95N78k03o11R2O42Ko31j25O15K14n56l29N04
$$ y = [-534, 105, 568, 9, -546, -81, 542, 198, -496, -265, 477, 358, -396, -425, 324, 472, -235, -505, 149, 523, -70, -556, -34, 525, 108, -525, -220, 473, 287, -446, -395, 351, 422, -295, -498, 199, 505, -110, -530, 27, 533, 59, -513, -144, 497, 238, -442, -298, 418, 397, -316, -428, 273, 500, -156, -508, 95, 535, 14, -521, -95, 506, 191, -472, -270, 428, 335, -371, -407, 290, 445, -213, -485, 127, 511, -56, -520, -48, 499, 120, -498, -220, 451, 301, -403, -355, 338, 417, -244, -441, 188, 484, -86, -482, 25, 504, 86, -474, -144, 480, 244, -403, -294, 379, 378, -293, -422, 235, 468, -151, -487, 67, 496, 29, -488, -110, 461, 177, -447, -265, 383, 310, -342, -374, 261, 425, -194, -469, 111, 477, -34, -478, -43, 487, 137, -450, -204, 422, 286, -354, -338, 302, 402, -212, -421, 183, 463, -75, -448, 19, 475, 79, -442, -147, 431, 228, -383, -291, 351, 353, -278, -403, 212, 426, -130, -459, 45]
4508D5M00m19m96L54N33k43n79J58O01n7o03m1N88J51n66k57N37L47m72m24L94
4529d9N04l17n39K08N69j06n87LN91J01n77j90N36K71m83l61M35M17l42n09K70
4550a55N51j81n73P3N93J6n82j33N75J95n06l07M69L73l85m42L16M92k30n20J30
4571b31N80n5n64n4N56J46n38k30M91L21m35m01L69M64k90n06K05N26j00n47K
4592b91N52P1n41j58M89K68m50l64M19M14l39m72K49N17j65n36O6N46L6n47j19
4613c55N11K17m74k85M20L52l52m30K98M64k02m98J26N33l9n33o3N27J40m94k22
4634c59M49K90l84l89L48M23k77m53J87M94j13n09J8N24P2n18j54M89K28m43l05
4655c82L87L72l17m36K45M65j47n11Q6N14Pn13q6M96J72m58k47M15L28l67l80
$$ y = [45, 445, 26, -470, -116, 417, 174, -405, -247, 354, 297, -306, -347, 241, 392, -174, -431, 106, 453, -19, -443, -49, 455, 138, -401, -193, 376, 270, -317, -314, 277, 378, -199, -389, 147, 418, -65, -426, 9, 426, 84, -425, -155, 396, 215, -358, -285, 308, 324, -258, -391, 184, 379, -127, -434, 35, 408, 23, -419, -103, 389, 159, -361, -231, 349, 294, -270, -324, 232, 378, -160, -390, 101, 422, -13, -414, -45, 419, 129, -377, -172, 354, 254, -293, -291, 261, 332, -209, -367, 122, 390, -60, -424, -5, 409, 70, -402, -153, 364, 199, -337, -271, 275, 311, -236, -355, 156, 373, -101, -386, 34, 386, 34, -396, -98, 366, 164, -334, -208, 325, 286, -247, -310, 217, 357, -137, -359, 90, 380, -4, -393, -45, 378, 101, -352, -165, 329, 216, -293, -275, 249, 321, -197, -351, 138, 366, -77, -382, 5, 377, 60, -376, -131, 334, 187, -324, -238, 276, 283, -230, -316, 180, 352, -106, -353, 62, 390, 23, -357]
4676c57K94M34k16m75J33N06o3n10l5M96J23m72k03M37K69l90l30L21L98k69m40
4697c49J96M61j11m87K6M98N2m90j48M80K21m18l07L81L54l05m07K41M44j53m77
4718b98P7M91Jm96p0M80J58m40k47M06L20l61l74K97M25k23m56J31M82n6n03l1
4740b87M87J08m53k05M26K62l83l12L10L89k65m20K02M43j17m81L7M95M1m72j32
4761c27M66J98m10k78L75L41l06l92K32M34j70m56R7M65j9m68p4M71J46m28k37
4782c40M10K85l49l64L05L98k31m41J45M63p4m54k6M61J09m55j81M35K31l80l16
4803c69L36L76k84m16K09M51j19m64M1M70N5m76j27M59K02l98k90L65L31l03l75
4824c26K35M22j79m40Q7M65rm74q2M76J44m43k20M01K92l48l61K88M12k12m55
$$ y = [-357, -63, 371, 155, -320, -187, 319, 256, -254, -289, 207, 330, -142, -345, 92, 361, -29, -359, -38, 360, 91, -349, -153, 308, 197, -290, -264, 234, 286, -204, -352, 128, 349, -69, -376, 5, 359, 54, -353, -112, 332, 179, -298, -221, 270, 271, -225, -295, 185, 343, -97, -344, 62, 382, 21, -353, -56, 369, 146, -310, -179, 303, 247, -256, -287, 200, 308, -145, -350, 76, 338, -45, -357, -47, 342, 77, -343, -141, 302, 185, -296, -259, 236, 277, -195, -327, 139, 337, -73, -351, 24, 365, 59, -333, -101, 333, 163, -293, -196, 269, 250, -218, -292, 179, 325, -103, -340, 70, 355, 6, -358, -53, 345, 114, -327, -182, 281, 207, -247, -273, 188, 297, -158, -339, 96, 327, -53, -369, -33, 343, 59, -357, -148, 303, 184, -280, -239, 231, 286, -190, -317, 142, 344, -54, -344, 21, 352, 49, -326, -91, 331, 152, -288, -201, 264, 255, -219, -301, 175, 319, -124, -344, 57, 349, 1, -360, -72, 340, 128, -327]
4845c27J38M53n1m74k3M67R3m45j83M35K55l76l28L39L73k50m36J94M68j11m70
4866b59K6M62O8m75j26M47J99l98k79L46L40l14l60K15M38j71m56Q4M64%m74p3
4888b96M56J59m41k34L90L12l49l55K68M09k09m27J23M64n3m78nM63R7m39j80
4909c25M25K49l86l13L24L90k73m20J98M59j17m70J9M75O3m72j26M35K02m05k77
4930c45L54L37l07m00K50M33j62m64Q4M83j3m81p6M63J56m16k42L91K96l39l55
4951c53K80M03k01m52J50M56n3m75j6M75R4m56j78M14K69l85l17L29L78k59m19
4972c16J78M45r6m70K3M71N0m53j46M30K17m10k61L42L35l00l93K34M20j51m63
4993c14P8M82Om73r5M74J59m17k39L79L11l34l55K76M01k17m32J30M69o3m70k7
$$ y = [-327, -189, 264, 213, -261, -284, 183, 276, -169, -352, 83, 338, -38, -366, -27, 346, 96, -340, -146, 322, 211, -259, -233, 229, 297, -178, -304, 143, 342, -56, -335, 11, 351, 37, -323, -108, 330, 159, -297, -213, 251, 251, -223, -296, 160, 319, -122, -356, 34, 346, -3, -358, -90, 319, 110, -317, -194, 270, 217, -261, -266, 197, 294, -145, -325, 100, 349, -37, -350, -26, 364, 91, -329, -131, 328, 211, -259, -240, 235, 298, -174, -300, 135, 337, -68, -345, 9, 346, 39, -361, -111, 322, 160, -304, -220, 263, 250, -231, -307, 156, 312, -104, -346, 45, 341, 2, -353, -73, 330, 129, -323, -173, 283, 230, -245, -261, 214, 308, -148, -326, 88, 357, -28, -345, -16, 362, 103, -316, -138, 307, 211, -259, -236, 235, 285, -168, -314, 116, 333, -77, -338, 4, 339, 39, -354, -120, 300, 149, -314, -236, 246, 252, -221, -316, 158, 317, -100, -339, 40, 351, 17, -338, -62, 339, 122, -310, -180, 289, 226, -244, -271]
5015b71M79R6m47j79M15K56l68l30L19L89k56m19J77M41j01m58KM64P0m64j31
5036c16M36K10m15k75L64L33k81m03K21M39j59m47P2M73Mm61r5M64J67m23k41
5057c33L85L10l36l55K56M07j96m56J27M81n7m65l7M65J22m54j94M07K72l65l37
5078c53L12L88k58m18J70M50r4m57oM73P5m66j40M37K12m05k77L57L52k84m11
5099c43K17M51j59m42N3M79L4m78j12M59J78m08k55L76L08l29l51K53M13j86m53
5120b95J04M66k4m94m7M69J29m30k22M15K72l43l55L04L85k43m29J79M37q4m50
5141b56pM57R1m54j62M40K28m00k87L41L59k70m12K03M66j49m65N0M79L2m70j10
5163b96M52J85m11k67L80L15l24l80K56M14j93m54J08M87l7m65o8M66J41m34k32
$$ y = [-271, 208, 304, -143, -322, 93, 349, -19, -349, -30, 359, 103, -316, -139, 302, 201, -257, -255, 209, 279, -185, -316, 120, 330, -85, -360, 4, 337, 56, -347, -126, 313, 154, -293, -221, 252, 256, -205, -300, 164, 331, -92, -333, 52, 362, 26, -329, -73, 334, 138, -318, -191, 290, 233, -232, -269, 196, 318, -136, -330, 77, 349, -16, -353, -41, 347, 89, -329, -159, 291, 197, -260, -266, 207, 282, -184, -324, 113, 325, -80, -357, 0, 352, 68, -343, -126, 325, 166, -276, -223, 256, 290, -188, -300, 159, 337, -71, -326, 50, 358, 29, -322, -69, 344, 158, -295, -191, 275, 251, -243, -290, 179, 308, -122, -344, 71, 343, 0, -355, -51, 334, 91, -338, -159, 278, 194, -256, -263, 194, 285, -169, -331, 109, 337, -63, -350, -9, 350, 80, -332, -129, 337, 188, -277, -227, 252, 284, -186, -296, 156, 341, -70, -337, 43, 358, 34, -346, -90, 324, 131, -323, -215, 272, 235, -230, -298, 168, 309, -125, -357]
5184c57M10K82l47l47K90M02k35m31J58M74r1m71OM65R0m60j72M48K36l98l10
5205c58L43L81k89m11K02M39j12m55K6M76M0m67j23M53J85m12k79L86L30l33l89
5226c67K52M32j78m61Q9M90j0m81p7M72J59m48k24M00K97l49l59K99M05k14m51
5247c24J42M74o6m79k1M88J01m65j86M32K66l93l22L22L83k62m19J78M59j13m79
5268b84L7M85M1m73j25M56J91m04k87L61L40k92m01K24M41j61m58P0M97Km67r0
5290b97M55J62m24k42M02K97l32l73K78M14k03m48J16M99n7m90l7M78J17m51k14
5311c50M34K71l64l62L24L89k44m37J68M68r9m76QM87O7m70j55M38K32m07l00
5332c78L62L55k84m13K08M56j33m80P1M83K4m79j05M55J96m21k73L87L26l13l84
$$ y = [-357, 53, 335, -12, -359, -69, 333, 98, -333, -175, 299, 208, -263, -257, 208, 298, -162, -334, 114, 350, -48, -358, -15, 366, 77, -334, -132, 307, 195, -260, -234, 242, 282, -185, -308, 145, 330, -82, -361, 25, 355, 22, -367, -115, 317, 139, -322, -233, 257, 247, -234, -311, 161, 320, -128, -352, 48, 345, -4, -363, -64, 341, 127, -324, -182, 292, 226, -253, -274, 214, 315, -150, -336, 96, 362, -31, -353, -31, 352, 90, -329, -151, 308, 195, -284, -247, 238, 279, -194, -319, 137, 328, -76, -363, -2, 338, 46, -355, -131, 310, 149, -309, -239, 258, 260, -207, -297, 158, 320, -104, -346, 56, 353, 21, -352, -74, 340, 137, -311, -195, 304, 247, -243, -280, 198, 315, -136, -350, 84, 355, -9, -371, -47, 342, 98, -339, -171, 297, 198, -278, -270, 217, 284, -186, -341, 97, 329, -78, -378, -16, 339, 55, -358, -150, 306, 173, -307, -236, 247, 271, -208, -313, 142, 338, -83, -356, 31, 357, 44, -340]
5353c40K57M23j79m81J03M87nm96o6M75J38m52k10L99K94l52l64K96M06k23m51
5374c41J67M61o9m88mM73Q8m58j80M39K60l92l14L26L87k64m30K02M43j09m83
5395b86M7M89M3m74j22M55K06m29k79L78L41l01m12K47M41j80m72R1M77j7m71
5416b28q4M70J63m38k48M03L00l44l55K85L98j98m52J27M82n7m85k0M75J23m62
5437a45k08M31K82l84l24L09L93k58m33J83M69r9m71J6M73N9m58j47M35K14l87
5458e0k88L26L57k89m09K25M47j43m73O6M72L4m86r9M51J73m26k41L72L20l04
5479C5l97K71M18j89m48J09M80l7m74m3M50J42m33k20M13K72l42l43K88L77k06
5500A23m38J49M59p4m66j2M67R2m54j65M25K34l83l10L24L69k74m03J81M51j21
$$ y = [-340, -83, 340, 161, -320, -217, 270, 265, -231, -297, 178, 316, -136, -346, 53, 347, -5, -369, -73, 333, 110, -341, -174, 287, 218, -270, -274, 199, 287, -171, -351, 88, 348, -44, -358, -32, 355, 91, -339, -137, 306, 197, -286, -239, 250, 293, -181, -303, 152, 358, -71, -350, 28, 369, 68, -344, -97, 344, 164, -308, -217, 260, 243, -228, -312, 158, 321, -117, -365, 38, 338, -6, -361, -76, 322, 124, -328, -201, 281, 224, -261, -281, 194, 317, -145, -353, 78, 360, -24, -348, -39, 354, 96, -337, -154, 315, 216, -255, -239, 234, 293, -165, -312, 123, 337, -50, -338, -12, 345, 56, -353, -128, 319, 176, -297, -231, 241, 275, -211, -310, 141, 314, -112, -353, 19, 339, 35, -362, -91, 327, 138, -310, -201, 279, 242, -232, -275, 175, 317, -116, -336, 77, 349, 7, -336, -48, 329, 123, -315, -166, 293, 219, -247, -259, 208, 300, -154, -319, 106, 340, -43, -353, -29, 340, 66, -337, -156, 295, 174]
5521A74m60M9M47N8m82j09M46K08m07k75L70L17k97l65K29M28j71m49R4M72k1
5542B56m68n9M41J55m32k16L80K82l18l59K73L94k00m34J29M53o4m58l3M66R8
5563B86m31j83L98K58l59l25L11L67k45m07J71M37r6m45PM63N9m42j24M17K16
5584C33l92k63L51L12k81l76K17M15j53m36P3M60om37j00M36J62m18k22L60K94
5605C29l06l57K65L82j87m23J07M43m1m45l4M38J17m20j90L88K58l50l08K81L74
5626C21k34m07J55M44q0m43MM44O9m33j33M12K07l69k75L23L36k78l61J95M20
5647C17j45m34N1M58J4m43j00M19J56l72k50L53K91l14l28K35L91j62m20R3M49
5668B59l1m46n6M38J18l92k08L78K70l45l12K78L70k14l96J39M35p8m34jM38P4
$$ y = [174, -286, -237, 210, 268, -214, -323, 123, 331, -76, -351, 19, 336, 39, -326, -97, 331, 160, -289, -195, 277, 256, -212, -271, 170, 325, -107, -323, 57, 339, 21, -338, -65, 329, 129, -305, -176, 277, 213, -245, -278, 188, 286, -145, -328, 70, 328, -31, -356, -45, 322, 77, -330, -159, 278, 182, -263, -256, 207, 266, -176, -300, 117, 333, -59, -322, 29, 341, 60, -316, -99, 316, 163, -273, -200, 260, 254, -183, -283, 153, 315, -103, -325, 35, 329, 23, -334, -69, 313, 126, -297, -190, 253, 212, -233, -267, 171, 288, -132, -322, 66, 324, -26, -334, -53, 321, 87, -320, -165, 279, 199, -244, -240, 204, 273, -160, -293, 119, 326, -43, -318, 5, 341, 63, -298, -103, 317, 172, -262, -211, 247, 261, -182, -282, 137, 293, -79, -329, 24, 315, 1, -327, -92, 299, 137, -283, -190, 259, 228, -218, -274, 164, 282, -110, -318, 60, 330, -15, -327, -49, 321, 107, -289, -150, 285, 207, -227, -228, 210, 284]
5690B84m23j62M15K24l71k89L19L44k73l67J67M32j24m52N6M28K9m27r8M03J75
5711B90l74k48L53K85k92l47K38L86j66m18J06M43l8m22n1M36J14m02j98L65K78
5732C38l27l12K56L75k14l92J36M18n9m43jM18Q8m19j57L89K37l63k90L14L27
5753C19k51l79J72M30j18m33K3M51L6m39j16M01J95l65k49L28L05k73l55K16L98
5774B96j53m14Q0M33om18p9M23J41l92k17L63K64l03l26K45L77k06l94J28M19
5795B61n0m38j8M24J05m13j81L78K44l45k86K84L52k39l82J46M27q6m29MM32P4
5817B64m27j39M00K05l56k71L29L19k74l54K04L95j28m03L6M45Km31q2M09J60
5838C03l73k25L36K83l05l34K38L64j69l95J04M13l1m29m7M25J21m02j83L59K50
$$ y = [284, -139, -301, 114, 338, -33, -322, -3, 341, 68, -299, -132, 300, 176, -276, -220, 208, 237, -190, -288, 115, 290, -84, -332, 21, 306, 14, -333, -95, 291, 125, -293, -187, 256, 218, -204, -255, 181, 295, -107, -305, 60, 338, 11, -301, -45, 330, 116, -276, -140, 278, 219, -224, -225, 193, 281, -138, -295, 94, 331, -32, -322, -8, 319, 68, -311, -139, 291, 173, -260, -237, 214, 250, -189, -305, 96, 291, -74, -323, 5, 310, 37, -318, -102, 296, 143, -271, -191, 242, 236, -182, -261, 162, 303, -89, -306, 57, 321, 18, -308, -63, 314, 108, -286, -158, 261, 211, -227, -245, 179, 284, -129, -310, 68, 312, -33, -319, -35, 317, 78, -304, -158, 269, 183, -246, -242, 190, 264, -163, -302, 98, 303, -53, -324, 5, 324, 50, -304, -100, 295, 167, -236, -200, 245, 247, -184, -266, 143, 303, -70, -295, 41, 324, 19, -315, -77, 287, 118, -277, -173, 240, 209, -220, -267, 158, 279, -123, -306, 53, 303]
5859C03l21l10K64L69k15l93J45M15o8m23lM25Q3m16j55L87K16l31k75K96L24
5880C17k23l83J73M18j24m18M2M07N0m22j07L95J68l61k49L41K87k75l46K16L77
5901B83j52m00P6M11Lm21o7L97J53l88k01L41K64l03l08K53L44j86l81J27L99
5922B44m5m24k5M27R6l92j82L90K30l32k84K80L31k24l84J56M00p5m21J5M04N9
5944B44m04j25L76K01l61k46L08K91k42l57K03L87j43m04N8M20J1l90r9L87J67
5965B82l52k29L31K69k76l12K14L49j52l71R0L93j8m18m4M05J07l74j83L38K52
5986C01k99k95K53L28j86l74J20L95o1l91k3L94Q9m00j27L51J97l08k74K88L04
6007B82k28l47J62L79j00l86L8L93M4l88j12L78J70l45k14K94K74k56l16J90L59
$$ y = [303, -18, -328, -64, 305, 90, -303, -158, 257, 189, -234, -237, 188, 271, -145, -300, 87, 303, -28, -303, -7, 317, 94, -289, -116, 302, 178, -240, -198, 209, 259, -163, -270, 125, 293, -68, -317, 24, 311, 36, -310, -94, 283, 131, -269, -193, 218, 221, -200, -267, 130, 283, -105, -306, 35, 299, -4, -312, -59, 285, 99, -282, -155, 244, 199, -225, -250, 177, 273, -119, -301, 89, 319, -13, -297, -17, 314, 90, -294, -138, 262, 187, -234, -219, 185, 244, -160, -285, 91, 292, -69, -315, -7, 284, 42, -315, -112, 275, 132, -272, -214, 206, 217, -173, -272, 115, 282, -70, -299, 32, 301, 25, -287, -73, 276, 124, -247, -157, 236, 218, -200, -244, 161, 268, -106, -289, 49, 301, 2, -293, -40, 288, 102, -272, -152, 243, 182, -209, -232, 162, 251, -149, -276, 75, 272, -36, -310, -22, 282, 54, -293, -131, 248, 148, -238, -200, 193, 237, -151, -263, 115, 285, -60, -274, 20, 294, 38, -278, -88, 271]
6028B71j37l79Q7L86j3l96o9L93J18l53j85L15K48k93k87K26L34j64l64J10L60
6049B08k9l96j7L85Q3l73j58L60K11l03k69K57L19j98l56J68L55q4l69mL90N5
6071B35l64j27L64J83l18k48K81K85k35l26J91L40j24l72N8L74J6l75q5L71J20
6092B44l21j99L05K42k58k92K00L35j57l54R6L56j9l69m6L71R8l38j60L18K28
6113B80k89k60K39L07j92l28J26L67p1l68LL58P0l66j17L38J79l08k44K74K74
6134B72k26l15J65L43j14l60N1L77Ql67p6L47J36l26j90K92K39k47k89K07L27
6155B54j51l36P4L61k0l58l3L56R5l47j46L23J99k80k52K31K86j64l36J25L54
6176B35o1l56kL53N8l45j22L15J80k94k25K37K77k10k97J48L27q7l51K4L65K1
$$ y = [271, 134, -245, -158, 228, 215, -181, -250, 143, 261, -92, -277, 38, 286, -7, -294, -68, 266, 102, -262, -152, 208, 179, -217, -234, 151, 234, -139, -297, 63, 274, -29, -298, -41, 278, 80, -276, -108, 247, 163, -206, -210, 180, 235, -129, -256, 108, 291, -27, -275, 6, 291, 56, -270, -79, 261, 137, -235, -177, 197, 213, -162, -247, 124, 244, -77, -276, 29, 271, 13, -279, -79, 256, 99, -255, -159, 197, 178, -191, -237, 134, 232, -106, -266, 52, 280, -9, -269, -30, 277, 85, -243, -117, 250, 179, -189, -186, 172, 242, -124, -241, 97, 276, -32, -276, -2, 272, 46, -269, -104, 239, 125, -235, -184, 193, 201, -166, -242, 105, 241, -85, -275, 17, 256, 9, -280, -73, 254, 103, -233, -159, 202, 182, -176, -209, 147, 242, -105, -251, 72, 271, -9, -261, -30, 256, 92, -244, -119, 235, 174, -182, -184, 169, 227, -118, -240, 75, 255, -39, -264, -27, 250, 40, -257, -109, 218, 131, -220, -196, 169, 190]
6198A90l51p8L31J46l11j96K80K43k19k86J80L06j30l18O1L50j7l44m1L49R7l20
6220g8j62L02K09k68k61K31K82j62l05R1L35n7l36j5L43O1l21j26K93J80k72k36
6242b72K45K68j89l03J30L39r1l33ML51N3l51q3L21J57k88k14K64K49k13k82J58
6264h0L26j20l37N7L54Nl52o0L38R8l04j71K81K08k33k52J97K92j52l12Q2L33
6286A98m5l28k5L29Q1l21j36L03J70k57k39K39K60j81l01J35L33p3l28J0L34N6
6308B14l34r5L03J57k74k05K42K46k03k86J63L09j08l17L8L30Pl22p5L08J24k92
6330g0j71K68K07k26k47J81K82j42l02R1L00m1l19j0L25O2k92j28K87J78k66k04
6352b37K14K52j61k89J34K97p2l09J9L06M5l10q7K82J48k55k04K41K35k10k59
$$ y = [190, -161, -239, 92, 238, -73, -269, 11, 254, 35, -251, -71, 235, 105, -213, -152, 198, 181, -163, -204, 145, 242, -78, -240, 62, 271, 3, -258, -27, 255, 93, -212, -121, 214, 157, -179, -194, 149, 210, -111, -237, 56, 236, -36, -272, -27, 241, 52, -251, -121, 218, 127, -206, -202, 149, 202, -149, -232, 89, 246, -42, -256, 8, 257, 44, -238, -80, 246, 126, -211, -154, 200, 205, -147, -207, 131, 229, -75, -246, 35, 243, 10, -242, -45, 247, 95, -217, -135, 198, 153, -175, -200, 129, 210, -111, -247, 56, 226, -31, -270, -31, 229, 48, -253, -118, 215, 142, -186, -176, 158, 214, -120, -215, 88, 245, -29, -234, 8, 254, 51, -235, -72, 237, 129, -188, -150, 180, 187, -135, -210, 98, 222, -70, -241, 27, 234, 8, -239, -58, 224, 82, -220, -129, 171, 130, -189, -199, 126, 188, -104, -232, 55, 233, -33, -237, -23, 229, 68, -221, -87, 210, 138, -171, -152, 154, 199, -111, -198, 84, 232, -23, -227, 14, 249, 39, -220]
6373b20J49K91j03l13L6L20J7l03q9L01J30k79j76K58K10k13k44J68K82j33k89
6394b00O2L06ml26l7L03R2k84j30K67J84k40k28K05K52j51k62R5K95m4l15PL06
6417A53N3l01r8K75J46k56j93K12K29j78k63J24K89q4k98K2L16Ok90o5K73J17
6439A89k52j62K35J91j90k32J63K66j27k70N8L00kk97m9K94Q3k63j49K71J59k07
6461Ik19J84K40j28k64Q4K69m3k70j8K87N2k75j01K52J44k26j95J99K16j48k56
6483b07J09K63o4k77K8K73L1k75p6K64J19k39j55K15J94j73k29J39K66j00k74
6504a68M5K89j4k67o2K76R1k53j26K28J67j98k11J73K22j14k48O8K59j7k82k0
6526a62K67O3k48j01K29J42k14j78J83K05j44k31J11K28m3k63K1K61K9k52p3K46
$$ y = [-220, -71, 220, 117, -196, -160, 160, 177, -126, -215, 86, 216, -63, -239, 19, 229, 16, -228, -60, 222, 89, -200, -138, 168, 164, -162, -199, 104, 196, -88, -218, 49, 233, -7, -235, -30, 222, 71, -191, -96, 199, 155, -160, -153, 153, 206, -95, -193, 82, 228, -28, -221, -9, 220, 42, -221, -97, 192, 108, -190, -168, 148, 154, -136, -201, 72, 189, -63, -225, 10, 201, 11, -221, -58, 208, 81, -189, -131, 169, 167, -130, -179, 115, 198, -65, -214, 57, 216, 9, -210, -26, 214, 86, -178, -94, 175, 132, -138, -156, 131, 183, -92, -193, 59, 203, -23, -218, -19, 197, 49, -207, -98, 165, 101, -176, -148, 125, 156, -119, -195, 69, 188, -51, -206, 9, 203, 30, -199, -60, 206, 106, -168, -123, 166, 152, -115, -177, 99, 190, -63, -189, 39, 206, 8, -203, -30, 192, 78, -170, -102, 157, 140, -142, -162, 105, 168, -80, -181, 48, 190, -24, -202, -19, 186, 42, -189, -78, 150, 107, -156, -135, 126, 155, -97, -170, 76]
6548G6J10k15j53J92J87j51k18J29K35q5k52L9K58Jk58n6K52Q7k24j40K13J66
6570A93j90j96J60K18j17k40O6K52k0k70j5K55N9k46j01K25J44j96j81J66K13
6591A79j38k19J07K31n5k41NK52L0k39o2K21J13j99j54J84J83j67k02J23K17o6
6613A03k41L5K30kk43m9K43Q2k21j27K12J53j77j92J40K29j08k39P8K36k6k46
6635a30j5K36N6k23r4K10J39j87j67J48J97j29j98R6K11m0k34NK47J7k21o3K11
6658G2J03j92j49J79J58j44j89J08K08r0k16L4K40pk23m0K14Q1k15j08J91J49
6680A64j70j79J51J89j02k25Q8K28l5k20pK14N0k09q7J90J26j79j45J60J64j17
6702D9k00Q8K25n3k29J0K23K3k20n8K14R0k01j32J74J59j43j88J15J96p9k14M5
$$ y = [76, 186, -29, -182, 10, 197, 46, -172, -43, 192, 107, -145, -106, 152, 153, -105, -161, 91, 178, -46, -186, 27, 193, 3, -193, -33, 185, 68, -172, -106, 146, 126, -144, -159, 96, 155, -91, -192, 33, 177, -19, -200, -34, 179, 41, -178, -71, 160, 105, -136, -131, 121, 151, -88, -150, 71, 184, -15, -169, 15, 198, 31, -171, -48, 169, 103, -138, -103, 127, 125, -118, -167, 76, 158, -63, -190, 22, 175, -2, -194, -54, 175, 67, -172, -94, 142, 116, -130, -145, 91, 147, -76, -170, 40, 179, -8, -175, -27, 170, 41, -157, -61, 150, 110, -124, -119, 128, 145, -76, -139, 72, 175, -17, -166, 13, 171, 27, -162, -54, 154, 64, -152, -118, 122, 115, -108, -148, 66, 147, -68, -176, 15, 164, -6, -185, -34, 155, 53, -172, -84, 144, 109, -111, -118, 96, 146, -63, -150, 40, 166, -13, -158, 2, 166, 49, -151, -63, 162, 109, -120, -110, 113, 136, -84, -142, 72, 162, -39, -171, 3, 162, 19, -169, -54, 142, 63, -151, -106]
6725a06K18j6k24j4K13O9k07j07J96J36j55j60J25J90j03k00P6J99j9k22qK27
6747A08L7k22o9J93J02j55j42J50J53j11j93Q1K06m7k16J6K09K6k14o2K07P9j77
6770d1j21J58J43j38j67J16J79p5k04M4K11qk01l5K22N9j97r5J83J32j62j48J34
6793a1J74j05j95P1K06l3k20RK10M0k03p8J79R5j54j36J41J52j12j84R7J93n5
6816H1k12K6K03J6k03n8J93J03j88j20J62J41j39j52J03J75o7j87L0J95Nk01k1
6839a15J91O1j75r5J67J24j50j37J20J63j00j80O1J92k8j95j9J96M2j83q0J85
6861D5R9j64j33J37J55j10j78Q4J82n0j96K3J92K3j92n8J89Q9j66j18J59J32j31
6884A3j56J09J72p4j93M7K02rj91l9J96O6j81r0J66J11j36j37R5J68p7j96N6J83
$$ y = [-106, 112, 96, -128, -142, 71, 140, -67, -174, 22, 158, 3, -157, -32, 158, 55, -145, -69, 130, 111, -111, -119, 108, 145, -77, -146, 47, 149, -6, -148, 2, 155, 44, -149, -68, 138, 91, -125, -109, 100, 126, -88, -150, 57, 136, -41, -162, -4, 139, 1, -166, -50, 129, 54, -150, -106, 105, 97, -104, -139, 83, 142, -55, -150, 33, 165, 3, -145, -11, 163, 58, -137, -66, 140, 107, -113, -104, 106, 146, -57, -135, 44, 139, -15, -151, -10, 142, 30, -154, -57, 136, 81, -131, -105, 98, 114, -89, -147, 46, 149, -39, -159, 3, 144, 5, -147, -44, 131, 64, -123, -93, 102, 107, -94, -115, 76, 137, -38, -133, 34, 158, 8, -129, -9, 154, 54, -126, -65, 127, 99, -96, -115, 81, 123, -60, -140, 45, 144, -20, -153, -16, 139, 29, -149, -65, 117, 67, -129, -106, 86, 109, -83, -141, 48, 137, -29, -147, 12, 144, 13, -143, -34, 138, 64, -129, -82, 120, 111, -80, -119, 77, 143, -38, -128, 38, 149, 13, -124, -29, 139, 62, -134, -78, 105]
6908A05j9j94j0J84M0j64q3J76R3j49j30J30J49r6j81R0J73l9j84J1J85K9j90
6931g4m1J62Q9j50j20J44J39j15j59Q0J82m9j95M2J74Jj80l0J61P6j74r2J47J24
6955A42j37j42J06J55p9j69M6J78k1j84j1J83L9j68p0J51R5j35j10J12J44r5j50
6978a20P2J70m9j74J2J69L0j69m8J61O9j49r5J38J16j08j40P4J74n5j83K9J76
7001A00lj71l6J76N9j55r9J38J12j16j46J02J49o7j69M8J76k5j79kJ79L1j56n5
7025a09J38R3j31j19J10J44q3j53O1J70m9j59J0J70J0j66l9J60P1j43r6J23J28
7048A41j20j30O9J52n2j69K4J73oj62l8J60O4j41j00J33J13j24j24J03J44p1j54
7071a15L7J70jj82JJ61M6j66p5J45J16j26j28J24J20q6j41O9J53k9j80OJ58L1
$$ y = [105, 86, -108, -118, 66, 106, -58, -141, 35, 128, -21, -151, -21, 128, 32, -149, -59, 114, 75, -109, -98, 87, 116, -74, -115, 47, 136, -14, -134, 10, 149, 34, -125, -45, 137, 88, -107, -65, 109, 110, -70, -100, 61, 137, -37, -129, 18, 142, 5, -137, -31, 124, 45, -124, -78, 100, 79, -105, -116, 67, 106, -62, -132, 19, 114, -21, -131, -19, 125, 30, -120, -48, 122, 73, -101, -89, 80, 110, -59, -107, 54, 123, -26, -121, 17, 133, 25, -115, -41, 133, 78, -105, -76, 100, 97, -74, -110, 66, 125, -30, -129, 9, 121, 5, -141, -39, 110, 43, -126, -78, 98, 73, -106, -108, 71, 102, -54, -109, 29, 122, -9, -128, -18, 126, 43, -110, -49, 121, 72, -87, -77, 93, 103, -63, -102, 58, 129, -14, -110, 13, 141, 21, -109, -40, 112, 60, -109, -85, 88, 82, -80, -118, 42, 106, -35, -135, -2, 111, -13, -137, -34, 110, 39, -115, -78, 92, 91, -91, -90, 71, 117, -49, -124, 21, 137, 11, -117, 7, 127, 41, -100, -31, 122, 93, -87, -81, 77, 108]
7095A08j62m8J40Q0j43j06J25J20r4j42P1J52m4j68K7J58Qj53m7J60O8j50q6J47
7119B1R1j11j17R0J48p7j43L8J69j4j66j8J70M1j65o5J37J06j32j10J04J44r3
7142D8j50N2J57l8j50JJ53J7j47n4J51O3j27j01J29J14j24j24Q0J54n0j49K2J49
7166G6Mj49l4J60N3j43p3J25J14j20j19Q3J40o8j51M8J51nj59j5J57M4j61n6J43
7191D5Q0j23j12R7J44q9j45N6J48l6j70J7J56J9j52m5J39P5j35r6J22J21j04j30
7215a18P6J43m3j51K6J49K0j66l2J56N0j35q1J18J11j06j20R2J34o9j47L9J59
7238A05j5j71nJ53M5j51p8J51R4j28j17R7J33q6j39L8J65k6j57j6J69K7j62m8
7262a22J51O6j13j04J16J23j00j33R4J30m0j53K1J59Nj63l1J57O6j46q3J12J03
$$ y = [108, -54, -102, 38, 118, -25, -131, -6, 114, 20, -122, -51, 101, 57, -111, -84, 74, 82, -71, -118, 42, 110, -40, -126, 21, 112, 1, -116, -26, 122, 45, -98, -60, 109, 95, -71, -89, 81, 122, -43, -108, 29, 135, 3, -107, -3, 141, 48, -102, -50, 107, 69, -81, -80, 73, 90, -57, -111, 40, 103, -24, -125, 4, 118, -6, -130, -50, 104, 54, -95, -73, 76, 80, -69, -103, 57, 110, -33, -106, 19, 133, 13, -106, -23, 117, 49, -102, -54, 97, 92, -67, -82, 75, 119, -42, -98, 45, 125, 2, -110, -13, 131, 42, -103, -47, 101, 65, -105, -88, 68, 87, -65, -110, 29, 104, -31, -127, -5, 116, 12, -118, -42, 101, 58, -93, -67, 82, 102, -64, -96, 60, 110, -25, -106, 12, 123, 17, -103, -11, 123, 54, -93, -54, 105, 90, -81, -86, 67, 112, -39, -117, 34, 128, 0, -117, -20, 113, 27, -112, -74, 91, 65, -92, -108, 61, 88, -74, -122, 29, 95, -18, -122, -6, 117, 17, -116, -22, 108, 68, -85, -64, 95, 100, -63, -94, 63, 129, -17, -100, 12, 115]
7285A15j02j11O8J35n6j54N3J36rj49j2J40M2j41p0J41P9j14j16J02J30q9j27
7308a09M8J51k8j43j2J51L7j48n3J42P2j17j00J09J05p3j29O6J43m8j39J4J46
7331H5J5j50l7J37N6j32q8J20J05r7j38R0J41o5j37J9J53j1j41l2J57M9j43p3
7355a17J24R6j04j12R7J14n8j45N0J40j2j50pJ45K7j29o4J37Q1j10j07J07J11
7378A14p1j40O6J26l0j48K3J40J4j52m7J47O8j44q4J07J17r7j27Q9J31o4j45L5
7402g2J35Qj50j3J32N8j23q8J26R9j01j16Q0J35o0j46M4J39j2j33k6J52M5j41
7426b8n5J23O5r4j08R6J14q2j35O3J36l0j47KJ47J3j44m8J42O9j24q8R5J16r3
7451Ej23P4J36n6j14J2J48Rj57k2J37N4j24q5J18J04j01j03P4J22n7j38K2J66
$$ y = [115, 13, -98, -30, 105, 49, -105, -52, 84, 75, -74, -86, 54, 96, -45, -115, 26, 105, -9, -125, -23, 107, 18, -109, -61, 90, 62, -81, -93, 58, 95, -53, -106, 36, 108, -9, -109, 0, 105, 32, -97, -31, 112, 64, -75, -61, 85, 100, -50, -87, 50, 106, -26, -114, 6, 111, 14, -124, -34, 107, 42, -95, -76, 77, 66, -75, -107, 50, 99, -44, -117, 7, 103, -1, -113, -16, 98, 40, -105, -55, 85, 73, -77, -84, 61, 88, -41, -105, 32, 113, 3, -104, 3, 114, 43, -97, -31, 95, 65, -83, -60, 80, 94, -58, -105, 42, 110, -34, -118, -11, 106, 9, -118, -29, 102, 38, -107, -72, 63, 71, -79, -92, 40, 98, -25, -113, 13, 112, 11, -105, -25, 110, 50, -96, -52, 87, 75, -58, -84, 68, 113, -28, -83, 40, 105, 11, -97, -1, 113, 31, -104, -41, 95, 65, -82, -80, 67, 80, -64, -112, 30, 99, -25, -113, -18, 98, 5, -118, -44, 92, 36, -78, -66, 82, 91, -66, -88, 49, 103, -21, -106, 12, 116, 15, -88, -14, 108, 51, -87, -65, 101]
7475A01k2j47j7J54L6j45o8J36R0j22j09R8J24p5j45O1J28k0j51MJ43J8j35m7
7499a10J30O4j06q9J06J07r7j05N9J30l1j43K2J38Oj32m3J52N3j32p9J15J05r7
7523B3j18P0J27n6j30K8J43j3j54pJ47L0j24o3J13R0j13j16J03J29q4j37N3J36
7547G7j2j51lJ54K0j31n9J30P2j08r1J00J07p5j22N3J47m2j35RJ56%j49l4J51
7572F4N3j38p6J01J05j00j10P3J26m8j35J7J42Kj58jJ34M3j33o8J26Q8j10j12
7596a15Q9J21n9j35L7J55k6j55J2J45J9j30n5J27Q7j32r2J11J18p2j43N6J52l9
7620G6j48NJ42K5j50l1J26N7j21r3J10J13j03j28P4J48n3j40J5J51Jj54j2J34
7644D4N4j43o6J32Q6j04j20R2J28o3j32L6J51j9j50j0J47M5j47o1J32Q7j14j07
$$ y = [101, 79, -68, -85, 69, 105, -40, -108, 28, 118, -4, -113, -15, 109, 34, -111, -50, 78, 58, -93, -89, 54, 72, -63, -110, 20, 84, -22, -111, -5, 102, 5, -100, -41, 89, 58, -85, -63, 75, 81, -51, -94, 58, 111, -21, -100, 15, 120, 23, -95, -25, 102, 46, -84, -56, 87, 74, -80, -87, 60, 90, -34, -97, 16, 106, -7, -123, -20, 109, 25, -112, -59, 77, 65, -86, -89, 65, 85, -46, -105, 25, 97, -11, -102, -2, 105, 30, -92, -39, 108, 66, -69, -60, 96, 96, -53, -87, 64, 117, -21, -97, 4, 109, 9, -101, -28, 98, 50, -85, -68, 74, 76, -82, -83, 51, 94, -39, -107, 19, 107, -3, -115, -26, 95, 36, -99, -62, 93, 67, -88, -76, 69, 88, -42, -97, 30, 117, -15, -107, 4, 122, 50, -93, -37, 115, 76, -72, -67, 75, 100, -50, -81, 45, 102, -19, -112, -2, 111, 8, -120, -46, 102, 49, -91, -76, 75, 76, -78, -90, 44, 98, -45, -111, 21, 107, 3, -117, -25, 103, 40, -92, -56, 95, 76, -74, -84, 63, 108, -39, -100, 32, 119, 5, -102]
7668a02Q6J40q1j48N5J48j5j57qJ55K2j55m9J46O9j25j06J16J02q3j24N4J52m0
7692E2j48J5J49Rj56k1J53O3j41p5J10J11j09j24Q2J43n7j48K6J71j3j63k7J63
7716F5N2j49p5J36Q9j14j09R1J32q5j42O1J56l5j52rJ57K0j44n6J33R1j40j00
7740a27J17J13r2j31P0J47m1j43RJ53K1j56l6J56O0j36j05J37J17j06j31P2J53
7763A21n3j49J8J55qj50l0J58N8j62o6J25J02j20j14Q7J35p6j40M5J50qj59j3
7787i4J48N0j63p1J36J03j19j13J07J34q8j29M9J47k5j55PJ62K6j54n8J57P2j29
7811@j10J15J16r1j25N6J57n1j60J0J63J3j58m1J54N4j39q1J27R3r4j35R5J37
7835A05n8j47K5J57mj51l0J51N3j35q9J42J00j17j11R7J26p3j38M3J60pj71jJ61
$$ y = [-102, -16, 124, 43, -105, -50, 98, 83, -74, -82, 73, 95, -60, -109, 37, 106, -19, -125, -9, 93, 10, -114, -60, 92, 52, -96, -81, 68, 77, -79, -100, 53, 116, -25, -100, 10, 121, 12, -112, -30, 113, 56, -92, -66, 105, 92, -71, -98, 65, 117, -32, -107, 29, 118, 4, -105, -14, 118, 33, -109, -48, 108, 73, -79, -88, 69, 89, -55, -111, 22, 113, -27, -127, -10, 103, 11, -120, -50, 97, 56, -87, -78, 75, 96, -60, -96, 60, 120, -16, -121, 16, 133, 27, -104, -32, 121, 68, -81, -63, 92, 84, -66, -96, 62, 120, -42, -108, 17, 119, -1, -115, -28, 107, 31, -109, -64, 86, 78, -81, -94, 54, 104, -59, -130, 6, 109, -10, -123, -16, 118, 30, -99, -50, 97, 72, -83, -76, 86, 112, -42, -100, 57, 129, 0, -110, 5, 121, 30, -95, -39, 118, 67, -93, -83, 80, 93, -65, -106, 48, 102, -37, -118, 9, 102, 8, -127, -32, 105, 47, -100, -75, 82, 78, -73, -103, 48, 101, -34, -123, 19, 119, 2, -109, -12, 114, 41, -97, -54, 106, 99, -72, -73, 88]
7860H8J5j35o7J48P1j27j10J04J32p8j49O1J47k3j80J0J57K1j58n3J59P9j45r5
7884a28J25J10r3j36P9J47n9j46K1J71j5j49j7J29P1j47p5J29R6j01j22Q8J45
7907A23p2j53L9J67k1j51k5J59L0j41o8J39Q8j10j20R2J42q9j48O5J45k4j59q
7931a00J66K4j50o0J59O7j19r5J06J22r8j40P8J52m5j50J3J61J2j62l4J40P7j47
7955b3r4J33J10r4j49R9J26n4j59L6J57Lj61k4J56M8j52q4J43R2j19j11Q7J27
7979I3o4j53O5J56l1j55nJ61L4j44o5J36R1j19j10R7J32p9j40N9J51k6j66PJ63
8004H8K0j64n0J57P8j51j04J31J17j05j34P2J49m9j52RJ63Lj54l3J52O1j46q5
8028a27J31J07j15j26Q8J59o8j52L4J72k6j48k2J58N8j59o7J35R4j15j30J06J47
$$ y = [88, 103, -32, -99, 49, 120, -7, -117, -13, 119, 41, -108, -47, 100, 77, -103, -93, 64, 85, -73, -126, 33, 112, -33, -128, -3, 107, 14, -122, -43, 104, 45, -101, -80, 91, 76, -73, -90, 39, 110, -37, -112, 17, 113, 12, -110, -22, 123, 51, -102, -63, 104, 83, -68, -93, 66, 96, -45, -113, 26, 114, 4, -116, -24, 118, 29, -119, -54, 91, 67, -92, -100, 66, 90, -60, -120, 39, 106, -13, -108, -2, 120, 22, -118, -40, 112, 67, -83, -70, 91, 103, -59, -93, 47, 124, -23, -117, 16, 126, 32, -117, -18, 108, 54, -105, -69, 88, 91, -70, -94, 62, 110, -42, -126, 17, 109, -10, -121, -34, 93, 29, -124, -59, 97, 66, -89, -94, 67, 101, -43, -108, 28, 119, 0, -110, -13, 119, 40, -100, -41, 110, 84, -82, -75, 88, 108, -56, -106, 51, 129, -22, -126, 5, 122, 17, -117, -45, 104, 55, -97, -88, 75, 78, -76, -109, 43, 104, -42, -127, 4, 111, -4, -130, -42, 117, 49, -103, -69, 103, 77, -71, -93, 65, 123, -36, -103, 32, 126, 11, -119, -13, 134]
8051A34q4j53N5J63k9j74LJ68K1j57o1J54P7j36j03J12J28r8j44O4J63m3j63J6
8075h7J67J2j68m6J67O1j34r8J25J22j00j44Q7J57o5j56K4J69Kj70j7J68N3j43
8099a4r9J45R8j09j27Q6J43q1j45L4J80l1j76j5J60N0j56o5J41R3j34j12J13J35
8123A14q9j54N7J74m2j55oJ74K5j55o0J53Q7j41j14J25J39j00j50Q2J55n9j57
8146i7K0J81Pj69m9J67O8j49r9J34J05j12j31R7J32m8j72L8J64j1j70j8J60O0
8170A08j69q0J46J09j26j19J12J28o3j71N7J76k0j81MJ61L3j54p5J62Q4
$$ y = [134, 50, -103, -48, 115, 86, -88, -85, 83, 104, -53, -114, 40, 117, -19, -122, -10, 118, 20, -124, -60, 103, 60, -103, -87, 80, 92, -76, -122, 45, 106, -28, -126, -1, 121, 21, -123, -36, 121, 56, -100, -76, 93, 95, -75, -92, 76, 129, -14, -113, 32, 130, 21, -106, -20, 123, 42, -103, -69, 111, 80, -96, -111, 49, 99, -57, -122, 19, 112, -22, -134, -21, 114, 25, -129, -72, 102, 60, -95, -101, 73, 98, -57, -117, 36, 123, -18, -132, -7, 132, 32, -118, -36, 119, 60, -97, -77, 104, 111, -58, -107, 60, 128, -21, -120, 14, 119, 7, -124, -27, 105, 57, -115, -77, 87, 76, -94, -112, 48, 108, -61, -141, 5, 114, -12, -131, -19, 109, 46, -125, -68, 108, 88, -93, -89, 72, 105, -49, -124, 38, 122]
8191A22
$$ Imaginary data points
##PAGE= N=2
##DATA TABLE= (X++(I..I)), XYDATA
0@%%%%%%%%%%%%%%%%%qJ6j6J6j6K2l0L2l3M1m8N6o5P3q6R5j06J22j38J54j73J97
39A05k18K42k72L02l34L68m08M50m94N47o03O61p30Q06q88R80j084J203j336J489
59G86j670J887k149K474k890L445m229N419p469J1956l8473L6092Q0493q7898
73b226p5523O0322R5708n0851r7028K7881J05813j3623j03498p487J04525K2652
85F6665r7795m1601R2270N5692q0798p1277O9297Q2190n3311r2485L7293R7904
97F4044j8616j01242Q68J00067J7547r6436l4017Q9335M9737q0322o3084O8836
109c283P4889n5974q4340M1291R1648k5537r6320Q567R8067Q771r6643k6148R1952
122B6940M2602q4019n7518P3437P0273o0535q0361M6127Q7804l0645r2428J4714
$$ y = [0, 0, 0, 0, 0, 0, 0, 0, 0, 0, 0, 0, 0, 0, 0, 0, 0, 0, -8, 8, -8, 8, -8, 14, -16, 16, -17, 24, -24, 32, -33, 40, -46, 49, -57, 65, -73, 81, -92, 105, -113, 129, -143, 159, -175, 193, -215, 235, -259, 288, -315, 346, -384, 422, -466, 514, -570, 633, -703, 786, -884, 1003, -1146, 1328, -1562, 1883, -2346, 3073, -4396, 7560, -30913, 5179, 85672, -2226, -77749, -17427, 78281, 27430, -69598, -41717, 64096, 50473, -53025, -60512, 44013, 66665, -31130, -72731, 19539, 75231, -5567, -76844, -7547, 74643, 21332, -71153, -33860, 64044, 45428, -55814, -54946, 45121, 62668, -33768, -67785, 21550, 71287, -9035, -72119, -3283, 71606, 15632, -68708, -27417, 64231, 38694, -57626, -49059, 49008, 57779, -38864, -65012, 26940, 69542, -14477, -71995, 1442, 71715, 11180, -69181, -23054, 64750, 34105, -58323, -43609]
134d3609R4422J374r3818j7324R0610L2754q4919m7437P6542O0737o5752p2259
146f8679N2696Q1332l7919q7541K2071R0712n790r0757j0102Q8049K5229q2795
158b3494l9071P5480N1525o6312o2484N5505P1712m3241p9118K9536Q4258j4844
170C9452q6923n74Q6754J6050q3724l0938P7923M4681o9589n6605N9240O6596
182F2343m7314p4251L4323P9743k0622q2953O446Q3925P878q2621k2219P8839
194B3517L6022p2629m8934O3879O0312n2940o9610M0213P6413k6264q0426J1819
206c8628Q1754K609q0417j6429P6824K9420p1167m1332O3669N1979n4540o1235
218e7493M3859O8717l1832p4293J8682P7481m858p8158r100P6178K2658p1619
$$ y = [-43609, 50813, 52187, -41631, -58955, 31655, 64409, -20510, -67947, 8595, 69332, 3580, -68679, -15983, 65349, 27430, -60111, -38040, 52672, 46882, -43875, -53977, 34072, 59301, -23494, -62565, 12915, 64440, -1872, -64356, -8851, 62861, 19620, -59498, -29962, 54296, 39452, -47471, -48045, 38709, 54759, -28965, -59903, 18020, 62701, -6888, -63493, -4253, 62343, 15029, -59222, -24899, 54844, 34222, -48731, -42285, 41640, 49518, -33103, -55322, 23517, 59539, -13090, -62024, 1855, 62167, 9227, -60383, -20170, 56243, 29979, -50447, -38628, 43126, 45735, -34682, -51111, 25713, 55133, -16034, -57366, 6303, 58282, 3742, -57493, -13634, 55083, 23251, -51042, -32360, 45121, 40263, -37895, -46995, 29183, 51841, -19778]
230a9778l5163O4859M6259n6213n5589M6213O3109l5161o8733K3404P2502j1140
242C4569p4390j575P4211J4399p1912k7038O7245L8978o0307m9738N1293N8737
254E4472m0542o5607K8629P0188j6065p2336L407P2291Q979p0167k0806O6210
266A8653L1862o0528m2004N3217N0993m4386n8642L4090O4506k2609o8353J0367
278c2834O9873K179o9008j4433O5864K5913o0661l6211N3829M5121m5640n2512
290d8520L6417N8426k6406o2761J5703O5437m508o6319p032O5244J8501o2097
302a7915k9569N6845L9693m9637m8451M0808N5465l0736o0488J9943O3511q846
314C0623o4562k217O3826J3014o1357k3369N7244L3111n1532m2030M4215M9761
$$ y = [-19778, -54941, 9918, 56177, -36, -55625, -9412, 53697, 18536, -50197, -26793, 45709, 34569, -39821, -41396, 32815, 47214, -24698, -51736, 15509, 54487, -5820, -55558, -4265, 54472, 13930, -51677, -23048, 47140, 31075, -41261, -37854, 34437, 43416, -26751, -47557, 18653, 50515, -10013, -52017, 1200, 52193, 7807, -50835, -16745, 47761, 25152, -43201, -32834, 37039, 39218, -29790, -44223, 21641, 47554, -13107, -49318, 4511, 49632, 3992, -48520, -12103, 46323, 19917, -42844, -27141, 38296, 33788, -32531, -39563, 25681, 44182, -17915, -47484, 9361, 49054, -583, -49034, -8226, 47239, 16503, -43985, -24042, 39469, 30623, -33939, -36156, 27670, 40684, -20673, -44042, 13202, 46313, -5219, -47249, -3034, 46727]
326D6727l5384n5981K5312O0310j4374o2540L038O2563Q141o0460j8734N6511
338A5129K8365n0961l6801M4160M3999l6348m9872K7687N4414j8353n7476Q426
350b7631N8952J870n8701j2242N6537K2301n2487l1630M6683L9756l9408m6440
362d2440L1076N1494k2020n4906J2611N6743l058n7096o434N5996J5813n3418
374a5639k4880M9377L3373m3770m1037L6687M7477k8369n2358J9033N5459r164
386B6189n6681q12N6003J0480n3599j9537M9736K7776m4601l5019L8368M1286
398C9589l1220m6394K3190N0291j4448n2733N172N3521M374n2587j3786M9799
410A4768K2634m5384l0539L9539L7244l2640m2565K4985M6509j6849m9076Q472
$$ y = [46727, 11343, -44638, -19326, 40984, 26610, -35930, -32892, 29671, 37812, -22648, -41382, 15129, 43494, -7467, -44268, -108, 43891, 7543, -42329, -14642, 39772, 21419, -36057, -27631, 31321, 33191, -25510, -37752, 18785, 41086, -11401, -43031, 3652, 43408, 4000, -42440, -11364, 40130, 18110, -36796, -24185, 32558, 29500, -27596, -34030, 21966, 37779, -15639, -40519, 8858, 42231, -1539, -42576, -5889, 41588, 13219, -39139, -20106, 35353, 26189, -30492, -31304, 24699, 35179, -18420, -37957, 11779, 39555, -5046, -40065, -1697, 39589, 8369, -38025, -14835, 35456, 21008, -31725, -26553, 26968, 31342, -21245, -35031, 14768, 37402, -7982, -38521, 1018, 38262, 5622, -36943, -11958, 34551, 17702, -31374, -22902]
422b2902N0374P5n0336q655M8972J7131m6178k5289M1917L2799l6205l9347K9175
435h469M4562k1153m8242J2443N0204l524n0492n283M9230J3687m6574k1475M2737
448G651K8583l7781l4897L1835M0324k4888m4635J7092M7620q666m9065j51M8822
461B1844Q885m6916j7201M3401K4720l8550l1192L2627L6509k5985m0548J8848
473a3558M3414j1340m5077L653M5604M170m4882j1970M2866J9518l9473k6582
485c3657L4705L2789k8767l7899K1841M1605j4306m3888O488M4732J310m4244
497a9291q854M2558J6068l9763k2752L5955K8912l1093l4346K5267L8842j8550
509A2953m2213J1073M4216l207m4671m840M3579J2563m1001j9689L7139K5954
$$ y = [-22902, 27472, 27547, -22789, -31444, 17528, 34659, -11519, -36808, 5109, 37908, 1703, -37644, -8469, 36093, 14940, -33302, -20859, 29345, 25821, -24671, -29954, 19276, 32963, -13611, -35086, 7651, 36234, -1547, -36444, -4609, 35715, 10827, -33808, -16716, 30904, 22238, -26827, -26978, 21844, 30729, -16187, -33388, 10013, 34733, -3817, -35009, -2382, 34127, 8142, -32406, -13558, 29856, 18516, -26561, -22908, 22696, 26866, -18016, -29986, 12880, 32398, -7075, -33657, 1048, 33837, 5070, -32829, -10988, 30617, 16311, -27577, -21089, 23643, 24953, -19291, -28145, 14413, 30481, -9282, -32034, 3921, 32833, 1740, -32606, -7339, 31503, 12953, -29260, -18187, 26029, 22822, -21849, -26689, 16890, 29453, -11548, -31237, 5902, 31856]
521C1856l2267l1190K6628L5438k0397l8623J3806M0778o833m1852l52M1758P630
534B6380m0442j4756L7744K1433l3823k7396K8736L2326k2770l6110J6226L8629
546B6177r395l9881K492M0039M288l9094j0836L7233J7087l4389k2938L0600K8264
559B9647k5836l2874K0163L6496j3752l8967O767M0094L91l9826p470L8246J4094
572B7173l5447k0117L1734K5379k7189k9820K2040L3427j6309l6127J0102L7856
584B2702l533l8458l306L7866J0046l5990j6513L2843K2351k8626k7316K3511
596d423L1219j7790l3986J1747L5654n562l6266n72L5982O591l4766j2430L2683
609H081J8008k9678k3200K5746K7764k0938l1512J5341L4226r237l5768K869L6066
$$ y = [31856, -411, -31601, -4973, 30465, 10068, -28555, -14749, 26029, 19196, -22656, -23008, 18750, 26380, -14062, -28818, 8926, 30359, -3464, -30860, -2124, 30202, 7432, -28678, -12452, 26177, 16782, -23099, -20607, 19432, 23720, -15374, -26210, 11023, 28110, -6279, -29217, 1383, 29647, 3811, -29063, -8900, 27596, 13844, -25123, -18356, 21738, 22129, -17697, -25167, 13079, 27173, -8274, -28391, 3343, 28722, 1533, -28287, -6247, 27180, 10871, -25256, -15154, 22702, 19169, -19289, -22595, 15271, 25317, -10673, -27186, 5657, 28008, -618, -27934, -4423, 26796, 9006, -24980, -13233, 22421, 16859, -19407, -19979, 16003, 22594, -12172, -24602, 8081, 26089, -3589, -26789, -1043, 26721, 5783, -25729, -10388, 23838, 14601, -21167, -18298, 17768]
622A7768L462l5223r491L3351J5093l0571k0121K7058K4584k2861k8393J8064
634g280L1478j2719l3715O851L4993p06l5117n636L4040J1755l1751j7411K8341
647C123K2358k4041k6402J9129K9441j3767l1492Q226L2649k602l2898l017L2308
660A3015Q544l0803j3921K8383J8962k5076k3452K0851K7179j5911k9980J0444
672a1765L1701m707l2322j018L1900O572l0556j1727K8387J6476k5522k0743K2028
685a296K4482j7943k7628J3278L0037q114l1592K558L2110L136l1501q778K9812
698H561J4029k7072j8711K3554K2623j9374k5714J4799K8003r944k9474M910L0183
711A6373K05l0055n398K9102J0444k7238j5255K4469J9602k0860k3274J6515K6112
$$ y = [17768, 21230, -13993, -23484, 9867, 24960, -5611, -25732, 1326, 25910, 3049, -25344, -7280, 24198, 11479, -22236, -15385, 19608, 18902, -16215, -21851, 12189, 23944, -7807, -25218, 3123, 25481, 1440, -24962, -5833, 23608, 9841, -21651, -13425, 19224, 16622, -16276, -19293, 13015, 21559, -9244, -23165, 5218, 24180, -896, -24348, -3497, 23682, 7771, -22209, -11765, 19936, 15229, -17093, -18111, 13789, 20361, -10195, -21922, 6465, 22941, -2581, -23324, -1296, 23186, 5243, -22385, -9107, 20930, 12816, -18776, -16218, 15892, 19028, -12473, -21251, 8561, 22590, -4482, -23193, 361, 22984, 3610, -22104, -7305, 20698, 10754, -18720, -13810, 16373, 16578, -13477, -18875, 10227, 20671, -6567, -21822, 2647, 22249, 1389, -21885, -5370, 20742]
724B0742j1669k7977O531K8889j378k8833l625K7965Q363k6366j2778K4113J6838
737B0815k1277k0488J7831K3636j3818k6162R254K7912m304k8743q69K8614N976
750A8377k7460j0827K5426J5221k2608j9005J9217K2127j5347k4586J1135K6368
762A8038o685k7442K019K7805K737k7367p526K6049J2168k3868j6411K0817K0083
775B0417j7051k2973J2761K4997q176k6119L518K6394J050k5909n454K4774R615
788A7844k3031j3496K0679J7044j7760k0159J4257K2707j0223k4555N803K5598
800A4708j185k5725l441K4991P857k3426j1918K1219J5466j8438j8514J5248K1016
813A7858j1749k2951P899K4347l802k5103n02K5133M928k4362r257K2722J3337
$$ y = [20742, 9073, -18904, -12373, 16516, 15138, -13695, -17320, 10645, 19008, -7358, -20136, 3977, 20815, -462, -20950, -3119, 20517, 6699, -19463, -10209, 17703, 13399, -15344, -16213, 12401, 18377, -9083, -19910, 5516, 20737, -1871, -20876, -1659, 20468, 5121, -19465, -8330, 18038, 11353, -16089, -14070, 13735, 16472, -10895, -18421, 7628, 19796, -4072, -20483, 334, 20417, 3366, -19607, -6846, 18151, 9975, -16144, -12626, 13768, 14818, -11091, -16545, 8229, 17844, -5187, -18683, 1996, 19040, 1280, -18879, -4622, 18085, 7862, -16693, -10890, 14708, 13523, -12202, -15643, 9348, 17205, -6221, -18139, 3080, 18546, 108, -18406, -3158, 17858, 6109, -16842, -8943, 15404, 11602, -13501, -14003, 11130, 16058, -8304, -17561, 5161, 18498]
826A8498k0295j6921J7157J9857j3489k2061R518K3447n364k4122J195K4111K874
839A4405k3460o821K2218J0562k0357j4071J7925J7192j4875j9823J1307K1825
851A6027p320k3049L103K3443J159k3031n240K1845R033k0067j2397J7782J5314
864A6602j5104j7800J2074J9851q767k1383N134K2362j238k2699k777K2292O787
877A5334k1088j0586J9145J3987j6552j6874J3479J9092j0049k0683O425K1613
889A3243k741k1962r40K1735M594k0938q136J9567J1544j7617j4628J5037J7313
902A6071j1894j9407Q354K0792m563k1430O90K1319L065k0542o568J9188R741
915A4816j7362j2604J5144J5087j2565j7195R663J8871o425k0041K936K0631O98
$$ y = [18498, -1797, -18718, -1561, 18296, 4807, -17254, -7736, 15711, 10347, -13775, -12580, 11531, 14405, -9055, -15876, 6342, 16904, -3453, -17524, 401, 17593, 2718, -17105, -5798, 16027, 8707, -14342, -11239, 12204, 13363, -9668, -14908, 6937, 15970, -4097, -16494, 1288, 16602, 1498, -16302, -4228, 15623, 6856, -14527, -9393, 12969, 11731, -10968, -13745, 8547, 15334, -5754, -16340, 2805, 16792, 240, -16634, -3155, 15937, 5888, -14795, -8370, 13243, 10502, -11460, -12400, 9335, 13929, -7009, -15145, 4422, 15966, -1651, -16279, -1242, 16071, 4177, -15230, -6876, 13916, 9353, -12077, -11387, 9932, 12997, -7545, -14113, 5075, 14816, -2546, -15150, -6, 15081, 2516, -14679, -5016, 13855, 7430, -12611, -9675, 10956, 11654]
928A1654k0540m353J9748P884j8291j1108J6217J3894j3684j6156J0798J7872
940A3935p722j9056M502J9754j210j9946k144J9648N511j8765q787J7285J1901
953A4906j5196j4642J2549J6866r451j8468O027J9406k509j9662r68J9240M321
966A2419j8327p413J6901J0231j5069j2754J2868J4948j0284j6750P374J8084
978A2228m169j8839P87J8954K660j8414n983J7221R022j5513j1670J3346J3856
991A3486j0836j5627Q174J6894n293j7788K352J8203P27j8145l848J7595O931
1004A2825j6461r863J4753J2507j2507j4733R815J6412o849j7492L694J7982n54
1017I529j7916k500J7340N410j6341q109J4914J0616j3086j2854J0878J4787q291
$$ y = [11654, -8886, -13239, 6509, 14393, -3898, -15006, 1211, 15105, 1421, -14735, -3937, 13935, 6213, -12843, -8341, 11413, 10203, -9743, -11887, 7761, 13272, -5493, -14280, 3005, 14906, -290, -14932, -2383, 14483, 5032, -13436, -7409, 11997, 9488, -10174, -11142, 8098, 12419, -5908, -13321, 3580, 13811, -1258, -14012, -1144, 13804, 3520, -13230, -5856, 12228, 8059, -10780, -9993, 8961, 11621, -6793, -12776, 4445, 13467, -2046, -13716, -370, 13486, 2650, -12977, -4803, 12091, 6798, -10990, -8638, 9565, 10292, -7853, -11701, 5894, 12825, -3636, -13499, 1254, 13761, 1254, -13479, -3664, 12748, 5899, -11593, -7899, 10083, 9529, -8387, -10887, 6453, 11863, -4478, -12587, 2327, 12943, -143, -12997, -2119, 12668, 4377]
1030D377j6257N368J7214k248j7552r72J7268M075j6399o962J5001R524j3187
1043g50j1704J1065J3490q703j4879O179J5891l476j6516O73J6706K208j6401
1056f217n101J5558P911j4184j0486J2292J2671r983j4410P383J5596m610j6265
1069i845J778J6467R89j6201l704J5557O311j4498q765J3017J1042j1117j3041
1082a2010Q831J4622o187j5725L308J6249l30j6188k595J5552N348j4411p837
1095a1373J2879R975j1019j1770Q931J3216o622j4309M178J5024j571j5352j114
1108h927J5194L823j4523o467J3350Q853j1711j0916R664J2578p382j3765M951
1121e278J4506k450j4832n2J4783K514j4365m916J3607P225j2454r382J0889J1329
$$ y = [4377, -11880, -6512, 10702, 8454, -9098, -10070, 7198, 11273, -5126, -12088, 2913, 12437, -750, -12454, -1389, 12101, 3398, -11481, -5302, 10589, 7113, -9403, -8730, 7976, 10184, -6217, -11318, 4240, 12151, -2033, -12519, -227, 12444, 2461, -11949, -4566, 11030, 6420, -9845, -8067, 8400, 9389, -6812, -10516, 5041, 11352, -3146, -11911, 1106, 12148, 1031, -12010, -3179, 11443, 5256, -10469, -7161, 9088, 8758, -7430, -10025, 5527, 10875, -3536, -11373, 1506, 11481, 462, -11308, -2377, 10839, 4217, -10092, -5914, 9110, 7539, -7813, -8927, 6267, 10090, -4433, -10900, 2450, 11303, -408, -11324, -1660, 10918, 3536, -10229, -5278, 9228, 6778, -8054, -8106, 6677, 9191, -5174, -10090, 3517, 10742, -1712, -11094, -205, 11124]
1135A1124q940j2957O654J4138m112j4823J436J4972J243j4623l795J3814O145
1148A0276j2621q232J1151J0017r381j1542P385J2798n190j3697K799J4200k74
1161G689j4256k310J3789M821j2840p130J1436R137r689j0781P687J2006n503
1174D056j2841L266J3304r98j3418j256J3209L490j2645n683J1736P749j0431
1187d62r647Q758J1232o751j2452M493J3220k105j3500k97J3353K622j2790m778
1201i104J1885O744j0688q524R260J0046p549j1352N612J2351l476j2982J160
1214f617J3177J232j2947l559J2228N737j1075p668R596R264p854j0507N968J1396
1228H371l973j1951J936J2216J20j2188k181J1822M234j1120o215J0059Q017q637
$$ y = [11124, 2184, -10773, -4119, 10019, 5907, -8916, -7480, 7492, 8735, -5888, -9683, 4131, 10276, -2345, -10577, 574, 10591, 1210, -10332, -2947, 9851, 4661, -9036, -6237, 7963, 7689, -6567, -8877, 4912, 9733, -3107, -10237, 1199, 10336, 647, -10134, -2447, 9559, 4056, -8785, -5519, 7785, 6787, -6631, -7887, 5322, 8812, -3833, -9516, 2220, 9969, -462, -10109, -1351, 9881, 3130, -9322, -4829, 8391, 6286, -7214, -7511, 5842, 8464, -4326, -9104, 2781, 9525, -1163, -9687, -427, 9619, 2070, -9282, -3670, 8681, 5205, -7777, -6617, 6560, 7792, -5155, -8714, 3514, 9251, -1824, -9492, 104, 9368, 1514, -8993, -3025, 8371, 4398, -7553, -5617, 6599, 6719, -5469, -7650, 4172, 8406, -2714, -8929, 1130, 9147, 510]
1242E10r566O896J0788m955j1571K849J1995p33j2024j305J1681L270j1070n101
1256h336J0189O789r062q327P710R639o082j0744M235J1514k195j1922M4J1907
1270E359K113j1457m161J0605O027r405p611P960Q900o345r901M615J0611k792
1284D518j1049R12J1172J052j1023k976J0491M859r621o592Q403Q103o884r309
1298g944N159J0154l295j0625J398J0746M70j0573k247J0118L929r463n480Q534
1312H81O920p399q206O010R311m411j0127K615J0603p05j0684j220J0405L078
1326G071r783m754Q865O226p701p480O389Q479m917r278L340R835j665j0139p9
1341e591J0116J881r786l653R118N314q126o750O812P945n276q821L642R352j964
$$ y = [510, -9056, -2160, 8628, 3673, -7898, -5049, 6946, 6213, -5811, -7116, 4565, 7835, -3235, -8336, 1853, 8642, -420, -8747, -1037, 8602, 2520, -8224, -3989, 7525, 5330, -6592, -6548, 5359, 7472, -3985, -8146, 2459, 8486, -919, -8530, -570, 8330, 1985, -7916, -3301, 7310, 4518, -6531, -5619, 5553, 6605, -4418, -7394, 3097, 7956, -1665, -8257, 146, 8249, 1365, -7944, -2785, 7369, 4074, -6551, -5153, 5593, 6063, -4510, -6757, 3361, 7290, -2173, -7653, 881, 7801, 402, -7804, -1794, 7517, 3106, -7021, -4406, 6197, 5492, -5192, -6412, 3993, 7071, -2712, -7466, 1399, 7625, -76, -7556, -1167, 7312, 2395, -6883, -3543, 6292, 4627, -5512, -5591, 4525, 6406, -3380, -7033, 2085, 7399, -727, -7477, -665, 7280, 2004, -6817, -3175, 6177, 4213]
1356D213r581L09R530J302r265k842Q756M304q024n681P064O926n888p985M475
1371b387Q813k889r333J223R513M87r360k134Q926L645q216n012P300O187o212
1386E51p183M997P993l673q621K221R024o55r164r65R016K593q555m132P759N523
1402F729o684o676N401P545l977q162K506Q493j040q575m29Q447J854q124l225
1417e917P563M549o792n729N767O795m560p599L181Q143j667q411J68Q348J319
1432E158q043k690P492L928o786n011N902N983m922o801L832P431k571p938J224
1447c812Q179K41q168j678P845L091p263m363O428N462n403o354M247O994l006
1462B440p429J728P667m45p709q48P544K136p177l380O580M574n769n600M753
$$ y = [4213, -5368, -5059, 4471, 5773, -3492, -6334, 2422, 6726, -1298, -6979, 85, 7011, 1123, -6862, -2387, 6426, 3537, -5796, -4573, 4940, 5427, -3933, -6067, 2859, 6504, -1712, -6724, 576, 6763, 551, -6632, -1635, 6358, 2685, -5936, -3715, 5309, 4654, -4510, -5475, 3541, 6134, -2421, -6553, 1206, 6729, 45, -6631, -1230, 6315, 2338, -5824, -3318, 5175, 4135, -4440, -4869, 3578, 5432, -2692, -5917, 1646, 6195, -597, -6326, -559, 6236, 1676, -5923, -2742, 5401, 3734, -4677, -4509, 3839, 5158, -2885, -5575, 1917, 5845, -941, -5952, -50, 5933, 1011, -5790, -1958, 5473, 2902, -5036, -3812, 4367, 4608, -3560, -5238, 2607, 5698, -1565, -5928, 500, 5962, 559, -5795, -1548, 5446, 2440, -4989, -3261, 4406, 3961, -3748, -4596, 2948, 5084, -2093, -5473, 1107, 5681, -88, -5688, -935]
1477i35O440l519p059K218P370q63p441m65P252J735o906k860O339L911n667m840
1493e290M842N679l907o364K832O888j644p174L48P248R69p078k227O621L415
1508E158n985m428N153N264m209n923L179O392k083o715R70O865J77o833j350
1523d368O625K527o194l638N533M650m672n476L626O110k487o474J278O628j24
1538C544o533j021O281K072n870l052N330L942m656m729L842N415k925n947J894
1553b413O287p52o411m11O306J546n994k597N466L524m801m289M005M929l177
1568A218n406K266N786j319o005L26O082P27o009j748N701K765n204l718M524
1583a4M524l684n140K721N561j691n793O65N828L36n713j289N442K204n048l055
$$ y = [-935, 5505, 1986, -5073, -2855, 4515, 3652, -3789, -4254, 2998, 4733, -2173, -5033, 1306, 5217, -450, -5290, -448, 5231, 1324, -5040, -2208, 4680, 3036, -4138, -3790, 3458, 4427, -2651, -4878, 1743, 5158, -827, -5255, -102, 5162, 953, -4970, -1791, 4601, 2518, -4197, -3227, 3638, 3815, -3018, -4368, 2257, 4784, -1410, -5048, 485, 5135, 463, -5013, -1387, 4723, 2236, -4238, -2960, 3668, 3544, -2989, -4010, 2271, 4343, -1527, -4579, 751, 4693, 37, -4692, -850, 4565, 1640, -4307, -2413, 3874, 3122, -3289, -3700, 2606, 4152, -1842, -4439, 1027, 4551, -250, -4539, -534, 4395, 1218, -4188, -1922, 3864, 2545, -3460, -3134, 2948, 3675, -2334, -4082, 1619, 4384, -820, -4538, -14, 4510, 826, -4314, -1593, 3968, 2277, -3516, -2851, 2977, 3313, -2400, -3689, 1753, 3957, -1091, -4146]
1599d146M533L823l857m521L061N078k139n470J117N662o6n632r81N418J916m975
1615a179k790M435L516l788m109L073M599k308m964J475N232n89n351l33N319
1630B238J267n102k213M731L046m153l782L431M363k616m786J775N019q98n115
1645b795L9N071Q01m919j605M640K384m228l127L703L778l034m334K230M741j345
1661B000m955M22M975M92m826j341M522K108m077k785L555L373k983l813K311
1676a022M200j594m488Q30M638j2m664q23M520J651m221k407L729L100l173l609
1692c345K469L996j742m238J005M371k84m385m38M298J155m105j843L805K520
1707C239l387l142K831L648k158m027J376M289n86m345k00M239R53l989j647L659
$$ y = [-4146, 387, 4210, 353, -4168, -1107, 3971, 1832, -3638, -2521, 3141, 3075, -2557, -3538, 1880, 3796, -1179, -3969, 466, 3982, 194, -3915, -842, 3757, 1449, -3515, -2040, 3192, 2603, -2748, -3081, 2238, 3505, -1597, -3810, 921, 3967, -186, -3968, -537, 3826, 1210, -3576, -1801, 3218, 2320, -2795, -2756, 2315, 3116, -1803, -3408, 1232, 3616, -612, -3739, -36, 3742, 708, -3626, -1396, 3345, 2000, -2955, -2533, 2442, 2934, -1892, -3233, 1289, 3397, -680, -3465, 90, 3463, 480, -3333, -1022, 3178, 1584, -2904, -2074, 2564, 2552, -2112, -2935, 1585, 3236, -985, -3392, 337, 3437, 264, -3345, -876, 3120, 1378, -2860, -1855, 2516, 2232, -2153, -2591, 1707, 2862, -1243, -3086, 719, 3239, -148, -3290, -459, 3189, 1031, -2996, -1620, 2669, 2083, -2262, -2462, 1777, 2730, -1259, -2906, 753]
1723G53K243l229k770K757L202k192l581J591L845r13m027J98M073N35l960j279
1739b754L690J954l292k533K791L001k226l357J647L569j007l714L98L762K04
1754B133l701q31L564J440l336k026L005K561k550l031J991L394j371l595O94
1769a659L673Ml642o19L469J206l227j728K921K192k535k608K077K973j582l250
1785b335J001L436l76l521k66L432R28l236j522K901K056k512k432K016K757j498
1801H29k998R91L121m56l177o4L144O07l071j125K885J633k598k109K220K516
1817B348j749k826J230L014o59l083J02L042M30k932r09K752J341k495j748K201
1833E9K098j843k435J434K691r67k863M32K966Q1k914o47K776J170k528j593K178
$$ y = [753, 2996, -233, -3003, -246, 2956, 764, -2817, -1226, 2619, 1706, -2321, -2123, 1950, 2485, -1475, -2754, 936, 2890, -402, -2935, -144, 2857, 631, -2726, -1079, 2490, 1483, -2231, -1833, 1929, 2133, -1568, -2399, 1165, 2605, -731, -2757, 248, 2809, 259, -2772, -781, 2613, 1242, -2353, -1659, 2014, 2018, -1624, -2243, 1226, 2432, -795, -2523, 398, 2590, 55, -2553, -476, 2497, 915, -2335, -1334, 2102, 1726, -1795, -2061, 1371, 2299, -937, -2459, 442, 2498, -14, -2446, -430, 2327, 829, -2169, -1178, 1943, 1487, -1690, -1754, 1390, 1997, -1074, -2199, 686, 2319, -279, -2388, -168, 2348, 599, -2227, -997, 2017, 1358, -1725, -1623, 1419, 1849, -1083, -1992, 760, 2101, -394, -2142, 59, 2157, 314, -2121, -687, 2004, 1037, -1826, -1394, 1572, 1653, -1261, -1908, 868, 2038, -490, -2083, 95]
1850I5J965j779k264J383K450r61k560N07K648p6k661l82K617Q23k463j289K237
$$ y = [95, 2060, 281, -1983, -600, 1850, 889, -1671, -1164, 1484, 1408, -1253, -1635, 982, 1805, -658, -1947, 290]
$$ [...]
8191b1
##END NTUPLES=NMR FID
##END=
