##TITLE=1H_LY-NiMg-Hex-240
 CDCl3, 8 sc, 
 7.2.2019
##JCAMPDX= 6.0         $$ Bruker NMR JCAMP-DX V2.0
##DATA TYPE= NMR FID
##DATA CLASS= NTUPLES
##ORIGIN= UXNMR, Bruker Analytische Messtechnik GmbH
##OWNER= root
$$ XWIN-NMR		Version 3.5
$$ Thu Feb  7 16:21:24 2019 Russian Standard Time (UT+4h)  she@DPX200
##.OBSERVE FREQUENCY= 200.1313
##.OBSERVE NUCLEUS= ^1H
##.DELAY= (6, 6)
##.ACQUISITION MODE= SIMULTANEOUS
##.ACQUISITION SCHEME= undefined
##.AVERAGES= 8
##.DIGITISER RES= 18
##SPECTROMETER/DATA SYSTEM= spect
##.PULSE SEQUENCE= zg30
##.SOLVENT NAME= CDCl3
##.SHIFT REFERENCE= (INTERNAL, CDCl3, 0, 15.7039)
##AUDIT TRAIL= $$ (NUMBER, WHEN, WHO, WHERE, WHAT)
$$ ##TITLE= Audit trail, XWIN-NMR		Version 3.5
$$ ##JCAMPDX= 5.01
$$ ##ORIGIN= Bruker BioSpin GmbH
$$ ##OWNER= she
$$ F:/spectra/data/she/nmr/H-F/1/audita.txt
$$ ##AUDIT TRAIL=  $$ (NUMBER, WHEN, WHO, WHERE, WHAT)
(   1,<2019-02-07 16:20:33.39 +0400>,<she>,<DPX200>,
      <created by zg, POWCHK disabled, PULCHK disabled
       configuration hash MD5:
       00 E9 B6 7A A2 85 ED C7 34 08 36 98 17 FE 4E 26
       data hash MD5: 16K
       83 20 A7 67 41 50 BC C5 58 8A A7 89 DB CB 5B 26>)
$$ ##END=
$$ 
$$ hash MD5
$$ 8C 21 A5 9D 3E 62 AB D7 D4 02 4E 36 55 9B DC B1
##$RELAX= 
##$RELAX= 
##$RELAX= 
##$RELAX= 
##$RELAX= 
##$RELAX= 
$$ Bruker specific parameters
$$ --------------------------
##$DU= <F:/spectra>
##$EXPNO= 1
##$NAME= <H-F>
##$PROCNO= 1
##$TYPE= <nmr>
##$USER= <she>
##$AMP= (0..31)
100 100 100 100 100 100 100 100 100 100 100 100 100 100 100 100 100 100 
100 100 100 100 100 100 100 100 100 100 100 100 100 100 
##$AQSEQ= 0
##$AQ_mod= 1
##$AUNM= <au_zg>
##$AUTOPOS= <>
##$BF1= 200.13
##$BF2= 200.13
##$BF3= 200.13
##$BF4= 200.13
##$BF5= 200.13
##$BF6= 200.13
##$BF7= 200.13
##$BF8= 200.13
##$BYTORDA= 1
##$CFDGTYP= 0
##$CFRGTYP= 5
##$CHEMSTR= <none>
##$CNST= (0..31)
1 1 145 1 1 1 1 1 1 1 1 1 1 1 1 1 1 1 1 1 1 1 1 1 1 1 1 1 1 1 1 1 
##$CPDPRG= <>
##$CPDPRG1= <>
##$CPDPRG2= <>
##$CPDPRG3= <>
##$CPDPRG4= <mlev>
##$CPDPRG5= <mlev>
##$CPDPRG6= <mlev>
##$CPDPRG7= <mlev>
##$CPDPRG8= <mlev>
##$CPDPRGB= <>
##$CPDPRGT= <>
##$D= (0..31)
0 1.2 0 0 0 0 0 0 0 0 0 0.03 0 0 0 0 0 0 0 0 0 0 0 0 0 0 0 0 0 0 0 0 
##$DATE= 1549542032
##$DBL= (0..7)
120 120 120 120 120 120 120 120 
##$DBP= (0..7)
150 150 150 150 150 150 150 150 
##$DBP07= 0
##$DBPNAM0= <>
##$DBPNAM1= <>
##$DBPNAM2= <>
##$DBPNAM3= <>
##$DBPNAM4= <>
##$DBPNAM5= <>
##$DBPNAM6= <>
##$DBPNAM7= <>
##$DBPOAL= (0..7)
0.5 0.5 0.5 0.5 0.5 0.5 0.5 0.5 
##$DBPOFFS= (0..7)
0 0 0 0 0 0 0 0 
##$DE= 6
##$DECBNUC= <off>
##$DECIM= 32
##$DECNUC= <off>
##$DECSTAT= 4
##$DIGMOD= 1
##$DIGTYP= 9
##$DL= (0..7)
0 120 120 120 120 120 120 120 
##$DP= (0..7)
150 150 150 150 150 150 150 150 
##$DP07= 0
##$DPNAME0= <>
##$DPNAME1= <>
##$DPNAME2= <>
##$DPNAME3= <>
##$DPNAME4= <>
##$DPNAME5= <>
##$DPNAME6= <>
##$DPNAME7= <>
##$DPOAL= (0..7)
0.5 0.5 0.5 0.5 0.5 0.5 0.5 0.5 
##$DPOFFS= (0..7)
0 0 0 0 0 0 0 0 
##$DQDMODE= 0
##$DR= 18
##$DS= 0
##$DSLIST= <SSSSSSSSSSSSSSS>
$$ [...]
##$SUBNAM2= <"">
##$SUBNAM3= <"">
##$SUBNAM4= <"">
##$SUBNAM5= <"">
##$SUBNAM6= <"">
##$SUBNAM7= <"">
##$SUBNAM8= <"">
##$SUBNAM9= <"">
##$SW= 20.0189088683792
##$SWIBOX= (0..15)
0 0 2 0 0 0 0 0 0 0 0 0 0 0 0 0 
##$SW_h= 4006.41025641026
##$TD= 16384
##$TD0= 1
##$TE= 0
##$TE2= 300
##$TE3= 300
##$TEG= 300
##$TL= (0..7)
0 120 120 120 120 120 120 120 
##$TP= (0..7)
150 150 150 150 150 150 150 150 
##$TP07= 0
##$TPNAME0= <>
##$TPNAME1= <>
##$TPNAME2= <>
##$TPNAME3= <>
##$TPNAME4= <>
##$TPNAME5= <>
##$TPNAME6= <>
##$TPNAME7= <>
##$TPOAL= (0..7)
0.5 0.5 0.5 0.5 0.5 0.5 0.5 0.5 
##$TPOFFS= (0..7)
0 0 0 0 0 0 0 0 
##$TUNHIN= 0
##$TUNHOUT= 0
##$TUNXOUT= 0
##$USERA1= <user>
##$USERA2= <user>
##$USERA3= <user>
##$USERA4= <user>
##$USERA5= <user>
##$V9= 5
##$VALIST= <valist>
##$VCLIST= <CCCCCCCCCCCCCCC>
##$VD= 0
##$VDLIST= <DDDDDDDDDDDDDDD>
##$VPLIST= <PPPPPPPPPPPPPPP>
##$VTLIST= <TTTTTTTTTTTTTTT>
##$WBST= 1024
##$WBSW= 4
##$XGAIN= (0..3)
0 0 0 0 
##$XL= 0
##$YL= 0
##$YMAX_a= 72470
##$YMIN_a= -93949
##$ZGOPTNS= <>
##$ZL1= 120
##$ZL2= 120
##$ZL3= 120
##$ZL4= 120
##$ABSF1= 10
##$ABSF2= 0
##$ABSG= 5
##$ABSL= 3
##$ALPHA= 0
##$AQORDER= 0
##$ASSFAC= 0
##$ASSFACI= 0
##$ASSFACX= 0
##$ASSWID= 0
##$AUNMP= <proc_1d>
##$AZFE= 0.1
##$AZFW= 0.1
##$BCFW= 1
##$BC_mod= 2
##$BYTORDP= 1
##$COROFFS= 0
##$CY= 11.3945322036743
##$DATMOD= 1
##$DC= 2
##$DFILT= <>
##$DTYPP= 0
##$F1P= 18.9103706918063
##$F2P= -1.10871071338519
##$FCOR= 0.5
##$FTSIZE= 0
##$FT_mod= 4
##$GAMMA= 1
##$GB= 0.15
##$INTBC= 1
##$INTSCL= 1
##$ISEN= 128
##$LB= 0.24
##$LEV0= 0
##$LPBIN= 0
##$MAXI= 10000
##$MC2= 0
##$MEAN= 0
##$ME_mod= 0
##$MI= 1.114404
##$NCOEF= 0
##$NC_proc= 0
##$NLEV= 6
##$NOISF1= 3.799351
##$NOISF2= 2.8
##$NSP= 1
##$NTH_PI= 0
##$NZP= 0
##$OFFSET= 15.70392
##$PC= 1
##$PHC0= -8755.621
##$PHC1= 11.40019
##$PH_mod= 1
##$PKNL= yes
##$PPARMOD= 0
##$PSCAL= 0
##$PSIGN= 0
##$REVERSE= no
##$SF= 200.130013532006
##$SI= 16384
##$SIGF1= 3
##$SIGF2= 2
##$SINO= 400
##$SIOLD= 16384
##$SREGLST= <1H.CDCl3>
##$SSB= 0
##$STSI= 0
##$STSR= 0
##$SW_p= 3612.71676300578
##$SYMM= 0
##$S_DEV= 0
##$TDeff= 0
##$TDoff= 0
##$TI= <>
##$TILT= no
##$TM1= 0
##$TM2= 0
##$TOPLEV= 0
##$USERP1= <user>
##$USERP2= <user>
##$USERP3= <user>
##$USERP4= <user>
##$USERP5= <user>
##$WDW= 1
##$XDIM= 8192
##$YMAX_p= 0
##$YMIN_p= 0
$$ End of Bruker specific parameters
$$ ---------------------------------
##NTUPLES= NMR FID
##VAR_NAME=  TIME,          FID/REAL,        FID/IMAG
##SYMBOL=    X,             R,               I
##VAR_TYPE=  INDEPENDENT,   DEPENDENT,       DEPENDENT
##VAR_FORM=  AFFN,          ASDF,            ASDF
##VAR_DIM=   8192,          8192,            8192
##UNITS=     SECONDS,       ARBITRARY UNITS, ARBITRARY UNITS
##FACTOR=    0.0002496,     1,               1
##FIRST=     0,             0,               0
##LAST=      2.0444736,     0,               0
##MIN=       0,             -93949,          0
##MAX=       2.0444736,     72470,           0
$$ Real data points
##PAGE= N=1
##DATA TABLE= (X++(R..R)), XYDATA
0 0 0 0 0 0 0 0 0 0 0 0 0 0 0 0 0 0 0 0 0 0 0 -5 8 -8 8 -8 8 -8 12 -16 16 -16 20 -24 24 -29 32 -34 40 -45 48 -53 61
43 61 -65 73 -80 88 -96 109 -117 129 -142 158 -174 193 -213 237 -267 301 -342 391 -453 534 -645
64 -645 805 -1051 1473 -2343 4828 -26084 -93949 1433 52697 -39121 -80947 7732 43810 -17221
78 -17221 -28147 26160 25677 -10428 -29 16835 -10808 -21486 7478 10860 -15535 -9766 17617
91 17617 19739 7820 4602 1309 6548 18731 -1318 -36205 -13748 31688 3615 -46286 -5863
104 -5863 53987 14975 -38464 3726 44360 -6618 -41988 550 10192 -37263 -28609 21019 108
117 108 -38542 9294 55258 2608 -35618 24921 56538 -10228 -42989 13373 35536 -14891
129 -14891 -31927 7262 20785 -1967 -8623 935 3216 3321 -893 -13797 -11535 5349 76 -16130
143 -16130 -1383 17339 -216 -10131 17693 20319 -17860 -15821 25005 10310 -39073 -18930 32745
156 32745 8865 -38305 -6449 40582 10634 -26870 3176 30022 -120 -18972 4748 10011
168 10011 -11034 -6927 9602 -1835 -12684 4751 11213 -8812 -12063 5963 4978 -9400 -5069
181 -5069 5014 1294 1133 8308 3090 -2944 8473 11316 -8110 -12086 6667 4249 -16935 -10755
195 -10755 9608 948 -12612 4065 15176 -4113 -8428 14321 11436 -15817 -9467 17547 6387
208 6387 -20145 -5550 20319 6208 -15293 -1672 14676 1503 -12005 -4223 2165 -3196 -4975
221 -4975 -2141 -1526 2422 7490 3449 -502 6466 8612 -2519 -6069 1991 -1158 -11993 -6396 4197
236 4197 -3233 -9627 4866 13339 -688 -5474 10351 12114 -5929 -8300 5647 3545 -9663 -6116
250 -6116 4541 772 -4326 2618 5484 -1673 -1425 4969 245 -7934 -3090 3493 -2328 -6884 680
265 680 6500 2640 556 4243 5295 2776 684 -2178 -4259 -2402 -2389 -7412 -7051 1239 3033 -2824
281 -2824 46 9499 7355 -1414 1477 7783 574 -8274 -2891 2676 -4780 -9124 104 5527 -963
296 -963 -2730 5263 7131 10 -2262 1694 1009 -3759 -4351 -1787 -919 -732 572 1719 2904 4114
312 4114 3095 616 68 -52 -2882 -5238 -3951 -2624 -3237 -1696 2150 3471 3125 5007 6071 2946
328 2946 327 861 -931 -5532 -5873 -2556 -2867 -4660 -846 4381 3402 1121 4047 6130 1560 -2769
344 -2769 -1206 -235 -3988 -5862 -2278 949 270 127 3053 5134 3620 921 71 186 -1532 -4560
360 -4560 -5066 -2442 -807 -1583 -363 3790 5383 3043 2066 3492 2087 -2281 -3897 -2655 -3144 -4458
376 -4458 -2871 102 1220 1892 3529 3853 2615 2037 1227 -1440 -3165 -2196 -1996 -3477 -2396 1218 2222
393 2222 838 1848 3917 2463 -583 -924 -454 -2112 -3428 -2283 -860 -337 698 1917 2239 2500
409 2500 2515 917 -835 -690 -940 -3136 -3460 -649 438 -1157 61 3597 3212 54 422 2331 28
426 28 -3249 -2121 -161 -1435 -2060 419 1837 1025 1392 2182 699 -605 166 -598 -2998 -2202 604
443 604 -9 -1541 1230 3963 1658 -438 1689 1978 -2038 -3399 -886 -1105 -3567 -1934 1632 1266
459 1266 -12 2132 3538 1195 -483 233 -572 -2541 -2163 -1042 -1417 -485 2252 2618 1298 2598 4045
476 4045 1269 -1766 -775 -318 -3310 -4225 -1387 -236 -1267 372 2858 1865 499 1801 1208 -2567
492 -2567 -3398 -1108 -2028 -4438 -1983 2145 1751 788 3813 5527 2771 1230 2423 679 -2982 -2537
508 -2537 -482 -2147 -3459 131 3034 1144 100 2600 2988 -381 -2355 -2037 -2730 -3884 -3555 -2945
524 -2945 -2190 221 2297 1729 1546 3614 3821 756 -797 315 -296 -2173 -1417 351 183 885 3592
541 3592 3639 1125 1629 3628 685 -3954 -3203 -677 -2992 -5777 -3109 382 -276 -1004 1146 2172 970
558 970 811 905 -1066 -2091 -281 147 -1922 -1357 2215 3213 1365 1526 3329 2973 1101 124 -637 -1419
576 -1419 -1005 -928 -2427 -2383 504 1604 -650 -1126 1301 1584 -970 -1905 -1075 -1285 -1571 -864 -1187 -1607 915
595 915 3217 938 -1114 2179 4581 618 -2702 435 2830 -595 -2951 -206 1598 -176 -711 608
611 608 267 -444 650 435 -1905 -1734 846 420 -2219 -1492 1315 1166 -537 -195 736 584 729 569
629 569 -1134 -1238 1394 1439 -2105 -2185 2022 2429 -1692 -2047 1737 2082 -915 -1210 503 435 -20 393 -612
648 -612 -1503 785 2113 -1191 -2874 1084 2949 -1228 -2960 1145 2623 -879 -1681 1068 1064 -806 30
665 30 865 -1012 -1078 1515 864 -2243 -1049 2320 978 -2076 -662 1802 536 -1001 -56 170 -505
682 -505 586 876 -1524 -1497 2021 1731 -2616 -2125 2537 1835 -2770 -1934 2155 1242 -1815 -600 1470
699 1470 349 -206 1231 598 -786 988 2240 -572 -1836 1210 1864 -1606 -2061 902 544 -1962
715 -1962 -976 702 -966 -1614 848 651 -2180 -1027 2214 484 -2680 -346 2727 397 -1856 717
731 717 2489 436 -202 1564 1189 -186 907 1395 -906 -1205 1328 834 -2208 -1373 1579 317 -2344
748 -2344 -939 999 -748 -2127 -577 -245 -1768 -1145 455 -525 -1251 981 2014 59 -2 2370 2091
765 2091 -117 476 2014 595 -669 896 1297 -743 -508 1606 544 -1883 -624 1234 -935 -3025
781 -3025 -1098 310 -1739 -2550 -321 500 -823 -475 1019 688 -50 739 965 -143 -84 967 494 -341
799 -341 617 1479 615 328 1375 1158 -130 93 685 -569 -1546 -427 -56 -1560 -1609 196 184 -1338 -754
818 -754 820 59 -1280 -378 610 -442 -976 334 843 -23 262 1398 1171 333 738 1145 261 -359 59
837 59 -8 -704 -605 -85 -276 -433 119 270 -213 -95 319 -147 -664 -210 60 -573 -597 232 285 -316 68 785
859 785 271 -333 247 549 -341 -614 249 333 -510 -227 760 506 -291 172 826 144 -605 -129 241 -457 -811
880 -811 -225 65 -279 -275 155 301 219 183 134 159 303 83 -316 -79 392 -20 -581 -28 587 -143 -766 54
902 54 559 -416 -865 180 572 -403 -535 562 707 -171 -132 651 467 -228 -132 196 -85 -374 -215 -177 -258
923 -258 -69 8 -157 5 384 152 -172 188 459 -80 -293 242 247 -393 -278 289 -28 -567 -65 334 -306
944 -306 -480 322 348 -431 -107 745 266 -478 229 843 -102 -653 286 545 -563 -764 245 252 -642 -514 324
965 324 245 -246 -102 267 328 251 20 -108 332 536 -281 -673 367 659 -757 -1002 623 710 -1083 -858
985 -858 1085 684 -1155 -384 1423 434 -1120 60 1318 -72 -1064 306 836 -556 -821 349 308
1002 308 -613 -338 315 0 -234 163 121 -85 338 350 -286 -11 719 51 -732 232 756 -627 -928 669
1022 669 536 -1239 -530 1299 133 -1527 277 1760 -470 -1553 1040 1676 -1227 -1388 1478 1081
1038 1081 -1725 -917 1603 400 -1695 -245 1391 -95 -1162 292 913 -267 -432 381 240 -46
1054 -46 232 -79 -363 483 482 -967 -645 1193 313 -1816 -325 1937 -95 -2187 523 2399 -729 -2076
1072 -2076 1413 2137 -1587 -1673 1947 1226 -2243 -922 2078 167 -2275 68 1873 -625 -1661 837
1088 837 1290 -917 -734 1083 501 -698 165 683 -239 -108 565 -283 -657 578 341 -1267 -384 1300
1106 1300 -259 -1711 625 1772 -1063 -1568 1784 1589 -2035 -1114 2532 761 -2789 -365 2762 -258
1122 -258 -2827 578 2477 -1049 -2205 1279 1698 -1456 -1223 1475 750 -1298 -214 1145 -32 -685
1138 -685 358 318 -453 98 303 -672 -221 953 -136 -1168 690 1554 -840 -1204 1643 1384 -1787 -982
1156 -982 2085 437 -2561 -395 2118 -637 -2568 577 1860 -1428 -1862 1454 1247 -1781 -814 1902
1172 1902 571 -1479 304 1856 64 -780 940 1167 -331 -177 739 47 -479 238 41 -772 -83
1189 -83 494 -756 -999 598 264 -1592 -779 1081 -362 -2103 -19 1529 -849 -1759 1192 1825 -1058
1206 -1058 -903 2107 1527 -1212 -105 2263 730 -1200 504 1801 -131 -972 707 767 -901 -780
1222 -780 274 -456 -1295 -560 -325 -1101 -801 -23 -586 -846 275 420 -675 -151 1185 380 -702 651
1240 651 1640 60 -463 1429 1569 -407 -150 1672 762 -1115 -64 1241 -418 -1611 44 636 -1239
1257 -1239 -1461 311 95 -1496 -903 475 -313 -1247 -177 521 -365 -437 611 593 3 527 1001 385 312
1276 312 989 614 -149 424 875 -183 -561 548 499 -906 -636 616 -109 -1393 -489 538 -666 -1391
1294 -1391 -11 510 -834 -830 644 501 -676 -85 998 241 -476 420 880 -91 -226 699 543 -273 115
1313 115 685 36 -371 279 307 -499 -372 287 -164 -735 -110 287 -425 -527 277 172 -556 -177 471 -85
1333 -85 -534 246 520 -318 -281 645 412 -484 -6 759 39 -624 152 553 -352 -574 307 294 -507 -269 444
1354 444 55 -452 83 404 -170 -259 308 210 -285 -3 381 -42 -279 215 252 -323 -202 311 -29 -498 -36
1375 -36 310 -257 -419 244 273 -355 -196 413 111 -398 33 404 -142 -332 255 272 -295 -123 434 107 -328
1396 -328 128 428 -139 -315 279 267 -353 -230 314 52 -416 -97 242 -153 -363 33 94 -219 -130 151 -4
1417 -4 -144 176 195 -114 14 344 64 -239 120 319 -181 -313 214 193 -363 -231 308 49 -396 -19 381
1438 381 -74 -332 170 324 -191 -219 242 149 -263 -90 211 -45 -228 54 118 -150 -85 150 7 -158 98
1459 98 184 -102 -108 198 118 -178 -26 184 -58 -210 71 92 -191 -116 186 16 -230 75 273 -76 -173 213 245
1482 245 -196 -135 234 73 -274 -84 164 -74 -251 17 113 -127 -115 135 52 -120 38 133 -37 -64 131 66
1504 66 -119 20 150 -65 -157 91 86 -180 -121 175 39 -224 -14 221 11 -176 86 214 -38 -127 70 73 -128
1527 -128 -94 0 -75 -104 -9 -26 -88 26 103 -34 -39 146 109 -106 -20 179 16 -178 18 155 -96 -204 68 101
1551 101 -174 -151 108 60 -165 -54 166 53 -98 55 179 14 -52 67 65 -69 -61 -7 -50 -84 -44 -44 -67 -2 21
1576 21 -27 22 108 38 -38 83 130 -39 -94 87 70 -175 -115 95 7 -224 -89 155 -21 -202 33 203 -21 -113
1600 -113 124 182 -38 -74 102 79 -97 -93 35 -24 -128 -69 3 -14 -41 -14 2 38 70 21 -1 100 121 -29 -43 113
1626 113 62 -130 -92 85 -30 -225 -64 99 -73 -192 46 173 -58 -95 181 178 -103 -73 162 43 -202 -96
1648 -96 98 -69 -192 -30 90 -42 -72 102 123 9 38 124 72 18 59 62 5 16 23 -41 -58 -8 -71 -186 -95 -9 -159
1675 -159 -219 3 77 -123 -113 197 198 -84 -6 288 152 -184 -17 244 -7 -261 10 217 -50 -163 143 241
1697 241 -51 -76 189 122 -141 -102 58 -57 -209 -126 -33 -108 -131 -58 -64 -55 -6 -20 -78 31 117 -13 -40 182 230 14
1723 14 50 313 211 -91 5 238 7 -294 -59 128 -183 -332 27 139 -189 -206 174 147 -219 -120 192 23
1745 23 -255 -72 145 -42 -180 49 157 8 -25 132 124 32 69 85 20 40 84 -10 -42 98 61 -109 -74 108 -47
1770 -47 -255 -81 81 -180 -321 7 130 -179 -182 203 208 -114 -36 303 149 -172 14 230 -27 -209 37 136
1792 136 -120 -138 102 85 -122 -28 130 10 -86 44 71 -52 -35 51 -19 -68 33 34 -99 -30 74 -45 -150 33
1816 33 111 -84 -114 142 109 -147 -41 211 67 -174 16 198 -50 -202 61 140 -132 -155 91 64 -154 -61 127
1839 127 21 -97 58 127 -12 -15 95 52 -67 3 42 -97 -103 29 -9 -129 -23 111 -6 -67 98 139 -43 -38
1863 -38 141 31 -154 -16 113 -70 -146 63 89 -127 -86 133 27 -175 -42 124 -68 -176 21 116 -63 -55
1885 -55 151 135 -13 50 155 38 -61 22 18 -91 -63 36 -20 -63 64 97 -35 -12 129 8 -166 -75 41 -146 -256
1910 -256 -44 16 -149 -114 123 118 -64 45 191 49 -74 62 127 -36 -39 133 104 -25 80 188 46 -47 83
1933 83 49 -154 -179 -50 -124 -252 -133 -9 -91 -107 58 90 -39 4 97 -3 -114 2 52 -69 -59 138 134 21
1957 21 137 266 131 11 125 139 -85 -142 2 -39 -205 -126 26 -45 -138 11 56 -65 -116 -14 -64 -159 -93 -14
1981 -14 -75 -59 102 136 34 121 262 138 -11 94 158 -66 -141 27 42 -121 -78 90 55 -72 7 97 -34 -119
2005 -119 -29 -46 -169 -141 -29 -63 -107 33 97 15 27 131 87 -39 13 70 -50 -94 38 55 -62 -22 130 79 -59
2030 -59 46 111 -44 -106 22 11 -152 -108 67 -15 -131 14 142 -12 -87 94 106 -80 -93 83 51 -115 -39 87
2054 87 14 -59 34 62 -33 -18 48 -17 -52 32 24 -77 -22 76 3 -86 34 110 -56 -76 76 82 -86 -31 146 40 -117
2081 -117 17 143 -47 -161 38 71 -124 -109 79 53 -96 -6 138 21 -72 31 67 -87 -91 16 -6 -95 -1 93
2105 93 32 14 114 86 -18 20 29 -90 -113 -8 -26 -136 -29 139 50 -69 107 189 -38 -135 41 51 -203 -177 59
2130 59 36 -149 10 219 103 -29 112 155 -40 -122 -6 -43 -171 -119 8 -26 -15 89 120 57 77 101 -33 -91
2154 -91 -21 -72 -209 -115 42 -22 -78 110 217 31 -21 155 84 -175 -158 33 -92 -260 -56 155 25 -52 178
2177 178 252 30 -47 100 29 -173 -158 -60 -96 -134 -20 53 56 118 133 59 54 88 -33 -158 -82 -8 -151 -190 62 136 -58
2204 -58 -9 250 162 -115 -27 167 -44 -279 -73 91 -117 -183 108 189 -24 9 191 107 -93 -49 35 -94 -174 -51
2228 -51 -7 -52 1 84 36 39 138 77 -65 11 64 -119 -179 12 23 -164 -79 191 69 -139 78 268 -34 -208 86
2253 86 183 -181 -233 133 118 -193 -83 204 81 -147 25 172 -49 -126 56 47 -147 -82 84 -10 -92 54 94 -29
2277 -29 9 105 -13 -99 73 63 -171 -109 145 19 -231 -19 249 -16 -202 96 224 -96 -166 162 100 -212 -79
2300 -79 199 -32 -256 53 225 -112 -200 182 208 -131 -102 176 81 -152 -7 104 -82 -95 73 -8 -150 22
2322 22 142 -71 -142 115 104 -160 -105 136 -1 -171 38 139 -100 -102 247 149 -181 -16 328 58 -267 8
2344 8 242 -91 -277 58 141 -160 -120 160 50 -173 35 164 -139 -214 75 57 -245 -179 115 53 -130 45 195
2367 195 62 64 195 101 -52 122 170 -126 -174 155 146 -163 -87 244 104 -190 -28 143 -141 -285 -28 -32 -342
2390 -342 -244 112 -16 -256 27 324 66 -111 153 263 -15 -103 103 69 -73 56 154 31 45 260 193 -71
2412 -71 21 166 -71 -308 -142 -47 -258 -268 -48 -33 -168 3 142 -61 -127 129 102 -225 -162 155 72 -174 32
2435 32 338 185 34 269 326 49 -27 153 9 -254 -156 23 -156 -257 -16 98 -77 -104 60 6 -121 -78
2457 -78 -66 -180 -146 19 -43 -162 77 286 93 -21 225 303 -11 -93 141 83 -160 -85 127 7 -104 81 173
2480 173 -41 -92 90 31 -218 -176 -20 -124 -237 -73 37 -48 -20 141 110 -13 88 161 -26 -91 60 67 -98
2503 -98 -56 92 41 -44 58 105 -33 -35 83 -3 -178 -44 109 -80 -175 73 163 -72 -128 138 137 -119 -97 107 37
2528 37 -134 -31 87 -28 -72 49 73 -54 -19 61 -12 -74 19 15 -68 -28 49 -12 -62 51 75 -74 -64 107 71 -109
2554 -109 -20 167 67 -86 46 143 -1 -85 38 27 -113 -78 21 -51 -117 31 81 -66 -59 100 70 -94 -61 68
2578 68 -3 -100 -6 73 11 0 91 70 12 41 62 -43 -63 -2 -14 -106 -43 44 -11 -43 64 87 -33 -53 81 19 -146 -82
2606 -82 44 -35 -146 -12 102 35 -23 66 110 20 -14 19 -22 -54 -7 -16 -71 -15 75 21 -29 60 107 -19 -79 22 13 -109
2634 -109 -74 32 -1 -74 13 112 26 -16 70 63 -33 -50 4 -36 -86 -25 2 -38 -18 78 39 -35 28 87 4 -91 -7 53 -47
2663 -47 -86 -4 36 -18 11 43 21 21 49 14 -63 -18 55 -42 -96 27 81 -39 -56 66 77 -65 -43 84 3 -110 -34 65
2691 65 -22 -82 19 84 -14 -36 55 75 7 -5 25 12 -13 19 -23 -36 8 53 -22 -60 33 70 -36 -58 53 60 -50 -57 40
2720 40 25 -64 -23 31 -21 -19 29 12 -34 -1 57 -18 -59 35 57 -48 -46 64 27 -87 -7 94 9 -94 18 102 -16 -85
2748 -85 11 70 -44 -79 29 40 -31 -15 26 17 -1 22 -9 -34 8 17 -55 -62 38 44 -71 -33 82 53 -60 -3 86 9 -86
2777 -86 -14 50 -30 -66 16 32 -33 10 50 22 -24 28 40 -42 -36 32 -3 -87 -16 78 6 -50 46 84 -21 -60 35 26 -66 -64 22
2808 22 2 -55 -10 45 34 18 38 8 -17 29 14 -82 -37 48 -4 -89 7 113 21 -66 28 94 -18 -102 -4 34 -73 -76 0
2837 0 12 -34 0 49 12 5 46 30 -30 -19 23 -18 -36 12 30 -12 26 86 40 -27 34 60 -36 -99 -8 5 -72 -59 20 27 -5 14
2869 14 38 -2 -4 20 -31 -93 -9 45 -51 -67 52 115 25 -2 90 104 -1 -23 17 -2 -46 -28 -23 -43 9 36 4 -25 13 35
2899 35 -53 -46 -12 -40 -92 -27 20 -34 -32 85 94 -19 -5 113 68 -71 -44 64 21 -68 -19 51 22 11 37 20 -1 30 17
2928 17 -85 -85 6 -14 -110 -68 43 4 -65 19 56 -12 -10 52 2 -48 14 76 -19 -56 76 96 -25 -28 76 48 -65 -38 20
2957 20 -49 -91 9 15 -85 -41 97 37 -76 -8 90 -1 -86 -10 46 -30 -33 18 -3 -2 55 20 -43 -5 88 6 -100 5 104
2986 104 -23 -84 55 93 -40 -36 66 32 -86 -21 71 -34 -97 31 86 -41 -52 68 74 -47 -25 51 4 -47 7 9
3012 9 -54 -4 52 -26 -70 31 61 -53 -82 37 51 -76 -29 64 10 -43 58 74 -41 -27 79 10 -118 -39 79 -42
3038 -42 -128 15 77 -44 -48 70 67 -38 5 80 -12 -61 22 43 -67 -57 59 14 -64 -4 66 3 -47 16 14 -57 -41 30 -36
3067 -36 -77 38 68 -61 -43 83 56 -71 -3 84 0 -90 19 71 -32 -51 90 82 -38 26 123 33 -55 31 64 -57
3093 -57 -110 -11 -32 -104 -65 18 -33 -52 43 30 -55 -15 76 4 -85 2 67 -19 -52 69 104 -9 41 110 57 -24 33 49 -79
3122 -79 -103 8 -22 -106 -51 50 -2 -50 39 60 -48 -64 26 -26 -137 -63 40 -25 -73 62 152 63 17 128 126 3 -26
3149 -26 15 -26 -64 -20 5 -52 0 70 23 -18 34 50 -58 -118 -50 -42 -132 -85 23 -8 -34 79 124 27 -10 95 64 -72
3177 -72 -69 13 -31 -79 3 70 27 31 110 74 -5 1 47 -64 -120 -40 -4 -84 -73 36 55 9 14 75 36 -18 -18 -24 -61 -46 -14 -29
3209 -29 -11 60 80 15 21 88 26 -73 -38 10 -78 -123 -11 45 -30 -17 85 89 -19 -5 64 10 -88 -56 -10 -25 -39 1 33 33
3239 33 44 34 12 -5 7 -25 -78 -51 -1 -35 -42 30 65 7 12 64 27 -43 -26 20 -53 -83 6 35 -11 3 84 63 -8 27 49
3270 49 -28 -87 -29 -2 -71 -66 38 53 -13 11 65 39 -43 -31 -11 -43 -58 -24 -30 5 62 42 19 69 102 8 -62 0 15 -91
3300 -91 -105 24 48 -56 -11 119 79 -38 -10 82 -39 -115 -42 0 -68 -75 28 59 9 30 87 42 -1 9 -17 -74 -56 -11
3328 -11 -44 -54 25 71 17 29 84 45 -46 -20 9 -72 -93 -9 6 -61 -2 107 48 -26 60 101 -34 -92 -3 22 -124 -104 45
3357 45 34 -57 2 125 54 -26 20 54 -30 -91 -37 -11 -66 -36 21 21 17 58 37 -8 18 29 -50 -80 9 6 -82 -26 82 41 -49
3388 -49 31 113 13 -78 16 45 -72 -99 26 25 -82 -27 81 26 -40 24 73 -20 -66 26 18 -67 -50 33 11 -55 2 48 10
3417 10 -21 17 21 -15 2 -1 -37 -18 31 -11 -46 21 61 -23 -58 55 59 -57 -50 66 40 -95 -36 82 5 -89 -8 95 2
3446 2 -70 33 63 -27 -47 29 16 -44 -33 17 -18 -23 20 16 -18 25 43 5 -32 10 15 -51 -20 21 -14 -35 27 34 -31 -4 59 25
3478 25 -52 -3 44 -29 -79 10 48 -48 -37 70 50 -44 -26 84 20 -92 -22 49 -19 -85 -8 64 3 -29 24 46 4 -21 -25
3507 -25 -17 -6 -13 -67 -39 42 29 -32 11 71 27 -50 -16 54 -29 -80 -5 47 -36 -35 69 67 -6 19 75 13 -51 -17 14 -45 -59 1
3539 1 8 -26 -11 52 1 -43 -12 8 -51 -74 -18 -3 -35 -14 31 54 32 50 40 31 22 8 -37 -40 24 -3 -47 18 84 42 -22 26 63
3572 63 -32 -99 -35 -9 -109 -122 -9 23 -30 -17 59 60 -3 0 28 -11 -49 -28 7 0 17 39 45 52 80 45 3 -6 6 -56 -99 -54
3604 -54 -23 -51 -53 8 43 1 -2 26 2 -42 -34 -32 -75 -53 16 1 -13 58 117 67 28 76 76 -27 -58 8 -7 -69 -44 37 33 -1 23
3637 23 56 12 -41 -26 -33 -82 -73 -56 -49 -42 12 27 34 50 61 27 -17 15 14 -53 -65 -1 11 -14 7 82 58 20 37 36 -15 -55 -25 -37
3671 -37 -77 -43 11 -9 -16 50 65 2 -11 34 -3 -71 -53 11 -17 -60 6 57 33 15 45 55 -1 -13 -3 -24 -59 -21 -22 -23 1 32
3703 32 30 11 40 57 -3 -22 5 -19 -51 -30 26 12 -20 32 62 14 -8 24 14 -55 -59 9 -18 -55 -17 32 5 3 48 47 -12 -16 24
3736 24 -7 -58 -23 12 -2 -15 30 47 22 22 43 9 -17 -3 -22 -45 -21 10 -16 -27 28 41 -8 -32 27 21 -60 -54 17 0 -56 -14
3768 -14 49 16 -22 40 64 3 -13 15 14 -29 -14 10 -2 -24 2 25 -8 1 12 4 -24 -1 -2 -27 -31 11 1 -29 -4 30 -5 -25 13
3801 13 17 -22 -19 19 0 -30 3 29 -9 -31 36 36 -11 -31 27 24 -40 -30 23 2 -46 -25 18 -3 -29 3 27 3 1 13 7 -4 9
3834 9 -2 -22 1 7 -22 -26 5 5 -33 -21 28 8 -28 -6 39 -8 -29 1 38 -3 -18 16 21 -7 1 30 17 -15 0 11 -18 -19 8 13
3868 13 -18 0 32 11 -11 19 13 -23 -19 10 -9 -34 -8 5 -2 3 20 18 4 18 21 -11 -29 5 7 -27 -23 20 8 -27 9 43 13 -25
3902 -25 -1 18 -23 -43 -14 0 -13 -7 23 19 8 25 27 9 -8 -8 -25 -42 -11 -16 -31 -9 19 17 -10 12 32 -11 -30 2 -1 -28 -39 22
3936 22 17 -13 21 49 13 -5 17 6 -26 -37 -6 -14 -23 -7 24 17 1 35 46 8 -4 16 -14 -46 -15 -5 -21 1 15 21 4 18 38
3969 38 7 -19 13 -3 -38 -23 3 8 -22 7 33 4 -16 3 15 -36 -40 -7 -17 -38 -1 31 16 2 34 39 9 1 10 -10 -35 -30 -12
4002 -12 -22 -25 2 26 15 10 27 14 -7 5 -4 -30 -15 -5 -16 -23 18 42 3 -16 15 23 -35 -39 -7 -24 -48 -29 25 17 -4 25 45 14
4036 14 -16 13 3 -30 -24 -8 -16 -22 8 14 6 20 20 14 -22 1 15 -33 -40 -13 -2 -24 -9 19 14 -1 -3 9 -16 -24 -24 -18 -28 -12 24 15 17 37
4074 37 46 1 2 23 3 -36 -43 8 -21 -34 -13 19 4 -10 10 27 -5 -22 -6 2 -18 -11 -4 6 7 13 5 2 23 7 -23 -18 6 -12 -41 -12
4110 -12 30 -1 -12 28 39 11 -16 -4 13 -37 -48 -2 -15 -22 -8 6 10 -1 10 13 2 -3 9 -9 1 10 15 -11 -6 26 3 -18 -10 30
4144 30 -11 -25 -22 -6 -5 -16 -12 7 7 20 14 8 2 14 -7 -25 -16 -3 -22 -36 -5 11 -13 -25 12 17 -8 -20 9 14 -17 -21 -4 4 -6 -3 0
4181 0 -11 -1 -13 -9 -7 -5 -3 -10 -1 17 -4 -17 9 14 2 -15 3 24 2 -39 14 2 -20 -23 -5 10 -3 -1 -10 4 11 4 -12 9 10 8 -6 -13
4219 -13 8 1 -19 -13 13 -1 -23 3 1 -11 -8 4 20 4 -12 16 8 0 -2 13 0 -4 0 -11 -17 -5 5 -14 -13 0 2 -23 -10 10 -8 -18
4255 -18 -9 10 7 -3 0 -1 5 -7 -1 -11 -3 6 5 -4 3 31 11 0 4 27 -6 -25 7 13 -8 -36 10 10 -19 -30 0 -7 -25 -15 16 4 -12 -5
4293 -5 13 5 -5 8 5 14 10 8 -6 8 15 -7 -8 11 12 -19 -16 11 -3 -28 -3 9 -10 -36 -23 -2 -19 -30 4 -3 -31 -19 20 1 -24 -4
4329 -4 26 7 -13 17 36 6 -5 39 18 -10 10 4 -4 -10 -9 -5 -6 -21 8 -14 -16 19 -3 -31 -15 13 -4 -31 24 27 -24 -20 34 29 -26 -21
4365 -21 37 -1 -38 -1 31 3 -28 12 29 -23 -17 20 12 -21 -17 7 -13 -25 -1 4 -16 -6 17 3 -2 15 16 -9 -6 10 -7 -27 3 23
4399 23 -22 -14 11 15 -33 -10 32 -1 -46 -4 30 -14 -34 9 24 -8 -15 36 24 -19 3 26 -4 -18 -4 7 -17 -21 6 -7 -7 13 10
4432 10 -1 4 15 2 2 5 11 -18 -3 23 1 -24 12 44 9 -24 14 23 -12 -8 21 10 -24 -11 28 3 -31 2 23 -2 -25 12 9 -14
4466 -14 -17 17 14 -14 3 11 -1 -3 15 13 9 9 20 12 15 12 -2 -19 6 28 -13 -11 14 21 -27 -17 31 5 -21 -9 25 -2 -32 8 20 -22
4502 -22 -18 16 18 -6 -16 20 -1 -13 6 12 -4 -4 9 -8 -4 -3 13 9 1 6 0 6 6 6 -5 -8 12 6 0 15 26 6 -22 21 32 -17 -14 27 7
4541 7 -25 -7 26 8 -23 13 28 -2 -23 7 36 -10 -29 13 17 -4 -10 5 1 -7 -7 -5 1 3 -1 -10 -2 10 -7 -19 2 13 -13 -6 17 13 -17
4578 -17 -9 30 12 -31 -3 32 -7 -17 -6 25 -9 -11 11 1 -24 -6 18 17 -28 0 15 -4 -18 -1 13 -13 -11 5 3 -17 6 3 5 0
4612 0 -2 -7 -6 -6 7 -3 -7 13 -6 -8 6 9 -6 -14 14 14 -9 -15 27 15 -15 11 19 11 -11 17 23 -4 -27 12 14 -14 -13 2 -4 -23 2 0 -10
4651 -10 -19 2 2 3 1 15 8 -9 11 3 -10 -6 10 -12 -21 -6 2 -11 -12 16 4 -21 4 23 6 -9 5 19 -1 -2 2 13 -20 0 8 -6 -7
4688 -7 -3 11 -8 -11 5 8 -15 -8 9 -2 -28 -11 0 -8 -18 0 8 -6 -1 11 8 8 12 13 -1 -9 14 5 -3 15 15 3 4 16 8 -18 -6 3 1 -14
4728 -14 -6 14 -16 -16 8 6 -12 -11 21 5 -7 -18 18 8 -14 4 17 5 4 11 10 -3 2 5 -20 -17 -3 0 -8 -2 4 -13 -10 10 4 -15 -9 10 -8
4767 -8 -18 -9 14 -4 -4 13 22 9 6 12 6 -1 -10 17 -10 -24 -13 -4 -20 -12 13 7 -23 -15 -7 -10 -20 -14 -1 -14 -12 -4 -3 -10 1 5 4 -5 8 2 -8 9
4809 9 2 -11 -16 14 7 -12 -15 27 17 -19 -8 14 -3 -26 -18 4 -7 -21 -8 13 -2 -2 6 13 -7 -8 -3 5 -6 3 -2 3 7 2 2 -1 7 -9 -14 -2 5
4850 5 -8 -14 13 18 -8 -10 11 15 2 -9 10 7 -7 2 10 -4 -5 5 5 -8 -12 13 -11 -15 4 6 1 -6 11 -3 -2 6 5 -14 -5 -10 -9 -10 0 -4 -3 8
4892 8 18 12 -1 8 8 -6 -9 -3 24 -9 -11 8 6 0 -5 20 2 -6 -7 25 -15 -7 -9 4 -1 3 15 12 17 3 3 1 9 6 -15 -10 -8 5 -18 -19 14 9 -12
4935 -12 6 16 8 -21 -11 3 -19 -34 -9 -9 -19 -4 11 23 14 9 17 10 -3 3 -5 -11 -9 2 0 -4 6 9 2 -2 5 -11 -28 -16 -18 -21 -30 0 7 -5
4975 -5 1 19 14 5 18 10 -9 -24 -5 -12 -26 -14 20 3 2 16 26 7 0 8 15 -13 -19 -10 -5 -7 -5 19 10 10 17 16 7 14 1 -12 -5 9 -10 -20 -3
5016 -3 24 11 5 16 17 -5 -2 0 -4 -20 -21 3 3 -21 -14 39 12 10 23 20 0 -14 0 -9 -15 -9 -2 -9 -1 19 -2 -11 -2 16 -4 -2 4 -1 -7 -6 6 12 4
5059 4 -5 15 3 12 7 9 6 6 4 -19 -22 1 8 -14 -6 20 4 -11 15 22 1 -14 0 7 -2 -7 -2 4 4 -4 1 5 -1 15 9 6 2 -1 0 -3 0 0 2 -5 16 -3
5105 -3 -9 10 13 8 -5 16 16 -1 3 0 11 -4 -14 5 1 4 -6 -5 -8 -6 4 2 -15 -2 -18 -14 -11 -2 3 -6 -10 8 6 5 19 23 0 1 6 -10 -9 2 3
5148 3 -5 5 14 12 3 2 11 4 -8 7 -1 -22 -19 12 19 -8 3 12 6 1 10 0 2 -15 -15 -3 -2 -2 -4 -5 10 1 4 8 12 19 0 -8 -4 -8 -24 -12 8 7 12 21
5194 21 17 23 0 10 18 -9 -14 -15 -9 -11 -8 -3 3 14 9 16 4 0 -4 -9 -7 -19 -18 -11 -9 4 18 9 14 22 4 6 -3 -11 -19 -18 -7 -25 -16 -7 12 16 12 12 13 1 -5
5241 -5 4 -2 -24 -7 -7 -13 3 11 21 14 17 24 12 5 -13 -15 -17 -13 -14 -4 -1 -2 15 10 18 10 -7 -20 2 1 -14 -8 -14 2 -3 -4 4 10 -1 -6 3 -3 -11 -13 -5 -16
5287 -16 -10 -12 2 7 1 8 5 8 3 4 -2 -3 -6 -2 -7 -7 -11 -9 -3 -4 12 5 -16 -12 -8 -6 -7 -8 -6 -5 -13 5 13 1 -11 -3 -13 4 2 0 -8 -3 -10 -2 -10 3 -4 -2 -4 4 12
5338 12 4 -9 0 0 -9 -2 2 -11 -7 -4 7 -4 -7 2 -6 4 -2 12 4 -11 -3 -3 -6 -12 -12 -12 -18 -3 -8 -3 -6 -5 4 2 2 -6 -8 -8 -15 -4 -17 -17 -6 9 -6 2 16
5385 16 4 3 -6 -6 -18 -19 -15 -9 -16 -4 15 15 4 2 20 -2 -8 -3 -11 -8 -3 -11 -6 -18 3 14 2 -2 14 7 -5 -3 -1 -13 -14 -14 -12 -2 -3 11 20 -1 11
5428 11 0 6 -9 -6 -20 -10 -11 -4 -3 -6 12 21 13 10 17 3 -4 -7 -7 -3 -3 -4 5 -11 6 3 14 0 -2 0 -7 -19 -3 -13 -22 -7 -2 -6 -4 7 14 10 -3 4
5472 4 13 -12 -15 -3 7 -13 8 12 2 -12 4 10 11 1 -2 -6 -13 7 -14 -2 -8 4 4 1 6 11 -14 -4 4 -8 -13 -21 -6 -5 -6 -2 -3 3 -10 15 6 5
5514 5 5 4 -4 -7 -11 -4 -13 -3 -13 -4 -9 3 -11 -3 4 -6 -11 -9 -6 -3 -5 -3 0 7 -3 1 7 10 -7 -4 4 -5 -7 -5 -11 -15 -7 -10 -7 -24 0 -3 -3 -6 -10 -2 -6 -17 -6 -4
5564 -4 -17 -2 2 -2 -5 6 -7 -19 3 -12 -8 -11 4 -10 -1 -7 2 -6 0 16 2 1 -3 2 15 -16 -5 -6 -17 -15 -8 4 1 -6 -3 -5 7 -7 4 -5 -11 -5
5606 -5 -10 -17 -4 1 -15 -22 2 -6 -10 -10 7 3 -9 -11 -4 8 -5 -8 7 -13 -10 -2 3 9 0 1 0 -2 -1 -6 -17 3 -7 4 3 -5 0 0 -7 -3 -3 -6 -2 -6 -5 -16 8
5653 8 0 1 -12 -4 -4 -4 -13 -6 -10 5 1 -2 1 -14 9 13 1 12 2 -1 -3 -3 7 -3 0 -6 5 3 2 -3 8 -5 -4 1 1 1 2 2 -11 5 -2 -6 -3 -2 -4 8
5699 8 0 3 3 0 2 -5 2 -14 4 -11 -7 -4 -5 6 -12 -2 8 -7 1 8 2 7 -2 6 1 2 -7 9 -3 -9 3 -1 6 1 13 -6 -6 -11 -5 -11 -7 -7 -7 7 -5 -1
5745 -1 -1 -7 1 2 3 -9 -3 -7 -9 4 4 1 -10 -1 0 -4 -5 -12 -5 -14 -3 -3 -1 -3 6 3 -10 -1 -3 0 1 2 -3 -5 -3 1 3 -6 -3 -2 -9 -6 -12 2 0 -13 -2 0 -9 -8 0 1 -4
5798 -4 -5 -7 -6 -6 7 -4 6 -5 4 -2 -2 3 9 -6 -4 5 3 -2 -2 2 -3 -4 4 -10 -7 3 -4 5 -13 -1 -5 9 5 4 13 3 -1 0 2 0 0 0 3 -9 4 2 -15
5845 -15 -5 -12 -2 -8 -5 1 -7 -11 -2 -10 -10 0 2 2 -1 1 10 14 -6 2 2 6 -11 -6 3 -8 -13 -5 5 6 5 3 -6 4 1 4 -5 1 -2 1 -3 18 6 -2 2 6 -1 2 -2 3
5895 3 -13 -6 -1 -12 0 1 -6 -7 6 -5 2 -6 5 -7 2 1 18 -7 6 1 5 19 0 3 -2 -7 3 -4 1 -10 -7 -5 4 -5 -6 -4 -7 0 -1 -8 -5 3 1 -5 -5 0 3
5942 3 -6 -12 1 0 8 2 -4 3 -5 -2 -9 1 -3 -3 4 -2 3 -6 -3 -2 5 8 -9 4 2 -12 -6 -2 -13 -2 3 -5 1 -5 2 6 -2 -15 -6 -4 -7 -3 5 -3 -2 -3 -5 -8 -3 -2 1 6 -9
5995 -9 -1 1 4 4 -13 -7 -5 -1 8 -1 0 -11 10 5 9 2 4 -14 -3 -2 -3 12 1 5 -4 -9 4 10 3 -5 2 1 -2 -6 -3 1 -1 1 -8 -6 1 10 13 4 2 -1 0 3 -10 4 -15
6046 -15 5 0 9 -1 -1 7 -10 1 -5 0 -4 -9 -3 5 4 -3 1 6 3 3 5 3 -10 -3 -9 -5 4 0 -6 3 -15 -9 5 -6 -9 -6 -14 -4 -3 -5 -12 -2 2 -14 -5 -4 -10 -11 -12
6095 -12 9 -9 -8 -1 -1 -3 -6 4 -15 -15 3 -12 -8 1 5 -3 0 -6 -4 7 -9 -6 -4 -2 -2 1 -6 -2 -7 -13 -5 -4 -5 -9 -1 -3 -7 -4 -4 1 -10 -5 4 -3 -10 -3 -6 -3 -1 4 -2
6146 -2 -7 0 0 -1 -4 9 -3 6 -5 16 1 -9 4 9 1 6 1 -14 3 -7 -2 -4 -3 -15 -6 -5 -3 -11 -10 -3 -6 -12 -1 6 3 -1 -6 -1 2 -3 -11 -3 2 3 -1 5 7 2 0
6195 0 2 10 -3 2 5 8 2 -1 10 4 -10 5 8 2 1 8 3 -5 -3 6 6 -1 -6 -6 4 -8 -20 -1 -5 5 -3 -6 -3 -5 -6 -5 4 -7 1 3 7 -2 -1 -7 5 -3 -8 1 2 -7
6245 -7 -5 -1 -3 2 -2 -1 1 4 -12 9 9 3 4 -10 3 5 10 11 2 1 -1 -9 -7 6 -1 5 1 -9 -8 -7 -2 6 -13 -1 1 -7 -3 4 4 3 -6 13 9 -13 -4 12 0 -3 -2
6294 -2 0 -5 -18 -12 -1 2 -11 -3 2 10 -7 2 7 7 -1 3 -4 -10 -4 -5 2 -2 -7 -10 -14 -3 -14 -9 1 -5 -1 -12 -13 -10 -10 5 4 4 -11 2 1 12 -10 -5 4 2 2 2
6342 2 9 1 2 -8 7 0 -3 -14 -13 -6 2 8 -3 0 -2 10 -3 1 1 -4 -2 -6 0 -3 6 5 3 -1 6 -3 -1 -10 9 -5 -2 -2 -7 -1 -4 -4 -8 10 -4 -4 5 -4 3 5 -6 10
6392 10 4 2 -2 5 -2 3 4 -10 3 1 8 7 -5 1 -2 8 1 -8 4 -6 3 -6 -17 -6 1 3 -1 -2 3 -13 -4 0 -8 0 6 4 -15 2 -5 4 14 -3 0 -2 -4 8
6438 8 -4 -5 -8 3 1 0 6 1 5 -2 6 7 6 -8 0 -2 -4 -8 -7 0 -11 -15 -7 -12 -1 -13 -17 2 -2 -1 -12 -13 -2 -6 0 0 9 -1 -3 -8 7 0 2 3 -4 0 -6 -5 -9 5
6488 5 8 1 2 0 5 2 -7 3 0 -5 -5 -2 2 7 3 2 -2 0 14 -1 -12 -9 -4 4 -17 -8 -2 -11 -4 -6 -7 0 -5 -4 -3 -5 0 -6 3 -5 -8 0 2 3 -3 -3 2 4 0 -5 1 2 -3 -2 -6 0
6544 0 11 0 8 2 4 1 -12 4 -1 2 2 -3 3 -7 -9 3 -12 -11 -6 -4 -9 -11 -16 -11 1 -3 5 3 -1 5 -5 8 -8 1 -5 4 6 1 4 -1 -1 -6 6 4 6 -7 -6 4
6592 4 -1 3 -5 3 -7 3 -3 -9 -1 -2 6 -1 -2 -4 -2 -6 4 -2 -8 1 -12 -8 0 -4 -1 5 -8 1 -12 -5 2 3 -9 4 7 5 9 5 -4 -5 16 4 2 4 5 11 6 10 -6 -4
6642 -4 5 -7 10 -2 -9 5 5 15 -1 3 -14 -11 -10 -3 -4 -3 -5 -12 -8 10 -3 2 -5 -19 -3 3 1 -9 1 -22 -6 7 6 3 11 -5 4 -3 7 13 -4 9
6684 9 3 6 -2 13 0 -7 5 -1 1 10 -3 6 1 -5 -18 2 -7 -4 -6 -3 -1 -1 -3 3 3 -7 -5 -7 12 5 1 6 9 8 4 -8 10 2 10 1 -5 4 4 -5 17 10 3 15 6
6733 6 -6 -5 -3 0 3 0 4 9 10 20 9 9 9 10 -3 6 -12 -7 4 -7 6 2 -6 -11 9 7 -4 -2 6 -2 5 10 4 2 0 10 14 5 17 17 0 6 9 1 -9 5
6779 5 1 -1 6 -2 24 9 -10 1 10 -1 -7 7 -1 19 8 10 3 6 3 -8 4 5 2 -13 -8 9 -9 -8 2 -3 -3 5 2 10 -3 -10 -1 -4 -1 9 2 -3 -2 12
6823 12 6 3 -7 14 5 1 -8 -5 -1 -4 7 -6 5 4 -3 17 -7 -4 17 -3 -3 6 11 9 5 2 4 -10 9 -1 10 1 4 0 -2 -13 11 5 -5 4 7 0 -2 6
6867 6 2 -4 4 1 4 2 0 11 8 3 8 -9 2 -2 0 1 -1 -3 -1 -9 -6 -6 5 -14 -12 4 -4 -21 -1 -8 -7 -10 1 5 -12 -2 2 4 -6 -4 10 -4 -12 -3 4 -6
6913 -6 -5 0 -4 -8 1 0 -9 7 1 6 -4 -3 11 4 1 -1 16 -1 -5 6 10 6 -13 -9 -1 -16 3 10 -4 -2 -1 5 -5 5 9 0 -8 2 5 7 -2 0 0 -3 3 4 -3 -1
6961 -1 7 -10 -4 2 9 -1 -1 -6 7 8 -4 -3 -7 -1 -4 -2 1 8 -3 3 6 -6 9 -1 0 -3 1 -6 -8 2 3 -4 1 0 -7 -5 -1 4 -17 5 0 -8 -4 14 21 4 7 -2
7009 -2 15 0 -6 3 7 13 9 5 8 8 10 3 0 3 -5 -6 0 2 10 -5 -2 4 12 8 2 10 8 6 -3 -1 -3 5 -8 2 -2 2 -1 7 4 8 1 6 2 15 -3 -9 -13 10 9 -1 4 8
7061 8 -1 7 5 10 6 1 3 2 7 4 -3 12 6 10 2 -3 7 -2 2 -6 0 -7 -11 2 -1 -4 -7 11 2 -3 1 -1 7 1 -12 3 9 5 -4 8 11 -6 -2 -13 5 1 3 11 8 10 7
7112 7 0 8 -1 -5 5 0 -9 5 5 -6 -7 1 2 -3 -1 6 3 0 2 -1 -3 1 -3 2 -10 -8 1 -2 -7 7 0 5 1 6 4 -5 3 8 -6 6 -5 5 0 6 -4 0 -4 4 8 -6
7162 -6 11 11 11 8 -5 8 7 0 8 -1 2 9 8 -2 0 15 -2 -4 -5 -4 -2 -8 0 2 -12 -8 -2 -1 4 7 10 5 5 0 -4 4 -5 -7 -11 -4 -4 3 -5 7 11 5 1 7 1 -6 1 -2 15
7215 15 -6 -10 6 1 9 -2 6 1 -1 3 -6 -11 -5 -1 -9 -6 -1 -7 -7 -11 -4 -4 -1 -3 -2 -8 -1 2 0 -2 0 2 0 -1 1 -4 3 5 5 -3 -10 3 1 -2 -7 4 -8 -7 8 -3 5 1
7267 1 13 12 0 1 -10 7 -2 9 3 1 -5 5 -3 -2 -3 0 -3 -4 8 5 -7 -12 0 5 -2 -10 0 -9 -5 4 4 7 4 5 -10 0 9 -2 -2 1 10 -2 1 13 12 1
7313 1 -12 14 1 -5 0 1 -11 4 9 10 -2 4 -2 -7 -10 -1 -18 1 6 2 7 -8 4 -1 2 6 3 3 -2 -12 -4 -5 -9 -1 3 -3 12 1 5 4 3 -1 1 -4 -6 2 -4 4
7361 4 4 2 1 -9 19 2 5 -4 -1 -7 -12 1 -15 0 -1 5 -3 4 4 -6 -5 9 3 3 -19 -7 -2 -3 3 5 4 -5 -1 8 -3 -3 -4 1 6 -1 -8 -10 5 17 10 16 12 -4
7409 -4 3 5 -6 4 -4 -4 -2 -5 -1 4 11 -12 -7 -4 -2 -10 -2 0 -6 -6 0 -3 -2 5 8 10 0 -12 -2 -9 4 -5 -4 0 -5 -6 3 0 -1 7 1 -4 -3 5 -5 -1 1 -3 -3 -1 -4 1 5
7462 5 -1 -5 1 3 3 -5 -4 -6 5 -2 -10 -1 -5 3 -6 0 -3 -3 -1 2 0 1 4 -5 -1 -7 3 1 6 3 0 4 1 1 7 4 12 -1 5 4 -6 -2 -6 -8 3 -4 -2 -4 -9 3 8 5 -1 -3 0
7517 0 -7 -10 -3 -1 0 -6 -7 -2 -2 -17 -7 -12 -1 1 -5 -13 -11 -8 -7 3 -2 2 6 -1 -1 8 6 3 -11 -8 -4 -3 -16 0 -9 14 3 3 6 0 -4 7 -8 -3 -1 -13 -6 -14 3
7566 3 1 -2 -8 -1 -1 -7 -12 -2 -2 -10 -11 -5 -7 -10 5 -5 0 -7 -7 3 -3 -5 -5 -6 -11 3 -12 -3 -1 6 0 5 1 -15 4 -6 8 3 -1 3 -4 -11 -9 -13 6 -12 0 -14
7614 -14 -4 -12 -10 0 5 -9 -13 -9 -18 1 2 -3 0 9 -2 -4 4 -16 -15 7 -2 7 5 -6 -4 1 0 0 5 -7 -9 -3 0 -2 -3 -4 -3 -11 -5 -5 -1 -10 -7 -12 1 -1 -23 -5
7662 -5 -6 -8 -13 2 -4 -2 2 -7 5 0 -5 -8 -3 -2 6 -6 -4 -9 -1 2 -6 -2 -5 -4 7 3 -11 14 -11 1 -3 -11 -3 -7 -12 -11 3 -3 1 2 0 -8 -5 7 6 -10 -7 -14 8
7711 8 -2 -5 -9 -15 -5 5 -7 -11 0 2 -4 -5 4 2 -14 2 2 4 -10 0 15 2 3 1 0 -3 -1 1 -14 -6 -9 -9 -6 -3 -1 -3 -8 -6 8 1 -2 3 -3 1 -4 4 1 -9
7759 -9 -3 2 0 -7 9 -7 -11 -7 -1 3 1 -6 13 -2 6 -2 4 -6 -1 -7 -13 4 -3 11 4 11 9 3 2 3 -9 -8 1 -2 -6 -7 3 -2 5 -19 0 -6 -7 13 -5 4 -13
7806 -13 1 -4 0 -13 -12 -2 -1 3 -8 5 2 7 -5 -3 1 -3 3 -4 -3 9 -8 -11 11 4 0 -5 -2 -7 -7 -9 10 0 -3 -7 1 7 -6 -2 1 -7 -5 -4 3 -10 -11 -2 1
7853 1 -3 -5 4 -2 5 -2 1 5 -7 -4 -4 -1 12 -4 -13 -3 0 1 -6 -9 -2 -2 -3 8 -1 -1 2 9 5 2 4 15 -8 11 2 -10 4 1 -3 2 2 -1 2 5 1 4 2 -6 -10 5
7903 5 -6 -10 0 -3 3 -9 -6 -7 -9 1 0 9 2 -4 -10 -5 4 13 -4 -2 -2 -7 -11 1 -7 -6 0 3 4 -1 -12 -7 1 -4 -2 -3 -7 -9 1 -9 -8 1 3 2 -14 -2 -1 -6 -10 -2
7953 -2 -7 -10 -2 3 -8 -10 -9 0 4 2 9 -8 -1 -2 -1 7 -5 -1 -2 1 9 0 4 2 1 10 -6 0 0 -2 -3 2 -4 -8 3 7 15 1 -8 -8 5 -11 -6 -6 -4 -10 -3 -1 -10 -8 3 -2
8005 -2 -6 -5 -4 -7 -3 -6 1 1 1 10 5 -7 0 1 1 8 5 14 6 2 10 -1 5 11 8 4 4 2 -1 11 5 -7 -2 -1 -17 -6 1 -4 -8 -12 3 -10 1 1 -9 -4 2 -8 -4 0
8055 0 8 -4 -12 5 11 1 1 5 -2 -6 7 3 4 -13 -1 0 6 5 -9 -4 2 -4 1 2 -11 7 12 -1 -2 -9 -6 -6 4 5 6 -5 -7 0 -9 2 -1 -5 -16 -6 -3 -2
8101 -2 3 -2 2 2 -7 8 2 -2 1 0 -2 10 -6 -4 8 -7 -5 1 4 -4 -6 7 9 6 5 4 1 5 -2 -18 -14 -9 1 -2 -11 -14 -9 -15 -6 -16 -2 -9 -9 -11 -1 -2 -1 10 -6
8150 -6 -2 -5 -2 2 12 0 12 8 -2 1 10 -1 -3 3 2 7 1 -7 6 4 -1 9 3 -1 10 5 -9 -6 3 2 3 8 7 10 1 1 -7 -3 -5 -5 -2
8191b
$$ Imaginary data points
##PAGE= N=2
##DATA TABLE= (X++(I..I)), XYDATA
0 0 0 0 0 0 0 0 0 0 0 0 0 0 0 0 0 -8 8 -8 8 -8 8 -16 16 -16 24 -24 32 -32 40 -42 49 -57 65 -73 82 -97 105
37 105 -121 134 -147 165 -184 203 -227 249 -276 305 -337 371 -410 451 -493 547 -602 664 -736
56 -736 816 -911 1017 -1146 1297 -1483 1716 -2023 2437 -3036 3986 -5717 9879 -41138 -9943
71 -9943 71641 -28434 -63544 25807 72470 -5058 -25574 27979 33282 -16472 -10973 12022 -6359
84 -6359 -20474 11153 18239 -7483 -5711 22815 18859 -2404 -7715 -5041 -3698 3050 -10293 -32931
98 -32931 -10410 32563 9018 -37377 -2375 53208 11892 -47401 -9138 36558 -11778 -50686
110 -50686 -3056 21891 -20291 -17395 34568 22362 -20196 15030 56505 3689 -41200 13202
122 13202 45533 -20896 -54383 7528 35449 -17534 -36050 10013 25766 -5199 -15507 -99
134 -99 3466 -1443 -4450 -10926 -7079 9571 7509 -8277 2296 20465 4086 -11504 9782 14793
148 14793 -19584 -20815 18612 10554 -33945 -15060 37292 16331 -32591 -4095 43195 11287
160 11287 -32426 -3474 27716 -3536 -27045 -130 12067 -9936 -9783 9573 1879 -11571 3283
173 3283 11863 -7285 -11985 7686 9188 -6741 -3393 9525 5603 277 5354 1939 -5840 1469
187 1469 5057 -11275 -15061 4571 6148 -13094 -7727 14430 7930 -8720 4043 16228 -2447
200 -2447 -10976 9403 9477 -16045 -11367 16153 7558 -19045 -5695 20769 6044 -18193 -4628
213 -4628 13885 -43 -15099 -4287 6155 383 -2686 2315 3980 4798 7029 2342 -3387 1061
227 1061 3149 -6939 -10449 -749 67 -8508 -2985 9060 3643 -4156 7172 14444 -611 -8234
241 -8234 5723 7980 -9917 -12431 3695 4155 -8941 -5363 7334 4175 -3515 1846 5491 -2083
255 -2083 -3843 2587 -185 -7450 -2170 5841 1088 -3892 3393 8778 2756 -1818 1207 1777 -2377
270 -2377 -4667 -5204 -5248 -2422 -462 -2834 -1526 6297 7804 1034 1373 8477 5024 -5247 -3867 2787
286 2787 -2854 -10633 -3990 3906 -1688 -5693 3510 8948 1258 -2510 4308 5384 -2962 -5654 -515
301 -515 126 -3993 -3387 972 2423 1818 2366 2811 2358 1752 -188 -2925 -3307 -2413 -3472 -4117 -1212 1713
319 1713 1801 2690 5349 5241 2648 2070 1634 -2112 -4976 -3774 -3517 -5748 -4268 827 2052 484 3292
336 3292 7069 4466 27 1065 2240 -2523 -6349 -3504 -678 -2740 -3316 1352 4705 3055 1531
351 1531 3025 3479 373 -2953 -3344 -2326 -2746 -3881 -2533 1292 3337 2326 2481 4839 4539 441
367 441 -1915 -994 -1962 -5205 -5251 -1976 -570 -880 1174 4071 4170 2984 2809 1892 -482 -1795 -2202 -3547
385 -3547 -3910 -1688 -36 -497 657 3687 3779 1142 687 1774 -149 -3294 -3055 -1329 -1701 -2078 -8
402 -8 2011 2167 2199 2494 1786 720 -60 -1584 -2895 -2160 -1266 -2048 -1536 1599 2830 929 1029 3405 2207
421 2207 -1725 -1874 297 -1274 -3836 -1831 1232 508 -375 1802 2900 1104 249 637 -761 -2134
437 -2134 -1162 -828 -2151 -968 2092 1755 -230 1475 3422 477 -2478 -720 142 -3092 -3787 -188
453 -188 897 -1062 433 3828 2954 416 1339 2179 -659 -2682 -1411 -1024 -2179 -1140 985 1122 1405
470 1405 3135 2717 276 140 884 -1815 -4519 -2791 -913 -2515 -2648 1025 2698 1111 1499 3108
486 3108 1370 -1141 -543 -569 -3318 -3341 140 740 -939 1503 5324 4100 1434 2706 3346 -465 -2994
503 -2994 -1639 -2124 -4573 -3216 151 -290 -1386 1763 4051 1144 -1236 448 545 -2949 -4370 -2538
519 -2538 -1561 -1685 -346 1427 2372 3763 4580 2950 1347 2060 1571 -1706 -3054 -1092 -490 -1679 -539
536 -539 1745 1603 1167 2410 1646 -1646 -2117 -487 -2660 -6182 -4210 -156 -1048 -2988 332 4160 2897
553 2897 946 2225 2794 691 -327 -28 -1098 -1615 513 1572 -33 361 3386 3545 531 -330 998
570 998 157 -2236 -2915 -2512 -2345 -1513 -703 -1264 -865 1659 2330 -286 -1216 953 1115 -1578 -2259 -460
588 -460 153 -115 695 1050 747 2314 3666 1090 -1404 1084 2991 -1035 -4160 -697 2168 -1069 -3347
605 -3347 -84 2158 -41 -1214 297 311 -794 -148 44 -1676 -1389 1237 1090 -1429 -687 2179 1761
622 1761 -557 -389 865 489 -11 -112 -1074 -1028 1192 1312 -1748 -1751 2217 2462 -1770 -2198 1752 2077 -1407
641 -1407 -1781 585 732 -369 -122 -394 -1010 680 1817 -979 -2488 1225 3030 -1057 -2892 1291
657 1291 2928 -918 -2136 967 1366 -1011 -614 708 -662 -1079 1209 906 -1949 -954 2351 1059
673 1059 -2198 -810 1973 598 -1445 -351 550 -254 172 672 -1105 -1210 1794 1626 -2342 -1945 2612
690 2612 2042 -2620 -1811 2648 1814 -1769 -679 1934 737 -606 615 485 -1040 98 1323 -1107
706 -1107 -2483 452 1404 -1902 -2451 841 978 -1703 -930 1283 33 -1057 1084 1382 -1236 -509 2585
723 2585 1155 -2038 63 3226 892 -1822 620 2591 143 -1207 566 551 -1188 -579 245 -1538
739 -1538 -1954 506 426 -2336 -1599 1490 484 -2306 -937 1440 -89 -1672 128 1132 -249 98
755 98 1864 1195 121 1791 2646 425 -301 1682 1358 -1200 -959 799 -348 -1849 -383 414 -1431
772 -1431 -1529 528 -181 -2501 -1349 806 -858 -2723 -485 1510 -250 -1117 1254 2243 570 372 1753
789 1753 1314 73 507 890 -168 -311 784 503 -463 276 1091 51 -664 158 11 -1353 -1261 -400 -1150
808 -1150 -1909 -601 234 -910 -952 880 1006 -603 -261 1302 639 -818 39 1274 354 -343 914 1490
826 1490 401 230 1143 752 -454 -325 137 -654 -1247 -622 -311 -809 -603 127 69 -204 224 372 -165 -212
846 -212 198 -111 -578 -78 384 -95 -177 620 685 -22 114 707 196 -547 -64 368 -376 -669 253 495 -328
867 -328 -208 729 447 -496 -226 452 -187 -933 -351 223 -330 -610 122 522 123 24 427 486 183 42 -12
888 -12 -37 29 -126 -410 -176 277 -26 -545 -44 549 -95 -712 70 661 -220 -673 378 838 -161 -407 619
909 619 740 -284 -398 358 199 -594 -498 13 -173 -445 -160 56 -14 121 252 100 141 414 192 -202 67
930 67 320 -159 -433 79 195 -401 -351 281 70 -456 -26 465 -75 -337 409 525 -253 -120 686 268 -568
951 -568 -27 619 -253 -873 68 462 -568 -772 345 475 -453 -342 563 471 -158 -61 373 284 30 -126 -196
972 -196 100 247 -384 -700 221 579 -627 -857 689 897 -794 -706 1189 886 -1020 -446 1367 456 -1271
991 -1271 -215 1177 -152 -1309 86 858 -536 -904 427 570 -489 -268 549 250 -192 182 274 -66
1009 -66 164 243 -338 -240 440 -71 -859 -33 643 -525 -918 603 718 -935 -482 1348 434 -1323 174
1028 174 1749 -296 -1640 774 1609 -1182 -1605 1277 1171 -1688 -1054 1646 642 -1659 -306 1598
1044 1598 120 -1243 254 1089 -245 -637 363 317 -234 -31 -65 -386 185 354 -819 -649 1024 465
1062 465 -1517 -316 1935 198 -1999 393 2383 -571 -2231 1087 2099 -1549 -1981 1686 1377 -2180
1078 -2180 -1113 2155 534 -2178 0 2160 -275 -1707 828 1579 -817 -937 1073 654 -887 -167
1094 -167 654 -293 -486 316 -199 -744 331 423 -990 -388 1306 117 -1451 516 1844 -773 -1634 1471
1112 1471 1607 -1944 -1408 2244 882 -2744 -620 2753 36 -2815 430 2703 -782 -2315 1214
1127 1214 2014 -1337 -1407 1537 1030 -1363 -433 1259 83 -936 199 475 -472 -145 373 -381 -250 867
1145 867 103 -1011 465 1417 -743 -1433 1160 1194 -1890 -1386 1750 515 -2530 -574 2242 -194 -2375
1162 -2375 656 2298 -892 -1719 1644 1783 -1403 -785 2113 953 -1468 97 1874 8 -1271 447
1178 447 897 -808 -879 289 -206 -937 -209 -2 -788 -317 437 -519 -917 552 559 -1177 -552 1411 320
1197 320 -1433 414 2144 -44 -1249 1466 2222 -734 -1016 1891 1438 -1550 -755 1737 316 -1931
1213 -1931 -352 1210 -690 -1800 -36 392 -1318 -1269 133 -236 -1104 -245 402 -259 -108 806 462 -2
1231 -2 898 1131 12 197 1411 700 -564 488 1471 -69 -908 758 998 -1063 -1113 739 39 -1884
1249 -1884 -936 642 -730 -1942 -215 736 -965 -1289 638 718 -917 -425 1157 538 -571 451 1325
1266 1325 393 28 1008 1018 155 367 801 130 -242 311 60 -771 -352 215 -667 -1109 -27 148 -1120
1285 -1120 -943 435 -42 -1277 -388 846 -145 -959 438 1135 -181 -383 1049 982 -349 6 1102
1302 1102 393 -560 230 795 -191 -508 393 355 -561 -308 348 -209 -715 -72 136 -597 -520 252 -13 -589
1322 -589 -13 505 -133 -369 421 442 -336 -85 618 118 -407 284 623 -212 -345 545 378 -566 -233 573
1342 573 -42 -785 -33 498 -335 -617 302 418 -409 -249 511 193 -410 62 466 -112 -320 268 252 -303
1362 -303 -102 339 -37 -375 98 241 -326 -286 271 66 -429 1 425 -87 -324 300 416 -249 -180 434 171
1383 171 -389 -25 403 -98 -374 197 307 -276 -196 355 94 -387 -6 365 -176 -411 154 236 -360 -300 282
1404 282 82 -411 -97 317 -42 -300 124 263 -91 -51 269 130 -58 170 240 -86 -57 257 24 -321 23
1425 23 229 -217 -377 152 212 -330 -241 323 132 -367 -34 390 -23 -351 130 320 -192 -280 214 173 -279 -135
1447 -135 225 21 -226 52 179 -77 -73 171 75 -135 68 190 -78 -135 167 97 -191 -68 175 -22 -197 64
1469 64 157 -121 -82 214 82 -182 61 272 -66 -227 142 186 -248 -236 162 46 -317 -123 195 -28 -232 67
1491 67 214 -64 -84 174 123 -83 17 157 -13 -97 99 74 -106 -25 137 -43 -150 67 130 -138 -97 187 92
1514 92 -173 3 255 41 -181 52 187 -76 -192 19 52 -139 -128 35 -13 -68 41 54 -12 53 115 -12 -60
1537 -60 94 75 -121 -77 123 -11 -208 -15 154 -62 -188 66 146 -112 -127 163 133 -119 -16 221 85 -102
1559 -102 40 155 -8 -122 12 35 -92 -84 -3 -28 -42 17 36 23 53 86 19 30 82 24 -79 -11 60 -92 -150 28
1585 28 38 -168 -141 119 58 -159 -39 216 78 -123 87 261 25 -117 91 169 -82 -145 61 56 -140 -112 49
1608 49 12 -88 -12 80 53 18 51 80 65 75 15 -13 63 63 -81 -109 31 4 -180 -132 70 -7 -198 -39 158 9
1634 9 -123 95 225 -20 -90 135 148 -139 -138 123 39 -204 -102 136 30 -136 60 199 45 -24 132 149 -10
1657 -10 -14 75 16 -76 -43 -13 -90 -82 -63 -100 -105 -35 -70 -135 -37 78 -24 -81 122 222 1 -28 236 222 -99 -78 202 78
1685 78 -252 -115 176 -17 -249 2 231 -21 -154 114 213 -100 -166 68 53 -209 -168 45 -20 -178 -56 68
1707 68 19 -22 72 88 63 94 82 48 104 184 57 2 168 187 -56 -76 127 27 -273 -198 56 -128 -385 -130 124
1732 124 -120 -272 85 236 -98 -138 221 190 -175 -120 219 85 -196 -17 246 77 -101 123 247 57 -9
1753 -9 116 96 -40 -12 27 -45 -58 -10 -63 -113 -10 -2 -165 -128 28 -59 -245 -80 135 -54 -202 107 259 -31 -101
1778 -101 258 275 -121 -78 225 93 -241 -74 171 -46 -247 24 165 -86 -129 138 117 -95 -39 122 31 -103
1800 -103 8 69 -51 -58 39 -6 -68 21 36 -83 -44 94 0 -109 47 135 -62 -110 144 123 -125 -87 170 37 -214
1825 -214 -43 171 -52 -234 42 154 -100 -147 127 136 -106 -29 181 79 -82 44 128 -32 -64 57 28 -118
1847 -118 -36 41 -78 -89 55 56 -60 28 159 40 -63 91 109 -86 -105 72 7 -186 -66 87 -50 -167 48
1870 48 105 -109 -108 103 43 -161 -44 141 5 -121 75 198 10 -43 163 143 -55 -32 93 -18 -134 -41 21
1893 21 -79 -50 63 34 -48 54 90 -64 -85 36 -27 -207 -103 40 -68 -148 71 193 15 5 219 201 -18
1916 -18 16 169 31 -127 9 78 -64 -90 78 56 -96 -30 64 -77 -198 -75 -58 -214 -188 -13 -20 -127 19 186
1940 186 90 37 159 178 12 -1 108 30 -79 27 105 9 5 166 144 -14 32 108 -28 -194 -78 -45 -215 -257 -63
1965 -63 -35 -162 -89 85 31 -88 26 88 -39 -86 21 29 -56 22 129 86 72 198 209 43 61 167 21 -153 -54
1990 -54 36 -131 -212 -14 51 -108 -78 100 64 -94 -60 42 -69 -163 -46 -4 -101 -63 83 68 8 105 158 48 14
2015 14 84 35 -94 -60 26 -58 -107 40 81 -29 -18 106 43 -99 -28 48 -83 -142 -7 44 -104 -40 124 76 -58
2040 -58 53 162 4 -99 55 99 -100 -121 69 47 -100 -44 95 25 -74 0 45 -40 -60 10 -14 -63 8 24 -54 -42
2066 -42 78 21 -83 15 97 -30 -89 87 98 -75 -58 129 60 -135 -13 122 -47 -155 26 107 -71 -69 129 107
2090 107 -63 -12 131 7 -110 -14 50 -84 -100 47 64 -53 27 117 38 -35 27 25 -100 -94 -39 -97 -121 21 53 -59
2116 -59 15 175 76 -96 38 121 -87 -204 4 63 -141 -112 153 151 -28 58 238 97 -91 -1 53 -118 -209 -40
2140 -40 -12 -109 -38 116 90 32 101 107 -15 -37 -24 -114 -164 -55 -39 -117 -37 146 98 -18 107 190 -20 -154 24 -11
2166 -11 -235 -172 62 6 -131 50 265 104 -46 138 193 -68 -173 -10 -12 -174 -128 43 51 11 107 181 105 70 77
2191 77 -23 -74 -41 -111 -191 -75 52 -55 -84 151 219 -10 -43 177 86 -213 -152 84 -63 -274 -41 173 2
2214 2 -90 163 239 -36 -80 118 37 -172 -106 22 -60 -111 34 115 40 81 150 72 11 66 10 -133 -77 18 -103 -151 46
2241 46 107 -68 -35 203 96 -147 0 189 -71 -274 26 153 -178 -228 149 184 -151 -102 228 108 -166 -17
2263 -17 160 -49 -161 36 87 -107 -53 130 60 -66 67 121 -20 -35 80 -15 -111 36 75 -127 -97 165 90 -176
2287 -176 -7 257 28 -215 46 207 -104 -217 98 107 -233 -115 177 9 -230 39 264 -68 -201 154 205
2308 205 -145 -161 153 74 -191 -67 104 -36 -90 83 55 -110 24 171 -42 -132 101 131 -119 -88 147 46
2330 46 -135 55 192 -37 -92 202 152 -205 -90 247 -9 -356 -75 203 -111 -315 32 187 -121 -147 148
2351 148 69 -179 -25 144 -116 -213 77 145 -141 -79 247 192 -45 84 252 82 -34 85 15 -138 -14 69
2373 69 -150 -202 104 133 -190 -149 179 54 -283 -133 90 -149 -307 -14 97 -163 -73 290 211 -82 126 396
2395 396 110 -164 71 215 -78 -205 48 92 -76 -9 136 7 -62 88 23 -238 -190 4 -180 -368 -142 39
2417 39 -98 -122 137 175 35 112 235 42 -88 139 163 -121 -95 255 200 -73 92 352 137 -112 32 97 -195
2440 -195 -303 -104 -140 -350 -206 41 -71 -174 54 187 -10 -88 62 48 -102 -42 24 -39 -9 180 153 22 189
2463 189 337 108 -77 105 178 -141 -224 19 41 -175 -118 124 45 -120 33 123 -97 -189 -5 -9 -233 -179 57
2486 57 3 -100 64 199 82 42 162 111 -40 7 84 -60 -155 18 65 -84 -47 116 78 -59 18 77 -56 -94
2510 -94 41 -10 -151 -20 137 -2 -120 98 196 -39 -116 111 131 -142 -123 101 53 -124 -38 125 16 -85 46
2533 46 70 -59 -63 38 -16 -84 0 34 -34 -8 56 8 -48 54 82 -48 -52 123 83 -90 -25 152 56 -113 -12 96
2559 96 -39 -160 -9 37 -96 -61 67 10 -46 60 125 -13 -51 85 80 -86 -55 84 45 -72 21 102 28 -18 52
2584 52 32 -51 -42 -5 -84 -107 -20 -5 -72 -31 70 15 -42 52 64 -64 -86 49 18 -135 -62 104 54 -56 53 175 82
2611 82 -21 60 91 -22 -61 -25 -36 -53 -21 8 -29 17 83 27 -45 17 59 -59 -112 4 11 -78 -57 78 51 -32 32 110
2639 110 7 -66 -6 18 -87 -100 -19 -2 -66 3 59 4 25 101 70 -40 -3 71 -11 -104 -11 71 -20 -52 42 87 25 19 46
2668 46 24 -17 0 -13 -75 -29 27 -27 -90 18 75 -39 -63 47 60 -85 -76 50 6 -101 -27 88 28 -66 39 112 1
2695 1 -43 47 65 -26 -47 15 8 -26 6 1 -35 30 81 1 -54 53 88 -33 -62 45 70 -48 -49 48 33 -46 -18 50 8 -34
2725 -34 20 13 -36 -12 40 -25 -60 8 40 -41 -35 61 34 -64 -7 92 20 -85 17 99 -11 -95 20 90 -35 -66 47 72
2753 72 -12 -13 40 24 -7 2 -7 -29 0 21 -37 -46 61 66 -54 -22 77 42 -79 -34 67 -9 -102 -28 46 -28 -72 24 47 -22 -22
2784 -22 48 2 -43 -4 23 -62 -52 37 20 -70 9 102 38 -45 45 94 -19 -78 29 50 -45 -34 45 51 -26 10 52 21 0 11
2814 11 -11 -24 -14 -20 -62 -28 58 16 -60 21 108 17 -96 -9 69 -50 -130 -27 41 -33 -47 27 57 1 22 73 30 -9 30
2843 30 22 -26 -20 29 17 -11 39 65 17 25 50 5 -57 -15 21 -62 -98 -6 42 -31 -42 50 53 -5 0 6 -12 -24 -1 -27 -58 14 75
2876 75 2 -36 86 122 3 -60 43 49 -69 -105 -29 -32 -54 -20 0 -6 13 50 22 -24 9 45 -35 -40 26 21 -16 35 86 40 20
2907 20 92 100 -39 -52 55 17 -119 -82 31 4 -80 -29 53 16 -24 -11 -27 -52 -22 -29 -99 -82 32 22 -60 -7 99 70
2935 70 -19 39 70 11 -15 44 24 -33 14 78 1 -43 59 92 -33 -50 49 24 -79 -48 23 -27 -70 34 48 -47 -25 84
2963 84 33 -88 -34 79 -5 -105 -17 44 -17 -49 31 22 8 31 29 -62 -14 62 5 -84 3 103 -2 -80 39 99 -45 -55
2991 -55 55 41 -79 -10 92 19 -67 53 100 -24 -49 70 77 -56 -51 37 0 -55 -6 18 -31 -11 47 -15 -73 8 57 -64
3019 -64 -85 46 54 -62 -28 75 25 -47 27 64 -44 -50 53 10 -100 -25 94 6 -74 63 136 0 -48 92 83 -49
3045 -49 -31 49 -1 -77 12 39 -38 -52 65 47 -49 -9 56 -11 -67 4 16 -61 -38 43 -13 -53 44 72 -39 -41 74 53 -87
3074 -87 -40 77 8 -88 21 90 -12 -34 82 87 -44 -4 86 0 -117 -25 26 -80 -103 8 25 -46 -1 77 45 -7 74
3101 74 71 -31 -22 61 23 -85 6 82 -4 -38 57 84 -22 -35 31 -28 -119 -60 -7 -104 -112 16 29 -62 -7 97 42 -36 32
3130 32 62 -48 -77 28 30 -62 3 133 76 -3 109 184 39 -33 69 43 -72 -94 -32 -39 -79 -14 3 -22 -5 52 -4 -72
3158 -72 -40 -13 -96 -126 -18 10 -50 -4 111 70 27 94 131 6 -54 32 7 -99 -64 40 23 -27 47 111 55 1 54 19
3186 19 -71 -64 -16 -74 -117 -7 65 -5 -9 103 99 11 -13 40 2 -79 -63 -27 -41 -20 20 20 22 64 69 -9 -38 19 -23 -122 -79 12
3218 12 -32 -69 42 104 20 7 108 77 -41 -53 25 -1 -83 -40 44 25 0 45 58 36 21 13 -23 -34 -8 -36 -51 -8 54
3247 54 21 -12 47 76 2 -26 21 1 -87 -44 9 -15 -58 22 80 8 -12 71 25 -59 -34 5 -43 -81 -2 48 -10 -14 98 93 5
3278 5 14 65 13 -73 -49 9 -9 -14 31 42 55 73 47 6 7 35 -54 -116 -25 8 -70 -72 55 95 -34 -3 87 45 -92 -73 22
3309 22 -50 -141 -40 59 -6 -17 83 113 18 8 58 8 -50 -37 -26 -54 -21 50 28 10 77 96 18 3 29 5 -81 -63 -14
3338 -14 -66 -58 26 63 3 18 96 33 -59 -5 32 -76 -135 -19 25 -75 -60 94 103 -32 -1 115 45 -96 -46 17 -45 -96
3366 -96 -12 38 -1 21 69 60 36 42 24 -31 -14 0 -44 -64 25 50 -22 -7 107 76 -33 11 81 -16 -118 -14 43 -68 -81
3395 -81 52 66 -40 -18 94 38 -48 -3 54 -34 -89 -1 30 -53 -25 57 33 -32 11 62 25 -21 4 25 -11 -4 15 -11 -5 34
3425 34 18 -22 26 63 -12 -40 42 61 -65 -64 61 46 -89 -41 87 29 -93 -12 96 -1 -79 11 59 -45 -72 4 26
3452 26 -46 -35 28 4 -12 36 34 -3 12 37 0 -19 10 12 -32 -11 32 19 -13 38 60 0 -2 46 16 -74 -18 41 -18 -66 23 73
3484 73 -18 -37 72 65 -60 -41 70 10 -86 -37 51 -21 -69 -6 73 -2 -48 -3 22 -31 -48 -27 -27 -12 -2 -23 6 68 49 -1
3514 -1 18 81 30 -58 -6 65 9 -55 31 89 15 -17 61 75 -35 -34 29 -1 -83 -42 10 -19 -43 22 47 -20 -9 29 -3 -57 -21
3545 -21 14 -45 -51 12 47 13 23 66 64 13 5 2 -19 -26 -29 -37 -19 30 30 -5 17 85 26 -47 -9 38 -47 -112 -23 21 -26 -42 66 109
3579 109 29 9 79 55 -44 -33 7 -22 -47 -9 34 14 20 37 38 21 12 -26 -83 -69 -34 -71 -97 -37 16 9 5 51 67 15 -10 22
3611 22 -10 -47 -15 10 -1 28 94 91 55 90 109 29 -31 1 13 -79 -98 -21 6 -54 -18 57 45 -25 -18 10 -31 -85 -66 -43 -63
3642 -63 -40 9 30 43 71 82 35 45 49 -16 -51 -9 11 -34 -27 35 64 22 32 70 42 -25 -20 3 -57 -76 -23 -3 -32 15 61 48
3674 48 17 52 60 -20 -37 10 -23 -79 -52 24 13 -21 16 68 29 -15 3 13 -42 -71 -34 -18 -30 -5 32 13 43 60 35 5 12
3705 12 22 -30 -37 4 7 -19 5 59 26 -8 39 60 -6 -56 -8 1 -60 -47 11 12 -17 21 59 23 -2 20 22 -41 -36 -3 -19 -56 -15
3738 -15 34 13 -10 19 35 -5 -17 -8 -11 -43 -20 -7 -32 1 35 15 -11 23 56 -7 -30 17 30 -38 -29 53 44 -7 28 70 43 -4
3770 -4 23 41 -28 -53 -14 -5 -36 -41 1 9 -29 -3 18 -2 -13 6 -8 -34 -8 8 -21 -20 25 16 -2 -5 34 16 -14 11 28 -15 -13 30
3804 30 23 -9 12 52 8 -10 39 42 -24 -27 38 14 -37 -33 30 9 -33 -7 26 -3 -27 4 18 -12 -23 -15 -9 -20 -15 -17 -30 -6 9 -19
3838 -19 -20 24 13 -18 -21 34 19 -33 -15 31 8 -27 2 35 5 -6 30 34 -9 4 29 5 -29 -2 14 -2 -14 10 6 -2 7 17 7
3871 7 -21 -8 -13 -44 -35 -28 -12 -35 -16 4 0 -1 11 5 -10 -3 7 -25 -19 -6 7 -13 -12 39 35 -2 5 37 8 -38 -14 30 -24 -16 13 23 7
3908 7 28 31 35 13 5 5 -18 -26 -14 -14 -22 -1 15 0 3 30 9 -23 -11 1 -27 -51 -21 0 -21 -14 34 24 3 13 32 13 -21 -5 8
3943 8 -17 -24 19 33 4 22 49 33 7 19 2 -24 -27 -18 -1 -34 -2 16 8 17 46 29 3 3 14 -24 -44 -11 -4 -25 -37 18 20 -11 5
3978 5 24 5 -32 -9 7 -32 -42 17 17 -8 14 55 44 5 25 40 -11 -33 -1 2 -31 -4 25 17 8 34 34 12 -4 13 6 -17 -19 -16 -20
4013 -20 -24 8 12 -22 3 30 -11 -35 -21 -4 -43 -43 3 22 -17 -1 43 20 -4 9 18 -13 -39 -9 -4 -37 -32 9 18 17 31 29 15 10 24
4048 24 3 -9 -10 -3 -15 -11 21 33 -3 1 18 16 -24 -16 -7 -8 -20 -5 4 -4 12 29 14 -12 17 26 -21 -43 -6 -27 -51 -34 19 -2 -14 11
4084 11 56 14 -10 20 32 -2 -11 4 16 12 14 32 25 20 25 9 -7 9 0 -13 -14 3 5 -29 4 31 12 -28 5 25 -25 -42 -12 -13 -33
4119 -33 -44 -18 1 -8 5 16 15 22 15 12 0 2 21 -5 -15 10 26 11 3 16 21 -2 3 13 22 -23 -7 17 7 1 11 25 25 20 2 0 -15
4156 -15 3 -16 -37 -10 -2 -20 -35 9 15 -6 -23 -3 8 -21 -26 7 -1 -22 -16 3 6 -2 4 7 13 13 13 12 5 25 13 9 24 35 14 -6 24 42
4194 42 1 -20 15 24 1 -29 7 22 -9 -7 13 20 13 -2 3 7 1 -5 -2 0 8 7 -25 -19 -4 -3 -28 -13 22 -6 -15 4 20 8 -2 15 34 4
4232 4 6 21 22 11 6 12 12 4 7 12 -4 3 17 -5 -3 9 10 -5 -15 3 17 -11 -7 18 2 -19 -10 7 -4 -15 -6 -12 -13 13 8 -8 5 20 4
4271 4 -17 -1 11 -12 -42 -5 19 -18 -27 9 30 -3 -2 34 30 1 14 48 36 17 24 31 23 11 4 4 5 -4 -9 -13 -14 -14 -15 -32 -19 -10 -27 -39 -12
4310 -12 -8 -26 -22 5 -1 -13 -7 17 -6 -12 27 29 -2 -5 35 23 -13 14 38 22 -12 15 36 1 -5 14 13 -22 -13 4 0 -19 -4 11 3 -2 -3
4347 -3 -12 -12 7 -6 -19 -3 20 -11 -31 10 24 -25 -28 16 10 -40 -28 19 8 -36 -5 34 -4 -25 18 44 -7 -10 24 32 -12 4 19 8
4381 8 -9 8 22 14 13 20 10 -5 19 15 -6 -1 25 -16 -14 9 25 -15 -24 22 12 -32 -17 21 7 -41 -11 24 -10 -37 13 31 -13 -18 39
4416 39 26 -28 -3 29 4 -21 13 37 15 3 24 21 9 15 35 16 12 22 6 -11 20 25 -5 -17 23 11 -11 -11 23 2 -23 8 24
4449 24 -20 -19 7 12 -39 -33 24 2 -27 -14 10 -15 -27 4 19 -23 -22 22 13 5 -6 19 18 3 21 28 20 10 15 -1 2 12 3 -15 12 30
4485 30 -8 -13 26 22 -14 -13 29 5 -34 -9 21 -19 -25 -7 15 -4 -27 16 19 -16 -11 19 5 -16 6 15 -4 -6 21 14 -9 1 11 14 5 8
4521 8 0 -4 8 28 2 6 24 24 -4 22 43 18 -17 23 27 -22 -29 9 14 -21 -17 23 2 -52 -11 25 -6 -44 2 7 -19 -25 10 17 -7 -9 3
4558 3 -5 -14 12 6 -3 1 1 4 7 18 11 -1 13 31 4 2 13 13 2 -9 23 30 -13 -19 29 3 -24 21 35 -3 -20 11 15 -22 -22 14 2 -35
4596 -35 -8 2 -16 -29 -16 -3 -15 -12 5 7 -2 7 6 -1 1 2 5 4 20 13 -5 0 23 8 -10 12 28 10 -11 14 26 -1 -15 25 20 -16 0
4633 0 27 8 -25 -6 13 -5 -26 -5 6 -19 -28 13 0 -15 -7 -4 -6 -25 -4 11 -6 -1 4 7 -4 3 17 7 13 11 12 3 16 28 6 2 25
4670 25 25 -5 9 25 16 -16 7 5 -12 -28 -9 2 -17 -16 19 14 -22 -4 18 1 -16 3 6 -24 -13 2 4 -14 -5 15 5 -3 11 17 2
4705 2 -7 7 8 3 12 21 21 7 25 14 8 12 21 13 7 10 4 -20 6 14 17 -12 10 30 0 -8 11 10 -2 -19 4 15 -27 -21 2 2 -8 3 11 -5 -4
4746 -4 -2 2 -10 -14 -4 -17 -19 -9 0 -7 7 12 2 0 10 24 2 10 18 19 13 26 27 27 20 19 25 11 -5 4 1 -19 -9 -2 -13 -34 -15 4 -25 -26 -5
4787 -5 1 -30 -15 6 -10 -21 -15 2 2 -11 4 11 10 4 11 3 8 13 5 13 3 4 4 -8 14 13 -8 -19 15 7 -22 -6 11 1 -22 3 27 1 -8
4826 -8 14 30 4 -14 -5 -4 -13 -13 -15 -15 -17 -21 -12 -5 -14 -3 -9 -13 -15 0 -9 2 9 1 -5 13 8 -3 6 29 26 8 1 15 21 -4 0 14 0 -3 18 -4 -10 -1
4870 -1 23 6 -7 3 17 4 -8 -8 -6 -3 -11 -3 -9 -13 -9 -7 -3 2 -1 0 -8 7 -5 -10 -1 18 -4 -18 3 9 3 2 17 20 1 2 25 31 10 4 26 24 -5
4913 -5 16 14 12 5 18 17 14 3 -9 -6 -8 0 -18 -16 -3 4 -3 -13 2 5 -14 -12 5 -9 -30 -4 5 -18 -21 10 16 6 7 31 23 7 11 10 9 -2 8
4954 8 -1 -1 15 33 20 15 19 17 -3 -8 -4 -12 -34 -17 -13 -15 -21 -1 5 8 0 10 -7 -19 -11 -6 -26 -33 -13 -6 -14 0 31 20 1 12 28 -10 -28 -4
4994 -4 1 -22 -22 13 17 3 8 27 19 20 30 21 7 5 16 -4 -9 14 18 -6 9 36 12 -14 5 2 -20 -25 -10 -13 -33 -29 8 -1 -2 -3 15 -1 2 4
5034 4 1 -13 -17 5 2 -9 0 11 12 13 17 22 8 6 11 -9 -11 5 2 -5 -1 12 19 16 16 12 13 1 10 6 -12 -5 4 -2 -5 21 22 -10 -18 3 6 -23 -25 0 -12
5079 -12 -32 -19 -3 -14 -15 3 8 -12 0 13 15 10 4 6 3 11 5 11 10 21 2 12 -1 22 13 1 7 20 12 4 14 9 -4 -3 2 4 -3 -3 -3 6 -14 -10
5121 -10 9 -2 -18 -8 -15 -17 -21 -10 -6 -8 -1 14 2 5 19 10 5 0 8 9 -9 -2 10 7 30 27 14 17 23 24 9 7 12 2 -13 -12 -2 -11 -5 9 11 -6
5163 -6 -6 21 10 -15 -4 -7 -4 -9 -16 -2 -7 -5 2 13 9 12 0 -6 0 -13 -9 -22 5 1 6 0 18 22 2 37 26 13 6 10 4 -2 -10 2 15 13 13 13 19 11
5207 11 6 4 -5 -13 -16 -22 -28 -6 -6 -9 1 6 13 12 -5 -1 0 -23 -16 -14 -21 -10 -3 -1 3 17 27 26 12 14 15 -1 -5 -5 3 0 7 31 15 28 43 35 26 -2 14
5252 14 6 -2 -12 -9 -7 -4 2 4 2 6 -13 1 -2 -8 -19 -16 -21 -19 -10 -23 6 5 11 -1 18 10 -1 5 6 -5 -9 0 6 -5 6 13 12 3 4 15 13 8 8 -1 5 -9
5298 -9 4 15 1 0 4 12 18 5 -3 14 4 -18 -25 -5 -19 -15 -4 -12 -14 -5 0 -4 2 -4 -14 -17 0 -10 -9 5 3 3 2 11 14 14 9 7 21 19 18 24 21 4 3
5343 3 17 2 5 3 6 5 1 -3 10 -6 5 -1 6 -12 0 -3 -6 -4 -2 -6 -6 8 4 -1 -7 -4 0 -2 -7 -8 -3 0 -8 10 11 9 19 24 6 6 15 6 1 7 19 18 12 13 20
5392 20 4 21 21 12 0 -4 3 -17 -19 -12 -5 -1 -4 1 1 4 9 9 8 -10 -3 -10 -14 -20 -10 -8 -14 -2 12 -1 -2 28 20 7 -1 7 -11 -13 3 12 6 17 22 23 24 20
5438 20 26 18 4 -9 3 -17 -19 -6 -5 -5 -6 12 5 2 8 -8 -16 -17 -14 -15 -23 -21 -5 -10 -10 11 9 0 9 13 0 -7 -3 7 1 -6 3 8 10 19 26 13 5 19 6 8
5484 8 8 7 -4 0 -3 8 -1 10 20 17 -1 -1 16 -1 -6 -2 -11 -14 -10 -5 -1 -14 -19 -4 -1 -9 -6 -8 -8 -1 1 3 -10 2 6 2 13 9 11 0 4 5 9 1 8 9 -4
5531 -4 12 12 9 7 8 21 7 -2 4 10 -2 -6 -5 -7 -4 -9 3 -11 3 8 -4 -4 0 0 -8 -14 -12 -14 -10 -8 -9 0 -13 2 14 9 -3 7 8 -12 2 12 5 12 16
5576 16 14 15 18 24 11 14 14 5 2 2 2 2 -11 -2 -3 1 -16 -1 -5 -13 -7 -6 -10 -11 -2 -15 -12 -11 -11 -16 -18 3 1 -9 -12 1 4 -9 1 9 3 -5 10 20 11 -1 18
5623 18 13 7 13 10 10 11 2 14 13 0 4 8 -5 -13 6 1 -12 -6 -2 -11 -14 -10 -12 -7 -10 -18 -6 -14 -12 -6 -5 -5 0 6 -2 4 0 -1 -19 6 6 -13 1 3 -5 1 20 13 9
5672 9 2 10 14 7 1 -2 29 14 12 10 17 9 1 -10 -2 -10 -11 -16 -4 -3 -15 -11 -22 -5 -1 1 -3 -1 -13 0 -8 -4 -7 -9 -3 -2 4 -2 7 -3 -2 6 10 1 1 17 3 15
5720 15 0 11 3 14 12 12 15 8 27 11 -2 3 7 7 -1 -6 6 4 -5 3 1 -10 -11 -12 -6 -19 -19 -21 0 -8 -7 -10 -14 4 1 -2 -10 6 6 0 4 -1 16 14 16 17 1
5767 1 6 7 8 13 4 4 16 -1 13 2 0 -1 2 -2 -2 12 13 6 -4 -3 -1 -3 -6 -6 -9 -1 -12 -15 -18 -4 -26 -15 -8 -16 -16 -7 -7 7 4 -1 1 11 20 5 13 0 20
5814 20 7 15 24 17 14 7 24 10 11 16 15 15 6 -1 10 5 -9 -5 0 -10 4 3 -17 1 -4 -6 1 -4 -7 -5 -1 -8 4 -8 -13 -11 -3 -9 -2 0 8 4 -4 11 9 10 18 13
5862 13 19 22 16 12 17 15 11 20 15 17 0 10 7 0 5 -4 2 1 -4 5 -4 -5 -9 -3 -3 -10 -12 -6 -7 -9 -6 1 -2 -13 5 1 3 6 4 -1 7 7 -6 3 3 8 3 9 12 11 11 1 6 19
5916 19 18 7 7 25 4 5 8 9 -8 11 14 -1 -1 -7 -12 -12 -10 -9 -16 -15 -20 -13 -15 -6 -8 -1 -6 -4 1 5 2 -2 7 10 7 7 10 5 8 1 3 9 0 10 10 17 7 3 15 14 20
5967 20 7 7 2 12 8 9 12 0 2 -5 2 3 -10 1 5 -5 -8 -4 -6 -9 -7 -9 -10 -14 0 -2 3 12 -4 7 7 11 1 8 17 21 15 13 6 12 8 6 13 4 9 -3 9 4
6015 4 11 -1 1 -6 12 4 -16 -11 2 -2 -4 -9 0 5 -9 -7 5 6 -12 -9 -14 -6 -17 -10 -7 0 -6 -5 2 6 1 -4 12 0 15 26 18 19 14 18 13 16 15 13 25 13 10
6062 10 12 14 5 16 -8 6 4 -6 3 -5 3 7 -2 11 -2 4 2 3 -13 -8 -8 0 -7 0 0 -1 -1 -10 -1 7 0 -1 12 2 12 8 13 8 16 19 15 7 11 18 15 5 18 8
6110 8 16 2 16 19 3 8 -14 4 4 -19 5 -13 -15 -15 0 -11 -7 -4 -11 -8 0 -3 -7 -5 0 -18 1 -5 9 4 11 10 0 5 10 10 19 15 8 24 7 16 16 -1
6154 -1 5 8 13 14 17 4 4 8 11 7 7 9 1 2 -20 -3 -11 3 -4 -7 -9 -2 -11 -6 -9 -3 6 -6 -4 8 -7 8 -3 -5 1 6 13 -1 15 7 7 21 7 13 7 14 10 8
6202 8 5 8 5 1 11 10 10 16 13 -6 3 13 -2 3 -1 4 -7 3 -12 -13 -8 -17 -17 -10 -11 -16 -18 -20 -10 -9 -6 0 -1 4 -5 2 7 18 -2 11 8 15 -3 9 17 11 6 4
6250 4 6 9 8 4 13 10 6 1 10 -1 -3 -5 2 -4 3 -13 3 -15 -9 0 -4 -4 -1 -15 -16 -11 -14 -17 -19 5 -12 -4 0 0 -2 6 10 2 4 0 3 6 11 15 5 9 6 1 10 6 18 9
6302 9 14 0 2 4 -9 -2 -3 3 -14 -9 -18 -12 -8 -3 -7 -9 -4 -15 -16 -21 -5 -1 -14 -5 -4 -8 -13 -8 -6 -16 -4 -9 8 -5 3 1 9 10 6 11 -2 7 -4 3 0 15 17 9
6350 9 9 4 6 -3 -8 -11 -14 -11 -12 -20 -16 -7 -3 -25 -7 -11 -18 -13 -11 -16 -26 -8 -14 -10 -5 -1 -15 0 -5 -7 -6 4 4 6 4 14 0 -2 0 8 9 5 5 2 6 12 12 10 7 2 -2 6
6402 6 5 10 8 6 -5 -7 -13 -11 -10 -16 -22 -22 -15 -13 -14 -12 -7 -7 -3 -4 1 -2 -2 8 0 9 0 -11 9 4 13 -4 3 10 11 10 7 7 14 13 8 11 13 16 5 7 9 0 -8 -4 4 0 -5 -9 0
6457 0 -6 -7 -5 -12 -14 -17 -13 -4 -8 -5 -8 -9 -17 -2 -8 -22 -2 -13 -7 5 5 6 3 8 14 8 13 9 15 6 -1 20 3 4 7 -2 4 0 -3 -5 4 -1 1 -9 -12 0 -4 -12 -10 2 -9
6508 -9 -6 -9 -9 -11 -9 1 1 0 -18 2 -11 -8 -7 -1 -10 -7 5 -1 5 12 5 4 12 7 17 8 11 8 10 22 4 7 7 1 5 12 -4 -3 -5 -2 -10 -1 -16 -8 -11 -16 -12 -7 -4 -2 3
6559 3 -4 -4 -15 -2 -7 -8 -6 -12 1 0 5 -8 -4 3 5 8 1 -6 9 14 16 7 4 15 7 19 10 16 11 19 11 13 14 8 1 -2 -9 -7 -6 -15 -11 -12 -6 -6 -15 -9 2 -8 -5 -9 -3 -4
6611 -4 -4 -6 -9 -2 -6 -3 9 3 5 -2 4 -1 -1 3 0 11 5 5 3 14 20 12 7 3 5 0 5 -4 1 5 8 -5 1 5 -3 -13 -2 -7 -12 -13 -9 -14 -8 -23 -5 -17 -23 -5 -5 -4 -2
6662 -2 -3 -3 2 -10 1 -11 0 8 13 3 5 8 -3 -4 18 8 -2 8 14 9 2 3 6 9 6 9 9 11 10 2 -2 -2 4 1 7 -7 -6 -1 -6 -11 0 -7 -5 -9 -6 -4 -9 -12 -5
6711 -5 -1 -5 -6 0 7 -6 11 1 8 10 6 8 17 12 12 13 17 8 6 2 4 -8 1 4 9 8 12 10 3 3 0 2 -2 -8 -8 3 -19 -7 -10 -12 5 -2 -4 -4 -10 -11 -12 -20 -4 -3 -14
6762 -14 5 7 -2 -4 11 16 4 14 11 12 16 13 14 22 3 9 24 18 10 14 3 -1 -3 3 -5 3 -13 -8 4 -14 -14 0 -5 -2 -5 -15 -6 -11 -8 -13 -1 -9 8 -1 -4 7
6808 7 6 -5 2 6 0 -1 13 13 -2 5 19 11 -4 8 4 6 -7 14 2 4 4 12 13 3 0 12 10 -14 3 1 -7 -11 -10 -6 -16 -18 -8 -6 -9 -15 1 -8 -8 -8 -10
6853 -10 -5 1 0 -1 -3 7 0 10 6 16 -2 -6 16 19 5 3 10 19 16 11 4 9 3 10 17 8 2 3 7 8 -2 2 7 0 2 -6 -6 -12 -7 -14 -10 -1 -14 1 -1 -3 3 0 -7 1 -7
6904 -7 -11 -4 -7 -6 -3 12 13 7 4 10 13 1 7 23 2 10 12 8 4 8 12 17 9 10 6 7 0 7 -5 -6 -4 -4 -9 -5 -5 0 -6 -6 -4 3 -10 -10 -12 -5 -6 -5 -9 -11 -5 8 3 -3 6 10
6958 10 12 0 14 3 -2 10 21 17 7 12 12 4 5 -3 12 -5 10 10 3 3 -5 8 -14 -8 -4 -4 -11 -7 -2 -6 -6 1 -4 -10 -11 -11 -13 -6 -11 -7 -14 -13 3 6 1 -1 2 12
7006 12 -2 20 22 3 10 8 14 13 8 16 21 20 14 3 18 4 7 -11 -3 -1 -2 2 -3 -7 5 5 -11 5 -17 -9 -3 2 -3 -8 2 -4 -2 -5 -3 -2 -11 -6 -9 -2 -6 5 -10
7053 -10 -10 -3 7 0 5 1 14 9 2 2 6 10 4 18 11 12 3 17 14 6 -7 -2 -3 -12 -10 -11 -1 -6 -18 -2 -5 0 -3 -7 5 -4 -7 -10 -8 -1 -18 -1 7 4 5 -2 11 -3
7101 -3 4 0 0 7 11 15 6 6 7 1 15 21 10 3 10 6 7 1 5 3 2 -1 0 -1 -11 0 1 -15 -9 -1 -15 -13 -6 -12 -9 -9 -8 -20 -11 0 -4 -7 -5 -3 -7 -5 -2 9 -4 4 0
7152 0 3 5 1 5 9 2 8 12 13 1 9 4 6 5 6 8 0 5 3 -2 -8 -1 0 -5 6 2 -7 -4 -9 -10 -12 -10 -11 -18 -14 -13 -15 -3 -18 7 -5 -13 5 8 1 13 1 13 11 2 20
7203 20 11 10 6 9 11 2 8 -2 -4 3 4 -2 5 7 11 4 1 -4 -9 -2 -5 -15 -18 -1 -4 2 -13 -6 -6 -3 1 -15 -10 -9 -4 -12 -11 -12 -1 0 -6 -3 0 11 6 12 12 14 15 9 12 -3
7255 -3 12 14 5 14 14 7 6 5 6 2 4 5 -8 -17 -12 -10 -9 -18 -13 -10 -11 -6 3 -7 -5 -7 -4 -2 -12 -18 -10 -3 -10 5 1 2 -1 0 1 6 2 8 5 8 -2 5 12 3 10 3 5 4 6 4 1
7310 1 7 4 -9 2 -11 -6 -7 -5 -3 -13 -7 -12 -8 -16 -17 -24 -17 -2 -12 -15 5 3 -7 -10 -2 9 2 -1 7 6 -2 1 15 -2 11 6 12 -5 0 8 14 8 1 -3 6 0 -7 14
7358 14 11 -4 7 6 2 3 3 11 -7 -13 -11 0 -12 2 -18 -14 -5 -13 -10 -10 -7 -8 -4 -2 -3 2 3 10 10 5 1 16 16 22 10 5 22 22 8 15 13 4 6 14 15 11 3 17
7406 17 9 3 10 4 4 10 -3 -4 -10 -6 -8 -2 -2 -1 -7 -14 -6 -10 -6 -8 -10 -13 -3 -5 -1 -10 -10 -4 -1 6 5 0 0 7 9 20 9 6 4 16 11 8 9 3 -1 -1 0 -4 -8 -6 -3 -15 -8 -14
7460 -14 -1 -5 -7 -19 -3 -4 -11 -7 -12 -11 -14 3 -4 -2 -12 4 -1 -5 2 -10 2 -11 3 -12 3 6 4 1 6 12 14 8 27 13 16 16 14 12 8 3 0 2 4 -1 -5 11
7506 11 -2 -2 2 -8 -10 -11 -8 -15 -17 -16 -16 -6 -10 -8 -10 2 4 -4 -2 3 5 -14 -8 1 6 7 7 11 14 12 11 12 5 4 -1 -7 10 7 5 0 7 -6 4 8 10 8 11 -4 5 -1 -4
7557 -4 -6 -7 1 -18 -18 -8 -16 -10 -10 -7 -12 -5 -4 -3 -1 -6 1 -14 -9 3 2 7 10 6 -2 1 12 8 5 7 6 0 7 5 12 12 11 18 5 5 -9 10 11 3 -9 -2 -13 3 0 -12
7607 -12 -4 -11 -4 -7 -14 -4 -10 -11 -11 -11 -14 -3 -3 -8 -6 -8 8 10 -9 14 -4 12 12 18 9 13 18 14 18 23 -3 3 9 9 12 4 7 5 10 6 0 1 11 -4 2 -5 -1 4 -5 -3
7657 -3 -8 -2 2 -12 -5 -6 -18 6 -10 -8 -7 -4 -3 3 0 -6 -1 8 2 16 10 14 7 24 20 14 19 15 22 9 9 15 10 18 1 6 7 10 6 2 7 -2 -5 -4 1 -10 -11 -7 -12 -7 -3 -7
7709 -7 0 -6 1 -8 -1 -6 -2 -2 -1 0 -10 11 3 8 3 5 0 9 6 14 21 9 15 25 9 18 19 16 7 9 18 23 6 2 8 3 -2 -5 -2 -12 0 -8 3 -13 -12 -5 -5 -1 -1 -6 -4
7760 -4 6 -14 -6 -8 -6 -5 1 5 19 10 9 10 8 6 18 16 6 20 18 12 27 18 15 13 24 14 10 8 -12 1 13 4 15 6 3 9 -3 -4 -3 -7 -3 -10 0 -6 -6 -6
7806 -6 -17 -9 -6 1 1 -5 5 9 11 15 13 12 21 14 4 11 14 18 17 14 8 25 14 11 8 19 16 17 11 12 7 10 10 9 16 6 0 7 -8 -6 -7 -5 -1 -5 -13 -6 -4 -8 -6 -4 -2 -7 -8
7859 -8 2 -11 -13 3 8 10 3 7 15 3 9 10 3 7 12 17 5 6 4 9 8 -5 -8 1 4 7 -6 1 -9 1 4 1 -3 -6 1 2 -9 0 -1 -9 -6 1 -17 -10 1 -14 -8 -8
7907 -8 -4 -14 2 -2 4 0 -3 -2 9 6 1 19 20 10 7 14 15 -1 14 17 3 4 3 5 -2 -8 -3 1 3 -13 3 1 -7 -8 -10 -7 -12 -11 -19 -18 -17 -2 -14 -15 -13 -10 -18 -10 -7
7956 -7 -7 1 -12 4 -10 3 -3 -6 0 -3 12 6 14 6 16 15 15 14 5 14 6 0 -6 4 1 1 3 0 4 10 -4 -9 -8 -10 -16 -9 -16 -15 -29 -6 -11 -9 -9 -7 0 -6 -1 -3 2 4 -3
8007 -3 2 -10 -1 15 -2 4 1 14 9 6 8 10 6 0 -2 10 19 17 12 10 6 -4 16 -7 0 -2 8 4 -9 -7 -9 -10 -4 -13 -8 -11 -6 -4 -6 -9 -19 -9 -4 -2 -1 1 -1 9
8055 9 6 7 2 9 -4 1 7 11 5 4 11 7 11 3 6 10 7 9 9 7 0 6 9 5 -6 6 1 3 -11 -18 -4 -2 -18 -10 -6 0 -9 -5 -11 -9 -10 -25 -6 -8 -2 -9 -2 5 -10 7 7
8106 7 4 -5 -2 10 13 2 -5 12 3 13 10 11 4 14 2 7 7 -4 5 3 0 -4 -1 -1 -2 -8 -5 -13 -12 -13 -7 -16 -8 -4 -3 0 -20 -10 -8 -14 -7 -1 -4 5 2 -2 3 7 11 1 5
8157 5 7 17 14 15 23 11 11 15 2 5 17 2 5 9 0 -2 2 1 1 1 -7 -11 -8 -8 -7 -9 -15 -9 -19 -17 -14 -15 -16 -7
8191g
##END NTUPLES=NMR FID
##END=
