##TITLE=1H_LY-NiMg-Hex-120
 CDCl3, 8 sc, 
 7.2.2019
##JCAMPDX= 6.0         $$ Bruker NMR JCAMP-DX V2.0
##DATA TYPE= NMR FID
##DATA CLASS= NTUPLES
##ORIGIN= UXNMR, Bruker Analytische Messtechnik GmbH
##OWNER= root
$$ XWIN-NMR		Version 3.5
$$ Thu Feb  7 16:35:19 2019 Russian Standard Time (UT+4h)  she@DPX200
##.OBSERVE FREQUENCY= 200.1313
##.OBSERVE NUCLEUS= ^1H
##.DELAY= (6, 6)
##.ACQUISITION MODE= SIMULTANEOUS
##.ACQUISITION SCHEME= undefined
##.AVERAGES= 8
##.DIGITISER RES= 18
##SPECTROMETER/DATA SYSTEM= spect
##.PULSE SEQUENCE= zg30
##.SOLVENT NAME= CDCl3
##.SHIFT REFERENCE= (INTERNAL, CDCl3, 0, 15.7039)
##AUDIT TRAIL= $$ (NUMBER, WHEN, WHO, WHERE, WHAT)
$$ ##TITLE= Audit trail, XWIN-NMR		Version 3.5
$$ ##JCAMPDX= 5.01
$$ ##ORIGIN= Bruker BioSpin GmbH
$$ ##OWNER= she
$$ F:/spectra/data/she/nmr/H-F/1/audita.txt
$$ ##AUDIT TRAIL=  $$ (NUMBER, WHEN, WHO, WHERE, WHAT)
(   1,<2019-02-07 16:34:13.68 +0400>,<she>,<DPX200>,
      <created by zg, POWCHK disabled, PULCHK disabled
       configuration hash MD5:
       00 E9 B6 7A A2 85 ED C7 34 08 36 98 17 FE 4E 26
       data hash MD5: 16K
       56 E8 E3 8A 50 E9 93 4A 54 34 19 F5 BC C4 4A 8D>)
$$ ##END=
$$ 
$$ hash MD5
$$ 0E 8C A4 77 85 CB 81 B7 A5 20 C0 6E C3 27 BC C3
##$RELAX= 
##$RELAX= 
##$RELAX= 
##$RELAX= 
##$RELAX= 
##$RELAX= 
$$ Bruker specific parameters
$$ --------------------------
##$DU= <F:/spectra>
##$EXPNO= 1
##$NAME= <H-F>
##$PROCNO= 1
##$TYPE= <nmr>
##$USER= <she>
##$AMP= (0..31)
100 100 100 100 100 100 100 100 100 100 100 100 100 100 100 100 100 100 
100 100 100 100 100 100 100 100 100 100 100 100 100 100 
##$AQSEQ= 0
##$AQ_mod= 1
##$AUNM= <au_zg>
##$AUTOPOS= <>
##$BF1= 200.13
##$BF2= 200.13
##$BF3= 200.13
##$BF4= 200.13
##$BF5= 200.13
##$BF6= 200.13
##$BF7= 200.13
##$BF8= 200.13
##$BYTORDA= 1
##$CFDGTYP= 0
##$CFRGTYP= 5
##$CHEMSTR= <none>
##$CNST= (0..31)
1 1 145 1 1 1 1 1 1 1 1 1 1 1 1 1 1 1 1 1 1 1 1 1 1 1 1 1 1 1 1 1 
##$CPDPRG= <>
##$CPDPRG1= <>
##$CPDPRG2= <>
##$CPDPRG3= <>
##$CPDPRG4= <mlev>
##$CPDPRG5= <mlev>
##$CPDPRG6= <mlev>
##$CPDPRG7= <mlev>
##$CPDPRG8= <mlev>
##$CPDPRGB= <>
##$CPDPRGT= <>
##$D= (0..31)
0 1.2 0 0 0 0 0 0 0 0 0 0.03 0 0 0 0 0 0 0 0 0 0 0 0 0 0 0 0 0 0 0 0 
##$DATE= 1549542853
##$DBL= (0..7)
120 120 120 120 120 120 120 120 
##$DBP= (0..7)
150 150 150 150 150 150 150 150 
##$DBP07= 0
##$DBPNAM0= <>
##$DBPNAM1= <>
##$DBPNAM2= <>
##$DBPNAM3= <>
##$DBPNAM4= <>
##$DBPNAM5= <>
##$DBPNAM6= <>
##$DBPNAM7= <>
##$DBPOAL= (0..7)
0.5 0.5 0.5 0.5 0.5 0.5 0.5 0.5 
##$DBPOFFS= (0..7)
0 0 0 0 0 0 0 0 
##$DE= 6
##$DECBNUC= <off>
##$DECIM= 32
##$DECNUC= <off>
##$DECSTAT= 4
##$DIGMOD= 1
##$DIGTYP= 9
##$DL= (0..7)
0 120 120 120 120 120 120 120 
##$DP= (0..7)
150 150 150 150 150 150 150 150 
##$DP07= 0
##$DPNAME0= <>
##$DPNAME1= <>
##$DPNAME2= <>
##$DPNAME3= <>
##$DPNAME4= <>
##$DPNAME5= <>
##$DPNAME6= <>
##$DPNAME7= <>
##$DPOAL= (0..7)
0.5 0.5 0.5 0.5 0.5 0.5 0.5 0.5 
##$DPOFFS= (0..7)
0 0 0 0 0 0 0 0 
##$DQDMODE= 0
##$DR= 18
##$DS= 0
##$DSLIST= <SSSSSSSSSSSSSSS>
$$ [...]
##$SUBNAM2= <"">
##$SUBNAM3= <"">
##$SUBNAM4= <"">
##$SUBNAM5= <"">
##$SUBNAM6= <"">
##$SUBNAM7= <"">
##$SUBNAM8= <"">
##$SUBNAM9= <"">
##$SW= 20.0189088683792
##$SWIBOX= (0..15)
0 0 2 0 0 0 0 0 0 0 0 0 0 0 0 0 
##$SW_h= 4006.41025641026
##$TD= 16384
##$TD0= 1
##$TE= 0
##$TE2= 300
##$TE3= 300
##$TEG= 300
##$TL= (0..7)
0 120 120 120 120 120 120 120 
##$TP= (0..7)
150 150 150 150 150 150 150 150 
##$TP07= 0
##$TPNAME0= <>
##$TPNAME1= <>
##$TPNAME2= <>
##$TPNAME3= <>
##$TPNAME4= <>
##$TPNAME5= <>
##$TPNAME6= <>
##$TPNAME7= <>
##$TPOAL= (0..7)
0.5 0.5 0.5 0.5 0.5 0.5 0.5 0.5 
##$TPOFFS= (0..7)
0 0 0 0 0 0 0 0 
##$TUNHIN= 0
##$TUNHOUT= 0
##$TUNXOUT= 0
##$USERA1= <user>
##$USERA2= <user>
##$USERA3= <user>
##$USERA4= <user>
##$USERA5= <user>
##$V9= 5
##$VALIST= <valist>
##$VCLIST= <CCCCCCCCCCCCCCC>
##$VD= 0
##$VDLIST= <DDDDDDDDDDDDDDD>
##$VPLIST= <PPPPPPPPPPPPPPP>
##$VTLIST= <TTTTTTTTTTTTTTT>
##$WBST= 1024
##$WBSW= 4
##$XGAIN= (0..3)
0 0 0 0 
##$XL= 0
##$YL= 0
##$YMAX_a= 128160
##$YMIN_a= -167058
##$ZGOPTNS= <>
##$ZL1= 120
##$ZL2= 120
##$ZL3= 120
##$ZL4= 120
##$ABSF1= 10
##$ABSF2= 0
##$ABSG= 5
##$ABSL= 3
##$ALPHA= 0
##$AQORDER= 0
##$ASSFAC= 0
##$ASSFACI= 0
##$ASSFACX= 0
##$ASSWID= 0
##$AUNMP= <proc_1d>
##$AZFE= 0.1
##$AZFW= 0.1
##$BCFW= 1
##$BC_mod= 2
##$BYTORDP= 1
##$COROFFS= 0
##$CY= 11.3945322036743
##$DATMOD= 1
##$DC= 2
##$DFILT= <>
##$DTYPP= 0
##$F1P= 18.9103706918063
##$F2P= -1.10871071338519
##$FCOR= 0.5
##$FTSIZE= 0
##$FT_mod= 4
##$GAMMA= 1
##$GB= 0.15
##$INTBC= 1
##$INTSCL= 1
##$ISEN= 128
##$LB= 0.24
##$LEV0= 0
##$LPBIN= 0
##$MAXI= 10000
##$MC2= 0
##$MEAN= 0
##$ME_mod= 0
##$MI= 1.114404
##$NCOEF= 0
##$NC_proc= 0
##$NLEV= 6
##$NOISF1= 3.799351
##$NOISF2= 2.8
##$NSP= 1
##$NTH_PI= 0
##$NZP= 0
##$OFFSET= 15.70392
##$PC= 1
##$PHC0= -8747.67
##$PHC1= 3.200193
##$PH_mod= 1
##$PKNL= yes
##$PPARMOD= 0
##$PSCAL= 0
##$PSIGN= 0
##$REVERSE= no
##$SF= 200.130013532006
##$SI= 16384
##$SIGF1= 3
##$SIGF2= 2
##$SINO= 400
##$SIOLD= 16384
##$SREGLST= <1H.CDCl3>
##$SSB= 0
##$STSI= 0
##$STSR= 0
##$SW_p= 3612.71676300578
##$SYMM= 0
##$S_DEV= 0
##$TDeff= 0
##$TDoff= 0
##$TI= <>
##$TILT= no
##$TM1= 0
##$TM2= 0
##$TOPLEV= 0
##$USERP1= <user>
##$USERP2= <user>
##$USERP3= <user>
##$USERP4= <user>
##$USERP5= <user>
##$WDW= 1
##$XDIM= 8192
##$YMAX_p= 0
##$YMIN_p= 0
$$ End of Bruker specific parameters
$$ ---------------------------------
##NTUPLES= NMR FID
##VAR_NAME=  TIME,          FID/REAL,        FID/IMAG
##SYMBOL=    X,             R,               I
##VAR_TYPE=  INDEPENDENT,   DEPENDENT,       DEPENDENT
##VAR_FORM=  AFFN,          ASDF,            ASDF
##VAR_DIM=   8192,          8192,            8192
##UNITS=     SECONDS,       ARBITRARY UNITS, ARBITRARY UNITS
##FACTOR=    0.0002496,     1,               1
##FIRST=     0,             0,               0
##LAST=      2.0444736,     0,               0
##MIN=       0,             -167058,         0
##MAX=       2.0444736,     128160,          0
$$ Real data points
##PAGE= N=1
##DATA TABLE= (X++(R..R)), XYDATA
$$ [...]
564A124o20p268K659R206j234n615M674O054m026l819K634j352n156J653K281
579A195o086k089Q825K302q869K07J0514q96j0190J177P294l924o184M389L158
594H23m798J344P431k375o165O214O865p957o858P779M482q907l735P498J518
609C159n655J396M180l293j651N375j002p614K202P732m340q063N359P420n337
624a32m937O027L034n181J23M427l382l711N914K310q284j211R710J74r987J093
640d013R398k165p784L027N261l987k410M617o65m991L590N091n894m792P436
655A719M040q148k915P923J487o781L44N129k211k975L960M97n595J643O546l568
671A095o924N139O817n836n646O304M051o099k049N315o18m537K849L196n139
$$ y = [1124, 504, -6764, -4105, 5101, 3867, -1748, 2926, 8980, 4954, 1135, 3769, 2417, -2739, -1086, 1195, -4891, -6980, 1845, 4147, -4722, -4515, 5999, 5103, -5087, -3910, 3384, -540, -6724, -2335, 823, -3975, -2631, 4800, 2425, -3740, 2474, 9339, 1382, -5476, 2303, 6785, -2122, -5857, 1641, 3159, -2496, -1100, 3080, -213, -1864, 3511, 2509, -5105, -2903, 4829, 489, -7574, -2215, 5205, -132, -5069, 958, 3992, -1189, -1066, 3361, -21, -3732, 2182, 4492, -3792, -5003, 4707, 4881, -5106, -4013, 5385, 3220, -4564, -1537, 3724, -263, -2673, 1944, 1279, -3712, -122, 4969, -925, -5717, 1719, 5759, -2389, -5304, 2619, 4106, -2675, -2331, 2798, 587, -2388, 1572, 2069, -3526, -1883, 4663, 1095, -5829, -690, 6127, 291, -5355, 949, 5000, -1099, -3148, 2167, 1549, -2988, -139, 3057, -2082]
686b082j912O800P32p696M78P913j468p261K264N859k874l878L395J729l341R53
702c89L590k880k977M834K526n926j833O204N30o278J91M935j875l898K747J839
718A340l966l6M757j738n089L337N190m413m651N195L982n151k379N419J505m132
734h30P49L857j759k530L059J242m420p84M217q49m824J101L918j920l176K111
750h38J767k467o90J943j191k068K198J554l021m45M455P76l568J114M345j040
766B824l290J947K335k837j670K852J71l349Q04L377j774l265K274K420l415k704
782c300K547R75l287p86K594J30j602J335J876r17k64K008L0j954O17J779j197
799E84j466J713J301j419j50J936k07j728O44R36k080j601J542K15k619k54K592
$$ y = [-2082, -3994, 2806, 3538, -4158, -3680, 4233, 2765, -4496, -2232, 3627, 753, -3125, 270, 1999, -1342, -389, 3201, 321, -2656, 2178, 4704, -1222, -3055, 3149, 3679, -2599, -2408, 2527, 652, -3246, -499, 1340, -2626, -2662, 2095, 357, -4732, -1395, 3795, -618, -5269, -74, 3908, -1243, -3622, 1797, 3302, -830, -81, 3776, 2017, -513, 2546, 3788, -632, -1416, 2801, 1952, -2872, -1771, 2147, 227, -2949, -838, 929, -1538, -2228, -285, -1476, -3544, -1346, 208, -2813, -3258, 1197, 1973, -1595, -481, 3864, 2824, -466, 1481, 3816, 979, -691, 2161, 2332, -1017, -213, 3164, 1390, -1875, 399, 2819, -596, -3300, -753, 222, -3065, -3851, -1257, -1127, -2729, -1394, 482, -435, -699, 1309, 1339, -615, 2, 1781, 584, -882, 831, 2132, 713, 563, 2499, 2292, 564, 1208, 2144, 64, -1537, 5, 220, -2399, -2653, -61]
816f1p9k186R43K428r23j843J261J242j610q99J602M41j268N73J765k63q45J060
834A338Q40j201p17P17k64j246N2N79n83k75R78J44q98M17J012q91j198Q65P21
853C90j426o81J559N78j310J92J763n7j341N46J157r59j195Q48O41j176m77J239
871B91L74r77Q3J043j68q47J66L64m82l85K65J1j95L47K69k94J66O35k73o58M26
892A61M62q46n56R08L08j105k3J326q2j240M05J269o94j260P72J005j034q64J110
911B2P20j015l60J117K87r25r8P52r3o59L1L51q9k07K9O6J71J21l11j80N24J55
933D09p92j48R20jj108J96J264l72j245O61J250q72j174J081R75j270q31J381
951C24N98j397l63J395J79j265j5J112j10r18J28O82j10n12J2L51J66k42l57K38
$$ y = [-61, -140, -2326, -1383, 1045, 122, -1721, -460, 782, -828, -1727, -125, 316, -952, -379, 1386, 1123, 278, 1338, 2178, 977, 260, 977, 713, -533, -481, 98, -485, -760, 218, 362, -536, -119, 893, 2, -1196, -331, 390, -1036, -1717, -158, 420, -890, -698, 1065, 1008, -333, 213, 1370, 411, -784, 64, 705, -471, -948, 291, 665, -312, -229, 814, 646, -201, -35, 329, -153, -538, -273, -262, -457, -110, 159, -135, 31, 666, 393, -265, 161, 623, -223, -779, 129, 437, -668, -691, 635, 553, -687, -282, 987, 293, -967, -195, 810, -224, -1088, 22, 742, -273, -633, 484, 771, -154, -252, 500, 407, -252, -221, 130, 41, -166, -137, -71, 100, 221, -90, -270, 254, 409, -383, -531, 389, 388, -720, -524, 740, 368, -877, -216, 1034, 162, -1012, 69, 1044, -226, -1057, 324, 922, -475, -838, 557, 736, -529, -544, 568, 458, -460, -332, 350, 240, -272, -260, 91, 257, 15, -342, -104]
971a04O06k87q46M48J040o71j203R23J289j253j289J523J229j824j036K030P97
988A372k165n01K251J97k211J13K094m12j886N73J648p16j365P25J095o41q19
1005f48M36O41j56n48j63N21M99o08p90Q11J116j076j232J446J283j855j213K204
1023F68R60k616o90K879K55l066K18L165o44l095J113K901j484k603J720K179
1039A860j866j722J864J286j698q24J490N05j127k88P02J72l15l13j25N52M56
1056F09r07o68J444Q29j976p61K482N79l000k91L342j56l586P10L682j248l519
1073b435J840L242k338k826K697K212l030j670L107J022l018m48K813L8k372K94
1089h72J869m21j287L66O82j34j29k09k57P43N73j256o21J804M30k368j80K693
$$ y = [-104, 502, 215, -631, -183, 857, 186, -1017, -94, 1195, -58, -1347, 176, 1405, -419, -1455, 575, 1372, -793, -1294, 957, 1154, -1057, -944, 1150, 738, -1148, -575, 1073, 357, -1008, -283, 812, 171, -648, -212, 429, 273, -275, -438, 83, 582, -26, -816, -5, 1111, 35, -1197, 249, 1532, -323, -1536, 668, 1628, -988, -1678, 1201, 1456, -1610, -1392, 1773, 1129, -1966, -853, 2048, 564, -2039, -319, 1860, -6, -1728, 136, 1422, -276, -1100, 390, 895, -232, -520, 182, 354, 39, -274, -399, 153, 609, -298, -966, 478, 1307, -669, -1430, 1052, 1631, -1369, -1660, 1682, 1526, -2060, -1350, 2332, 1084, -2435, -595, 2647, 309, -2517, 180, 2392, -638, -2308, 799, 1821, -1197, -1645, 1168, 1206, -1166, -872, 997, 576, -711, -345, 337, 203, 74, -135, -392, 351, 924, -332, -953, 851, 1281, -1087, -1267, 1426]
1107A426l85l046J017L165j672l070K426K871l012k481L511J953l890j347L989
1122A455P05l872k6L624n12l115R72K493j323j893J363J132j388n36J119O0o50
1139c92L71J75m39N05M23j122j73J701k56k159Q75K504j392k540K116K455k723
1156g1k221L149J549l686j108L678K47l801M35L587j115l176J731K752k129k107
1172b286K395J509k291p54K266M00j620L11J332m29n61O04j16o67N47K19j320
1189d61q2J457o43j812J046J638j793j595K191J041k808o29L078O2l103Q00L405
1206A792j065k771K017K771k102j992K540J501k592q47K475J72k270K45J750q51
1222G73j484Q16N53j292m57P59m44q03O52K53q83L64J201o27q59J488R95j637
$$ y = [1426, 1041, -2005, -988, 2177, 505, -2565, -139, 2732, -280, -2761, 750, 2703, -1187, -2534, 1455, 2160, -1712, -1738, 1886, 1374, -1741, -769, 1724, 401, -1492, -129, 1003, -385, -921, 198, 258, -392, -21, 154, -285, 220, 643, -479, -652, 1049, 793, -1366, -491, 2013, 621, -1919, 197, 2652, -71, -2292, 857, 2406, -1280, -2388, 1290, 1537, -2264, -1829, 1758, 643, -2533, -802, 1950, -179, -2286, 109, 1618, -673, -1427, 839, 1239, -381, -70, 1262, 833, 272, 876, 760, 93, 640, 859, -461, -543, 914, 271, -1541, -495, 1143, -650, -2245, -54, 987, -1821, -2450, 628, 690, -2413, -1613, 1792, 727, -2044, -27, 2744, 642, -1350, 1190, 2691, 99, -748, 1727, 1899, -371, -126, 1624, 773, -711, 105, 658, -634, -1091, -332, -776, -1579, -927, -674, -1557, -1193, 8, -619, -1478, 10, 1005, -632]
1240f32l65K273K27k199N70K511q12k194J439J977j902j740J970R01k555q18K145
1257G96j32k384L23J920q80j674J088J210j247p03J306L39j002L30J017l21k84
1274b98R56K40p21M69Q81p87o98J050K95j472j28J418m98j619P15J299j316j294
1292a508J414P53j842n50J827R4j780L96J821n52j324J083J235j064o78J299L73
1309I97j182N7J101l68q59O38N62q17l11P98j82q95L14N77p58m94Q73J45r87J98
1329e93J054m31r12P77Q06r75n27J148K91j185R7J220l25j063O56Q95q78o74R58
1348C39L35j109j02J002k19r10M62P45n98m88P64K43p94L3P50k78o30M96M69o19
1368a09k29P09J4p20J93O22m68n54N89L05p43j34P92q5p78L55P30n08n59O80M19
$$ y = [-632, -997, 1276, 1503, -696, -126, 2385, 1573, -621, 818, 2795, 893, -847, 1123, 2024, -531, -1349, 796, 664, -1720, -1397, 523, -357, -2031, -943, 267, -980, -1683, -377, -38, -1040, -710, 307, -14, -298, 658, 898, 177, 646, 1527, 740, 42, 1092, 1387, -85, -213, 1205, 707, -912, -197, 1102, -214, -1508, -94, 659, -1183, -1733, 94, 188, -1592, -1196, 625, 73, -1251, -168, 1067, 3, -675, 624, 997, -185, -128, 973, 605, -254, 384, 946, 129, -182, 616, 434, -461, -147, 430, -328, -822, 51, 196, -791, -593, 461, 30, -882, -105, 701, -274, -801, 347, 638, -547, -450, 770, 445, -618, 38, 933, 55, -619, 339, 674, -435, -537, 465, 246, -664, -202, 543, -55, -543, 221, 464, -330, -297, 453, 175, -455, 41, 510, -109, -338, 371, 385, -335, -142, 480, 12, -542, 47, 352, -391, -525, 267, 182, -596, -241, 489, -19, -578, 102, 521]
1389E21p66j64Q24l2p77K68P33m08n92N70M17o82k58O59J0o71J18N42l01m35L97
1410b7K58m72p0M76j08m15K74L10l71j53M81K0m74J96M75l41m00N09K86o29j58
1431c33O86k3p28J71O85l56n95M77M80n82l19O07J74o20jN83j38m93K48M00l32
1452ik38L46J05l42M2K76j76j89K54O2l27P0L35j97k95L26K43m23j43M94J9n25
1474b92J16N23k70m63L99L69m54k56N19J49n30k5M94j21m42K09L16l00k10L42
1494G3P7l37O7L18j76k51K81J35l37l7L50p7l30K19K92l15j88L95R6m19j0M23
1516B49j15m17J98L41k87k52L55J34l34oL17r1k74J80J72k63q5K85j2k88J43K76
1538B26k62j60L39Q6m10K4M32j68m32K81L78l86k79M57J98m93q6N03n9m63J26
$$ y = [521, -245, -409, 415, 383, -394, -126, 607, 199, -393, 177, 594, -88, -346, 313, 323, -348, -230, 312, 11, -424, -27, 231, -241, -311, 165, 57, -358, -84, 226, -145, -298, 183, 203, -271, -75, 400, 59, -341, 168, 454, -175, -333, 353, 330, -398, -227, 458, 102, -493, -16, 464, -118, -437, 170, 344, -276, -277, 306, 168, -325, -77, 323, -9, -247, 99, 204, -138, -96, 180, 4, -185, 69, 131, -196, -126, 209, 12, -283, 43, 286, -137, -280, 214, 233, -292, -176, 347, 77, -386, 13, 382, -72, -328, 191, 340, -190, -215, 279, 158, -284, -75, 241, -59, -269, 73, 150, -187, -120, 198, 22, -229, 52, 187, -150, -187, 163, 86, -244, -25, 267, -48, -236, 159, 255, -164, -174, 249, 134, -283, -85, 256, -31, -283, 72, 206, -128, -134, 183, 92, -182, -2, 170, -93, -178, 107, 95, -193, -50, 226, -36, -196, 143, 229, -181, -157, 275, 107, -325, -44, 334, -52, -331, 126, 324, -169, -255, 248, 189, -274, -148]
1559a48M20k53l19L02K25l25q9L23pk70J06J74j67r6K18l9k27J55J87k46j26L54
1581A52M4m15Q2M29j97m22L20L69m15l18N34J87n93m5N88q7n63K14M98l07m39
1602c84M00L10m26j70M32L0l91P7L18j65k36K36J17k58J4K36j25j88K34R7l27
1623a69J7L78j57l63K96L54l94k75N07J62n73o7O12j01o23K34N61l77m69M68L77
1644C98n30k32N56R7n72L3M85j45m16K54K99k89j36L42M4k91J20K34k23j54K76
1665A50%l36J20L06k43k72L81J88m86o7N12r6n93J94N50l81m94M95M38n38k55
1686d27O68J74o45K8O29j50n81K52M65l56l50M18K33m10q7L82m4l39J04J69k49
1707a16j18K22o5k38J71K12k59r1L99M3m28J25M51k58m26M00L83m81k51O28J77
$$ y = [-148, 272, 19, -300, 2, 227, -98, -187, 136, 129, -141, -35, 139, -28, -124, 94, 55, -172, -17, 170, -76, -202, 152, 196, -219, -137, 292, 95, -327, -7, 362, -53, -371, 163, 350, -243, -288, 300, 213, -350, -136, 362, 55, -384, 16, 326, -100, -270, 162, 192, -199, -122, 196, 31, -205, 31, 148, -110, -96, 140, 15, -173, 61, 158, -169, -152, 226, 69, -294, 2, 356, -38, -313, 194, 356, -217, -284, 328, 227, -396, -162, 399, 22, -447, 21, 398, -132, -364, 192, 289, -283, -250, 235, 90, -326, -72, 227, -62, -198, 144, 188, -103, 17, 251, 28, -126, 150, 150, -186, -66, 240, -3, -275, 106, 294, -192, -259, 253, 157, -436, -242, 308, -73, -567, -72, 366, -172, -427, 241, 415, -230, -202, 427, 277, -304, -52, 413, 57, -293, 125, 358, -52, -139, 243, 199, -140, -36, 133, -116, -234, -12, -77, -315, -144, 68, -191, -282, 117, 160, -268, -143, 308, 50, -376, 24, 407, -74, -325, 303, 480]
1728D80o28LO66j46o72K18N36m18m99M33L22n10k06N08R2m47L0M14j53l23K01
1749i9K01k49o4K58k6j41J83J47k07pL06j20l25J96K67l55k45M25J25m84n1N63
1771B98q6n71K11N12l50m78M14L69n13k55N51J73n25pN51p2m41J86L60k72k54
1792a99K73J24k93l0K61o9k12J60J22j94k5K15j02k25J88J67k90j03L69J6l79
1813b26R0M23j81l84K75L39l74k64M32J53m71o0M70o0m44J54M12k35l37K99K65
1834B76l36j38L27M9l13M4K42j37j86J82R9k06J0K16o6j89J45J61k40q7K48l4
1856F7k73J06K59j90j95K93J89l10r3L66Mm00M7L38j61l27K29K40k62j38L15R3
1878A97l10jK90j19k67J13J92j93j30K39R7j89O0K23o3j53J45Q0k21n4J77o0k35
$$ y = [480, -148, -145, 521, 375, -297, -79, 457, 39, -460, -27, 295, -215, -421, 87, 179, -268, -238, 176, 23, -300, -99, 102, -147, -211, 47, 21, -120, 63, 210, 3, -4, 302, 182, -143, 53, 320, -35, -280, 145, 270, -214, -265, 298, 212, -359, -148, 364, 14, -464, -50, 319, -194, -449, 102, 275, -250, -257, 294, 222, -219, -33, 327, 55, -199, 74, 198, -95, -125, 136, 67, -145, 15, 137, -57, -82, 133, 31, -194, -6, 161, -129, -232, 137, 153, -226, -136, 287, 106, -278, -3, 336, -38, -302, 130, 283, -188, -248, 222, 162, -282, -128, 284, 49, -288, 11, 276, -60, -198, 129, 178, -135, -91, 151, 14, -172, 10, 109, -97, -87, 129, 63, -126, 19, 180, -60, -147, 101, 67, -206, -100, 159, -31, -226, 67, 256, -54, -147, 219, 223, -177, -130, 208, 47, -280, -51, 189, -73, -211, 104, 197, -113, -114, 176, 57, -210, -97, 95, -98, -228, 11, 108, -81, -21, 202, 139, -14, 131, 211, -10, -64, 113, 53, -182]
1901a82J28J84j62j12K46Q1k74k0K35j17k96J11K07k13j58L02J53k19QL27jk58
1923c0J05K08j94k07J81J02k04l7K60oj82R6J57j79j51J09j5k50l4J63r0j53J85
1946a66J86j31k8K45L3k06L0J83j10k18J67J55j50m6K62Q5j78L5K00j16k41O8
1968E9M8k14j27J54%j56P4K10o6j07J51Q1k02p0J57m5k01R9J81p1n7K38J41j86
1992I1KK11p3k47K9J40j78j72J60J04j40k9K04J0j53L6R2j19j28P4K5j31J7J45
2016c0ln1J37J01r5k2J22o0j59M4J07j23j29J88R1j77j2K21j9j99K8J72j34j92
2040a94J30J24j59p4K02O1j56J9J79n8j33N7P4q2o2P9J9o9M3M5m6k0P7l4q8N7
2066iP3r9n5J45K9j52J4J86r3j78J09J59j52j44K05J30k07n4K23J3k19PJ70q2
$$ y = [-182, -54, 130, -32, -144, 102, 183, -91, -111, 124, 7, -289, -178, 29, -184, -342, -40, 113, -106, -98, 229, 228, -30, 75, 283, 89, -118, 63, 165, -39, -76, 184, 178, -4, 92, 249, 70, -81, 28, 13, -237, -271, -108, -198, -351, -166, 20, -111, -139, 106, 139, -67, -37, 146, 36, -182, -15, 140, -10, -56, 206, 291, 113, 148, 348, 232, -9, 59, 107, -107, -234, -80, -80, -236, -162, 48, -18, -125, 26, 107, -95, -165, -8, -53, -254, -155, 26, -45, -102, 136, 277, 91, 93, 304, 231, -16, 13, 153, -25, -197, -37, 67, -73, -102, 102, 112, -41, -5, 87, -32, -160, -86, -61, -192, -175, -30, -33, -84, 53, 154, 59, 37, 159, 99, -60, -16, 91, -32, -161, 27, 118, -59, -71, 150, 131, -68, -40, 132, -2, -194, -64, 60, -99, -173, 29, 90, -66, -47, 132, 74, -59, -2, 72, -10, -72, 7, 26, -43, 0, 45, -1, -21, 56, 22, -66, -9, 64, -35, -90, 55, 84, -68, -54, 132, 39, -139, -30, 129, -23, -167, 38, 168, -39, -93, 130, 143, -76, -69, 101, 19]
2090A9k01R7J30j18n3J41Q3r6J0Q4m5o9J3j9p8J9O8o3J2J61N3j26M3J51j04k05
2116i3O9J15k12j49K28R8j95RL28Mk35N8K16j63k74R6J22j90j04K24J06r8N9J78
2140A97lj16L1lj58o0L3q1m7J25R5o1R2K05o0j68Q6R4k63j86J92O2k70%L60M9
2166A45k35J53L09j49k93J31R9k75k10K29O7k04O8K86L0j22J08J14j40j18K9o5
2188d3j36J3N8n9L7K08J8q8J51J52k33j68J65J9l39m6L26l3k62J71L80j32k43
2211h4K33J97l28k19K41M5l50j4L21Nk27J58K76j25j59J41M8j89q2P6o1o9R3N1
2235b2q8J08J82j06j20J82R0k96r6K52n1l01J18L02j66k10L20K28l40j48L63N7
2257B58m41m6L92p0l94J50L33j35k15K19J62k11n9J91o5k17J01J28j65q7J90M2
$$ y = [19, -182, -85, 45, -73, -126, 15, 98, 2, 12, 96, 51, -18, -5, -24, -102, -83, -15, -78, -66, 95, 148, 22, 65, 216, 112, -93, -24, 91, -121, -270, -42, 56, -139, -130, 198, 202, -33, 25, 241, 78, -196, -100, 22, -168, -272, -48, 58, -40, 19, 197, 194, 78, 109, 106, -52, -112, -79, -160, -207, -82, 13, -48, 44, 249, 189, 21, 107, 201, -62, -248, -56, 6, -264, -264, 96, 145, -90, 63, 372, 223, -70, 61, 160, -115, -325, -96, -29, -233, -165, 121, 151, 29, 137, 251, 111, -7, 22, -43, -179, -166, -108, -167, -130, 78, 96, 8, 159, 311, 78, -90, 75, 94, -245, -291, 35, 2, -260, -89, 291, 159, -84, 149, 346, 18, -201, 40, 85, -265, -279, 42, 47, -180, -22, 254, 129, -30, 111, 159, -30, -112, -36, -97, -166, -73, -22, -110, -2, 180, 74, -46, 136, 226, -70, -166, 86, 35, -266, -148, 154, -12, -222, 98, 326, -14, -162, 201, 258, -183, -229, 163, 93, -301, -151, 182, 47, -168, 51, 213, 2, -57, 134, 69, -148, -47, 81, -84, -171, 19, 61]
2279F1j51N6J51j00p1J73k8k40Q4K49j97k91K93K53l20k02L93J55l72p7L82m3
2301A58l33J17K67k47k10L21J24l46m9L85Ml48O9L08j13k27J34P9j51j7J18j11
2323f8j32K37Q1k72j6L43k7l27J05K71j86k16K26R3k80K2L65j06l21K46L72l07
2345A03l15L50K31m26k17L29Q6l57PK68p6j56K06R6k54JK67j06l32J36K49j76
2367h6j68K50J41j36P8K17j42j22K48Om04m2L73r3m54J43M49j85l29K66K55l30
2389f5j67K66o1l77R3L17k30k33L91L43k71j09M30J08l40n9K24j26j96J07N2j85
2411h8J13K72j28k35K58J69l85k54K51nm17j8K98q4j74L36K49k64j8M42rn00M5
2434a46M37j94m28K55L92j66j74L21J64k59k4J85k23l23J28P4l54j02L36N4k46
$$ y = [61, -90, -34, 117, 17, -54, 119, 91, -149, -65, 184, -13, -304, -11, 242, -78, -280, 113, 268, -104, -181, 201, 158, -175, -58, 209, -38, -248, 73, 197, -149, -198, 187, 191, -157, -88, 220, 107, -120, 14, 93, -58, -75, 43, -68, -200, 37, 118, -154, -170, 173, 146, -181, -76, 195, 9, -207, 19, 112, -168, -146, 219, 113, -208, 38, 410, 103, -212, 138, 369, -57, -274, 55, 141, -216, -209, 59, -17, -173, 33, 129, -125, -124, 143, 37, -295, -159, 90, -86, -254, -4, 137, 1, 79, 296, 154, 32, 280, 286, -118, -160, 213, 120, -334, -191, 258, 73, -256, 10, 265, -65, -232, 34, -27, -404, -311, 6, -224, -457, -66, 277, 6, -103, 327, 435, 95, 36, 260, 134, -62, 45, 97, -88, 25, 297, 169, -66, 192, 361, -24, -278, -27, -32, -449, -467, -169, -253, -427, -91, 158, -106, -124, 318, 309, -191, -146, 291, 97, -331, -76, 316, 150, -24, 297, 461, 202, 178, 363, 140, -183, -55, 19, -335, -437, -101, -47, -293]
2455b93J34K98j06j44J58J7k81K4K25j80k21L59L02k85r9M83J42m49q3L57j33
2476B25m48R2K61k42j99L36J61l30J5L86j04l85R4K69k43k53K23J50j64M0K31
2497A15j7q9J84N9k87JK32j16l35J88K66k33j82L33J23l03m1L15j20l51J69K75
2519A86k98k28L86J93l85o4M26K3m01N7L20j53k70J79J66k05o3K37k4k15J17J53
2541A37j87j16J88N3k11M8K05r2j25J98P9k53qK80r8l36J95L10k50k52L34K17
2563C16l60j33L24J4l73K1K79j58k36K38K15k45o5L21M4l10L5K52j45k13J35J27
2585H3j46kK04l2j27J56J28k35j18J97nl16MK80j02j97K03K05j87q3K59Ml22K0
2609a29K56j71k75K10K39j77j21K87J26k31pJ98j13k16Q6Q4k01l8K33J4j87J27
$$ y = [-293, -159, 139, 33, -111, 47, 64, -217, -193, 32, -148, -369, -10, 292, 7, -92, 391, 533, 84, 1, 358, 225, -223, -131, 130, -112, -311, 25, 186, -144, -129, 257, 153, -232, -138, 131, -112, -365, -142, 8, -156, -116, 115, 98, 9, 193, 252, -35, -34, 198, 82, -253, -65, 201, -32, -214, 119, 242, -61, -102, 213, 93, -258, -89, 186, -112, -340, 46, 239, -146, -210, 216, 239, -162, -105, 215, 62, -208, -29, 137, -68, -131, 106, 82, -133, -16, 137, -50, -166, 22, 75, -136, -88, 117, 25, -100, 98, 177, -76, -84, 196, 98, -238, -43, 267, 17, -235, 99, 316, -44, -177, 147, 161, -212, -191, 88, -70, -306, -68, 147, -98, -163, 158, 202, -108, -73, 179, 34, -179, -44, 83, -63, -65, 139, 107, -20, 136, 264, 29, -89, 108, 103, -213, -209, 71, -31, -228, -25, 180, -7, -90, 169, 173, -149, -129, 127, -44, -319, -109, 130, -47, -168, 119, 245, 14, 7, 205, 92, -124, -38, 46, -155, -193, 40, 54, -133, -6]
2631fK26j31j58J58O0k44m7J91p5j86J54K08j53j30K84J08k87o2K30l7k89M9K01
2654F4j24j41J95J13j66J8K13n5k09Q2J34j64j28J62P0j64K8J85n4j11J48P7k04
2677c1n8K23o8k55Q1K29j36j74K05J46k11n6K55k2k65P9K18j65k03K07J57k32
2699g6q5K44P1k20J7J72o6j40Q5P4j51k3J59n5j38J13J26j33p4J77J4j81M3J49
2723A02j05j31J59R6k26m6K70K1k77O3K85j30k43J57J81k16j41K30O8k62M5K31
2745A31q2j76J30J75j89j16J93N0k16jJ64o8j08J18P3j13j4J63o5j42J02J20k00
2768g1p5K06Qk31O3K47j03j86J97J73k38j34K41M8l00OK66o7k38J39K37j53j61
2791a26K20P9k46l7J96n0j94Q6J41j17n4J66J9j32O1J19j48j05J69J9k32RK58
$$ y = [-6, 220, 89, -69, 89, 149, -95, -142, 49, -26, -212, -58, 150, -3, -133, 151, 259, -28, -90, 140, 103, -186, -137, 64, -60, -201, -6, 107, -59, -41, 172, 117, -92, -10, 124, -40, -168, -6, 64, -100, -72, 113, 59, -52, 96, 173, -31, -89, 134, 66, -189, -108, 121, -15, -189, 16, 162, -49, -105, 150, 128, -137, -58, 160, -5, -208, -1, 156, -76, -161, 83, 154, -66, -49, 123, 57, -83, 2, 76, -75, -98, 61, 6, -132, -19, 107, -26, -100, 77, 91, -90, -47, 102, -3, -134, 25, 121, -105, -151, 119, 140, -137, -74, 211, 81, -162, -5, 176, -40, -181, 49, 117, -145, -100, 131, 49, -127, 3, 178, -11, -127, 66, 116, -100, -101, 63, -5, -113, 5, 78, -35, -49, 114, 49, -93, 9, 129, -71, -146, 60, 68, -163, -100, 147, 44, -142, 55, 228, -10, -144, 97, 145, -155, -149, 117, 50, -188, -49, 188, 35, -126, 94, 173, -73, -110, 86, 36, -158, -72, 69, -48, -102, 64, 83, -49, 12, 131, -17, -122, 47, 66, -166, -157, 101]
2814A01o4j98J68J99j99r9K28K0k72jK43j11k52J71K55j89j80K74J40k76p6K15
2836I7l0k29N7J33j21o8J99O1j83P2J96q8j76R0R3j66o6J60l2j30J56J30j66o8
2860g9K61K2l38j4K88j00l29J12K55j16j71K17J42j93rK37j01k41J25K00k19j75
2882b26K62J48k11k6K28K0j78L9N9j57m9J33q9k22J61K03j80j36K60J30k46q2
2904a59K22k8k20R7J57j69p8K83Q7k55J7L59p3l55Q9K62j74k77J55J64j61l9J72
2927G6m1j30J24J00k31q4K24%k63L2K53n2j49J57J22j53PJ82j00k34J61J87k39
2950e1j91L08J71l13q7L12L6k83J4J89j10j55J52N3j99J9K56o3k16J34K16j69
2972B3j68J65R0j83%J52p8r0J66N7k40J5K58p6l12J32K79j68k53K15J87k11q8
$$ y = [101, 37, -161, 7, 206, 7, -92, 136, 156, -116, -117, 126, 15, -237, -66, 189, 0, -180, 94, 234, -42, -118, 97, 67, -162, -105, 28, -93, -161, 38, 99, -84, -12, 184, 96, -80, 10, 103, -63, -129, 31, -1, -131, 25, 155, -11, -79, 182, 204, -134, -148, 140, 40, -289, -177, 78, -38, -209, 8, 150, -43, -52, 185, 84, -157, -32, 168, -51, -226, 36, 184, -27, -53, 175, 195, 17, 56, 115, -42, -91, 42, -47, -269, -108, 95, -85, -221, 39, 169, -77, -159, 63, 35, -185, -88, 69, -100, -178, 105, 192, -63, -46, 313, 240, -115, -26, 236, 62, -215, -60, 104, -57, -96, 76, 35, -95, 29, 129, -102, -186, 38, 38, -225, -193, 60, 8, -141, 16, 138, -15, -8, 174, 74, -160, 1, 188, -51, -242, 66, 237, -76, -163, 149, 185, -98, -84, 105, -5, -160, -8, 45, -154, -135, 121, 58, -158, -24, 192, 23, -145, 20, 110, -73, -73, 79, 1, -89, 77, 134, -106, -91, 167, 91, -221, -89, 190, 22, -231, -16, 171, -40, -128]
2995a28K28jk26O6K10j88j58K31J40k67o7K92K3k56K9J87q7j30J00K7j44P7J54
3018A12j13j42K34J12k60p9K63lk74K5K46j16j95K11J24k11l6K80m9k89P2K72
3040A84j75k58J85K09j92j22K20R0j73K6J50j05j08J43J2k12OK04n0k02J31J91
3062A54j56j01J89J6k02L7J52j47j69K16J23k40n5L26N9k74L6K80q4k51J06J33
3084A48j78j16K01Rk01Q7K26j31j60J61J00k15j13J58jk08M5J47o4l0J89O0j33
3107a9O2J98j06k06J03J49k21j01K07O4j67O7K11j03j36J36N0k73j28J84k3k78
3129c30M9K74m7j42J79J82j28q5J58k7k12J7J44j06j12K05J67j09kK02Oj71k0
3152I2M4j59j41O7Qj48O9K07l0q6J59J12j88j11J22m3k26K1J90o1q2K43J94j54
$$ y = [-128, 100, 99, -127, -61, 149, -39, -197, 34, 174, -93, -160, 132, 155, -101, -72, 115, 28, -102, -2, 25, -119, -42, 112, -1, -143, 91, 203, -57, -136, 127, 124, -150, -125, 121, 5, -190, 21, 145, -66, -102, 178, 129, -160, -88, 184, 9, -249, -64, 145, -47, -169, 51, 141, -32, -6, 144, 39, -69, 74, 86, -126, -120, 84, 34, -168, -37, 154, -2, -103, 86, 102, -100, -63, 89, -58, -227, -11, 112, -128, -183, 143, 202, -72, -36, 244, 160, -91, 15, 148, -30, -146, 55, 64, -137, -50, 176, 45, -115, 46, 146, -69, -182, -24, -25, -233, -188, -41, -105, -135, 54, 114, -19, 43, 241, 135, -71, 32, 181, -40, -141, 66, 130, -37, 30, 241, 138, 2, 138, 188, -85, -213, -29, -52, -330, -281, -7, -54, -196, -17, 165, 37, -48, 110, 83, -129, -112, 32, -74, -186, 19, 186, 77, 75, 277, 283, 112, 92, 136, -23, -164, -97, -89, -237, -168, 39, 9, -77, 82, 194, 6, -105, 17, -26, -252, -231, -41, -102, -184, 59, 253, 99]
3176I9l9K39j4k95n1J63j27k29J05J79q4l8J92P7j40J1R1j44j82N8L7j31nJ96
3200c2M6n6J23J21r2o1J07p1k36J7J67j28j42K08J97j29o3K07M1k37m3J17j16
3223e5j98J11J55j10m7K36J03j58j5J60p0k00NO0q1n0R9N1l2Q9R3p0q1Q9k2j92
3249a30k0J21m7j12J53J53q3k9J73K3k26j6J58j14k30J04K01j17r3K04J47j67
3271E3p1J48n1j96j1P2p9o6J37Q6l7M6J19k5q7KKj42k7O6l1n9J44J34q5jJ85m
3299B22k31l2J18j10k41R7J83p9p4K41J22j50k9J56m4k72kJ17j10j47J44J64l5
3322Hj2J44N5r1l2Lj06r3L4l2o2R5J16l0J4J61L2j64QN8j22j97P3J26j38m9K33
3349C2J40j45j1K11k0k55j5J31r9k21J22J41q2m7K06Q2j01j7Q2o6j23j7K0o8j4
$$ y = [99, 60, 299, 285, -10, -61, 102, -25, -254, -149, 30, -54, -92, 100, 177, 37, 48, 139, -5, -187, -129, -92, -223, -228, -32, 14, -42, 81, 202, 110, 49, 156, 85, -151, -134, 33, -95, -237, -29, 168, 39, -24, 183, 224, -13, -56, 61, -55, -253, -142, 13, -97, -144, 92, 195, 37, 22, 182, 112, -88, -83, -23, -104, -154, -55, -4, -36, 53, 146, 76, -5, 84, 62, -130, -150, -29, -76, -188, -35, 118, 35, 6, 179, 202, -24, -40, 118, 4, -226, -122, 79, -38, -131, 73, 220, 53, -18, 130, 79, -117, -128, -56, -135, -201, -64, 22, -15, 31, 150, 125, 38, 40, 42, -100, -127, -61, -92, -151, -7, 127, 42, 41, 226, 222, -9, -41, 77, -33, -274, -177, 6, -73, -147, 94, 216, 66, 37, 193, 149, -123, -125, -8, -118, -265, -121, 43, 8, -4, 140, 195, 104, 72, 75, -31, -124, -90, -122, -184, -89, 27, -3, 11, 172, 204, 40, 48, 106, -16, -213, -140, -14, -152, -201, 32, 172, 27, 16, 227, 207, -48, -63, 68, -31, -252, -130, 11, -71, -118, 88, 170, 69, 52, 134, 68, -55, -72, -52, -120, -134]
3374a34P5QNJ11M4p0J5P6q7j46N1P4j35o4J82P6j51L1K06rk12M5J67j24k02J10
3400e8J20j18q8J54R3j14j4J31j6j14J4O2o7n5L9J8l3J9M6k3jO8l5o3O3M2j09
3427c9o9J27M2j61MJ69j9j46O1J72q0j50J16J02j49r1J46L7j67%J63oj23K7J43
3452A09m8j05M2N2o2l3K0J0k6J4J9k6N1N5n4l7P0J5j31oJ10m2j32Q1J46r2r4J58
3480F4Q7j63p2J47K1j87l6J88rj49P7J37n2q3P1O7r9m8M3Mo8%P4j7PL9Nm4K9j9
3510A4p0JM6m7p2P0J25o4o4J31Q2j56n6J29Kj78LJ49k5j16R5J40p7q7R7N7j61
3537c2p7R5kj29J1J10K4l2M0O2k4j6ml9l9K8j8l8N3Q2jk8R9N1j07m8O8o3j48n
3567a27J11l9j07J19J30p8o1J04M2j62o3Q3j2j10K5J46J4l1J08Q5o5j9L5l7j01
$$ y = [-134, -59, -51, -46, 65, 109, 39, 54, 130, 43, -103, -52, 22, -113, -177, 5, 81, -70, -39, 167, 158, -54, -9, 158, 34, -168, -58, 62, -56, -144, 10, 103, -11, -25, 106, 90, -24, -10, 52, -15, -70, -31, -13, -46, -27, 19, -4, -5, 63, 28, -35, 28, 70, -39, -108, 19, 61, -100, -96, 73, 54, -92, -31, 141, 61, -89, 27, 129, -20, -111, 35, 72, -95, -95, 68, 62, -61, -34, 109, 61, -44, -2, 50, -12, -45, -25, -15, -41, -27, -8, -34, 17, 72, 18, -19, 51, 66, -65, -71, 39, -3, -135, -54, 92, 0, -94, 64, 151, -12, -84, 63, 84, -103, -139, 49, 40, -109, -32, 105, 53, -30, 41, 108, 9, -39, 4, 8, -60, -60, 14, -3, 4, 43, 48, 4, 33, 14, -56, -55, -9, -56, -128, -58, 67, 3, -61, 70, 152, -4, -60, 69, 71, -107, -104, 45, 20, -96, -1, 139, 62, -25, 72, 129, -32, -109, -14, -16, -145, -134, -24, 0, -32, 8, 70, 46, 30, 26, -13, -52, -24, -42, -80, -27, 55, 54, 26, 125, 176, 69, 21, 89, 26, -122, -127, -16, -55, -162, -43, 87, 9, -52, 52, 94, -68, -131, -48, -60, -170, -145, 1, 15, -16, 92, 177, 112, 93, 128, 91, -10]
3592a0l1K5l2jM1M2RM3J4m9l4J0o5j22j9P8m4n7J35J01j9j4J11J2j12l2M5m2j11
3621a28N8R8k2l8J34Q6p3k4M1l3j33m4J2n5k9O2O0k1M4Q2lo2J0J0q9n1K1J2j8
3650i3N0P7J1J5P2J6q9k2J7n5r1MN9m2j2R2N2l6kP3m4j09NL4p2n7P6P1k5K1R3
3681H9K0l8j8L1n6q2J3Rl2PP1Qj0L5L7k8m3lj8o8lK7j5lP9L5k9J5O1k6q0JK9n9
3715d4n2N2L7l4jQ1J7n7MN1n7p2K4L2l3k9P5K8rJ2N3om3M%m8j9K0oj4L3K7j3j1
3749BL7k2m6%J3l5l6M7L4m8%Q9Qo3L1N4m3n5J0N5m7l5O3L0l7LN5k4l3%J4l4l4
3782d7J9J4k6PL4lj6L3Qn0K0K0l5l3M9K9n0lM5J1m8J7N1l5n5K9L1n5k4O8Rm1n
3815c2M7mm5K0M8k4l8J8L4l7j6K4J6k9J0K1k4j2K1J6k5NJ7k2j7L5Ml8NM1j4m1
$$ y = [-10, -41, -16, -48, -49, -8, 34, 43, 86, 100, 51, 17, 27, -38, -160, -179, -101, -145, -202, -67, 34, 15, 1, 112, 124, 12, -20, 25, -17, -128, -70, 28, 6, -32, 102, 188, 115, 91, 132, 99, -34, -78, -66, -121, -150, -88, -28, -49, -5, 77, 74, 12, 22, 32, -57, -108, -87, -75, -93, -43, 34, 45, 60, 132, 148, 59, 37, 54, -1, -92, -88, -29, -71, -83, 9, 61, 25, 23, 96, 52, -57, -52, -18, -90, -147, -71, 0, -25, -4, 89, 109, 71, 53, 84, 28, -54, -41, -32, -64, -57, 14, 22, 12, 47, 84, 56, 13, 10, -8, -76, -79, -52, -67, -70, 9, 44, 15, 30, 91, 65, -15, -14, 15, -44, -96, -44, -7, -41, -42, 39, 56, -1, 3, 54, -3, -75, -51, -19, -52, -81, -6, 22, 13, 25, 78, 72, 29, 33, 33, -15, -34, -14, -20, -34, -1, 26, 13, 2, 39, 17, -29, -29, -16, -51, -87, -40, -6, -54, -54, 35, 43, -20, 11, 65, 22, -33, -23, 32, -15, -50, 13, 43, 6, 9, 64, 40, 7, 7, 21, -13, -47, -28, -14, -40, -33, 1, -2, -18, 15, 23, -27, -7, 13, -22, -55, -6, 23, -27, -30, 15, 26, -22, -5, 46, 11, -44, -15, 16, -39, -63, 5, 14, -27, -32, 15, 11, -34, -14, 34, 10, -28, -10, 24, -13, -29, -5, 11, -18, -8, 13, -11, -23, -2, 14, -11, -6, 11, -11, -28, 7, 11, -27, -22, 19, 5, -36]
3847c6K6L1k1k7L5J3m3j7N6k0m1J6M8k0k7L1L3l7qK6j3k6MK3j2j6K6Mj3NK2j5
3879Gj8K6pl7NK5Kl4J4L6j7j0K2J1m8jJ1%l7J3L8j5j4L5K6l7KK3j6k4j1K8k4k4
3913e0L6K0j6J7K2ml6PJ0k1k5K6J3l9L4K8ok8L3Rk3l1K9j8k6ML3lj5J0K9j4j5
3946a0J1J2m6J4koMQJ6rJ9J5lk6KJ5m1KPJ0k1J0M0j8j7K8J6l7%Ljk3oM0j6lK3
3983A0J4j1k0K1j0k1nKj0j1J4K2lj0L3Kk1nJ8k3j3J5Pj2kL1%rPK1j5k5J7nl1J3
4019a5KMkMK2qKOOl1OJj2qJ6Mj5QK5Kk1J9qkk5JJ2j7LJ3LMKJ6rj4J4j1qjJ9j1
4061djRJ6mMlroqJ4j3lLLLj1K2LkmlNk7PMqkNJ5j4jJ8qkJ1j2j2LJ7j4oJ3J0j0
4105bL%J0qjmOJo%pnJ7Kj3RN%j0%mPjm%j0J8orOlM%MpP%jlPomjJlKJ0j6J5mnJ0
$$ y = [-36, -10, 21, 0, -27, 8, 21, -22, -39, 17, -3, -44, -28, 20, 0, -27, 4, 37, 0, -8, 18, 5, -21, -17, 6, -6, -22, 4, 8, -5, 0, 22, 7, -11, 15, 8, -29, -24, 1, 3, -31, -17, 19, 2, -8, 14, 25, -23, -24, -13, -13, -50, -37, 1, -14, -28, 7, 33, -4, -2, 21, 5, -19, -30, -2, -26, -50, -14, 6, -10, 7, 29, 25, -11, -4, 6, -15, -40, -14, -1, -40, -6, 22, 16, -12, 21, 30, 7, -24, 5, -13, -39, -35, -2, -5, -20, -10, 19, 5, -10, 1, 13, -33, -19, -21, -27, -23, -15, 1, -8, 11, 26, 23, -3, -1, 14, -27, -25, -18, -8, -29, -19, 21, 3, -14, 14, 30, -7, -7, -4, -5, -28, -34, 6, -10, -13, 10, 24, 13, -7, 14, 4, -17, -22, -20, -30, -41, -27, -5, -8, -18, 15, 17, -4, -9, 9, -14, -27, -12, -5, -17, -19, 12, 12, 3, 10, 31, 16, -9, 8, 3, -28, -15, -13, -9, -11, -7, 15, 7, 9, 15, 21, -10, -4, -3, -15, -23, -7, -3, -18, -10, 15, 17, -4, 15, 7, 5, -20, -19, -7, -24, -21, -8, -5, -1, 1, 17, 8, -6, 8, -3, -11, -12, 7, -4, -5, 4, 20, 16, 20, 17, 8, 2, -6, 8, -5, -8, -5, -2, 1, -10, 12, 15, 13, 9, 6, 11, -16, -9, -5, -13, -15, -10, 5, -9, -10, 8, 0, -2, 9, -3, -15, -12, 5, -9, -15, -2, 8, -2, 1, 1, 11, 3, 2, -2, 4, 5, -1, -1, -8, -13, 4, 6, -7, 2, 7, 7, -3, -3, -7, 0, -1, -5, -5, -15, 3, -3, -12, -6, -9, -5, -5, -1, -8, -1, -1, -2, -5, 2, -4, -8, -9, -8, -11, -9, 1, -15, 0, -4, -9, 1]
4157AoMJ0lpNnJKqPKj2J7j2OrJ3rJLoj1LjPj1J6nlJ1j5MQkrJ3oJ4jj4nJ0OpJ3
4203A0j3KmJ1Nj0j1mJ9ll%%p%QjJOpmMNj3OoJ0kk1J9kjrJ1nONNlmJ0Lj9NOLj3
4250eJ5J0rmkJ0j4MJ3k6jR%%JqJ2k5J5J1j5KjKnJ0%J0k0rK1Kj8PMkqJ0%jKJ1j9
4293a1qPJ2j0JJ0qJ3ljkMPj4MP%j1kR%j0kPp%kK2k7%LPj8JJ1%j1nK0ljkMjOkJ3
4340Gk0MJ2kLj%pOJ2pk0K2lk2J3J5j0j3NJ1j7L%K6m0kK8%k7QJ6nj2J4Krj4K0J6
4380A2l5MJ1Pj7J0NNoMj3nJ2Rk5K8J0j8mJ1Pk3JK6mk2NK4k0j6RK7j9j6J5J3k6
4417a4j0K6j0j6%L2rj4J5J4k2%J3Lk0J6qKNPj4JKJ1j4nJ6orkK7lk6J1K1j8k5L0
4455GK2m5PK7Jl1NL4j9k0J0J7l1JJ6qnN%jnMknRJ2k1lK7rk1J1K5j2j1J6K9m4q
$$ y = [1, -5, -1, 9, 6, -1, 4, -1, 0, 2, -6, 1, 3, -9, 8, -4, 2, -7, 6, -3, -2, 1, -5, -16, -13, -14, -7, -18, -2, -7, -10, 1, -14, -10, -2, -4, -13, 0, -6, 8, 7, -7, -12, -2, 4, -3, 10, -3, -1, -5, 6, 11, 1, -10, -14, 5, 2, -1, -1, -1, -8, -8, 0, -1, 0, 6, -1, -5, -1, 4, -9, -3, -9, 1, -1, -22, -3, -5, -6, -15, -4, -9, -3, 2, 7, 4, 0, 10, 13, -6, -1, 5, 8, -5, 10, 20, 11, 7, 5, 15, 1, 5, 18, -8, -9, 0, 0, 0, 1, -7, 5, -20, -5, 6, -9, -7, -8, -6, -11, -1, -1, 9, -11, -20, 1, 3, -15, -8, -4, -6, -14, -4, -4, -5, -3, 8, -11, -19, -12, 0, -10, -9, 1, -7, 6, 3, 2, 0, 4, 11, -3, 1, 8, 8, -3, -5, 4, 4, -6, -8, -1, -8, -8, -10, 12, -15, -15, -12, -5, -23, -22, -11, -11, -22, -27, -7, -10, -11, -13, -9, -10, -4, -6, 7, -13, -9, 3, 1, 4, 3, 3, -4, 2, 14, 7, -13, 9, 6, -16, -3, 12, 2, -11, -6, 5, -12, -9, -9, 17, -23, -25, 3, 3, -24, -16, 0, -5, -17, -3, -1, -10, -24, -4, 12, -23, -19, -8, -1, -18, -8, -3, 2, -4, 0, -13, -18, -6, 3, -22, 6, 16, -2, -6, 5, 12, -11, -10, 16, 12, -10, -5, 19, -1, -17, -8, 19, 0, -16, -1, 12, -14, -24, 2, -8, -24, -24, 8, -1, -15, 0, 14, -8, -8, 5, 8, -12, 4, -4, -2, 3, 10, -4, -3, -1, 10, -4, -9, 7, 1, -8, -10, 17, 14, -12, -1, 20, 2, -23, 7, 29, -16, -9, 18, 19, -12, -7, 27, 8, -12, -2, 15, -16, -15, 1, -7, -12, -7, -7, -8, -13, -9, -11, -16, -7, 5, -16, -19, 8, -1, -22, -11, 14, 2, -9, 7, 36, -8, -16]
4494a6M5ol3j4M5rl5RK8j1l0K0K9l0k4M0ok7PK0plJ2pnOjnnJ1rj8K6J6k0j7K0
4531dK6m0%L7J3n4RM3j6l8J7L8k6l6M2K0l6k0L6Ml5%L2k3j7K0J9l0J2J5pj4R%
4565dnkJ5j7j1L4mk7RK8j1k3kL8k5k3K3K7m3pM4jk7rN5j4m5J5M3m0k0K9K0k9j1
4600b0K4Lj5mK4j7j4jJ4qoK0rqJ5Ml4J7J7kk0K5J3m0jM4ol7kM6k5k3L3J8l9j3
4636b7M3J7m9jM0j0m4J3M0k4j6PL6k3k3K4Kk3%K5j5j%OrnJ2j3JJ6%k2oL1rl0K2
4673a5J9j7j3L7J0l4j8M4j2k8QL7j8l4K5K2j7j2L4Lm3LK4nk4OK7j8j2J7J0j2p
4706a3J5j8JrJj1LJ8pqK2J3j6jL7j5k7OJ5rj7J8L4k7j5K0K2l6NJ3rl7QK1j3l6
4742e2K1K2j5oK9%j4PNmj2J6Jj4QRnOROk4nJ5ql6K1K1k7rK2K0l9ML3Pl7kL0j7
$$ y = [-16, 29, 23, -10, -24, 21, 12, -23, -14, 14, 3, -27, -7, 22, -8, -32, 8, 2, -25, -18, 2, -5, -8, 4, -3, -8, -2, -3, -8, -13, -2, -11, -29, -3, 13, -7, -24, -4, 22, -18, -18, 19, 32, -22, -13, 30, 14, -24, -7, 31, 5, -31, 11, 31, -5, -25, 11, 15, -20, -20, 12, -11, -28, -8, 11, -19, -7, 8, 1, -13, -4, -4, -9, -11, 4, -13, -24, 10, 6, -21, -12, 16, 5, -18, -20, 18, -7, -30, -7, 20, -23, -30, 14, 13, -14, -23, 32, 18, -27, -12, 31, -9, -29, 0, 20, -9, -20, 4, 7, -8, -12, 12, -5, -19, -20, -6, -14, -20, 0, -9, -17, -2, 2, -32, -15, 2, 0, -20, 5, 18, -22, -23, 21, 15, -22, -24, 22, -3, -26, 7, 25, -14, -27, 16, 33, -16, -17, 23, 13, -31, -18, 22, -2, -18, -11, 25, 2, -21, 3, 5, -18, -18, 7, -8, -9, -9, -3, -12, -17, -5, -18, -17, -1, -1, -23, -29, 2, -7, -37, -15, 4, -13, -26, 11, 21, -13, -31, 13, 1, -27, -19, 18, 0, -34, -9, 13, -4, -16, 18, 21, -22, -19, 5, 0, -24, -18, 9, -9, -21, -4, 6, -6, -13, 2, -16, -15, -24, -23, -34, -31, -13, -20, -28, -6, 7, -9, -10, 27, 12, -15, -9, 6, -3, -20, -2, 32, 5, -10, 10, 32, -4, 1, 14, 5, -32, -24, -3, -16, -52, -31, -9, -24, -30, -1, -1, -15, -8, -3, -7, -19, -3, -2, -16, -8, 1, -4, 2, 11, 17, -7, -12, 3, -5, -41, -20, 1, -26, -35, -13, 7, -32, -28, 5, 12, -25, -27, 3, -14]
4781a4k1J4K5k1LK8J8k9mK4rl0RJ0k1oJ4Qj9J1J6k2j3K1jk8%K7j7k2K9L1l1j4
4815c4N2J8l4j5M0pm5K4K1k6j3J6J6k4J0J9Ml8J1J6k5kJ2Kk0kK1Ql4L0J4k5mJ8
4849Djl6K3J4j2k4L7Qm1J9J4Ol9OM5k7k3J7K7l8kM0qk5J1K8j8j9J8Rj8%K9k3j6
4884a5J5J0j8j4K3Pk0LK1oj8J9Mk5j6L5Jm0J9L6k3j3L2J7l4qL8qm2nM0j6j3J8
4918DPj1qL0j1k1PJ9l4j0K0j0rK3K6j3j9L1J9l5j8K3J3n7K6J1l2qL8K1k6pK8n
4952A2m2J2K3l8k4L3K4j8%M0mj3L4Mm0j4K4j5l3J6L5j6nL4K4m1QJ9j6m9PRj6m4
4986g0N0J9j7pN7Nm0QJ9k2l6J1J2k5rL5MnK9J7j4j4J5j1l1mJ6k4j4M2J6k4RM8
5020D5j4l1J1K6k9l8J4K7m3mM4kj5QL9k2k8K3%m2j7K8prK2J7JnJ0K2l0%K0k9j6
$$ y = [-14, -35, -21, 4, -17, -14, 14, 32, 3, -1, 23, 14, -16, -7, 3, -18, -24, -10, -2, -21, -10, 6, -16, -29, -8, -9, -37, -37, -10, -27, -49, -20, 11, -20, -34, 18, 36, 2, -13, 27, 20, -25, -1, 20, -6, -19, -3, 13, -11, -1, 18, 22, -16, -5, 11, -14, -16, -4, -2, -22, -24, -3, 5, -29, 1, 15, -10, -14, 4, 3, -33, -10, 4, -8, -32, 5, 13, -28, -9, 5, 11, -28, -22, 23, -4, -27, -10, 17, -21, -23, 17, 9, -16, -5, 23, 5, -14, 4, 13, -5, -5, 24, 1, -15, 0, 10, -8, -22, 1, 8, -12, -9, 12, 6, -12, 7, 11, -14, -30, 5, 6, -34, -15, 21, -2, -15, 17, 34, 0, -8, 30, 22, -20, -25, 15, -1, -14, 4, 11, 0, -8, 22, 11, -10, -3, 16, -18, -28, -8, -18, -27, -4, 22, 9, -10, 21, 40, 5, -13, 10, 23, -34, -8, 3, -29, -37, 1, 22, -4, -11, 17, 12, -30, -18, 5, -33, -57, -24, 0, -18, -18, 22, 18, 5, 39, 43, 3, -11, 13, -2, -35, -19, 16, 0, -5, 29, 53, 12, 20, 39, 23, -26, -19, -10, -26, -70, -20, -1, -18, -25, 32, 37, -3, 5, 24, 2, -34, -23, -11, -36, -45, -10, -6, -11, 18, 35, 21, 7, 22, 11, -20, -24, -8, -32, -46, -4, 12, -12, -3, 45, 31, 0, 11, 37, 8, -30, -16, 11, -32, -36, 8, 6, -9, -1, 38, 16, -12, 11, 11, -31, -48, -20, -27, -36, -14, 3, 4, -1, 9, 31, 1, 1, 21, -8, -24]
5055b4J5Pk5JM4kj3RJ6k2j6K5Pn0lN0om4J7M6k5j5K8J0l7j3K2Jk4PJ2oj4K6kj2
5091a0PMnj2J9nj6kJ3J4l0J6L4l1oJ6K8m2rL4Nm0RK3k3j7K2K1k9qL0J1j3RQj0
5127A5j9ONj8j7J2OrJ0J2Kj1J9Kk6OJ3j8l7K5J6j9J3K5J0k9K0J8j3k3J2Ol7k2
5161d5L4Oj2LM2Jj0J5Kj9l5KLj7nJ9j3K4J1L0k2J7Kj6l3Oj5k0qK1J6qJ9L7pj6
5197IRQj9l3KOk4jL5RnJ8K7pj5J2j0k7k3%Rl6K2K4J4kJ6K1qj2j6j5k3Pnj3J7K3
5235fJ2mJ5J6Jk0nql1j7K2nkQL6opL0Qj7k3Lj2j9%LJ1LK0J7kNlJ1k4rrj7j0lP
5276c1lK6J5PrJ9mk4j2Omk4%J3J7oRL9k2MRkk0j7PKk1PK2Lk0J8NJ8k8K4k1nrQ
5316drj4J5RKrJ1mj2J8kqj2J1Jj9J8J5j9lLJ1mmJ4Jj3LJ9lj6J6kj4pJ5Lk1KJ9
$$ y = [-24, -9, -2, -27, -26, 18, 16, 3, 12, 28, 6, -10, 15, 22, -28, -31, 19, 13, -31, -14, 32, 7, -8, 20, 30, -7, -20, 2, 3, -21, -14, -2, -8, -22, 4, 2, -10, -3, 1, -4, -16, 3, -2, -18, -20, -7, 7, -23, -7, 27, -4, -10, 6, 34, -8, -17, 17, 22, -18, -9, 14, -9, -26, -4, 17, -12, -20, 10, 21, 8, 17, 25, 15, -4, 2, 7, -11, -28, -16, -10, -19, -9, 3, 5, -6, 13, 15, -11, -5, 8, -10, -47, -22, -6, -25, -12, 13, 23, -6, 14, 32, 19, -4, 8, 14, -23, -45, -11, -5, -17, -14, 28, 29, 19, 34, 36, 17, -18, -16, -13, -30, -35, -16, -29, -5, 6, 36, 14, 31, 33, 17, -16, -10, -25, -45, -53, -32, -16, -24, -5, 32, 25, 9, 18, 26, 7, -26, -24, -18, -42, -43, -8, 1, -4, 14, 41, 34, 19, 31, 21, -6, -29, -29, -20, -56, -34, -10, 4, 2, 18, 39, 31, 19, 3, -12, -35, -28, -33, -46, -29, -6, 6, 2, 17, 33, 34, 14, 9, 1, -30, -47, -25, -30, -32, -24, 12, 6, -1, 29, 37, 20, -3, 0, -12, -31, -31, -28, -17, -14, 6, 23, 21, 26, 23, 34, 10, 1, -8, -25, -35, -38, -31, -34, -8, 7, 14, 5, 24, 20, -4, -16, -10, -14, -38, -38, -25, -8, -14, -5, 34, 12, 16, 25, 23, 3, -14, -7, -5, -26, -19, 3, 6, -14, 4, 9, 27, -1, 23, 2, -3, -12, -4, -13, -27, -12, -3, -1, -10, 1, -3, -15, 3, 1, -7, -19, -8, -7, -26, -8, 7, -12, -15, -12, -1, -5, -9, 5, 6, -7, -4, 15, 12, -4, 12, 10, -4, -11, 4, 7, -14, -12, 7]
5356GPj0OMj2lmqo%J7r%J4K1l0MJ1oj5mJj4jJ6J9k8J9J6Nj4NK0l0k3J1%j0QL7
5396B1j1j4J9K4k6mNrj8nJ4qj7K3Q%KK3pk2Lnj8k3J9lmOL6onK1J6k7k7K6j2l0
5434c5jJ0%%L5K3j9KK2%k5j7J3l6rJ7PoRL9j1%J0J2l2oj1Lk8LJ6mJ3J2J9j1jO
5472A9ok8KJ1j8k0MK6j1J0J8KJ3Mmk9oQLj5qL2Jj8K2K1j8LJ5j6j8pJ4j6j4RPm
5510a2P%J0pKRj0j9J6jl3K1J0j7J4K3Pj1j0J9j5j5J0Pk1mJ7Mj2nL1mrJ1Mk5j8
5547b6K6lj8RONkLJ7j1JnMk0jJ4mj8OmLMK3j1j8MK4k2j8K1J0jj4PJ1k1K5K2l1
5586ckJ1J5k7lJ6k1lRMoj7L5mqMQqj2J3Jk0jJ3Qj9MJ8j3QLlpjNlk2RRj0kJ1Mj2
5630a9J0K8qooJ4j2rJ2oj0J0RLLjnLj0K4k8Mk0JOpMJ1jQJ4j1j4kQpj7LK1k2J2
$$ y = [7, 14, 4, 10, 14, 2, -1, -5, -13, -19, -19, -2, -11, -11, 3, 24, -6, -2, 9, 3, -12, -16, -15, -29, -30, -14, 5, -23, -4, 12, 17, 3, 8, 28, -2, -25, -14, -14, -24, -16, 21, 10, -4, 15, 39, 13, 9, 14, 5, -13, -18, -4, -12, -29, -6, 2, 2, 4, 27, 20, -2, 1, -4, -22, -45, -26, -29, -33, -27, 9, 3, -2, 19, 35, 8, -19, 7, -5, -35, -36, -26, -26, -26, 9, 32, 13, 15, 37, 37, 12, -5, 8, -28, -37, -20, -13, -19, -10, 29, 18, 18, 28, 40, 8, 2, -9, -6, -34, -31, -15, -19, -6, 6, 25, 14, 13, 19, 13, -15, -13, -2, -20, -40, -36, -10, -21, -11, 7, 9, 22, 26, 22, -7, -13, -5, -2, -17, -25, 7, 8, -10, 12, 33, 15, 18, 33, 17, -1, -8, 6, -10, -24, -15, -8, -12, -5, -5, 5, -2, 0, 9, -1, -20, -4, -5, -38, -17, -7, -24, -10, 13, 20, 9, -1, 18, 3, -12, -2, 5, -16, -20, -3, 1, -11, -16, 15, 11, 2, 13, 17, -8, -26, 0, -3, -21, -12, -6, -1, -3, 0, 17, 6, 7, 2, 6, -14, -15, -1, -5, -23, -17, -21, -18, -14, 9, -2, -20, -16, 8, -14, -32, -11, -1, -2, -16, -9, 2, -19, 6, 28, -3, -5, 6, 21, -6, -9, 7, -14, -17, -8, -4, -10, -27, 8, 4, -4, 0, 8, 0, -12, 1, 2, -18, -19, -6, 2, -17, -13, 5, -8, 0, 3, 0, -7, -8, -3, -6, -28, -19, -10, -20, -22, -11, -7, -19, -9, 19, 11, 5, -1, 13, 1, -8, 4, -2, -12, -2, 7, 10, 13, 12, 7, 10, 0, 24, -4, 0, -20, -19, -13, -20, -16, -5, -6, 2, 16, 5, -9, -11, -3, -10, -27, -24, -3, -25, -13]
5671a3OJ2qQJ5j2j4JJ4k4j6J9JmK0J5KjJ1k6Mrlj1qRMoJK6Pj3lPj8pmQk7KK5j5
5713b5OJ4J8rj2J8rrk3J3lmJ9LnLJ2Qr%joj4lJ5j8LJ8PJnJ6j3oqJ8j0j6%J4j5
5754a7%LJ1OjLkj1jLk0RJ1nMJ0kQNp%pQmolLJ4k0J4%oj1PJJ0mjNoj7MjLJ1%Lp
5802cp%j0OJ1jj1%MMnJ0Mj9J2Qnj3K0kkpJ3j0J1k3K1%pkJ3j0jjJKorPlKjpJ5K
5847Amj6RMJqNKj6mJ9OoRmJnJ2rJoJ8qnJQPrQRoj3N%j1OqKMoMj0RKkMj2jMjOj1
5899a4J3m%NmpNJpJ0j2MkRNj0QLmj1J9m%j1qJ5NLLrMLmK0j5j0NRnqLqLLrnLj4
5947b4N%QMnJ5jrPNj6KQ%%lR%JJrNLljOrJljQpKQoJ0j4%k%MM%Lj5JKopK0mnnM
6001iKmJ0JkLkKqMoRqJ9%oPj2KJJ0pMj3NoJ0nrJ2lJ4k1oJ8k0J0jKlkNnqMKMj6
$$ y = [-13, -7, 5, -3, 5, 20, 8, -6, -5, 9, -15, -31, -12, -11, -15, 5, 20, 22, 21, 32, 6, 10, 1, -2, -13, -21, -12, -8, -14, -13, 13, 20, 7, 4, 11, -7, -14, -18, -10, -37, -35, -10, -25, -19, -5, 13, 4, -8, 10, 1, -8, -31, -18, -21, -25, -6, -3, -8, -5, 7, 15, 6, 6, 5, -1, -15, -18, -3, -21, -18, 0, 7, 8, 3, 19, 6, 0, -8, 10, 0, -16, -16, -2, -17, -17, -14, -3, 3, 2, 5, 3, -8, -9, -6, -26, -17, -6, -11, -7, 3, 1, 9, 14, 7, 7, 0, 8, 4, -2, -5, -2, 12, -8, 6, 6, 0, -11, -4, -3, 7, 3, 2, 7, 1, -16, -12, -13, -10, 1, 1, 4, -3, -10, -10, -20, -14, -3, -4, -15, -15, -11, -7, -12, -2, 2, -17, -5, 3, -2, -15, 5, 3, 1, -6, 7, -3, 8, -15, 6, 6, -1, -3, 10, 0, -1, -2, -1, 1, -5, -14, -7, -10, -8, -9, -16, -1, 1, -3, -19, -10, -6, -5, -13, -8, -6, -22, -26, -7, -1, -7, 2, -2, -1, -6, 6, -3, -2, -8, 10, 2, -3, -2, 6, 13, 4, 12, 21, 15, 2, 7, 7, -4, 2, -6, -4, 0, -6, -2, -12, -3, -1, -3, 1, -11, -12, -8, -9, -3, -14, -1, -5, -5, 0, -4, -11, -6, -5, -12, -2, -14, -10, -12, -3, 2, -8, 0, 3, -1, -12, 7, 3, 3, -8, -16, -1, 4, 7, 10, 1, 5, 8, 4, 24, 9, -1, 4, 13, 8, 0, 3, -5, -2, 1, -8, -13, -10, -24, -19, -19, -11, -7, -12, 3, 2, -7, 0, 5, -11, -9, -1, -1, -1, -4, 5, 5, 6, 7, -2, 3, 6, 3, 2, 8, -1, 0, -3, -4, 4, -3, -1, 7, 1, 11, -3, -3, -5, -5, -1, 3, 3, 6, -9, -8, -6, -12, -19, 1, -3, -8, -13, -9, -7, -11, -1, 0, -2, 1, -1, 1, -7, -3, -9, 0, -8, 11, 11, 5, 12, 0, 2, 3, 13, 6, 10, -3, 2, -4, 6, 1, -8, 4, 1, 15, -6, -12, 6, -14, -4, -5, -3, -6, -8, -3, -8, -16, -12, -10, -6, -22]
6049b2J6Oj8JNkJ1JNj0JLJ6nj5J3jj3J3J1k0Q%plnJ0mLLjrNKMnoPj3KNMnOkMj0
6096a1QKqJ9k6J8j4KJ9j3jjJ0nJ0Nqk%KnjPlkJNj1LPOnqNj3L%PllpJ0j0MQpJ%
6144eJ2k1J4j3K1j4kRj1j0J5PqjPpKJ2mrPnJ4Mj6J3Kj7oJJ9j4K1k5PPj1nj0K4
6184DqllMoNNkK%QqnPQlj8J5Lj3QMPj6lJ0KkjPmlnOqRJ0j2%lLqOjMrKnkK%qRJ0
6238AmkmJ2qqoK1QonkjQPqnjJ4j%plLJKjpoJ3kQj9QKKj0J0oj0J6jk4K1qjpRkq
6288a7PJKjjNQqKPj4jkJ6KnK1mj1%Olj0njMMllJ3j6MMmJmKnJjmQMrQKjjPKmj8
6340a5J7Qj1j3J7Pj5J3kqJ0j0R%o%Rj1mOl%MPjnj1lJ0pPj1QoML%j9MnJ6joRo%
6386a1QmJ1%j8J0J1k0NQrkJ7j2J3lNMppJ3jnj8J3qJ3oRmkJ3k3%KKj2J%M%kMlp
$$ y = [-22, -6, 0, -18, -17, -12, -14, -3, -2, 3, -7, -6, -3, 13, 8, -7, 6, 5, -8, 5, 16, -4, 4, 4, -3, -6, -11, -1, -5, -2, 1, 0, -9, -4, -2, 2, -3, -9, -2, -15, -13, -8, -4, -9, -3, -5, -1, -11, -3, -1, -9, 10, -16, 2, -12, -10, 9, -4, -5, -6, 4, -1, 9, 14, 6, 4, 4, 6, 1, 0, 7, 4, 2, 3, 8, -3, 0, 7, 13, 8, 0, 5, -8, -5, -5, 2, -1, -4, -11, -1, -11, -7, 1, -6, -5, -5, 7, -14, 0, -13, 8, -6, -8, 1, -10, -20, -5, 2, -6, -7, 0, -7, -5, 7, 3, -6, 1, -4, 10, 14, -2, 11, 13, -4, -10, -9, 10, -4, 17, -8, -1, 6, -5, -10, -20, 4, -4, -7, -10, -6, -12, -7, -2, -4, -2, -2, 6, -2, -7, 0, 8, 5, -13, 2, 5, -8, 0, 4, 11, -5, -8, 2, 4, 2, 1, 8, 4, 1, -4, 2, -6, 3, 13, 1, 1, -2, 1, -7, -1, -2, 2, -7, -5, -10, -12, -10, -10, -18, -9, 1, -3, -5, -9, 3, -5, -13, -19, 2, 10, 4, -1, -3, -4, 4, 11, 3, -2, -3, 11, 10, 10, 3, 0, 3, 4, 6, 5, -2, -8, 5, 3, 11, -8, 0, 2, 4, -6, 4, -2, -12, 4, 3, -21, 0, -8, -9, -16, -7, -9, -17, -10, -9, -7, -8, -9, -4, 4, -4, -2, 5, -9, -10, -12, 4, 6, 1, 22, 18, 7, 7, 13, 10, 0, -5, -6, -2, 2, -1, -4, 9, -7, -3, 1, -3, -2, -6, -4, -9, -8, -9, -13, -5, -1, -10, -2, 0, -1, -2, 5, 7, 3, -15, 2, 10, -1, -14, 3, 10, -5, 8, 6, -2, 8, -2, 7, 7, 1, 1, 10, -1, -5, 1, -2, -2, 2, 9, 8, 3, -8, -11, -1, -8, -1, -12, -4, -10, -6, -3, -3, -22, -18, -23, -7, -8, -14, -5, -11, -11, -3, -7, 4, 4, -14, -4, 7, -13, -8, 0, -9, -11, 6, -6, 7, 4, 9, 13, 6, -1, 12, 11, 6, -12, 1, -7, 6, 0, 9, 5, 3, 16, -7, -7, -5, -3, -15, -14, -14, -10, -10, -12, -8, -11, -18]
6431a8J0Nj1JJ0J2j1%JKLKmNoKpMj0J4%mlPqRkrqJ2KrRpJ8k3jJ6rrLRJ2k8RJo
6478a5LPJlmJ6jrRJLj1QrkLJ5j0jQnKPkj3kOj0KjMJj5QMPj4J8jpjj6J4koQkKL
6527bmoqJ5jorJ4oJ4pR%LmoQjlj2PJ3jj5JJ5ooPj2Kj1J7j1JjLOj5J5KrlKLNj0
6574a3J0J1j3lJ6rJ1Mmj5RJor%J3jNJlj3J8nMoQroN%Kk1J0jJlJ0Lj6KLMj4%J5
6619dj1KKJ1p%OjJMj5QPmpkPLMrJ4Jk1K0lj0j0RKoqJ3Rk0RJ2qj0KjQonlK5k3J0
6666epJ5ojnOjj8J1J5mLNmjJmOj5QJ%rRJ1MloJq%LonKnlJ0oJ3okNj4K1j7mj1L
6715b3K2koPJ6j6LNRj5pJ3r%LLkRNlKlOKk1JMjj1RJ0j0MnMj8J9oojNlj1J1J4p
6761@j3MJ1Mk8K8j3j4NJ3J2j7J8J0j8rJ5JqnJ1%j9J2J4kj0J2Jqpplj%KK%J0j3
$$ y = [-18, -8, -3, -14, -13, -3, 9, -2, -2, -1, 1, 4, 6, 2, 7, 1, 3, -4, 0, -10, 4, 4, 0, -3, 4, -4, 5, 3, -6, -14, -2, 0, -9, 0, -7, 11, -12, -13, 3, -6, -15, -12, -3, 9, -19, -10, -9, -15, -12, -5, -4, -7, -11, 5, 4, -5, 4, 5, 8, -3, 5, -4, -6, -3, 12, 2, 1, 9, 4, 6, 13, 11, -2, -4, 2, -8, -6, -7, -3, -2, -17, -9, -5, 2, -12, 6, 5, -2, -3, -19, -5, -7, -13, -5, -7, -5, -2, -6, -12, -20, -5, -6, -12, -21, -7, -13, 1, -6, 3, 3, 6, 2, -4, 4, 3, 0, -12, -5, 8, 7, -8, -7, 8, 2, -4, 3, -9, -7, -18, -1, -12, -11, -12, -9, -3, -18, -3, -1, -10, -13, -11, -8, -3, -13, -3, 8, -5, -8, 8, -1, 10, 14, 10, -5, 4, 5, -1, -10, -10, 3, 2, 7, 8, 5, -8, 10, 5, 9, 3, 11, 2, -4, 1, 1, 3, -18, -8, -9, -8, -11, -1, 2, -14, -12, -9, -5, -19, -19, -4, -15, -13, -11, 0, -7, -7, -1, -2, -1, 3, -12, -4, 3, -1, -8, -10, -3, 0, 4, -5, 9, 10, -11, 9, 6, -4, -14, -5, -3, -9, -17, -4, 5, -15, -6, 6, -2, -12, -10, -11, -3, -9, -14, -17, 8, -15, -5, -12, 3, -3, -4, -9, -3, -4, -22, -11, 4, 0, 3, 8, 4, 3, 4, 0, 6, -9, -1, 0, 0, -9, 0, 11, 15, 12, 6, 7, -1, -1, 2, -4, -9, -7, -12, -15, -5, -11, 2, -4, -6, -1, -15, 6, -11, -15, -26, -23, -1, -3, -9, -2, 14, -2, 1, 6, 15, 0, -7, 6, -3, -3, 0, 3, 1, 10, 15, 12, 14, 11, 17, 19, -2, -1, 3, 2, -9, 0, 10, 0, 4, -1, 3, -15, 4, -2, -8, -9, -4, -7, -18, -7, 7, 0, -13, -9, 2, 6, -22, 6, -7, -21, -16, -3, 9, -8, 10, 20, 2, -7, 8, 9, 1, -4, 7, 7, -12, 0, 14, 12, 2, 14, 15, 7, 0, -7, -10, -11, -11, -9, -7, -7, 3, -10]
6801a0KRmmj2J0j1nOJ1KpK8kj4j2K0rroJ1koOOJ3plJ3j2rQlMpLJ0j4MRLjplrM
6847fLj7pK4rrJ1Pk0J4Qj5j0%K4ok3J9J3nOpQmJLMk0MOmJ0J4nnlRkomr%j4J6j
6892gLPnLk0K0lj2jkjoJ0QJqJ3jpnJ8qj0kMRk0J7PJ1qLlj5lJ5Jj0pJ1NnNlqQN
6939Dj7NNKk3J4mNj%LOj5RJ0k3kJ8jj6LJ4Rj6J6llrQPj2jOQoqJ7n%Rj3%nJ0kj2
6985iPnj1J2kj1OlJ7pmPj%pMqKJ1Qk6MJ7LkoJ0lpJ1qJj4J8jnqJ9oM%KjJ%k0nj
7033a7J1qLKLLNMoj0%kqjNOj0J4J1Ok2RPKnMNj2Lj0J2Lj0MJ1noMp%MqLMMnMJ0
7081A4k1jPJ1j9LkKkoJ7mj2JQLqQjrj0K0JpkJ9kj5J2oPKkokNQrj6J9nj3J5Knl
7127dKK%kPppj0K2j5%J0MnkkRqmj2J0kRljpO%J5J0j5J0j2Mj3M%OjRj0J4nlJ1r
$$ y = [-10, -8, 1, -3, -7, -19, -9, -20, -25, -19, -8, -6, -13, 15, 13, -1, -13, 7, -2, -11, -17, -6, -8, -14, -8, -2, 11, 4, 1, 14, 2, -7, 1, -2, 2, -5, -2, 8, -6, -2, 7, 10, 9, 2, -1, -10, -6, -3, -20, -27, -3, -12, -21, -10, -3, -23, -9, -1, -16, -26, -26, -2, -8, -31, -12, 1, -4, 2, -5, 3, -1, 0, 3, 7, -13, -9, -3, -7, 3, 17, 12, 7, 4, 13, 11, 5, 1, -8, -8, -22, -6, -7, -4, 3, -2, 1, -19, 1, -2, -14, -15, -17, -18, -24, -14, -6, -5, -13, 0, -1, -8, -13, 5, -3, -13, -15, -11, -2, -22, -5, 2, 13, 5, 8, 5, -10, -13, 2, 3, -7, -14, -3, 2, -3, 2, -1, -9, -1, 4, -13, -8, -3, -1, -24, -10, -14, -9, -10, -10, -7, -1, -16, -7, 3, -20, -22, -4, -5, -21, -18, -4, 5, -11, 5, 2, -1, -10, -2, 5, -7, -8, -2, 6, 0, -8, 9, 4, 4, 13, 0, 0, -5, 5, 3, -9, -2, -7, -18, -6, -8, -19, -13, -16, 1, -6, -10, -3, -4, -4, -11, -7, -15, -13, -2, 6, -20, -16, 1, 4, 2, -4, 6, 3, -4, 7, -1, 0, -14, 4, 3, -2, -10, 9, 3, 7, 7, 9, 8, 9, 9, -11, -16, -17, -6, -14, -11, -9, -6, -3, 2, 6, 0, -10, -10, -12, -20, -21, -16, -10, -20, -6, 5, 11, -11, -2, 5, 7, 2, 6, 11, -1, 2, -8, 4, 7, -3, 1, 12, 7, 1, 5, -2, -2, 2, -6, -3, 1, 5, 0, 4, 14, -7, -8, -1, 10, -9, -6, -8, -6, -8, -14, 3, -1, -13, -12, -4, -1, -9, -1, -2, -11, -21, -1, 0, -7, -9, 10, 8, -7, 5, -1, 6, 8, 6, 0, -2, 3, 11, 2, -14, 5, 0, -13, 2, 4, -1, -4, -2, 0, 0, -2, 5, -2, -9, -19, 3, -12, -12, -2, 2, -3, -5, -7, 2, -6, -10, -22, -12, -14, -5, -8, -9, -16, -10, -10, 5, 15, 0, 10, -2, 2, -11, -7, -7, -1, -2, 7, -3, 11, 6, 3, 14, 5]
7173Ejj4J2pj2kPJ2j2PJ2kMj0lqkMlrkJ5jLLPjJOj2Lj2J2ko%JJ0J3MnOj2lmjM
7220Ekj0lJ3%j1jQmnjJ0j3%Nl%kPQpLjJ1j4qNJ1oJLnm%J5%lmJ5j2j0J4JNolRj5
7268dPqMOj9KMoLMnj2QjpJ0KPKkmKJ1klj0lJj2J2K3Kj7J4LMj4Qj4lkoKmQJ4kJ0
7316A3lJKj2rm%oqJ0J5jJOL%j1lkMj9LKJ0j1PJ4J0J3qllj4rOm%J1N%pK3rPoqM
7363A0j8mOm%J8j2LQKpLLk6QlKq%PnkK2KnJMlj0LmRj0jK2Kmj0J2Ok2K%nlJ1Mp
7411cLPj0oN%ljkj1J6l%j3QJ1lj5J2Jj1J0jJmNOKk3J6J7j3kRQj3KKQj0pKJ9j7
7455aKMqjJ7kj3mJ9j1j8QlkmL%lOJ2oLKJ9k3%npkqK4rNQPj0J0Oopj5J2mlOKOJ
7503GJ0knKpnJjk0mNJ0jJJ0mPqRj5nR%k0jJ7NPlJ0KoRLj2pj0J8j7%NJ2j0QJ6j1
$$ y = [5, 4, -10, 2, -5, -17, -19, -12, 0, -12, -5, 7, 5, 9, -1, -4, -12, -14, -10, -13, -22, -24, -9, -10, -7, -4, 3, 2, 3, 9, -3, 0, -12, 0, -2, -8, -8, -7, 3, 16, 20, 15, 21, 9, 6, 2, 1, 5, 3, -7, -10, 3, 3, -8, -9, -1, -5, -10, -11, -1, -14, -14, -9, -12, -12, -14, -7, 1, -6, -3, -4, 7, -7, -15, -10, 1, -5, -4, -1, -6, -10, -10, 5, 5, 2, -2, 13, 1, -9, 5, 6, 11, 5, 2, 11, -4, 3, -5, -1, 5, -14, -12, -8, -14, -11, -7, -12, -24, -16, -17, -24, -14, -12, -5, -3, -5, -9, -7, 4, 2, -1, -11, -14, -13, -25, -13, 10, 12, -5, 9, 12, 16, 2, 10, -4, -7, -9, -15, -13, -17, -9, 5, 3, 13, 10, 11, 13, 1, -8, -12, -12, -18, -26, -16, -1, -2, -1, 5, 8, 8, -3, -6, -8, -4, -23, -20, -18, -8, -19, -12, 2, 12, 25, 17, 14, 11, -3, -12, -6, -10, -10, 1, 6, 6, -1, 22, 13, 20, 14, 6, 10, -8, -12, -6, -10, -10, 8, -4, -1, 7, 9, 2, 5, 8, -18, -10, -13, -11, -19, -19, -12, -17, -19, 3, 5, 0, 1, 5, 2, -8, -5, -9, 0, -10, -11, 11, 13, 9, -1, 11, 17, -5, -3, -3, -8, -11, 0, 4, -3, 0, 7, -3, -9, -4, -4, -7, -8, -10, -21, -5, -8, -8, -21, -13, -2, -5, -20, -8, -7, -18, -8, -9, -8, -12, -7, -1, 1, -22, -6, 11, -2, -4, 5, 13, 0, 2, 4, 12, 2, -5, -3, 16, -1, 1, 5, -3, -4, 13, 11, -2, -6, 13, 2, -16, -8, -11, -13, -17, -14, -14, -17, -11, 1, -5, -2, 0, 19, -4, -4, -9, -16, -18, -26, -2, -11, -6, 2, 9, -1, 9, 15, 9, 2, -13, -1, -5, -8, -2, 0, 6, 7, 17, 15, 10, 12, 5, 0, 1, 0, -20, -24, -19, -9, -10, -9, 1, -3, 4, -4, 5, -10, -15, -6, -6, -26, -27, -10, -5, 2, -1, 9, 11, 5, 14, 17, 5, -2, -12, 6, -11, -11, -6, 6, -4, 4, 20, 9]
7549IJj0MqlMj3PjLlNJOKoMj0j6QJnmJ6j0J1%J1k%j1J2j0rJ2LJ0j3J2J2k2K1k
7592A7j0Lj4PqoRLpJ2KJ0j0PnqlJrm%JKLJ3pkMQqqJ1oj9JJ2j2K7j3J1jJNJ5j4
7637A1qlJ%lJ0jkpJ6qkJ%j4mNprJ1J1pMPlLjPonmQnj4J4Pj4R%O%j6J8ojJ1pqN
7686@J7j0Jj%NrPrRj1J2jrqJ5qmJOj3mPPQrJ3j5nKnmQPmNoJ7j1Qm%rMLLrOJlO
7737GNJk0J1J0k1KKMj1RPkokQJrjJ0j3j1kLPmRjPPm%oNlmPqKJ3Mj0NmJ5k3J2m
7785DnqmPRmj0L5k0lJ5Kpj4KmnrkPRQKj1J1ompQoJmj2K7mKPmQ%rj%Lj0MJlmMN
7836AJ3rmnJ1j1j2LJ3jkPj1NJ4%oj2%Kj3J5jKmrQQjJ3j9RPj4rRJOKJ2j8QL%LK
7882A6j2J3j2kKJompLK2k1NmmmQmMOj4LOoMrJ2JnJ2jjjrOoMOnOOqJkJ5Lj0%Rj1
$$ y = [9, 10, 0, 4, -4, -7, -3, -16, -9, -10, -7, -10, -5, -4, 2, 4, -2, 2, -8, -24, -16, -15, -20, -24, -8, -18, -7, -7, 4, 2, 2, -9, 3, -7, -16, -4, -1, 9, -4, 8, 20, -2, 19, 17, 7, 10, -4, 3, -5, -11, -2, 1, -6, 6, 8, 18, 8, 15, 10, 2, -1, 0, -9, -13, -13, -12, -10, -7, 6, -1, -3, 1, 9, 1, -7, 4, -2, -21, -20, -8, -20, 7, -6, 5, 4, 5, 10, 25, 11, 3, 0, 1, 1, -2, 8, 7, 5, -2, 14, 6, 4, 5, 5, -9, -13, -8, -15, -24, -13, -2, -9, -5, 2, -1, 2, 1, 8, 2, -3, -7, 1, -4, -18, -4, 3, -11, -2, -2, 4, 4, -12, 6, 0, -1, 10, 3, -5, 0, 17, 7, 8, 7, 7, 12, 3, 10, 1, 10, -1, 11, 10, 1, -7, 8, 0, -4, -3, 3, -10, -14, -7, 0, 8, -1, 12, -3, -8, -6, -11, -15, -7, 0, -4, 1, -5, 12, 1, 9, 5, 5, -4, 0, 3, 6, -3, 3, 4, 1, 7, 12, 13, -7, 4, 14, -7, -5, -3, 1, -10, -1, 6, 4, -2, -4, 4, 5, -4, -5, 5, -8, -19, -21, -18, -11, -15, -6, -7, 0, 7, 3, 3, -3, 2, -1, -5, 2, -6, -4, 9, 13, 3, 8, 4, 19, -4, 8, 4, -1, -9, -13, -6, 3, -1, -11, 24, 4, 1, 16, 18, 11, -3, -1, -5, -10, -19, -21, -14, -5, 3, 5, -6, 5, -1, -5, -12, -4, -10, -9, -13, -25, 2, -2, 0, 7, 3, 11, 11, 2, 1, 1, 4, -6, -2, -1, -4, -8, -4, 1, 14, 5, 1, -4, 7, -4, -16, -13, 0, -1, -3, 4, -7, -2, 12, 12, 6, -6, -6, -4, -17, -2, -3, -1, -5, -14, -6, 2, 1, 14, -5, 4, 11, -3, -12, -3, -2, 4, 6, 18, 0, 8, 11, 11, 14, 16, 4, 17, 5, 3, 5, 6, 0, -4, -11, -8, 14, -7, -2, -6, -10, -14, -6, -10, -6, 0, -14, -11, -5, -11, -7, -16, -4, -3, -8, 4, 3, 2, 1, -8, -2, -8, -4, 2, -3, 3, 9, 1, 2, 0, 15, 18, 8, 8, 17, 6]
7932FpJ4j3KLlNPj4PJmj1Oj0NlmJJ2oLR%j1JJ0j2r%K0poMJ0oNkJ6j6jJJpOmKo
7980eJ1qMkNnPorL%M%j2jJ5rkJ0j0lOMqonJ3%L%OJrJ7jmpQJ0j5KJ2nj0LMkOMn
8030IpJoNnLKrQ%mnJ4jj8LMj3OkOoRnKO%lJ1lqKMnJ0j1K2k4K0lNj0kjJ0poJ1k0
8079a1J0koOMJLrMjnkPo%KJpJ1nlLPLk0RRoqMO%K%J8kj0J2KomPj3jJ3j9J0L%o
8129ELLpoP%mj3NJO%j0QlQj1%%J5rjk%PKKOrjmKMJoJ3oOj4J7j7J1nkJ2mjQj4p
8179dkjJ0j3JLlQrLNM
$$ y = [6, -1, 13, 0, 2, 5, 2, 7, 14, 0, 7, 8, 4, -7, -1, -11, -6, -9, -13, -12, 0, -6, -3, 6, 6, -5, -4, 6, -6, -15, -15, 5, -2, -8, -4, 6, 0, 5, 3, 19, 3, 2, 3, 4, -3, 3, -1, 1, -5, 6, -2, 2, 0, 5, 0, 7, 1, -8, -5, -5, -1, -1, -13, -14, 1, -8, -10, 0, -10, -13, -7, -3, -11, -17, -22, -9, -9, -6, -6, 0, 1, -8, 9, 8, 4, -3, 5, 15, 0, 2, 14, 9, -1, 2, 6, 4, 10, 14, 9, 2, 3, -3, 2, -3, 0, 2, -7, 1, 1, -3, -8, 6, 5, -13, -10, -6, -19, -13, -15, -9, -15, -6, -11, -9, -3, -3, -6, 5, 2, -6, -4, 0, -5, 5, -6, 16, -8, 12, 9, 14, 4, 2, 1, 11, 4, -2, 9, -11, -1, -3, -9, -3, 1, 2, 5, -4, 0, -1, -6, -8, -1, -7, -7, -5, -4, -11, 0, -5, -8, -5, 2, 5, -15, -6, 3, -3, -11, -7, -1, -1, 1, 1, 19, 17, 7, 19, 21, 15, 11, 18, 5, 4, 17, -2, 8, 11, 11, 5, 8, 11, 4, -2, 5, 5, 1, -12, -7, -6, 0, 0, -10, -2, -5, 3, -8, -8, -8, 7, -2, -3, -5, -5, 2, 4, 6, 12, 3, 2, -2, 0, 4, 5, -1, 12, 6, 12, -2, 15, -2, 9, 4, 2, 14, 10, 9, 17, 3, -4, -6, -7, 3, -10, -9, -6, -9, -1, -10, -7, -2, 2]
8191B
$$ Imaginary data points
##PAGE= N=2
##DATA TABLE= (X++(I..I)), XYDATA
0@%%%%%%%%%%%%%qJ6j6J6j6K4l2L3m1M9n7P2q3R3j08J25j48J70j94K21k47K80
35A49l18L56l99M48n02N60o21O90p66Q47r36J034j141J257j384J525j680J852
53I71k041K252k492K765l074L430l848M346m949N698o659P941r750J2516j7304
68a0198K7875r1644M9109J46047j68173o1822J51560Q5406j31174l9990Q8941
79D5937P574r2153R659N0158l2655l7791O3337M0439m3764k1272N3906K2677m0233
92B5819m2901k850K1164J0271m6320m8815M8559Q4329l9227q5778N8982J11147
104I4380n6057j11824N2022R0623p1654q4290P0128N8768p1816j7757R6739P947
116E7209q8463K7841R7692n0351j09730M7874R1320o6260r4615N7711Q3192m2370
$$ y = [0, 0, 0, 0, 0, 0, 0, 0, 0, 0, 0, 0, 0, 0, -8, 8, -8, 8, -8, 16, -16, 17, -24, 25, -32, 40, -43, 50, -58, 67, -81, 89, -105, 116, -131, 149, -169, 187, -212, 236, -266, 294, -327, 363, -403, 444, -492, 542, -599, 658, -726, 799, -881, 971, -1070, 1182, -1310, 1455, -1619, 1811, -2037, 2309, -2640, 3058, -3601, 4340, -5410, 7106, -10198, 17677, -73967, -24858, 121189, -46984, -108806, 42754, 128160, -3014, -43004, 45937, 53511, -38642, -28983, 21175, -11480, -49271, 14066, 54505, 10741, -10531, 43375, 66052, 25819, -17082, -19932, 1232, 11503, -34817, -83632, -35073, 49256, 10029, -75749, -16767, 94380, 38323, -73501, -21479, 69144, -2510, -86800, -16672, 42096, -29720, -47477, 49262, 57209, -31254, -3413, 94279, 43928, -65802, -17928, 73392, 7132, -87483, -29772, 53420, 11050]
128A1050n8281L8337M8051j8170k9442j757M737N383j346k2272q740K9988J5260
141A2798k2884J085L1304n238k3104K1096J3542m5285j4002N6380K634p3245N010
154c9909Q7714n339q7040J4489Q7462j9579q3084J8377O4312k7588n2077K9347
166a2915L5217k9060j3447L6021K783l4170Q874L1839j8280l2721J6368K5657
178A6166j3808j7757R867J3771L187k747j2339n750J9848Q052l2952j5950L6689
191F277J6143l8843j0569M3920R664l8169O67L4533j2130l2675J7996K2428l0698
204a1456j7903L8909J4817l9778n438M5519M172m3038k636L4586m407l2617J263
217a8007K0964k595j0066O468O814m48M820K210q897k109P297n283j2149L758
$$ y = [11050, -47231, -8894, 39157, 20987, -8455, -10212, -5475, -92, -1438, -23710, -32450, -2462, 12798, -10086, -9001, 22303, 17065, -6039, 15057, 28599, -16686, -30688, 25692, 28326, -44919, -39909, 47805, 42466, -44574, -30085, 57377, 37798, -45286, -26909, 37403, 9815, -42262, -12915, 22302, -6758, -20205, 15816, 18599, -15571, -6697, 25142, 6862, -25859, -9491, 16166, 2358, -15399, -5532, 8239, 11426, 8679, -3660, -9410, 10438, 18490, -14462, -30412, 6277, 22420, -16423, -26992, 16928, 26592, -11577, -10910, 23623, 11493, -21182, -3186, 19242, -11456, -29359, 9550, 24367, -15411, -20849, 24670, 28842, -14196, -16832, 17754, 13347, -19270, -18007, 2957, 362, -9704, -3236, 3578, 3130, 7950, 10160, 1263, -846, 6451, 1168, -10981, -7223]
231g223O889p154l57J4306M6j1712J0313J6503j5676j9725J6268J4351k5184j7667
245b6022K4138J4300k2749o961K6546P662j9736k6J7449n916j7272N208Q755j2271
259f895q321J2967O828r721q4J3373K993p911j107L502k092m524l392l663Q69
274g178N128j422m503P246J0842l924p085P531O097j1271q348P502J141j2454
288a0698r89J2592K64q842O748J3242m418r668O221O616j0335r733N219L485p596
303g892k643P981M465j889K084N232L75k584j063j852l696k475j699j746J099
318f303L095J200J827N406L040k591r62K358l170p923j820K602l020m186M680
333e767P005k19m02O166L587m634l476J391k420o933k222K578j6j129L645N506
$$ y = [-7223, -334, -7488, -7845, 6461, 6507, -5205, 5108, 21611, 5935, -13790, 2478, 16829, -8355, -26022, -1884, 12416, -10333, -17294, 9252, 16914, -2822, -2848, 14601, 8685, -8587, -3379, 5376, -6895, -15216, -2249, 4579, -5142, -5226, 8147, 11140, 3229, 2122, 5624, 3532, -992, -4384, -8047, -7178, -2050, -3472, -7975, -729, 10113, 6189, -896, 6635, 12732, 1461, -6887, 615, 1756, -10698, -11687, 905, 1169, -7673, -925, 12317, 7899, -1769, 4452, 11068, 733, -9000, -3781, -296, -7892, -10535, -2554, 1911, 22, 2106, 7338, 7713, 5129, 4066, 2214, -1482, -3957, -5656, -7402, -6303, -3208, -2008, -181, 5225, 8265, 5674, 4712, 7070, 3900, -4023, -5843, -3241, -6261, -10447, -5767, 1238, 1019, 617, 6783, 10370, 5736, 2260, 3651, 1231, -5702, -7924, -5346, -5362, -6491, -2846, 2660]
349B660J904M44J777M83k485l288k918k686j722p37j34J832M008L003J102K219
365E462K547j501l962j558j049m211l441J476K247k26J768N217K784q33M79J184
381F383k701m404j508p82k673r40K728K225P67K669L298J79j289p6j225l622k242
398c213o0j068r70K248L021O14J078L026N63k570j073J91k752l308N44J366j065
415c428N63L968J899j192R27K069k117l749LM97k922j475K869J978p32J544L159
432C861k49j734O06m80l647j434J714r42k203K724M147r48j262L505J425m309
448G74k223K042j749m489J212L792j432j132N414L531l515j231M110q20o504j341
464c561L175j628l253K734M038l48O12L502j91l161K71K17n059l659K400Q00l157
$$ y = [2660, 4564, 5008, 6785, 7268, 4783, 1495, -1423, -4109, -5831, -6568, -6702, -4870, -862, 2141, 3243, 5462, 8009, 6508, 2546, 988, -61, -4272, -7713, -6237, -3990, -4216, -2448, 2769, 5553, 4720, 5199, 6383, 3682, -722, -2230, -3012, -5685, -6625, -3897, -1672, -905, 1764, 5062, 5241, 3952, 3876, 2651, -971, -3213, -3273, -4341, -5311, -3063, -42, 572, 1650, 4676, 5239, 2669, 1596, 1787, -965, -4273, -3729, -2363, -3428, -2865, 1103, 3002, 1810, 2737, 4806, 2689, -1060, -1057, -560, -3482, -4957, -2088, -110, -842, 702, 3861, 3612, 1878, 2484, 2004, -1643, -3077, -1363, -2305, -4508, -1784, 2363, 1415, 153, 3658, 5083, 774, -1449, 593, -1156, -5645, -4433, -641, -2073, -3205, 2209, 5740, 2225, 994, 5104, 4284, -2220, -3561, -386, -2014, -5267, -2533, 1505, 1157, 1769, 5271, 5080, 1919, 2190, 2407, -2652, -6311, -3911, -3111, -6268]
481f268J389N673J175j215L144J908m105j951K446l042o441K251O029k778l444
496e229P643P136m531l425N807J017q442l230L352k968n630L446M867l180n74
511c941P979K521o648r76N350k656q018k02L637j823j267M240K619K32M473L452
527H972m188k353M675j083r350j865O316j300o142L614O908k165k207N421L81
542E634p582l03N092n907r077N228P914n978n076R903P621o043k723P120Q59o732
558e0k43K839m422k571N958J420n952K363Q962j709p602K566N165n382o060K434
574b284N86m229J516M060l315j509Q173K711q707j042R622q44j0834P48Q794k427
590A019o468M674N302m057m60O404j885p083L966O024p733p423P599N543q490
$$ y = [-6268, -4879, 794, 1969, 754, 3898, 5806, 1701, -250, 2196, -846, -7287, -5036, 993, -1785, -5229, 2414, 9550, 5019, 1594, 7401, 8418, -24, -3254, 98, -2870, -8500, -5054, -187, -3367, -3941, 4038, 6559, -89, -1065, 4285, 1629, -6389, -6591, -2954, -4777, -6044, -1804, 815, 1047, 5520, 8972, 4784, 2431, 7106, 6023, -3327, -5192, 1124, -176, -6318, -2704, 4204, 2039, -168, 5253, 5634, -1948, -2251, 2841, -3066, -12143, -6915, 999, -4979, -10055, -152, 7469, 1426, -1297, 5823, 6682, -50, -293, 2546, -1876, -4447, 1511, 2931, -3021, -658, 8304, 6595, -1007, 1559, 6724, 1342, -4718, -2284, -1698, -5927, -4411, -351, -3666, -5175, 2998, 5709, -2998, -4040, 5582, 4738, -6096, -5348, 3446, 1019, -5449, -775, 4527, 470, 10, 6414, 4529, -2554, 1412, 7436, -297, -7720, -121, 5422, -3068]
605c068m066Q479K892o436OM964k454l102M212J08o669J649P856l135p746N187
621a323Q105n206o158N758L986n744j641M688j879m197M667L007p151j719R167
636D360P06j0001M58R784j680q715K555O600l505l858M345R10m818K200N064m826
652d21m968O765M467p902l521Q163K261p447o23N988j305m128L087J724m838O22
668b076O193k608o760M468O992n582o351O107M845o322l162N691P07m963J764
683a057L933m005k510O123J337p295q7P927r97p659J917O675k544m864L206K895
699B995l389l56L469k010l416L806K662n649k370O010J053o426k40N635j014m409
715c649K418L008l246p95M548p43m875K711N283l815m859M990M466n116l089N382
$$ y = [-3068, -7134, 1345, 4237, -2199, -2193, 2771, 317, -2785, 1427, 1535, -5134, -3485, 4371, 1236, -6510, -1323, 6782, 1576, -4582, 1176, 5162, -582, -2223, 2465, 586, -3611, 1056, 4063, -3088, -4807, 4360, 5066, -4935, -4477, 5307, 3627, -5088, -2533, 4067, 562, -3296, 1049, 1959, -2859, -659, 4405, -421, -5389, 1376, 5843, -2059, -5580, 2583, 4844, -2603, -3226, 2762, 1457, -2671, 416, 2140, -2698, -2076, 4117, 1509, -5251, -783, 6209, 627, -5724, 383, 5228, -1094, -4256, 1435, 2142, -2821, -1057, 2876, -1129, -3639, 2484, 3821, -3474, -3561, 4366, 3369, -4290, -2373, 4302, 1758, -3106, 100, 2995, -394, -750, 2719, 709, -2707, 1099, 3761, -1888, -4258, 1752, 2805, -3621, -3861, 1774, 760, -3649, -1231, 1777, -1469, -2264, 2284, 1541, -3334, -623, 4660, 845, -4014, 976, 5442, 326, -2763, 2619]
731B619J948m842m97L831j528l532K146J564m076j212M230j28m557J045M492j435
747F8l518K117K552k245j148K360q8j802K016K186k327o91M032P64l956J02L825
764D247j358m172J153K535k697k248K710Q34l200K71L316j443l476J897K701k993
780a923k587L034K018k677n30L403R05j723R04J963j046j068J391Rk150J65J796
797A884r73j648J461J381j635q89J492k92k192J00J054j586j388J807J027j888
813b285L1K925L54k198O85K415r02k165J072J570j410r87J754Q00j297J84J544
830B090m52j457M68N77j418j040P58J16j032J75J000j96l15Q99K85r51J14R18
848E39p20j163Q81J029j053n71J666P82j343j26J543j90j644J86J106q75j277
$$ y = [2619, 4567, -275, -772, 3059, 1531, -2001, 145, 1709, -2367, -3579, 651, 523, -4034, -2989, 1503, 68, -3450, -1333, 1219, -1026, -2174, 186, 98, -1704, 312, 2498, 171, -520, 3512, 4276, 320, 422, 4247, 2889, -1283, -130, 2405, -292, -2540, 170, 1004, -2196, -1925, 1391, -52, -3528, -1631, 1070, -1923, -4510, -1476, 542, -2135, -2665, 738, 1643, -80, 824, 2787, 1741, 673, 2064, 2073, -77, 88, 1884, 911, -737, 724, 2105, 470, -419, 1073, 781, -1411, -1311, -257, -1843, -3231, -1424, -397, -2285, -2254, 671, 1025, -1173, -488, 1927, 1025, -1140, -68, 1502, 92, -895, 859, 1659, 362, 546, 2090, 1638, 181, 649, 1226, -192, -1232, -474, -358, -1390, -1215, -215, -411, -726, 173, 458, -493, -379, 539, -181, -1344, -463, 566, -487, -1058, 608, 1390, 47, -79, 1464, 1274, -370, -184, 922, 47, -1230]
865a230Q90R36r87m99J303M87j106j43R78j99j017J10N63l44l63M53K56j39K51
884B00K85l03p6M32k86p35K83N26o69n16R14M88r52j32J244Jj295K20J231n91
904B69j292P26J143q82r04J108Q53j050n34J062L08j074k30Q06n0p29P3N15m5
923G3k55Q6J52Q1L9k46j73L96J58o63j72Q88Q9j009J19J205k80j258N04J247p81
944B00j226R68J090j190r13J351P27j385m87J407K76j343j06J181o6j039J23Q24
962C92j13o14Q0M42P1k99k46K47M77k58p25L53R51n45j140P86J265j090j305J382
982A11J269j673j136J927R24k099o52K211L43k243n0K160k69k010N21J774o63
999D45j480P35J236o93r54N44P16l17n71rN32L41n38o65P13R43r32j187J250J244
$$ y = [-1230, -340, 596, -391, -890, 413, 900, -206, -349, 629, 430, -587, -477, 86, -258, -621, -168, 88, -51, 200, 485, 182, 106, 538, 252, -483, -200, 326, -343, -859, 55, 543, -409, -541, 703, 704, -591, -371, 860, 269, -1023, -297, 846, -36, -940, 168, 1021, -29, -563, 499, 807, -267, -497, 309, 259, -470, -397, 118, 73, -182, -96, 56, 137, 176, -70, -243, 153, 311, -352, -524, 364, 453, -556, -437, 768, 488, -770, -266, 981, 200, -1026, -58, 1032, -158, -1071, 280, 1007, -378, -865, 542, 818, -525, -631, 550, 484, -555, -432, 392, 279, -335, -255, 187, 258, -41, -287, -40, 437, 179, -546, -193, 758, 213, -927, -141, 1124, 34, -1271, 111, 1380, -293, -1429, 498, 1422, -677, -1329, 882, 1225, -1018, -1068, 1092, 823, -1187, -666, 1108, 445, -1035, -300, 936, 243, -711, -167, 549, 232, -339, -348, 184, 525, -13, -678, 35, 978, 46, -1141, 109, 1353]
1019A353j654j259J993J117k421q22K769M89k975j7L150m25l167Q91L006j314
1035G14k769J604K402j806j942J895J499j790j048J621O31j321l89R08K02n06
1051i5k26J02M16L07o97n83J182P57j703q27K222O57k749m42L186R3l496M54L660
1070B218r68l614J525L371k095l077K535K519k879j937L108J359l070o99K931
1085A227K48k606J46K112l83j592M03R86k41l85j0q9M55M21j010o37J495N23k097
1104a034l38K558p8k872P09L145j328l111K042K988k725k714L266K235l722j642
1120b621L953J038l927l60L753k36l413P27K787j189k208J370J527j384p98J306
1136C25L16q72J88M38m27J50M49q30l33J425l1j938N38K355j150k577J726K481
$$ y = [1353, -301, -1560, 433, 1550, -871, -1693, 1076, 1565, -1410, -1427, 1723, 1298, -1869, -978, 2028, 714, -2055, -451, 1951, 145, -1797, 98, 1597, -193, -1241, 380, 1011, -310, -699, 209, 411, -95, -321, -219, 197, 504, -193, -776, 406, 1163, -540, -1367, 855, 1512, -1237, -1679, 1507, 1600, -1896, -1442, 2218, 1250, -2364, -839, 2532, 437, -2640, -105, 2414, -465, -2402, 706, 2065, -1005, -1704, 1227, 1475, -1131, -985, 1127, 744, -848, -445, 541, 300, -85, -95, -184, 271, 692, -318, -955, 540, 1063, -1034, -1372, 1186, 1108, -1764, -1055, 2090, 762, -2349, -307, 2681, -44, -2758, 508, 2743, -979, -2621, 1332, 2370, -1557, -1917, 1836, 1600, -1813, -1086, 1701, 512, -1696, -326, 1201, -183, -981, 325, 641, -231, -43, 395, -32, 118, 567, -263, -596, 829, 798, -1140, -602, 1753, 603, -1974, -248, 2233]
1154B233k486k424K889J886l457j340L731P22l718J55L783p32l369J511L028j923
1170D89k395K324J846k329j087K341N72j974o9J431m96j066M21J14p82K37L93
1187c0r97j94J378k55j640Q73J774j371j588K060J430k411p36L088N03k978M94
1204f00L373q55l077J530K741k156k502K235J637k717j290K431L87k497l6J922
1220E26o83j714Q00R75j081m80J099J06o47P13P32n97K04J233l68r59J136R91
1238A986j536o87J947K66k293R3K281q00k500R74J922j863k021J781J213k372
1254a609q97K352L71k226L17K275n08j698J134J567j079q42J425O20j048R4J116
1271A364k83o36O40K17r35KO80p77r43P96L85j376k96J382k26j565N80J463j025
$$ y = [2233, -253, -2677, 212, 2098, -1359, -2699, 1032, 1754, -1964, -1809, 1974, 1242, -2127, -616, 2412, 489, -1906, 418, 2264, -65, -1152, 1189, 1761, -213, -282, 1149, 653, -413, 8, 122, -660, -423, -30, -1027, -1221, 157, -98, -1738, -865, 909, -462, -2050, 10, 1440, -971, -1707, 1381, 1884, -1094, -600, 2773, 1918, -1159, 371, 3112, 956, -1546, 689, 2326, -391, -1681, 750, 1137, -1360, -1396, 526, -157, -1871, -1071, -96, -1177, -1657, -558, -452, -1099, -386, 346, -251, -47, 1186, 818, -141, 995, 1986, 450, -237, 1710, 1976, -317, -224, 2057, 1257, -1243, -269, 1653, -210, -2231, -450, 763, -1609, -2506, -154, 217, -2009, -1692, 583, 75, -1623, -489, 1078, -1, -843, 582, 1202, 154, 248, 1364, 1081, 445, 1085, 1302, 367, 369, 1049, 272, -671, 125, 510, -866, -1162, 220, -6, -1571, -991, 472, -553]
1290e53j293J418J086j561n72J966M40j718K71J922m11j517Q47J286j103r76J141
1307F73M81j316j93J111k80j045M69O67q09n00P72K9q77K22P69n13n22Q63L84
1326C85q85O2J083k80r68O16Q67q68o68J076M04j157r9J202k23j167M63R51p88
1345Fq04Q91M94j044k28J086l5r65L65Q54n24o15O98L59p95r4P69j66o94L82N52
1366D92n55l66O56J21p37P6O60l55n87N36M39o63k05Q07L7p73K34P85m21o54O02
1387A29M93p27k99Q01O6q08J40P64l72o77M87M98o48l67O62J30o91O7O11k07m83
1408d31L80L54m40j56M97Lm55J96L96l35k24M38R9m93J01M78k92m54M17L31n87
1429a77k33O60M7p05J06P02k54o48M14N27n09m02O10K53o20q3O22p4n43K02M39
$$ y = [-553, -1846, -428, 658, -903, -1475, 491, 931, -787, -516, 1406, 995, -522, 325, 1611, 508, -468, 673, 1154, -162, -355, 756, 476, -569, -100, 567, -242, -742, 30, 59, -818, -596, 173, -340, -862, 1, 385, -500, -438, 645, 365, -603, 13, 880, 12, -656, 420, 824, -333, -432, 770, 547, -620, -157, 794, 6, -798, 93, 587, -457, -685, 401, 366, -599, -234, 620, 96, -519, 179, 538, -257, -351, 418, 252, -442, -60, 492, -63, -429, 227, 348, -389, -313, 347, -8, -595, -59, 380, -283, -488, 319, 356, -417, -183, 602, 181, -473, 129, 622, -105, -404, 397, 463, -345, -205, 559, 187, -490, -3, 495, -153, -520, 142, 272, -419, -352, 259, 52, -431, -51, 303, -137, -293, 204, 207, -248, -52, 344, 9, -215, 223, 322, -171, -70, 408, 116, -338, 79, 410, -177, -410, 250, 297, -408, -302, 400, 146, -502, -88, 439, -70, -472, 138, 391, -229, -312, 310, 236, -307, -105, 334]
1450C34k74l17L21J63l50j6K91j05k37K19J29k99QL39j20l35K66K92l82k03M63
1471A87P9n15O2N21k02m80L22M28m29l28M93K01n36r9N14o2m81J78L94k63k62
1492b78L33J60l51LL43j21k89K33J93l16p7L42k8l37J58L21k75k60L65J46m36
1513a71o0M36p2m24J58M05k53k87L30K05l56q3L35m5l04J26K32k28j49L05L3k68
1535a35P5K87j98k23K96J16l73k9M09r3m40K30M13l32l38M36K49m93j47N07lm95
1557b81J02M55j94l62K73K76l12j55L12M5k93N7K23j53j31J93K8k15R0K15k05
1578c2j56L03Q5l88J2M28j44m22K54M03l81l29M80K47n55j18N91rn92J35N75k74
1600A13m81L65L56m02k53M33J09m10OL61j22k74J97J73k43n4K55o5k24J94J36
$$ y = [334, 60, -257, 64, 227, -123, -139, 152, 47, -190, 29, 158, -141, -133, 206, 86, -249, 17, 309, -73, -276, 187, 266, -249, -187, 334, 132, -348, -26, 402, -27, -355, 138, 339, -197, -296, 218, 156, -325, -147, 247, -16, -278, 55, 215, -136, -133, 210, 89, -200, 33, 226, -90, -167, 175, 147, -190, -32, 289, 14, -246, 119, 265, -171, -231, 205, 133, -291, -133, 272, 19, -268, 62, 267, -89, -172, 163, 118, -186, -60, 172, -56, -205, 100, 133, -135, -60, 227, 29, -194, 102, 218, -155, -184, 225, 132, -308, -78, 335, 3, -335, 101, 350, -143, -290, 217, 214, -281, -179, 276, 82, -280, -7, 269, -43, -198, 114, 159, -134, -77, 146, -7, -138, 55, 83, -132, -42, 173, -32, -188, 115, 200, -188, -176, 252, 108, -314, -60, 343, -38, -367, 113, 360, -195, -313, 278, 269, -323, -188, 387, 113, -368, -3, 353, -49, -302, 131, 240, -170, -164, 197, 75, -199, -2, 171, -72, -126, 129, 64, -160, 34, 170]
1621A70k70l3L34o3l71K01L65l36l33M58K16n55j28N80j4o09J68N97k92n01M23
1642GM23n05l04N52J55n71l1N46q8m58K18L88k74k27L21R2l36K2K50j79k16K36
1664B1P9k92M2L37j80k98L07K18m23j31M87j0n62J69N81k61n10M65M84n02l30
1685c09O14K04o63r2O21j00o22J92N36l15m15L78K92m24j86L96ql81P2K53j84
1706a41j37K29O0j94J30K51j88j39L42O4m09N3M29j85m35L18M13m30l18N45K05
1727D63o34j29O25r2p06J66N80l27n28M32M42m53k55N43J63m91k6M60j05l45J73
1748d4K74k16j08K59M6k09J04J59k07j04K42q9l31J26K83k81k71L94K04m55q8
1769c12N37l4n54J46N38k85n08L98M53m60l04N58K43n39o6N26m0n09J22L95k62
$$ y = [170, -100, -133, 201, 138, -233, -32, 333, -3, -336, 122, 338, -217, -345, 235, 221, -388, -220, 377, 85, -416, 7, 430, -75, -379, 173, 328, -243, -274, 272, 184, -274, -56, 332, 58, -169, 152, 244, -92, -70, 180, 1, -215, 21, 100, -192, -150, 187, 7, -291, 16, 234, -189, -320, 167, 157, -405, -236, 345, 84, -426, 39, 523, 21, -309, 305, 509, -154, -246, 375, 275, -347, -155, 381, 66, -349, 29, 321, -103, -289, 107, 99, -282, -210, 43, -141, -278, -49, 11, -183, -53, 198, 10, -129, 213, 277, -132, -79, 350, 165, -270, 48, 461, 31, -287, 258, 463, -171, -300, 325, 233, -473, -307, 273, -54, -582, -150, 292, -161, -416, 127, 290, -201, -227, 233, 128, -217, -44, 230, 14, -94, 165, 211, 2, 106, 265, 58, -46, 196, 107, -224, -98, 185, -96, -367, 27, 231, -224, -312, 225, 191, -363, -217, 321, 36, -472, -74, 379, -81, -385, 173, 416, -123, -189, 337, 297, -212, -90, 305, 43]
1790D3l15K64K07l16o2K90l0k18J15J51j78p3J94n0k07J42K09k36j44L59N6l80
1812a79L6M13j40m13K24L83l33l11L97K07m52r5M70k2m36J07M31j91l76K80K85
1833B85l19k03L39R2l28qK87q4k16J53J46j90m6K31l9k15Q7J80k09j22K38K1k44
1856a64O1K93j28k30K39K09l20j60L50J2l82RL68j15l20K06K96k31j84K80J26
1877B15l20n8K97n4l00J26K59j58j38K40J28k00rJ94q3k06P6R3k11q1J95oj90
1900a91J08K16j50j36J85R1k53q1K48n6k55J18K79j28j37K75J97k41p7K85k3l29
1922e5K6K20j56k41J78J69j85p1K42%k25L1J26j58k01J36N9j70jK61J0j12J80
1945F3J99j47r1J93K6k48k8J87r0j83J48K09j54r4K20N0k63n4J50j23k65O5J34
$$ y = [43, -272, -8, 199, -117, -179, 111, 81, -137, -22, 129, -49, -122, 72, 22, -185, -43, 166, -70, -214, 145, 201, -179, -143, 270, 130, -283, -59, 324, -9, -320, 77, 284, -168, -263, 207, 185, -251, -144, 287, 96, -280, 0, 285, -34, -237, 102, 194, -134, -142, 145, 61, -155, -2, 144, -46, -92, 139, 100, -115, -28, 152, -57, -179, 59, 80, -164, -103, 190, 62, -168, 71, 280, -40, -200, 150, 162, -220, -211, 157, 42, -278, -72, 224, -7, -191, 89, 215, -105, -163, 134, 80, -220, -94, 165, 7, -131, 109, 237, 37, 28, 222, 139, -67, 9, 102, -109, -190, 5, -1, -191, -83, 133, -17, -153, 32, 123, -130, -211, 37, -19, -274, -156, 123, -5, -142, 133, 330, 89, 12, 297, 274, -55, -29, 191, 35, -206, -28, 141, -44, -115, 127, 127, -98, -67, 59, -99, -300, -164, -105, -275, -276, -15, -5, -117, 63, 262, 115, 24, 217, 243, -5, -33, 154, 64, -119, 29, 238, 84, -10, 210, 260, -3, -57, 93, -30, -295, -230, -96]
1968i6j58q8K40J02j23O4K09o5j54J15P7j73r1J77K6j51J01K19o2j10J79R9k40
1991I7j09J42p1k68K4J76j18j29J81J67j30n5J63J7j82NJ09r9j14J12J03q4K4
2014c9J73Pq1O5O6j14q7Q9m7j71O2J23q9r4J80J07j67o9J97qk37J3J80q9j81J45
2040f6J70j47o5K01O3j81j9J66m5j62N2Q2o8p8J00M0o4KO5m6l2O7k1q1N5P5p6
2067a3o2J37L6j70KJ72m8j91Q9J86j32j59K00J27j91j02J98L3k36k4K06n0j87
2090a79J05J74q4q0J39P2j19m1O8m5j09K9K4m2M8R3k3j6J18J5j46k1J13r4k26
2115b27R5J59j37j02K51J55j98k2K57j7k95mJ90j42k57J28K32j40p5K36J47j43
2137I1l0J24m9j89k4K8j17l4J16J5mJ47Q9o6jJ21r2k28K9R9k02j54K52J42j77
$$ y = [-96, -254, -342, -102, 0, -123, -59, 150, 85, -69, 46, 123, -50, -141, 36, 62, -89, 12, 231, 169, 59, 238, 337, 97, -12, 130, 59, -209, -185, -9, -127, -256, -75, 92, -38, -93, 70, 87, -95, -90, 19, -80, -194, -82, 21, -63, -39, 134, 141, 60, 125, 191, 77, -10, 79, 32, -139, -77, 46, -43, -137, 43, 150, -17, -86, 111, 103, -134, -121, 59, -30, -211, -66, 104, -43, -108, 93, 156, -25, -44, 122, 77, -85, -33, 49, -19, -97, 3, 43, -21, -19, 46, 0, -32, 35, 14, -67, -12, 63, -13, -75, 62, 98, -72, -70, 102, 54, -137, -48, 138, 6, -153, 47, 174, -17, -119, 79, 112, -124, -148, 58, 8, -179, -74, 100, 16, -64, 75, 147, 28, -13, 55, 10, -99, -70, -46, -88, -40, 53, 30, 14, 132, 147, 1, -20, 93, -1, -227, -132, 27, -110, -212, 39, 194, -4, -26, 231, 214, -81, -85, 105, -37, -294, -166, 66, -74, -149, 87, 234, 91, 61, 185, 136, -53, -77, -49, -166, -200, -84, -69, -73, 74, 163, 97, 96, 217, 125, -103, -74, 25, -177, -331, -79, 63, -114]
2162a14LL55O1l00L5K39j90l33J03J82k09j66K88J77j61K3K66Kk26J3R3j80j60
2185a99P9Op7P6J27QL0J52j0j60M3Q6k28j91J79Q3k51j5L79N4k65J20L35j61l43
2210a43J52K07l17k47K69J67k90j2L96K2k51R4K31j57k28Q4Q4j86q4J46L0n3J08
2233B2O2n2L9J38j28j79J26Q3k63j04K78L6k63R7L38j16k61K36K17l37k07L42
2255A04R0m46l7M24ql67J18L91j47k68J96J59k32j23J96j6k08Q0J80j28r2J99
2277F5P8j79J0J50q8j17J19K1k18N1K65j68k45K35L00l05k35L81J64l82j20L75
2299A57Ll70Q4L01j82k34K78J93l37p2L77J8l83L4L38j18k73J05J67j52o1J58
2321C1m6j18J98R1k46l6L16ql49O3K91j38k54K03J74k41l0L21o5l23J78L33l14
$$ y = [-114, -111, 244, 305, 5, 40, 279, 89, -244, -141, 41, -168, -334, -46, 131, -30, -7, 259, 261, 35, 48, 141, -39, -199, -120, -114, -191, -115, 12, 20, 50, 202, 192, 32, 75, 161, -67, -258, -79, 4, -247, -262, 117, 171, -94, 26, 361, 200, -143, 9, 216, -101, -348, -79, 88, -202, -214, 182, 204, -47, 47, 278, 121, -107, -23, 61, -125, -209, -63, -33, -86, 22, 84, 32, 71, 209, 81, -98, 28, 111, -152, -256, 22, 58, -205, -108, 230, 114, -147, 89, 306, -31, -238, 104, 194, -252, -289, 135, 127, -240, -122, 269, 122, -146, 50, 209, -23, -146, 50, 34, -174, -94, 86, -42, -134, 65, 143, -36, -26, 124, 36, -81, 38, 59, -159, -108, 157, -11, -256, -21, 279, -26, -261, 120, 284, -98, -218, 157, 160, -210, -126, 175, -7, -241, 37, 230, -107, -179, 198, 216, -167, -133, 205, 87, -186, -81, 86, -66, -127, 31, -15, -133, 65, 156, -90, -126, 190, 182, -167, -104, 187, 49, -205, -2, 172, -69, -99, 222, 157, -166, 12, 345, 31]
2344C1l68L21K55m20k25L92J47l34k3L37k5j96J51J27k61l9K60n3l02J38L05j26
2366I2j85K29J88j96m7J52j36k04J39N0l81n1M15k8m03J36M64j35m01K17K84l14
2388a15k14K81N9l08J23L94j19k24L48L29l43k23L24Q5m29j41K37n1k11J06J29
2409C7j25M4K26j30k83J52J70l57k55L19J27k95N9M20K9j93K68K52k91j63L44
2430C55l3n05kM74j19m39K58M42k23k86K33J37l55j62J71j58k89J62K03j83m8
2451c67M14J29k54O6K87j15k55J20P5k35PK88p0j85L09K95l05k44L54P9n20j73
2473c00L62p2m41J29L81j49k01L27J84l07p5L18o0l99R7L22j66k22K70K37j55
2494H0m4K15j8j84N9N5k58o0K34o8k84J77L01j85k21K66J83l39j01K87m3l27J38
$$ y = [31, -337, -16, 239, -181, -406, -14, 133, -201, -224, 113, 88, -108, 43, 170, -91, -130, 130, 77, -225, -87, 218, 92, -93, 136, 324, 128, 81, 233, 97, -107, 32, 82, -299, -350, 65, 37, -366, -230, 234, 99, -302, -85, 199, -115, -329, -48, 11, -297, -174, 220, 101, -123, 225, 554, 211, -12, 312, 397, -32, -173, 64, 13, -198, -92, 37, -88, -44, 182, 52, -231, -79, 91, -266, -521, -202, -75, -370, -311, 109, 138, -55, 213, 465, 174, 11, 355, 322, -183, -185, 289, 170, -269, -11, 431, 208, -78, 155, 292, -63, -225, -54, -212, -501, -339, -136, -319, -367, 47, 176, -78, -12, 275, 160, -95, 25, 100, -135, -128, 160, 90, -95, 214, 509, 204, -40, 314, 393, -127, -300, 62, -10, -451, -322, 59, -90, -291, 36, 220, -87, -162, 156, 96, -303, -206, 116, -50, -272, -2, 235, 80, 36, 251, 233, 49, 108, 163, -95, -155, 79, 11, -273, -96, 205, 20, -201, 65, 248, -91, -192, 95, 52, -275, -137]
2517a37L11k16k25L63K17l72j40M09L4m32NL64j22l09J76K25j90j14K43Mk25P7
2539e4J87j53j48K04R5j95RK12n9j69J49P5k33m8K66n2l11J56L21k17k90K77K29
2562B51l46j88L33N5l50J1L45p4k42K12K42k28j21K73N4l41l3K71p8k31J54J75
2584A44j29m7J88j4j87P7Q5k13j49K12M6k53L3L05k8k05J73K02j99j59K00L8l16
2607a96K0K73r1k44K10K94j86j77K59J05k91q9J77n3k37R6J60j35m5K32N5k00
2629f3P4J88j27k29J34R3j99n7K35qj88J53K12j46j79K20J01l00j23K48Pk70O3
2652a61K49o1j64J86J44j76n6J69m0k26O2J59j39j07J72R9j45JJ65l6j61J00O6
2675A00j91p0J95qk23Q1K46r8j86J87J62k17j02K14Pk41M3K35j21k13J98K00k05
$$ y = [-137, 174, -42, -267, 96, 313, -59, -199, 210, 244, -188, -183, 181, 59, -250, -74, 151, -39, -153, 90, 94, -131, -54, 133, -20, -168, 36, 131, -64, -55, 157, 98, -71, 78, 153, -80, -128, 138, 86, -225, -69, 252, 35, -255, 22, 251, -95, -283, 50, 105, -245, -234, 111, 37, -205, 7, 249, 21, -100, 173, 227, -114, -147, 124, 46, -185, -31, 144, 15, -32, 156, 142, -45, 32, 117, -96, -245, -33, 13, -240, -207, 98, 70, -135, 38, 240, 41, -118, 82, 120, -196, -176, 97, 6, -238, -28, 266, 80, -97, 162, 267, -24, -113, 64, 11, -226, -130, 30, -105, -150, 82, 137, -63, 11, 199, 72, -157, -23, 70, -129, -186, 49, 41, -147, 6, 218, 72, -107, 113, 214, -86, -209, 39, 46, -224, -161, 88, 27, -137, 49, 193, 17, -39, 130, 90, -136, -74, 85, -54, -161, 11, 110, -35, -34, 131, 95, -66, 34, 100, -91, -161, 34, 26, -197, -116, 130, 32, -154, 33, 195, -22, -124, 90, 97, -144, -101, 134, 13, -200, -2, 198, -7]
2698gj44K58P3k42l8J99m4j83P5J05j07m4J55k1j33Q8J35j29r4J44N4j91J1J63
2722H3p5j56J57J23j92p6K45M1k83M4K64j01k63J35K10j88j71K29J08k32j1K57
2744A48o0k11J20J66j72j44J75P6j91l6J95k2j43J06J06j26m0J51n4j72R3J41
2766A06j76j01K07O4k17M4K37q9k21J62J73k27j66K44Q1k70k1L00j5k48J01K41
2788B09j67j85J93R1k24p3K01j5j70P7J80j01q5J33M4j62J6J19j16j22J58O5j81
2811a15NK42j1k17J10J89j72j74J80O1k47k0K64n6k46J62K74j89k11K31J48k85
2833g7j11K25K7k35N3K12q2q4J83P7j87j3J72q7k12R1J20j46p5J78K0j17Q5J31
2857A48j44j20J89L8l13m2L10k5l01J29L16r8k08K00J63k27r1K09n7k39J07K15
$$ y = [-7, -151, 107, 180, -62, -100, 99, 55, -128, -53, 52, -55, -99, 56, 35, -98, -10, 125, -4, -98, 46, 100, -91, -80, 83, 8, -148, 9, 132, -60, -136, 109, 150, -133, -89, 175, 74, -189, -54, 156, -32, -203, 26, 134, -98, -109, 148, 88, -123, -3, 163, -9, -153, 22, 98, -93, -129, 66, 44, -99, 7, 113, -13, -53, 98, 44, -128, -35, 106, -70, -171, 36, 100, -117, -73, 164, 75, -146, 16, 189, -38, -204, 40, 121, -149, -170, 130, 115, -133, -32, 209, 42, -143, 50, 141, -83, -156, 45, 30, -140, -63, 117, 16, -69, 64, 108, -54, -38, 81, -35, -157, 1, 66, -115, -110, 132, 121, -96, 14, 203, 31, -143, 37, 98, -149, -169, 95, 39, -207, -45, 229, 40, -171, 60, 208, -77, -188, 37, 64, -171, -118, 94, 12, -72, 111, 188, 1, -12, 160, 73, -139, -48, 72, -74, -149, 29, 49, -68, 17, 148, 4, -116, 73, 111, -202, -244, 66, 41, -260, -131, 185, 87, -121, 79, 242, 15, -76, 133, 76, -163, -56, 159]
2879A59j64j72K52J66k32j03K20Kk10j4R4j22o3J45oj50J42K23j39j69K09J43
2901B11k60j15K26J7j99P0J97j05j12K45Q8l04l7K98o6l85N2L00j31k69J68K12
2923A01j45p8J70oj53Q6J09j90r2K41N7k37J9K81k2j92J21J48j77p0J60o8k25
2946a62J23K02k06j80K80J86l16j30K93O1l00k5K30n5j84J37J21j56kK36m4k32
2968a23R6K08j45k14J78J31j91k7J66l3j21J16P2k09l8K64l8l04J05L02j31k68
2990b04J84K40k20j47K06O0k44M2K05j28j81K21J56k63q2K67N4l02J1K16p3j49
3012a31R3R7j17K7J56j01j54J96J30k70j02K62M1k96K7K72o7j93J56J48k11p2
3034a09K33ol10O2K91j35k72J83K63j82j52K13J09k14l6J56r3j30J09N5j76nK30
$$ y = [159, -5, -177, 75, 241, 9, -94, 126, 128, -82, -96, -2, -124, -187, -42, -48, -198, -56, 167, 28, -141, 68, 211, -49, -164, 62, 79, -120, -50, 147, 42, -70, 175, 263, -41, -78, 220, 154, -231, -179, 121, -10, -279, -111, 101, -44, -122, 48, 42, -111, -25, 84, -106, -198, 43, 100, -137, -118, 163, 141, -51, 70, 218, 41, -29, 131, 63, -162, -39, 163, -43, -223, 57, 243, -73, -203, 90, 151, -149, -174, 56, 1, -183, -46, 75, -81, -83, 153, 109, -123, -27, 181, 36, -178, 0, 131, -60, -87, 79, 46, -75, 41, 113, -96, -134, 130, 92, -212, -107, 195, 64, -204, -20, 220, 0, -147, 59, 119, -125, -83, 122, -6, -187, 34, 190, -73, -155, 112, 166, -136, -125, 91, 18, -131, -38, 59, -58, -31, 125, 24, -130, 66, 196, -74, -176, 86, 127, -169, -142, 130, 63, -130, 26, 174, -37, -109, 124, 118, -192, -130, 161, 26, -246, -63, 200, 18, -134, 79, 188, -26, -62, 94, 1, -129, -20, 35, -141, -146, 84]
3057H4l0j94R5K06j40j32J58M8j97jJ77r0j47J99J55k16p4L02O3l29oK53q8k85
3081a89R1J82j47j32J94P6j75M5J90j03k03J29J32k03j31K04O5j53N8J84k9n9
3103B6J55M3j77j2J51j20k18J03J54j60j06K12Q9j64j6J73r4k10P5Q0k13j06K46
3126h9O4j94P7L11Lj94J24J82j84j63J26J8k06L1K03n3j09J78J65j74j04J31k5
3149A18k54n9J00j10q0J36R7q1P6K17k7j71R7J06k17j40J43N0j58L7K59Oj10J69
3173B04J43j96j69J54l7k95n4K19m6j56J22K36n0r2J45L0j91n3P7j03j41J13J23
3196a7p7K5K06O7j12K8P0j28j34O1k2j75M4J93k3j15J70J90j56j44J46K7k66o4
3220b06J80k8j55J34K09p1p9J79O8k20q6J27n0j84K3J42k5l9J21P3o2K3N3j06
$$ y = [84, 54, -140, -45, 161, 21, -111, 47, 95, -102, -103, 74, -16, -163, 36, 191, -25, -99, 203, 266, -63, -69, 184, 96, -189, -98, 84, -63, -195, -1, 75, -100, -55, 135, 32, -171, -42, 90, -113, -244, -40, 25, -128, -70, 114, 85, 26, 181, 224, 47, 35, 186, 66, -152, -49, 105, -55, -161, 51, 140, -24, -40, 133, 39, -171, -96, -16, -229, -335, -89, -25, -219, -142, 169, 172, -22, 102, 284, 100, -63, 63, 81, -125, -94, 109, 56, -53, 125, 290, 116, 12, 143, 118, -136, -195, -95, -205, -285, -149, -52, -133, -57, 160, 133, -38, 59, 165, -52, -192, -49, 1, -157, -120, 139, 145, 35, 204, 347, 151, -18, 136, 99, -196, -250, -31, -77, -233, -111, 125, 75, -17, 128, 158, -33, -86, -9, -112, -253, -140, -17, -94, -69, 137, 204, 92, 120, 190, 62, -72, -11, -33, -208, -164, 29, 6, -109, 61, 251, 95, -49, 97, 124, -142, -206, -26, -54, -209, -75, 134, 63, -16, 163, 231, 11, -75, 52, 2, -182, -159, -17, -42, -81, 40, 113, 51, 74, 127, 21]
3244B1j15P3Qj59NJ88K0j00J34J38j09j00J16j4k36l0J85p0j73J34K49q4j51J74
3268A04J23k01j51J20j6j66MJ58rl8J40J00q2l0Q5p2j37mL0q3j1J19K8k7J19J01
3294B04j10q3R7k6k54l7J62m0j56J33K38o2r5J81J07k29r6J23m8k37J8K17l9j13
3318a45J61J93o0r5Q5J8j69q2K1o2m2P3N2nJ00J28m8n0P4l2j93m3Q9p2j42J18
3344a28J99p3o5K18J14k04j03J70m2k64j2J74n7j45J49J98o2o3J23P6j64q4O8
3367B3n9j20L3P1k4K6Q6M6k3M4J1j04l9M8n7j17N2J25p9n8J76R8j69k7J92m3k29
3394a17J7J62q7j69J03J89j00j00J67Q5j53m7J25j8j38J1P5l5o5P1N7m3K0L7k5
3419B2j7M4k7q1M4N3r2m9J20L3j18j0J70Kj74L5J63p2j63R9J10j26r7J52O9j59
$$ y = [21, -94, -21, -13, -172, -167, 21, 41, -59, 75, 213, 104, 4, 120, 106, -130, -160, 25, -45, -218, -84, 165, 81, -70, 104, 227, 26, -125, -5, -21, -187, -183, -25, -34, -72, 68, 168, 86, 56, 141, 69, -68, -72, -42, -125, -136, -17, 11, -16, 103, 204, 94, 11, 108, 82, -172, -209, -47, -87, -243, -110, 128, 66, -29, 152, 259, 30, -66, 57, 9, -228, -210, 7, -32, -145, 16, 209, 149, 54, 139, 157, -12, -94, -73, -135, -177, -104, -52, -57, 43, 171, 123, 73, 147, 115, -78, -121, -32, -104, -246, -128, 71, -2, -67, 151, 265, 61, -42, 128, 86, -178, -190, -16, -73, -218, -69, 129, 67, 4, 127, 203, 39, -45, 23, -36, -156, -123, -52, -76, -50, 36, 82, 59, 103, 114, 10, -29, 19, -38, -155, -103, 22, -57, -115, 61, 159, -10, -37, 155, 112, -117, -100, 62, -25, -194, -91, 98, -2, -102, 65, 150, -3, -50, 75, 57, -81, -70, 5, -30, -95, -24, 33, -10, 10, 47, 22, 5, 49, 22, -59, -15, 38, -54, -103, 17, 50, -68, -78, 92, 94, -80, -45, 118, 46, -117, -18, 92, -34, -131, 21, 90, -69]
3445f9rJ64mj42K8J29m9j42O2P1p7m2O3K7k6K9K1k7K0M4o3o4P2J1r9k0J12Pj09
3474h2O2J43q4j05J00R4j70r1J60M8j77j5J92J7j45K7J49n0j34N5O2q7p4P4L8
3499Go3J8Q4Lm3K6Jm2jj8k9j0O6lm5P2R8n0r2J06N0j65p7J27J9j41OJ55Oj21O3
3530GJ21r3j19N5N8j46n8J27N0r6M1J32K2o8J8M5n0n9qrj5L3K2pM0Q3m0m2K7J8
3560H9j43o5N8lr8K0J50op8J07J08j09j03R5L1j49n4J13N7p6M3J53J2o7K9N5j05
3587F4q1J6l0q1j1O8J4J0N7K3rqop1n8Lj9n1L5J23K3j9R7J06n4p4N6k7j29m9Q5
3618Cj3q3N6J40k3n2O7M6j15r4L7l8j12pQ9J1MP3Q9k7RK9k1r8lJ8n6j8P0N0mN4
3650H1N0j5l8Nk0r4n7L3l2m2N2Q2j1j0P3M4q8l0L9m7q8JP4j9k9R6Q1k4j9N8j5
$$ y = [-69, -78, 86, 82, -60, -32, 97, 48, -94, -32, 39, -38, -80, -17, 10, -16, 13, 34, 7, 27, 71, 8, -56, 16, 27, -72, -92, 20, 27, -82, -20, 123, 39, -66, 34, 128, -42, -133, 27, 75, -102, -117, 75, 92, -53, -26, 123, 73, -61, -6, 56, -31, -105, -31, 7, -56, -38, 46, 49, 6, 32, 33, -9, -10, -28, -57, -67, -1, -4, -49, 23, 121, 71, -21, 85, 135, -30, -107, 20, 39, -102, -96, 59, 65, -56, 7, 128, 35, -84, -29, 29, -117, -175, -48, 2, -94, -53, 79, 101, 33, 51, 96, 46, -13, -21, -30, -45, -12, 10, 3, 43, 126, 86, 44, 71, 89, -54, -119, -61, -64, -162, -142, 8, 2, -76, 31, 139, 30, -73, 22, 53, -96, -150, -37, 20, -56, -13, 140, 152, 85, 114, 169, 64, -17, -1, -31, -112, -123, -55, -41, -31, 26, 49, 40, 32, 26, -45, -103, -100, -119, -170, -135, -12, 11, -8, 89, 195, 141, 67, 123, 96, -33, -82, 3, -10, -93, -37, 103, 80, 28, 95, 141, 26, -68, -31, -69, -181, -188, -99, -88, -84, -11, 78, 51, 60, 89, 68, -30, -33, -15, -71, -89, -19, 31, 27, 81, 131, 116, 78, 83, 63, -31, -88, -55, -87, -129, -77, 5, -6, -16, 57, 101, 13, -17, 22, -25, -113, -112, -38, -57, -86, 10, 91, 67, 48, 106, 91]
3681I1r0l7L0l6o4M0N2qOP7J8m1lPl9m9nJ9m8K2N9J0nO1L0n5j9J2l0q8LM9k2k5
3715g8O0O2l7rP1pq3%L5n0n6M3O2l0j3R2J2m2LK6l1n4j1K0l1j1M1J1pK7K6l3l1
3748b3L8j6n0rM6j2l5N8M6l5RM1J0p1j2M6j9o5K0L7pl1N4L2n1j1L8j5o1J3K4j7
3780b8m3N6K4j9J3K2rj7J8Mk8mK9k4l2L9L6m8qN8Jm9j3N2j9n8J6O3n8k7N2M4o9
3813b6nO0mn7PN8k4m0K3L8m1j5L3j7j5J1K1j5j3K3Ml1NL2k1k4L3J4l6PL8pl8L3
3847A1K5k1m5M8J4n7j8N0Lm4K2M8k4m1K5L7m4j7K7kl8RL7j5pK9MqoQml4J5J1j8
3882b0pL6Mk1J6L1j7l8J0K6m3k4M9mk5K2M0k3k0K7K0l4k9J8nk7RK3Jj2K6J9k5
3915ClJ6j6k0OJ9l0j4L4OoQK9j4j6J1%k8qJ5Ll1K1K9Pl0K2J5k5j4ROl2LK9kk4
$$ y = [91, 1, -36, -6, -42, -106, -66, -14, -22, -16, 61, 79, 38, 35, 42, 3, -46, -51, -32, -80, -58, 1, 11, 6, 67, 97, 42, 23, 35, 5, -83, -80, -31, -53, -78, -18, 44, 7, -2, 69, 62, -21, -21, 14, -36, -92, -49, 13, -17, -30, 62, 74, 32, 35, 61, 30, -24, -35, -15, -46, -57, -16, -5, -12, 15, 41, 8, -23, 15, -1, -51, -60, -14, -26, -61, -3, 43, 8, 17, 58, 68, -3, -15, 31, 12, -53, -33, 4, -3, -34, 20, 52, 1, -10, 28, 13, -48, -35, -11, -28, -71, -15, 9, -10, 3, 25, 16, -1, 17, 21, -7, -11, 18, -6, -38, 1, 37, -11, -19, 39, 40, -9, -22, 30, 11, -47, -31, 32, -26, -53, -1, 43, -26, -31, 29, 25, -32, -25, 33, 9, -31, -8, 30, -11, -26, 7, -10, -25, -14, 7, -8, -21, 2, 6, -25, -20, 12, -9, -33, 0, 14, -22, -15, 23, 16, -22, 11, 36, 15, -30, 18, 32, -25, -43, 7, 10, -34, -12, 36, 12, -29, -4, 33, -11, -28, -1, -3, -41, -32, 5, -10, -17, 12, 16, 8, 2, 10, 6, -28, -13, -2, -20, -27, 9, 13, -8, 8, 39, 22, -16, -6, 20, -23, -47, 2, -2, -27, -5, 35, 12, -8, 19, 39, 5, -24, -6, -11, -38, -29, -6, -5, -17, 9, 28, 3, 0, 16, 0, -20, -14, 5, -25, -39, -5, 1, -5, 3, 32, 18, 2, 13, 13, -15, -23, -8, -5, -36, -15, 14, 21, -9, 13, 28, 3, -11, -2, 4, -28, -25, 4, 2, -22]
3952b2K7K1j9nJ1Kl8J0mmpJ7Lj0J6K0lk3MJ6k4j6RJ5l7K9L3%k9K8J1l0pLMl6J
3989c4K7J3k8L0MMj2PRl9OJ5j1j9J9jqPK6j0Lj4J4mk4MJknL3j8LJ6J8k7pJ7k2
4027iolJ9j4mJ8J4Kj5Rkj2nJ2j2j7J7KpKJ2J0j2J%mj1K1j3k2K4pQmJ8Mj3mjQj6
4068a2nMKpRJ7Jj2KQrj4J7oj0RjRqkPjNLnnpPJmNj7J2J1Pj7MkQrmPJj1jJ2mNr
4117iJ5rkOj0%P%%lMmlJ1rLPjOmj5J8j0lkMJqOj2J2%p%pJ3nkOPLj3lQQj1qQl%
4167a0J3j0%J1lqPq%OJ2k5J3rMLj0OK2j0omP%Loj0MMLqKLnmJ1JrJlJ5j2%J4pp
4213iJ0nKpMJ1j6QOpJPo%nPoj4J9jOmjJrPnNpLPqknRj1%J9lpKnKJ2j4mlJ4mjN
4264bJLMJpj6J9LJj7ROj0qRQpj1J2Noj1K3oj1N%jjlJ1j2J0m%j1J5Qoj3N%KjkQ
$$ y = [-22, 5, 26, 7, 2, 13, 15, -23, -13, -17, -21, -28, -11, -8, -18, -2, 18, 15, -8, -4, 12, -12, -28, -19, -4, -41, -12, 21, 21, -8, 20, 31, 1, -6, -3, 1, -35, -34, -7, 6, -22, 8, 12, 16, 4, 11, 20, -19, -13, 2, -9, -28, -9, -10, -18, -11, 15, 5, 8, -6, 8, 4, -20, -16, -15, -17, -22, 11, -7, -4, 12, 30, 3, -4, 13, -9, -15, -18, 1, -13, -17, 1, 15, 17, 2, 11, 9, -3, -8, 4, -8, -25, -8, -6, -13, -11, 1, 11, -1, 0, 0, -4, -15, 6, -7, -29, -5, -12, -4, -8, 10, 14, 1, -3, -4, 4, -12, -17, -13, -11, -18, -9, 8, 9, -3, -1, 7, -2, -16, 1, -5, -15, -6, -7, 2, -6, -8, -1, -2, 3, 6, 1, -4, -11, -4, -3, -7, -2, -19, -7, 4, 11, -6, -2, -4, 4, -5, -9, -2, -1, -12, -13, -1, -5, 0, -9, 6, -3, -5, 1, -9, -9, -2, -2, -2, -5, -1, -5, -8, 3, -6, -3, 4, 3, 9, 5, -10, 8, -2, -5, -7, -3, -2, -10, -4, -16, -4, -4, -11, -11, -18, -5, -10, -12, -6, 1, 4, -9, -12, -4, 4, -7, -15, -7, -10, -10, 3, -7, -7, 4, 1, -7, 0, -8, -8, -2, 10, -15, -2, -11, -7, -4, -14, -8, 14, 4, -2, -6, 1, 1, 4, -2, -12, -8, -4, -1, -9, -7, -4, -9, -13, -2, -1, -10, -9, -12, 3, -9, -9, 5, -2, -9, 1, -4, -2, -9, -5, 6, -10, -2, 4, -3, -2, 5, -1, -1, -6, 1, -5, -19, 0, -1, 5, 1, 0, 1, -8, -1, -6, -1, -8, -5, 2, -6, -8, -13, -4, -15, -15, 4, 1, -6, -4, -9, -7, 5, -9, -13, -16, -2, -6, -7, -2, -1, 2, 6, 7, 0, -16, 3, 6, 7, -10, -1, 5, -5, -13, -4, 4, -3, -14, -2, 3, -3, -14, 9, 3, -8, -3, -3, -4, -5, -8, 3, -9, 1, -3, -3, -14, 1, 9, 3, -10, -5, -5, -3, -4, -6, 2]
4310Bj1J9kk1QJ5ok0QOpJLRj7KJ6Pj5jJ9mrJJ8j5j8PlmPJ5j5oJ3oPj5J4j5mJ8
4352Aj6%LJ6Kl6K9J4j8mQJ4j2k2L9Ol1J3KLk0RK4k0j2NJ5l1MJ5Rk2RJ5k0QPk4
4390a8jQJ0o%J1Nk2J1J6k4kK0kk2kK3pk1NL4qk6J8K4k1k5L1j2rJK0j2j0J3J1M
4427A5Jk3RqlMj5QJ3lk3K2J2k3mK6j0k4K6J8ol5J1K1j1k2L1J8k8j5L7Om7J0K7
4462A5rk4J1K0l3pK4J0k2LJ2KnQoj0PJ2k0rL4jl1PL4j7l0K6K3k8k3L5%m5NM6k
4499A2m9K6K3j6k4K9K5l5k4M1Mj7qOPJJ0Joj5Nj5J0J1Jk1J5K1j2j8J9J1m0nL8
4534A1ml9J7M0k3n1L6L9k1l5K5L0l2k0L4J3m4KL7qj4JJ8j1k2K4Pk1LkkRNqnJ7
4570FJ0l7OJ9Nk8lM0j7l6K2L1l3j0L0K3o2J0L9Nn1J4L3k2l0L4K0k2j7K7Kk3nK3
$$ y = [2, -9, 10, 8, -13, -5, 10, 4, -16, -8, -2, -9, -8, -5, 4, -13, -11, 5, 12, -3, -4, 15, 11, 2, 3, 21, 6, -12, -5, -8, -12, -5, 10, -5, -11, 2, -4, 3, -12, 2, -13, -17, 1, -15, -15, -12, 4, 6, -30, -1, 13, -5, -9, -1, 13, 1, -21, 18, 24, -7, 6, 8, 11, -9, 0, 24, 4, -8, -3, 12, -19, -15, 0, 9, -13, -4, 11, -9, -1, 6, -18, -19, -11, -1, -7, -7, 4, 9, -13, -2, 14, -10, -12, 8, 6, -16, -18, 5, -2, -23, -18, 16, 8, -18, 0, 24, 3, -22, 9, -3, -12, -11, 9, -3, -13, 0, 11, 15, 16, -7, 2, -6, -9, -5, -20, -12, 1, -2, -25, -3, 9, -14, -18, 8, -2, -26, 0, 18, 12, -23, -12, 9, -2, -24, 7, 25, -3, -18, 19, 25, -22, -12, 15, 6, -18, -7, 13, -20, -27, -3, 7, -15, -12, 0, 2, -3, 5, -1, -11, -4, 8, -12, -21, 13, 12, -19, -12, 22, 5, -25, 1, 24, -4, -27, 8, 8, -37, -32, 14, 12, -37, -11, 12, -4, -28, 1, 26, -9, -33, 8, 12, -5, -13, -7, 0, 1, 11, 12, 6, -9, -4, -19, -9, 2, 3, -18, -3, 18, 6, -12, 7, 18, -22, -27, 11, 7, -32, -15, 25, 2, -49, -13, 26, 5, -30, -5, 25, -7, -27, 7, 20, -24, -22, 15, 7, -7, -6, 12, 1, -21, 3, 10, -11, -8, -10, -12, -3, 2, -6, -11, 6, 16, -21, -15, 4, 9, -19, -22, 18, 1, -35, -13, 18, -15, -25, 5, 28, -34, -24, 15, 20, -31, -17, 16, -6, -36, -2, 18, -4, -21, 6, 8, -15, -20, 3]
4604Cj1jMOooRpMNQj4jK1j8j3J8J0k8oL4Kl9jL8pm0J9L6l0k2K9J9k4k0K2K3l3
4642a7oL7j0m5K3K8nm0L4Mj2kJ0Kj0PJ2j4JKOk2K6%k1JJ1Rk7J0K5j8l1L3Qj9k3
4679c3L8j0l1L1L0j3m5K8K7j2l4K7J4l3oL3Ll6J7J2J0m1K5MqrJ4j1j0J6nlnK0
4713DMlNPj7j9L3j6j6J0L3k1l1K4K3l2j4K6K0n0rL7j0l5J0K9Jk5K5K2j6nK4%k8
4748a0PRj6LJ5OmqJ4j1j1Nkj9kJ1Ml5J6K9j6k3L6J4k6mK5J6m8mL9lk1RL5k5j1
4785fL3ll2j2K8j1j3jJ3pj5OJ9j4J1Krj0J8Mk8OK7jk1L0K7l1j7K5J4l2oL4k8k9
4821b9J1L0j0l3L0J6k4j1L1%l8NL2k9oJ2J7j7MK3j2pRJ2k1nK0jl2J3K6k5j6L1
4855FPl3kL8ok9NL2k1l1K6K4l1k1M9Ll5PK4rk5J9J1j9qJ8qk1J4K4j9j1K9mqPK1
$$ y = [3, -8, -9, -5, 1, -5, -11, -2, -9, -5, 0, 8, -6, -7, 14, -4, -17, 1, 11, -17, -23, 11, 13, -26, -27, 11, 4, -36, -17, 19, -11, -33, -4, 15, -9, -29, -7, 16, -17, -23, 14, 4, -41, -18, 10, 5, -35, -1, 3, -9, -11, -1, 1, -9, -2, 10, -4, -3, -1, 5, -17, 9, 9, -12, -11, 0, 9, -18, -8, 17, -1, -32, 1, 9, -10, -33, 5, -5, -36, -5, 25, 12, -33, -5, 22, 10, -24, 3, 17, -16, -22, 11, 14, -22, -5, 7, 17, -24, 1, 5, -3, -12, 2, -9, -19, -3, -8, -11, -16, 4, 8, 5, 10, 17, 0, -19, 14, -2, -18, -8, 25, 4, -27, -3, 20, -12, -26, 0, 20, -30, -39, -2, -12, -47, -37, -8, -7, -32, -7, 15, -1, -6, 18, 18, -10, -3, 6, -10, -7, 8, 14, 10, 2, 16, 5, -6, -1, -3, -22, -24, -13, -9, -44, -28, 1, -15, -38, -2, 12, -14, -18, 7, 23, -25, -29, 10, 7, -14, -5, 30, 5, -6, 27, 24, -8, -20, 8, -3, -16, -17, -4, -11, -26, -20, -1, -15, -4, -2, -11, -21, -3, 1, -27, -21, 6, 5, -16, 14, 41, 10, -7, 18, 32, 0, -6, 28, 0, -29, -18, 12, 2, -31, -1, 15, -9, -20, 11, 11, -27, -22, 10, -19, -25, -13, 4, -13, -9, 14, 2, -5, 4, 16, -5, -10, 10, 9, -23, -10, 16, -9, -25, 6, 13, -20, -22, 16, 10, -19, -14, 18, -3, -34, -8, 16, -15, -36, 13, 16, -19, -12, 12, 3, -22, -3, 8, -11, -19, -1, -9, -30, -16, 8, -11, -22, 7, 3, -5, 2, 23]
4892B3k6j9L0Ql3qM1ll7K4L2j0l1K9%l5lJ9Nl5mK7nj7K2K0k4pL0j0l1NJ7j2j0
4927b8L1J6l1K0L0j2k4J5lk7l2L9Jl7PL9j4j5L7K6m0l2M6j3l9J2J7Kk3K3K6j2
4959EnK8Lk8j3J9l6j2K2nrJ3L6j2j4K6J0l9k4L4j1m0MM3j8j1L3L8k2k0M0Qm7j7
4993b1K8k2l2OK4rJ1L5JrJ1J2l3j5Jol6J5K7k2qN2J4j1j1J8Jm6pK8j8m4L4K9j3
5028a6j3N4Ll3KK4k6k5J2J8l4JL5QqNK8j1j0Jj7j5jJ6k3j8L5K0k7jM2nl0NK1j9
5064bl6K0K0m2OL6Rk4oM3j2l2J8K6l0k1K1kj1j4M5qj5J9%j8pK1j2j5K1Nql0L4
5099a%k8K9J0j0k8L7J4m5j0K8Ll3kM3j1k9K7J1k2rL3J1l1J4J4j5j6%Opj5K5J9
5133A2k2RK4lj3Kkj9j2J5lk6K0J8LjL8jm5PJ8j9m9K4Oj1k0M5K1k0J0J3Lj3r%k8
$$ y = [23, -3, -22, 8, 16, -17, -25, 16, 13, -24, 0, 32, 22, -9, 20, 20, -15, -18, 1, 6, -29, -33, -6, -11, -28, -6, 14, -10, -17, 13, 3, -28, -23, -6, -18, -28, 3, 19, -12, 8, 38, 26, 2, 17, 14, -13, -45, -6, -5, -42, -35, 4, -10, -25, 12, 38, -2, -34, 12, -1, -40, -28, -11, -9, -32, -9, 17, 5, 0, 28, 31, 3, -10, 9, -27, -39, -17, -22, -31, -18, 18, 6, -8, 18, 28, -11, -35, -1, -12, -52, -48, -5, -23, -34, -1, 37, 15, -5, 35, 43, -4, -21, 7, -15, -47, -41, -17, -26, -15, 20, 21, 12, 23, 35, 2, -13, -12, -18, -54, -39, -12, -34, -42, 10, 24, 13, 2, 20, 21, -25, -32, -4, -22, -66, -32, -3, -16, -29, 25, 28, -5, -3, 21, -5, -30, -18, 0, -34, -33, 2, 10, 2, 7, 35, 24, 14, 15, -2, -17, -18, -2, -25, -43, -8, 12, -15, -16, 26, 21, -9, -4, 17, -2, -38, -18, 2, -40, -34, 2, 11, -13, -19, 24, 12, -20, -2, 24, -6, -27, -6, -8, -19, -33, 12, 4, -11, 8, 8, -10, -17, 4, -8, -23, -2, 3, -5, -35, -1, -1, -29, 0, 10, 0, -28, 9, 23, -22, -32, -4, -1, -34, -36, 7, -4, -33, -6, 5, -17, -26, 7, 18, -13, 1, 15, 0, -16, -16, -10, -17, -32, -7, 12, -10, -1, 23, 20, 7, 9, 7, -12, -24, -9, -12, -38, -18, 0, 3, 2, 40, 39, -6, 1, 19, 0, -49, -25, -19, -30, -50, -5, 16, -4, 6, 19, 22, 9, 0, 0, -28]
5170b8rK4j9JOL2J0jJ4kj0k1pnk8PM%JL3K6rJK4j9l1Mj1k4j9L0Qj7K1K1Pj2J5
5208A7Qk4k0JKl3pJ6J2MJ8K4J8k2Okl6pKrrRJ1J8QJ8KMnmj8k9oNj6jJ9K5mJ8J5
5249B8Mk9jRm0j4ORk1K4K2J2lLJ8lk3l%l0nJ0nlJ7K8lJ5KJqrpj6j9ROjQK0J9k1
5291FLJ7j7j5J4j9j6kK8lj5kK7KpKJ4k5KOlk8NK0rJJ0J3j9QJ0pj9Q%Pj3J4Jj4
5331a5KJ1joJ4Mk0mJ6Rl0PK0pk4OJ5rqRJ7j2lL4j5k1RKk2rJ7J0j7JJ1J1LJ3pk5
5371a4K1%j2k4J4J8rk3M2Nj1NJ1j2k5NMj0l2K8J1j2OL9mk9J5Kj4rjJl6J2K6KJ
5408iJ4K0j7qJ4ok7qJ6j8j2K5J8j8K0L7k4oMkk1j1j%j2RL2mmK6Kj3k2J6j5k4p
5445c6J2KqJ6J9KmL1%k4%j3Jk7QJ4j4NL2j1mJ9J5k0j6J4j2l7PJ9pmJ6QlJ4Kor
$$ y = [-28, -37, -13, -32, -31, -25, 7, 17, 16, 30, 28, 18, -3, -10, -15, -43, -36, -32, -32, -31, 2, 28, 19, 20, 44, 25, -6, -2, -13, -37, -56, -26, -18, -35, -14, 7, 14, 2, 17, 25, 1, -19, -18, -16, -49, -56, -40, -28, -24, -6, 18, 36, 14, 20, 18, -18, -25, -23, -32, -41, -32, -21, -3, 5, 23, 25, 29, 24, 20, 2, -27, -33, -28, -44, -45, -26, -1, -5, 13, 28, 32, 3, 2, 11, -29, -43, -37, -28, -49, -25, -3, 9, 6, 9, 27, 24, 1, -2, -2, -32, -37, -27, -32, -35, -18, 10, 7, 22, 24, 25, 17, 8, 1, -15, -34, -25, -19, -20, -12, 8, 27, 6, 9, 26, 9, -6, 8, -11, -27, -29, -1, -4, -19, -21, 6, 8, 1, 3, 17, -8, -6, 0, -3, -31, -26, -6, -15, -14, -4, 9, -10, -2, 8, 1, -18, -10, -10, -3, -16, -2, -1, -15, -13, -2, -3, -9, 5, 9, -11, -15, 1, 10, -20, -13, 7, 0, -24, -18, -3, -12, -20, -11, 6, -6, -9, 25, 10, -11, -2, 0, -22, -31, -14, -4, -21, -20, -9, 2, 5, 18, 11, -14, 7, 7, -5, -29, -15, 3, -6, -29, 13, 18, 7, 12, 23, 11, -14, -9, -5, -15, -47, -19, -8, -20, -14, 25, 21, -8, 7, 9, -5, -14, -15, -14, -50, -38, -12, -10, -9, 5, 25, 8, 0, 14, 8, -19, -27, -11, -29, -41, -16, 2, -16, 4, 41, 17, 11, 15, 13, -8, -19, -20, -20, -32, -23, 9, 5, 1, 27, 29, 16, -6, 10, -5, -29, -36, -24, -22, -30, -14, 5, 7, 3, 34, 34, 10, 10, -3, -2, -29, -21, -7, -21, -16, 16, 5, 1, 20, 35, 15, -1, 13, 1, -36, -29, -10, -17, -21, -5, 3, 0, 14, 16, 10, 1]
5484AN%k4mJJ4k1J4L6j2j0K1Nk2j6J9j6k1kK4nj3K8Nj1%K6rk6nJ6Nk3J6pQJ2J5
5522B4Kk3K0lqk8PJoj1K3jj0MJ7mj3J4Nl0J0Q%k0J1J8j0jJ4Pj6J0J1j8j1lJ2o
5560dj1J5k%PJ1kpj0J2j4PLj9j0K3Rk1KK4Nk1jJ3qmjMj6j2K1%j8J5J7Jj8J9lo
5600@pJ4nj2J1jj0OLJj0J1OJj5OlmKjkqRQkj7K7orRJ2lj8KJ4k3pK1pj4J5J5pk
5644@kJ4j1k4MJqkK5%j3K0LJ4j7J0j6LkmMl0K0J1n%J7Rj7rK4l3klJ3j5PJ3QrP
5685EO%pj0J4k6PKLqJ4J3%mJ1qj2oJ1j2j4J4jj0JJ9J3LJ2nk5jqk%j3J6KrJ9Qq
5727DKQoj7qPmpJJ9j4J0J7Nj0pJ2j0j4OqKJkOkQLJ4pLj3p%lNnJKJ0kKJ5k5MJ5
5773A1Nl0J1qJlJ0OJj8J0lPklRj3J0nkKJmLJ1j3JLQjmJpJ7j7PknmJ6kj2pK7on
$$ y = [1, 6, 6, -18, -22, -21, -7, -28, -14, 22, 10, 0, 21, 26, 4, -12, 7, -9, -30, -32, -8, -13, -26, 2, 7, -4, -4, 22, 13, -13, -18, -2, 3, -20, -4, -11, -3, 9, 24, 26, 3, 23, 20, 12, -16, -9, -8, -14, -25, -2, -3, -13, -9, 8, 4, -9, 5, 10, -20, -10, -2, -2, -22, -11, 7, -3, -4, 10, 17, 1, 11, 22, 4, -7, -10, 2, -4, -15, 0, -2, -2, 5, 16, 14, 7, -3, 9, -5, 2, 5, -14, -24, -1, 8, -13, -11, 13, 18, -3, -4, 9, 1, -3, -4, 0, -16, -28, -7, -7, -25, -10, 7, 8, -10, 9, 6, 0, -7, 7, 2, -10, 1, 0, -10, -4, -1, 0, -10, 1, 7, 8, -7, -1, -4, -8, -6, -7, -9, -17, -8, 0, -2, -19, 8, 2, -7, 2, 14, 11, -7, -5, 9, -14, -21, 0, -7, -21, -6, 9, 2, 0, -2, 12, 1, -23, -19, -18, -26, -28, -3, -3, -16, 4, 7, 21, 4, 14, -2, 1, -1, -5, -1, -31, -11, 0, -5, -5, 12, 21, 4, -5, 19, -14, -16, -19, -6, -21, -14, -1, 7, -2, 5, 11, 11, 4, -6, 8, -18, -11, -9, -6, -14, 0, 13, 13, 9, 20, 12, 0, -6, 5, -7, -21, -7, -8, -18, -17, 2, 15, 18, 30, 25, 0, -1, -9, -11, -11, -24, -8, -6, -15, 4, 12, 4, 6, 14, 8, -9, -17, -10, -14, -21, -20, -1, -15, -5, 12, 17, 7, 0, 12, 2, -12, -6, -14, -12, -11, -13, -7, -9, -1, 2, 16, 9, 12, -1, -8, -8, -11, -6, -11, -10, -8, 2, 0, 2, 17, -8, -4, 11, 16, -14, -3, -11, -10, -13, -3, 3, 4, -14, -4, -7, 0, -2, -5, 4, -9, 1, -4, -6, -4, -3, -7, -4, 7, -6, -5, -2, 6, 5, 1, 2, -5, 12, -5, 2, 0, -5, -9, 7, 5, -7, -14, 13, 7, 2]
5819BoPoRj0%njPPrj1J5lqJ4Pk5PPmKpONOj0J3lj2PjnL%kmJ4ojJ2pj3J6rl%rJ5
5868APk1J2J5qqnK0j3jlLj1nJ1JnmK6j0j4PnrJ1LLrJ0RpNk1K0PpKj8J4j2Pk%P
5912Cj0oQOlMqNJqOoPpKlLoJ2nkNKj1JPloQMj1K1j2pJJ3qj0RLJljPj2jK1j1nR
5962Djj4PLNj6OknONj0J3onJ0j2J0qK0j4jjMqKmNPQj2jJ7rpoJ1MLljj0PnpJ3j5
6009a3P%n%KQmj2NjKQrlPNj1KPMqLQj3ONJpoK0lqKLk%kMpMjNj4PLnOJJ8j4%Jp
6062aqJ0j4NJ2Jj0j2QLkNRj2PkknJ1%oMJJmpKNmlJ8rJRnj3kRmLj2ONjjJ4j7KJ2
6111GppPNj8lJ1MnkMnKJ3lj1LKOqJ5j3LpRLoRj1ONqJjjNLplMrNKKKj3J9Krlj%
6163bj4JK3j0j1MRokK3j6ljOjoNRj2MJpPkPRkpqJ2Kj0%plJ4j2MJ0Jk3J0kJ3j4
$$ y = [2, -4, 3, -3, 6, -4, -4, -9, -10, -3, 4, -5, -16, -1, -4, -12, 2, 9, -16, -9, -2, -6, -4, -11, -5, 0, 6, -4, 9, 6, -6, 1, 0, -5, -2, -2, -4, -8, 6, 0, -1, 11, 4, -9, 7, -2, -5, -5, -14, 1, 8, -13, -1, 14, 6, -2, -7, 13, 0, -1, -4, -1, -12, -17, -6, -5, -10, -14, 12, 2, -12, -5, -10, -19, -8, -5, -2, -11, -1, 8, 1, 6, -15, 5, 12, 5, 7, -11, 3, -9, -2, -4, -4, 3, -7, -13, -5, 1, -2, 2, -6, -1, 0, -8, -2, -8, -1, -8, -6, -9, -6, -12, 0, -5, -7, -2, 0, -11, -10, -3, -6, -12, -4, 0, -11, 10, -2, -9, -8, 5, -3, -13, -4, -1, 0, -3, -4, 3, -9, -10, 11, 0, -5, 4, 3, -11, -4, -1, 4, -12, -6, -8, -13, -7, -2, -12, 1, -5, -10, 0, -12, -2, -10, 10, -4, -5, -6, -2, -10, -8, -12, -7, 0, 8, -4, -5, 12, 3, -4, -10, 1, 5, 8, 5, 4, -6, 1, -4, -11, 2, -13, -6, -6, -11, -11, -9, -1, -5, -17, -12, -13, -11, -3, -12, -15, -8, -3, -14, -12, -5, -1, -9, -6, 2, -11, -5, 0, 1, -6, -12, 8, 5, -3, -1, 2, 0, 0, -2, 2, -5, -1, -2, 3, -11, -4, -1, -6, 0, 1, 19, 5, 5, 6, -1, -9, 1, -13, -8, 4, 5, -5, -17, -9, -6, -8, -3, 6, -6, 1, -1, -3, -8, 3, 3, -3, 1, 2, 3, -1, -8, -6, -1, -5, -8, 10, 1, 2, 11, 6, -7, -9, 0, -4, -1, -13, -7, -2, -3, -4, 10, -7, -5, 7, 0, -7, 0, 5, -13, -16, -5, -1, -6, -8, -4, -9, -7, 6, 3, -8, -5, -3, 3, -5, 10, -3, 0, -7, 2, 5, -1, 8, -3, 3, 8, 0, 1, 0, -1, 4, 7, 0, -3, 1, -8, -3, -1, 1, 3, -10, 9, 11, 2, -1, -2, -2, -16, -15, 8, -2, -13, -9, 0, -6, -8, 15, -1, -4, -5, 1, 0, -6, -1, 8, -4, 0, 1, -6, 1, -1, 6, 15, 13, 6, -2, 10, 12, 2, 2, -5, -8, 6, -6, -2, 8, 9, -14, -4, -6, 7, -7]
6208gJJ1j5%%OokQLj0J7ljjNj1JJ0j1JLKnKkJ0j0pJ3j0oK5rlj7J5Nj2lJ6Mj4j1
6252a8J9oqJ2J0j6kJ1mKj2K1plNoKqOQNkllj2QjMpJ2Kj1lPpJMLj4RrNR%nRj2j
6300fJ3j7pK0oqPpPn%MKj4J4L%JoLj7J8j0kJ2OjkkJ0orRKrkKpnJ0QqNkLj0KJ4
6348Gj1orJ5ojNpLj0K2nlpJ7rJ3j9%QOKjJLj0LnkJ4mjJjk%%j3PJ2Kk1NPqj8J4
6395a2K0k0QJ2nnrJ6kpjPmMlpj0J4J5j0nk%j9K3QllnJ4olJ1pj2%K3j2joJ6j4q
6438a0J2J4j5jnJ1j1jLoMM%j2J8rJ0j2NPj2NNjmQlNj7J7Lj8KJ3oqJ7j0JqKJ3k
6481HmJ0mj0j3J9qpPnMnQL%j3J2q%OkJqJ7mkKJrQMkKMj3Jj1J7Oj6RJnrJ3nlKN
6530DqKpQKpJRJLopMPj0jJQKpJPlrRLj4NKjljK7k2Qj3LlQkNlJK3j6lmkj1PNjP
$$ y = [-7, -6, 5, -10, -10, -10, -4, -10, -12, -4, -1, -11, 6, 3, 2, 1, 6, -5, -4, 6, -5, -4, -1, 1, -4, -2, -4, 6, -4, -11, 2, -8, -14, 11, 2, -1, -18, -3, 2, -10, -13, 3, 7, -7, -18, 1, -5, -13, -1, 9, -7, -9, 2, -2, 0, -12, 9, 2, -1, 4, -2, 0, -8, -2, 6, 11, 9, 6, 3, -9, -1, -2, 2, -5, 7, 9, -2, -5, 2, -5, -4, 0, 3, -11, -2, -11, -6, 3, 3, -2, 7, -5, -6, 7, -10, -17, 3, -3, -11, -4, -11, -4, -9, -9, -5, -3, -17, -3, 0, 0, 1, -5, -2, -19, -1, -11, -13, -1, 5, 4, 2, 0, 10, 4, -5, 4, 6, -3, -5, -3, -10, -15, -5, 3, -5, 0, -2, 1, -9, -7, 7, -4, -10, -19, -4, -10, -11, -6, -13, -10, -20, 2, -3, -6, -13, 4, -5, 8, -11, -11, -3, 3, 5, 4, 5, 8, -2, 1, -4, -6, 8, 4, 3, 4, 3, 1, 1, 1, -12, -5, 7, 9, -12, -7, 0, -8, -26, -12, 8, -12, -4, 8, 3, -2, -11, 5, 3, -4, -5, 2, -2, 2, -1, -8, -18, -4, 11, 1, -4, -6, -6, -25, -2, 6, 3, 0, -5, 9, 3, 0, 11, 4, -8, -8, 15, 3, 2, -4, 12, -2, -10, 2, 16, 1, 0, -5, 6, -5, -6, -3, -9, -5, -1, -1, -13, 5, -4, 6, -6, -1, 6, -6, -1, 4, 3, -1, 7, 4, 9, -8, 9, 12, -6, -4, 9, 3, -5, 12, 2, 3, -5, -3, 10, 8, 4, 14, 10, 0, -13, 6, -2, -9, -2, -7, -3, -8, 0, 3, 3, -10, 2, -6, -6, 0, -2, -1, -9, 8, 4, 2, 4, 5, -4, 4, 8, 6, 8, 12, -1, 0, -11, 6, 12, -4, 5, 6, 1, -8, 5, 0, -3, -1, 4, -4, -2, -9, -1, 1, -6, -5, 4, 5, 8, 2, -5, -1, 6, -4, -5, -4, 4, 6, -1, 0, 7, 4, -5, 4, 7, -7, -2, 0, -1, -4, -5, 22, 0, 8, -5, -2, -5, 3, 1, 6, 3, 4, 27, 11, 8, 4, 2, -9, -2, 3, 2, 9]
6583Ij5J1j5jRJPJkr%PpjRmj5J2qJ7qj2PJJ2qJ0omJRj0lJ5pLqJ%LRq%%kjqQpn
6633a2kKMrJ1%Oj2mK1j2kJRk4J3OK0j7klRlj1J0%QKLJj8JJKPj0OrLJ%RPl3J2L
6679eJpMkOj4J1kjkOJ3k1J2J1j3mkKkKKJ3KkjrJ3j2llKQp%J3pJJJ0k2NJ0j7lJ
6725a2LJ0k8PJ9oKPJ3k3kJPj5%O%RKKlKNqJjKpj1K3nkONnpKJ8j7j1J6%j2LPMj3
6772fMMoj0J0Oj8NRj3lJ6LkomNmoNOKOnJ1JlOj4NKk3LJ8Mj2mJ7Kj6J0K6j9j1q
6817gJ4k2RLMj6J1K1j6j0RJ6k3kJ5%k4J3Nn%NRokOj2KnJ5rMQqJoK0mk2J0J1j0
6859BqRQj1MJ7j5oJJ1j5j5J4J1j9j0K6J0j9J8lnJnj6KKJ5mOj3J7lnJ3j0pNqj8
6899b3OJ4NKMJ6lj1oJ7j5JmOj4kNJ2j9MJ7Lj5j3J7j8%%J1mJJ2qLLJJ%moKJ0%j4
$$ y = [9, -6, 5, -10, -11, -2, -1, 6, 7, 5, -4, -4, 3, -4, -5, 4, 0, -15, -3, -11, 6, -2, -14, -7, -6, 6, -2, 8, 2, -2, -1, 8, -2, -5, 10, 3, 6, -2, -1, -1, 2, 11, 3, 3, 3, 1, 0, -8, 0, -7, -12, -14, -12, -8, -17, -6, -6, 0, -12, -16, 5, -7, -9, -8, 1, -23, -10, -4, 16, -1, -3, -6, 3, 0, -11, -1, -1, 7, 9, 12, 13, -5, -4, -3, -1, 6, -4, 2, -7, -4, -3, -3, 6, 13, -20, -8, -5, -4, -11, -7, -9, -3, -17, -6, -8, -9, -11, -5, 8, -13, -1, 10, -3, -7, -9, -7, -9, -7, -5, 8, 10, 8, 7, -2, 11, -1, -4, -7, -5, 3, -4, -4, 9, 2, 3, 4, 14, -8, -3, 7, -10, -13, -12, -9, 1, -27, -20, -1, -7, -5, 2, 15, -8, -10, -9, -2, -17, -17, -11, -11, -2, 0, 2, -1, 1, 6, -2, -1, -2, 0, -7, -18, 5, 0, -2, 4, 9, 4, -3, -1, 17, 0, -11, 5, 5, -7, -4, 3, 7, -6, -2, 2, -4, -14, -4, 2, -16, -11, -2, -15, -18, -2, 1, -1, -7, -11, -6, -10, -16, -11, -5, -3, 3, -2, 9, 10, 7, 13, -1, 4, 6, -17, -14, 4, 8, -4, -8, 9, 11, -5, 5, 31, 12, 1, -7, 7, -15, -6, -3, 1, -15, -4, 17, 1, -9, 0, 16, -7, -9, 6, 6, -18, -5, 0, -5, -5, 0, 9, 3, 1, 7, -5, -3, -8, 7, -2, 2, 10, 2, 3, -3, 17, 13, -9, 1, 12, 2, -6, 3, 11, 0, 4, 21, 6, 0, 1, 12, -3, -18, -4, 7, -12, -22, 4, 14, -5, 13, 10, 5, 6, 1, -15, -13, -11, 4, 0, 6, -7, 10, 7, 2, 15, 5, -2, 3, -5, -23, -17, -3, 2, 4, 8, 24, 21, 10, 4, 21, 6, 7, 3, 9, -5, -7, -2, 10, -9, -5, 12, 15, 0, -13, 4, -14, -14, -14, -3, -7, -6, 6, -2, 1, 4, 5, 6, 6, 2, -4, -2, 8, 8, -6]
6943fJ3LKk1J4Joj1J4Lj1j3K4J3k5PM%j3KJ7nj3J0jk1QJ8nj%J9j1mlj3RoPkl%
6985fNoKJ0Rj9J3Jj6JPOmlJmj1J2J3qJKRj5pOKrmOmmNJ0j3J2PkPj8J4qn%KrJK0
7033Ij4OJ0Qj5jjlj4MJ6kj8K8Kk1jJ8lpqmJ8j4Nj0J1mMlJjJ0rJ0j4K%rJ6%j7J3
7076bJ3j3kJ1Rk3JJ0j1j3J9NmnlJ0JnQmpjQlmkJ0Kmj1RjkrPPoMnj0LNmQJ%Pj%
7125CkOkJj8K4j2nMmJ1pjmRqJ6mkj6kL%oK0lLnQMlj2LqrPKKJRJJlJ5j5ljrj1J1
7175a1qJ3pK0pLJ8Lj3mj3J5j3j3J3QonJ6Jjj2RNoj5MqkKPJ3lJPnoKjjj3oJ0oJ2
7220cj2K1NmlNrNqqJ0j0JRNJ1j2KOqpNRj2j5J0MNpjJ4mmlMnlJ0Lj4R%pJ7j4kJ4
7267Ij2nJPKnQkq%%LOj4J0loJ0oJ6k7J0joOr%K1rLJ2Mk2J6qj2mRj8J1olJ6LMj
$$ y = [-6, 7, 10, 12, -9, 5, 6, 0, -11, 3, 6, -5, -18, 6, 19, -6, 1, 5, 5, -8, -6, 11, 6, -7, 3, 2, -19, -11, 7, 2, 1, 1, 20, 9, 5, 2, -11, -2, -8, -1, -3, -6, -6, -1, -7, -5, 5, 14, -5, 8, 9, -7, -6, 1, 7, 3, 0, 1, -3, -14, -2, 11, 3, 4, 6, 15, 0, -7, -1, 1, -8, -12, -6, -10, -14, -9, 1, -12, 0, 7, 5, 12, -6, 8, 0, -5, -5, -3, -12, -11, 9, -5, 1, 11, 19, 4, 3, 2, -1, -15, -11, 5, 3, -15, 13, 15, -6, -7, 11, 8, 1, -7, -11, 7, -7, -2, -12, -1, -5, -1, -4, -3, -4, 6, -3, 7, -7, -5, -5, -14, 2, 2, -15, -2, 11, -2, -4, 7, 16, -7, -6, 4, -7, -20, -1, 4, 0, -5, -8, 2, 3, -2, 6, 2, -5, -6, 2, -1, -5, -7, 3, 5, 1, -10, -1, -2, -4, -13, -6, 1, -5, -1, -6, -16, -13, -8, -12, -4, -3, -3, 4, 3, 3, 1, 7, 5, 6, -12, 12, 0, -5, -1, -5, 6, -1, -2, -6, 3, -5, 11, 7, 5, -11, -13, -10, -10, -16, 4, 1, 4, -1, 7, 11, 8, -4, -1, -9, -18, -11, -9, -7, -6, 3, 4, 5, 2, 17, 2, -1, -2, -11, -22, -11, -19, -6, -13, 7, 0, 3, 21, 24, 11, 7, -6, 9, -4, -17, -4, 4, -2, -7, 9, 10, 9, -3, 6, 11, 5, -10, -6, -14, -16, -14, -7, 6, 3, 4, 11, 6, 0, 2, 1, 0, -13, -19, -9, -15, -3, -15, 6, 11, 7, 4, 9, 0, 5, -3, -11, -1, -11, -10, -1, 4, 15, 3, 5, 11, 3, -4, 1, 10, -2, -17, -7, -3, 2, -5, -6, 8, 4, 0, -3, 1, -4, -7, 3, 6, -8, 1, 1, -6, 11, -3, -5, 9, -3, -8, -7, 0, 2, -3, 5, 3, -5, -5, -5, -2, 4, -10, 0, -3, -9, 1, -5, 11, -16, -6, -7, -13, -7, -16, -16, 5, -4, -1, 11, 15, -7, 9, 1, -11, -15, -6, -24, -13, -19, -22, -6, -3, 1, 0]
$$ [...]
8191A0
##END NTUPLES=NMR FID
##END=
