##TITLE=1H_LY-Ni-900-ac-240
 CDCl3, 8 sc, 
 14.1.2019
##JCAMPDX= 6.0         $$ Bruker NMR JCAMP-DX V2.0
##DATA TYPE= NMR FID
##DATA CLASS= NTUPLES
##ORIGIN= UXNMR, Bruker Analytische Messtechnik GmbH
##OWNER= root
$$ XWIN-NMR		Version 3.5
$$ Mon Jan 14 16:29:03 2019 Russian Standard Time (UT+4h)  she@DPX200
##.OBSERVE FREQUENCY= 200.1313
##.OBSERVE NUCLEUS= ^1H
##.DELAY= (6, 6)
##.ACQUISITION MODE= SIMULTANEOUS
##.ACQUISITION SCHEME= undefined
##.AVERAGES= 8
##.DIGITISER RES= 18
##SPECTROMETER/DATA SYSTEM= spect
##.PULSE SEQUENCE= zg30
##.SOLVENT NAME= CDCl3
##.SHIFT REFERENCE= (INTERNAL, CDCl3, 0, 15.7039)
##AUDIT TRAIL= $$ (NUMBER, WHEN, WHO, WHERE, WHAT)
$$ ##TITLE= Audit trail, XWIN-NMR		Version 3.5
$$ ##JCAMPDX= 5.01
$$ ##ORIGIN= Bruker BioSpin GmbH
$$ ##OWNER= she
$$ F:/spectra/data/she/nmr/H-F/1/audita.txt
$$ ##AUDIT TRAIL=  $$ (NUMBER, WHEN, WHO, WHERE, WHAT)
(   1,<2019-01-14 16:28:14.59 +0400>,<she>,<DPX200>,
      <created by zg, POWCHK disabled, PULCHK disabled
       configuration hash MD5:
       00 E9 B6 7A A2 85 ED C7 34 08 36 98 17 FE 4E 26
       data hash MD5: 16K
       0D 1A E2 AC 79 13 54 BC FC 06 39 60 FD F3 A0 7A>)
$$ ##END=
$$ 
$$ hash MD5
$$ 4D 5D F0 00 13 3F 91 13 24 F8 03 8C 9D 3E 53 D2
##$RELAX= 
##$RELAX= 
##$RELAX= 
##$RELAX= 
##$RELAX= 
##$RELAX= 
$$ Bruker specific parameters
$$ --------------------------
##$DU= <F:/spectra>
##$EXPNO= 1
##$NAME= <H-F>
##$PROCNO= 1
##$TYPE= <nmr>
##$USER= <she>
##$AMP= (0..31)
100 100 100 100 100 100 100 100 100 100 100 100 100 100 100 100 100 100 
100 100 100 100 100 100 100 100 100 100 100 100 100 100 
##$AQSEQ= 0
##$AQ_mod= 1
##$AUNM= <au_zg>
##$AUTOPOS= <>
##$BF1= 200.13
##$BF2= 200.13
##$BF3= 200.13
##$BF4= 200.13
##$BF5= 200.13
##$BF6= 200.13
##$BF7= 200.13
##$BF8= 200.13
##$BYTORDA= 1
##$CFDGTYP= 0
##$CFRGTYP= 5
##$CHEMSTR= <none>
##$CNST= (0..31)
1 1 145 1 1 1 1 1 1 1 1 1 1 1 1 1 1 1 1 1 1 1 1 1 1 1 1 1 1 1 1 1 
##$CPDPRG= <>
##$CPDPRG1= <>
##$CPDPRG2= <>
##$CPDPRG3= <>
##$CPDPRG4= <mlev>
##$CPDPRG5= <mlev>
##$CPDPRG6= <mlev>
##$CPDPRG7= <mlev>
##$CPDPRG8= <mlev>
##$CPDPRGB= <>
##$CPDPRGT= <>
##$D= (0..31)
0 1.2 0 0 0 0 0 0 0 0 0 0.03 0 0 0 0 0 0 0 0 0 0 0 0 0 0 0 0 0 0 0 0 
##$DATE= 1547468893
##$DBL= (0..7)
120 120 120 120 120 120 120 120 
##$DBP= (0..7)
150 150 150 150 150 150 150 150 
##$DBP07= 0
##$DBPNAM0= <>
##$DBPNAM1= <>
##$DBPNAM2= <>
##$DBPNAM3= <>
##$DBPNAM4= <>
##$DBPNAM5= <>
##$DBPNAM6= <>
##$DBPNAM7= <>
##$DBPOAL= (0..7)
0.5 0.5 0.5 0.5 0.5 0.5 0.5 0.5 
##$DBPOFFS= (0..7)
0 0 0 0 0 0 0 0 
##$DE= 6
##$DECBNUC= <off>
##$DECIM= 24
##$DECNUC= <off>
##$DECSTAT= 4
##$DIGMOD= 1
##$DIGTYP= 9
##$DL= (0..7)
0 120 120 120 120 120 120 120 
##$DP= (0..7)
150 150 150 150 150 150 150 150 
##$DP07= 0
##$DPNAME0= <>
##$DPNAME1= <>
##$DPNAME2= <>
##$DPNAME3= <>
##$DPNAME4= <>
##$DPNAME5= <>
##$DPNAME6= <>
##$DPNAME7= <>
##$DPOAL= (0..7)
0.5 0.5 0.5 0.5 0.5 0.5 0.5 0.5 
##$DPOFFS= (0..7)
0 0 0 0 0 0 0 0 
##$DQDMODE= 0
##$DR= 18
##$DS= 0
##$DSLIST= <SSSSSSSSSSSSSSS>
$$ [...]
##$SUBNAM2= <"">
##$SUBNAM3= <"">
##$SUBNAM4= <"">
##$SUBNAM5= <"">
##$SUBNAM6= <"">
##$SUBNAM7= <"">
##$SUBNAM8= <"">
##$SUBNAM9= <"">
##$SW= 24.933730806125
##$SWIBOX= (0..15)
0 0 2 0 0 0 0 0 0 0 0 0 0 0 0 0 
##$SW_h= 4990.01996007984
##$TD= 16384
##$TD0= 1
##$TE= 0
##$TE2= 300
##$TE3= 300
##$TEG= 300
##$TL= (0..7)
0 120 120 120 120 120 120 120 
##$TP= (0..7)
150 150 150 150 150 150 150 150 
##$TP07= 0
##$TPNAME0= <>
##$TPNAME1= <>
##$TPNAME2= <>
##$TPNAME3= <>
##$TPNAME4= <>
##$TPNAME5= <>
##$TPNAME6= <>
##$TPNAME7= <>
##$TPOAL= (0..7)
0.5 0.5 0.5 0.5 0.5 0.5 0.5 0.5 
##$TPOFFS= (0..7)
0 0 0 0 0 0 0 0 
##$TUNHIN= 0
##$TUNHOUT= 0
##$TUNXOUT= 0
##$USERA1= <user>
##$USERA2= <user>
##$USERA3= <user>
##$USERA4= <user>
##$USERA5= <user>
##$V9= 5
##$VALIST= <valist>
##$VCLIST= <CCCCCCCCCCCCCCC>
##$VD= 0
##$VDLIST= <DDDDDDDDDDDDDDD>
##$VPLIST= <PPPPPPPPPPPPPPP>
##$VTLIST= <TTTTTTTTTTTTTTT>
##$WBST= 1024
##$WBSW= 4
##$XGAIN= (0..3)
0 0 0 0 
##$XL= 0
##$YL= 0
##$YMAX_a= 171286
##$YMIN_a= -173909
##$ZGOPTNS= <>
##$ZL1= 120
##$ZL2= 120
##$ZL3= 120
##$ZL4= 120
##$ABSF1= 10
##$ABSF2= 0
##$ABSG= 5
##$ABSL= 3
##$ALPHA= 0
##$AQORDER= 0
##$ASSFAC= 0
##$ASSFACI= 0
##$ASSFACX= 0
##$ASSWID= 0
##$AUNMP= <proc_1d>
##$AZFE= 0.1
##$AZFW= 0.1
##$BCFW= 1
##$BC_mod= 2
##$BYTORDP= 1
##$COROFFS= 0
##$CY= 11.3945322036743
##$DATMOD= 1
##$DC= 2
##$DFILT= <>
##$DTYPP= 0
##$F1P= 18.9103706918063
##$F2P= -1.10871071338519
##$FCOR= 0.5
##$FTSIZE= 0
##$FT_mod= 4
##$GAMMA= 1
##$GB= 0.15
##$INTBC= 1
##$INTSCL= 1
##$ISEN= 128
##$LB= 0.24
##$LEV0= 0
##$LPBIN= 0
##$MAXI= 10000
##$MC2= 0
##$MEAN= 0
##$ME_mod= 0
##$MI= 1.114404
##$NCOEF= 0
##$NC_proc= 0
##$NLEV= 6
##$NOISF1= 3.799351
##$NOISF2= 2.8
##$NSP= 1
##$NTH_PI= 0
##$NZP= 0
##$OFFSET= 15.70392
##$PC= 1
##$PHC0= -8955.345
##$PHC1= 15.80006
##$PH_mod= 1
##$PKNL= yes
##$PPARMOD= 0
##$PSCAL= 0
##$PSIGN= 0
##$REVERSE= no
##$SF= 200.130013532006
##$SI= 16384
##$SIGF1= 3
##$SIGF2= 2
##$SINO= 400
##$SIOLD= 16384
##$SREGLST= <1H.CDCl3>
##$SSB= 0
##$STSI= 0
##$STSR= 0
##$SW_p= 3612.71676300578
##$SYMM= 0
##$S_DEV= 0
##$TDeff= 0
##$TDoff= 0
##$TI= <>
##$TILT= no
##$TM1= 0
##$TM2= 0
##$TOPLEV= 0
##$USERP1= <user>
##$USERP2= <user>
##$USERP3= <user>
##$USERP4= <user>
##$USERP5= <user>
##$WDW= 1
##$XDIM= 8192
##$YMAX_p= 0
##$YMIN_p= 0
$$ End of Bruker specific parameters
$$ ---------------------------------
##NTUPLES= NMR FID
##VAR_NAME=  TIME,          FID/REAL,        FID/IMAG
##SYMBOL=    X,             R,               I
##VAR_TYPE=  INDEPENDENT,   DEPENDENT,       DEPENDENT
##VAR_FORM=  AFFN,          ASDF,            ASDF
##VAR_DIM=   8192,          8192,            8192
##UNITS=     SECONDS,       ARBITRARY UNITS, ARBITRARY UNITS
##FACTOR=    0.0002004,     1,               1
##FIRST=     0,             0,               0
##LAST=      1.6414764,     0,               0
##MIN=       0,             -173909,         0
##MAX=       1.6414764,     171286,          0
$$ Real data points
##PAGE= N=1
##DATA TABLE= (X++(R..R)), XYDATA
0 0 0 0 0 0 0 0 0 0 0 0 -8 8 -8 8 -8 11 -16 16 -21 24 -32 32 -40 47 -50 58 -67 75 -85 98 -109 122 -137 153
34 153 -169 188 -210 232 -258 287 -318 352 -389 432 -477 530 -591 656 -737 830 -938 1069
52 1069 -1234 1445 -1722 2114 -2702 3680 -5619 10908 -54989 -173909 -24649 134433 110284
65 110284 -57634 -122758 -21745 98625 74425 -44254 -105492 -30911 84638 104768 -6197
76 -6197 -118772 -90690 58600 138244 36630 -117254 -108792 51627 137262 24174 -122603
87 -122603 -92447 69502 131495 12111 -119098 -88481 51642 117787 36976 -81090 -96431
98 -96431 2456 95658 71067 -44249 -104812 -24812 95312 86111 -51247 -125718 -20788 124110
110 124110 101215 -64669 -144801 -30785 117060 103019 -38511 -112521 -35843 73721 75352
121 75352 -19901 -84675 -38325 62547 91646 1909 -104368 -86210 49330 131328 43109
132 43109 -104145 -110041 33291 123329 35520 -98518 -85651 50825 113737 17717 -100963
143 -100963 -85112 36718 107023 46305 -64156 -93677 -12155 81559 73093 -29895 -95675
154 -95675 -31290 82057 84234 -37811 -114705 -29711 103953 96460 -45290 -124884 -35761 94792
166 94792 93190 -25275 -97596 -40353 58315 73011 -4243 -71407 -45557 41919 80936 13326
178 13326 -83306 -78585 35885 113809 42649 -89360 -102560 21926 110495 43229 -77689
189 -77689 -80845 29973 92816 23322 -77045 -73305 24848 90713 46175 -52165 -88351 -20203
201 -20203 72330 76057 -17127 -88291 -39296 66642 79457 -25462 -100156 -31531 88507 88802
213 88802 -34597 -111634 -39609 79004 88201 -12292 -85007 -45248 43811 69061 6482 -61517
225 -61517 -49283 30232 76110 21196 -71616 -76422 25377 102196 44069 -76099 -94512 13815
237 13815 97913 45171 -63220 -75784 15895 78233 29438 -57204 -65499 11500 74158 45745
249 45745 -39300 -79361 -23987 62996 73417 -9942 -80663 -42714 53827 73619 -13348 -82851
261 -82851 -32200 68700 75383 -23931 -92388 -38142 63076 79373 -2354 -72800 -48881 30276
273 30276 64597 16333 -50402 -49740 19639 67261 23489 -60549 -69156 19531 90086 41998 -64765
286 -64765 -85833 6763 85373 46313 -49507 -69935 4865 66225 33559 -43208 -60688 2199
298 2199 64111 46475 -31105 -73997 -26124 56999 70367 -6445 -74846 -43174 45789 68868
310 68868 -5716 -71226 -33528 53927 66530 -14427 -77424 -37640 50224 71939 4418 -63544
322 -63544 -50186 21691 61220 22517 -42391 -49396 11188 58539 24836 -48869 -60245 13676
334 13676 75776 38074 -52828 -75122 755 71961 45968 -36083 -62934 -5371 53248 35877
346 35877 -29245 -53601 -5342 52769 44555 -23180 -66206 -26749 49457 65250 -2453 -66703
358 -66703 -42634 36616 62741 1592 -59387 -34448 40158 58632 -5518 -64420 -38144 38604
370 38604 66126 10773 -55995 -51862 14700 59206 27682 -36938 -50180 4737 53120 27096
382 27096 -40042 -54745 8100 65224 36432 -43030 -67568 -4576 62087 46587 -25945 -58824
394 -58824 -13800 44203 38908 -18415 -49029 -11869 43746 42908 -16789 -59098 -26388 42719 59354
407 59354 350 -58442 -40775 28149 55864 7816 -47429 -34177 26979 49884 2303 -50929
419 -50929 -36823 27651 58505 15054 -47740 -50571 9097 54861 29767 -31277 -47908 -69
431 -69 45892 26769 -31273 -47168 3739 53659 33026 -33738 -58902 -8329 52694 45856 -17820
444 -17820 -54928 -19967 37506 41389 -10459 -45997 -16664 37476 41610 -12583 -53825 -25298
456 -25298 38280 54429 1378 -52725 -38950 22647 51280 12262 -39503 -34953 17327 44558
468 44558 8836 -41506 -36738 19645 53513 18139 -42273 -49470 5878 51980 30602 -27470
480 -27470 -45625 -3343 39729 26081 -23433 -40045 -351 42537 29713 -24590 -50125 -11810
492 -11810 42978 44099 -10204 -50011 -24722 30467 41944 -3368 -41447 -19851 30375 38318
504 38318 -8378 -46335 -22985 32252 47426 2706 -44897 -35976 16385 45485 16323 -31289
516 -31289 -35170 8339 39446 14618 -33068 -36535 12722 48905 20245 -37794 -48032 3820
528 3820 49516 30627 -24897 -43838 -5661 35329 26079 -17284 -35303 -4289 34307 28353 -17177
541 -17177 -44284 -15113 36264 43698 -4810 -47489 -28498 26278 43234 1579 -38970 -22666
553 -22666 25123 36044 -4843 -40217 -21379 26717 41291 4152 -37743 -33347 10613 40043
565 40043 19802 -23658 -34869 213 34146 19597 -24382 -35235 5683 42778 21849 -31470
577 -31470 -44687 905 44493 29744 -20595 -40189 -8202 29294 25120 -10607 -29525 -7963
589 -7963 25333 26041 -9804 -37411 -17546 29088 41921 -2 -44008 -30902 22415 43653 5475
602 5475 -36705 -24694 21056 34189 -2198 -35378 -19785 22638 36258 4733 -32457 -31035
614 -31035 6773 36317 22207 -18932 -35588 -5429 31713 23945 -19220 -35715 1004 39704
626 39704 23003 -28198 -42533 219 41712 28107 -18674 -37102 -9006 24964 24013 -5384
638 -5384 -24728 -11297 17502 24371 -2872 -31219 -19887 22329 39777 3942 -40291 -31965 18883
651 18883 42541 8202 -33377 -25121 16348 30366 392 -28362 -17026 17003 29299 5635
663 5635 -25360 -27811 2269 31571 24270 -13747 -35348 -10452 28596 26818 -14297 -34612 -2472
676 -2472 35749 22551 -24955 -39179 -142 38071 25962 -16383 -33846 -9927 21044 23332
688 23332 -1201 -21740 -14203 12599 24381 1914 -28181 -22003 18549 38937 6076 -38326
700 -38326 -31991 17531 41636 8950 -31837 -25327 13612 28415 2919 -23443 -16198 11726 24207
713 24207 7173 -19475 -25300 -1009 27892 25109 -10509 -34981 -13797 26183 29108 -9342 -32708
726 -32708 -6420 29905 21386 -19895 -33797 -712 32876 23205 -13473 -30208 -11260 16647
738 16647 22576 3484 -17647 -16336 6647 21846 5598 -23125 -21544 14589 35967 7554 -34879
751 -34879 -31343 14670 39301 10392 -28431 -24403 10834 25692 3966 -20070 -15217 8749 21246
764 21246 8426 -15459 -23668 -3697 24517 25002 -8190 -33785 -14690 25488 30137 -8069 -33425
777 -33425 -9000 27877 22283 -16279 -30613 -1371 28675 19935 -12369 -26781 -10154 14948
789 14948 22112 5908 -16234 -19540 1762 21480 10762 -18039 -21784 9966 32064 7732 -31943
802 -31943 -29407 13738 37605 11266 -25558 -24131 6389 21321 5816 -13370 -11784 4913 15584
815 15584 8075 -11241 -21468 -6215 21617 26157 -4316 -32113 -17303 21514 29127 -5169 -30115
828 -30115 -9172 24779 20834 -13758 -27833 -3090 23950 18501 -8164 -22167 -10605 10917
840 10917 19993 7240 -14935 -20510 700 22966 13731 -16947 -24024 6125 29871 9220 -27760
853 -27760 -26306 12888 34346 9544 -24774 -23785 4800 20915 9331 -9109 -12389 -741 10980
866 10980 9088 -6685 -18387 -6533 19753 25002 -4380 -32153 -18296 20296 30041 -1337 -26821
879 -26821 -10989 18834 17485 -10542 -22443 -2333 20340 16662 -5686 -19780 -12512 6893 19045
892 19045 10577 -11108 -20045 -2208 19946 13586 -14565 -22553 4478 27580 10481 -23566 -24753
905 -24753 8857 29263 9626 -20125 -20696 3516 18681 9725 -7715 -13449 -3683 9918 11720
918 11720 -2764 -16809 -8556 15927 22502 -3694 -29378 -16274 20257 29411 -1085 -26985 -13399
931 -13399 15803 17919 -5884 -18217 -3099 15853 13583 -4966 -17612 -11728 6665 19695 11997
944 11997 -10894 -22060 -5041 18860 15639 -10798 -20564 2502 23698 9169 -21155 -22494 7559
957 7559 26694 10349 -16408 -19256 118 14611 10028 -3960 -11236 -5150 7594 11707 -820
970 -820 -15689 -9946 13234 21548 -1170 -25524 -15456 16799 25853 -466 -23789 -12662 13421
983 13421 17032 -2890 -15494 -5218 10933 11838 -1838 -13709 -10897 4959 17939 11210 -11081
996 -11081 -21953 -4664 19452 16740 -9347 -20437 -106 20299 9028 -17288 -19067 6741
1008 6741 23546 9337 -14942 -18802 -1543 13827 12148 -1359 -11455 -7856 5471 11883 868
1021 868 -14017 -9540 12007 19926 -1108 -23720 -14769 14809 23967 1110 -20438 -12438 9939
1034 9939 14868 -633 -12237 -5719 7625 10552 517 -10977 -10944 2677 15961 11206 -9318
1047 -9318 -20131 -4823 17522 15780 -7680 -18747 -1762 16914 9143 -12865 -16004 4201 18832
1060 18832 8472 -11784 -16523 -2466 12437 12678 -240 -11917 -9471 4604 12516 2541 -12377
1073 -12377 -9419 9828 17300 -1023 -20887 -12883 13430 21884 1607 -18615 -12883 7459 14236
1086 14236 1947 -9957 -6774 4921 9657 1872 -9571 -10751 2156 15340 10810 -9006 -19228
1099 -19228 -4671 16357 15140 -6217 -17082 -2924 14040 8870 -9608 -13663 2188 15262
1111 15262 8200 -8870 -14719 -3732 10545 12712 1045 -11406 -10236 3512 12325 3777 -10509
1124 -10509 -9190 7257 14595 -44 -16979 -11137 10710 18712 2433 -15617 -12591 4842 13149
1137 13149 4284 -7676 -7833 2078 8596 3310 -7689 -10049 1497 13848 9633 -8514 -17556 -4088
1151 -4088 15022 14181 -4959 -15579 -4062 11501 8877 -6605 -11791 444 12571 8116 -6963
1164 -6963 -13788 -4409 10013 13036 1200 -11808 -10499 3588 12308 4047 -9514 -8727 5768 12484
1178 12484 319 -14092 -9581 8744 16168 2889 -13294 -12163 2973 12332 5944 -6063 -8628
1191 -8628 -11 7793 4405 -5990 -9150 854 11971 8276 -7520 -15189 -3539 12914 12641 -3431
1205 -3431 -13472 -5123 8516 8599 -3372 -9541 -1441 9314 7688 -4726 -12162 -4793 9009 12605
1219 12605 1217 -11575 -10117 3556 11685 4054 -8197 -7875 4183 10132 704 -11095 -8046
1232 -8046 6803 13719 3221 -11458 -11891 1768 12130 7108 -5604 -9660 -1002 7950 5026 -5467
1246 -5467 -8533 1064 10812 6669 -7280 -13063 -2429 11507 11126 -2671 -12008 -5749 6651 8716
1260 8716 -1065 -8321 -3041 7127 7545 -3216 -11028 -4794 8379 11789 773 -11075 -9209 3400
1274 3400 10585 4041 -6490 -7052 2150 7714 1629 -7684 -6796 4282 11142 3887 -9092 -11310 379
1289 379 11313 7923 -4674 -9957 -2049 7283 5366 -4216 -7393 622 8773 5302 -6056 -10705
1303 -10705 -2106 9517 9863 -1523 -10603 -6458 5029 8947 871 -7494 -4416 5497 7567 -2017
1317 -2017 -10139 -4735 7917 11084 246 -10804 -8396 3599 9934 3805 -5706 -6604 996 6316
1331 6316 2245 -5542 -5996 2615 9343 4195 -7573 -10814 -368 10861 8387 -4253 -10292 -2670
1345 -2670 7038 5719 -3348 -6579 327 7105 4103 -4945 -8421 -1703 7481 8366 -377 -8844 -6975
1360 -6975 3097 8797 2899 -6263 -5806 3417 7375 -446 -8805 -4757 6943 10057 4 -9960
1374 -9960 -7328 3485 8746 3502 -4409 -5794 -354 4574 2921 -3088 -5206 691 7461 4710 -5958
1389 -5958 -10413 -1077 10552 8663 -4281 -10663 -2737 7234 5729 -3175 -5937 454 5920 2915
1403 2915 -4191 -6472 -1248 5899 7215 435 -7733 -7395 2126 9153 4131 -6075 -6904 2522 7592
1418 7592 304 -8185 -4471 6529 8951 -611 -9043 -6013 3230 7345 3281 -3031 -5162 -1863 3108
1433 3108 3897 -858 -4822 -1214 5889 5258 -4402 -9758 -1650 9749 8408 -3919 -10128 -2751 6522
1448 6522 5329 -2319 -4738 44 4021 1968 -2726 -4434 -1315 4044 6144 1251 -6626 -7505 1412
1463 1412 9147 4790 -5801 -7417 1833 7398 820 -7257 -3963 5953 7711 -1113 -8179 -4930 3221
1478 3221 6522 3034 -2485 -4972 -2560 2544 4475 183 -4643 -2108 5028 5262 -3748 -9205 -1562
1493 -1562 9348 7907 -3984 -9696 -2461 6183 4968 -1897 -3982 -134 2795 1363 -1682 -2985
1507 -2985 -1388 2537 5172 1908 -5424 -7295 645 8642 5122 -5319 -7601 1105 7065 1477 -6144
1522 -6144 -3629 4844 6201 -1273 -6705 -3536 2958 5172 2468 -1815 -4429 -3087 1913 5011 1427
1537 1427 -4340 -3243 3726 5145 -2746 -8138 -1325 8768 7122 -4307 -9429 -2111 6113 4782
1551 4782 -1596 -3397 -259 1751 624 -1082 -1800 -1130 1783 4585 2123 -5015 -7346 387 8645
1566 8645 5315 -5200 -7556 1066 6820 1301 -5841 -3172 4598 5348 -1434 -5608 -2561 2330 3763
1581 3763 2120 -793 -3671 -3422 1399 5313 1982 -4580 -4159 3163 5572 -1626 -7153 -1417 7466
1596 7466 5753 -4255 -8051 -1126 5723 4112 -1296 -2868 -946 305 423 519 -178 -1215 347 3423
1612 3423 1998 -4418 -6654 756 8595 5100 -5223 -7635 508 6123 1535 -4547 -2205 4055 4036
1627 4036 -1896 -4981 -2043 2126 3479 2437 -302 -3678 -3905 969 5216 2171 -4211 -3835 3124
1642 3124 5274 -1694 -6892 -1469 6758 5263 -3586 -6757 -733 4795 3095 -1332 -2354 -820 144
1657 144 764 1349 156 -1982 -917 2797 2576 -3107 -5600 652 7457 4053 -5299 -7119 671 6040
1673 6040 2073 -3501 -2087 2530 2291 -1927 -3334 -559 2118 2594 1799 -469 -3779 -4036 1083 5750
1689 5750 2882 -3813 -4256 1950 4313 -1379 -5598 -625 6348 4464 -3625 -6349 -917 4069 2908
1704 2908 -548 -1515 -817 -446 309 1245 128 -1946 -707 3030 2703 -2931 -5426 358 6554 3461
1720 3461 -4722 -5897 1163 5487 1441 -3544 -2145 1982 1959 -1195 -2020 -110 1247 1309 1187 -227
1736 -227 -3075 -3255 1529 5530 2300 -4270 -4550 1610 4293 -424 -4198 -345 4883 2822 -3665 -5127
1752 -5127 -144 3879 2724 -187 -1379 -1543 -1370 220 2036 1060 -1559 -1083 2184 2028 -2769 -4710
1768 -4710 670 6147 3232 -4151 -5349 648 4422 1279 -2643 -1430 1746 1485 -1084 -1715 -282
1783 -282 766 1142 1389 87 -2728 -2962 1366 4750 1629 -4036 -3795 1893 4077 -396 -3831 -559
1799 -559 3887 2180 -3026 -3863 348 3346 2065 -490 -1517 -1621 -1069 874 2449 945 -1922 -1530
1815 -1530 1636 1813 -2092 -3537 1051 5197 2169 -4087 -4659 732 3980 1423 -1783 -1136 867 500
1831 500 -1027 -906 264 701 865 1133 -91 -2614 -2617 1410 4354 1471 -3496 -3271 1504 3257 -385
1848 -385 -3000 -251 3194 1605 -2559 -3106 321 2712 1687 -371 -1381 -1502 -754 1108 2172 451
1864 451 -1975 -1245 1599 1568 -1798 -2776 1130 4258 1355 -3735 -3716 1035 3652 1234 -1659 -1289 384
1881 384 407 -508 -388 306 482 601 765 -397 -2326 -1830 1738 3810 847 -3357 -2840 1342 2775 -152
1899 -152 -2190 -75 2352 880 -2237 -2298 522 2283 1416 -307 -1319 -1527 -687 1173 2044 336 -1801
1916 -1801 -1111 1259 1171 -1467 -2032 1145 3361 772 -3213 -2941 1012 3042 1072 -1347 -1236 76
1932 76 332 -115 -132 153 287 561 582 -601 -2039 -1151 1925 3112 208 -3096 -2227 1362 2396 -95
1950 -95 -1738 -104 1723 552 -1786 -1770 525 2027 1300 -414 -1550 -1510 -190 1537 1744 -130 -1700
1967 -1700 -771 1110 779 -1231 -1306 1233 2540 190 -2752 -2176 1002 2547 980 -1074 -1271 -272 325
1984 325 244 57 1 179 542 353 -818 -1683 -471 1939 2312 -272 -2611 -1597 1170 1911 71 -1210
2002 -1210 -216 1030 347 -1234 -1280 408 1738 1219 -508 -1747 -1370 351 1718 1236 -558 -1465 -406
2019 -406 895 427 -929 -699 1115 1771 -132 -2268 -1686 934 2306 989 -1108 -1542 -346 696
2035 696 549 -133 -307 262 689 102 -1099 -1348 150 1893 1616 -662 -2204 -1147 1081 1647 205
2052 205 -979 -399 642 354 -828 -1029 323 1575 1101 -675 -1807 -1069 756 1700 819 -778 -1211
2069 -1211 -212 677 249 -594 -317 883 1142 -317 -1772 -1222 853 2006 893 -1068 -1593 -387 887
2086 887 772 -177 -499 226 714 -36 -1185 -1037 571 1812 1028 -962 -1871 -710 1056 1382 199 -847
2104 -847 -536 376 404 -494 -873 167 1453 1088 -786 -1974 -883 1206 1808 351 -1163 -1013 156
2121 156 625 31 -449 3 756 629 -455 -1337 -858 728 1729 855 -1057 -1740 -395 1173 984 -370
2139 -370 -753 248 819 -202 -1299 -706 968 1572 391 -1126 -1372 -338 841 1115 344 -671 -781
2156 -781 58 557 -80 -783 -66 1306 1080 -909 -2043 -601 1604 1703 -154 -1365 -700 407 472 -95
2174 -95 -203 213 470 238 -370 -926 -695 585 1662 877 -1203 -1920 -240 1584 1072 -721 -999 414
2192 414 949 -349 -1379 -409 1228 1328 -59 -1167 -1040 -157 744 1056 419 -736 -1015 17 835 130
2210 130 -871 -204 1296 1037 -1072 -2039 -262 1855 1477 -543 -1389 -434 502 309 -107 27 248 143
2228 143 -38 -229 -597 -590 487 1535 782 -1302 -1920 -11 1795 1013 -925 -1036 499 943 -448 -1300
2246 -1300 -136 1318 1062 -360 -1152 -774 11 720 976 324 -865 -1116 106 1034 198 -980 -309 1275
2264 1275 997 -1167 -1981 -12 2031 1329 -865 -1482 -253 670 334 -97 51 183 -27 -114 -93 -398 -511
2283 -511 407 1438 676 -1415 -1906 196 1977 941 -1152 -1111 593 948 -516 -1212 107 1388 778
2300 778 -633 -1046 -490 127 623 936 359 -898 -1191 162 1195 251 -1060 -376 1302 944 -1257 -1925
2318 -1925 207 2077 1067 -1122 -1422 -23 734 245 -137 77 81 -188 -85 135 -260 -582 302 1398
2336 1398 611 -1524 -1811 488 2150 800 -1434 -1230 674 1046 -461 -1081 187 1269 525 -751
2352 -751 -933 -324 210 658 931 220 -1131 -1278 344 1408 275 -1158 -415 1271 822 -1364 -1773 472
2370 472 2121 864 -1251 -1346 58 678 193 -33 160 12 -316 -81 218 -260 -666 279 1422 551 -1563
2389 -1563 -1716 616 2086 532 -1543 -1067 866 1061 -488 -1030 190 1060 350 -661 -652 -150 171 562
2407 562 824 53 -1260 -1137 675 1624 189 -1383 -553 1196 794 -1228 -1481 667 2003 582 -1417
2424 -1417 -1340 124 797 409 119 70 -291 -508 5 391 -172 -607 360 1399 368 -1720 -1666 777 2135
2443 2135 481 -1525 -1017 776 864 -545 -910 287 998 285 -572 -553 -222 -5 502 867 103 -1201
2461 -1201 -1000 763 1483 -81 -1480 -452 1305 864 -1101 -1335 597 1687 305 -1330 -1027 340
2477 340 819 380 13 -203 -548 -469 337 693 -113 -733 168 1171 203 -1643 -1356 1041 2137 320 -1671
2496 -1671 -1143 657 910 -270 -611 295 731 64 -587 -527 -231 74 681 970 -42 -1416 -1070 800
2514 800 1499 -41 -1357 -340 1258 671 -1166 -1258 597 1566 332 -1112 -873 217 612 306 55
2531 55 -168 -510 -298 518 670 -341 -924 145 1199 265 -1420 -1088 1033 1779 4 -1671 -926 778
2549 778 981 -133 -549 43 352 -56 -338 -220 -103 77 611 768 -299 -1486 -855 1064 1594 -81
2567 -81 -1411 -480 1010 591 -950 -957 646 1397 222 -1077 -908 93 601 520 245 -255 -675 -358 537
2586 537 634 -376 -822 242 1173 195 -1390 -1043 930 1617 39 -1422 -791 666 848 -77 -535 -96
2604 -96 226 78 -72 -119 -227 -89 528 703 -294 -1298 -605 1105 1390 -282 -1432 -468 964 657 -683
2623 -683 -781 468 1025 78 -934 -741 130 638 589 176 -446 -825 -264 702 729 -341 -813 172 979 119
2643 119 -1235 -839 927 1468 34 -1323 -814 527 813 78 -399 -172 85 87 23 -122 -314 -92 556
2662 556 673 -316 -1235 -549 1042 1228 -285 -1320 -424 877 641 -544 -720 287 823 116 -700 -610
2680 -610 72 548 548 136 -538 -793 -135 807 688 -416 -838 100 874 129 -1011 -640 824 1204 -75
2699 -75 -1184 -705 465 795 208 -306 -306 -92 99 182 -31 -310 -114 547 608 -367 -1131 -383 1018 1102 -307
2720 -307 -1188 -394 734 575 -374 -587 155 603 137 -523 -548 -32 484 608 128 -619 -794 -12 841 601
2740 601 -471 -758 104 758 103 -814 -502 677 971 -62 -972 -647 359 772 316 -302 -466 -182 214
2759 214 293 -26 -346 -101 508 474 -402 -934 -214 937 903 -304 -1025 -371 593 589 -190 -474 2 423 192
2780 192 -349 -496 -84 482 600 51 -667 -700 94 787 483 -424 -657 56 598 126 -606 -402 487 767
2800 767 -14 -819 -622 269 742 364 -304 -540 -208 282 333 -62 -344 -74 434 346 -376 -770 -136 797 749
2821 749 -269 -903 -396 493 594 -51 -456 -128 324 232 -242 -466 -79 467 567 -7 -649 -595 165 733
2841 733 394 -405 -596 5 490 136 -444 -322 354 597 -5 -678 -560 189 690 380 -299 -577 -208 316
2861 316 367 -54 -337 -60 393 260 -351 -614 -22 684 588 -242 -751 -334 395 551 42 -373 -224 215 258
2882 258 -123 -393 -116 431 518 -67 -649 -500 253 678 282 -392 -496 1 359 129 -297 -254 223 441 28
2903 28 -524 -492 156 652 385 -329 -630 -189 390 368 -106 -325 -23 321 133 -347 -432 55 540 403 -224
2924 -224 -615 -319 302 527 113 -354 -288 155 288 -87 -384 -107 438 454 -148 -622 -337 335 567 159 -347
2945 -347 -371 2 261 141 -149 -182 118 321 58 -409 -442 142 629 358 -378 -619 -110 447 306 -162 -296
2966 -296 37 263 47 -292 -280 99 406 275 -199 -508 -277 276 504 109 -386 -337 146 328 -53 -380 -94
2987 -94 427 364 -221 -573 -194 386 482 53 -323 -282 12 215 129 -85 -158 47 249 72 -340 -384 144 597
3009 597 269 -417 -574 6 464 252 -225 -260 83 218 -37 -277 -169 153 314 153 -183 -413 -228 254
3029 254 458 94 -387 -325 162 337 -57 -371 -53 427 288 -308 -523 -75 400 357 -60 -296 -205 26 172
3050 172 120 -48 -145 6 207 85 -291 -344 178 563 225 -453 -537 84 487 186 -264 -226 145 203 -79 -254
3072 -254 -74 183 233 77 -179 -326 -162 229 408 65 -395 -309 203 344 -96 -377 -36 438 230 -359 -481
3093 -481 40 447 263 -140 -284 -132 46 129 101 -43 -135 -1 188 67 -274 -302 194 541 140 -490 -481 172
3115 172 508 120 -322 -198 184 199 -116 -237 -15 191 202 29 -185 -273 -112 265 386 13 -408 -260 244
3136 244 337 -124 -386 16 444 191 -391 -453 83 450 199 -218 -283 -67 111 129 65 -71 -136 -10 163 52
3158 52 -264 -270 223 507 50 -524 -422 252 512 51 -369 -184 218 189 -133 -231 28 230 185 -8 -201 -248
3180 -248 -44 296 349 -38 -417 -210 281 306 -180 -385 63 467 157 -425 -413 137 460 167 -265 -270 -26 135
3202 135 101 0 -110 -125 51 204 34 -298 -251 240 472 7 -533 -350 315 500 -21 -443 -186 249 238
3223 238 -135 -263 1 230 164 -69 -224 -223 28 320 296 -144 -446 -150 338 333 -190 -388 81 449 111 -460
3245 -460 -392 207 518 149 -287 -323 -16 180 133 -6 -132 -91 90 194 -32 -335 -215 290 473 -28 -551
3266 -551 -314 348 466 -79 -452 -156 318 241 -155 -304 -22 236 188 -53 -231 -198 57 320 227 -203 -412
3287 -412 -68 406 298 -261 -419 84 450 115 -431 -350 252 503 99 -368 -333 47 266 177 -54 -179 -111
3308 -111 105 190 -60 -313 -150 351 433 -116 -585 -289 387 486 -85 -455 -150 311 232 -198 -330 -13 280
3329 280 228 -75 -303 -242 82 354 185 -235 -398 14 414 230 -321 -420 133 511 118 -441 -366 223 486
3350 486 93 -360 -319 92 320 174 -127 -255 -76 195 241 -76 -328 -132 351 398 -154 -564 -212 436 493
3371 493 -119 -495 -168 325 298 -151 -338 -51 302 238 -115 -356 -224 173 397 160 -307 -415 19 410 208
3392 208 -330 -368 143 485 109 -471 -399 210 520 131 -379 -368 82 354 168 -189 -283 -36 271 254 -124 -378
3414 -378 -122 363 404 -149 -566 -198 447 478 -152 -531 -163 385 336 -155 -401 -79 324 278 -118 -373 -208
3435 -208 229 404 107 -349 -404 69 439 197 -356 -402 148 495 107 -477 -404 238 557 131 -431 -410 93
3456 93 400 193 -201 -315 -31 305 227 -175 -402 -85 415 404 -196 -559 -185 466 484 -151 -537 -162 412
3477 412 375 -181 -439 -103 353 343 -122 -419 -213 258 439 80 -404 -385 139 493 167 -408 -415 177 514 96
3499 96 -484 -413 237 557 133 -449 -447 107 452 216 -269 -377 -14 364 246 -226 -436 -60 442 389 -222 -592
3521 -592 -169 493 486 -167 -565 -183 425 405 -160 -477 -117 395 387 -120 -488 -243 311 490 59 -448 -402 163
3543 163 510 153 -424 -407 193 549 116 -498 -456 213 593 175 -472 -484 110 501 250 -316 -436 -10 406
3564 406 271 -254 -476 -62 476 404 -256 -596 -164 507 511 -163 -593 -217 421 441 -148 -521 -163 408 432 -116
3586 -116 -537 -268 339 540 70 -490 -418 203 557 173 -445 -430 188 572 139 -523 -471 217 625 218 -480
3607 -480 -527 90 562 287 -320 -488 -10 454 294 -287 -522 -54 518 422 -271 -654 -178 523 536 -164 -623
3628 -623 -237 438 498 -131 -541 -205 420 480 -93 -579 -314 352 587 56 -544 -458 224 592 169 -464 -458 207
3650 207 589 158 -526 -486 206 657 247 -482 -572 66 600 335 -331 -556 -29 507 356 -291 -543 -44 556
3671 556 428 -286 -667 -175 561 558 -151 -652 -276 424 521 -95 -576 -266 418 532 -87 -624 -358 382 640
3692 640 66 -584 -486 238 628 182 -488 -474 197 587 177 -509 -503 190 671 276 -491 -620 41 639 417
3713 417 -341 -608 -71 547 400 -310 -593 -65 585 455 -318 -700 -184 565 584 -148 -666 -317 416 563
3733 563 -55 -595 -307 411 589 -51 -662 -414 399 698 74 -636 -527 247 658 202 -512 -510 166 597 194
3754 194 -489 -548 141 685 317 -474 -685 -8 681 479 -322 -666 -112 585 466 -304 -622 -69 608 483
3774 483 -299 -690 -206 566 614 -111 -674 -356 388 617 34 -591 -395 368 642 5 -679 -463 410 759
3794 759 93 -685 -586 251 702 226 -517 -525 131 602 233 -464 -561 88 661 373 -427 -736 -75 708 563
3815 563 -317 -761 -178 607 515 -283 -659 -112 618 509 -275 -708 -210 555 636 -58 -670 -434 346 653 123
3836 123 -596 -469 322 695 72 -697 -531 390 809 145 -702 -629 244 727 254 -497 -561 87 579 288 -388
3857 -388 -574 24 651 447 -403 -793 -155 716 647 -297 -813 -236 625 576 -262 -690 -144 598 525 -242 -706
3878 -706 -255 497 651 -2 -667 -506 279 704 190 -582 -578 275 756 162 -711 -583 365 852 171 -717 -660
3899 -660 249 754 298 -469 -579 28 549 339 -324 -592 -56 628 509 -342 -829 -225 725 713 -260 -895
3919 -895 -307 631 625 -244 -705 -180 560 508 -222 -669 -283 475 647 52 -642 -580 220 755 300 -576 -647 206
3941 206 783 227 -694 -626 345 863 211 -714 -665 210 751 329 -428 -595 -28 523 403 -251 -600 -151 577
3962 577 580 -278 -848 -273 720 781 -232 -927 -337 646 683 -180 -713 -213 515 503 -179 -628 -285 401 655
3983 655 103 -621 -632 165 795 396 -545 -717 148 805 278 -666 -650 314 869 231 -716 -682 209 751 367
4004 367 -387 -605 -93 486 446 -162 -600 -211 540 625 -198 -867 -341 724 828 -197 -948 -380 640 718
4024 718 -164 -717 -260 479 513 -116 -565 -316 327 626 157 -569 -658 116 825 455 -549 -825 74 832
4044 832 374 -644 -685 263 841 217 -695 -653 177 728 397 -343 -608 -200 408 517 -48 -584 -303 477
4064 477 657 -152 -878 -391 731 896 -152 -960 -444 612 727 -104 -654 -276 416 495 -62 -520 -355
4083 -355 248 626 247 -522 -707 46 828 517 -536 -851 44 848 403 -604 -712 218 811 244 -609
4102 -609 -618 144 681 388 -314 -634 -247 432 601 20 -615 -402 420 691 -86 -838 -388 719 873 -190
4122 -190 -977 -451 607 763 -43 -628 -332 325 469 21 -447 -345 221 626 271 -525 -755 24 850 576
4142 576 -508 -879 -10 832 433 -568 -709 186 773 270 -579 -634 87 635 405 -245 -608 -274 399 622
4162 622 33 -638 -460 403 749 -33 -835 -424 647 850 -164 -945 -422 609 773 -21 -654 -382 278
4181 278 482 101 -372 -377 146 564 284 -502 -744 43 899 605 -519 -929 -46 838 476 -521 -679 163
4201 163 736 240 -556 -607 81 628 440 -204 -643 -355 360 658 89 -647 -488 390 742 -31 -845 -449
4221 -449 639 830 -138 -927 -432 552 736 -2 -601 -390 229 510 151 -351 -430 77 574 340 -461 -739
4241 -739 31 887 582 -545 -935 -28 851 521 -461 -674 76 647 261 -453 -543 53 589 449 -196 -666
4261 -666 -387 400 734 124 -674 -548 370 740 -7 -795 -404 623 789 -150 -889 -455 524 732 60 -590
4281 -590 -454 163 495 214 -348 -476 45 604 357 -475 -760 29 875 567 -546 -925 -50 823 520 -435
4301 -435 -673 22 609 323 -367 -547 -2 544 485 -173 -681 -390 429 764 119 -714 -572 352 755 38
4321 38 -747 -428 544 745 -124 -841 -443 506 747 92 -607 -524 113 549 293 -324 -515 -4 574 359 -473
4342 -473 -749 21 866 559 -530 -921 -67 803 547 -382 -681 -44 562 364 -324 -554 -69 527 504 -164
4362 -164 -714 -409 444 803 124 -723 -586 341 781 84 -709 -433 488 720 -62 -779 -443 449 743 138
4382 138 -583 -580 75 601 366 -321 -573 -38 588 392 -444 -736 16 818 527 -517 -912 -102 769 589
4402 589 -313 -699 -140 517 435 -237 -564 -135 485 542 -144 -714 -440 467 811 117 -741 -613 333 754 128
4423 128 -649 -461 395 690 4 -708 -484 378 770 206 -574 -642 40 656 432 -330 -635 -73 582 407
4443 407 -412 -695 7 772 507 -478 -866 -148 732 622 -253 -726 -244 493 486 -153 -572 -213 468 556 -129
4464 -129 -727 -417 487 806 102 -736 -603 288 757 185 -586 -489 301 668 69 -628 -519 315 764 245
4484 245 -569 -706 37 705 478 -326 -664 -90 585 405 -353 -658 -7 701 493 -408 -822 -167 682 667
4504 667 -188 -749 -335 445 580 -72 -594 -282 436 577 -120 -739 -417 477 777 91 -723 -614 244 734
4524 734 246 -518 -540 187 630 176 -546 -553 231 771 319 -566 -749 8 746 512 -359 -689 -126 554 427
4545 427 -295 -607 -52 611 477 -324 -771 -229 632 699 -95 -774 -439 420 656 1 -610 -339 418 590
4565 590 -99 -720 -401 460 737 90 -683 -604 196 708 307 -450 -580 78 596 263 -491 -596 157 751
4585 751 350 -570 -780 25 779 532 -363 -710 -135 532 437 -244 -546 -92 536 459 -250 -707 -273 583 742
4606 742 -37 -788 -506 410 744 56 -647 -401 396 600 -78 -671 -359 455 701 70 -635 -583 153 691
4626 691 370 -384 -615 -30 584 365 -416 -633 83 755 375 -573 -816 18 799 515 -367 -704 -143 498
4646 498 422 -178 -508 -161 411 448 -153 -663 -335 513 776 12 -813 -584 405 802 116 -666 -441 392 600
4667 600 -43 -616 -326 402 634 79 -571 -565 89 648 433 -320 -674 -134 587 469 -361 -685 28 746 403
4688 403 -573 -797 33 800 495 -376 -693 -156 453 435 -90 -467 -215 312 449 -73 -619 -384 443 781
4708 781 47 -831 -619 395 850 120 -675 -470 346 579 -39 -562 -294 347 562 82 -492 -536 50 634
4728 634 486 -284 -730 -198 581 540 -306 -708 -34 725 418 -558 -779 52 792 479 -374 -674 -173 415
4748 415 425 -30 -413 -281 225 465 18 -568 -435 389 796 102 -829 -657 399 889 151 -688 -500 333
4768 333 565 -22 -503 -281 297 473 91 -424 -511 -5 578 524 -228 -761 -274 595 613 -266 -747 -98 701
4789 701 430 -514 -743 64 761 435 -376 -646 -183 369 437 34 -373 -342 124 469 122 -514 -485 338 805
4810 805 117 -840 -694 394 877 152 -679 -494 295 521 -1 -450 -268 232 416 138 -326 -505 -88 555
4830 555 576 -180 -784 -317 616 676 -226 -765 -135 693 463 -456 -692 66 681 385 -339 -586 -169 335 459
4851 459 99 -369 -427 64 506 231 -482 -524 290 780 119 -814 -647 443 900 150 -685 -514 243 510
4871 510 64 -343 -227 162 352 157 -297 -492 -98 562 615 -182 -822 -357 596 691 -207 -737 -119 661 423
4892 423 -444 -657 51 644 382 -292 -535 -185 293 452 141 -365 -460 72 557 275 -475 -552 259 773 125
4913 125 -767 -595 441 844 108 -693 -500 238 526 124 -296 -263 60 286 168 -215 -458 -96 539 600
4933 600 -225 -846 -365 641 748 -196 -761 -166 589 388 -405 -565 79 598 354 -280 -523 -219 263 486
4953 486 211 -329 -502 14 555 295 -455 -559 261 785 163 -752 -597 394 819 130 -633 -463 231 488
4973 488 131 -271 -291 -11 285 255 -144 -453 -176 480 560 -216 -819 -328 668 740 -203 -778 -215 565 420
4994 420 -315 -502 56 496 283 -255 -473 -218 271 523 234 -383 -587 -19 591 362 -411 -554 214 723
5014 723 120 -737 -560 421 803 130 -597 -487 145 452 191 -194 -300 -47 261 296 -115 -482 -179 503
5034 503 612 -183 -815 -324 639 692 -200 -768 -235 533 423 -248 -499 -32 407 284 -166 -424 -231 233
5054 233 519 223 -420 -606 6 647 390 -425 -582 162 678 145 -642 -488 390 742 122 -574 -490 116
5074 116 484 275 -149 -359 -137 248 337 -72 -469 -183 487 579 -216 -809 -299 650 711 -162 -723 -246 466
5095 466 431 -181 -440 -65 365 297 -117 -427 -275 206 543 240 -421 -624 7 651 398 -425 -599 117 635
5116 635 159 -586 -479 327 661 135 -524 -486 90 488 325 -131 -401 -209 255 387 -46 -455 -211 464
5136 464 556 -204 -766 -287 626 678 -147 -716 -281 426 456 -87 -395 -117 292 313 -52 -402 -285 218 564
5157 564 237 -466 -631 19 665 411 -421 -597 87 586 183 -505 -433 261 616 155 -483 -491 45 472 376
5178 376 -118 -455 -244 276 435 -34 -479 -217 429 507 -187 -707 -242 589 653 -136 -680 -314 373 479 -6
5199 -6 -384 -207 219 338 4 -391 -315 209 565 226 -471 -633 34 666 396 -379 -568 39 536 208 -422
5220 -422 -432 177 540 178 -417 -514 -11 487 418 -123 -511 -274 286 458 6 -452 -229 374 467 -160 -634
5241 -634 -249 532 625 -74 -635 -357 316 515 74 -362 -290 160 365 61 -360 -328 189 549 217 -463 -586
5262 -586 51 643 404 -328 -574 -28 483 276 -299 -413 86 494 238 -358 -528 -55 483 462 -128 -543
5282 -543 -305 297 479 16 -446 -257 334 440 -118 -559 -243 446 589 -32 -594 -413 246 546 163 -368
5302 -368 -365 107 404 120 -326 -342 170 533 208 -441 -558 47 591 402 -290 -569 -105 425 327 -199 -413
5323 -413 -7 425 293 -272 -513 -86 491 489 -115 -576 -313 304 500 40 -425 -279 246 387 -59 -471 -253
5344 -253 354 528 26 -541 -439 199 576 237 -358 -446 52 418 182 -319 -355 146 501 175 -412 -497 54
5365 54 568 389 -237 -527 -148 376 381 -96 -413 -112 378 335 -217 -524 -131 490 498 -130 -597 -309 310 502
5387 502 62 -402 -270 197 350 5 -369 -262 263 491 97 -486 -484 148 602 281 -378 -514 21 452 217
5408 217 -310 -346 118 438 141 -369 -424 30 476 368 -174 -510 -234 330 453 -10 -425 -204 328 384 -154
5429 -154 -515 -140 480 489 -136 -572 -276 313 476 64 -351 -284 117 309 99 -279 -284 152 449 165 -450 -504
5451 -504 110 608 328 -387 -543 6 453 234 -281 -327 100 378 133 -292 -379 -4 414 364 -105 -495 -290
5472 -290 282 496 53 -441 -294 290 409 -105 -499 -152 451 474 -152 -550 -263 303 451 101 -311 -292 55
5493 55 294 159 -197 -294 72 432 208 -379 -514 79 617 348 -383 -557 -5 477 251 -241 -314 57 306
5514 306 126 -229 -313 -15 332 342 -71 -471 -321 251 530 111 -454 -348 251 447 -49 -479 -170 427 434
5535 434 -145 -524 -237 290 419 98 -261 -292 -7 284 238 -122 -311 -10 408 248 -331 -515 48 628 371
5556 371 -367 -568 -14 468 275 -220 -290 23 259 119 -162 -255 -50 271 339 2 -443 -359 223 554 154
5577 154 -463 -402 229 467 -20 -466 -187 382 394 -159 -450 -185 256 363 90 -219 -314 -67 251 299 -74
5598 -74 -350 -93 363 286 -286 -512 51 611 340 -386 -566 11 466 266 -190 -269 -5 173 90 -84 -184
5619 -184 -67 205 321 35 -435 -384 203 588 165 -475 -417 220 468 -16 -432 -172 353 335 -146 -414 -161
5640 -161 220 316 118 -169 -320 -115 244 327 -44 -378 -148 356 315 -268 -487 32 561 305 -374 -517 35
5661 35 444 253 -173 -262 -36 128 111 -11 -137 -107 130 302 43 -392 -369 227 599 167 -479 -428 192 464
5683 464 13 -378 -135 306 280 -150 -348 -128 203 295 134 -151 -330 -165 235 355 -22 -381 -173 350 315
5704 315 -255 -481 26 551 292 -356 -481 27 408 217 -164 -238 -54 97 139 34 -130 -170 85 301 98
5725 98 -363 -364 223 573 132 -506 -413 222 503 44 -365 -162 224 225 -117 -271 -76 173 257 123 -152 -346
5747 -346 -182 267 425 -4 -415 -207 307 328 -220 -440 35 524 253 -364 -466 14 374 222 -109 -210
5767 -210 -94 56 134 75 -128 -180 67 313 107 -366 -377 197 550 138 -486 -394 234 465 46 -342 -156 211
5789 211 217 -56 -204 -97 100 199 132 -112 -328 -161 300 420 -26 -453 -233 312 345 -173 -400 32 429 195
5811 195 -351 -404 44 368 223 -95 -224 -158 24 173 117 -111 -214 36 294 97 -359 -354 206 542 112 -480
5833 -480 -394 198 418 57 -293 -151 164 175 -43 -168 -102 66 184 159 -106 -327 -162 279 407 -42 -441
5854 -441 -212 341 339 -164 -394 5 384 191 -302 -344 47 324 212 -75 -239 -173 36 229 161 -134 -270 -12
5876 -12 284 97 -318 -324 203 492 67 -482 -370 211 426 90 -252 -186 80 137 6 -127 -90 44 186 157
5898 157 -109 -341 -139 320 404 -43 -447 -193 318 328 -135 -358 2 347 168 -253 -312 22 284 201 -62
5919 -62 -243 -205 44 264 168 -144 -274 8 291 122 -298 -289 199 455 57 -441 -337 174 399 90 -244 -205
5941 -205 44 157 63 -78 -125 -7 167 178 -100 -330 -124 321 402 -68 -454 -197 297 337 -90 -315 -17 290
5963 290 164 -187 -292 -11 259 221 -23 -244 -211 53 296 200 -152 -298 -4 291 125 -268 -268 171 397 60
5985 60 -379 -316 156 390 116 -222 -237 -1 173 104 -55 -158 -33 163 164 -105 -322 -96 302 370 -80 -423
6007 -423 -201 273 324 -53 -281 -84 224 172 -120 -243 -57 219 225 -13 -268 -228 76 313 193 -166 -303 -7
6029 -7 296 132 -217 -244 136 354 68 -335 -295 117 361 144 -180 -260 -48 187 159 -51 -182 -61 166 162 -99
6052 -99 -306 -90 304 325 -81 -409 -193 250 322 -16 -274 -134 168 180 -77 -218 -67 196 227 -3 -261 -243
6074 -243 82 323 180 -185 -303 0 271 144 -173 -223 99 304 74 -273 -284 74 338 172 -171 -291 -72
6095 -72 208 211 -29 -201 -104 169 172 -101 -279 -72 283 298 -81 -381 -204 212 319 16 -258 -167 121 205 -13
6118 -13 -214 -119 159 253 7 -290 -247 91 343 166 -204 -300 -12 254 151 -140 -205 44 248 87 -215 -254
6140 -254 49 330 221 -155 -318 -93 226 238 -38 -241 -100 173 179 -80 -245 -61 258 245 -85 -332 -185
6161 -185 188 321 55 -246 -212 71 228 49 -194 -157 134 259 28 -292 -244 108 355 146 -218 -294 -22
6182 -22 236 163 -100 -202 2 210 123 -165 -270 6 310 235 -149 -352 -111 252 282 -47 -251 -105 175 191
6204 191 -60 -204 -47 216 227 -49 -291 -191 159 324 109 -234 -259 59 268 93 -199 -179 127 275 25
6225 25 -289 -212 133 346 129 -201 -274 -19 228 180 -69 -202 -52 180 160 -122 -266 -29 296 245 -139 -375
6247 -375 -127 277 292 -43 -279 -115 171 173 -48 -192 -49 180 199 -30 -257 -190 135 340 136 -244 -298 32
6269 32 303 151 -210 -217 92 283 29 -283 -220 145 314 116 -214 -264 -41 210 201 -40 -211 -122 150 188 -73
6292 -73 -277 -68 290 281 -135 -387 -141 311 311 -54 -286 -120 149 176 -25 -160 -58 126 181 5 -210 -194 85
6315 85 335 155 -244 -341 16 345 179 -205 -258 90 279 53 -265 -192 148 300 111 -194 -240 -38 195 230
6337 230 -8 -220 -163 136 243 -27 -280 -113 276 295 -146 -409 -128 298 318 -75 -305 -137 134 179 9
6358 9 -135 -81 77 163 42 -189 -223 65 347 185 -264 -376 4 370 202 -214 -265 93 280 48 -245 -182
6380 -182 118 251 78 -167 -226 -63 174 236 23 -241 -201 120 283 9 -282 -148 275 313 -121 -394 -125
6401 -125 323 313 -70 -317 -132 123 180 36 -101 -123 23 162 88 -155 -244 42 354 208 -264 -404 16 400
6423 400 238 -218 -293 46 254 61 -205 -150 114 232 93 -124 -219 -100 179 279 72 -255 -254 120 329 52
6445 52 -310 -172 259 324 -115 -389 -130 313 284 -75 -278 -134 122 179 57 -107 -144 -23 160 122 -131 -260
6467 -260 1 332 214 -247 -423 12 412 236 -241 -319 41 267 82 -175 -156 76 193 77 -103 -210 -99
6488 -99 165 298 70 -284 -295 131 356 88 -303 -195 235 312 -88 -380 -111 298 308 -57 -270 -159 74
6509 74 186 108 -65 -167 -52 171 173 -110 -285 -32 345 251 -246 -432 3 418 249 -221 -322 32 255 107
6531 107 -138 -145 27 149 98 -43 -177 -133 143 303 87 -302 -315 133 390 110 -310 -232 206 310 -62 -321
6553 -321 -98 270 280 -45 -266 -158 68 219 168 -45 -203 -114 153 211 -72 -287 -39 344 255 -242 -450 -28
6575 -28 404 269 -193 -330 -22 220 124 -100 -133 5 124 130 -15 -196 -189 112 328 129 -306 -343 106 413 125
6598 125 -317 -268 177 318 -10 -302 -135 211 249 -17 -221 -166 27 205 183 -41 -245 -150 179 266 -27 -297
6620 -297 -81 306 263 -217 -405 -21 405 281 -188 -317 -55 198 159 -33 -132 -61 68 119 31 -173 -192 91
6642 91 346 131 -305 -377 78 405 137 -285 -286 133 294 17 -270 -141 171 239 22 -171 -197 -21 187 219
6664 219 -24 -277 -168 186 304 -20 -321 -131 286 276 -154 -384 -44 356 254 -156 -325 -78 180 193 13
6685 13 -135 -107 27 147 80 -141 -202 57 333 142 -301 -362 70 401 182 -268 -287 84 276 46 -223 -137
6707 -137 117 198 46 -152 -210 -38 190 236 2 -287 -205 167 320 19 -311 -147 247 276 -125 -350 -73 299
6729 299 283 -92 -290 -126 144 203 56 -134 -159 12 186 127 -146 -240 40 313 171 -268 -362 56 401 196
6751 196 -243 -297 29 247 97 -144 -146 51 177 91 -102 -208 -68 191 261 3 -297 -229 146 322 32 -295
6773 -295 -172 188 267 -80 -302 -91 247 253 -46 -257 -162 117 225 110 -111 -193 -30 183 146 -114 -227 15
6795 15 289 164 -224 -325 24 359 212 -178 -298 -22 227 154 -88 -184 -16 161 118 -74 -218 -97 169
6816 169 283 28 -294 -248 136 339 78 -268 -218 136 256 -11 -255 -128 182 245 -17 -249 -192 70 239
6837 239 140 -122 -233 -55 188 176 -84 -223 -23 254 179 -183 -321 -4 323 226 -141 -291 -66 192 184 -39
6859 -39 -180 -63 112 159 -34 -190 -118 146 258 23 -274 -245 116 304 96 -233 -220 86 233 41 -211 -153
6881 -153 116 231 37 -196 -206 33 246 173 -111 -264 -94 198 193 -60 -232 -64 218 176 -134 -287 -38 272
6903 272 236 -96 -293 -123 163 225 7 -192 -122 96 177 2 -190 -137 126 267 45 -258 -233 102 293 110
6925 110 -193 -221 43 220 92 -151 -172 64 214 76 -160 -228 6 247 189 -100 -272 -91 194 200 -40 -213
6947 -213 -80 173 179 -89 -230 -70 214 231 -42 -275 -156 146 266 44 -190 -153 87 204 38 -171 -137 121
6969 121 244 37 -230 -229 57 274 147 -152 -234 -16 207 142 -119 -184 12 208 136 -148 -242 -6 244 185 -97
6992 -97 -277 -100 184 206 -21 -197 -107 129 157 -34 -211 -102 166 233 -15 -267 -195 114 261 80 -193 -201 58
7015 58 205 45 -156 -138 91 219 52 -191 -214 40 238 158 -121 -236 -45 194 175 -75 -201 -33 194 157
7037 157 -115 -230 -22 240 212 -82 -252 -98 165 205 1 -189 -122 95 174 0 -178 -124 121 233 30 -250
7059 -250 -203 91 281 97 -212 -217 44 222 70 -154 -143 63 181 56 -163 -180 26 222 181 -81 -233 -92
7081 -92 166 215 -22 -207 -74 185 173 -85 -227 -26 228 185 -67 -242 -97 145 201 27 -147 -122 43 166
7103 166 59 -139 -138 64 221 70 -224 -229 76 282 115 -205 -240 38 204 71 -154 -144 41 155 65 -123
7125 -123 -169 0 187 185 -64 -236 -130 157 237 -7 -238 -113 175 198 -76 -236 -60 218 195 -75 -214 -105
7147 -105 134 187 54 -137 -158 18 164 94 -112 -158 40 220 99 -210 -250 69 302 124 -199 -241 26 209
7169 209 97 -107 -126 29 114 62 -83 -148 -39 146 182 -26 -248 -149 144 261 12 -244 -136 153 202 -64
7191 -64 -222 -62 204 164 -66 -211 -101 114 185 57 -112 -155 -5 160 138 -86 -201 7 222 126 -186 -258
7213 -258 50 299 122 -206 -249 28 213 110 -86 -134 -27 105 84 -43 -131 -55 132 184 -3 -251 -178 142
7235 142 284 35 -249 -171 140 208 -33 -216 -70 169 156 -60 -187 -82 84 157 81 -93 -173 -39 144 166
7257 166 -60 -195 -30 229 145 -179 -256 53 288 149 -183 -230 24 195 112 -75 -124 -12 79 100 9 -121 -87
7280 -87 96 196 25 -233 -177 144 305 36 -267 -184 151 232 -23 -196 -76 143 140 -45 -172 -98 60 159 104
7303 104 -85 -200 -76 159 190 -53 -232 -62 206 156 -166 -251 42 288 149 -167 -230 15 187 130 -45 -112
7325 -112 -39 71 102 27 -118 -113 70 205 42 -238 -207 121 297 46 -258 -181 145 219 -20 -184 -95 113 132
7348 132 -20 -133 -92 40 136 97 -82 -205 -84 172 219 -57 -249 -87 196 175 -129 -240 23 254 117 -178
7370 -178 -222 -1 177 126 -30 -120 -78 34 127 51 -102 -112 62 211 66 -226 -210 135 313 65 -251 -207 110
7393 110 220 3 -156 -89 95 120 7 -114 -94 17 140 124 -48 -213 -99 163 211 -44 -254 -95 188 188
7415 188 -118 -237 -5 222 124 -136 -205 0 166 126 -14 -126 -112 19 146 84 -103 -159 38 216 70 -216
7437 -216 -212 124 304 70 -248 -212 95 227 40 -137 -112 64 106 20 -95 -100 4 152 155 -58 -223 -100 168
7460 168 253 -26 -262 -109 194 188 -98 -235 -17 206 140 -119 -200 -47 139 140 6 -131 -122 14 158 114 -109
7483 -109 -179 22 210 81 -198 -214 102 289 62 -236 -200 82 218 67 -122 -113 22 117 61 -56 -109 -19 138
7506 138 148 -52 -227 -114 184 259 -25 -263 -131 169 186 -60 -210 -23 177 127 -95 -198 -58 125 168 33
7528 33 -142 -152 4 175 111 -112 -186 13 213 93 -189 -205 87 265 85 -203 -211 46 201 98 -103 -140 -2
7551 -2 116 89 -46 -112 -45 133 165 -43 -226 -112 175 242 0 -233 -126 169 203 -38 -192 -58 157 128 -50
7574 -50 -168 -67 95 162 47 -125 -169 8 187 135 -104 -196 0 199 95 -158 -199 57 243 85 -198 -206 30
7597 30 198 108 -92 -153 -27 107 108 -33 -143 -72 123 164 -33 -231 -110 164 236 -9 -250 -142 144 208 -2
7620 -2 -181 -70 123 146 -26 -147 -74 89 180 53 -140 -187 16 182 138 -105 -202 -26 186 104 -131 -185 43
7643 43 220 103 -166 -202 13 183 122 -87 -160 -66 94 118 -6 -146 -75 97 147 -29 -222 -124 164 233 7
7666 7 -231 -150 130 201 8 -171 -92 85 143 2 -139 -113 69 171 72 -140 -178 27 217 144 -105 -199 -16 195
7690 195 107 -128 -179 15 200 115 -128 -211 -11 177 143 -58 -182 -86 94 144 -9 -155 -96 94 152 -28 -209
7713 -209 -120 130 205 6 -218 -163 94 202 31 -156 -120 69 137 22 -131 -117 65 185 70 -143 -192 5
7735 5 199 136 -91 -196 -26 178 125 -96 -173 -8 173 114 -96 -193 -21 172 166 -44 -191 -96 110 181 -3 -156
7759 -156 -87 104 159 -26 -190 -108 127 193 7 -201 -157 76 204 48 -156 -156 33 150 56 -139 -149 45 180
7782 180 61 -149 -179 6 193 129 -98 -188 -32 152 126 -63 -156 -29 143 113 -66 -179 -52 158 165 -38 -201
7805 -201 -92 116 164 10 -156 -94 85 128 -9 -169 -97 94 178 17 -174 -156 68 206 84 -147 -172 23
7827 23 159 76 -134 -148 34 186 56 -152 -175 3 183 126 -102 -195 -54 125 129 -55 -166 -55 123 144 -50
7850 -50 -185 -69 160 176 -35 -209 -113 131 195 19 -148 -97 80 138 3 -131 -104 87 163 31 -158 -163 29
7873 29 197 97 -123 -189 -4 172 89 -111 -145 32 172 63 -138 -168 29 179 110 -75 -182 -60 117 149
7895 149 -24 -154 -74 99 133 -37 -190 -90 157 184 -48 -220 -114 146 196 2 -166 -100 78 121 6 -114
7917 -114 -79 73 165 45 -135 -155 36 212 115 -118 -200 7 199 119 -123 -172 36 176 71 -131 -153 41 163
7940 163 101 -74 -168 -66 107 138 -3 -148 -108 106 149 -37 -186 -79 141 189 -31 -219 -101 141 182 -13
7962 -13 -149 -88 64 107 5 -94 -91 46 131 61 -121 -164 26 204 137 -133 -225 -13 206 108 -130 -158 29 179
7986 179 52 -137 -139 33 166 92 -80 -159 -60 99 160 8 -156 -105 84 168 0 -198 -100 155 183 -50 -229
8009 -229 -94 145 172 -8 -170 -93 68 116 30 -84 -92 25 116 81 -118 -164 6 204 126 -128 -223 -16 216 126
8033 126 -115 -165 26 156 66 -117 -106 33 144 80 -52 -141 -70 84 160 41 -159 -141 75 173 7 -185 -91
8056 -91 161 191 -46 -234 -102 137 170 -14 -162 -101 48 111 39 -83 -99 5 127 91 -105 -196 -6 207 151
8079 151 -137 -236 -4 217 120 -124 -177 20 164 57 -110 -117 18 110 94 -50 -131 -89 94 178 38 -172 -162 94
8103 94 190 17 -189 -127 150 198 -49 -216 -93 138 165 -21 -146 -98 49 114 53 -55 -118 -19 105 102 -103 -191
8127 -191 -11 215 141 -158 -247 -12 212 117 -115 -171 18 149 62 -96 -125 10 116 99 -20 -158 -100 80 187
8150 187 36 -175 -166 82 218 21 -199 -119 147 186 -40 -219 -99 137 166 -6 -136 -119 24 131 64 -42
8172 -42 -131 -45 131 123 -93 -186 -7 208 136 -141 -247 -7 225 132 -124 -182 -11 127 54
8191E4
$$ Imaginary data points
##PAGE= N=2
##DATA TABLE= (X++(I..I)), XYDATA
0 0 0 0 0 0 0 0 0 0 -8 8 -8 8 -8 16 -16 17 -24 27 -32 40 -48 54 -58 72 -81 90 -105 121 -137 153 -175 195
32 195 -219 248 -273 306 -338 378 -419 465 -514 570 -630 699 -773 858 -954 1061 -1184 1326
50 1326 -1497 1698 -1945 2257 -2658 3202 -3992 5230 -7473 12827 -51091 13096 171286 70164
64 70164 -94450 -126875 17918 112103 52556 -76352 -92761 7673 104070 70676 -50524
75 -50524 -122463 -43756 95999 123919 -11792 -135011 -78227 87970 128331 -13344 -135270
86 -135270 -60128 100409 117322 -30907 -132626 -53881 91044 110999 -6744 -107252 -73132
97 -73132 44097 103934 37737 -74334 -93790 9984 104924 57420 -77171 -109541 18163
108 18163 131640 62397 -101438 -130667 18146 140042 73528 -80770 -115868 -2212 96797
119 96797 60062 -47462 -83336 -8748 78402 67225 -35508 -105832 -45007 84931 117172
130 117172 -3778 -126226 -82901 70927 122993 3219 -114224 -62892 77484 103319 -18571
141 -18571 -113870 -54231 74351 104163 6021 -92761 -77107 26905 94553 46807 -58622
152 -58622 -89400 -961 92930 59530 -63564 -103451 5964 115513 65466 -79858 -117548
163 -117548 4771 116924 70132 -62324 -102259 -10515 81682 61440 -31487 -75928 -21758
174 -21758 60056 65976 -17143 -87746 -46838 65742 102628 2299 -109221 -78063 58229
185 58229 113221 13351 -97399 -65704 54654 89735 -3907 -89144 -50152 55371 88314
196 88314 11020 -78262 -73766 17139 87506 52954 -47039 -87556 -12628 80536 61590 -48167
208 -48167 -92742 -1426 99502 62103 -66390 -106694 -2775 101882 69658 -47217 -93048
219 -93048 -19948 67257 61638 -18378 -68592 -29313 48645 65473 -6529 -78869 -50179 53456
231 53456 95144 8939 -95562 -74213 47119 102358 18374 -83675 -64419 39842 80056
242 80056 7369 -70788 -49495 37198 74659 17545 -62205 -67924 8752 77565 53012 -38824
254 -38824 -82579 -18464 70088 61147 -34429 -80752 -8936 79309 55259 -50049 -88936 -6999
266 -6999 83624 63877 -34214 -82250 -26872 54023 61411 -5853 -60226 -34946 36657 60709
278 60709 553 -67853 -47444 44237 84637 10788 -83314 -68545 37641 91406 22612 -70181
290 -70181 -62126 26915 70865 15479 -56949 -49007 24824 66498 22684 -52207 -64939 3458
302 3458 71318 52269 -33901 -77964 -20552 63034 59332 -26042 -72563 -14269 65163 51469
314 51469 -36926 -76103 -11619 68754 59186 -24316 -73394 -30686 44979 60426 1941 -54335
326 -54335 -38374 27592 56030 6362 -56514 -43460 34567 72071 11763 -69409 -60648 28506
338 28506 78923 25425 -56490 -58562 14508 60514 22223 -42626 -46453 13218 56292 25424
350 25424 -41719 -59300 -902 63002 49658 -27915 -71021 -22330 54212 56215 -17259 -63379
362 -63379 -18919 51619 47942 -24768 -64872 -16393 55706 55957 -15179 -66258 -34570 37529 60187
375 60187 8186 -50561 -41777 21073 53677 11384 -48708 -41946 26542 63379 13887 -58491
387 -58491 -55582 20769 69858 28400 -46287 -56859 4903 53869 28503 -31977 -45647 3751
399 3751 48701 27933 -33195 -54268 -4097 55370 46105 -22972 -63624 -22853 45593 51910 -9476
412 -9476 -53781 -22400 38296 43375 -13474 -52892 -19671 42637 50833 -7378 -57633 -35671 30433
425 30433 57137 12117 -45374 -41849 15409 48821 14139 -40051 -37976 19208 53041 14364
437 14364 -47404 -49008 14132 60332 29631 -37451 -54484 -2381 48536 33129 -24242 -45385
449 -45385 -3166 43516 29791 -27237 -50396 -5705 49983 42717 -20145 -57994 -22326 39943
461 39943 48774 -4307 -47564 -25474 29019 41166 -4717 -44963 -23060 33217 47765 -1701
473 -1701 -51880 -36383 25961 54926 14152 -41921 -41254 11574 44618 15956 -32458 -34086 12587
486 12587 43289 14888 -36501 -42431 7642 50536 30228 -28614 -50967 -8674 42407 35956
498 35956 -16821 -43409 -8880 37060 29749 -20924 -44400 -6770 42560 37576 -16327 -50121
510 -50121 -21286 32800 44337 1006 -40461 -27863 20073 38761 3223 -37670 -25929 24903
522 24903 44869 2923 -46855 -36390 22583 52695 15066 -39439 -40475 8973 41574 17477
534 17477 -26865 -31868 6939 36373 16372 -28091 -38441 2131 43859 31497 -22421 -49337
546 -49337 -13260 39054 38710 -11990 -42868 -13238 32826 30206 -15930 -39796 -7999 36069 33309
559 33309 -12657 -43089 -20582 26131 40128 5703 -33874 -29699 11849 36012 10306 -30190
571 -30190 -27930 16384 40721 7500 -39965 -35163 17771 48143 15999 -34596 -38105 5416 36638
584 36638 18528 -20154 -28546 1240 28498 17160 -19320 -33424 -2968 36268 31493 -16305
596 -16305 -46435 -16782 35322 40160 -7987 -42008 -16478 29388 30438 -12056 -36051 -8610
608 -8610 31167 29712 -10169 -37535 -19460 21526 36984 8779 -29688 -31438 6501 35264 15658
621 15658 -26167 -30561 10944 39071 10601 -36344 -34429 15618 45335 15367 -32157 -35634 4054
634 4054 33004 18611 -15139 -25713 -3464 21914 18249 -11307 -29116 -7843 29261 31319 -10741
647 -10741 -43150 -19164 31591 40072 -4790 -39816 -18378 25056 28835 -7891 -30240 -8750
659 -8750 24193 24399 -6717 -29977 -18010 15581 32759 12006 -24643 -32362 1270 33642 19964
672 19964 -21810 -31527 6271 36207 12218 -32294 -32203 13707 41512 14263 -29168 -32859 2430
685 2430 29361 18770 -11026 -23952 -7275 17792 19865 -6112 -27433 -11504 25499 31868 -7566
698 -7566 -41420 -20115 29852 39530 -3778 -38645 -18918 22960 28227 -4885 -26696 -9950 18546
711 18546 21245 -2956 -23948 -17280 10782 29238 13811 -21219 -32589 -1986 32455 23103 -17958
724 -17958 -32022 1210 31946 13890 -26118 -28459 10773 35716 12842 -25069 -29477 424
736 424 25436 19263 -6264 -21606 -11122 12296 19629 -825 -23185 -13125 20581 29794 -4865
749 -4865 -38079 -20504 26587 37979 -1502 -35628 -19215 19642 26270 -2905 -23488 -9981
761 -9981 15257 19270 -624 -20190 -17090 7125 26445 15122 -18084 -31599 -3436 31460 23901
774 23901 -17235 -33213 -889 31457 16107 -22859 -27295 8084 31355 11243 -22169 -25611
786 -25611 851 22998 18349 -4510 -21101 -14299 9217 21654 4958 -20112 -16188 14944 27419
799 27419 -2378 -34116 -19117 24852 36111 -777 -33650 -19967 15685 24103 857 -17367
811 -17367 -9163 9435 14090 915 -15026 -15531 3909 23933 17061 -14598 -31488 -7058 28348
824 28348 24831 -13343 -30647 -2385 28068 15338 -20104 -25293 5804 27543 11657 -17193
836 -17193 -22271 -1687 18104 17027 -1962 -19164 -15094 8348 23079 6905 -20728 -19425 12053
849 12053 27594 988 -30190 -18071 21971 32275 -1734 -31737 -18629 15039 24319 3747
861 3747 -15250 -11944 3686 11840 4742 -9569 -13911 1375 20899 16032 -14044 -30973 -7293
874 -7293 28212 26291 -10573 -29756 -5930 22836 14545 -14945 -20255 4823 22875 10065 -14384
887 -14384 -20330 -4011 14904 17843 2260 -16424 -16678 4478 20895 8260 -17769 -18357 10188
900 10188 25833 2538 -26998 -18294 17292 28694 625 -26256 -16669 12068 21277 4130 -13772
913 -13772 -12770 1665 12293 8114 -6743 -14656 -2289 17512 15641 -11351 -27620 -6107 26848
926 26848 24592 -11002 -30041 -7464 21680 16646 -10455 -18226 1610 17705 8402 -11675 -17181
939 -17181 -3440 14001 17729 2787 -17104 -18815 2845 21720 11333 -14875 -18436 6810 22398
952 22398 2751 -23646 -16207 15636 26384 1716 -23113 -16576 8103 18311 6160 -9445
964 -9445 -11534 -992 9774 8668 -4674 -14181 -4098 15610 16133 -8297 -24997 -7201 22693
977 22693 22071 -8898 -26333 -7045 19086 15907 -7840 -16707 -1381 13625 8754 -7077 -13810
990 -13810 -4504 10778 15865 2903 -16298 -18056 3517 22273 11762 -14697 -19430 4340 20574
1003 20574 4412 -19417 -14108 13151 22671 1275 -20907 -15702 6816 18015 8266 -7736 -12985
1016 -12985 -4031 8641 10264 -2385 -13177 -4767 13905 14878 -7727 -23268 -6886 20775 20850
1029 20850 -6969 -23659 -7877 15468 14624 -4844 -13843 -2775 10228 8386 -4068 -11642 -5796
1042 -5796 7991 14722 4169 -14104 -16939 2526 20239 11240 -12972 -18166 2613 18126 5587
1055 5587 -15268 -12685 9272 18346 2016 -16664 -13747 4942 16047 8793 -6659 -13607 -5412
1068 -5412 8567 11712 -816 -12633 -5807 11643 13397 -6387 -20176 -5786 18621 18702 -6187
1081 -6187 -21804 -8387 13355 14669 -2163 -12384 -4796 7458 8350 -1915 -10287 -6314 6905
1094 6905 14150 4162 -13600 -16224 2434 19209 10894 -11598 -17072 1197 15855 6174 -11989
1107 -11989 -11367 6424 15219 2933 -13202 -12519 2804 14031 9309 -5085 -13355 -6478 7758
1120 7758 12063 461 -11613 -6571 9135 11930 -4331 -16570 -5357 15084 16008 -4449 -18585
1133 -18585 -8508 10614 14053 402 -10723 -6643 4730 8344 440 -8564 -6618 5418 12779
1146 12779 3795 -12492 -14648 2560 17650 10046 -10390 -15951 -102 13838 6905 -9070 -10448
1159 -10448 3868 12714 3716 -10742 -11798 1612 13237 9717 -4793 -13694 -6633 8080 12313
1172 12313 644 -11163 -6626 7751 10640 -3200 -13878 -4782 12463 13741 -3287 -16054 -8437
1185 -8437 8549 13442 2182 -9527 -7998 2757 8380 2279 -7075 -6691 4042 11161 3465 -10856
1199 -10856 -12570 2403 15312 8913 -8580 -14141 -1433 11291 7415 -5789 -9196 1072 9699
1212 9699 4426 -7788 -10579 295 11741 9489 -4357 -13331 -6394 8004 11846 710 -10215
1225 -10215 -6349 6160 9076 -2006 -10963 -4152 9830 11552 -2190 -13780 -8300 7107 13190
1238 13190 3278 -9297 -9202 1972 9020 3217 -6776 -6766 3674 10102 2525 -9998 -10530 2889 13480
1253 13480 7475 -7587 -12662 -2070 9720 7911 -3621 -8690 -1056 7851 5189 -5721 -9740
1266 -9740 -451 10685 8926 -4283 -12583 -5636 7695 10868 783 -8873 -6077 4140 7473 -342
1280 -342 -7891 -4038 6628 9441 -589 -11136 -8205 5249 12435 4363 -8437 -9784 951 8900
1294 8900 4085 -5676 -6375 2653 8319 2065 -8165 -8492 2423 11162 6548 -6042 -11287 -2974 8233
1309 8233 8440 -1801 -8429 -2845 6504 5926 -4130 -9146 -1012 9868 8393 -4340 -12002 -4846
1323 -4846 7733 10142 519 -8209 -5811 3132 6588 688 -6001 -3992 4550 7977 394 -9357 -8001
1338 -8001 4108 11865 4886 -8059 -10245 412 8991 4695 -5045 -6187 1895 6944 1695 -6588
1352 -6588 -6578 2049 8853 5497 -4444 -9595 -3744 6433 8669 207 -7788 -4710 4727 6570 -2099
1367 -2099 -8246 -1882 8521 7746 -3973 -10940 -4082 7241 8967 410 -7001 -5298 1774 5357
1381 5357 1863 -3784 -3953 2189 6498 1655 -7450 -7910 2951 11418 5272 -7970 -10551 442 9336
1396 9336 4776 -5044 -5953 1742 5949 1055 -5475 -4893 1893 6963 4577 -3260 -8387 -4271 5444
1411 5444 9093 1324 -7929 -5965 4163 7316 -1134 -7948 -2147 7849 6932 -4029 -9814 -3041 6656
1426 6656 7552 373 -5628 -4915 316 4365 3206 -1862 -4335 -46 5415 2954 -5690 -7750 1842
1441 1842 10575 5361 -7353 -10084 294 8735 4624 -4215 -5201 990 4299 840 -3621 -3307 1056
1456 1056 4828 3950 -1897 -7194 -4656 4536 9089 1959 -7841 -6588 3659 7535 -393 -7295 -2194
1471 -2194 6963 5961 -3958 -8619 -2100 6267 6541 170 -5001 -4700 -282 4046 3925 -1010 -4596 -1140
1487 -1140 4808 3432 -4841 -7371 1560 9995 4981 -7199 -9594 496 8382 4327 -3831 -4675 617
1502 617 3303 696 -2365 -2213 436 3240 3475 -738 -5964 -4832 3493 8670 2456 -7389 -6892 3063
1518 3063 7526 367 -6572 -2488 5667 4954 -3390 -6933 -1203 5327 5024 -94 -4022 -4081 -792 3574
1534 3574 4521 -70 -4818 -2462 3950 4046 -3471 -6639 1161 9040 4324 -7125 -9017 937 8289
1549 8289 4100 -3661 -4365 261 2397 416 -1436 -1140 290 2177 2932 -297 -5457 -4924 3194 8701
1565 8701 2704 -7311 -6967 2960 7381 313 -6269 -2152 5372 4312 -3283 -5904 -680 4338 3696
1580 3696 35 -2706 -3427 -1447 2887 4752 355 -5178 -3231 3863 4885 -2467 -6352 374 7657
1595 7657 3601 -6306 -7384 1579 7432 3178 -3456 -3886 -260 1483 838 326 -152 -695 389 2184
1611 2184 369 -4371 -4294 3163 8256 2272 -7455 -7014 2666 7143 898 -5128 -1815 4302 2997 -3327
1627 -3327 -4888 -62 4047 3330 306 -2354 -3660 -2019 2629 4978 767 -4836 -3131 3613 4490
1642 4490 -2578 -6149 330 7182 3458 -5509 -6446 1362 6153 2316 -3066 -3067 -35 1265 1015 771
1658 771 -297 -1694 -519 2354 1553 -3156 -3977 2305 6916 1631 -6917 -6063 3005 7034 1115 -4682
1674 -4682 -2258 2767 1984 -2399 -2885 874 3165 1924 -283 -2107 -3352 -1865 2921 5449 1084
1689 1084 -5026 -3923 2672 4236 -1644 -4803 720 6293 2518 -5445 -5910 1293 5630 2419 -2190
1704 -2190 -2497 -477 416 673 971 -47 -1527 -310 2497 1519 -3244 -4097 1942 6332 1559 -5987
1720 -5987 -5000 3001 6015 379 -4547 -1981 2631 2036 -1566 -1981 631 1837 849 -201 -1180 -2428
1736 -2428 -1399 2777 4777 327 -5328 -3799 2847 4590 -809 -4108 170 4566 1391 -4695 -4277
1751 -4277 1917 5008 1878 -2071 -2485 -1125 -115 1111 2021 611 -1758 -1122 1694 1295 -2671 -3281
1767 -3281 2112 5807 1279 -5560 -4693 2361 5180 611 -3483 -1459 2082 1380 -1473 -1643 465 1471
1783 1471 898 258 -836 -2314 -1476 2380 4129 90 -4698 -2953 2982 4113 -1017 -3942 -83 3863
1799 3863 1257 -3702 -3160 1840 3997 1101 -2079 -2207 -890 259 1574 2052 121 -2312 -1410 1626
1815 1626 1563 -1879 -2490 1891 4568 423 -5074 -3737 2472 4684 682 -2835 -1492 1091 682 -957
1831 -957 -617 811 1013 402 85 -789 -2111 -1173 2366 3795 -12 -4212 -2616 2470 3431 -791 -3062
1848 -3062 96 3097 799 -3088 -2478 1585 3216 871 -1683 -1890 -811 384 1569 1681 -335 -2216
1864 -2216 -986 1693 1355 -1677 -2038 1674 3634 -68 -4338 -2716 2542 4034 346 -2720 -1532
1879 -1532 818 807 -353 -257 546 548 160 -45 -776 -1661 -543 2392 3044 -556 -3898 -2075 2383 3023
1897 3023 -553 -2419 10 2173 339 -2440 -1617 1554 2588 598 -1454 -1665 -804 406 1627 1570
1913 1570 -436 -2070 -882 1436 1133 -1307 -1467 1466 2741 -371 -3586 -2019 2267 3298 211
1928 211 -2286 -1408 540 795 28 -95 235 259 170 -22 -765 -1381 -99 2285 2276 -996 -3418 -1395 2310
1947 2310 2555 -567 -2058 -85 1625 218 -1856 -1138 1342 2140 445 -1419 -1712 -687 825 1788
1963 1788 1125 -888 -1887 -474 1359 807 -1071 -901 1350 1921 -704 -2885 -1260 2071 2658 113
1979 113 -1942 -1388 237 826 385 -7 -58 65 191 -70 -829 -1039 370 2051 1470 -1277 -2738 -785
1997 -785 2019 1984 -390 -1561 -242 1021 203 -1173 -740 1009 1695 432 -1329 -1739 -488 1233 1789
2014 1789 560 -1240 -1533 -53 1160 477 -810 -459 1107 1204 -823 -2230 -795 1809 2251 97
2030 97 -1874 -1498 279 1193 605 -304 -397 156 404 -204 -1003 -686 809 1802 744 -1484 -2162 -329 1785
2049 1785 1595 -348 -1363 -434 692 318 -741 -609 725 1429 361 -1323 -1660 -212 1493 1620 108
2066 108 -1352 -1181 186 977 347 -517 -193 778 652 -771 -1603 -426 1516 1800 24 -1708 -1461 276
2084 276 1343 728 -449 -617 150 483 -242 -1012 -425 1064 1575 191 -1586 -1666 97 1625 1245 -380
2102 -380 -1211 -500 523 453 -404 -556 456 1236 389 -1321 -1695 -14 1801 1539 -418 -1638 -851 607
2120 607 889 52 -451 36 601 236 -741 -1084 -135 1252 1460 32 -1589 -1480 309 1588 848 -701
2138 -701 -920 227 692 -303 -1073 -171 1273 1225 -367 -1565 -1046 397 1281 900 -230 -1016 -699 282
2156 282 674 -14 -575 100 1066 478 -1286 -1682 222 2021 1312 -911 -1705 -433 860 664 -147 -254
2174 -254 169 296 -84 -538 -639 -73 940 1300 86 -1619 -1544 509 1923 813 -1129 -1085 483 916
2192 916 -425 -1160 69 1443 933 -735 -1431 -617 573 1070 748 -170 -1034 -850 335 970 114 -780
2210 -780 -111 1081 528 -1350 -1629 498 2126 987 -1264 -1608 -79 938 480 -193 -89 163 -1
2227 -1 -235 -268 -301 -71 692 1144 64 -1597 -1460 685 2012 642 -1360 -1115 622 946 -494 -1083 250
2246 250 1423 642 -950 -1274 -275 674 944 604 -231 -1075 -829 488 1150 123 -962 -235 1120 568
2264 568 -1352 -1546 686 2181 735 -1542 -1593 211 1128 413 -289 -134 86 -117 -228 -83 -124 -102 540
2283 540 1025 15 -1620 -1368 901 2123 482 -1607 -1151 784 1020 -533 -1037 398 1385 350 -1115
2300 -1115 -1059 24 707 742 506 -194 -1068 -857 553 1284 129 -1071 -302 1144 573 -1392 -1438 859
2318 859 2150 481 -1727 -1411 459 1150 253 -380 -106 44 -186 -143 128 -64 -278 377 1001 40 -1617
2337 -1617 -1271 1088 2134 207 -1882 -1121 1001 1153 -522 -1018 385 1213 132 -1127 -852 216
2353 216 704 645 412 -335 -1210 -828 793 1476 53 -1270 -357 1163 534 -1390 -1273 1059 2110 237
2371 237 -1809 -1264 600 1110 212 -282 -30 -42 -315 -82 232 -84 -377 353 1055 31 -1632 -1190 1179
2390 1179 2037 -11 -1893 -892 1163 1086 -623 -1031 359 1069 52 -910 -569 272 513 460 331 -366
2408 -366 -1156 -619 1067 1480 -219 -1546 -442 1227 638 -1235 -1092 1061 1843 -68 -1882 -1119 783
2425 783 1210 298 -284 -234 -318 -353 130 486 -24 -405 330 973 -130 -1698 -1038 1382 2056 -107 -1918
2444 -1918 -888 1090 955 -616 -850 451 976 -31 -885 -524 142 365 474 454 -296 -1154 -579 1051
2462 1051 1318 -418 -1529 -226 1388 659 -1230 -1089 909 1556 -170 -1602 -749 860 1062 125 -426
2479 -426 -411 -393 -143 498 651 -184 -683 158 888 -73 -1471 -724 1507 1887 -383 -2053 -861 1155 1113
2498 1113 -338 -700 283 654 -173 -754 -349 217 429 590 426 -502 -1338 -551 1194 1387 -401 -1479
2516 -1479 -195 1274 466 -1245 -967 952 1505 -135 -1431 -682 679 827 116 -268 -314 -351 -51 564
2534 564 512 -434 -785 252 1045 15 -1351 -636 1326 1506 -563 -1847 -535 1268 1064 -375 -767
2551 -767 17 387 -87 -363 -61 184 237 419 285 -596 -1244 -257 1430 1344 -567 -1597 -269 1185 536
2570 536 -956 -735 857 1217 -257 -1352 -668 593 884 325 -187 -483 -553 -68 665 526 -449 -724 326
2589 326 1008 -80 -1329 -607 1264 1410 -471 -1611 -474 1090 902 -333 -703 -51 359 90 -150
2606 -150 -96 -51 69 419 352 -501 -1055 -102 1324 1071 -724 -1496 -153 1215 612 -782 -683 586 907
2625 907 -241 -1061 -452 577 795 296 -274 -639 -590 104 848 560 -521 -785 221 850 -81 -1137 -444
2644 -444 1169 1216 -499 -1508 -501 955 900 -149 -608 -181 211 141 -33 -107 -132 61 470 363 -526 -1001
2664 -1001 -68 1256 961 -695 -1361 -113 1123 580 -698 -681 426 764 -113 -818 -386 442 671 283
2682 283 -249 -652 -535 238 898 461 -625 -788 234 833 -9 -957 -334 990 962 -512 -1307 -365 895
2701 895 849 -65 -570 -332 61 208 162 -41 -220 -9 440 309 -529 -909 47 1191 793 -699 -1228 -97
2721 -97 987 554 -528 -576 263 588 -36 -599 -360 292 605 357 -228 -708 -502 342 913 348 -668 -733
2741 -733 252 756 6 -780 -273 797 741 -431 -1069 -343 720 792 19 -564 -470 17 343 278 -108 -310
2761 -310 -7 432 242 -524 -725 156 1024 590 -656 -1046 -62 849 553 -347 -539 87 441 77 -405 -339
2781 -339 185 561 365 -252 -716 -404 431 848 243 -646 -618 204 639 39 -588 -228 590 600 -308 -863 -329
2802 -329 597 755 78 -566 -525 23 431 310 -139 -341 -19 375 170 -452 -568 166 847 458 -588 -911
2822 -911 -104 725 558 -241 -550 -65 365 175 -294 -334 115 510 334 -281 -666 -308 483 759 147 -601
2842 -601 -544 197 554 95 -423 -194 437 456 -217 -682 -295 487 689 111 -545 -541 17 473 340 -177 -349
2863 -349 -18 349 141 -377 -427 206 695 320 -519 -735 -81 624 510 -159 -486 -164 255 231 -171 -324 30
2884 30 447 324 -302 -641 -224 520 646 33 -583 -442 192 456 101 -305 -177 269 338 -126 -518 -249 410
2905 410 640 140 -535 -563 59 535 318 -240 -358 32 313 50 -351 -275 230 524 172 -442 -572 -61 513
2926 513 462 -83 -472 -246 242 302 -113 -339 6 433 276 -353 -589 -103 530 505 -86 -506 -321 152 347
2947 347 106 -205 -160 141 243 -48 -400 -243 338 596 107 -556 -528 134 583 261 -271 -295 98 275 4
2968 4 -288 -147 242 375 81 -358 -425 -39 427 447 -70 -482 -269 256 326 -85 -344 2 415 217 -375 -504
2990 -504 23 529 380 -175 -432 -203 156 272 93 -119 -136 69 197 -13 -321 -216 304 545 65 -548
3010 -548 -469 207 555 168 -333 -264 131 220 -54 -241 -38 251 260 1 -282 -314 9 383 383 -66 -454 -244 272
3033 272 348 -97 -337 22 413 164 -407 -445 117 520 251 -254 -379 -116 159 207 66 -104 -163 26 166
3054 166 18 -259 -199 266 478 19 -555 -393 287 560 95 -379 -219 188 217 -101 -234 22 243 176 -63
3075 -63 -246 -228 34 334 329 -108 -441 -212 317 343 -117 -339 50 414 123 -409 -367 223 509 145 -311 -327
3097 -327 -19 186 168 44 -87 -130 6 148 24 -233 -167 265 436 -50 -569 -338 336 525 -6 -428 -172
3118 -172 232 190 -163 -221 76 266 135 -104 -216 -158 63 318 283 -125 -424 -145 340 320 -184 -362 83 431
3140 431 85 -434 -320 271 496 77 -353 -274 60 209 143 -11 -110 -111 24 170 30 -223 -133 274 388 -105
3162 -105 -559 -263 420 504 -72 -457 -149 277 192 -166 -201 91 247 82 -150 -243 -131 101 317 228 -185 -416
3184 -416 -98 358 280 -214 -327 133 426 46 -474 -293 309 485 34 -382 -243 107 221 102 -56 -118 -58
3205 -58 95 163 -14 -259 -119 282 353 -147 -539 -187 444 453 -183 -488 -113 345 214 -179 -227 77 235 80
3227 80 -161 -215 -75 164 313 134 -265 -407 -19 402 261 -262 -356 133 405 -1 -459 -245 371 500 -11
3248 -11 -433 -265 138 261 92 -96 -132 -40 113 146 -65 -275 -67 351 367 -159 -533 -146 467 431 -196 -476
3270 -476 -48 393 210 -243 -292 56 284 118 -162 -228 -72 172 273 72 -306 -349 84 448 210 -343 -366
3291 -366 169 433 14 -464 -219 375 465 -78 -464 -250 213 344 97 -142 -195 -46 158 159 -82 -259 -20
3312 -20 359 303 -269 -542 -83 521 429 -238 -495 -45 380 209 -242 -283 101 339 149 -188 -300 -80 222
3333 222 314 52 -313 -318 121 402 99 -387 -330 242 446 -11 -487 -251 346 450 -68 -451 -226 236 345
3354 345 60 -247 -241 21 244 169 -133 -296 -9 367 255 -266 -500 -18 546 382 -285 -526 -30 446 268
3375 268 -230 -312 67 342 147 -235 -329 -53 308 340 12 -376 -298 160 434 112 -373 -288 238 429 -35 -508
3397 -508 -265 353 508 -31 -488 -283 226 373 62 -284 -248 69 279 139 -223 -325 1 388 257 -287
3417 -287 -503 -29 520 353 -308 -534 -19 479 291 -257 -362 40 380 194 -223 -346 -23 334 337 -54 -420
3438 -420 -273 231 468 88 -412 -314 259 454 -36 -516 -259 393 515 -55 -535 -295 266 435 60 -321
3458 -321 -284 102 323 126 -251 -338 52 440 245 -333 -517 -4 544 357 -323 -546 -15 477 279 -294 -421
3479 -421 47 425 237 -252 -399 -51 386 373 -85 -446 -258 298 474 26 -449 -308 317 473 -29 -524
3499 -524 -245 398 521 -44 -538 -313 294 480 78 -388 -323 116 382 132 -311 -369 85 467 221 -389 -531
3520 -531 43 570 345 -346 -562 -30 508 304 -292 -455 17 456 267 -276 -462 -66 422 394 -128 -500
3540 -500 -252 329 484 -6 -482 -290 320 501 -22 -523 -279 401 561 -35 -569 -352 314 534 99 -419
3560 -419 -349 156 450 155 -334 -383 126 509 233 -394 -532 52 595 358 -353 -588 -44 535 344 -297 -513
3581 -513 -8 482 309 -275 -516 -86 462 433 -138 -552 -269 359 514 -6 -531 -311 330 522 -32 -572
3601 -572 -299 384 581 -5 -587 -390 306 589 115 -457 -401 158 507 161 -376 -418 134 551 249 -420 -559
3622 -559 60 637 392 -365 -624 -47 553 387 -296 -551 -51 511 357 -287 -566 -109 501 477 -174 -622
3642 -622 -287 388 552 -20 -556 -345 346 533 -28 -569 -330 380 595 17 -606 -438 302 634 160 -485
3662 -485 -469 153 564 210 -403 -479 146 610 263 -457 -590 68 657 401 -375 -642 -79 559 433 -267 -570
3683 -570 -80 500 424 -266 -605 -131 550 535 -180 -664 -317 442 600 -20 -600 -350 351 566 -14 -581 -367
3704 -367 366 625 30 -632 -499 267 679 203 -514 -542 130 606 246 -436 -527 144 619 262 -464 -599 73
3725 73 675 413 -357 -671 -108 583 470 -230 -595 -138 529 468 -249 -653 -167 572 599 -172 -716 -335 461
3746 461 632 -21 -609 -381 345 572 7 -579 -386 347 637 75 -632 -537 243 739 260 -531 -621 106 657
3767 657 296 -466 -568 114 633 284 -492 -630 53 674 437 -368 -692 -142 552 527 -185 -636 -217 510
3787 510 537 -197 -686 -231 581 664 -156 -777 -370 499 693 12 -625 -411 339 586 55 -551 -411 306 637
3808 637 133 -609 -605 191 770 341 -543 -708 50 695 363 -463 -631 99 657 318 -479 -637 36 671 453
3829 453 -318 -701 -212 527 595 -116 -661 -313 464 602 -144 -725 -311 577 718 -120 -806 -422 506 731
3849 731 17 -650 -448 292 600 117 -506 -450 238 652 227 -567 -652 142 810 427 -526 -798 13 764 432
3870 432 -457 -662 60 680 339 -466 -648 10 642 496 -292 -717 -274 504 660 -38 -681 -398 440 670
3890 670 -60 -744 -386 578 763 -110 -832 -443 510 768 61 -646 -475 251 600 173 -447 -467 151 641
3910 641 286 -508 -710 82 838 500 -528 -846 -33 813 508 -432 -701 19 667 372 -420 -621 -16 627
3930 627 501 -222 -704 -338 452 702 37 -707 -508 391 736 0 -760 -436 555 777 -80 -851 -478 489
3950 489 766 91 -632 -504 189 592 242 -399 -519 79 641 377 -461 -740 23 855 574 -515 -900 -68
3970 -68 849 576 -408 -728 -26 652 382 -362 -594 -42 570 508 -176 -688 -378 431 782 123 -715 -580 343
3991 343 801 78 -771 -471 538 807 -58 -835 -486 494 777 117 -616 -538 142 567 297 -340 -553 -26
4011 -26 591 433 -415 -770 -61 839 638 -489 -946 -113 837 600 -400 -753 -54 622 412 -302 -566 -112
4031 -112 492 508 -106 -642 -427 393 804 184 -717 -682 314 865 171 -755 -539 476 796 -44 -800 -481
4051 -481 466 764 140 -579 -563 63 565 403 -245 -570 -134 556 488 -367 -800 -93 867 683 -480 -982
4071 -982 -158 831 634 -355 -727 -104 565 399 -247 -530 -147 440 537 -17 -613 -501 332 825 247 -709
4091 -709 -709 306 900 213 -746 -577 441 799 25 -742 -454 416 704 137 -541 -558 35 569 456 -224
4111 -224 -666 -232 535 551 -282 -786 -129 818 648 -499 -992 -157 842 664 -315 -739 -160 479 413 -160
4131 -160 -475 -175 389 521 5 -633 -544 316 875 298 -709 -764 252 886 246 -717 -573 403 791 49
4151 49 -727 -474 358 693 187 -463 -558 -9 564 482 -190 -661 -258 553 618 -244 -807 -195 774 642 -445
4172 -445 -952 -161 827 647 -337 -768 -232 469 470 -83 -453 -235 273 489 60 -590 -529 311 887 289 -765
4193 -765 -807 236 923 298 -675 -577 356 735 43 -678 -445 352 673 206 -455 -597 -67 533 554 -134 -682
4214 -682 -320 534 642 -219 -809 -194 774 660 -420 -938 -155 790 629 -295 -724 -237 444 474 -35 -458
4234 -458 -315 221 519 101 -574 -576 286 863 268 -782 -807 263 949 293 -684 -623 271 681 102 -585 -430
4255 -430 295 622 212 -453 -614 -82 598 624 -137 -742 -355 529 665 -184 -767 -192 732 614 -415 -897
4275 -897 -155 746 640 -240 -728 -301 390 515 51 -446 -361 204 551 128 -579 -572 283 860 276 -759 -811
4296 -811 259 931 318 -657 -634 217 652 149 -534 -450 201 585 250 -410 -630 -111 597 613 -160 -796 -378
4317 -378 547 700 -156 -765 -224 687 608 -361 -844 -165 730 662 -207 -725 -353 367 580 105 -458 -429 169
4338 169 571 160 -570 -570 285 864 263 -764 -797 227 920 347 -615 -666 147 644 226 -454 -473 130 589
4359 589 301 -395 -658 -123 631 655 -176 -822 -392 564 734 -118 -754 -254 602 587 -297 -791 -199 655 657
4380 657 -157 -720 -402 360 645 176 -485 -494 150 610 211 -524 -559 269 833 259 -722 -760 224 898 380
4401 380 -564 -702 58 624 307 -379 -511 48 552 333 -362 -681 -142 648 666 -178 -835 -398 537 737
4421 737 -76 -730 -301 539 595 -233 -730 -235 588 663 -96 -727 -472 333 704 211 -500 -565 124 634 253
4442 253 -504 -560 232 777 259 -673 -732 188 858 427 -513 -726 -3 623 409 -314 -549 -25 559 399 -338
4463 -338 -685 -127 668 654 -216 -838 -387 546 728 -50 -695 -370 453 583 -143 -687 -294 520 681 -54
4483 -54 -732 -521 333 764 255 -537 -598 124 647 273 -479 -540 198 724 254 -608 -697 149 820 465 -460
4504 -460 -752 -100 628 504 -259 -613 -97 538 451 -305 -679 -152 661 640 -209 -814 -383 506 723 21 -665
4525 -665 -417 345 617 -17 -613 -357 419 685 26 -735 -574 319 811 276 -580 -663 84 641 304 -443
4545 -443 -541 121 632 259 -522 -663 73 769 509 -390 -795 -192 634 610 -192 -654 -181 551 492 -258 -678
4566 -678 -135 652 611 -200 -784 -382 483 714 70 -610 -494 258 609 104 -565 -435 332 716 85 -725
4586 -725 -599 325 856 283 -608 -670 90 652 309 -396 -523 75 566 278 -422 -625 9 690 540 -340
4606 -340 -823 -272 630 676 -161 -724 -241 530 526 -252 -658 -135 618 571 -214 -727 -348 430 698 132 -560
4627 -560 -524 174 641 220 -513 -503 272 722 136 -722 -626 329 854 274 -625 -682 76 628 319 -327 -489
4648 -489 -8 472 307 -317 -590 -74 629 581 -289 -855 -330 642 746 -142 -763 -296 532 536 -233 -631 -128
4669 -128 562 501 -188 -639 -353 370 653 189 -516 -600 92 664 318 -482 -577 217 742 200 -691 -613 327
4690 327 864 264 -632 -650 90 610 339 -257 -470 -65 391 344 -207 -564 -162 576 613 -241 -872 -356 658
4711 658 786 -147 -817 -334 517 548 -192 -585 -142 481 447 -157 -578 -326 316 650 236 -497 -641 20 682
4732 682 412 -453 -634 135 736 217 -671 -619 325 853 252 -629 -637 83 578 356 -219 -455 -148 327 380
4753 380 -107 -522 -223 512 638 -181 -860 -390 667 826 -124 -824 -356 509 555 -168 -562 -142 424 388
4773 388 -130 -503 -319 236 601 257 -462 -687 -23 726 487 -430 -707 75 745 274 -626 -602 317 807
4793 807 209 -610 -598 98 562 368 -153 -433 -218 255 432 -5 -494 -288 475 651 -143 -878 -426 659
4813 659 845 -111 -838 -383 481 532 -145 -505 -127 345 371 -59 -422 -348 151 564 341 -413 -738 -76 732
4834 732 521 -432 -752 35 734 281 -609 -596 283 730 169 -567 -542 78 515 360 -123 -453 -296 226 507
4855 507 87 -491 -358 414 678 -107 -844 -377 689 853 -130 -838 -388 472 553 -57 -433 -159 261 286
4875 286 -28 -376 -339 130 581 367 -419 -763 -109 757 568 -406 -741 17 710 290 -585 -579 264 683 174
4896 174 -504 -505 39 443 359 -70 -453 -306 224 536 103 -562 -412 373 674 -89 -808 -362 650 768 -177
4917 -177 -827 -340 493 576 -42 -418 -218 174 265 46 -266 -303 94 538 351 -432 -765 -65 810 603 -426
4938 -426 -774 -32 678 286 -518 -495 260 609 114 -491 -483 15 433 406 -32 -457 -391 169 552 147 -531 -426
4960 -426 388 695 -71 -809 -392 627 760 -139 -768 -325 443 517 -31 -387 -230 133 301 139 -227 -361
4980 -361 2 513 377 -386 -744 -36 806 575 -452 -807 -33 690 347 -434 -478 195 519 122 -416 -422 17
5001 17 425 422 -30 -516 -468 173 618 209 -528 -479 311 639 -79 -762 -344 604 728 -137 -755 -365 384 522
5023 522 60 -327 -262 68 299 179 -213 -382 -11 531 397 -386 -754 -54 773 559 -432 -780 -24 669
5043 669 363 -393 -470 113 479 171 -326 -389 -20 363 409 -20 -524 -451 231 690 216 -559 -517 287 629 -27
5065 -27 -679 -300 566 656 -152 -723 -355 359 542 104 -337 -355 -15 311 238 -163 -390 -31 499 389 -386
5086 -386 -728 -31 786 553 -414 -751 -67 615 376 -319 -449 66 432 208 -248 -377 -70 350 440 9
5106 9 -541 -465 223 679 201 -554 -524 266 632 11 -624 -332 473 595 -105 -648 -340 334 544 145 -325
5127 -325 -410 -56 351 313 -153 -447 -83 478 366 -374 -699 -16 753 524 -417 -754 -98 580 410 -245 -441
5148 -441 -20 353 226 -191 -381 -97 356 470 3 -549 -470 272 711 208 -549 -528 243 603 48 -543 -311
5169 -311 411 552 -74 -594 -349 280 541 187 -338 -470 -72 378 366 -152 -456 -108 468 366 -340 -641
5189 -641 -6 693 468 -380 -719 -103 563 456 -171 -451 -106 311 270 -119 -371 -137 330 472 -12 -561
5209 -561 -468 284 694 207 -549 -523 204 580 106 -474 -317 328 522 -3 -509 -367 241 547 244 -327 -506
5230 -506 -92 426 409 -149 -481 -112 429 341 -303 -573 -41 630 451 -328 -694 -167 493 483 -104 -462 -202
5251 -202 258 349 -43 -371 -202 316 471 7 -542 -426 291 681 203 -509 -520 144 553 166 -395 -353 202
5272 202 472 70 -456 -409 166 558 280 -335 -544 -101 448 450 -144 -475 -147 381 348 -232 -520 -56 550
5293 550 435 -265 -640 -206 440 529 -28 -486 -306 231 392 5 -395 -242 259 442 -13 -538 -397 254
5313 254 615 185 -491 -532 77 509 240 -314 -376 102 431 145 -376 -415 118 556 308 -336 -586 -118 474
5334 474 442 -129 -483 -176 337 347 -170 -443 -93 434 404 -187 -587 -252 388 553 31 -502 -383 206 447
5355 447 69 -382 -262 251 439 -1 -493 -357 249 575 170 -442 -512 13 478 292 -251 -410 -11 394
5375 394 211 -321 -455 66 555 327 -338 -586 -95 490 444 -123 -460 -186 291 332 -86 -363 -121 345 387
5396 387 -93 -529 -281 351 603 79 -514 -436 198 499 109 -388 -280 223 401 -2 -433 -313 226 506
5416 506 176 -368 -489 -34 451 366 -167 -451 -98 379 299 -251 -462 17 526 319 -347 -577 -86 475 409
5437 409 -120 -430 -213 224 319 -1 -308 -187 238 384 -21 -486 -338 316 611 128 -528 -458 191 532 148
5458 148 -363 -282 189 379 22 -358 -253 166 438 197 -311 -477 -96 421 418 -123 -494 -194 359 353 -217 -474
5480 -474 -12 499 318 -321 -548 -67 458 401 -100 -412 -234 167 309 70 -256 -225 143 376 53 -433 -356
5501 -356 277 608 136 -530 -488 174 532 167 -370 -297 150 324 28 -288 -223 128 364 193 -240 -442 -124
5522 -124 396 457 -68 -518 -247 349 418 -154 -471 -44 468 315 -304 -517 -47 435 360 -99 -376 -240 115
5543 115 307 121 -199 -288 52 355 126 -394 -392 224 605 156 -546 -516 187 558 178 -341 -292 126 283 35
5565 35 -218 -179 79 284 192 -169 -425 -178 368 515 -20 -537 -290 344 461 -106 -469 -86 442 294 -285
5586 -285 -446 -15 390 310 -78 -332 -238 70 315 216 -161 -343 -34 359 181 -345 -408 203 592 126 -557
5607 -557 -480 190 539 155 -338 -278 81 223 52 -133 -147 15 210 201 -124 -404 -209 367 530 -18 -564 -319
5629 -319 348 460 -101 -446 -72 390 262 -267 -396 -4 341 288 -56 -280 -243 40 304 226 -156 -371 -55
5650 -55 372 224 -320 -414 164 556 128 -502 -450 222 513 137 -324 -297 46 186 91 -70 -126 -44 135 189 -88
5673 -88 -377 -200 346 516 -40 -587 -330 346 482 -67 -401 -81 337 206 -235 -327 19 324 244 -43 -250
5694 -250 -260 7 312 289 -124 -394 -77 375 241 -313 -397 152 541 120 -496 -416 189 473 114 -288 -256 39
5716 39 178 112 -29 -147 -98 121 231 -16 -354 -221 322 488 -50 -580 -305 381 485 -64 -444 -115 295
5737 295 208 -195 -249 27 253 180 -41 -234 -262 13 356 322 -138 -445 -116 363 282 -255 -365 164 505 107
5759 107 -468 -380 200 474 139 -253 -246 -20 126 122 12 -138 -134 110 241 1 -377 -245 309 498 -34 -547
5781 -547 -292 352 457 -77 -408 -109 271 202 -131 -229 -18 165 156 6 -191 -237 -13 348 299 -172 -463 -109
5803 -109 409 298 -242 -377 106 432 81 -424 -310 222 425 109 -248 -268 -32 146 188 74 -149 -181 61
5824 61 236 1 -345 -201 321 467 -65 -554 -284 343 419 -53 -372 -128 206 153 -110 -191 -36 120 162 31
5846 31 -185 -271 -12 336 285 -190 -454 -99 395 286 -244 -365 81 390 81 -348 -272 172 360 98 -216
5867 -216 -248 -60 144 229 80 -194 -230 68 273 50 -304 -198 282 413 -88 -520 -243 359 443 -46 -358
5888 -358 -155 155 162 -36 -136 -40 93 138 39 -184 -260 -12 364 289 -209 -473 -99 390 287 -239 -357 70
5910 70 350 74 -316 -249 137 327 103 -195 -238 -75 163 243 76 -211 -248 76 297 64 -302 -192 261 376
5932 376 -89 -469 -219 323 399 -34 -348 -184 140 191 15 -120 -98 34 136 79 -163 -266 8 346 261 -218
5954 -218 -467 -88 399 300 -196 -330 20 292 92 -245 -214 106 284 122 -164 -265 -111 172 291 71 -252
5975 -252 -258 72 291 73 -272 -183 241 356 -56 -418 -193 294 385 6 -313 -195 101 215 70 -102 -135 21
5997 21 172 101 -152 -242 5 360 248 -232 -430 -81 358 270 -156 -331 -40 249 121 -181 -219 55 255 136
6019 136 -141 -282 -126 175 295 64 -274 -271 61 304 87 -255 -187 181 287 -57 -381 -197 233 356 29
6040 29 -301 -245 74 247 126 -119 -171 -9 177 108 -143 -237 19 327 227 -216 -391 -59 344 290 -124 -323
6062 -323 -75 221 160 -112 -207 5 215 154 -129 -291 -131 190 291 58 -284 -268 76 300 88 -231 -191 144
6084 144 269 -13 -309 -186 206 339 52 -276 -263 50 264 158 -115 -219 -26 190 140 -128 -225 21 305
6105 305 196 -215 -368 -75 328 279 -92 -310 -120 193 202 -48 -200 -47 204 186 -88 -295 -134 203 317
6126 317 36 -299 -264 87 280 90 -213 -194 81 220 -3 -274 -193 149 310 67 -269 -310 17 286 192 -133
6148 -133 -256 -54 196 135 -138 -214 29 274 171 -179 -321 -53 281 281 -49 -292 -150 165 228 -11 -210 -100
6170 -100 173 211 -69 -294 -144 220 317 29 -299 -243 97 276 104 -168 -193 56 208 55 -188 -204 94 309
6192 309 121 -248 -326 6 324 215 -152 -287 -46 205 141 -124 -192 11 224 147 -154 -292 -82 247 294 -20
6214 -20 -298 -196 146 276 40 -227 -136 177 238 -52 -288 -118 222 297 -13 -296 -224 95 270 119 -157 -214
6236 -214 -3 200 103 -151 -211 62 286 143 -248 -356 4 338 227 -170 -312 -49 220 147 -94 -183 -3
6257 -3 193 135 -124 -256 -83 223 284 0 -310 -254 143 321 68 -267 -192 152 257 -43 -285 -111 234 293
6279 293 -17 -275 -207 102 275 133 -124 -214 -39 193 159 -118 -212 14 292 192 -223 -347 9 369 238
6300 238 -187 -328 -45 225 161 -84 -175 -17 155 103 -77 -223 -97 185 287 17 -332 -272 124 355 98
6321 98 -295 -230 134 268 -27 -293 -128 213 253 -33 -281 -192 78 249 148 -112 -242 -86 182 211 -80 -268
6343 -268 -30 297 206 -213 -391 14 384 256 -191 -331 -48 244 176 -69 -164 -45 105 119 -30 -187 -133 151
6365 151 298 47 -337 -324 132 388 98 -311 -256 139 285 -18 -282 -107 199 236 -33 -243 -180 66 238
6386 238 169 -84 -261 -127 202 248 -54 -291 -66 308 235 -201 -366 8 388 239 -204 -336 -39 234 175
6407 175 -48 -156 -85 65 126 30 -157 -157 114 313 68 -334 -341 150 434 134 -323 -288 130 277 13 -247 -119
6430 -119 170 215 -17 -210 -168 39 212 191 -68 -292 -173 191 294 -41 -324 -96 282 236 -195 -366 -2
6451 -2 375 227 -202 -313 -46 208 191 -14 -145 -103 43 160 77 -154 -185 90 312 99 -317 -338 150 452
6473 452 135 -341 -298 127 302 40 -218 -112 129 185 -4 -179 -151 6 207 221 -51 -327 -209 215 342
6494 342 -14 -336 -147 271 249 -180 -365 -8 376 230 -210 -319 -85 179 192 18 -133 -159 -5 160 112
6515 112 -138 -230 73 338 143 -313 -352 143 445 137 -332 -303 123 300 44 -216 -143 91 149 31 -120 -147
6537 -147 -36 177 221 -43 -339 -219 241 374 2 -368 -198 252 265 -143 -320 -16 321 195 -176 -300 -69
6558 -69 175 216 69 -141 -216 -43 184 175 -122 -254 24 337 134 -325 -373 115 462 170 -311 -330 76 287
6580 287 92 -166 -129 49 147 71 -84 -175 -70 168 277 -4 -335 -234 228 386 13 -381 -211 250 285 -98
6602 -98 -324 -59 257 188 -132 -268 -85 139 206 81 -143 -239 -69 209 230 -103 -295 -28 309 169 -274 -336
6624 -336 109 426 164 -318 -332 50 270 127 -111 -130 -8 104 102 -30 -159 -91 162 284 24 -352 -265 204
6646 204 416 47 -364 -220 224 307 -68 -284 -63 231 220 -70 -236 -119 109 220 115 -113 -266 -90 235
6667 235 253 -99 -319 -81 299 207 -224 -346 60 379 173 -268 -323 31 267 167 -71 -175 -73 88 127
6688 127 29 -167 -138 123 294 27 -330 -248 201 421 65 -358 -251 158 286 -10 -246 -91 177 172 -28 -197
6710 -197 -136 74 226 160 -103 -289 -114 240 287 -73 -327 -81 287 199 -212 -318 29 343 172 -221 -320 -22
6732 -22 235 181 -42 -193 -130 57 163 57 -181 -177 105 279 44 -326 -264 162 395 82 -321 -259 132 305
6754 305 61 -191 -125 104 183 29 -156 -164 30 225 189 -113 -306 -117 241 298 -59 -324 -107 239 222 -132
6776 -132 -283 9 291 174 -157 -291 -64 204 225 4 -206 -171 34 195 94 -159 -191 71 270 81 -268
6797 -268 -269 143 368 110 -307 -290 68 268 96 -170 -170 37 177 66 -120 -183 -4 227 197 -79 -306 -131
6819 -131 231 307 -24 -318 -143 202 234 -87 -266 -54 225 190 -113 -262 -115 176 239 21 -192 -218 26 224
6841 224 126 -146 -218 20 247 90 -250 -256 101 327 112 -249 -295 25 265 153 -117 -190 -14 155 109 -81
6863 -81 -188 -41 188 205 -68 -286 -147 219 295 -1 -291 -179 165 229 -21 -217 -93 179 209 -42 -234 -128
6885 -128 151 266 76 -194 -234 3 241 151 -139 -223 12 229 112 -189 -237 57 300 147 -199 -302 -24
6906 -24 233 193 -87 -220 -81 139 156 -49 -200 -58 175 201 -59 -278 -141 186 287 19 -266 -204 106 229
6928 229 23 -205 -135 105 189 1 -211 -159 105 258 105 -203 -250 -6 233 159 -114 -227 -26 193 121 -130
6950 -130 -220 4 238 164 -137 -264 -67 221 233 -57 -239 -120 126 183 -27 -203 -99 147 186 -55 -258 -152
6972 -152 152 266 42 -242 -221 61 237 92 -167 -158 52 203 62 -182 -179 87 275 122 -195 -250 11 235
6994 235 172 -87 -213 -40 170 131 -94 -186 -34 196 161 -94 -268 -102 204 247 -9 -238 -154 128 200 -3
7016 -3 -188 -100 135 182 -30 -216 -136 120 237 50 -199 -231 19 214 121 -149 -206 7 198 85 -168 -195 44
7039 44 252 133 -188 -262 -22 242 183 -78 -203 -75 154 143 -36 -158 -67 164 199 -46 -243 -115 189 278
7061 278 16 -253 -175 127 236 26 -185 -106 120 167 -12 -177 -131 98 218 81 -166 -229 -16 220 165 -105
7083 -105 -212 -45 189 129 -140 -209 36 239 128 -167 -245 -16 211 177 -64 -182 -83 103 145 8 -157 -96
7105 -96 112 185 -5 -242 -148 173 287 32 -267 -182 132 247 46 -166 -101 87 177 17 -143 -109 77 195
7127 195 102 -139 -239 -50 226 199 -89 -242 -63 205 158 -129 -231 9 228 123 -164 -231 -20 187 156 -49
7149 -49 -185 -112 69 164 37 -139 -145 84 204 20 -231 -171 156 277 27 -272 -194 121 241 50 -167 -133 66
7172 66 135 35 -110 -110 35 169 119 -102 -217 -53 225 241 -60 -253 -77 203 186 -112 -226 4 225 128 -138
7195 -138 -215 -14 160 147 -28 -164 -137 35 166 72 -141 -180 53 204 45 -230 -192 126 293 40 -264 -205
7217 -205 118 236 57 -156 -132 35 120 35 -86 -108 -9 126 127 -85 -212 -91 204 253 -55 -282 -102 204 200
7240 200 -91 -221 -10 200 109 -140 -180 -25 148 142 -7 -138 -154 23 183 110 -114 -190 24 209 80 -205
7262 -205 -202 94 271 48 -242 -200 107 220 34 -145 -129 30 111 72 -48 -112 -38 124 146 -41 -224 -94 197
7285 197 263 -50 -300 -123 223 228 -72 -202 -22 179 114 -97 -157 -13 138 148 12 -151 -154 23 209 140 -110
7308 -110 -218 -12 230 110 -192 -192 112 283 45 -232 -199 82 220 62 -121 -129 1 90 80 -21 -121 -76 100
7331 100 159 -20 -234 -135 182 253 -39 -283 -124 198 214 -70 -216 -57 159 123 -67 -136 -45 102 133 44 -115
7354 -115 -155 2 216 166 -118 -238 -13 225 135 -180 -200 92 259 48 -235 -189 83 213 78 -115 -143 -32
7376 -32 85 110 -1 -116 -76 88 167 -23 -251 -141 200 279 -33 -299 -139 180 220 -41 -198 -59 132 127 -44
7399 -44 -118 -55 68 136 58 -107 -182 -21 191 174 -110 -244 -17 239 145 -147 -219 62 251 70 -188 -178 71
7422 71 197 82 -91 -152 -51 81 138 38 -136 -133 63 182 12 -217 -145 178 263 -37 -308 -159 179 229 -14
7445 -14 -207 -96 98 110 -19 -102 -65 53 137 85 -118 -210 -32 210 198 -108 -262 -50 226 164 -145 -213 39
7468 39 227 87 -183 -168 41 189 105 -59 -141 -72 82 157 50 -134 -138 73 216 39 -208 -149 158 260 -14
7491 -14 -265 -143 159 229 -1 -185 -97 74 121 24 -95 -92 30 116 81 -107 -211 -34 221 194 -104 -273 -55
7514 -55 219 166 -127 -204 19 216 99 -141 -167 18 173 130 -48 -160 -88 81 188 61 -150 -155 69 204 34
7537 34 -208 -150 143 258 -10 -255 -148 142 220 23 -168 -120 50 122 54 -65 -99 11 134 107 -87 -190 -40
7560 -40 211 182 -103 -268 -81 213 177 -83 -207 -14 163 92 -107 -152 0 150 133 -23 -161 -102 82 193
7582 193 78 -149 -171 68 218 56 -181 -146 123 240 21 -224 -154 131 225 53 -146 -143 15 142 87 -56
7604 -56 -133 -20 137 115 -92 -205 -35 201 192 -90 -257 -72 214 178 -68 -212 -39 152 119 -73 -150 -39 129
7627 129 141 -20 -172 -143 71 207 76 -157 -174 38 205 67 -162 -155 92 218 24 -184 -152 89 221 72
7649 72 -137 -143 17 151 113 -44 -127 -30 143 131 -78 -193 -42 191 192 -87 -241 -86 188 193 -57 -197 -77 135
7673 135 132 -39 -162 -72 126 157 -6 -175 -130 85 211 83 -159 -183 35 210 75 -158 -152 75 213 44 -190
7696 -190 -151 75 208 84 -134 -168 -35 138 125 -54 -157 -48 128 135 -75 -182 -43 180 185 -79 -227 -84
7718 -84 168 195 -23 -172 -86 112 153 2 -140 -80 96 152 0 -171 -141 80 205 65 -158 -177 32 187 77
7741 77 -130 -157 36 185 53 -151 -157 47 201 112 -114 -191 -21 164 146 -53 -153 -55 133 128 -62 -169 -35
7764 -35 173 163 -60 -211 -83 145 201 -9 -180 -105 101 171 17 -139 -83 115 170 21 -165 -136 95 205 64
7787 64 -150 -166 33 190 90 -112 -146 21 153 85 -115 -164 17 178 111 -123 -210 -41 156 158 -62 -184 -60
7810 -60 134 132 -41 -155 -34 147 150 -55 -179 -96 124 205 31 -165 -125 79 169 33 -157 -111 98 176 9 -160
7834 -160 -130 87 203 63 -149 -159 21 171 105 -91 -151 -7 157 100 -105 -173 8 201 134 -103 -211 -36
7856 -36 173 168 -59 -188 -49 125 121 -58 -148 -43 120 130 -42 -175 -104 114 200 30 -176 -149 73 195 56
7879 56 -133 -128 79 182 24 -170 -114 102 189 63 -142 -133 25 155 121 -65 -142 -8 142 120 -76 -176 -21
7902 -21 188 157 -99 -229 -38 187 155 -69 -179 -56 119 125 -37 -133 -59 105 115 -30 -159 -93 85 202 47
7925 47 -183 -185 58 208 63 -172 -136 75 178 8 -169 -105 93 169 35 -129 -150 15 149 125 -43 -151 -32
7948 -32 127 128 -45 -168 -10 186 158 -92 -200 -25 202 159 -75 -173 -51 110 123 -24 -113 -68 67 110 -2
7971 -2 -133 -116 83 212 55 -170 -180 72 222 76 -154 -145 70 182 11 -161 -99 84 171 36 -135 -138 -3
7994 -3 137 121 -54 -182 -59 122 146 -56 -180 -51 179 147 -109 -221 -25 201 153 -78 -179 -46 108 109 -9
8017 -9 -113 -57 63 119 25 -125 -124 58 194 61 -180 -201 54 215 63 -178 -155 79 168 16 -158 -104 72 135
8041 135 22 -111 -133 -15 132 126 -43 -185 -79 120 171 -29 -190 -51 192 145 -115 -234 -31 205 151 -82
8063 -82 -186 -64 105 118 -2 -91 -68 55 129 42 -130 -139 64 219 91 -185 -200 65 250 74 -174 -155 73
8086 73 176 25 -129 -99 72 135 37 -92 -125 -13 120 143 -28 -195 -107 127 180 -40 -214 -71 168 162 -97
8109 -97 -204 -33 188 140 -91 -167 -58 89 123 22 -88 -83 21 127 61 -97 -138 53 217 84 -193 -205 70
8132 70 254 90 -178 -157 60 181 35 -127 -89 39 132 41 -100 -124 -26 115 152 -34 -191 -101 134 198 -42
8155 -42 -219 -71 177 161 -88 -219 -36 187 128 -84 -163 -62 89 131 20 -108 -109 12 138 83 -113 -143 34
8178 34 207 84 -177 -210 86 269 88 -164 -167 67 168 53 -91
8191i1
##END NTUPLES=NMR FID
##END=
