##TITLE=1H_LY-Ni-600-ac-240
 CDCl3, 8 sc, 
 15.1.2019
##JCAMPDX= 6.0         $$ Bruker NMR JCAMP-DX V2.0
##DATA TYPE= NMR FID
##DATA CLASS= NTUPLES
##ORIGIN= UXNMR, Bruker Analytische Messtechnik GmbH
##OWNER= root
$$ XWIN-NMR		Version 3.5
$$ Tue Jan 15 16:12:36 2019 Russian Standard Time (UT+4h)  she@DPX200
##.OBSERVE FREQUENCY= 200.1313
##.OBSERVE NUCLEUS= ^1H
##.DELAY= (6, 6)
##.ACQUISITION MODE= SIMULTANEOUS
##.ACQUISITION SCHEME= undefined
##.AVERAGES= 8
##.DIGITISER RES= 18
##SPECTROMETER/DATA SYSTEM= spect
##.PULSE SEQUENCE= zg30
##.SOLVENT NAME= CDCl3
##.SHIFT REFERENCE= (INTERNAL, CDCl3, 0, 15.7039)
##AUDIT TRAIL= $$ (NUMBER, WHEN, WHO, WHERE, WHAT)
$$ ##TITLE= Audit trail, XWIN-NMR		Version 3.5
$$ ##JCAMPDX= 5.01
$$ ##ORIGIN= Bruker BioSpin GmbH
$$ ##OWNER= she
$$ F:/spectra/data/she/nmr/H-F/1/audita.txt
$$ ##AUDIT TRAIL=  $$ (NUMBER, WHEN, WHO, WHERE, WHAT)
(   1,<2019-01-15 16:11:05.71 +0400>,<she>,<DPX200>,
      <created by zg, POWCHK disabled, PULCHK disabled
       configuration hash MD5:
       00 E9 B6 7A A2 85 ED C7 34 08 36 98 17 FE 4E 26
       data hash MD5: 16K
       CE 7F 99 D1 AD 60 26 C2 B4 65 06 65 BD 89 D4 40>)
$$ ##END=
$$ 
$$ hash MD5
$$ C7 ED 2D 32 62 19 7A B5 0D 8C 70 AE 3D 2D 0A 2D
##$RELAX= 
##$RELAX= 
##$RELAX= 
##$RELAX= 
##$RELAX= 
##$RELAX= 
$$ Bruker specific parameters
$$ --------------------------
##$DU= <F:/spectra>
##$EXPNO= 1
##$NAME= <H-F>
##$PROCNO= 1
##$TYPE= <nmr>
##$USER= <she>
##$AMP= (0..31)
100 100 100 100 100 100 100 100 100 100 100 100 100 100 100 100 100 100 
100 100 100 100 100 100 100 100 100 100 100 100 100 100 
##$AQSEQ= 0
##$AQ_mod= 1
##$AUNM= <au_zg>
##$AUTOPOS= <>
##$BF1= 200.13
##$BF2= 200.13
##$BF3= 200.13
##$BF4= 200.13
##$BF5= 200.13
##$BF6= 200.13
##$BF7= 200.13
##$BF8= 200.13
##$BYTORDA= 1
##$CFDGTYP= 0
##$CFRGTYP= 5
##$CHEMSTR= <none>
##$CNST= (0..31)
1 1 145 1 1 1 1 1 1 1 1 1 1 1 1 1 1 1 1 1 1 1 1 1 1 1 1 1 1 1 1 1 
##$CPDPRG= <>
##$CPDPRG1= <>
##$CPDPRG2= <>
##$CPDPRG3= <>
##$CPDPRG4= <mlev>
##$CPDPRG5= <mlev>
##$CPDPRG6= <mlev>
##$CPDPRG7= <mlev>
##$CPDPRG8= <mlev>
##$CPDPRGB= <>
##$CPDPRGT= <>
##$D= (0..31)
0 1.2 0 0 0 0 0 0 0 0 0 0.03 0 0 0 0 0 0 0 0 0 0 0 0 0 0 0 0 0 0 0 0 
##$DATE= 1547554265
##$DBL= (0..7)
120 120 120 120 120 120 120 120 
##$DBP= (0..7)
150 150 150 150 150 150 150 150 
##$DBP07= 0
##$DBPNAM0= <>
##$DBPNAM1= <>
##$DBPNAM2= <>
##$DBPNAM3= <>
##$DBPNAM4= <>
##$DBPNAM5= <>
##$DBPNAM6= <>
##$DBPNAM7= <>
##$DBPOAL= (0..7)
0.5 0.5 0.5 0.5 0.5 0.5 0.5 0.5 
##$DBPOFFS= (0..7)
0 0 0 0 0 0 0 0 
##$DE= 6
##$DECBNUC= <off>
##$DECIM= 32
##$DECNUC= <off>
##$DECSTAT= 4
##$DIGMOD= 1
##$DIGTYP= 9
##$DL= (0..7)
0 120 120 120 120 120 120 120 
##$DP= (0..7)
150 150 150 150 150 150 150 150 
##$DP07= 0
##$DPNAME0= <>
##$DPNAME1= <>
##$DPNAME2= <>
##$DPNAME3= <>
##$DPNAME4= <>
##$DPNAME5= <>
##$DPNAME6= <>
##$DPNAME7= <>
##$DPOAL= (0..7)
0.5 0.5 0.5 0.5 0.5 0.5 0.5 0.5 
##$DPOFFS= (0..7)
0 0 0 0 0 0 0 0 
##$DQDMODE= 0
##$DR= 18
##$DS= 0
##$DSLIST= <SSSSSSSSSSSSSSS>
$$ [...]
##$SUBNAM2= <"">
##$SUBNAM3= <"">
##$SUBNAM4= <"">
##$SUBNAM5= <"">
##$SUBNAM6= <"">
##$SUBNAM7= <"">
##$SUBNAM8= <"">
##$SUBNAM9= <"">
##$SW= 20.0189088683792
##$SWIBOX= (0..15)
0 0 2 0 0 0 0 0 0 0 0 0 0 0 0 0 
##$SW_h= 4006.41025641026
##$TD= 16384
##$TD0= 1
##$TE= 0
##$TE2= 300
##$TE3= 300
##$TEG= 300
##$TL= (0..7)
0 120 120 120 120 120 120 120 
##$TP= (0..7)
150 150 150 150 150 150 150 150 
##$TP07= 0
##$TPNAME0= <>
##$TPNAME1= <>
##$TPNAME2= <>
##$TPNAME3= <>
##$TPNAME4= <>
##$TPNAME5= <>
##$TPNAME6= <>
##$TPNAME7= <>
##$TPOAL= (0..7)
0.5 0.5 0.5 0.5 0.5 0.5 0.5 0.5 
##$TPOFFS= (0..7)
0 0 0 0 0 0 0 0 
##$TUNHIN= 0
##$TUNHOUT= 0
##$TUNXOUT= 0
##$USERA1= <user>
##$USERA2= <user>
##$USERA3= <user>
##$USERA4= <user>
##$USERA5= <user>
##$V9= 5
##$VALIST= <valist>
##$VCLIST= <CCCCCCCCCCCCCCC>
##$VD= 0
##$VDLIST= <DDDDDDDDDDDDDDD>
##$VPLIST= <PPPPPPPPPPPPPPP>
##$VTLIST= <TTTTTTTTTTTTTTT>
##$WBST= 1024
##$WBSW= 4
##$XGAIN= (0..3)
0 0 0 0 
##$XL= 0
##$YL= 0
##$YMAX_a= 140486
##$YMIN_a= -149391
##$ZGOPTNS= <>
##$ZL1= 120
##$ZL2= 120
##$ZL3= 120
##$ZL4= 120
##$ABSF1= 10
##$ABSF2= 0
##$ABSG= 5
##$ABSL= 3
##$ALPHA= 0
##$AQORDER= 0
##$ASSFAC= 0
##$ASSFACI= 0
##$ASSFACX= 0
##$ASSWID= 0
##$AUNMP= <proc_1d>
##$AZFE= 0.1
##$AZFW= 0.1
##$BCFW= 1
##$BC_mod= 2
##$BYTORDP= 1
##$COROFFS= 0
##$CY= 11.3945322036743
##$DATMOD= 1
##$DC= 2
##$DFILT= <>
##$DTYPP= 0
##$F1P= 18.9103706918063
##$F2P= -1.10871071338519
##$FCOR= 0.5
##$FTSIZE= 0
##$FT_mod= 4
##$GAMMA= 1
##$GB= 0.15
##$INTBC= 1
##$INTSCL= 1
##$ISEN= 128
##$LB= 0.24
##$LEV0= 0
##$LPBIN= 0
##$MAXI= 10000
##$MC2= 0
##$MEAN= 0
##$ME_mod= 0
##$MI= 1.114404
##$NCOEF= 0
##$NC_proc= 0
##$NLEV= 6
##$NOISF1= 3.799351
##$NOISF2= 2.8
##$NSP= 1
##$NTH_PI= 0
##$NZP= 0
##$OFFSET= 15.70392
##$PC= 1
##$PHC0= -9127.811
##$PHC1= 6.200042
##$PH_mod= 1
##$PKNL= yes
##$PPARMOD= 0
##$PSCAL= 0
##$PSIGN= 0
##$REVERSE= no
##$SF= 200.130013532006
##$SI= 16384
##$SIGF1= 3
##$SIGF2= 2
##$SINO= 400
##$SIOLD= 16384
##$SREGLST= <1H.CDCl3>
##$SSB= 0
##$STSI= 0
##$STSR= 0
##$SW_p= 3612.71676300578
##$SYMM= 0
##$S_DEV= 0
##$TDeff= 0
##$TDoff= 0
##$TI= <>
##$TILT= no
##$TM1= 0
##$TM2= 0
##$TOPLEV= 0
##$USERP1= <user>
##$USERP2= <user>
##$USERP3= <user>
##$USERP4= <user>
##$USERP5= <user>
##$WDW= 1
##$XDIM= 8192
##$YMAX_p= 0
##$YMIN_p= 0
$$ End of Bruker specific parameters
$$ ---------------------------------
##NTUPLES= NMR FID
##VAR_NAME=  TIME,          FID/REAL,        FID/IMAG
##SYMBOL=    X,             R,               I
##VAR_TYPE=  INDEPENDENT,   DEPENDENT,       DEPENDENT
##VAR_FORM=  AFFN,          ASDF,            ASDF
##VAR_DIM=   8192,          8192,            8192
##UNITS=     SECONDS,       ARBITRARY UNITS, ARBITRARY UNITS
##FACTOR=    0.0002496,     1,               1
##FIRST=     0,             0,               0
##LAST=      2.0444736,     0,               0
##MIN=       0,             -149391,         0
##MAX=       2.0444736,     140486,          0
$$ Real data points
##PAGE= N=1
##DATA TABLE= (X++(R..R)), XYDATA
0 0 0 0 0 0 0 0 0 0 0 0 0 0 0 0 0 -1 8 -8 8 -8 8 -16 16 -16 18 -24 25 -32 34 -40 48 -52 59 -67 75 -85 97 -107
38 -107 119 -132 147 -164 182 -200 223 -246 271 -298 330 -363 398 -439 485 -535 592 -656 731
57 731 -815 914 -1035 1179 -1358 1590 -1897 2328 -2977 4064 -6195 11938 -58883 -149391 50954
72 50954 106230 -32790 -65946 47271 50744 -40679 -66131 5239 73232 49287 -64922 -85244
84 -85244 46286 89480 -47503 -71504 74982 69087 -102276 -86923 89789 93597 -49211
95 -49211 -66716 19365 34830 -13651 -31123 6381 54507 19682 -77468 -55101 83054 76668
107 76668 -73757 -70500 68522 46308 -78879 -33023 88922 42799 -72099 -55475 31290
118 31290 50026 2603 -37950 -13193 42735 13532 -66528 -20518 91002 34992 -98747 -44966
130 -44966 87118 39236 -68968 -20804 59926 9807 -57411 -21030 43879 43737 -14997 -57365
142 -57365 -11286 58836 18244 -61632 -9667 73441 906 -87363 -2068 90181 11034 -74546
154 -74546 -16447 48766 12566 -30527 -9635 26898 22413 -25998 -48436 15649 69258 -1398
166 -1398 -73525 -2883 67239 -6737 -63248 19123 65578 -19792 -66028 5121 54162 13659
178 13659 -31968 -23054 15814 25153 -17110 -33582 28115 53062 -32130 -70759 24725 72007
190 72007 -16873 -58033 18319 43417 -24727 -39925 21813 43744 -2551 -41840 -22811 29906
202 29906 37387 -19608 -37490 23961 36017 -38840 -43586 47221 54213 -39648 -54126 24103 40053
215 40053 -14728 -24895 13862 22786 -10400 -33375 -5380 42392 27331 -39905 -39334 32498 35005
228 35005 -33115 -25098 43098 23986 -48989 -31905 39608 36790 -19557 -30901 3898 21506
240 21506 -446 -22317 1308 35895 5421 -49843 -19579 51294 28624 -42109 -24013 35116
252 35116 12848 -36758 -9415 39400 18460 -31519 -30220 13456 33357 2009 -29091 -4689
264 -4689 28828 -1248 -38773 2696 50620 5361 -51678 -14538 40267 14695 -27606 -7714
276 -7714 23921 5526 -26448 -15204 24322 30303 -12988 -38148 896 35306 1124 -30888
288 -30888 6242 34060 -11301 -41948 5620 43333 5972 -33564 -12529 20546 10816 -15636
300 -15636 -9195 20056 16539 -23900 -30313 19056 39076 -9256 -36352 5024 28484 -9559 -26359
313 -26359 14171 31588 -9328 -35391 -3752 30240 14462 -19965 -16055 15050 13312 -19641
325 -19641 -15877 26292 25600 -24994 -33710 15704 32161 -7750 -23817 7728 19268 -10999 -23436
338 -23436 7990 29999 3287 -29915 -14630 22629 17397 -16837 -13273 19064 11620 -25255 -17675
351 -17675 25664 25972 -17151 -27531 7068 21654 -3917 -16776 6747 19810 -6912 -27538
363 -27538 -736 30620 11074 -25481 -15324 18267 11869 -17218 -8472 21869 12369 -23834 -21094
376 -21094 17642 25951 -7669 -22852 2789 17703 -5027 -18357 7459 24819 -3002 -29239
388 -29239 -6559 25760 12884 -18074 -11725 14555 8101 -17845 -9931 21498 17683 -18468 -23967
401 -23967 9912 22806 -3674 -17156 4265 15076 -7217 -19578 4901 24953 3671 -24197
413 -24197 -11610 17884 12618 -13485 -8954 15562 8175 -20138 -13589 19590 20073 -12260 -20716
426 -20716 4518 15892 -2543 -12611 4851 15941 -4356 -22458 -2237 24737 10109 -20546
438 -20546 -12362 15358 8605 -15234 -5616 18807 8644 -19275 -15225 12946 18483 -4215 -16014
451 -16014 187 12921 -2001 -15116 3854 21621 -494 -25519 -6006 22490 9110 -16013
463 -16013 -6410 12769 2817 -14331 -4645 15459 11725 -11222 -17686 3587 17972 812 -15095
476 -15095 1196 15280 -5168 -19834 4834 23573 486 -21162 -5278 14041 5268 -8813
488 -8813 -3013 9173 4489 -11832 -11467 10998 18772 -6050 -20597 2164 17287 -3609 -14595
501 -14595 7929 16142 -8766 -18967 3548 17690 3507 -11772 -6892 6530 6376 -6924 -7066
514 -7066 11322 12077 -13862 -18402 11400 20148 -7299 -15995 6430 10899 -8689 -9989 8952 12749
528 12749 -3483 -14020 -4897 11268 10235 -7732 -10246 8360 8649 -13298 -10093 17193 13929
541 13929 -15616 -15408 10030 11834 -5796 -6681 5138 5489 -4819 -9393 667 13994 6555 -14837
555 -14837 -11547 12755 10805 -12246 -6787 15222 4886 -18123 -7025 16054 9666 -9137 -9058
568 -9058 2304 6249 184 -6038 376 10832 531 -17223 -4456 19882 7946 -17456 -6927
581 -6927 13934 2321 -13176 581 13969 1710 -12011 -7020 5649 10343 1052 -10194 -3205
594 -3205 10060 493 -13488 2260 18835 -1293 -20835 -1791 16990 2550 -10675 44
606 44 7262 -1782 -7660 -1603 7767 8870 -4441 -14492 -233 15093 1170 -13234 2824 13487
620 13487 -7311 -16351 7181 17356 -2675 -13152 -1280 6301 1746 -2683 -1448 4365 4849 -7621
634 -7621 -11945 7673 17340 -4945 -16948 3906 12525 -6932 -9711 10342 10488 -9052 -11587 2596
648 2596 9073 3958 -4278 -6411 2277 6216 -5577 -7706 10734 12023 -12558 -15229 10100 13474
662 13474 -7322 -8128 7258 4339 -8088 -5036 5546 7723 1019 -8397 -7492 6760 9697 -6371
676 -6371 -8132 9531 6834 -13888 -7949 15022 9363 -11617 -8037 6750 4375 -3917 -2218 2867
690 2867 4080 -781 -8459 -3558 11607 7666 -12046 -8432 11550 5791 -12324 -2789 13743 2169
704 2169 -13101 -3554 9049 4689 -3451 -4526 -492 4670 1603 -7030 -1439 11308 2005 -14818
718 -14818 -3296 15278 3532 -13011 -1697 10330 -709 -8783 1063 7589 1624 -5052 -5649
731 -5649 1166 8491 1815 -9499 -1849 10287 -580 -12233 2706 14314 -2559 -14045 899
744 899 10548 28 -6011 282 3562 206 -3665 -3531 4140 8770 -3003 -12453 1212 12567 -1448
759 -1448 -10665 4283 9763 -6844 -10439 5969 10241 -1962 -7167 -1826 2975 3210 -1271 -3612
773 -3612 3398 5976 -6503 -10249 7134 12949 -5386 -11488 4368 7483 -5689 -4997 7024 5594
787 5594 -4989 -6838 -410 5834 5319 -3317 -6703 2776 5707 -5803 -5833 9675 8102 -10405 -9725
802 -9725 7611 7946 -4536 -3973 3804 1813 -4049 -3462 2079 6667 2638 -7907 -6824 6806 7272
817 7272 -6265 -4765 8317 2983 -11007 -3860 10827 5539 -6983 -5151 2522 2969 -581 -2069
831 -2069 745 4495 -240 -8590 -2356 10778 4943 -9877 -4772 8060 1992 -7863 226 8765
845 8765 529 -8050 -3215 4539 5008 -385 -4817 -1392 4604 366 -6460 1004 9757 -461 -11527
860 -11527 -1245 10123 1758 -7059 -283 5216 -1040 -5236 -153 5260 3677 -3471 -6768 739
874 739 7588 438 -6955 1008 7213 -3194 -8848 3499 9894 -1624 -8479 -408 5263 816 -3020
889 -3020 -549 3141 1729 -4397 -4891 4514 8029 -3062 -8758 1943 7299 -2686 -5841 4377 6117
904 6117 -4514 -6981 2127 6480 1107 -4281 -2807 2482 2833 -2953 -3047 4996 4895 -6229 -7198 5272
920 5272 7702 -3484 -5923 2881 3887 -3544 -3681 3469 5097 -1224 -5979 -2109 5138 4063 -3888
935 -3888 -3802 4116 2928 -5969 -3400 7293 5044 -6342 -5870 3849 4801 -2061 -3116 1949 3010 -2085
951 -2085 -4792 739 6698 1889 -6784 -3675 5527 3314 -4900 -1856 5762 1537 -6740 -2973 5891
966 5891 4568 -3319 -4639 1017 3626 -611 -3400 1312 4991 -1120 -7017 -588 7441 2327 -5997
981 -5997 -2418 4474 1188 -4465 -713 5265 2110 -5033 -4289 3094 5236 -974 -4597 476 3995
996 3995 -1424 -4809 1948 6517 -768 -7096 -1170 5814 2066 -4016 -1453 3545 961 -4381 -2035
1011 -2035 4843 4204 -3718 -5559 1774 5085 -929 -4053 1587 4133 -2268 -5442 1398 6364 689
1026 689 -5609 -2162 3940 2051 -3208 -1359 3926 1784 -4786 -3557 4188 5046 -2340 -4922 959
1041 959 3841 -1097 -3492 1802 4578 -1398 -5863 -371 5769 2049 -4326 -2204 3267 1415 -3573
1056 -3573 -1300 4425 2700 -4197 -4424 2550 4898 -932 -4114 687 3573 -1502 -4336 1667 5680
1071 5680 -389 -5943 -1322 4652 1934 -3195 -1387 2962 1131 -3710 -2294 3927 4204 -2793 -5176
1086 -5176 1248 4665 -795 -3797 1562 3930 -2089 -4917 1176 5342 664 -4311 -1898 2764 1875
1101 1875 -2226 -1580 3048 2395 -3804 -4063 3377 5194 -2052 -4760 1301 3539 -1688 -3066 2198 3730
1117 3730 -1433 -4454 -533 4037 2275 -2874 -2669 2361 2232 -3164 -2370 4322 3514 -4341 -4516 3079
1133 3079 4235 -1733 -2981 1401 2214 -1585 -2789 972 4004 823 -4384 -2623 3769 3129 -3207
1148 -3207 -2395 3691 1803 -4649 -2223 4704 3147 -3278 -3287 1354 2503 -332 -1904 314 2634 -172
1164 -172 -4188 -897 5210 2259 -4901 -2594 4014 1678 -3738 -647 4077 800 -3957 -1998 2558
1179 2558 2977 -536 -3007 -630 2764 404 -3424 225 4890 -63 -5930 -788 5500 1259 -4023
1194 -4023 -680 2904 -61 -2708 -305 2696 1989 -1831 -3704 369 4329 471 -4096 77 4122
1209 4122 -1276 -4866 1641 5423 -814 -4717 -260 2958 596 -1482 -497 1272 1131 -1835 -2857
1224 -2857 1960 4648 -1304 -5228 814 4520 -1311 -3662 2306 3541 -2513 -3766 1311 3305 482
1239 482 -1997 -1633 957 1971 -1142 -2361 2331 3446 -3133 -4609 2971 4796 -2313 -3725 2112
1254 2112 2431 -2336 -1973 2012 2330 -568 -2597 -1460 2266 2824 -1905 -3064 2344 2791 -3489 -2849
1270 -2849 4331 3252 -4062 -3213 2889 2382 -1703 -1300 1031 1067 -476 -1904 -641 3026 2091 -3607
1286 -3607 -3050 3567 2885 -3602 -1922 4014 1218 -4293 -1229 3710 1651 -2081 -1715 335 1484 659
1302 659 -1660 -819 2719 858 -4178 -1319 5006 1766 -4741 -1553 3838 586 -3224 196 2948
1317 2948 76 -2407 -1327 1068 2506 522 -2954 -1222 3090 659 -3711 273 4775 -541 -5311
1332 -5311 38 4470 311 -2785 14 1499 -361 -1254 -397 1373 2278 -853 -3985 -90 4418 381
1348 381 -3924 608 3620 -1905 -3947 2107 4116 -1008 -3129 -291 1313 784 -198 -838 538 1605
1364 1605 -1625 -3320 1952 4697 -1432 -4611 1115 3372 -1753 -2310 2628 2306 -2302 -2611 578 2135
1380 2135 1354 -997 -2163 488 2078 -1406 -2263 2890 3197 -3498 -3948 2854 3471 -1979 -1993 1786 880
1397 880 -1925 -1060 1217 1932 572 -2312 -2331 1973 2884 -1882 -2318 2719 1740 -3869 -1892 4076 2255
1414 2255 -3039 -1959 1553 1011 -670 -485 394 1101 82 -2428 -1144 3375 2174 -3424 -2243 3171
1430 3171 1397 -3268 -497 3595 392 -3352 -913 2158 1340 -594 -1345 -382 1424 500 -2148 -313
1446 -313 3362 418 -4222 -749 4147 767 -3428 -257 2674 -342 -2320 230 1986 686 -1265
1461 -1265 -1858 221 2547 401 -2783 -217 3036 -518 -3564 990 3957 -804 -3677 319 2618
1476 2618 -65 -1489 42 991 336 -1088 -1378 1178 2714 -885 -3495 569 3390 -762 -2895 1456
1492 1456 2687 -1887 -2792 1439 2608 -338 -1823 -632 918 1042 -710 -1275 1309 1923 -2025 -2902
1508 -2902 2136 3389 -1736 -2980 1464 2057 -1666 -1519 1768 1703 -1089 -2001 -291 1830 1479 -1361
1524 -1361 -1848 1345 1671 -2056 -1689 2897 2180 -2949 -2501 2208 2125 -1329 -1266 1006 867 -896 -1324 339
1542 339 2151 782 -2507 -1760 2288 1876 -2125 -1310 2471 886 -2990 -1111 2847 1578 -1880 -1661
1558 -1661 713 1256 -177 -1110 198 1686 -105 -2681 -480 3224 1175 -2956 -1225 2415 677
1573 677 -2251 -184 2437 461 -2293 -1249 1461 1832 -381 -1842 -102 1724 -127 -2121 488
1588 488 2906 -286 -3355 -299 2991 625 -2144 -377 1631 99 -1670 -443 1762 1410 -1348
1603 -1348 -2276 561 2422 -169 -2161 440 2141 -961 -2561 920 2914 -238 -2595 -450 1780
1618 1780 633 -1197 -490 1296 764 -1686 -1571 1698 2415 -1175 -2567 685 2148 -759 -1785 1134
1634 1134 1970 -1083 -2366 362 2363 567 -1801 -996 1304 893 -1398 -877 1908 1379 -2118 -2081 1667
1651 1667 2311 -1010 -1946 715 1491 -880 -1596 887 2094 -307 -2404 -594 2112 1101 -1616 -977
1667 -977 1528 752 -1895 -990 2153 1647 -1769 -2067 1027 1923 -527 -1528 601 1531 -777 -2020 483
1684 483 2461 281 -2347 -876 1786 897 -1482 -643 1691 742 -2002 -1356 1862 1975 -1210 -2049 648
1701 648 1678 -623 -1514 862 1838 -739 -2310 72 2358 659 -1889 -935 1463 762 -1551 -734
1717 -734 1953 1207 -2022 -1851 1539 2065 -883 -1718 637 1403 -774 -1516 737 2041 -149 -2295 -667
1734 -667 2016 1081 -1617 -974 1598 752 -1983 -969 2165 1493 -1764 -1823 1011 1614 -528 -1270 495
1751 495 1349 -531 -1914 139 2401 566 -2381 -1004 1979 877 -1777 -518 1958 515 -2111
1766 -2111 -998 1764 1523 -958 -1612 305 1423 -185 -1494 390 2052 -325 -2631 -125 2703
1781 2703 576 -2227 -543 1709 215 -1592 -179 1670 729 -1463 -1511 804 1931 -211 -1901 130
1797 130 1855 -519 -2170 764 2590 -511 -2611 -20 2034 286 -1328 -245 1023 336 -1157
1812 -1157 -919 1280 1798 -1011 -2342 627 2319 -597 -1978 995 1904 -1261 -2062 994 2066 -232
1828 -232 -1611 -426 1009 710 -802 -859 1141 1277 -1604 -1927 1690 2356 -1415 -2187 1176 1594 -1237
1845 -1237 -1223 1279 1288 -848 -1506 -70 1456 951 -1203 -1324 1177 1304 -1604 -1291 2162 1533 -2312 -1736
1863 -1736 1895 1552 -1247 -1013 861 693 -650 -884 257 1478 468 -1901 -1205 1947 1430 -1902
1879 -1902 -1113 2071 703 -2384 -636 2359 869 -1746 -1002 839 883 -149 -809 -50 1169 99
1895 99 -1960 -358 2601 741 -2683 -842 2329 433 -2016 59 1929 -98 -1762 -414 1163
1910 1163 1075 -271 -1394 -300 1527 243 -1816 191 2458 -369 -2916 204 2769 9 -2023
1925 -2023 124 1309 -331 -1030 117 1010 745 -785 -1711 298 2231 -19 -2194 353 2099 -978
1941 -978 -2286 1295 2448 -960 -2110 369 1292 3 -590 -146 507 553 -876 -1392 1135 2242 -1033
1958 -1033 -2531 928 2186 -1162 -1664 1597 1505 -1592 -1531 953 1347 19 -845 -699 521 974 -771
1975 -771 -1211 1431 1658 -1933 -2064 1919 2011 -1653 -1456 1487 852 -1404 -678 1051 890 -262 -1099 -683
1993 -683 1158 1260 -1267 -1343 1637 1213 -2178 -1146 2456 1160 -2244 -1006 1671 681 -1085 -457 612
2010 612 564 -155 -1025 -347 1600 821 -1993 -1037 2204 905 -2292 -544 2324 255 -2185 -189 1772
2027 1772 330 -1097 -562 374 825 104 -1183 -282 1673 239 -2251 -188 2591 148 -2566 -50
2043 -50 2189 -138 -1676 286 1309 -101 -973 -451 581 1166 -139 -1686 -86 1959 -72 -2115
2059 -2115 511 2333 -794 -2413 735 2150 -440 -1471 219 838 -40 -577 -325 665 1063 -751
2075 -751 -1852 665 2262 -598 -2131 832 1831 -1251 -1698 1392 1666 -973 -1427 232 902 342 -488
2092 -488 -638 553 948 -1035 -1445 1463 1972 -1483 -2036 1326 1632 -1281 -1067 1362 860 -1182 -985
2109 -985 504 1082 382 -956 -977 870 1128 -1166 -1082 1718 1176 -2103 -1362 1964 1296 -1489 -889 1072
2127 1072 504 -841 -500 519 931 41 -1367 -714 1552 1040 -1615 -922 1764 601 -2044 -459 2138
2144 2138 561 -1759 -663 1101 606 -520 -561 225 823 -91 -1366 -113 1912 384 -2103 -505
2160 -505 2000 296 -1834 -6 1732 -86 -1585 -175 1205 582 -664 -893 219 1103 -90 -1360
2176 -1360 217 1743 -328 -2084 278 2112 -182 -1837 163 1428 -210 -1146 76 1013 337 -872
2192 -872 -897 636 1358 -432 -1548 454 1603 -669 -1679 846 1764 -775 -1700 498 1406 -177 -1033
2209 -1033 -39 825 289 -851 -674 982 1142 -1012 -1492 937 1560 -925 -1416 996 1261 -1033 -1251
2226 -1251 828 1241 -392 -1142 -103 961 432 -917 -631 1075 811 -1324 -1065 1422 1248 -1314 -1224
2243 -1224 1111 1047 -952 -883 825 928 -553 -1091 130 1221 321 -1227 -573 1245 637 -1355 -607
2260 -607 1537 698 -1547 -839 1331 894 -989 -846 687 803 -528 -949 347 1217 -98 -1459 -217
2277 -217 1503 352 -1460 -373 1405 314 -1425 -379 1369 575 -1153 -800 826 919 -535 -972
2293 -972 439 1110 -386 -1325 279 1524 -93 -1542 -103 1422 180 -1274 -202 1210 314 -1177
2309 -1177 -554 1061 861 -847 -1028 633 1089 -542 -1147 523 1257 -457 -1400 261 1407 -27 -1324
2326 -1324 -163 1173 247 -1141 -374 1134 560 -1127 -809 964 1002 -773 -1032 636 1059 -560 -1120
2343 -1120 486 1261 -294 -1356 40 1316 150 -1217 -257 1157 331 -1152 -475 1137 685 -1028
2359 -1028 -876 808 984 -607 -1022 515 1084 -445 -1223 330 1342 -141 -1367 -58 1260 167
2375 167 -1155 -263 1085 361 -1052 -579 945 822 -790 -999 624 1093 -525 -1136 525 1221 -452
2392 -452 -1294 339 1309 -118 -1193 -41 1054 210 -947 -373 927 613 -907 -867 848 1054 -769
2409 -769 -1139 691 1126 -669 -1118 610 1111 -446 -1082 196 996 87 -932 -336 894 519 -942
2426 -942 -700 1019 883 -1061 -996 1000 998 -881 -930 754 850 -587 -842 360 903 -38 -955 -268 1003
2445 1003 500 -1046 -601 1152 647 -1231 -667 1234 711 -1108 -698 857 666 -593 -656 349 753
2462 753 -127 -936 -103 1135 309 -1277 -417 1321 409 -1331 -355 1284 301 -1169 -357 932 460 -621
2480 -621 -603 326 747 -116 -947 16 1183 26 -1383 -56 1476 65 -1384 -35 1240 14 -1031
2497 -1031 -49 826 259 -608 -534 401 823 -237 -1061 183 1230 -262 -1361 344 1394 -373 -1334
2514 -1334 332 1130 -230 -887 52 662 172 -537 -495 483 823 -478 -1089 510 1254 -576 -1273 656
2532 656 1205 -688 -1059 619 919 -417 -730 135 608 225 -531 -537 557 805 -682 -987 838 1094 -939
2551 -939 -1088 965 978 -866 -793 710 614 -461 -529 144 563 215 -673 -561 772 793 -925 -847 1054 776
2571 776 -1193 -701 1197 628 -1015 -545 709 444 -345 -399 71 530 185 -791 -403 1069 610 -1210
2589 -1210 -632 1243 507 -1230 -298 1186 208 -1044 -274 687 383 -276 -487 -64 620 185 -864 -200
2607 -200 1202 219 -1443 -251 1423 202 -1235 -46 1013 -97 -833 -4 612 294 -317 -624 8
2624 8 855 138 -1012 -34 1195 -142 -1377 237 1427 -207 -1188 177 871 -135 -561 72 409 231
2642 231 -338 -650 244 1005 -172 -1176 210 1198 -411 -1183 589 1156 -576 -1004 395 749 -148 -454
2660 -454 -71 290 333 -329 -653 425 959 -507 -1152 580 1139 -673 -998 730 840 -700 -684 518
2678 518 553 -187 -429 -139 380 459 -438 -684 612 869 -753 -904 906 876 -940 -747 869 601 -690
2697 -690 -452 422 369 -129 -381 -161 490 414 -677 -622 849 719 -956 -671 1003 534 -1009 -393 919
2716 919 315 -698 -347 341 361 -5 -420 -206 559 313 -813 -379 1074 437 -1155 -415 1075 298 -916
2735 -916 -119 778 84 -597 -200 345 437 -17 -613 -232 730 252 -863 -137 1058 35 -1197 -55 1114
2754 1114 85 -866 -61 549 12 -383 -116 288 404 -177 -748 -3 943 99 -959 10 964 -198 -977
2773 -977 299 986 -192 -815 13 522 137 -241 -205 188 386 -242 -663 298 960 -264 -1039 240 938
2792 938 -284 -759 413 678 -384 -649 167 531 152 -354 -389 223 511 -265 -601 420 739 -575 -883
2811 -883 561 859 -449 -691 365 486 -319 -402 208 430 59 -473 -363 459 580 -448 -626 496 591
2830 591 -627 -561 725 598 -659 -590 434 478 -217 -368 65 336 44 -463 -182 627 399 -724 -552
2849 -552 673 530 -652 -418 659 306 -685 -363 535 421 -297 -475 7 431 131 -478 -150 605 170
2868 170 -780 -239 867 332 -786 -325 631 232 -511 -173 472 259 -358 -440 168 599 31 -652 -142 632
2888 632 77 -694 -8 797 14 -840 -146 700 230 -486 -242 316 232 -283 -356 292 541 -220 -743 74 758
2909 758 2 -691 34 630 -110 -657 70 690 73 -603 -276 400 352 -253 -371 266 427 -342 -586 345
2929 345 751 -223 -744 109 631 -70 -520 107 517 -65 -590 -130 561 337 -451 -462 313 436 -323 -448
2949 -448 395 516 -424 -642 306 667 -132 -577 16 462 -26 -458 0 549 149 -605 -345 524 462 -392
2969 -392 -444 356 380 -395 -411 429 542 -303 -620 129 591 33 -484 -46 465 24 -549 -96 626 275 -581
2990 -581 -408 434 415 -331 -373 331 370 -394 -505 321 603 -148 -630 -5 514 33 -460 -12 511 57 -584
3011 -584 -199 573 367 -441 -424 329 393 -312 -369 378 464 -354 -583 222 630 -34 -520 -27 431 28 -432
3032 -432 -35 537 186 -568 -364 488 472 -359 -412 330 363 -390 -399 385 489 -273 -570 52 485 75 -412 -106
3054 -106 410 101 -517 -178 608 336 -565 -421 448 387 -353 -283 356 292 -336 -391 236 525 -27 -537 -127
3075 -127 478 158 -472 -116 566 112 -667 -205 626 309 -464 -301 306 233 -246 -250 229 357 -184 -556 23
3096 23 624 99 -590 -123 534 26 -560 23 616 49 -578 -196 405 285 -201 -276 140 311 -159 -434 199
3117 199 632 -126 -717 41 648 -22 -515 77 453 -120 -473 15 443 179 -331 -366 158 421 -120 -433
3137 -433 199 506 -313 -624 302 662 -206 -595 115 388 -91 -288 66 300 57 -358 -292 350 478 -269
3157 -269 -539 260 471 -339 -442 460 472 -427 -498 277 431 -72 -284 -30 211 76 -272 -171 425 340 -507
3178 -507 -504 470 489 -436 -382 429 258 -479 -272 386 325 -195 -356 -61 291 192 -308 -223 412 223 -573 -275
3200 -275 672 358 -610 -324 473 218 -379 -109 324 142 -221 -292 43 422 165 -466 -246 508 204 -565
3220 -565 -98 670 87 -686 -114 561 136 -369 -122 184 116 -96 -214 53 405 -14 -610 -94 660 88
3240 88 -645 -21 597 -83 -563 121 502 -30 -390 -110 197 226 -60 -307 18 405 -81 -549 137 674 -145
3261 -145 -710 129 594 -141 -443 159 345 -131 -278 -20 247 243 -175 -439 100 512 -132 -521 236 525 -365
3282 -365 -585 353 555 -264 -433 114 239 -66 -137 -25 173 181 -292 -393 323 569 -301 -554 323 442 -396
3303 -396 -346 474 362 -400 -343 201 286 40 -170 -148 144 210 -279 -269 467 402 -547 -488 487 418 -418 -245 396
3326 396 127 -387 -154 260 254 -16 -308 -214 284 280 -328 -234 463 184 -623 -225 647 263 -502 -202 343 71
3348 71 -244 -45 193 159 -71 -334 -70 468 218 -469 -197 506 101 -545 5 620 8 -561 -66 376 88
3369 88 -157 -96 63 134 -51 -301 39 485 -3 -598 -42 583 -13 -522 101 464 -158 -423 99 349 35
3390 35 -216 -162 74 245 -39 -331 94 441 -176 -536 200 575 -199 -496 184 388 -162 -270 141 235 -24
3411 -24 -212 -137 184 313 -179 -395 182 413 -265 -418 330 399 -366 -402 296 337 -191 -236 70 153 9 -183
3433 -183 -100 243 232 -329 -352 362 385 -363 -340 368 252 -397 -211 358 213 -248 -231 75 215 63 -206 -122
3455 -122 281 163 -377 -179 486 244 -490 -247 424 183 -358 -105 298 90 -258 -158 133 266 8 -332
3475 -332 -123 339 97 -401 -80 456 25 -526 -64 491 90 -372 -82 234 64 -182 -99 146 242 -109 -371
3496 -371 35 437 21 -433 17 428 -78 -441 110 440 -59 -384 -46 260 108 -159 -143 119 218 -165 -317
3517 -317 182 427 -166 -474 117 424 -142 -354 150 299 -162 -334 34 290 78 -249 -200 175 228 -200 -261
3538 -261 250 320 -312 -377 284 387 -214 -340 164 254 -117 -226 92 263 4 -305 -129 306 236 -285 -242 284
3560 284 230 -323 -232 345 264 -312 -304 207 267 -118 -231 55 225 -36 -300 -41 359 109 -403 -200 337 172
3582 172 -326 -153 327 146 -323 -179 277 266 -173 -272 80 271 -26 -280 26 331 -22 -397 -19 417 107
3603 107 -354 -117 298 109 -283 -101 266 161 -256 -254 170 293 -107 -313 63 276 -87 -313 92 360 -38
3624 -38 -382 -50 332 93 -277 -101 251 104 -270 -152 264 249 -231 -288 154 306 -112 -272 121 282 -110
3645 -110 -340 75 371 29 -326 -81 280 98 -257 -95 282 122 -290 -201 258 258 -183 -271 121 230 -127
3666 -127 -263 107 291 -100 -369 12 342 32 -318 -67 253 47 -271 -71 289 142 -269 -225 200 266 -139
3687 -139 -253 122 254 -166 -306 156 350 -86 -357 13 291 31 -233 -20 239 56 -261 -145 267 238
3707 238 -234 -289 173 271 -183 -245 188 258 -227 -306 137 310 -52 -271 -31 202 60 -227 -79 274 144 -338
3729 -338 -218 308 271 -249 -238 228 198 -230 -193 221 229 -143 -272 24 271 77 -237 -85 265 92 -331 -102
3751 -102 399 157 -382 -201 295 172 -223 -129 182 123 -185 -206 87 278 -15 -351 -88 328 66 -350 -29
3772 -29 382 -4 -419 -45 378 97 -275 -117 160 124 -110 -140 109 252 -109 -374 54 436 -10 -407 21
3793 21 356 -81 -349 94 326 -48 -313 -71 199 154 -117 -197 95 220 -154 -309 189 398 -195 -436 133
3814 133 369 -119 -305 119 218 -119 -244 1 214 124 -214 -249 146 289 -170 -293 246 306 -308 -321 313 342
3836 342 -216 -273 130 184 -64 -134 26 175 69 -266 -198 295 281 -304 -310 288 235 -337 -201 348 174 -327 -215
3859 -215 183 191 -51 -177 -56 156 85 -257 -126 356 156 -441 -218 413 200 -368 -133 308 47 -286 -66
3880 -66 225 140 -85 -219 -39 269 130 -284 -84 360 41 -440 -26 487 36 -431 -70 293 31 -181 -13
3901 -13 127 66 -123 -228 54 350 28 -419 -54 390 -24 -382 121 397 -142 -417 57 311 20 -166 -84
3922 -84 56 94 -69 -174 125 321 -156 -451 123 458 -88 -369 160 282 -211 -265 194 274 -59 -216 -108
3943 -108 113 204 -70 -241 111 247 -252 -343 304 406 -283 -383 191 245 -192 -153 172 127 -119 -196 -46 213
3965 213 207 -192 -293 183 257 -252 -215 361 228 -411 -252 322 213 -189 -145 88 72 -57 -110 -14 222 120 -333
3988 -333 -227 359 255 -339 -196 349 92 -376 -75 350 85 -250 -155 78 128 15 -163 -72 208 40 -353
4009 -353 -70 417 83 -464 -97 383 37 -318 8 262 -17 -210 -48 150 174 -37 -254 -19 313 40
4029 40 -349 39 385 -81 -435 97 412 -50 -322 22 187 -6 -122 -38 107 137 -124 -283 107 376 -93
4050 -93 -410 97 357 -162 -328 205 310 -196 -300 73 212 33 -131 -121 75 148 -133 -213 234 307 -267 -377
4072 -377 242 359 -189 -252 219 178 -202 -167 158 199 -4 -207 -148 173 220 -169 -207 223 185 -349 -236 388 258
4095 258 -324 -252 182 149 -126 -86 107 123 -68 -221 -56 293 177 -318 -222 276 154 -318 -99 365 80 -377
4117 -377 -148 270 163 -134 -138 39 112 -19 -169 14 289 14 -401 -85 411 117 -336 -66 272 -15 -302
4138 -302 4 276 78 -214 -194 56 204 -8 -225 8 239 -91 -348 84 409 -44 -406 -13 294 -10
4158 -10 -198 30 182 -11 -207 -110 173 244 -126 -304 53 283 -86 -256 162 306 -204 -333 137 323 -18
4179 -18 -230 -28 137 26 -143 -51 197 139 -237 -263 219 308 -167 -285 144 185 -202 -201 211 238 -162 -282 2
4202 2 224 83 -167 -103 149 70 -235 -113 312 195 -309 -249 216 219 -158 -149 157 127 -177 -193 127 265 -5 -279
4226 -279 -81 233 102 -205 -57 269 39 -342 -101 319 184 -231 -195 133 136 -115 -119 126 174 -151 -310 39
4248 39 310 32 -302 -77 210 2 -252 22 293 34 -317 -147 234 192 -132 -152 100 136 -134 -169 179 276
4270 276 -119 -345 31 304 34 -223 -3 199 -43 -260 -6 296 105 -277 -199 158 179 -121 -143 157 150 -209
4292 -209 -243 163 312 -81 -306 -17 219 3 -207 34 228 -28 -308 -73 302 182 -221 -188 158 141 -150
4313 -150 -110 207 193 -206 -278 120 328 -8 -248 11 209 -48 -227 66 292 4 -323 -122 242 173 -173
4334 -173 -151 131 106 -214 -183 214 274 -178 -327 59 282 -31 -211 66 186 -102 -278 24 318 89 -275
4355 -275 -177 168 162 -143 -123 206 154 -272 -236 250 311 -139 -287 74 200 -47 -149 103 221 -41 -295 -76
4377 -76 294 183 -249 -197 194 131 -242 -105 307 148 -294 -247 163 225 -56 -194 12 146 -39 -219 32 318
4399 318 38 -380 -142 320 162 -253 -80 246 48 -274 -80 278 190 -161 -250 37 242 27 -197 26 263
4420 263 -60 -361 42 422 43 -354 -98 236 32 -186 -4 183 44 -219 -201 150 285 -59 -330 -4
4440 -4 265 -71 -273 145 328 -140 -375 48 330 50 -200 -56 125 52 -118 -89 199 222 -198 -346 166 367
4462 367 -94 -294 141 232 -210 -242 210 286 -92 -260 -68 171 132 -114 -148 143 134 -263 -220 319 321 -295 -336 198
4486 198 226 -168 -133 180 112 -182 -207 46 255 127 -252 -212 201 185 -226 -116 340 130 -407 -177 362 220
4508 220 -206 -158 110 79 -87 -71 105 211 -1 -333 -122 367 188 -327 -140 302 27 -359 5 384 54
4529 54 -305 -147 146 158 -16 -150 -9 154 -55 -300 50 424 2 -460 -73 363 19 -281 78 264 -73
4550 -73 -261 -16 219 171 -90 -255 8 256 -8 -268 107 354 -176 -435 149 420 -79 -311 50 175 -78
4571 -78 -137 41 155 86 -193 -242 135 343 -109 -349 125 292 -217 -278 277 303 -243 -308 113 216 -7 -135
4593 -135 -43 100 69 -168 -161 260 271 -300 -352 277 322 -230 -208 264 163 -261 -162 216 207 -49 -199 -92 176 162
4617 162 -176 -174 252 155 -370 -204 420 225 -371 -210 241 115 -189 -61 153 87 -106 -208 -15 288 127
4638 127 -324 -175 301 131 -334 -43 409 34 -432 -90 333 125 -166 -103 62 82 -39 -135 66 304 -10
4659 -10 -428 -54 454 105 -367 -23 323 -86 -339 88 329 22 -255 -158 91 191 6 -208 11 234 -115
4680 -115 -367 139 458 -95 -458 39 321 -51 -209 118 191 -89 -210 -63 208 245 -105 -317 61 296 -110
4701 -110 -275 233 332 -284 -387 221 367 -86 -220 34 119 -22 -113 -10 201 155 -255 -307 231 350 -191 -297
4723 -297 212 213 -299 -214 306 234 -212 -262 34 172 60 -132 -100 146 93 -260 -156 361 267 -348 -288 295 225
4746 225 -244 -115 250 96 -235 -161 152 240 25 -235 -134 212 136 -238 -87 329 73 -424 -130 395 163
4767 163 -288 -143 167 68 -141 -75 132 163 -84 -297 -32 341 85 -345 -104 303 -1 -332 31 381 11
4788 11 -342 -103 228 136 -101 -118 67 133 -79 -213 111 356 -68 -409 16 376 -4 -283 61 263 -91
4809 -91 -278 30 259 93 -201 -202 99 200 -83 -214 111 246 -206 -346 182 374 -117 -339 44 221 -61
4830 -61 -174 58 194 -7 -251 -127 226 253 -179 -265 143 224 -191 -192 259 259 -230 -298 155 281 -22 -194 -3
4853 -3 144 4 -186 -40 279 115 -306 -241 256 235 -209 -192 198 137 -245 -167 236 231 -139 -273 9 234 46
4876 46 -197 -29 218 18 -306 -64 354 157 -310 -191 218 158 -167 -86 199 132 -203 -209 134 294 -10 -281
4898 -281 -32 240 32 -230 28 305 -3 -347 -91 318 152 -224 -157 142 97 -160 -132 182 198 -182 -320
4919 -320 66 306 -11 -277 7 229 -49 -263 39 316 41 -308 -138 231 176 -143 -140 167 140 -194 -200 205
4941 205 288 -126 -317 41 261 4 -204 41 230 -52 -291 -36 319 134 -248 -179 169 150 -161 -135 188
4962 188 155 -223 -253 145 297 -54 -279 -3 216 -26 -225 37 281 -7 -321 -87 295 155 -191 -140 159
4983 159 126 -168 -116 187 240 -173 -305 78 316 -15 -233 41 215 -70 -258 60 308 38 -276 -127 189
5004 189 160 -142 -130 145 138 -213 -209 212 284 -144 -314 65 238 -63 -186 84 197 -75 -258 -23 260 135
5026 135 -211 -181 159 163 -168 -144 237 193 -260 -238 200 271 -104 -217 51 154 -45 -167 40 237 22 -294
5048 -294 -141 270 181 -211 -169 201 113 -248 -122 269 165 -223 -224 100 194 -15 -161 -2 159 -24 -241 -10
5070 -10 334 95 -344 -149 275 106 -210 -56 225 35 -221 -108 176 205 -69 -214 -7 220 30 -209 38
5091 38 286 -32 -359 6 350 58 -280 -71 167 23 -152 -34 149 97 -146 -244 67 301 -10 -286 14
5112 14 251 -86 -267 114 307 -79 -307 4 230 64 -107 -65 82 89 -125 -157 183 273 -156 -327 113 292
5134 292 -100 -225 153 198 -160 -218 119 236 20 -167 -116 118 144 -112 -165 176 184 -254 -266 246 277 -218 -249
5157 -249 143 142 -139 -120 103 125 -63 -184 -74 200 158 -201 -204 200 163 -243 -136 317 157 -302 -176 225 171
5180 171 -119 -102 62 99 -25 -131 -1 232 89 -298 -152 314 154 -277 -92 265 31 -294 -50 252 78
5201 78 -169 -134 53 145 12 -167 -34 202 5 -324 -19 369 36 -367 -59 280 5 -224 27 191 2
5222 2 -163 -84 113 198 -9 -244 -22 269 -3 -265 88 326 -129 -359 79 321 -19 -210 -5 114 -21
5243 -21 -98 -41 107 155 -133 -292 88 324 -74 -300 95 239 -181 -252 186 250 -137 -236 -6 114 54 -67 -91
5266 -91 84 118 -157 -208 221 310 -205 -318 179 236 -155 -140 203 132 -174 -158 67 175 71 -128 -162 112 168
5289 168 -159 -153 249 173 -326 -235 287 202 -204 -145 145 59 -129 -73 80 147 2 -221 -133 237 183 -225 -144 259
5313 259 81 -314 -78 342 100 -271 -103 162 87 -58 -51 40 104 -13 -205 -18 299 90 -319 -83 308 59
5335 59 -283 5 273 -33 -254 -28 177 79 -96 -138 18 150 -14 -207 34 270 -58 -342 32 346 -26
5356 -26 -278 35 203 -49 -166 35 163 52 -125 -143 96 226 -42 -243 65 251 -115 -268 155 290 -136
5377 -136 -271 102 222 -30 -131 18 107 39 -114 -99 158 196 -168 -268 144 263 -158 -232 176 177 -209 -193 162
5400 162 182 -73 -172 -35 107 68 -122 -103 175 145 -227 -177 283 230 -223 -187 200 139 -168 -97 171 126 -112 -158
5424 -158 24 203 88 -178 -108 197 112 -239 -90 297 104 -302 -135 241 125 -179 -100 105 70 -102 -119 53
5446 53 186 -12 -267 -71 256 70 -258 -60 246 2 -273 -13 269 68 -191 -95 122 126 -41 -105 64 167
5468 167 -56 -239 59 319 -12 -295 -13 256 -6 -218 28 218 -16 -215 -49 157 126 -97 -175 62 173
5489 173 -73 -198 115 240 -115 -279 64 263 -36 -216 9 159 -30 -167 -25 172 85 -175 -160 146 210
5510 210 -109 -184 129 191 -140 -191 170 244 -90 -219 50 186 12 -139 -7 152 40 -184 -92 210 152 -198
5532 -198 -195 150 155 -152 -148 147 145 -161 -191 99 203 -14 -196 -29 165 45 -170 -57 205 59 -245 -124 216
5555 216 151 -176 -136 139 119 -117 -124 132 172 -87 -196 27 216 28 -197 -25 180 18 -205 -25 234 68
5577 68 -222 -133 158 129 -130 -132 99 117 -133 -182 105 197 -59 -236 0 198 9 -173 -13 180 -4 -217 -57
5600 -57 212 116 -173 -136 128 142 -108 -118 132 147 -137 -190 77 221 -20 -200 -11 182 8 -159 -2 208
5622 208 44 -226 -91 193 128 -160 -138 121 108 -129 -128 112 157 -104 -222 18 203 10 -190 -16 156 -15
5644 -15 -218 -19 229 61 -209 -109 146 106 -101 -88 110 106 -115 -152 101 232 -54 -221 2 204 -16 -180
5666 -180 32 196 -19 -209 -30 192 81 -146 -117 102 117 -90 -129 113 155 -135 -226 89 235 -59 -222 34
5688 34 155 -59 -164 29 164 10 -182 -106 147 143 -116 -143 101 134 -129 -146 170 199 -133 -210 85 176 -27
5711 -27 -121 13 117 -10 -138 -32 180 109 -181 -163 161 162 -140 -125 160 116 -195 -148 145 170 -90 -154 0 113
5735 113 13 -125 -26 163 44 -223 -101 237 122 -211 -120 183 97 -152 -60 164 87 -116 -127 67 169 36
5757 36 -155 -33 165 32 -186 -10 252 41 -256 -64 217 58 -150 -46 108 21 -117 -79 86 141 -47
5778 -47 -217 -8 221 21 -210 20 210 -51 -230 42 229 -2 -186 -43 115 66 -67 -77 54 114 -79
5799 -79 -196 93 255 -60 -253 54 206 -62 -168 101 162 -88 -163 9 142 72 -85 -122 56 133 -79 -161
5821 -161 127 180 -177 -249 131 209 -105 -152 65 91 -83 -97 41 116 25 -150 -136 124 169 -112 -166 139 140 -190
5845 -190 -124 233 157 -166 -144 95 114 -27 -64 19 90 14 -138 -66 218 125 -210 -159 184 103 -186 -54 204 46
5869 46 -200 -82 134 101 -40 -125 -44 79 38 -143 -26 201 25 -279 -79 267 71 -205 -43 158 3 -145
5891 -145 4 133 57 -80 -118 10 167 54 -175 -25 198 -10 -227 41 260 -23 -244 -6 167 0 -103
5912 -103 -4 64 25 -74 -105 61 171 -38 -230 16 218 -54 -217 71 189 -116 -200 74 159 -35 -137 -39 58
5935 58 54 -58 -104 63 146 -119 -200 137 241 -112 -203 109 153 -108 -108 119 101 -59 -117 -17 104 96 -93 -141 77
5960 77 135 -142 -147 170 147 -216 -178 162 138 -117 -104 63 49 -49 -76 3 119 51 -166 -143 158 134 -171 -128 177
5985 177 75 -223 -78 208 92 -145 -94 65 98 8 -58 -12 117 29 -167 -41 246 83 -223 -96 195 48
6007 48 -181 -6 166 7 -171 -66 92 96 -24 -143 -44 124 14 -166 -3 202 -32 -274 -14 240 19
6028 19 -177 -19 111 -17 -100 -7 106 86 -79 -163 23 200 -1 -198 22 172 -89 -207 105 227 -58 -198
6050 -198 16 131 26 -64 -26 52 56 -109 -128 106 194 -106 -236 56 174 -90 -163 104 135 -124 -161 47 135 7
6074 7 -117 -80 48 77 -81 -113 125 128 -166 -171 162 192 -135 -142 102 101 -95 -77 87 113 -38 -150 -52 142 106 -125
6100 -125 -101 137 85 -173 -90 201 113 -196 -131 130 100 -87 -88 42 71 -56 -135 13 158 28 -211 -102 173
6123 173 69 -184 -44 174 29 -189 -51 178 96 -108 -102 58 118 -3 -107 40 144 -31 -212 11 237
6144 237 25 -208 -26 157 11 -142 12 154 26 -146 -103 92 140 -54 -154 28 130 -58 -169 67 188
6165 188 -64 -220 19 176 10 -153 -17 105 4 -119 -40 140 94 -124 -158 92 178 -54 -138 94 144 -97
6187 -97 -157 99 199 -49 -180 -10 132 35 -100 -41 121 48 -163 -98 158 143 -143 -167 81 118 -100 -122 97
6210 97 111 -100 -173 35 170 1 -159 -64 112 44 -141 -48 160 66 -182 -119 150 137 -111 -119 79 121 -92 -108
6234 -108 98 161 -49 -181 -4 189 55 -134 -39 144 23 -160 -38 182 87 -167 -134 114 122 -91 -130 69
6256 69 98 -109 -160 74 188 -32 -186 -44 147 24 -140 -20 141 24 -177 -75 170 124 -128 -146 85 121
6278 121 -84 -110 100 137 -81 -165 48 194 16 -162 -36 146 35 -144 -16 186 61 -188 -109 157 125 -118
6300 -118 -131 65 84 -105 -125 75 156 -65 -215 -23 184 21 -176 -45 138 7 -184 -27 186 72 -176
6321 -176 -124 116 112 -65 -105 77 111 -71 -151 67 212 -20 -222 -27 182 21 -150 7 150 0 -170 -37
6343 -37 160 102 -109 -132 57 122 -68 -138 85 141 -105 -220 50 200 -38 -191 -9 120 -27 -126 5 137
6365 137 41 -165 -117 123 170 -77 -156 92 147 -93 -129 147 190 -102 -174 51 153 15 -109 -13 102 34 -113
6388 -113 -60 176 132 -164 -166 137 154 -121 -115 124 101 -145 -120 107 146 -42 -156 -40 110 61 -122 -75 146 56
6412 56 -203 -104 206 139 -167 -124 134 88 -105 -50 119 91 -64 -131 28 188 57 -159 -72 175 66 -188 -27
6435 -27 229 31 -225 -73 175 82 -111 -71 54 51 -67 -107 33 151 -23 -222 -46 208 36 -208 -11 186
6457 186 -34 -205 2 179 40 -135 -94 67 93 -23 -113 25 144 -44 -200 71 247 -23 -226 24 196
6478 196 -28 -148 43 142 -21 -119 -41 102 123 -63 -159 39 161 -70 -184 101 184 -142 -230 89 188 -67 -150
6501 -150 23 94 -28 -92 -25 106 87 -133 -162 126 204 -100 -191 122 162 -144 -135 160 157 -115 -129 47 118 34 -81
6526 -81 -54 89 87 -131 -92 195 160 -201 -167 179 138 -140 -95 129 62 -129 -98 66 122 -2 -147 -89 114 94 -156
6551 -156 -107 181 64 -249 -95 244 105 -189 -95 109 46 -82 -43 66 87 -35 -153 -28 209 87 -210 -79
6573 -79 197 43 -213 -12 235 16 -216 -48 146 63 -59 -81 9 81 -33 -140 14 196 -14 -269 -44 225
6595 225 7 -210 3 149 -57 -184 12 130 43 -110 -121 25 122 -7 -145 31 184 -67 -223 87 251
6616 251 -49 -212 34 148 -36 -109 32 96 1 -114 -92 86 160 -64 -203 56 183 -114 -183 123 180 -156
6638 -156 -198 83 148 -44 -108 -20 54 15 -88 -83 110 118 -151 -196 118 185 -128 -175 128 120 -150 -110 123 113 -65 -111
6664 -111 1 104 73 -80 -79 106 106 -154 -118 205 146 -193 -139 162 104 -130 -75 96 57 -86 -96 19 127 30
6688 30 -162 -98 150 90 -170 -78 182 45 -221 -77 194 73 -150 -84 73 53 -47 -69 31 116 -19 -183 -26
6711 -26 210 62 -197 -42 187 18 -172 12 187 23 -146 -53 106 90 -40 -102 2 113 -28 -153 50
6732 50 197 -44 -235 0 185 -4 -167 9 116 -40 -141 -16 111 82 -85 -137 50 151 -43 -150 62
6753 62 167 -98 -195 89 205 -45 -165 15 118 0 -76 4 93 46 -111 -103 120 174 -85 -157 85 146 -98 -132
6777 -132 112 139 -121 -158 38 123 -6 -124 -54 71 34 -111 -73 126 104 -172 -162 134 151 -115 -116 96 86 -101
6801 -101 -94 87 127 -36 -146 -25 134 54 -112 -54 143 50 -169 -58 189 105 -152 -123 112 82 -77 -82 65 79
6825 79 -69 -136 26 153 16 -179 -75 134 37 -156 -44 137 17 -177 -84 132 86 -100 -111 46 82 -57
6847 -57 -94 56 134 -43 -175 16 181 38 -151 -31 139 21 -131 -8 162 51 -142 -103 86 115 -48 -116
6869 -116 48 104 -69 -142 64 165 -55 -183 -16 143 1 -120 -20 101 -7 -151 -68 130 89 -122 -146 81
6891 81 108 -70 -121 60 111 -95 -147 56 166 -9 -154 -27 116 32 -95 -9 132 45 -132 -88 133 117 -81
6914 -81 -123 61 111 -79 -104 64 124 -63 -179 -3 145 8 -139 -35 104 1 -141 -38 119 51 -141 -109
6936 -109 69 111 -68 -114 57 105 -82 -128 75 150 -33 -163 -2 147 22 -109 -17 122 20 -116 -36 140
6958 140 105 -111 -122 73 120 -64 -107 71 103 -96 -158 49 154 -11 -154 -36 77 25 -105 -45 103 49 -130
6981 -130 -117 122 123 -100 -132 84 87 -84 -101 88 116 -61 -137 22 130 36 -111 -38 108 43 -126 -47 151 84 -158
7006 -158 -107 130 113 -73 -75 72 66 -76 -98 39 121 -8 -150 -52 127 58 -136 -57 120 26 -177 -57 134 64
7030 64 -125 -83 61 55 -44 -70 44 86 -35 -138 -5 174 31 -162 -42 149 20 -128 4 144 19 -124
7052 -124 -35 110 86 -46 -104 22 92 -26 -132 47 170 -38 -187 11 174 -15 -155 3 99 -29 -117 -28
7074 -28 94 53 -101 -118 45 123 -56 -147 36 126 -90 -158 72 157 -49 -141 33 114 8 -64 -1 81 49 -79 -80
7099 -80 96 136 -87 -136 73 141 -74 -118 109 114 -100 -111 69 100 -6 -94 -38 54 56 -84 -76 95 88 -155 -143 130
7125 130 131 -120 -119 91 75 -104 -68 83 69 -51 -110 -24 101 75 -102 -75 120 77 -136 -63 183 96 -161 -81 135
7150 135 79 -77 -36 55 59 -36 -83 -7 123 43 -154 -76 139 61 -164 -40 148 11 -176 -43 125 49 -85 -66
7174 -66 31 51 -4 -86 -9 115 2 -178 -17 184 24 -178 -20 161 -4 -135 20 121 6 -85 -43 68 80
7197 80 -15 -110 15 130 -9 -151 38 174 -42 -186 34 153 -34 -119 11 69 -7 -77 -56 45 85 -59 -145
7220 -145 31 145 -50 -178 65 148 -84 -159 84 127 -65 -110 18 81 13 -45 -47 60 85 -71 -111 91 148 -100
7244 -100 -157 101 131 -99 -106 102 83 -72 -86 42 87 10 -86 -77 55 79 -97 -106 107 95 -157 -130 131 86 -132 -107
7270 -107 83 53 -74 -60 34 67 5 -109 -52 108 85 -111 -97 131 77 -143 -56 163 63 -130 -64 98 59 -36
7294 -36 -56 9 42 5 -93 -19 152 52 -163 -62 152 50 -146 -25 135 2 -142 -35 94 42 -64 -84 3
7317 3 58 5 -115 -8 129 -10 -187 -11 187 -6 -154 -12 121 -3 -98 10 86 36 -60 -67 37 113 -8 -123
7341 -123 5 134 -20 -144 48 162 -42 -164 11 105 -17 -86 -20 53 14 -70 -65 54 101 -73 -150 44 145
7364 145 -67 -140 65 112 -87 -125 41 92 -33 -99 -24 63 47 -65 -63 62 89 -101 -113 114 149 -95 -121 86 94
7389 94 -77 -78 75 83 -42 -96 -5 95 42 -98 -84 80 70 -119 -98 107 61 -144 -109 100 71 -83 -89 35 53 -34
7415 -34 -82 10 97 25 -117 -71 108 62 -119 -72 113 49 -127 -45 131 63 -91 -72 57 74 -18 -77 13 101 -2 -118
7441 -118 -10 149 31 -139 -51 130 28 -121 -43 96 21 -102 -68 66 65 -38 -110 -5 85 -16 -109 11 121
7464 121 -31 -145 -2 142 16 -120 -19 87 21 -76 -39 71 72 -65 -89 44 103 -19 -111 28 123 -30 -123
7487 -123 28 127 -9 -128 -10 96 31 -81 -42 57 43 -80 -90 69 92 -86 -131 32 106 -52 -110 24 95 -44
7511 -44 -121 -3 105 29 -105 -61 75 50 -59 -60 72 76 -86 -77 83 108 -55 -94 35 99 -26 -84 26 93 4 -105
7537 -105 -19 106 43 -94 -58 74 59 -76 -68 72 78 -83 -116 51 93 -45 -112 12 86 -30 -102 1 100 6 -118
7562 -118 -42 94 53 -84 -58 76 55 -82 -68 87 97 -45 -98 47 114 -12 -87 25 96 -11 -103 5 98 41
7586 41 -108 -57 85 60 -78 -62 68 75 -87 -97 50 90 -58 -102 13 74 -19 -87 4 91 -2 -113 -50 83 52 -92
7612 -92 -71 77 65 -77 -66 79 80 -63 -85 55 102 -16 -70 10 85 -1 -85 -6 108 34 -117 -53 97 62 -87 -67
7638 -67 76 34 -95 -75 63 60 -63 -92 -3 68 -9 -96 -17 84 1 -113 -36 105 30 -108 -55 72 33 -67 -48 63
7664 63 56 -62 -86 24 94 -7 -112 -1 89 6 -111 9 117 4 -107 -23 99 33 -70 -35 55 40 -51 -67 39
7689 39 86 -44 -126 3 108 -28 -121 2 93 -30 -109 10 93 -2 -83 -50 48 57 -36 -66 38 81 -48 -98 54 123
7715 123 -45 -129 31 99 -29 -84 26 74 -10 -71 -22 67 47 -60 -87 41 83 -53 -81 70 95 -90 -108 52 81
7740 81 -54 -88 2 48 -16 -69 -40 60 45 -92 -85 66 82 -77 -89 73 68 -96 -70 77 69 -63 -64 17 58 9 -52 -19
7768 -19 64 32 -85 -43 122 60 -109 -76 96 66 -85 -41 70 32 -76 -46 28 57 -20 -81 -35 67 16 -110 -45 105
7794 105 10 -149 -52 101 27 -104 -39 62 16 -48 -37 12 52 -21 -93 1 97 20 -112 -16 118 10 -109 15 116
7819 116 3 -98 -5 82 28 -38 -39 10 45 -32 -90 10 103 -33 -141 7 114 -29 -125 -1 82 -30 -86 7 56
7844 56 9 -64 -54 24 65 -29 -93 17 91 -60 -126 51 121 -46 -95 32 74 -20 -44 14 51 13 -38 -42 49 91 -41 -85
7872 -85 42 94 -71 -91 66 74 -84 -92 27 64 -35 -69 -19 18 0 -72 -60 53 65 -97 -94 77 78 -94 -82 74 61
7899 61 -85 -61 61 47 -43 -48 -8 33 20 -50 -45 69 42 -94 -52 107 56 -101 -37 93 49 -70 -39 48 27 -36 -52
7926 -52 11 53 8 -95 -56 79 31 -112 -32 85 4 -128 -33 73 5 -83 -36 32 21 -28 -45 -2 66 0 -97 -3 104
7953 104 0 -106 -8 89 -6 -84 21 82 6 -71 -9 47 43 -21 -59 3 59 -15 -81 23 103 -34 -122 11 90 -19 -82
7980 -82 9 42 -37 -62 -19 35 14 -55 -74 10 62 -38 -83 29 69 -55 -92 44 86 -48 -79 13 50 4 -24 -7 51 32
8008 32 -55 -51 62 89 -46 -87 46 63 -55 -55 55 42 -67 -67 15 54 -21 -55 -34 35 22 -56 -38 46 42 -107 -86 59
8036 59 58 -85 -66 41 13 -72 -43 27 45 -18 -76 -5 53 37 -60 -34 67 26 -89 -28 95 49 -82 -42 52 34 -32 -27
8064 -27 29 34 -35 -73 0 64 -2 -104 -32 59 17 -79 -16 70 -7 -103 -43 63 26 -55 -60 9 36 -28 -56 16 59 -19 -93 -3
8094 -3 94 2 -82 -8 65 3 -63 11 65 20 -52 -30 36 61 -16 -50 19 60 -25 -55 35 72 -28 -91 4 69 -3 -63 -8 34
8124 34 3 -73 -29 45 34 -67 -66 25 55 -42 -59 42 56 -57 -76 25 73 -13 -74 -17 45 10 -51 -11 58 25 -68 -38 69
8153 69 68 -46 -58 43 50 -27 -45 44 48 -39 -65 16 67 5 -65 -22 40 -1 -64 -34 58 26 -87 -69 38 29 -50 -65 12 19 -60
8184 -60 -48 29 68 -13 -82 -15 59
8191E9
$$ Imaginary data points
##PAGE= N=2
##DATA TABLE= (X++(I..I)), XYDATA
0 0 0 0 0 0 0 0 0 0 0 0 0 0 0 0 8 -8 8 -8 8 -16 16 -16 24 -24 32 -33 40 -48 55 -63 73 -81 90 -105 119 -131
36 -131 147 -168 187 -208 232 -258 289 -316 351 -387 428 -474 520 -573 631 -694 766 -847 934
55 934 -1033 1146 -1276 1427 -1604 1814 -2071 2393 -2807 3370 -4171 5419 -7631 12725 -48673
70 -48673 47882 140486 -43122 -79513 35873 56389 -50390 -55131 24886 73313 20666 -69953
82 -69953 -72049 56163 90736 -42338 -81607 59431 66279 -91196 -77401 102072 93713 -70214
94 -70214 -83885 31220 48432 -14475 -28796 12112 40841 4463 -67706 -37483 82695 69027
106 69027 -79311 -76988 69404 59079 -72056 -36640 85855 35724 -84712 -50654 52939
117 52939 55048 -11708 -43150 -10543 37375 13262 -53195 -15737 80003 27393 -97535 -41403
129 -41403 94864 44377 -77641 -30557 62924 12986 -58875 -12688 52944 32408 -30569 -52461
141 -52461 90 58887 17405 -59271 -14996 66522 4375 -80985 -96 90895 6198 -84533
153 -84533 -14842 61875 15418 -37744 -9815 27353 13688 -27148 -34759 22115 60640 -8092
165 -8092 -73452 -2636 70833 -657 -64419 13553 63867 -21566 -66851 13945 61926 4797
177 4797 -43524 -19841 22051 24239 -14270 -27805 22548 42453 -31706 -63260 29407 73838
189 73838 -19999 -66151 16334 49772 -21759 -40148 25232 41690 -14005 -44202 -10525 36689
201 36689 32154 -23488 -38650 19740 35995 -31035 -38615 44878 49454 -45281 -56126 31922 48306
214 48306 -18097 -31533 13721 21784 -13352 -27256 4069 39007 16542 -42579 -35425 35907
226 35907 38851 -31293 -29669 37592 23020 -47515 -27414 46358 35528 -29993 -35051 10350 25747
239 25747 -819 -20066 1205 28039 711 -43869 -12217 52412 25573 -47308 -27953 37599
251 37599 18307 -35048 -9483 38813 12746 -37118 -24873 23149 33181 -4471 -31505 -5049
263 -5049 27762 1980 -32748 3191 45345 415 -52988 -10628 46974 15969 -33243 -11447
275 -11447 24471 5284 -25071 -8960 26579 22929 -19514 -35672 6228 37714 1720 -32509
287 -32509 2003 31387 -9839 -38076 9817 44050 141 -39605 -10403 26620 12363 -16685
299 -16685 -9276 17154 11585 -22761 -23253 22628 36023 -14079 -38992 5962 32313 -6514 -26277
312 -26277 12609 28447 -13176 -34331 3248 33961 10050 -25128 -16382 16289 14564 -16412
324 -16412 -13536 23438 20220 -26950 -30535 20882 34265 -10896 -28183 6795 20515 -9565 -20398
337 -20398 10699 27080 -3037 -31095 -9632 26727 17254 -18944 -15684 16937 11554 -22283 -13793
350 -13793 26661 22187 -22241 -27907 11634 25122 -4407 -18452 5060 17253 -7696 -23644
362 -23644 3975 30135 6165 -28872 -14325 21498 14190 -16763 -9563 19250 9399 -23749 -16653
375 -16653 21693 24478 -12530 -25195 4231 19975 -3292 -17030 6815 21272 -6214 -27821
387 -27821 -1615 28475 10613 -21896 -13125 15386 9647 -15606 -8063 20195 13415 -20987 -21552
400 -21552 14434 24352 -6008 -20024 3206 15263 -5962 -16683 7019 22694 -1077 -25521
412 -25521 -8248 21336 13055 -14976 -10913 13748 7771 -18073 -10287 20816 17200 -16505 -21322
425 -21322 7939 18632 -2683 -13564 3586 13481 -5339 -19258 1720 24483 6518 -23217
437 -23217 -12160 17592 10903 -14528 -6550 16931 6331 -19836 -11921 16844 17600 -8389 -17782
450 -17782 1319 14075 -620 -13211 3377 18202 -2885 -24324 -2745 24826 8317 -19234
462 -19234 -8317 13688 4237 -13170 -2877 15359 7831 -14089 -15279 7423 18543 -619 -16518
475 -16518 -482 14546 -3387 -17204 5787 22252 -2508 -23198 -3326 17816 5888 -10792
487 -10792 -4032 8357 3011 -10616 -7501 12063 15519 -8802 -20528 3577 19259 -2214 -15496
500 -15496 5804 14880 -9107 -17762 6780 19055 173 -15064 -5833 8659 6861 -5950 -6243
513 -6243 8951 9064 -13184 -15472 13158 20080 -9197 -18611 6295 13141 -7449 -9793 9432 11183
527 11183 -6906 -13848 -702 13074 8255 -9225 -10766 7361 9279 -10541 -8866 15771 11975
540 11975 -17163 -15265 12987 14154 -7487 -9083 5109 5344 -5271 -7006 3311 11969 2832 -14965
554 -14965 -9657 13889 11877 -12038 -8833 13416 5326 -17036 -5575 17848 8576 -12956 -9841
567 -9841 5335 7645 -473 -5560 -15 7877 -340 -14175 -2231 19248 6583 -19118 -8070
580 -8070 15519 4809 -13133 -308 13643 -76 -13563 -4309 9240 9153 -1991 -10573 -2880
593 -2880 9828 2201 -11294 1200 16204 -2294 -20555 -280 19550 2670 -13760 -1488
605 -1488 8405 -1361 -7158 804 8051 5057 -6529 -12218 1958 15384 1386 -14155 384 12909
619 12909 -5400 -14807 7980 17395 -5201 -15898 324 9697 1907 -3808 -1367 3015 2563 -6159
633 -6159 -8195 8176 15234 -6399 -17889 3941 14891 -5017 -10656 8946 9747 -10491 -11339 6213
647 6213 10832 1017 -6670 -5755 2634 6377 -3354 -6556 8296 9675 -12259 -14084 11677 15039 -8465
662 -8465 -10946 6958 5732 -7854 -4180 7400 6420 -2601 -8475 -4594 7688 9212 -6165 -9144
676 -9144 7549 7212 -11860 -7130 15063 8847 -13749 -9112 9114 6305 -4980 -2859 3343 2659
690 2659 -2114 -6170 -1190 10373 5850 -12122 -8585 11727 7371 -11745 -4109 13110 2120 -13831
704 -13831 -2744 11461 4285 -6214 -4719 1132 4415 1344 -5507 -1519 9067 1571 -13352 -2655
718 -2655 15491 3654 -14341 -2831 11584 407 -9403 1281 8261 -42 -6527 -3649 3177
731 3177 7329 606 -9130 -2242 9798 787 -11123 1858 13412 -2938 -14610 1778 12605
744 12605 -255 -8199 50 4380 -322 -3399 -1511 4045 6111 -3783 -11003 2019 12940 -954
758 -954 -11652 2673 9965 -5836 -10015 6931 10636 -4180 -9057 -176 4965 2798 -1629 -3326
772 -3326 1976 4447 -5090 -8043 7240 12034 -6385 -12718 4614 9559 -4781 -5843 6609 5001
786 5001 -6533 -6371 2512 6672 3196 -4556 -6488 2595 6271 -3935 -5452 7920 6805 -10570
800 -10570 -9220 9297 9305 -5848 -5983 3858 2435 -4013 -2206 3492 5133 88 -7646 -5052 7508
815 7508 7568 -6272 -6160 6994 3569 -9802 -3126 11439 4819 -9231 -5674 4589 4128 -1153 -2144
830 -2144 574 2898 -743 -6558 -869 10102 3856 -10648 -5295 8877 3538 -7726 -604 8325
844 8325 -235 -8769 -1821 6568 4364 -2338 -5075 -916 4541 1118 -5229 467 8098 -995 -10992
859 -10992 -374 11211 1765 -8599 -1174 5868 -580 -5061 822 5404 1770 -4613 -5430 2066
873 2066 7474 184 -7300 33 6880 -2197 -7916 3685 9613 -2740 -9540 470 6937 813
887 813 -3895 -650 2799 841 -3774 -3136 4666 6633 -3915 -8763 2322 8183 -2080 -6414 3579
902 3579 5785 -4774 -6604 3592 6996 -431 -5471 -2224 3176 2940 -2398 -2792 3918 3799 -5861
917 -5861 -6152 5996 7780 -4335 -7012 2958 4757 -3144 -3504 3740 4320 -2606 -5732 -462 5738
932 5738 3377 -4427 -4159 3739 3287 -4942 -2948 6831 4162 -7135 -5691 5157 5531 -2752 -3878
947 -3878 1827 2764 -2126 -3741 1646 5898 534 -6975 -3006 6225 3773 -5023 -2575 5197 1462
962 1462 -6374 -2098 6601 3880 -4722 -4835 1994 4138 -568 -3303 937 4005 -1425 -6084 390
977 390 7503 1586 -6854 -2609 5117 1865 -4271 -738 4869 1190 -5379 -3242 4210 4972 -1916 -5058
993 -5058 469 4156 -878 -4205 1860 5673 -1564 -7028 -233 6647 1816 -4820 -1858 3567 1080
1008 1080 -3876 -1255 4785 3103 -4470 -5092 2722 5516 -1139 -4529 1127 3878 -2056 -4708 2067
1023 2067 6066 -410 -6200 -1599 4770 2295 -3379 -1674 3444 1383 -4462 -2592 4708 4455 -3335
1038 -3335 -5198 1481 4383 -854 -3469 1493 3889 -1810 -5313 613 6031 1345 -5117 -2320 3663
1053 3663 1845 -3249 -1163 4031 1852 -4516 -3632 3500 4861 -1623 -4573 615 3736 -1064 -3814
1068 -3814 1745 5039 -1183 -6013 -515 5432 1806 -3836 -1738 2884 1128 -3299 -1530 3970 3252
1083 3252 -3502 -4882 1970 5063 -835 -4159 1087 3713 -1963 -4396 1824 5293 -289 -4975 -1442
1098 -1442 3506 2021 -2294 -1656 2522 1809 -3523 -3178 3771 4795 -2745 -5155 1527 4136 -1378 -3133
1114 -3133 2043 3299 -2015 -4182 534 4406 1536 -3484 -2645 2447 2469 -2629 -2187 3809 2865 -4519
1130 -4519 -4124 3822 4557 -2328 -3649 1431 2429 -1519 -2352 1441 3417 -178 -4346 -1819 4159 3072
1146 3072 -3402 -2828 3320 1991 -4180 -1879 4874 2728 -4129 -3360 2278 2994 -683 -2089 247 2082
1162 2082 -336 -3376 -263 4853 1626 -5208 -2609 4449 2229 -3764 -1071 3890 545 -4154 -1337
1177 -1337 3413 2594 -1523 -3094 -221 2841 655 -2956 -43 4112 -278 -5556 -339 5908 1142
1192 1142 -4798 -1067 3346 238 -2698 91 2765 1047 -2388 -2939 1116 4180 230 -4232 -349
1207 -349 4018 -675 -4422 1622 5251 -1346 -5257 234 3902 536 -2102 -532 1213 658 -1534
1222 -1534 -1893 2007 3837 -1694 -5128 972 4986 -924 -4024 1820 3508 -2583 -3674 2063 3660
1237 3660 -417 -2707 -1188 1366 1860 -873 -2089 1686 2827 -2829 -4080 3173 4874 -2625 -4349
1252 -4349 2145 3043 -2218 -2071 2300 2102 -1431 -2537 -467 2483 2280 -2037 -3069 1984 2912 -2870
1268 -2870 -2757 4007 3042 -4356 -3331 3531 2863 -2227 -1803 1313 1037 -784 -1384 -6 2507 1364
1284 1364 -3404 -2690 3608 3103 -3542 -2452 3767 1496 -4219 -1136 4141 1437 -2982 -1740 1170
1299 1170 1607 304 -1461 -788 2078 810 -3474 -1047 4735 1583 -4999 -1770 4288 1112 -3469
1314 -3469 -109 3060 -227 -2775 -647 1821 1992 -241 -2812 -1027 3004 1077 -3308 -162 4234
1329 4234 -525 -5178 339 5066 225 -3673 -224 2022 -268 -1264 160 1346 1259 -1205 -3247 371
1345 371 4369 386 -4201 -11 3682 -1301 -3726 2201 4145 -1686 -3772 314 2251 643 -582
1360 -582 -777 191 1070 -1097 -2399 1916 4115 -1768 -4874 1171 4048 -1341 -2726 2247 2186 -2668
1376 -2668 -2508 1572 2501 477 -1577 -1915 571 2163 -773 -2072 2161 2665 -3367 -3681 3295 3888
1392 3888 -2363 -2779 1798 1287 -1897 -824 1726 1515 -427 -2224 -1548 2177 2794 -1837 -2684 2207
1408 2207 1964 -3345 -1746 4137 2095 -3702 -2206 2271 1501 -1012 -629 496 643 -228 -1755 -567
1424 -567 3008 1730 -3473 -2340 3287 1893 -3170 -877 3449 339 -3586 -625 2865 1175 -1364
1439 -1364 -1373 -1 1337 532 -1692 -394 2740 315 -3886 -587 4304 846 -3828 -577 3012 -99
1455 -99 -2472 386 2190 149 -1694 -1300 744 2274 174 -2699 -418 2877 -134 -3264 822 3824
1471 3824 -961 -3900 574 3199 -137 -2003 55 1150 72 -1002 -784 1172 2086 -1078 -3219
1486 -3219 700 3535 -583 -3138 1074 2748 -1755 -2731 1774 2768 -924 -2280 -210 1341 905 -700
1502 -700 -1130 928 1537 -1716 -2423 2179 3249 -1970 -3307 1523 2510 -1544 -1708 1788 1542 -1546 -1886
1519 -1886 443 1978 971 -1595 -1777 1279 1791 -1637 -1618 2534 1903 -3033 -2405 2646 2412 -1721 -1698
1536 -1698 1105 978 -955 -999 706 1760 175 -2423 -1350 2442 1946 -2156 -1632 2246 1037 -2757
1552 -2757 -922 3039 1373 -2462 -1712 1256 1473 -347 -1103 138 1286 -218 -2188 -141 3041 859
1568 859 -3179 -1313 2664 1001 -2252 -357 2334 225 -2434 -840 1954 1621 -883 -1886 39
1583 39 1751 53 -1844 347 2503 -459 -3229 5 3277 529 -2562 -552 1819 195 -1601
1598 -1601 -169 1763 889 -1632 -1913 947 2438 -290 -2329 243 2078 -734 -2314 1009 2785
1613 2785 -631 -2861 -160 2204 607 -1409 -570 1155 555 -1499 -1112 1782 2038 -1468 -2583 893
1629 893 2402 -642 -1903 949 1815 -1181 -2176 790 2450 137 -2124 -867 1501 973 -1262 -835
1645 -835 1633 1053 -2086 -1741 1969 2279 -1320 -2184 785 1678 -787 -1463 941 1827 -671 -2323 -160
1662 -160 2326 920 -1854 -1105 1496 828 -1695 -807 2079 1289 -2042 -1921 1400 2079 -709 -1709 515
1679 515 1450 -713 -1731 708 2298 -120 -2487 -646 2088 950 -1586 -756 1526 618 -1873 -1001
1695 -1001 2014 1707 -1557 -2095 875 1887 -570 -1545 741 1602 -872 -2100 462 2405 321 -2154
1711 -2154 -890 1624 869 -1440 -706 1744 922 -2062 -1551 1835 2030 -1190 -1934 703 1527 -678 -1376
1728 -1376 822 1772 -513 -2224 -260 2218 943 -1795 -1079 1547 822 -1767 -797 2128 1227 -2042
1744 -2042 -1730 1391 1765 -703 -1419 447 1238 -537 -1599 399 2223 195 -2460 -843 2182 1011
1760 1011 -1810 -692 1838 440 -2073 -721 2023 1300 -1388 -1626 581 1511 -171 -1406 281 1731
1776 1731 -406 -2374 135 2770 398 -2507 -616 1943 390 -1594 -141 1647 389 -1626 -1137
1791 -1137 1172 1779 -456 -1964 82 1844 -305 -1967 684 2391 -704 -2676 238 2385 214
1806 214 -1659 -291 1105 239 -1074 -567 1269 1359 -1186 -2139 811 2399 -550 -2140 766 1896
1822 1896 -1180 -1957 1220 2111 -637 -1880 -134 1297 611 -829 -778 922 1020 -1400 -1590 1715 2215
1839 2215 -1583 -2351 1262 1891 -1184 -1362 1292 1208 -1136 -1401 420 1525 539 -1322 -1210 1131 1343
1856 1343 -1332 -1259 1899 1382 -2316 -1668 2157 1712 -1560 -1302 1018 801 -737 -724 500 1173 91
1873 91 -1720 -866 1970 1403 -1907 -1326 1956 889 -2247 -610 2453 739 -2116 -982 1292 976
1889 976 -428 -812 4 921 77 -1557 -195 2330 559 -2726 -863 2529 688 -2147 -173 1963
1905 1963 -151 -1880 -115 1526 768 -726 -1283 -91 1457 341 -1606 -25 2121 -331 -2739
1920 -2739 336 2942 -55 -2437 31 1637 -240 -1102 313 1014 260 -940 -1256 538 2048 -106
1936 -106 -2256 104 2126 -672 -2184 1212 2400 -1202 -2364 658 1733 -137 -883 -83 464 296
1952 296 -667 -919 1054 1852 -1118 -2490 956 2408 -999 -1912 1391 1544 -1663 -1520 1349 1484 -461
1969 -461 -1104 -409 643 875 -568 -1064 1089 1419 -1726 -1895 1964 2115 -1789 -1783 1550 1124 -1450 -717
1987 -717 1286 751 -713 -1016 -230 1146 1036 -1188 -1356 1417 1287 -1894 -1171 2365 1160 -2404 -1112
2004 -1112 1993 874 -1360 -527 825 450 -394 -758 -79 1342 617 -1823 -975 2136 1029 -2251 -728
2021 -728 2322 374 -2267 -191 2022 254 -1452 -448 731 694 -106 -984 -228 1404 272 -1973
2037 -1973 -201 2470 168 -2634 -114 2410 -37 -1935 241 1496 -251 -1127 -137 797 819 -338
2053 -338 -1465 -18 1851 66 -2017 292 2220 -695 -2395 802 2330 -592 -1836 315 1134
2068 1134 -128 -639 -100 592 672 -704 -1481 717 2133 -599 -2241 682 1979 -1039 -1734 1384 1695
2085 1695 -1241 -1582 601 1179 89 -641 -516 452 770 -768 -1164 1290 1743 -1524 -2081 1413 1893
2102 1893 -1266 -1330 1339 919 -1322 -901 914 1055 -60 -1024 -741 889 1112 -976 -1093 1430 1105
2119 1105 -1971 -1282 2100 1382 -1749 -1128 1253 667 -929 -447 704 691 -270 -1168 -391 1504 936 -1593
2137 -1593 -1035 1656 759 -1911 -493 2132 505 -2004 -622 1455 657 -772 -564 336 638 -155 -1073
2154 -1073 5 1665 261 -2034 -478 2088 442 -1902 -133 1778 -87 -1677 -21 1428 379
2169 379 -947 -759 406 1014 -102 -1210 133 1549 -285 -1930 322 2134 -232 -2004 146 1636
2185 1636 -189 -1269 165 1080 106 -954 -622 762 1158 -508 -1477 405 1586 -538 -1617 777
2201 777 1736 -841 -1754 674 1589 -329 -1199 73 898 166 -801 -460 932 913 -1001 -1351 991 1568
2219 1568 -922 -1486 958 1326 -1035 -1236 965 1254 -638 -1196 135 1043 296 -917 -538 976 703
2236 703 -1208 -935 1413 1188 -1399 -1269 1222 1149 -1020 -925 898 880 -711 -990 373 1177 124 -1233
2254 -1233 -474 1223 622 -1285 -612 1437 651 -1559 -770 1485 896 -1158 -872 833 809 -601 -846
2271 -846 464 1079 -236 -1351 -69 1510 310 -1493 -397 1419 332 -1425 -328 1426 463 -1302
2287 -1302 -706 999 859 -669 -944 480 1036 -406 -1194 354 1440 -196 -1560 -14 1496 159
2303 159 -1333 -190 1236 249 -1189 -427 1131 713 -964 -971 731 1079 -575 -1113 536 1189 -500
2320 -500 -1324 373 1428 -142 -1376 -80 1246 199 -1154 -295 1133 444 -1144 -693 1051 928
2336 928 -863 -1038 695 1052 -588 -1084 542 1197 -401 -1307 178 1352 74 -1264 -217 1190
2352 1190 311 -1149 -391 1164 576 -1100 -802 918 931 -703 -1010 545 1044 -488 -1153 401 1289
2369 1289 -246 -1369 34 1324 122 -1212 -219 1118 295 -1074 -462 1008 695 -870 -912 693
2385 693 1054 -556 -1111 520 1177 -492 -1266 402 1311 -228 -1253 37 1128 147 -981 -275 928
2402 928 493 -913 -730 891 984 -799 -1122 730 1142 -680 -1121 649 1116 -537 -1113 331 1065 -50
2420 -50 -968 -222 900 437 -895 -609 984 788 -1063 -948 1037 1018 -938 -969 825 881 -679 -837 486
2439 486 865 -199 -925 -116 984 395 -1023 -548 1117 644 -1192 -662 1260 701 -1188 -702 999
2456 999 684 -733 -659 470 696 -224 -833 11 1036 221 -1214 -385 1305 421 -1339 -391 1313 319
2474 319 -1232 -328 1070 406 -790 -536 477 680 -208 -824 55 1055 10 -1284 -42 1448 65
2491 65 -1444 -49 1336 28 -1137 -18 936 148 -710 -379 501 693 -298 -945 207 1157 -214 -1300
2509 -1300 296 1397 -357 -1380 358 1244 -288 -1016 146 764 58 -597 -321 484 640 -464 -964
2526 -964 489 1184 -531 -1271 616 1247 -675 -1136 689 997 -536 -822 279 676 54 -547 -389 531
2544 531 688 -616 -902 764 1060 -896 -1099 975 1039 -920 -889 796 694 -602 -552 312 547 37 -622
2563 -622 -414 731 706 -839 -836 977 825 -1137 -751 1216 665 -1132 -596 880 493 -513 -405 193
2581 193 447 50 -638 -299 946 528 -1147 -634 1255 591 -1233 -385 1222 247 -1135 -229 888 329
2599 329 -488 -434 88 535 157 -722 -199 1036 213 -1335 -248 1462 244 -1344 -124 1117 -41
2616 -41 -924 67 738 132 -477 -467 149 757 94 -926 -101 1103 -59 -1295 219 1431 -236 -1338
2634 -1338 190 1040 -151 -683 134 487 73 -373 -425 299 852 -158 -1126 158 1209 -299 -1179 504
2652 504 1178 -588 -1105 505 888 -288 -588 41 344 179 -304 -481 374 810 -468 -1079 549 1161
2670 1161 -615 -1080 714 928 -734 -751 634 622 -355 -484 9 392 316 -388 -572 519 781 -672 -894
2689 -894 838 906 -914 -817 913 676 -783 -515 573 401 -291 -362 -18 420 291 -599 -536 772 686 -917
2709 -917 -719 982 602 -1014 -454 986 352 -835 -328 547 362 -164 -374 -104 468 280 -695 -358 948
2728 948 410 -1132 -437 1135 374 -989 -212 852 80 -699 -113 499 335 -189 -531 -118 671 276 -786
2747 -786 -200 968 84 -1150 -41 1194 77 -1000 -83 696 20 -465 -37 336 243 -257 -595 74
2765 74 875 67 -970 -59 961 -111 -974 278 1003 -269 -927 102 670 64 -363 -172 190 295
2783 295 -203 -525 284 825 -277 -1025 232 1011 -250 -851 351 709 -418 -667 286 604 -9 -463
2801 -463 -289 270 461 -239 -553 333 655 -511 -829 565 898 -501 -798 389 591 -337 -429 280 412
2820 412 -96 -459 -205 478 493 -454 -628 462 617 -560 -554 702 585 -715 -611 569 559 -320 -437 120
2840 120 320 -33 -394 -113 548 308 -701 -486 705 550 -667 -484 649 354 -678 -310 615 383
2858 383 -433 -462 141 450 76 -448 -150 522 158 -713 -199 850 309 -844 -359 703 297 -552 -196
2877 -196 488 207 -418 -341 284 529 -61 -636 -106 641 121 -659 -29 752 -5 -853 -84 789 199 -592
2897 -592 -234 388 232 -309 -269 285 438 -270 -670 141 776 -17 -735 3 667 -80 -634 123 689 -9
2917 -9 -656 -184 496 337 -308 -362 257 393 -306 -506 359 682 -291 -769 155 701 -72 -560 96 512 -100
2938 -100 -560 -27 581 236 -510 -420 375 459 -303 -430 360 475 -433 -582 382 675 -223 -648 53 515 -12
2959 -12 -442 27 512 59 -590 -247 592 436 -459 -457 365 404 -366 -379 429 489 -371 -598 226 641 -26 -531
2981 -531 -47 461 23 -502 -34 615 191 -619 -348 511 429 -363 -380 323 354 -372 -432 366 567 -245 -644
3002 -644 50 573 27 -481 -18 472 6 -545 -115 610 305 -510 -413 370 418 -306 -370 332 398 -377 -539
3023 -539 300 623 -128 -591 -13 472 39 -424 -27 485 88 -570 -281 526 430 -426 -452 334 385 -343 -355
3044 -355 403 442 -344 -540 158 554 24 -456 -104 394 97 -459 -128 575 258 -616 -399 509 417 -383 -336
3065 -336 348 272 -354 -324 306 465 -139 -523 -63 517 168 -460 -143 513 92 -628 -152 659 266 -554 -323
3086 -323 380 277 -268 -223 238 298 -232 -465 104 600 54 -625 -137 556 62 -536 15 594 11 -610 -119
3107 -119 484 263 -301 -280 141 283 -139 -360 181 534 -171 -679 75 700 5 -576 39 481 -115 -459
3127 -459 76 451 70 -398 -291 234 402 -141 -436 143 445 -271 -558 327 656 -276 -641 148 495 -86
3147 -86 -335 94 290 -24 -337 -155 368 412 -308 -526 250 519 -298 -449 408 458 -460 -497 365 480 -162
3168 -162 -367 14 231 71 -218 -118 347 261 -473 -447 501 516 -448 -450 414 313 -457 -259 438 296 -306 -345
3190 -345 64 327 147 -290 -220 340 226 -487 -248 643 319 -655 -334 550 282 -408 -142 347 111 -283
3210 -283 -208 150 372 73 -462 -220 492 238 -530 -149 625 76 -690 -94 645 128 -476 -147 258 115
3230 115 -145 -151 84 297 -37 -508 -50 639 90 -667 -77 623 -25 -577 119 554 -92 -471 -30 294 166
3251 166 -109 -265 22 364 -34 -475 124 623 -151 -702 134 669 -125 -525 151 382 -159 -303 72 271
3271 271 133 -213 -352 136 488 -97 -525 171 528 -315 -558 372 584 -320 -523 186 328 -86 -178 15
3291 15 143 90 -246 -290 315 498 -318 -574 306 515 -344 -394 459 353 -461 -353 311 332 -61 -217 -114 140
3313 140 188 -186 -221 372 341 -520 -461 527 476 -448 -341 391 168 -411 -142 347 213 -153 -301 -120 289 270
3335 270 -286 -271 381 200 -562 -208 661 258 -594 -237 421 141 -279 -42 210 80 -144 -250 4 414
3355 414 163 -481 -239 477 158 -515 -31 597 -2 -600 -40 475 90 -274 -96 103 101 -44 -204 49 397
3376 397 -24 -565 -27 609 27 -558 45 493 -138 -443 145 405 -48 -287 -103 134 227 -52 -293 62
3396 62 381 -132 -490 195 567 -211 -549 185 440 -187 -326 162 244 -101 -228 -48 202 228 -177 -376 169
3417 169 417 -204 -414 303 407 -384 -408 347 382 -252 -296 111 192 -29 -162 -47 211 149 -303 -293 348 384
3439 384 -368 -367 358 298 -393 -228 395 210 -315 -218 163 226 14 -211 -102 230 137 -329 -170 445 212 -513
3461 -513 -249 456 210 -386 -137 330 90 -294 -117 203 226 -70 -309 -74 344 125 -376 -100 428 37
3481 37 -511 -49 520 74 -429 -98 299 80 -199 -63 162 177 -138 -300 72 428 3 -453 -24 439 -48
3502 -48 -430 101 446 -91 -430 15 327 87 -198 -127 110 168 -151 -256 178 378 -187 -471 145 455 -127
3523 -127 -387 151 324 -170 -314 101 313 27 -280 -157 213 238 -166 -249 218 280 -289 -341 309 403 -255 -364
3545 -364 172 292 -135 -235 113 244 -55 -293 -71 317 199 -292 -246 280 232 -303 -228 346 252 -348 -292 262
3567 262 291 -156 -255 74 213 -40 -256 6 328 70 -395 -164 374 205 -327 -170 317 145 -320 -158 311
3588 311 220 -233 -270 110 271 -47 -266 39 299 -27 -366 1 420 70 -398 -125 325 117 -277 -98 270
3609 270 124 -275 -210 210 274 -142 -310 70 284 -87 -305 95 334 -62 -389 -7 369 73 -308 -106 251
3630 251 90 -247 -117 283 195 -252 -263 189 297 -125 -282 113 265 -119 -297 98 359 -25 -346 -61 307
3651 307 88 -269 -100 264 93 -288 -163 284 235 -227 -271 141 257 -115 -243 111 273 -112 -350 54 366
3672 366 13 -341 -65 290 56 -259 -68 299 106 -287 -192 243 259 -159 -265 126 260 -148 -272 153 346
3693 346 -129 -362 41 332 20 -269 -35 220 34 -257 -90 268 189 -253 -270 204 287 -178 -265 183 249 -213
3715 -213 -278 182 318 -93 -290 -6 241 58 -208 -67 244 97 -303 -189 330 259 -279 -267 236 220 -227
3736 -227 -179 249 212 -191 -260 81 276 33 -262 -91 246 88 -305 -95 374 116 -407 -186 341 182 -255
3757 -255 -147 204 116 -179 -151 142 252 -68 -330 -37 340 79 -341 -50 360 8 -390 -18 410 76 -339
3778 -339 -113 213 129 -125 -110 116 180 -112 -318 85 416 -20 -424 -1 375 -56 -342 90 350 -80 -342
3799 -342 -21 257 125 -157 -179 87 219 -116 -275 167 352 -197 -436 155 421 -130 -334 120 250 -121
3819 -121 -225 66 219 49 -223 -197 184 291 -152 -287 203 289 -282 -312 321 363 -266 -314 175 230 -100 -151
3841 -151 57 160 28 -220 -127 284 254 -315 -306 290 275 -312 -216 349 185 -353 -194 260 201 -117 -177 -18 151
3864 151 71 -198 -97 302 140 -405 -188 431 209 -388 -169 328 79 -295 -35 262 102 -158 -190 27 248
3885 248 93 -281 -117 313 71 -394 -28 481 36 -479 -71 363 60 -237 -15 154 25 -131 -134 85 295
3906 295 -24 -412 -54 416 33 -390 57 391 -139 -421 107 384 -6 -251 -58 104 91 -43 -118 102 243
3927 243 -146 -392 137 483 -92 -421 114 325 -180 -258 230 262 -139 -251 -26 170 160 -82 -215 76 225
3948 225 -176 -290 277 380 -305 -404 234 331 -172 -177 170 122 -155 -162 37 200 137 -212 -266 186 286 -215 -230
3971 -230 324 228 -398 -245 387 248 -251 -169 129 96 -67 -87 26 171 58 -302 -175 353 249 -351 -225
3992 -225 348 135 -382 -83 372 80 -322 -126 162 140 -36 -148 -61 178 59 -273 -60 387 70 -461 -95
4013 -95 423 68 -355 -17 285 -35 -233 -7 184 115 -88 -224 -3 299 46 -320 0 366 -66 -427 100
4034 100 447 -83 -380 26 259 -15 -153 -12 103 73 -115 -212 103 342 -103 -415 74 381 -123 -334 193
4055 193 311 -219 -307 144 264 -13 -175 -79 94 130 -87 -178 186 264 -255 -351 245 379 -217 -309 190 210 -210
4078 -210 -165 195 191 -86 -214 -80 199 199 -167 -229 184 187 -294 -211 369 254 -365 -267 259 207 -151 -123 111 95
4102 95 -95 -178 11 270 120 -323 -207 289 200 -293 -111 352 71 -381 -109 346 166 -203 -154 64 121 -22
4124 -22 -140 18 227 -17 -361 -54 412 121 -368 -97 300 24 -289 24 300 34 -264 -145 125 198 -26
4145 -26 -216 -8 220 -59 -292 94 376 -79 -428 18 351 23 -253 17 184 -26 -188 -41 213 179 -158
4166 -158 -285 81 305 -57 -270 128 273 -183 -318 174 349 -87 -289 -10 183 29 -116 -31 168 86 -223
4187 -223 -202 245 306 -197 -306 138 231 -175 -178 210 229 -195 -266 76 254 46 -208 -102 146 85 -202 -86 289
4210 289 159 -321 -234 275 248 -177 -186 151 124 -176 -143 166 240 -70 -284 -59 251 107 -213 -92 226 45
4232 45 -312 -74 342 153 -295 -207 176 165 -109 -117 125 144 -159 -238 98 319 6 -321 -73 259 51 -236
4254 -236 17 273 0 -325 -95 286 190 -170 -190 92 139 -119 -139 161 230 -162 -317 67 318 9 -257 -24
4276 -24 198 -35 -230 23 291 48 -302 -167 205 201 -133 -152 125 138 -190 -189 208 287 -128 -314 27 265 17
4299 17 -197 16 212 -38 -279 -19 318 122 -261 -187 165 161 -130 -109 186 154 -219 -242 169 311 -58 -289
4321 -289 -5 224 -16 -197 59 272 -42 -318 -67 295 157 -198 -165 122 128 -164 -132 208 221 -222 -322 122
4343 122 314 -40 -244 39 192 -95 -233 79 298 26 -294 -144 220 188 -157 -150 166 126 -245 -193 274 278
4365 278 -192 -301 89 225 -51 -145 70 174 -77 -265 -16 326 139 -285 -196 213 179 -200 -106 266 117
4386 117 -312 -208 242 270 -111 -224 18 155 -31 -174 45 272 -5 -364 -91 363 175 -270 -113 238
4406 238 62 -246 -47 280 133 -228 -226 93 252 13 -219 -18 218 -53 -304 65 394 0 -408 -85 290
4427 290 84 -199 -22 180 6 -218 -111 191 255 -102 -332 11 307 -27 -265 100 297 -164 -371 112
4447 112 372 6 -264 -58 144 47 -112 -56 169 150 -216 -287 193 377 -117 -353 107 263 -172 -237 221 265
4469 265 -160 -282 -3 217 110 -142 -160 113 129 -218 -177 300 275 -312 -345 240 295 -168 -171 175 105 -194 -155
4492 -155 125 246 25 -270 -180 212 199 -204 -148 290 111 -383 -163 410 214 -286 -195 154 107 -91 -69 77
4514 77 145 -55 -290 -46 374 154 -345 -185 300 74 -328 2 373 12 -360 -105 239 169 -67 -138 -9
4535 -9 124 -26 -229 64 383 -23 -467 -38 418 47 -315 26 263 -90 -264 44 259 100 -159 -227 35
4556 35 253 11 -244 55 298 -148 -400 166 447 -97 -377 41 237 -52 -141 48 142 -5 -203 -161 169
4577 169 294 -134 -354 98 309 -176 -285 260 308 -265 -319 185 262 -49 -164 -23 99 57 -110 -115 221 219 -290
4600 -290 -332 277 334 -249 -279 251 174 -275 -155 253 179 -147 -213 -32 185 141 -170 -181 208 141 -317 -183 402
4623 402 215 -411 -242 306 173 -217 -79 169 59 -143 -141 55 252 75 -313 -172 313 176 -313 -85 389
4644 389 26 -439 -55 397 115 -260 -134 96 81 -52 -94 49 208 -60 -375 -36 451 77 -417 -68 333
4665 333 -38 -328 100 336 -43 -308 -100 163 189 -33 -195 -15 206 -69 -307 144 418 -143 -485 55
4685 55 387 -36 -262 81 193 -110 -215 35 226 154 -161 -298 74 316 -47 -289 167 288 -264 -364 251
4706 251 383 -153 -302 46 156 -39 -107 14 149 57 -252 -234 248 351 -210 -339 187 247 -254 -208 321 224
4728 224 -269 -259 123 213 20 -139 -82 119 85 -210 -129 334 224 -371 -284 321 262 -254 -162 222 88 -255 -117
4751 -117 197 195 -65 -251 -98 225 141 -224 -117 277 73 -403 -99 411 159 -334 -172 215 104 -139 -64
4772 -64 135 113 -125 -232 22 344 76 -344 -101 315 55 -319 21 366 -25 -377 -50 308 127 -152 -138
4793 -138 74 118 -69 -170 108 283 -102 -400 43 400 1 -328 30 248 -87 -258 73 275 36 -251
4813 -251 -165 143 217 -75 -215 88 222 -174 -286 213 369 -150 -368 66 279 -42 -190 63 171 -38 -230
4834 -230 -51 251 201 -203 -256 157 235 -159 -207 215 211 -258 -277 206 295 -88 -233 1 163 5 -159 -8 238
4857 238 69 -315 -182 295 253 -227 -223 197 145 -230 -131 249 215 -204 -268 63 259 32 -214 -44 184 11
4879 11 -268 -32 355 118 -344 -182 269 187 -200 -115 177 95 -217 -173 167 254 -76 -300 -27 265 36 -228
4901 -228 -3 269 -34 -329 -36 350 143 -263 -167 161 134 -145 -110 188 167 -204 -267 117 321 -30 -299 3
4923 3 236 -29 -232 44 307 -14 -321 -104 271 165 -174 -166 139 141 -174 -162 210 237 -172 -308 74 280 -11
4946 -11 -223 21 214 -50 -266 18 312 70 -300 -174 204 167 -160 -127 175 132 -207 -205 193 294 -101 -293
4968 -293 15 237 -9 -210 43 241 -42 -315 -39 311 130 -247 -155 164 125 -142 -122 191 169 -199 -269 133
4990 133 302 -42 -277 17 213 -57 -236 67 285 -17 -301 -103 232 168 -157 -139 133 126 -187 -179 220 251
5012 251 -190 -310 100 274 -53 -210 64 181 -98 -237 37 273 73 -250 -172 175 181 -158 -142 188 144 -256
5034 -256 -222 246 269 -155 -253 62 184 -43 -149 36 187 -22 -274 -89 275 164 -255 -193 191 117 -230 -97
5056 -97 260 130 -255 -206 149 220 -46 -174 -1 151 -7 -197 10 293 42 -344 -131 314 137 -234 -85
5077 -85 211 41 -234 -76 215 155 -126 -232 22 222 36 -204 -2 236 -50 -329 19 365 43 -318 -75
5098 -75 210 36 -146 -14 155 62 -167 -184 107 282 -39 -306 4 265 -39 -261 109 291 -118 -319 39
5119 39 264 49 -167 -56 97 66 -97 -129 152 212 -164 -331 116 320 -115 -265 118 196 -178 -211 141 219
5141 219 -62 -217 -78 137 139 -103 -144 129 163 -228 -230 265 285 -244 -282 171 194 -118 -126 129 109 -98 -161 6
5165 6 200 126 -208 -198 191 177 -206 -157 276 143 -318 -169 275 172 -173 -143 68 80 -50 -106 9 181 46
5188 46 -280 -130 295 151 -314 -136 276 53 -306 -43 270 60 -215 -117 102 136 -3 -146 -36 178 8
5209 8 -257 0 358 27 -388 -57 330 23 -249 18 194 -43 -190 -25 138 147 -74 -235 -22 252 12
5230 12 -264 49 287 -113 -357 104 351 -56 -279 -5 139 -5 -98 -15 98 89 -144 -243 102 314 -84 -326
5252 -326 67 269 -147 -253 209 259 -172 -254 70 180 53 -87 -77 59 96 -115 -160 198 262 -232 -332 182
5274 182 290 -165 -190 172 130 -192 -147 137 184 7 -171 -131 119 161 -136 -152 209 159 -295 -209 307 233 -243
5297 -243 -189 166 98 -135 -59 114 104 -47 -189 -68 229 166 -233 -163 235 120 -287 -71 343 83 -310 -107
5319 -107 215 100 -89 -73 41 75 -31 -160 1 264 37 -328 -85 320 79 -292 -21 273 -24 -275 9
5340 9 230 63 -137 -130 35 145 -6 -174 19 236 -47 -315 55 371 -35 -323 30 242 -35 -184 58
5361 58 169 -8 -142 -87 110 194 -65 -234 41 246 -88 -273 140 285 -167 -298 107 247 -66 -178 8
5382 8 118 8 -104 -55 134 151 -171 -240 151 284 -144 -232 164 209 -191 -186 201 182 -120 -189 19 143 49 -112
5406 -112 -86 141 117 -209 -159 257 203 -253 -223 211 170 -185 -116 164 102 -153 -141 71 174 26 -198 -107 182
5429 182 96 -211 -90 254 93 -308 -127 282 134 -212 -115 127 80 -108 -81 79 165 -39 -232 -35 271 82
5451 82 -260 -71 241 39 -273 -5 273 39 -241 -97 153 110 -81 -121 47 129 -63 -203 52 280 -28
5472 -28 -318 -16 270 -6 -233 28 208 -34 -217 -26 188 99 -137 -146 64 171 -67 -190 91 225 -128
5493 -128 -277 88 293 -48 -233 33 179 -11 -156 21 173 39 -175 -136 153 195 -119 -196 102 184 -142
5514 -142 -184 155 217 -147 -235 61 209 -4 -150 -15 139 20 -162 -63 207 140 -213 -178 171 181 -141 -157 152
5537 152 140 -153 -164 125 201 -57 -202 -14 166 49 -166 -34 191 49 -237 -95 256 147 -194 -156 158
5558 158 130 -135 -119 130 147 -124 -195 52 212 6 -208 -48 188 27 -197 -25 213 54 -240 -116 189
5579 189 140 -147 -131 107 112 -117 -136 113 193 -94 -232 28 215 17 -189 -7 189 2 -205 -13 232 92
5601 92 -191 -134 144 140 -111 -125 124 137 -141 -169 100 221 -65 -219 1 185 14 -168 -6 189 18 -226
5623 -226 -78 218 119 -184 -132 119 125 -122 -117 134 134 -123 -184 68 216 -15 -205 -22 183 -13 -200 -3 222
5646 222 34 -237 -84 181 110 -138 -104 102 104 -109 -133 107 188 -83 -235 23 228 -7 -195 16 183 -35
5668 -35 -212 2 202 55 -174 -100 114 110 -101 -127 93 134 -137 -199 117 244 -77 -222 47 189 -31 -151
5690 -151 42 167 -14 -174 -58 172 128 -119 -146 102 141 -129 -142 160 179 -163 -199 113 195 -56 -151 30 105
5713 105 -19 -121 4 159 69 -182 -135 159 164 -146 -146 151 106 -178 -123 182 153 -115 -159 44 150 21 -112
5736 -112 -20 139 31 -191 -69 245 137 -232 -133 190 111 -153 -59 158 66 -145 -105 94 144 -20 -170 -35
5758 -35 159 42 -170 -21 218 19 -260 -45 249 69 -175 -65 122 35 -113 -61 86 116 -78 -189 12
5779 12 223 25 -226 -13 206 -31 -218 52 240 -22 -205 -9 151 66 -69 -55 67 87 -83 -144 93 229
5801 229 -84 -264 49 232 -56 -189 83 165 -86 -165 46 160 39 -121 -119 49 131 -62 -142 109 171 -158
5823 -158 -222 159 223 -115 -188 80 122 -84 -91 72 107 -11 -124 -88 140 163 -115 -168 135 153 -165 -120 215 142
5847 142 -189 -148 140 133 -66 -81 4 56 -8 -111 -35 173 99 -213 -168 200 136 -184 -103 189 43 -212 -52 173
5871 173 93 -97 -111 0 102 45 -103 -25 170 29 -229 -62 286 83 -238 -61 181 23 -149 10 131
5892 131 23 -114 -83 46 153 12 -171 -38 182 15 -212 32 235 -44 -267 -1 197 -2 -135 -14
5912 -14 77 5 -70 -61 64 136 -55 -219 20 235 -19 -218 73 213 -94 -197 111 187 -45 -143 -6 88 55 -48
5936 -48 -77 68 121 -101 -191 123 229 -131 -229 115 181 -125 -135 106 107 -91 -115 17 113 67 -98 -130 79 145 -118
5961 -118 -139 160 135 -198 -179 188 158 -138 -127 86 74 -50 -64 38 83 29 -147 -96 179 155 -154 -132 171 105
5985 105 -196 -75 224 84 -181 -94 111 94 -26 -72 -13 77 6 -145 -32 214 64 -254 -98 219 80 -193
6007 -193 -37 169 -8 -173 -27 139 86 -57 -130 -29 129 47 -135 0 195 -28 -243 16 285 13 -212
6028 -212 -24 156 -4 -98 26 105 31 -94 -126 48 191 -4 -206 -4 185 -61 -197 95 218 -90 -228
6049 -228 18 166 0 -97 -23 55 41 -73 -80 106 162 -104 -222 70 212 -76 -178 108 145 -132 -157 103 157
6072 157 -23 -133 -46 92 89 -76 -86 104 114 -155 -153 181 186 -148 -158 121 129 -102 -82 98 83 -68 -138 -10 153
6097 153 83 -142 -122 114 92 -153 -84 182 102 -212 -123 170 120 -98 -93 44 73 -51 -97 33 154 15 -197 -61
6121 -61 205 92 -169 -54 172 32 -194 -31 185 71 -140 -103 68 112 -19 -95 23 119 -40 -187 20 236
6143 236 -2 -225 -46 171 23 -157 -9 126 -8 -152 -54 125 114 -70 -152 35 141 -46 -147 66 190
6164 190 -75 -198 49 214 4 -164 -17 124 2 -115 -16 128 63 -150 -138 106 169 -77 -177 78 131 -92
6186 -92 -148 105 177 -76 -184 10 162 19 -115 -49 116 34 -142 -66 171 124 -156 -174 103 144 -96 -122 81
6209 81 106 -107 -142 78 172 -8 -167 -41 136 64 -123 -34 146 57 -184 -93 176 135 -123 -126 93 108 -76 -96
6233 -96 81 135 -70 -183 21 194 26 -173 -39 138 25 -150 -25 172 64 -184 -115 144 148 -81 -121 64
6255 64 100 -90 -127 81 176 -60 -190 -2 176 40 -140 -31 126 23 -163 -43 181 109 -155 -143 106 132
6277 132 -70 -100 97 116 -112 -160 72 173 -20 -190 -39 135 27 -143 -34 161 32 -194 -84 181 121
6298 121 -137 -132 90 108 -76 -98 80 129 -83 -182 25 193 24 -180 -45 168 16 -161 -3 191 50 -188
6320 -188 -98 128 114 -90 -106 56 107 -69 -139 79 179 -56 -225 -3 192 4 -172 -16 150 -24 -167 -27
6342 -27 161 69 -136 -118 76 119 -61 -127 66 135 -95 -193 82 215 -50 -198 14 145 1 -116 13 130
6364 130 10 -159 -87 154 146 -99 -169 76 155 -103 -141 124 164 -137 -196 72 163 -27 -140 -9 90 16 -113 -34
6388 -34 140 89 -183 -160 152 172 -129 -150 102 104 -151 -117 127 132 -74 -142 -8 139 57 -117 -57 129 54 -175 -77
6413 -77 212 122 -216 -135 163 100 -118 -69 114 68 -91 -114 48 152 25 -164 -80 168 65 -174 -50 203 19
6436 19 -250 -58 201 74 -144 -94 69 50 -57 -74 53 120 -38 -210 -20 218 43 -207 -28 183 -12 -185
6458 -185 29 197 15 -158 -63 99 84 -36 -103 20 109 -44 -183 56 233 -52 -253 14 212 -30 -171
6479 -171 45 136 -35 -134 -15 119 91 -91 -139 41 168 -47 -173 76 178 -119 -210 118 215 -74 -189 46
6501 46 113 -30 -78 5 91 52 -117 -123 120 191 -105 -196 102 172 -135 -152 167 148 -133 -156 88 129 -5 -95 -53 87
6527 87 63 -102 -95 154 131 -203 -178 189 159 -160 -115 133 75 -131 -77 109 94 -50 -126 -54 136 82 -131 -91 150
6552 150 73 -212 -80 247 101 -221 -108 145 73 -98 -38 78 52 -45 -117 11 185 62 -213 -90 193 69
6574 69 -202 -27 208 -2 -233 -44 171 60 -104 -81 19 68 -13 -103 14 163 -27 -241 -15 253 27 -213
6596 -213 -8 183 -32 -163 45 169 3 -114 -85 57 132 -14 -157 1 158 -59 -206 87 254 -70 -252
6617 -252 43 173 -34 -141 37 93 -34 -117 -55 92 118 -77 -185 37 183 -81 -190 102 178 -131 -197 110
6639 110 178 -67 -133 16 87 25 -69 -36 95 105 -124 -154 151 208 -132 -179 127 133 -136 -106 147 119 -102 -122 36
6664 36 111 40 -96 -89 95 84 -134 -107 179 136 -203 -147 181 130 -135 -86 113 63 -97 -70 57 126 5 -151 -68
6689 -68 152 96 -151 -85 179 53 -208 -52 221 79 -161 -83 95 76 -47 -54 27 91 -25 -141 -11 207 49
6712 49 -214 -53 181 29 -174 -14 174 -19 -187 -38 123 74 -61 -98 15 108 -17 -134 37 183 -51
6733 -51 -235 28 225 2 -179 8 149 -24 -129 21 120 50 -116 -110 72 148 -48 -142 47 157 -89 -172 90
6756 90 200 -74 -195 25 134 -9 -94 -5 80 14 -111 -78 115 133 -108 -173 66 156 -79 -133 102 127 -123 -136
6780 -136 84 138 -14 -124 -31 79 44 -93 -49 135 88 -145 -125 153 143 -117 -140 97 102 -100 -86 100 111 -52
6804 -52 -141 4 143 55 -126 -65 122 67 -142 -55 179 73 -187 -124 134 110 -91 -76 68 64 -72 -110 55 147
6828 147 -8 -177 -49 152 54 -138 -37 140 24 -152 -47 170 81 -123 -94 73 92 -50 -87 64 117 -60
6850 -60 -158 28 188 13 -169 -20 146 16 -138 -1 134 21 -140 -76 107 107 -81 -116 51 101 -60 -116 67
6873 67 145 -69 -179 18 166 18 -142 -12 113 20 -119 -24 149 84 -133 -112 102 139 -58 -112 68 114 -67
6896 -67 -129 63 158 -22 -153 -10 143 31 -103 -16 121 21 -141 -60 138 102 -108 -119 65 107 -62 -99 75
6919 75 117 -61 -142 34 174 8 -140 -30 117 26 -114 -21 132 44 -138 -85 130 116 -70 -100 57 118 -58
6942 -58 -103 76 142 -55 -176 8 154 25 -122 -24 94 12 -123 -39 128 82 -125 -123 81 130 -54 -113 68 109
6966 109 -87 -132 65 155 -38 -146 -12 108 17 -94 -26 100 46 -126 -74 141 115 -109 -132 92 113 -79 -84 87
6990 87 111 -72 -120 28 137 9 -123 -51 102 50 -109 -42 144 59 -163 -102 123 98 -108 -112 60 72 -62 -82
7014 -82 60 115 -29 -144 -28 136 59 -126 -54 134 43 -154 -40 158 57 -141 -85 88 70 -61 -70 46 74
7037 74 -38 -117 14 153 16 -167 -32 154 32 -133 -4 137 3 -142 -30 115 72 -81 -99 27 90 -29
7059 -29 -104 29 127 -53 -185 32 187 -12 -155 1 124 -13 -109 15 106 24 -84 -85 68 130 -47 -127 35
7082 35 141 -67 -149 82 161 -77 -150 32 132 -15 -75 -7 76 18 -76 -58 88 108 -91 -144 69 138 -83 -123 77
7107 77 102 -111 -105 79 116 -44 -96 -17 79 51 -59 -58 91 70 -136 -112 144 141 -126 -127 117 96 -84 -66 93 83 -57
7134 -57 -85 3 104 53 -94 -75 107 81 -129 -79 175 64 -172 -94 144 71 -99 -59 58 32 -48 -68 15 104 12
7159 12 -147 -72 154 75 -152 -61 150 15 -179 -22 155 36 -115 -54 61 59 -14 -70 4 102 7 -149 4 186
7183 186 19 -195 -29 160 -2 -139 15 124 -14 -112 -34 62 68 -40 -97 -1 113 -18 -150 20 171 -46
7205 -46 -189 30 173 -30 -136 18 95 -16 -72 -20 51 57 -50 -108 54 151 -36 -147 49 146 -77 -143 81 144
7229 144 -78 -120 48 101 10 -53 -39 41 65 -54 -98 88 135 -108 -147 93 145 -106 -125 101 92 -85 -91 56 83 -5
7255 -5 -80 -40 71 85 -71 -82 105 107 -133 -111 150 118 -127 -100 95 66 -70 -46 53 49 -21 -81 -32 120 70 -113 -95
7282 -95 121 79 -136 -68 150 56 -158 -63 119 75 -61 -64 12 43 -18 -81 -18 115 33 -149 -68 152 58 -152 -44
7307 -44 144 11 -142 -12 118 46 -76 -62 25 92 13 -88 4 121 5 -153 6 181 0 -170 -12 137
7329 137 -4 -107 12 93 5 -78 -56 37 97 -26 -128 8 127 -31 -142 32 146 -60 -169 30 124 -11
7351 -11 -106 -11 60 7 -63 -57 63 84 -71 -130 45 143 -55 -131 56 127 -64 -104 81 121 -37 -97 0 93 52 -58
7377 -58 -50 57 78 -79 -102 101 118 -105 -139 83 118 -83 -80 65 73 -56 -84 20 93 33 -89 -72 79 79 -103 -83
7403 -83 96 78 -137 -99 117 91 -92 -76 65 67 -38 -59 21 85 -3 -105 -30 122 65 -122 -57 126 54 -123 -57
7428 -57 131 49 -116 -68 81 68 -41 -79 5 80 -11 -115 -13 119 20 -151 -46 133 33 -121 -27 105 21 -104
7452 -104 -38 93 66 -57 -93 24 103 -10 -102 12 126 -13 -137 16 149 20 -120 -24 100 20 -73 -36 82
7475 82 46 -67 -79 54 110 -31 -118 11 111 -37 -120 29 123 -35 -129 -7 115 14 -86 -44 64 45 -80
7498 -80 -64 70 94 -79 -109 54 121 -45 -99 39 103 -33 -109 26 111 5 -102 -31 94 61 -68 -57 65 58 -84
7523 -84 -82 72 99 -76 -111 53 105 -26 -82 24 91 -19 -112 -25 102 42 -104 -71 65 50 -84 -58 87 58 -88
7548 -88 -89 53 107 -49 -100 26 88 -12 -94 12 99 5 -106 -22 103 58 -100 -58 71 46 -80 -66 94 75 -74
7573 -74 -99 41 92 -28 -93 21 82 -28 -105 1 98 17 -105 -46 85 50 -80 -56 73 65 -85 -92 71 101 -51
7598 -51 -93 36 88 -16 -76 23 102 -10 -87 -21 100 51 -92 -52 86 69 -76 -71 87 78 -79 -78 58 89 -36 -88
7624 -88 18 80 -4 -87 -12 89 15 -103 -58 104 54 -97 -64 84 52 -75 -54 86 76 -52 -88 25 82 -6 -87
7649 -87 2 94 -1 -109 -10 123 28 -116 -42 96 46 -65 -29 72 44 -59 -64 48 93 -15 -95 -11 93 0 -102
7674 -102 -5 103 4 -119 -11 102 24 -96 -50 49 42 -54 -48 38 72 -41 -107 22 114 -16 -117 -7 99 -15 -108
7699 -108 30 96 -7 -94 -28 63 44 -40 -72 41 66 -48 -86 54 97 -57 -128 30 96 -32 -78 28 71 -24 -76
7724 -76 -21 74 34 -67 -69 45 71 -55 -94 59 86 -90 -105 73 93 -54 -82 27 73 -10 -48 4 61 19 -77 -56 82
7751 82 86 -79 -90 73 77 -91 -65 86 68 -79 -70 48 63 -10 -54 -7 54 25 -80 -45 97 57 -112 -66 104 65 -99
7778 -99 -50 87 47 -68 -44 52 40 -29 -70 -12 83 31 -96 -37 107 26 -116 -25 124 30 -110 -35 86 42 -54 -30
7804 -30 38 47 -20 -68 9 98 9 -117 -21 119 14 -110 -4 110 -15 -113 -17 74 18 -60 -26 18 46 -11 -64 15 90
7831 90 -23 -129 8 128 -10 -115 12 96 -19 -86 16 87 3 -57 -31 29 77 -5 -77 26 91 -39 -101 67
7855 67 123 -53 -120 37 91 -18 -62 14 48 -17 -52 -24 64 72 -53 -102 38 98 -58 -88 67 81 -82 -85 80 80 -38
7882 -38 -50 7 44 10 -34 -19 54 46 -86 -72 89 86 -80 -80 81 59 -78 -55 72 54 -42 -62 16 50 5 -46 -47 65 48
7911 48 -81 -49 108 53 -112 -49 89 47 -81 -35 49 25 -37 -32 15 65 10 -75 -30 83 37 -80 -22 104 13 -118
7937 -118 -9 98 27 -78 -34 56 37 -33 -31 19 57 -16 -79 -5 105 16 -113 -19 114 3 -95 17 87 -6 -76 -8
7963 -8 56 28 -39 -44 7 55 -18 -86 18 96 -25 -107 21 107 -14 -84 10 65 -15 -58 10 48 19 -40 -59 26 83 -12 -72
7992 -72 32 89 -47 -81 58 84 -44 -85 33 63 -7 -48 0 32 13 -50 -33 61 74 -54 -88 46 77 -56 -68 56
8018 56 53 -71 -71 38 67 -25 -70 -15 38 13 -44 -27 56 39 -80 -53 99 70 -74 -56 60 32 -44 -44 56 38 -27 -52
8046 -52 2 52 19 -55 -34 58 22 -73 -29 84 40 -103 -50 72 42 -46 -36 19 28 -31 -50 9 58 2 -90 -29 69 22 -73
8075 -73 -10 72 -1 -100 -14 84 28 -68 -34 39 37 -6 -26 30 57 -10 -74 24 100 16 -79 -6 66 10 -62 3 56 5 -79 -35 39
8106 39 45 -41 -58 17 52 -32 -64 31 73 -42 -90 9 71 -3 -65 -5 47 -1 -42 -19 57 25 -58 -62 47 60 -28 -66 36 61
8136 61 -35 -59 36 79 -26 -70 10 77 14 -52 -6 42 19 -68 -27 60 56 -71 -72 39 37 -37 -51 41 40 -50 -59 18 62 -15 -67
8167 -67 -19 50 10 -50 -11 67 27 -79 -40 65 60 -45 -53 36 41 -38 -42 38 54 -23 -82 0 73 21
8191B1
##END NTUPLES=NMR FID
##END=
