##TITLE=1H_LY-Ni-600-ac-120
 CDCl3, 8 sc, 
 15.1.2019
##JCAMPDX= 6.0         $$ Bruker NMR JCAMP-DX V2.0
##DATA TYPE= NMR FID
##DATA CLASS= NTUPLES
##ORIGIN= UXNMR, Bruker Analytische Messtechnik GmbH
##OWNER= root
$$ XWIN-NMR		Version 3.5
$$ Tue Jan 15 16:06:28 2019 Russian Standard Time (UT+4h)  she@DPX200
##.OBSERVE FREQUENCY= 200.1313
##.OBSERVE NUCLEUS= ^1H
##.DELAY= (6, 6)
##.ACQUISITION MODE= SIMULTANEOUS
##.ACQUISITION SCHEME= undefined
##.AVERAGES= 8
##.DIGITISER RES= 18
##SPECTROMETER/DATA SYSTEM= spect
##.PULSE SEQUENCE= zg30
##.SOLVENT NAME= CDCl3
##.SHIFT REFERENCE= (INTERNAL, CDCl3, 0, 15.7039)
##AUDIT TRAIL= $$ (NUMBER, WHEN, WHO, WHERE, WHAT)
$$ ##TITLE= Audit trail, XWIN-NMR		Version 3.5
$$ ##JCAMPDX= 5.01
$$ ##ORIGIN= Bruker BioSpin GmbH
$$ ##OWNER= she
$$ F:/spectra/data/she/nmr/H-F/1/audita.txt
$$ ##AUDIT TRAIL=  $$ (NUMBER, WHEN, WHO, WHERE, WHAT)
(   1,<2019-01-15 16:04:48.92 +0400>,<she>,<DPX200>,
      <created by zg, POWCHK disabled, PULCHK disabled
       configuration hash MD5:
       00 E9 B6 7A A2 85 ED C7 34 08 36 98 17 FE 4E 26
       data hash MD5: 16K
       55 A5 62 9E 05 31 24 04 3E 7B C2 38 E9 A6 CD 7C>)
$$ ##END=
$$ 
$$ hash MD5
$$ 00 59 5F FC B2 23 11 92 AF 34 52 94 F4 A2 13 45
##$RELAX= 
##$RELAX= 
##$RELAX= 
##$RELAX= 
##$RELAX= 
##$RELAX= 
$$ Bruker specific parameters
$$ --------------------------
##$DU= <F:/spectra>
##$EXPNO= 1
##$NAME= <H-F>
##$PROCNO= 1
##$TYPE= <nmr>
##$USER= <she>
##$AMP= (0..31)
100 100 100 100 100 100 100 100 100 100 100 100 100 100 100 100 100 100 
100 100 100 100 100 100 100 100 100 100 100 100 100 100 
##$AQSEQ= 0
##$AQ_mod= 1
##$AUNM= <au_zg>
##$AUTOPOS= <>
##$BF1= 200.13
##$BF2= 200.13
##$BF3= 200.13
##$BF4= 200.13
##$BF5= 200.13
##$BF6= 200.13
##$BF7= 200.13
##$BF8= 200.13
##$BYTORDA= 1
##$CFDGTYP= 0
##$CFRGTYP= 5
##$CHEMSTR= <none>
##$CNST= (0..31)
1 1 145 1 1 1 1 1 1 1 1 1 1 1 1 1 1 1 1 1 1 1 1 1 1 1 1 1 1 1 1 1 
##$CPDPRG= <>
##$CPDPRG1= <>
##$CPDPRG2= <>
##$CPDPRG3= <>
##$CPDPRG4= <mlev>
##$CPDPRG5= <mlev>
##$CPDPRG6= <mlev>
##$CPDPRG7= <mlev>
##$CPDPRG8= <mlev>
##$CPDPRGB= <>
##$CPDPRGT= <>
##$D= (0..31)
0 1.2 0 0 0 0 0 0 0 0 0 0.03 0 0 0 0 0 0 0 0 0 0 0 0 0 0 0 0 0 0 0 0 
##$DATE= 1547553888
##$DBL= (0..7)
120 120 120 120 120 120 120 120 
##$DBP= (0..7)
150 150 150 150 150 150 150 150 
##$DBP07= 0
##$DBPNAM0= <>
##$DBPNAM1= <>
##$DBPNAM2= <>
##$DBPNAM3= <>
##$DBPNAM4= <>
##$DBPNAM5= <>
##$DBPNAM6= <>
##$DBPNAM7= <>
##$DBPOAL= (0..7)
0.5 0.5 0.5 0.5 0.5 0.5 0.5 0.5 
##$DBPOFFS= (0..7)
0 0 0 0 0 0 0 0 
##$DE= 6
##$DECBNUC= <off>
##$DECIM= 32
##$DECNUC= <off>
##$DECSTAT= 4
##$DIGMOD= 1
##$DIGTYP= 9
##$DL= (0..7)
0 120 120 120 120 120 120 120 
##$DP= (0..7)
150 150 150 150 150 150 150 150 
##$DP07= 0
##$DPNAME0= <>
##$DPNAME1= <>
##$DPNAME2= <>
##$DPNAME3= <>
##$DPNAME4= <>
##$DPNAME5= <>
##$DPNAME6= <>
##$DPNAME7= <>
##$DPOAL= (0..7)
0.5 0.5 0.5 0.5 0.5 0.5 0.5 0.5 
##$DPOFFS= (0..7)
0 0 0 0 0 0 0 0 
##$DQDMODE= 0
##$DR= 18
##$DS= 0
##$DSLIST= <SSSSSSSSSSSSSSS>
$$ [...]
##$SUBNAM2= <"">
##$SUBNAM3= <"">
##$SUBNAM4= <"">
##$SUBNAM5= <"">
##$SUBNAM6= <"">
##$SUBNAM7= <"">
##$SUBNAM8= <"">
##$SUBNAM9= <"">
##$SW= 20.0189088683792
##$SWIBOX= (0..15)
0 0 2 0 0 0 0 0 0 0 0 0 0 0 0 0 
##$SW_h= 4006.41025641026
##$TD= 16384
##$TD0= 1
##$TE= 0
##$TE2= 300
##$TE3= 300
##$TEG= 300
##$TL= (0..7)
0 120 120 120 120 120 120 120 
##$TP= (0..7)
150 150 150 150 150 150 150 150 
##$TP07= 0
##$TPNAME0= <>
##$TPNAME1= <>
##$TPNAME2= <>
##$TPNAME3= <>
##$TPNAME4= <>
##$TPNAME5= <>
##$TPNAME6= <>
##$TPNAME7= <>
##$TPOAL= (0..7)
0.5 0.5 0.5 0.5 0.5 0.5 0.5 0.5 
##$TPOFFS= (0..7)
0 0 0 0 0 0 0 0 
##$TUNHIN= 0
##$TUNHOUT= 0
##$TUNXOUT= 0
##$USERA1= <user>
##$USERA2= <user>
##$USERA3= <user>
##$USERA4= <user>
##$USERA5= <user>
##$V9= 5
##$VALIST= <valist>
##$VCLIST= <CCCCCCCCCCCCCCC>
##$VD= 0
##$VDLIST= <DDDDDDDDDDDDDDD>
##$VPLIST= <PPPPPPPPPPPPPPP>
##$VTLIST= <TTTTTTTTTTTTTTT>
##$WBST= 1024
##$WBSW= 4
##$XGAIN= (0..3)
0 0 0 0 
##$XL= 0
##$YL= 0
##$YMAX_a= 149595
##$YMIN_a= -168710
##$ZGOPTNS= <>
##$ZL1= 120
##$ZL2= 120
##$ZL3= 120
##$ZL4= 120
##$ABSF1= 10
##$ABSF2= 0
##$ABSG= 5
##$ABSL= 3
##$ALPHA= 0
##$AQORDER= 0
##$ASSFAC= 0
##$ASSFACI= 0
##$ASSFACX= 0
##$ASSWID= 0
##$AUNMP= <proc_1d>
##$AZFE= 0.1
##$AZFW= 0.1
##$BCFW= 1
##$BC_mod= 2
##$BYTORDP= 1
##$COROFFS= 0
##$CY= 11.3945322036743
##$DATMOD= 1
##$DC= 2
##$DFILT= <>
##$DTYPP= 0
##$F1P= 18.9103706918063
##$F2P= -1.10871071338519
##$FCOR= 0.5
##$FTSIZE= 0
##$FT_mod= 4
##$GAMMA= 1
##$GB= 0.15
##$INTBC= 1
##$INTSCL= 1
##$ISEN= 128
##$LB= 0.24
##$LEV0= 0
##$LPBIN= 0
##$MAXI= 10000
##$MC2= 0
##$MEAN= 0
##$ME_mod= 0
##$MI= 1.114404
##$NCOEF= 0
##$NC_proc= 0
##$NLEV= 6
##$NOISF1= 3.799351
##$NOISF2= 2.8
##$NSP= 1
##$NTH_PI= 0
##$NZP= 0
##$OFFSET= 15.70392
##$PC= 1
##$PHC0= -9129.741
##$PHC1= 9.400043
##$PH_mod= 1
##$PKNL= yes
##$PPARMOD= 0
##$PSCAL= 0
##$PSIGN= 0
##$REVERSE= no
##$SF= 200.130013532006
##$SI= 16384
##$SIGF1= 3
##$SIGF2= 2
##$SINO= 400
##$SIOLD= 16384
##$SREGLST= <1H.CDCl3>
##$SSB= 0
##$STSI= 0
##$STSR= 0
##$SW_p= 3612.71676300578
##$SYMM= 0
##$S_DEV= 0
##$TDeff= 0
##$TDoff= 0
##$TI= <>
##$TILT= no
##$TM1= 0
##$TM2= 0
##$TOPLEV= 0
##$USERP1= <user>
##$USERP2= <user>
##$USERP3= <user>
##$USERP4= <user>
##$USERP5= <user>
##$WDW= 1
##$XDIM= 8192
##$YMAX_p= 0
##$YMIN_p= 0
$$ End of Bruker specific parameters
$$ ---------------------------------
##NTUPLES= NMR FID
##VAR_NAME=  TIME,          FID/REAL,        FID/IMAG
##SYMBOL=    X,             R,               I
##VAR_TYPE=  INDEPENDENT,   DEPENDENT,       DEPENDENT
##VAR_FORM=  AFFN,          ASDF,            ASDF
##VAR_DIM=   8192,          8192,            8192
##UNITS=     SECONDS,       ARBITRARY UNITS, ARBITRARY UNITS
##FACTOR=    0.0002496,     1,               1
##FIRST=     0,             0,               0
##LAST=      2.0444736,     0,               0
##MIN=       0,             -168710,         0
##MAX=       2.0444736,     149595,          0
$$ Real data points
##PAGE= N=1
##DATA TABLE= (X++(R..R)), XYDATA
0@%%%%%%%%%%%%%%%qJ6j6J6j6K4l2L2l9M7n5O3p2Q0q8J04j20J36j52J73j97K21
37A17k46K74l06L42l80M20m66N15n70O28o92P63q39R25j018J121j239J372j520
56g99J688j881K107k376K697l093L599m260N168o498Q635j2599K2255q5731r7622
71a68710K46947n005j67511J02455J34250j70849q2564J43390r966j04103J25123
82D3457O7539j77176j2166J81970q1593j65701J57035J31526j97785o1915K09402
93I4593q433j88557O4698J18377j15996l6838J50561k4216j21848Q6383M6120
104F4844j68408J2712K12214m6982j73923J10016J05083j89982o8222K07982L1839
115I7173j49220M8474Q5581j26379m5630J34593j6697r3815J10363N8500j75844
$$ y = [0, 0, 0, 0, 0, 0, 0, 0, 0, 0, 0, 0, 0, 0, 0, 0, -8, 8, -8, 8, -8, 16, -16, 16, -23, 24, -31, 32, -40, 40, -48, 56, -64, 72, -80, 93, -104, 117, -129, 145, -161, 181, -199, 221, -245, 270, -300, 328, -364, 399, -440, 485, -533, 588, -651, 721, -799, 889, -992, 1115, -1261, 1436, -1657, 1942, -2318, 2850, -3648, 4987, -7612, 14643, -71088, -168710, 78237, 73232, -94279, 8176, 142426, -28423, -110987, 32403, 22437, -81666, 43457, 110996, -66180, -78346, 103624, 22031, -143670, 13365, 144891, -52894, -114809, 94593, 86160, -102397, -37699, 80678, -35318, -72156, 78405, 54189, -67659, 18724, 64844, -103564, -90852, 121362, 74380, -99543, 10473, 115556, -74426, -142648, 65334, 97173, -52047, -3573, 82008, -44371, -90001, 44592, 27895, -65920, 44443, 102943, -72901]
126g2901k1238J84508m5018j67656J13923J39001j48421q1292J56203Q425j46328
137h0794M4556R7957q1614j7112J17855m9519j22720R0687O9886j40547j962J90174
149A16847l3198j82890O1127J17974j14821o0328J51483K9332j20880J9803N6224
160D0673q9781j2157J21495k6387r7180R1175O3376j51305l8646J63795m942j44813
172h4697O3635J22689r6120q2461R6774J5407r1178M2478P0910p0004j3403R1571
184F5601n4568j11457R2030R2803j12797l4805J44084j1376j56654K9134J14861
195E6856n5099n0813R1254J1530q9138J9079M0789p0059M737J11051l0753j03655
207f4221O8820P1721j17477n1106J33507K6166j11384K0932Q6886n8200o3128
$$ y = [-72901, -94139, 90369, 45351, -122305, -8382, 130619, -17802, -99094, 57109, 65534, -80794, -36238, 61719, -19895, -37007, 80848, 31329, -91391, -704, 69182, -71365, -73327, 116847, 83649, -99241, -38114, 79860, -34961, -95289, 56194, 85526, -35354, -15551, 40673, -49108, -61265, 60230, 33843, -63337, 27838, 91214, -60091, -98737, 65058, 60116, -84697, -21062, 101627, 5507, -76954, 19820, 35227, -55951, -13473, 57437, -12567, -25970, 65601, 11033, -100424, -8394, 84409, -28388, -63193, 80891, 69515, -87139, -58005, 56856, 1757, -49056, 42198, 53728, -35410, -16331, 24458, -45601, -40864, 70187, 39434, -64221, 4599, 76320, -41157, -92263, 41244, 67410, -43974, -23042, 63844, 5644, -57484]
218e7484N8678J4504m6819M4361M1234p3763j6169P9294l6211r0846P5731R4345
230H6855q3307o0437Q9208J2395j02084R544Q5845j7952l4471M1012q869n6413
242c8674K8989L2625n6356O196R2884k4752r9854L8648P3175o9657n0877R0430
254B2777L9557p3881j1015M4982k7771k9247L9164N565k5363L9937J9644p4314
266b9965j7467P5882q974p1962M5092P8236n4244o6754M5004K8327m6989Q98M6975
279B4059n182j7265J3075k2496l2395L9027L1081m5544m100O6492j3025q1418
291d7691J1725O4671k0741l8783M0138L0909l6638k2415J0448n525M862K6860
303A7820q563k0005K8801R796n8169j5979O3356J4822m9893P402M8180k1138n0897
$$ y = [-57484, 1194, 15698, -31121, 13240, 54474, -19289, -35458, 43836, 7625, -83221, -7490, 86855, 3548, -56889, 32319, 44714, -57370, -47826, 38019, 20067, -14404, 26608, 17739, -38674, -9685, 22940, -33416, -27220, 65664, 40912, -58942, -20294, 52881, -16776, -67653, 22777, 62334, -11547, -22562, 22420, -5351, -34598, 4566, 10131, -15232, 24705, 44349, -29965, -47432, 28450, 19476, -52486, -7394, 70842, 16598, -50156, -5152, 23175, -23814, -22916, 24059, 18877, 1612, 14687, -7809, -40204, -1177, 29904, -15640, -19740, 46752, 33727, -47691, -35966, 28705, 7964, -30819, 9319, 40228, 3590, -18825, -8377, -13902, -9040, 17820, 9257, -10748, 18053, 27849, -30320, -46299, 17057, 31879, -18014, -10612, 37568, 16430, -34467]
316c4467J0150L0881j389j508P468o204j370L257k5143j5844M0811K9465l5368
329G39j9122L6797K646n0435o499M6941J4266k3671l922J1857m809j4768r400
342a9380M494K4750J7541k0151k1462J6273J0172l0558j2981L9165K6169k5428
354H604k2224J3816Q370j9801j2592J9239K6283j6k2512j1442J0976M059j7089
367a4329m063K8474K0483k0112k6808N878J6354r683j6237J6759L1279n130l3958
380a1093q164K0869K043j8931N131K8991O509k4003j8067N237J1764k27q102P028
394a015K3419j03l5545j5380K8761J3323k4536l90L5331K474l7438j2358J9423
407d034O638n913L993P472M580j294k0722j9042K1279K7499j8003j7483L1005
$$ y = [-34467, -24317, 6564, 5175, 3667, 11135, 4931, 3561, 6818, -18325, -34169, 6642, 36107, 739, -18383, 18414, 21060, -29375, -35874, 11067, 25333, 1662, -2260, 9597, 4788, -9980, -19380, -14886, 9864, 27405, 7254, -14208, 2065, 12237, -18321, -31302, 7863, 34032, 8604, -13620, 196, 8566, -11235, -23827, -4588, 21695, 21679, -833, -12275, -1299, 2760, -14329, -18392, 10082, 30565, 10453, -16355, -10477, 5877, -3806, -20043, -3284, 27995, 22865, -11093, -19257, 1612, 3655, -15276, -10145, 18846, 25355, 1352, -16715, -11478, 286, 59, -8043, -1015, 22404, 22301, -13244, -28624, 137, 13460, -11076, -11466, 23865, 26339, -11099, -23457, -4034, 2604, -3309, 684, 8156, 12736, 11442, -9280, -28322, -7043, 20456, 2453, -15030, 15975]
420A5975J4004m4267k1713L6282J6758k2235J389K1555o088j8013m504m386O121
433i122K5297K6k6586R800K5802l0777l6834L6544L9341k9835k1226L2967N387
446B0784l8622n586K3865K458J758J2127j3654j4949J8927k071l6546J4939N3247
459C6677j5016m7269K2606L1419m0184k6646M2579K1464k5540k96J2769j9031
471f468p552J7192j0730r115L9069J1040n1405p380M7016j4166m7555L2502N0123
484D2571l1364l3848K7291O132l1352P777K4280j1000K837K2457k6912l3133L5360
497A096K2330m5487o58O2517r067o3889J3678M3540k8991k4595M1021J4682l0255
510d078L716R678l0115J830M0317j4926l1327M1459K4667o2863k1617O1766M141
$$ y = [15975, 29979, -14288, -36001, 281, 17039, -5196, -3807, 17748, 11660, -6353, -10857, -15243, -9122, 16175, 16201, -10385, -585, 25217, -5560, -42394, -5850, 33491, 3656, -17570, 15397, 20784, -17838, -23424, 441, 2899, 4657, 16784, 3130, -11819, 7108, 5037, -31509, -16570, 36677, 21661, -25608, -3002, 28417, -11767, -38413, 4166, 25630, 90, -206, 12563, -6468, -14020, 3172, -7558, -16673, 22396, 33436, -17969, -25349, 21667, 7501, -40054, -7552, 42571, 11207, -22641, 4650, 10782, -20570, -12793, 11487, 487, 3324, 25781, -1131, -34264, 1096, 23426, -22061, -22719, 39798, 30731, -33158, -19480, 24060, -4931, -29526, 11495, 26177, -4078, -362, 9316, -20799, -18969, 21348, 6422, -24905, 16554, 41221, -21642, -43259, 18507, 22648]
523B2648n2833K1920M9595l1888l6655K6589N442k5674K1822K4218l0440l324
535h580L6298k7326m7689M3289M5096m8087k1651N8730N1o5249Q194M8945j8716
548C305k0909L4663K135l5129J3362J5905l7727K282N6386j3962n2803L3667L9784
561D0959n7573l1957O3462J8065n1593R550M1418l0458l0842L0304L284k5033
573b0414L1616K5304m8732j3907N0483j6308n5985M1709N8906m7721m0103M9671
585A4519R209n5740R797M7972j8597j9708L1451q809m0006K6703K8789m4920p316
598b6656O3693q337o5910K3652N1053m4911l6437N6188K2619m6344K938L0972
610B2520l0749k0898L8402J239l0390L3450K7512n8904k4659O0320K568n5850
$$ y = [22648, -30185, -8265, 41330, 9442, -27213, -624, 4818, -20856, 966, 25184, -5256, -8580, 27718, 392, -47297, -4008, 41088, -6999, -28650, 30080, 30131, -35118, -26924, 22021, 3305, -17604, 17059, 19194, -15935, -2573, 13332, -24395, -22113, 34273, 20311, -32492, 1175, 40959, -16614, -48571, 14891, 32956, -18637, -9087, 32331, 1873, -28969, 1335, 4619, -20414, 11202, 36506, -12226, -26133, 24350, 8042, -47943, -6234, 52672, 4951, -35152, 14519, 23728, -32012, -22215, 25757, 7160, -12548, 18903, 10094, -29912, -3209, 25580, -19340, -26656, 37037, 28700, -37210, -13558, 37495, -7416, -43853, 12335, 34954, -11390, -8452, 22520, -8229, -29127, 9275, 10514, -19876, 13574, 41086, -17818, -42477, 17843, 20411, -35439]
622c5439K9068N7713m3139m8301M0082J7798l9415J2628L8387k6389j9817L3798
634A6974j0886m2443L4502L9988m9692k2168O3595K809o7991J2944N4937l1897
646F72l6114M6829K0553m1988K076K4210l3078j2235N0037M58m2762K7497L2310
659C8465n8977l0973O6673J9907n4458J0501M6960l5910m2836L7234K1477k9038
671a0975J2966K6601l6037j8629M2536m804m5597L0724M5548m6714l3544N6317
683A8392J4506n9826K016M9149j9026k8994L6351J2538l8863M194K2522l1649
695a8690o739N6278L5n5869J5375L9313m5133l1286O3072K7668n3151o780L5685
708A9778k4366k8467L7594J7131k9744J1323K1640m0412j7369N1766L378n1303
$$ y = [-35439, -6371, 51342, 8203, -40098, -16, 17782, -21633, -9005, 29382, 2993, -16824, 16974, 6088, -36355, -1853, 38135, -11557, -33725, 29870, 32679, -35312, -22368, 32569, 672, -35442, 11387, 31940, -10048, -7972, 16238, -16840, -29075, 20962, 21420, -21342, 6155, 38465, -20512, -51485, 15188, 35095, -19363, -8862, 38098, 2188, -40648, -3414, 18063, -10975, 1991, 28592, -7445, -26074, 16462, 11658, -33939, -3215, 42333, -4381, -37925, 18392, 32898, -26928, -24912, 24237, 5211, -23783, 12568, 25106, -13757, -9563, 12959, -18690, -25429, 30849, 30884, -24985, -9610, 29703, -15430, -46716, 16356, 44024, -9127, -15907, 19778, -4588, -33055, 4539, 21670, -8074, 3249, 24889, -15523, -32892, 18874, 22252, -29051]
720b9051J9624M8665l7138l9142M5525K1003m8522l465M1056j1323k1314K8096
732A4014K155l8322J0293K8877k7928r787N2264N66o1536M544M6538k3278k9112
745c0712M5872K3794m6530j3956K7723j1889j3746L4023P046l4129R868K3818
757B1182l5954j8220N1556J0588n1562O591M6777k3636l8497L1590K1628l4403
769a2360k400L1973j0997j7276K3254l921l6341J7679L6906k6544k0361M2193
781B1805M414n6129L58M9498q042k8397K6263J4814l6191q395K4549p763p085
794a0301L0052j058l7930R636K9844k7839k2017M3266J6875m4197m668L8064j1278
807H449l1655J9121J8743k0143P27K0838j5152j5229K2335j590l1109J7796L8109
$$ y = [-29051, -9427, 39238, 2100, -37042, 8483, 29486, -19036, -22501, 18555, 7232, -14082, 14014, 16169, -22153, -11860, 17017, -10911, -20698, 31566, 32132, -29404, -24860, 21678, -1600, -30712, 15160, 38954, -7576, -21532, 6191, -5698, -19444, 14579, 21625, -12504, -2636, 21182, -14772, -32992, 18564, 29152, -22410, -15819, 30958, 7322, -31175, 415, 22043, -12360, -14760, 17213, 6216, -11060, 12194, 8273, -28068, -10389, 26517, -27, -20388, 21805, 26219, -29910, -29552, 19946, 11904, -16493, 9770, 24584, -11607, -20002, 4547, -3216, -10301, 19751, 18693, -19237, -9601, 20243, -7596, -29613, 13653, 30528, -13669, -18337, 19727, 8449, -23206, -4085, 14658, -5485, -4758, 16080, 928, -14301, 8034, 6444, -24665, -6869, 31240]
820C1240k3883l0433K9137J2948l9749k883M1654l75k5931J0457P644k3325Q68
833a2631K1625r679p319K6639k627l8266P242L4091j8068k5022L1601K0321l3875
846e968j2105K6452l103k0320J3445J2998j3642K851J3070j9278j3697K5563N625
859A1891k7618R557L3057j7812l2949J7854J9915k1161n760K6002R92j9016K979
872b069K623j3255P959J8531j2358j0591K1808P49l3104K001L2853o085k3561
885a4499J6383J7780k1395j3758J5033K393p686J0336M539j2985L625J0092j8096
898h238j1266K6267J0943k4840j253K4572r085k6679R823K0203p739o179J0732
911G261k126j0493L631j61q969J1219J6562j3932j4800J6150O034k3674k539K6486
$$ y = [31240, 7357, -23076, 6061, 19009, -20740, -23623, 18031, 17656, -8275, 2182, 9826, -13499, -12631, 8994, -685, -8004, 18635, 16008, -22258, -15016, 19075, 1007, -24015, 7586, 27907, -5968, -18073, 8379, 5276, -15044, -1599, 11399, -2243, 608, 13678, -5600, -19297, 6266, 11891, -15727, -6170, 26887, 9075, -23874, -6020, 13895, -7266, -13026, 12976, 13968, -5048, -2069, 554, -12701, -4742, 13789, 1431, -9160, 12648, 13397, -19707, -17706, 15147, 9062, -14499, 1884, 19664, -1731, -15489, -456, 1937, -5749, 4587, 9126, -3859, -234, 9858, -8238, -19504, 6763, 17706, -7134, -8387, 16185, 7100, -19579, -9756, 10447, 2708, -3471, 7261, 5135, -5358, -1727, -1888, -10857, 362, 16924, 2992, -11808, 4342, 10376, -13298, -15837, 10649]
925A0649L043j8636K175J0574r102q434O763L319Q10P909l008j4062L683J1173
939F856j1476r703J9966J2665j9000j0126J4299J187j4682K474J3938R36m537
952B797j081n293k406O886p47p280R477J3176j2383j6327R760J0569j1522n133
966i507J5579O534j1696o527K841M93K72K078k45L235O180o612j3607L785J2865
981E668l921q615R615J0131j0749j2519M771P802j811k090L724L739q90o629p059
996h833L174R778O2o886L723Q154o990j3028L011J1868O02o179J943N906k735
1011C570r226l301O872P418j405m957K167M287n616r373K810J1249K469o793j645
1026a474N211q93r096l047R463Q043m306o354L005L391o548o442N551R539N09
$$ y = [10649, 13692, -4944, -2769, 7805, -1297, -9731, -2968, 351, 1161, 9070, 6062, -8000, -4317, 6856, -4620, -14323, 5643, 18308, -692, -10818, 3481, 4668, -10014, -7540, 6398, 7334, 2797, 1716, -3577, -5983, 903, 156, -7124, 2353, 15529, 3146, -13181, -3421, 7148, -4374, -9507, 6072, 12606, 910, -5617, -2776, -2283, -2011, 67, -178, 3057, 9237, 2625, -10982, -7197, 5668, 1747, -6868, 2747, 12878, 2129, -10390, -5619, 2183, 372, -1718, 2006, 5745, 4855, -1774, -8833, -5659, 4119, 4181, -2705, 1018, 9172, 2182, -10846, -7835, 4033, 4635, -1544, 399, 6305, 3570, -5656, -8957, -2085, 5333, 3928, -1029, 1138, 5425, -191, -9564, -6754, 4495, 6964, 171, -1474, 3737, 2844, -6252, -9299, 164, 8207, 3901, -2453, 552, 3943, -2605, -9047, -3496, 6043, 6552]
1041F552n969k382K496O3n473k578Q105Q894m663r614K293O077o079p077Q090
1056a265J0561l514q016J32K384j999k435J014N217N938k797j0054r80Q282j734
1071G34q636O231J3101m716j2995J660O937l836l882N649N205m84k797n670l166
1086f665O187L870o745N41J2437j234j6312j148J2794j210q786O246R287n320
1100C942p534K29J1R22N168n84l834N992L287j3224o596J4174O078j1918R9J3481
1116I693l446j4502J420Q530j540p90M645j488k675K698m643q234Q689J2064q689
1131A732q572J1866L936j7027l819J5836K763r410L093N861o526m112K936k407
1145c850Q25J0701r11j2594L660J0320j1220j0928J5564J1392j3397n624J1623
$$ y = [6552, 583, -1799, 697, 760, -4713, -7291, 814, 9708, 5045, -4569, -2276, 3801, -2278, -9355, -1265, 9296, 5782, -2234, -2102, 282, -1717, -4152, -3138, 2079, 8017, 5220, -4834, -5814, 2468, 734, -7902, -1671, 11430, 6714, -6281, -4621, 2316, -1520, -5402, 247, 5452, 4968, 2171, -3499, -6665, -478, 3392, -3353, -2812, 9625, 8391, -7921, -9069, 3725, 2515, -6271, -25, 9262, 3942, -3592, -3363, -3352, -2430, 2738, 2154, -1680, 4312, 7599, -5625, -12221, 1953, 8031, -3887, -3788, 9693, 6247, -8255, -6835, 1695, 155, -635, 4010, 2522, -153, 2545, -2098, -10332, -1643, 10421, 1732, -6840, 5026, 8962, -8065, -11884, 3952, 6715, -2695, 398, 6259, -267, -4379, -1443, -3850, -3025, 7676, 6765, -5829, -2169, 8151, -3069, -13997, 1567, 12959, -438, -6062, 5561]
1158E561j696j2237L210Q068k340J486M775p827n877R238L9j2383O918J7146q599
1173E482j5798R387Q870j3613m580J5210L214r441J534K494p726O87P724n013
1187a569l098J3199Q89j8079L06J6073o029j3465J2534J2996j2675q716R275k06
1201A435q335N732O277n554K004O313j1155q818J4158N948j4690K180J7930p150
1215F275j8840P388J2219r136l891J2207K4r514L114J505r070M466J2352p847
1229A252r038J3556M471j9331k350J8910j577j4355Q304J1486j1122p963Q049
1242B92m85n390Q783M477j0425R60R363j0708j1222J6108J1340j5246m434J5292
1256H705l728j7160N948J3511n644l952P971l493q831O614L376j0381M115J4693
$$ y = [5561, 3865, -8372, -5162, 2906, 566, 2052, 6827, -1000, -6877, 2361, 2400, -9983, -3065, 14081, 5482, -10316, -929, 7941, -5672, -10252, 4958, 8172, -1269, 265, 2759, -4967, -4280, 3444, -1569, -4667, 8532, 9421, -8658, -8352, 7721, 1692, -11773, 761, 13757, 1082, -7634, 1641, 1435, -6900, -1168, 5109, -445, 1559, 7872, -3283, -12101, 2057, 8005, -6685, -4505, 13425, 6275, -12565, -5177, 7042, -2094, -5985, 6222, 6246, -3268, -154, 1351, -7719, -3253, 9099, 1252, -7786, 5770, 10241, -9090, -11440, 7470, 5893, -8462, -158, 11328, 206, -7757, 292, -193, -5583, 3200, 7677, -2748, -1788, 7575, -3133, -14355, 1753, 13093, -2153, -6587, 8705, 4977, -12183, -6235, 7276, 1632, -2320, 5651, 2158, -6673, -59, 3317, -7064, -2949, 11744]
1270A1744q520j4093J2135R217j6772n182J7841J473j3512M771Q876r616n390
1283g028Q223j702m447J1327L415j5462r71J3142p442j2022J5506J3194j5726
1296Gr162J2252n40j1955O838J1151o511l762N935o145p442J1305N574j2947J023
1311d379J5146p000j5686J0219J1869j3061o747J4319K623j0890K841N542q772
1324c976k127R523k451n314J1171K965j7835k864J6332j869j1933J0807J1504
1337A3933j4476j0684J0449L008o768O454O529r212l147P258n728p001J3176P156
1351A0947j5192l144J5195l071j5025P150J2023r464o617J0791J982q614K688
1364c51L146q732R33J1919l386q735R023M265j6430l724J7676K631j2148M083
$$ y = [11744, 3224, -10869, 1266, 10483, -6289, -11471, 6370, 7843, -5669, -898, 7978, -1638, -7028, 1195, -507, -4954, 6373, 9788, -5674, -6645, 6497, -945, -12967, 2539, 15733, 7, -9155, 3097, 2557, -9398, -2560, 8591, 2080, -1682, 4253, -1892, -9334, 1971, 7545, -5402, -4379, 10767, 3767, -11919, -1700, 10169, -2892, -9639, 4680, 7303, -3587, -746, 4796, -3976, -6103, 3420, 969, -4345, 6826, 9791, -8044, -10908, 5424, 3555, -8378, 2429, 13933, -543, -11227, -778, 2230, -4538, 1916, 8445, -767, -3914, 3344, -2384, -9385, 3791, 10947, -4245, -7389, 7806, 4735, -10290, -3140, 8883, -581, -7198, 3593, 5575, -3039, -351, 2795, -5937, -5004, 6915, 3529, -5206, 3817, 8082, -8348, -12072, 5604, 8235, -3913, 170]
1378A70Q208j0733p946R586M216m244M736K193j0838j552J0108l617p911J0991
1392C367P750j4342n890J3681Q02j2496L712J0041n942m903P422k03p065L734
1406c32K772q136K398J2594m570j2064O641O754j1884l394J5552L193j1993j69
1420b638N554o348k925Q825J576m777M109P16j0959rJ2382k025r668P380Q095
1435I288j1132o929J0609L044q906J547P188l658l176M702k246n742N493M120
1449D202p519N92J0858l832j2763M303R407o178m314R888K562r663j730M271k550
1464b466K18O926j402n937M043J986r434l89J2173j56j0132L450P609p146o483
1479g140P141L646n090J122L878l844j677M003l081m665O960N210p794k441Q476
$$ y = [170, 8378, -2355, -10301, -715, 3501, -743, 3993, 6186, -4652, -6204, 3904, 287, -7624, 3367, 11117, -3225, -9115, 4566, 5368, -7128, -3416, 6625, 683, -4220, 3202, 2999, -4066, -332, 2440, -5696, -3298, 9296, 4726, -7338, -697, 6057, -5827, -9221, 6331, 9524, -2469, -2638, 2916, -3432, -6357, 2468, 4044, -733, 3376, 4092, -6867, -6876, 5506, 3481, -6187, 1193, 9288, -1844, -8773, 1836, 4880, -4026, -2479, 4709, 1051, -2125, 2577, 331, -5411, 82, 4202, -3317, -2725, 8133, 4301, -8462, -4159, 5248, -930, -5244, 4644, 7206, -2457, -4187, 84, -2466, -2248, 4678, 3276, -2661, 1382, 3368, -6066, -6455, 5718, 5562, -4570, -1120, 6489, -657, -7140, 1, 3647, -1443, -321, 3557, -287, -1964, 2039, -1042, -5707, 1253, 6463, -1331, -3772, 4704]
1494D704j698j0313K939R458k582m792M309R90n885k37L201j452J486N197l393
1509A932o495L989L814o898j484R807J417q791r5N811l160m416M189L077k187
1524E10P63P64m320m06M599k088m000N948M886p205m550O185J260o343J357O797
1540D157r98m114P82j92k350K007K175k266J166M252l669o387L550N241m138k566
1556c350O296J962o359k039L546j09j462K181J084j153Q43p15m235N73N379o24
1572A818m144L065L962m934m815L883L412k580m80L009k51k456o89p04kL200J325
1589B619l086j36L333k275n128K375N437j415l184K307J671l320k140J611J495
1604A64R21P77j292j312J318l83l351Q60N120K71m173J73K789j992l294J866L446
$$ y = [4704, 3006, -7307, -4368, 5090, 2508, -2284, 2025, 3015, -2870, -3107, 94, -1358, 128, 5325, 1932, -4563, -574, 3240, -3658, -5142, 4665, 6082, -2709, -2804, 3007, -153, -4569, -380, 2697, 510, 1273, 2037, -2283, -2689, 1910, -178, -4178, 1770, 6656, -549, -5099, 1086, 2346, -3997, -2640, 4157, 3159, -955, -173, -365, -2715, -708, 1467, -799, 367, 4619, 950, -5437, -1887, 3354, -784, -3350, 2946, 4908, -1451, -3490, 56, -53, -1515, 666, 1750, 597, 1440, 725, -3510, -2937, 2442, 1818, -2326, 739, 4701, -233, -5048, -1165, 2247, -333, -813, 2196, 1945, -511, -1200, -1904, -1906, 1294, 2619, -467, -603, 2730, 455, -4673, -2298, 3139, 1724, -1460, 847, 2518, -802, -2942, -1331, 164, 1085, 1862, 570, -742, 576, 193, -3158, -2298, 2822, 3093, -1080, -907, 1882, -110, -3404, -1538, 1908]
1621A908L1j310m72m09k22k55j013P09L340P13l554j361K466j71l002R36M115
1638B449L96k973j010R48j37r49J14J562J863k15k719j381J720P46j824L32L343
1655B265O54l317j782J557Q62j106j0K022J292j364k473n42J619P61r89L02K246
1672A997K46k955j799J596J599o95m79J610J136j805k584J61K177O28j040L61
1688A54J664m58k730j082J799J614m11n72Q47P00j539k293L69K613Q72j503j26
1705h2J591o21k833m48K487J378q59m94O18k1j353j326N43K315J089j552j011
1722e79J283j4k608m57L100J514j764q72R86k87j612l38J252J526O06j110j434
1739h08N04O67j615p71K866J976k270j878J398M39j987j67K269J112p12q85p72
$$ y = [1908, 1939, 629, 157, -252, -474, -729, -1742, -1033, 2307, 3020, -534, -1895, 571, 400, -2602, -1666, 2449, 2845, -128, -1138, -190, -327, -1276, -1162, 400, 2263, 2048, -671, -2052, -332, 414, -1410, -1078, 2265, 2919, -398, -2180, -623, 239, -867, -877, 1145, 2437, 1073, -1400, -1942, -323, 438, -551, -249, 1997, 2243, -712, -2511, -915, 684, -11, -490, 1120, 2256, 451, -2133, -1972, 205, 833, -207, 154, 1818, 1360, -1370, -2452, -653, 961, 550, -22, 825, 1525, -14, -2307, -1938, 675, 1547, 44, -82, 1509, 888, -1945, -2393, 94, 1472, 613, 119, 737, 716, -637, -1963, -1420, 895, 1984, 432, -579, 704, 690, -1918, -2375, 725, 2239, 475, -397, 589, 302, -1310, -1648, -396, 1130, 1736, 626, -808, -304, 363, -1252, -2023, 843, 2819, 549, -1329, 69, 508, -1479, -1646, 623, 1735, 1023, 138, -634]
1756f34k09O00k16n94J711K005j847k760J110J705j674r17K712J496j994j462
1772i68M36J1j85N63L24M81J055r52k658K51K462m98j705J965K159k300k544J232
1790h71J215q67J65J361N9n20m61j421l77K132Q35j734L81K270j448l272R81K734
1808A162p16j185J630P62j778j007L10K9Q57J283p99r56J262p4k799k9L329L77
1826A658k361O14J830j697k137J130J438j76L17L61j027l13M86j217o67K597J505
1843B341k401j014K049m61k720Q13K836k06j351M99m2j192J01N08l57J031J555
1860A989j500k028J404J073k220l88L096O27k487k63J320r28j096J113Q71r6N65
1877A052l03j866l9J593o76j062K225J586k559j838J715N94j572O01K040l13j315
$$ y = [-634, -843, -243, -459, -1053, 658, 2663, 816, -1944, -834, 871, -803, -1720, 992, 2488, 494, -968, -532, -521, -706, -143, 181, 662, 1717, 765, -1893, -1642, 820, 322, -1383, 582, 2741, 441, -2103, -871, 344, -523, -358, 1003, 1062, 542, 81, -1340, -1717, 415, 1250, -484, -103, 2167, 719, -2553, -1572, 1162, 446, -739, 891, 1653, -125, -1132, -822, -793, 64, 1347, 548, -408, 854, 780, -2019, -2048, 1281, 1658, -703, -89, 1741, 44, -2093, -963, 475, 299, 616, 977, -50, -363, 123, -1094, -1761, 836, 2341, -60, -1074, 975, 514, -2206, -1393, 1443, 1237, -114, 385, 343, -849, -748, -240, -597, 434, 1989, 489, -1539, -135, 938, -1282, -1670, 1426, 2053, -434, -697, 623, -305, -1401, -288, 583, 487, 1052, 749, -1117, -1156, 437, -239, -1301, 924, 2510, -49, -1887, -172, 422, -1150, -549, 1491, 1178, -137]
1894a37j13l67m68J146O92j001L60J477j337k249J318J887j394r14K069O46j976
1911c61n81Q59l13k05J031J76l97O77l99k119J15K323j3j376J216J189k193j772
1929b143J516J229n43L21P14q62q46K00l61k2J659N48j734l51J505o04j828R97
1947f05J867q45j094J044N19j164m41L87r8M38R56l70q33N46j21j693J74K414
1965A081M72j587m0O61j234j014J302J333j11k02m04j043j12Q60j02j54J277K94
1983A277j871o23J484J74j225M21J244m29p84L75J61n22mR5j70P64Q99q63j224
2002h21M72L94r33K72J872K93j618p36L33j22L4R52N91k50m42p91p39O23J234
2021F18r4n63N16J64j258n14J161N73o61j21N18l5l58r1j47l3L52M5k10N59N14
$$ y = [-137, -250, -617, -1085, 61, 753, -248, 112, 1589, 252, -1997, -679, 1208, -186, -1100, 969, 1615, -361, -942, -83, -396, -601, 430, 606, 209, 886, 487, -1632, -1517, 806, 793, -583, 633, 1822, -371, -2143, -627, 602, 59, 380, 1094, 232, -614, -414, -775, -797, 862, 1410, -324, -675, 830, 226, -1602, -605, 1262, 417, -677, 367, 886, -278, -719, -332, -430, 8, 964, 594, -239, 307, 186, -1507, -1333, 1081, 1553, -34, -74, 587, -647, -1661, -359, 974, 863, 661, 257, -786, -898, -38, -140, -294, 983, 1277, -594, -1217, 267, 441, -784, -363, 881, 452, -332, 43, 204, -318, -322, -227, -397, 367, 1266, 403, -821, -349, 45, -888, -616, 1256, 1549, -69, -805, -472, -594, -560, 392, 983, 733, 291, -500, -1239, -616, 618, 524, -39, 477, 641, -617, -1131, 30, 603, -58, -179, 339, 304, -54, -145, -292, -325, 27, 72, -138, 421, 935]
2042I35r41j103M75Q23j34P8P55j05j174o21K96N87O45L06l66m31j67m75l42Q70
2062h9J060l04q03N8J67n13j89O25M56j58k61r2J7N3k06l14K85O19k3l81J22J25
2084B54n73n23M86Q04J84k50k46k80k96j60K23O84N95k92p92k68J75q2J8O15N06
2105G82l25o20j94P9Q1J04J58K15J68k31n24m4L40o5k39L79N30k23n24p8Qj02
2127c25R3L71K71Q0k70o03k22L95K52m6L24L68m61p49qL91R5J38L32j4l14k51
2149a53k23n2M20L64j81q5K60k35o34M5N55O5j38K84J36m42l21M5K5J73M15N3
2171C76k88k5m7m78j06O65L39k95k0J75l97m61K50L88M0J44J66l51l39Q8l3j20
2193c29M28M61k97l76J56p9m54J80N89L8j89R9j21m61lL10K0J05L90j26n48m5
$$ y = [935, -6, -1109, -634, 189, 55, 133, 888, 783, -391, -1012, -716, -129, 516, 822, 456, 25, -142, -617, -959, -89, 971, 667, -136, -78, 89, -424, -613, 12, 468, 310, 49, -43, -26, 27, -179, -493, -208, 411, 388, 7, 129, 254, -319, -842, -356, 448, 632, 382, 136, -144, -440, -600, -377, 307, 902, 610, -182, -450, -275, -357, -339, 276, 782, 457, -163, -357, -278, -197, -93, 65, 280, 448, 217, -307, -351, -11, -76, -315, 64, 594, 371, -153, -231, -223, -325, -232, 139, 410, 490, 220, -383, -605, -210, 42, -4, 320, 688, 227, -522, -530, -139, -44, 94, 426, 412, 98, -153, -376, -428, -8, 356, 175, 90, 350, 115, -519, -474, 81, 146, 8, 292, 428, -14, -335, -290, -265, -92, 323, 376, 88, 63, 16, -462, -568, 97, 436, 141, 121, 296, -101, -562, -312, 76, 116, 260, 426, 75, -264, -176, -209, -329, 99, 560, 263, -113, 43, -36, -490, -310, 279, 317, 128, 227, 106, -355, -358, -48, -28, 77, 467, 341, -207, -252]
2215b52J79j96jN71J73m10j37P1k78j57M25K82j33O2N7m28k81L06J77r7K57K92
2237D82l52m07J18N1j55K63M23j44k73L3j20l13J71M37J2j15J34j23m30k1K84
2258d5L4O1K85m7l92j13J17j29K1M11J68k69j26J8k15j31K70K61nJ1k0k71j86
2281b92J25J17KK29J97k56l01J9N9p3J24L15N9k17j52r1n6M9J58J08Q8K7k01k64
2305b27pJ65N9K5J84J00k19k98l1J59P6J3J50J20j44k68j21J06J27R2P6K4kj47
2329A2k47n6K51K14j07j2J79r6m10n4L49J07q5Q8R4j76j94m3J1J57K64m5k35Q2
2353D8R5l80j99N01K86l29r8K92j37m22J01K73J4O6J27k41j75K13j00l19L45N56
2375E17l51m74L73J85n77q5O34J09l53P1J03l29l3K71j47m0N24l4p11P2O08l76
$$ y = [-252, -73, -269, -270, 301, 474, 64, -73, -2, -280, -437, -12, 270, 137, 199, 256, -172, -453, -147, 30, -67, 190, 482, 130, -277, -159, -108, -263, 0, 423, 279, 6, 39, -81, -394, -223, 214, 226, 111, 245, 122, -308, -329, -45, -11, 50, 335, 288, -104, -217, -100, -229, -208, 203, 371, 102, -24, -6, -221, -352, -82, 179, 174, 185, 165, -106, -292, -167, -50, -48, 181, 378, 122, -179, -160, -101, -174, -50, 265, 324, 107, -45, -136, -192, -143, 15, 123, 211, 238, 37, -227, -234, -69, -10, 15, 199, 299, 80, -218, -249, -90, -14, -1, 149, 269, 125, -143, -264, -158, -31, 61, 137, 161, 159, 12, -235, -291, -40, 174, 67, 55, 234, 138, -272, -326, 23, 130, 45, 133, 227, 51, -143, -186, -175, -18, 246, 201, -34, 48, 143, -237, -436, 65, 351, 22, -76, 216, 79, -343, -242, 31, 45, 111, 238, -3, -178, 35, -65, -384, -39, 517, 166, -308, 65, 250, -327, -412, 222, 331, -22, 49, 152, -177, -210, 61, -86, -126, 398, 364, -347, -275, 333, -43]
2397d3n04O69N19o56l24N02q7m49K89L40k78Q1K97n06l84O60J78p36K43R05m67
2418B49r09N22N64o64j92Q02Jn70K20J27n34J75O55m31m23Q31J44j131j5J125
2438E46k89q76O90O90q37m41O86q9m78N32K93o73J35O59p00o75J058N00j164k6
2458d59J227m25j196O16Q31p38k43Q28j86o91N18K00q56L09J076o88r17J088N12
2477H06j449j57J489j74j181O30P82r44l57Q74k18n94Q42K77j176J72J172q02
2495hj062J316Q43j498l56J458k62j314O65R13q43k15R05m45q15R29L56j292K77
2514d48J512p86j400J194R54j549m30J646o3j306N81P69j021k01J100m40q13J157
2532D56M13j637O1J693o93j490J308J157j583o38J520p6j292O92Q67j017j45J106
$$ y = [-43, -547, 122, 641, -15, -339, 163, 76, -373, -84, 256, -22, 59, 356, -150, -534, 126, 304, -432, -189, 716, 249, -660, -138, 426, -238, -430, 372, 373, -197, 23, 150, -384, -209, 446, 15, -408, 423, 567, -564, -579, 546, 257, -619, 71, 761, -76, -517, 169, 80, -398, 134, 427, -246, -111, 548, -152, -827, 231, 731, -433, -459, 768, 343, -853, -237, 594, -144, -387, 441, 255, -436, 82, 282, -574, -265, 811, 123, -794, 294, 806, -643, -800, 689, 515, -666, -36, 746, -198, -555, 319, 101, -493, 349, 626, -550, -378, 794, -8, -1070, 246, 1089, -409, -765, 693, 431, -883, -218, 695, -148, -363, 542, 97, -718, 211, 567, -725, -448, 1064, 278, -1122, 72, 1026, -523, -953, 693, 630, -676, -95, 674, -347, -548, 552, 112, -701, 456, 869, -768, -707, 986, 293, -1197, 111, 1268, -315, -953, 567, 491, -801, -109, 758, -259, -404, 702]
2550G02o74j013J295O14j694L4J894o59j778J147J276j490o01J588k2j289O26
2567d4O98j185mJ353o67j115J392O70j952j60K070m32j798J112J332j522p36J485
2585D97j2j195Q00P03j297kJ433q13j323J519R25j956l06K123l73j960R35J391
2603A089j331o44J495r1j236P79O07j393J21J719q00j516J457J008k043m39K235
2620A017j53j901P86J316j308o29J423j41j126R48O05j561O2J801q17j691J497
2637A28J258j945o19K124q0j927O53J333j115m87J370l19j233R95O28j603J17
2654g22K019p69j916J314J372j842o88K085R7j826N14J167j073l95J356l76j182
2671h65J123O80j736k0K051o76j977J281J533j680q29J847O9j693N27J131r69
$$ y = [702, 28, -985, 310, 924, -770, -736, 1158, 499, -1279, -132, 1144, -346, -947, 641, 619, -670, -44, 654, -531, -535, 818, 151, -964, 428, 1098, -854, -1014, 1056, 624, -1174, -62, 1270, -252, -988, 497, 485, -710, 90, 793, -504, -506, 927, 114, -1209, 310, 1235, -721, -1027, 1096, 723, -1237, -302, 1089, -242, -886, 609, 518, -718, 61, 668, -725, -604, 1115, 315, -1201, 256, 1264, -779, -1218, 1017, 864, -1037, -251, 1065, -243, -872, 551, 410, -716, 232, 837, -724, -662, 1139, 322, -1369, 128, 1386, -559, -1178, 946, 866, -1061, -408, 925, -190, -677, 693, 374, -859, 136, 764, -839, -722, 1297, 528, -1388, -74, 1298, -544, -1232, 853, 950, -876, -362, 805, -268, -663, 693, 317, -865, 258, 938, -798, -818, 1233, 557, -1420, -139, 1394, -286, -1115, 732, 801, -892, -365, 766, -203]
2688b03k68J288o11j285J252Q17j756n1K104o03k109J076J598j482q11J712J11
2705G79j551M84R28j001j23J336o57j276J349Q54j854k41K114m46k013R98J626
2722A306j343r14J433P9j298N86Q63j010r0J270p88j347J430J034j784l71J995
2739A051l18k007P82J583j061q31J244N5j158N89O66j077N3J370p61j370J368
2756A78J072j804n45J951p4j811O44J418r79q00J025J8q97P43N76j175NJ364p66
2775A43j401J373J224j671p10J744L6j672M58J314p20o50Q69j32q20P50M80j211
2793e96R3J476o69j487J157J212j524p53J623K71j422K66J014o69m90P61j62o21
2811e20Q55L82j354L8J465n60j428J083J263j329q67J315K84j152J97Q44m80k74
$$ y = [-203, -471, 817, 206, -1079, 173, 990, -766, -817, 1287, 684, -1425, -349, 1249, -233, -1044, 668, 779, -772, -288, 640, -361, -484, 852, 195, -1081, 268, 1122, -732, -973, 1141, 695, -1318, -320, 1306, -37, -951, 482, 561, -737, -151, 712, -298, -388, 882, 94, -1253, 177, 1211, -573, -944, 1051, 733, -1274, -492, 1091, 30, -801, 443, 498, -660, -71, 595, -482, -429, 941, 180, -1190, 178, 1250, -554, -1099, 852, 778, -1033, -389, 1029, 50, -750, 275, 293, -604, 139, 715, -460, -455, 909, 143, -1258, 115, 1339, -332, -1042, 702, 738, -934, -476, 838, 118, -532, 337, 205, -615, 135, 615, -596, -503, 973, 304, -1183, -26, 1186, -338, -1091, 532, 803, -619, -353, 661, -8, -498, 263, 101, -520, 335, 717, -637, -599, 866, 306, -1122, -39, 1224, -105, -972, 343, 627, -525, -328, 516, 36, -238]
2829b38O03l94o06R23L77j279M9J491m79j510P98J218j023q07J130L92r41J5N38
2848B57m27o4O19l91n35R13L20j326q6J458k20j351N99J142p96q78P78L94n84
2867a78P7L60l61L9M79n51n28R60M49j183j73J294j50j313L38J083m36o77N07
2886C6L03m13oP6k92K73N51n67n58Q36M06j113k82J239J36j071P6Q41k43o32K29
2907a75L03m9Q8q1l77K70M66n78n08Q40N53r38m30Q97K33q65j18P28J01m13q8
2928a41Q4P9J06j95k86M25N02n59o09N95N21o80m30P33M17n87l86L60K58j90k30
2949b13O1L37J79l83m15L68M80m06m70M93N54m78n93L21N12k20m19J74M60k2n05
2970a85j90M02K94l38l03L60M09l60n40K03N39o5m94N4N39J9o29j98N95K84m86
$$ y = [-238, 365, -29, -635, 288, 665, -614, -565, 926, 447, -1063, -265, 953, -70, -877, 253, 645, -296, -281, 257, -170, -234, 385, -6, -541, 372, 692, -634, -720, 738, 518, -833, -234, 908, 112, -766, 12, 406, -178, -101, 259, -102, -63, 416, -135, -663, 297, 746, -437, -610, 684, 534, -779, -441, 642, 206, -471, 36, 339, -74, -80, -4, -296, -23, 528, -39, -597, 239, 645, -468, -750, 489, 625, -446, -370, 471, 228, -404, -175, 128, 79, 167, 86, -291, -21, 445, -133, -641, 199, 752, -186, -616, 281, 514, -351, -469, 259, 360, -53, -141, -57, 22, 128, -67, -353, 72, 574, 15, -594, 1, 522, -158, -588, 145, 562, -25, -411, -51, 207, 17, -213, -152, 185, 364, -19, -434, -66, 414, 8, -462, 31, 585, 107, -486, -165, 347, 127, -292, -118, 342, 320, -185, -375, 27, 321, -17, -320, 40, 449, 89, -451, -248, 291, 226, -268, -214, 325, 344, -285, -483, 112, 396, -90]
2991i0k58M89K70m75l75L02M02p2l53j4L94J03n37k97O08M45n62m22N98L55o61
3012a50l89N67L88l35k54J57J77l2k63k34L49N30l62o37M18O27o22o53P08O70
3032F60o19m76M86K38l94j47J58J31K46o4n39L4O98k07q70M61R93n30r40N68O81
3053E68o54m45O12K80k87o1o4j97L37K19o22o4J007p6j219J82J147m20r92O57
3073i2Q39o53n31M35Q5k60K39J1l41M62L80r30m11J161K28j250J41J318l92j210
3093g71M73Q24n54l27N65pl14L28j77o52N88P97r06o16J265L34j542j09J454j47
3113E06j131M98P77o49l97M92j80j98P05q5r30N03R20j062q66J429O77j489k38
3132g18J421k26j241M40P88n32j11N74m43l86Q32j15j143O38J345r87j176J290
$$ y = [-90, -348, 141, 411, -64, -439, -137, 265, 193, -160, -174, 220, 323, -214, -511, 97, 542, -20, -442, 156, 511, -150, -539, 28, 416, 81, -173, -16, 161, 129, -134, -368, -19, 511, 149, -488, -70, 557, -65, -718, -10, 660, 41, -435, 51, 289, -105, -252, -94, 37, 283, 219, -320, -286, 412, 205, -665, -204, 789, 259, -681, -113, 568, -86, -531, 81, 361, 74, 13, -51, -248, 89, 308, -314, -378, 629, 553, -666, -484, 663, 243, -749, -92, 747, 94, -437, -2, 83, -177, 62, 73, -268, 194, 574, -356, -767, 394, 622, -628, -487, 831, 439, -771, -298, 526, -28, -355, 210, 203, -111, 217, 40, -612, -24, 773, -133, -749, 516, 850, -692, -801, 653, 506, -625, -127, 650, 1, -396, 96, -84, -282, 423, 338, -592, -89, 831, -231, -1097, 332, 1009, -480, -718, 703, 477, -764, -324, 464, -68, -179, 395, -48, -434, 398, 283, -860, -222, 1123, 136, -1040, 250]
3150B50P24j555l34J539Oj118M01N65p42o9O91m89l65J145k5j504L94J492r11
3169I5j311J380J021j485n52J340n4j090N10O11o83J16P40q23o42J271J89j549
3187i16M16J767q62j634J114J085j346m50J417J8j038M09L37q61L01J023q29p23
3205g72J404K40j865J76J918o26j585J082J146j341o01J215r2q47O61L64r63L62
3223a24J033j116r67J577N95j804Q8J931o49j820Q93J235j065l62J189k48r60
3240e74O36K41j071N67J397j119j227J518O59j909r5K068l65j715P75J101j084
3257a97m23J068l02p56R44K61j308M05J421j205j336J689J021j816l35J814l96
3274E49j719P39J214q18k37R16o21q97J056L47j314N36J630j183j654J486J135
$$ y = [250, 974, -581, -915, 624, 630, -488, -87, 478, -264, -333, 358, -131, -496, 649, 624, -880, -486, 1006, 95, -1216, 164, 1185, -300, -852, 488, 434, -656, -146, 465, -218, -102, 638, -185, -827, 444, 633, -916, -500, 1267, 405, -1229, -115, 970, -376, -826, 591, 609, -429, -20, 317, -544, -243, 780, -49, -772, 632, 872, -993, -817, 1101, 475, -1110, -28, 1118, -223, -824, 391, 299, -548, 113, 477, -486, -124, 909, -207, -1174, 403, 998, -806, -718, 1213, 564, -1256, -363, 872, -193, -555, 634, 386, -574, 62, 303, -768, -201, 1196, 77, -1150, 368, 1027, -882, -977, 1091, 726, -989, -214, 887, -197, -620, 448, 146, -610, 334, 595, -713, -308, 1113, -92, -1428, 261, 1282, -534, -869, 945, 549, -1170, -431, 783, -35, -272, 644, 23, -874, 182, 529, -785, -249, 1381, 198, -1456, 30, 1165]
3291A165j705m02J852j77j606N79R55q69j77R75n94p65J273L20j651K74J685j001
3309A31j574J569J315j686p05J500j64j333P65R66q38j19P84r14q10J499N41j626
3327f99K24J717j030j757J387J392j412o21J419j27j232O06O72q97J24R75q56
3344a15q06J493M27j871L2J861o29j596J254J260j446q08J186Kq26P78N21j048
3362c31L7R13r59q15J699O93j850k02J738n66j641J054J350j100o83J012j24q33
3380f08O96L88j010K89J167r58j015J470O56j842k36J884k04j513P13J043j092
3397a72n90R55mn09P75J35j266K12J199q39r46J540P83j805m99J616j12j333O62
3416a98J026p85m75O74k67n25Q40K08j159L80J300r28j249J274Q97j508m21J608
$$ y = [1165, -540, -942, 910, 733, -873, -294, 661, -208, -385, 590, -4, -769, 504, 824, -827, -553, 1132, 131, -1443, 126, 1441, -245, -950, 550, 386, -947, -182, 784, -54, -173, 611, -303, -1113, 386, 927, -699, -475, 1242, 212, -1545, -158, 1234, -178, -799, 620, 493, -739, -133, 539, -358, -234, 741, -115, -921, 572, 999, -872, -840, 1021, 392, -1204, 50, 1310, -136, -944, 242, 244, -582, 196, 717, -331, -294, 619, -340, -1155, 544, 1237, -613, -815, 923, 357, -1284, -230, 1120, 20, -663, 349, 225, -608, 88, 476, -534, -245, 922, -36, -1051, 419, 1075, -767, -1003, 881, 677, -836, -123, 920, -172, -762, 193, 189, -320, 455, 590, -676, -464, 735, -104, -1050, 490, 1273, -532, -1031, 585, 473, -860, -198, 828, 43, -432, 242, -25, -550, 290, 498, -661, -281, 1019, 91, -1158, 116, 1013, -495, -916, 692]
3434F92N9j307K71P34o52k06P73k29m47Q06j9j343L24J445o51j163J147Q76j472
3453c62o31J311J86r39L31O02n67j62M89m74l70J029J74j251K42J320p27j308
3471a107R61J053j016n49J059J32r05R4M08l37J60N93n66m72Q63R1j268K41J463
3490H98m00j239O41Q91r30o17Q47L43n10J24J61m53J09M57n78l37J068K81j270
3509e14p4J198l10j151N71J015n26o02M33J27m05J45J21k52L65M76p59n52R16
3528B22L20j050l9J244q7j126J47P39l08m46L84K32j20Q7j86m60L73N32n65m13
3548e20R08L53j093l56R69J49p84J01O98j08m73l4L4O8K64j05l32L81M23p02n78
3569g37P49N66o95l44P93K02p56k53M60K03j31n3j2J18J56l87m17M67O19m15n43
$$ y = [692, 751, -556, -285, 449, -203, -409, 364, 135, -312, 494, 475, -868, -544, 901, 250, -913, 234, 1110, -362, -993, 318, 504, -435, -104, 498, -69, -231, 258, -216, -586, 443, 617, -634, -392, 928, 201, -1107, -146, 907, -109, -658, 401, 533, -372, -278, 130, -207, -47, 546, -20, -492, 371, 462, -806, -565, 898, 498, -741, -100, 791, -139, -756, 91, 434, -76, 48, 209, -244, -135, 322, -256, -593, 475, 756, -514, -588, 610, 300, -851, -280, 735, 209, -393, 40, 167, -238, -93, 28, -224, 141, 617, -142, -694, 222, 542, -508, -547, 697, 610, -516, -369, 370, 62, -384, 0, 232, 112, 199, 13, -447, -74, 458, -107, -520, 388, 741, -352, -708, 261, 410, -374, -273, 425, 317, -156, -190, -156, -88, 176, 71, -261, 120, 543, -159, -737, 12, 578, -117, -461, 332, 534, -222, -475, -15, 188, 57, 4, -8, 110, 266, -121, -538, -71, 548, 133, -410]
3590d10N05M36o53n03N65N07l15l20J98K01j43l15r7L70L86k53m73K67M11m05
3610d1n47M44O51k48n48J60L89j99m49R5N09K02l79k97K39K42k84l52L52N59j80
3631C18n70J2M35m7m75M4O13J79n63l15L80K39l81k39M51L89k89m67M7L37J8l22
3653b06k8M98K18n50m54M46M18m37l27N74L93n08m73K61L18j10j80J01K67J00
3673C21l67m31K93N72k59n29M51N89n79o86M48N58l22k99L37K23k20k52j45J20
3693a77M32K0n10R8O45l21q96L34R32l16o69M16N06n11m29K73K42L3Q4j77k00
3714a91L67P7p50k8J033O8r96J27Q73m03q56M15P16k78k74K06p5j28J67k08k78
3735d16O79M45q86m29R58J12j107J09J177j39r10K47M71m22k02L27m0M3M41l59
$$ y = [-410, 95, 531, -122, -625, -60, 447, 132, -188, 10, 211, 68, -247, -344, 26, 412, 159, -314, -47, 364, -41, -588, -144, 507, 259, -289, -129, 260, 61, -388, -293, 216, 418, 39, -258, -19, 223, -61, -413, -61, 498, 318, -252, -240, 195, 148, -327, -283, 330, 509, -54, -369, 11, 250, -131, -370, 81, 470, 181, -286, -239, 98, 116, -206, -234, 264, 482, -68, -522, -76, 342, -95, -422, 152, 545, 37, -436, -175, 143, 33, -147, -46, 221, 321, -46, -477, -184, 388, 129, -400, 51, 640, 61, -625, -177, 381, 59, -240, 97, 320, 100, -152, -297, -177, 255, 275, -235, -137, 508, 187, -709, -375, 557, 241, -428, -12, 494, -17, -446, -173, 69, 102, 186, 9, -191, 176, 253, -497, -525, 508, 576, -420, -293, 580, 177, -679, -264, 452, 174, -100, 106, 31, -97, 70, -138, -416, 263, 708, -178, -607, 351, 463, -644, -535, 642, 503, -407, -160, 311, -111, -313, 14, -26, 17, 458, 99]
3755I9p21N38O55q45m78J236L66j277k01J030j48q26M17O10l32j36J83m25j10
3774c65P06j53p54O54Q67j050q79J111N71j131j20J170j10r15J87L44l76J57M55
3793C69m56j62Q02l03j164N86J188p89r09J134O01j284l85J043Po61M24L41n20
3812a38J14L56p47k01J194J0j257M45J217r48j181J098Q99j014k99R62j85p96
3830d71L48K31m55M64O11q81n08J131K2j426M27J543o58j249Q81P66j090l69R55
3849B72k3n25N23P2p96L54O84r25m89J465L24j582N0J425o22j271R28J037q50
3868E1m03O88l10n85O58K12p42N20Q72j130q95J367N35j519M7J603m31j380O11
3887b31Q35p99k65P93k16m63P39rj127M41J098r30q59J493O48j675l75J437k12
$$ y = [99, -622, -84, 571, -274, -752, 484, 850, -427, -628, 402, 254, -572, -155, 455, 123, -13, 170, -255, -365, 341, 188, -566, 88, 955, -95, -974, 137, 708, -423, -543, 627, 517, -398, -211, 133, -243, -86, 369, -87, -249, 553, 250, -914, -328, 860, 71, -838, 296, 897, -387, -772, 271, 278, -383, 41, 382, -138, -24, 332, -415, -616, 578, 588, -669, -224, 993, 45, -1136, -38, 861, -153, -452, 510, 325, -471, -123, 108, -347, 117, 728, -153, -661, 470, 492, -934, -507, 1036, 378, -871, 10, 776, -314, -683, 272, 249, -276, 247, 319, -477, -123, 561, -364, -853, 612, 936, -646, -596, 829, 207, -1064, -136, 901, 51, -352, 336, 26, -559, 99, 311, -431, 89, 961, -169, -1064, 303, 838, -681, -634, 969, 538, -842, -231, 604, -195, -460, 333, 117, -346, 393, 384, -743, -302, 796, -134, -993, 500, 1148, -527, -902, 535, 323]
3906C23j125P50Q82p98l48N16m63l62J064J91j154L64J114j105j117J455Q98j417
3924c32l59J367k30j178N23P05o56o8O92n25m63J018Rj391L93J436p88j124J281
3943C10P88j564n36J322P1q33N73M98q55j50O17n62k97J324J78j563J18J366p39
3962F6j194J251J034j286o01J082n5q33N07M49o92J48P38p33n79J188J84j528
3980h54J90J643n16j327Q61Q42j207n15J147J76o11M05J16r38J79R01o12n03J290
3999F67K62j709j08J557l02j178Q28R36j019n98Q22J0n35N50K07q33L15Q82q31
4018g7q21J213M94j445p4J582k13j388M33Q26p29l07Q65Jn41M13o6r49M27J157
4038H01o36q71J077M64j513k89J512N5j098L92O97o92l79O15j25l34O85Q0r85
$$ y = [323, -802, -52, 830, 32, -316, 200, -263, -625, 439, 630, -524, -160, 954, -151, -1268, 187, 1085, -332, -691, 676, 446, -732, -209, 496, -160, -228, 464, -61, -524, 494, 503, -888, -495, 941, 153, -971, 310, 1098, -466, -1002, 320, 391, -442, 131, 629, -226, -376, 241, -321, -618, 706, 884, -679, -561, 805, 66, -1128, 123, 1157, -129, -730, 352, 297, -536, -29, 420, -272, -124, 614, -119, -698, 490, 674, -854, -664, 979, 463, -864, -3, 839, -368, -883, 264, 440, -171, 234, 350, -588, -409, 492, -120, -623, 667, 929, -780, -888, 669, 367, -811, 17, 953, -66, -664, 158, 168, -367, 183, 390, -443, -128, 754, -77, -898, 315, 809, -636, -710, 872, 659, -729, -296, 530, -199, -506, 359, 360, -181, 232, 166, -783, -356, 801, 165, -706, 371, 835, -678, -967, 545, 600, -498, -106, 591, -101, -480, 135, 10, -324, 361, 441, -544]
4057e44K98J049p97r80J083P99j190l69J245l9j154K15P01l67p7N62l29m93N83
4076A96K0r57M28J270o17j156P96P27j105m14J198K35q57R3M00m50p4M94l19k68
4096c60Q01Q6j115J21J131m94j048Q30R61q79o13P75J32p00J46M66k34Q1L51n70
4116a32m65P99K44r66J76J197m21j199M56Q64o16m62P39K35n31j4J19l42K02N03
4136C86m35l65P98J79j115q9J140j22r54M38Q13n26o29L87J96k39J91J50l12J66
4156E8L37o33m39Q83M32q99j53R61j48r84J69P76j68l66K64R1k45O8q5l05L91
4177EN49n27n07O61L10r24k11R43K13p20j1N10j82l86J01J37Q5K55j41m60K26
4198g4M23m89m49P31N34o94m31O00J74o15p1N11J36j70j06j25J4K19j35l33L96
$$ y = [-544, -246, 803, 6, -974, 109, 908, -282, -651, 594, 555, -599, -384, 317, -50, -127, 435, 106, -387, 196, 216, -741, -313, 957, 340, -816, -20, 707, -398, -812, 386, 621, -236, -143, 257, -193, -267, 227, -92, -360, 441, 527, -588, -467, 664, 170, -878, -48, 913, 34, -579, 196, 328, -372, -226, 240, 6, 87, 438, -132, -597, 202, 446, -520, -344, 853, 432, -767, -311, 553, -63, -525, 214, 449, -82, -96, 23, -319, -117, 386, -49, -414, 384, 563, -552, -641, 499, 377, -577, -139, 674, 148, -481, -94, 102, -137, 54, 204, -108, 58, 395, -238, -677, 206, 638, -261, -414, 547, 399, -585, -416, 360, 192, -174, 90, 181, -64, 4, -81, -386, 5, 554, 27, -480, 181, 491, -433, -644, 299, 512, -208, -219, 291, 109, -277, -176, -39, 46, 301, 160, -300, -74, 349, -140, -589, 142, 676, -18, -449, 151, 325, -290, -361, 150, 286, 116, 10, -115, -101, 118, -17, -350, 46]
4219D6N30m41o33L97M76m88l62N85L77m11l34J44J32l9n6n9K11K99k70n30J89
4240b37N27k17m46L85N22l93n30J86L72r9k17J08K63M6k94l07J53M09q4l72J96
4261b9M46k35n92R0N34J2l80L9L78mm52j86L11L02j37k67J71L02k19m78Q8M94
4283A88R0l87m2L41M1m55k01M21L59k58k99K25K58k97l57K02M30Ol09p6K32M8
4305A60l22k00L75M10k68m34K24L47l11m19L29M93j65l64L9J95m8k25m8K60L28
4326C56j67m63P5M24j60n03K86O34k11n96J35L80j80k74J65K91N5j54k60o1L29
4347A01O9m36P4O47n7p59nO30j02n02K39M79j54l48l6N5Q6J33j59j18M00J62o79
4370b80k48P03J96o58J1P21j08o87M7M10n5j18J29l3OJ60l00l88M69N08n39l65
$$ y = [46, 576, 135, -498, -101, 375, -113, -475, 110, 487, 76, -258, -114, 18, -21, -77, -136, 75, 374, 104, -426, -237, 290, 73, -373, 12, 534, 141, -389, -203, 169, 70, -147, -39, 224, 270, -24, -331, -178, 231, 147, -225, -29, 417, 182, -410, -320, 214, 226, -154, -115, 263, 259, -193, -379, -68, 234, 97, -170, 1, 303, 84, -394, -306, 188, 278, -109, -151, 190, 231, -224, -425, -4, 355, 97, -202, 23, 281, -16, -373, -171, 259, 265, -44, -120, 112, 160, -162, -362, 13, 423, 155, -279, -55, 292, -19, -438, -109, 384, 219, -145, -106, 89, 41, -184, -232, 28, 356, 189, -274, -199, 225, 65, -438, -152, 482, 271, -325, -190, 190, 10, -264, -99, 192, 247, 93, -167, -228, 101, 170, -266, -192, 455, 398, -361, -366, 264, 162, -340, -101, 378, 224, -124, -160, -105, -19, 114, -45, -163, 237, 399, -280, -528, 175, 371, -287, -276, 445, 337, -350, -303, 107, 52, -66, 63, 30, 36, 196, -104, -492, -23, 485, -54, -419]
4392d19O99K31q45k10P70J05n24J30L42k06j74N7j64R5M89j61n63L15N31o42n57
4413g01P93N16p16k60O36Mo02O6L51q2P2J53l52j19M74j28o65M16Q38n28p45O10
4435C1M65p47k75P34J66m58Q3J33k87P6K65l74p7P55n7r22J61Q61m67p49P24O63
4457G04o91m13N34%m02K18K12k58J90K81o14l07Q16J21q97K17R98m28r36M88O22
4478D55n71k77N99N7l76J95lm61K95N25n32l39Q65J51j106n8J061k00q06N06O43
4499F23o08m07M17j9k25M27Q4n61K40N04o82n15R72M23j010j32R95k03r22L58
4519b41O39m23k09M40j19l16L93j5o71L54Q11n74o69Q50L97j107k17J071O2p54
4539b98K65M71n41k37M19j13j57O13k5q73J97Q05n53o98R40N82j007l76Q94op39
$$ y = [-419, 280, 511, -334, -544, 226, 331, -193, -63, 279, 73, -101, -44, -208, -113, 376, 215, -348, -33, 498, -144, -701, 92, 608, -108, -368, 268, 272, -330, -264, 87, 5, 77, 230, -122, -241, 233, 105, -560, -144, 694, 166, -579, 31, 496, -251, -526, 208, 374, -84, -1, 132, -155, -79, 186, -188, -265, 490, 433, -489, -328, 533, 66, -683, 41, 704, 13, -400, 134, 134, -268, -50, 162, -96, 94, 375, -239, -546, 270, 391, -506, -289, 709, 281, -655, -167, 455, -116, -393, 206, 263, -113, 82, 79, -382, -87, 438, -94, -433, 432, 583, -523, -581, 480, 280, -526, -20, 623, 15, -392, 25, 6, -219, 208, 292, -269, -29, 475, -207, -722, 250, 673, -337, -469, 526, 323, -599, -241, 398, -25, -234, 206, 87, -229, 164, 149, -522, -168, 643, 69, -600, 250, 647, -460, -677, 394, 456, -298, -33, 438, -103, -340, 79, -34, -191, 422, 397, -476, -279, 526, -27, -725, 215, 797, -210, -586, 308, 302, -437]
4560d37K85M76l78r6M23l19l26O25L6q58K89J013n06r05O86N69r11l00R74J50
4580D90o63J34K32m73L4N54k74k84O83Qj058J26J074l13q50O61O32q69m35P57
4600A66J12n23K41K71m49Q4M83m68m42P63K08r39J06J082l30j031M59O74o08k74
4620d15P22P9n60J07J05m46K67O93m55n25O83J84j023RJ159j10r29L50N92n80
4640i3l57N94P0l67K68J06n19J87O09n33n93Q05M22r18j28R73j50r83K85O81l34
4661B5k05M41j03m41K69Q4m71L40P44n46p66O58M44q36j46R99L0q62J19N06l50
4682f7j79M37r1k81L87M8o45J73P39m62o89P10N96q06l36P37L5p09J77N43k24
4703I3j51K62k87l20M86J76n75J89P39m76q36N33O66o06l02P01J06o49L3L27j88
$$ y = [-437, -152, 324, -54, -150, 273, -46, -372, 253, 289, -569, -280, 733, 227, -678, 8, 577, -334, -634, 340, 490, -173, -39, 193, -280, -246, 308, 34, -250, 433, 441, -617, -491, 583, 270, -580, 81, 713, -156, -591, 166, 278, -245, -4, 267, -182, -98, 385, -83, -525, 238, 446, -493, -387, 695, 365, -666, -207, 467, -141, -415, 307, 386, -174, -67, 38, -408, -141, 552, 97, -428, 255, 439, -584, -575, 584, 474, -455, -105, 487, -93, -450, 144, 214, -153, 115, 221, -298, -111, 498, -35, -628, 177, 599, -319, -447, 526, 376, -607, -322, 359, 25, -180, 261, 158, -283, -14, 70, -401, -61, 683, 137, -629, 29, 473, -363, -509, 490, 520, -342, -223, 283, -67, -246, 191, 100, -181, 206, 254, -391, -218, 521, 59, -630, 80, 676, -130, -466, 271, 306, -403, -226, 317, 93, -58, 204, -83, -403, 83, 259, -316, -127, 612, 136, -700, -167, 499, -107, -409, 292, 398, -251, -218, 109, -79]
4724g9KL27k31k60M68R2p26P4Q11k60p06M65O14n97m54N14J65l79J11K83k22m5
4746c3K19l43k76O23K45o81j4P04k63p61L37O87l52l68L86R7l62L0J42j60J34
4767iL43l40l33M94J83o90m7P88k8o68J78M92l33l64L03J72j40J05K6l05R2L04
4789B23l20k81N65L12o61k24N95Qn79J35N39j28l11J12J2j30J43K2k13K12L46
4810C77l78m19M17L31n15j76O08J36n46o3L26o1j79J37O6j3J39j12l62J63L97
4831B73k28l42M15L25n03l36M24J90l13m2K93Mj67n6p3K4K44j0k97J43L52k92
4853B8m37K83M27k68k63L07J91l06j85J28J25N0rj04J3J75j06l39J35M40r6l76
4875a87J51L23k45l43J91L03p1j43K6M4J3r9j44Q7L10j6l33J5K93r9l60J11L72
$$ y = [-79, -77, 250, 19, -241, 227, 319, -407, -333, 478, 218, -488, -23, 591, -6, -460, 54, 219, -160, -49, 234, 12, -33, 186, -157, -433, 190, 435, -246, -260, 444, 181, -580, -243, 444, 92, -276, 110, 207, -155, -125, 17, -143, -9, 334, -6, -339, 155, 338, -352, -399, 389, 361, -307, -129, 363, 30, -334, -31, 141, 1, 106, 132, -173, -81, 223, -97, -378, 187, 499, -162, -386, 209, 217, -362, -227, 312, 184, -127, -15, -3, -133, 10, 32, -181, 31, 377, -1, -420, -3, 328, -187, -363, 245, 381, -165, -228, 98, 37, -142, -5, 61, 48, 187, 75, -287, -124, 273, 45, -297, 118, 443, -60, -396, 28, 218, -95, -137, 156, 160, -7, -63, -136, -112, 132, 122, -175, -32, 320, 28, -409, -126, 301, 33, -230, 77, 268, -38, -223, -95, 30, 80, 71, -33, -20, 155, 49, -290, -155, 285, 189, -187, -36, 287, 42, -301, -110, 193, 122, -21, 5, 49, 62, -37, -181, -94, 216, 200, -133, -118, 175, 76, -284, -173, 199]
4898A99jk99qJ67k5j59l8J69J81n9k35k1K15k0k56L6L59L6l30r2K35M5k11l4K41
4923I5J42j55k33O1J80o1j58O0K64J0l01r7J93J05j82o1K26J65k15k62J17K07
4945A00p6j75J15K28o3k71o0J96Q8j17o3J59J37j83k66J02K98o0k23J07K50j08
4967A15l17L6K53L9j52j1J30M0j46j74Q1K32L5k35%K50n1l55QL61M4k60OK05n8
4992G6j89n1J03J60L5j59q8J88L5k99o7L80J45l52q0K86j1l05J1K51O4q2m8m2
5016c9K8P9j39j14K66K26k99k44K98J28l45r3L92J00k74o3J16m3m2J6j2Q6J83
5039B11j54k91J47K70k35k40L71K62l79k04K70O4k00J6J67Mjl1j93j1K86l8k97
5062b06J84L60k68l99K63K92k59j52L11Q8k29n7M2n9R6J17j58n7L06o1m56R7M46
$$ y = [199, 198, -101, -109, 58, 33, -126, -164, 5, 186, 127, -108, -129, 86, 66, -190, -154, 205, 241, -89, -181, 54, 99, -112, -146, 95, 237, 82, -151, -90, 90, 29, -129, -69, 195, 205, -96, -193, 0, 105, -77, -138, 88, 253, 38, -224, -107, 100, 24, -151, -36, 192, 129, -142, -202, -6, 82, -35, -98, 61, 198, 15, -251, -149, 149, 89, -134, -27, 223, 115, -202, -166, 87, 126, -26, -37, 93, 133, -13, -187, -106, 126, 161, -74, -74, 176, 125, -230, -222, 139, 183, -77, -71, 134, 76, -113, -164, -61, 99, 134, -25, -113, 75, 110, -189, -256, 124, 269, -83, -163, 123, 112, -193, -182, 69, 133, 51, 3, -39, -11, 68, -71, -185, 81, 307, 8, -236, 62, 190, -155, -248, 144, 244, -30, -93, 23, -20, -62, -46, -58, 28, 211, 57, -234, -87, 183, -52, -292, 79, 341, -38, -242, 28, 92, -108, -92, 75, 79, 78, 47, -146, -157, 129, 91, -206, -22, 338, 70, -329, -66, 226, -33, -185, 126, 214, -15, -72, -30, -89, 7, 124, -34, -91, 215, 154, -302, -205, 241]
5085B41j18l69K48K94l20k51K17J24j12O3N7j20N7R0k61r9M06J14m35J6M28j54
5107A16m35J92L64j67j75J81L0j67M8Mj32J75K41k77j97L21Q9m59j6N20j9m03
5129a66J13K49k23j82J84O8n8J25l2k66J01K66k48k18M21K06m83j25M13j7l72
5150b44J33L04j21j35J10o1j11J71J6k24J67L21k83l53L15K38l98r9M78M0l86
5171a22MJ78j13n2J80k7q6J87n5l59J02M01j67l28L11K45m15j95L66Q3k73O0J88
5194A13j14m9J09j40r3K55O0l22R9L94k25m24K54L15k67j30L31M2l11j2J27q2
5216g0P5J92j56j79K21Ll43P1M72j11m09J85K70k86j73K69J03j83L4P2j32L2J51
5239A08j77j54L19J09l45j7L71j23l98J78L42j49j59J69Ok07M6J09p5J09J88k41
$$ y = [241, 123, -246, 2, 296, -24, -275, -58, 66, -46, 17, 74, -46, 11, 101, -160, -259, 147, 261, -174, -158, 270, 116, -319, -127, 237, 70, -105, 76, 106, -61, -13, -9, -141, 34, 275, -2, -199, 122, 211, -248, -264, 256, 237, -166, -53, 196, -27, -209, -25, 43, -15, 110, 78, -188, -87, 179, -69, -287, 134, 340, -143, -268, 145, 128, -244, -111, 193, 72, -63, 47, -14, -125, 46, 62, -162, 5, 326, 43, -310, 5, 243, -155, -254, 224, 264, -122, -118, 60, -53, -105, 75, 48, -38, 149, 94, -265, -163, 238, 71, -257, 54, 299, -116, -311, 55, 138, -135, -75, 113, -1, -50, 59, -81, -174, 81, 141, -181, -82, 312, 87, -337, -83, 232, -35, -165, 166, 208, -103, -115, 12, -70, 5, 197, 41, -138, 83, 86, -257, -186, 286, 175, -234, -49, 221, -65, -238, 31, 134, -49, -15, 57, -75, -43, 108, -69, -223, 96, 205, -140, -157, 214, 91, -307, -129, 213, 64, -95, 74, 80, -127, -81, 28, -47, 62, 250, 9]
5261Ik27K36J39l00oM11m9m10O5K51j25j19J82K1j21N9L4j84P2K18j82j93K89
5284G0J68l33j08L10j2k99J01K84r6j42N8m5r1J48P4j42Q7J78k31k87K91K38k50
5307b9r0K85j0l08K1K04n0l3Q4m9r5J20J1k22P6K59j44k16K17J87k72j70K45O3
5331H4j81P4J35q8q3K6o3k4K14O2k40K3J94j59k35K37K44j78j59J73J7j73J4J31
5355D5pJN4j21p9J67K4k17M2K70q7k46J39J69j87j24J60R2q3KJ4r3KP4p8k6K05
5382A12L7k55m2K19m2j83J31K05j24j56O2L6o1N6M4m1M4O0j41j07J86Q0k00MK22
5407A46m2k18K6J49n8p8R4N9n0pm2r0Q3J15q3p7J62M1k38p4K19M1j38K2J27n8
5433C1j09J8K1K0O1jp7M8O6j20j01J63J19j39n8J43mj50j5J02K2j6J3k3k1K9n4
$$ y = [9, -218, 18, 157, -143, -149, 262, 213, -197, -132, 119, -6, -125, 57, 78, -43, 16, 50, -134, -62, 156, -26, -219, 70, 238, -95, -203, 107, 95, -204, -103, 181, 85, -57, 1, -44, -135, 13, 87, -55, 32, 210, -21, -308, -17, 221, -29, -119, 166, 156, -152, -131, 73, 23, -10, 74, 25, -70, 50, 61, -161, -85, 174, 30, -186, 31, 218, -54, -224, 21, 84, -97, -23, 112, 24, -59, -33, -96, -120, 94, 156, -84, -61, 133, -26, -261, -24, 220, 42, -117, 56, 73, -100, -86, 45, 38, 39, 93, -28, -107, 60, 84, -133, -91, 179, 92, -154, -15, 154, -33, -157, 3, 95, 12, 14, 28, -65, -63, 11, -67, -93, 112, 149, -106, -148, 71, 29, -154, -23, 182, 58, -98, -36, 0, -61, -5, 39, -2, 42, 102, -39, -146, 40, 120, -80, -76, 146, 104, -114, -88, 61, 3, -75, 19, 78, 28, 21, -21, -111, -28, 87, 4, -73, 89, 130, -108, -182, 37, 78, -60, -38, 89, 31, -78, -60, -39, -19, 42, 41, -36, 12, 78, -42, -143, 20, 139, 0, -58, 85, 81, -69, -84, 18, 40, 24, 37, 14, -7, 22, -32]
5460c2q1R3J54q9j21Q3P0j48o6J47R4r3m1L0rl8j2J0M8P8m0j10K5R2p3j05J36
5487BJ25r2j04N7M7q3k0P1N7mj8p4oO8j2o4N3J27o7j47L0R7n3o6Q5P3k7q5l1J5
5517d6L1J0j6K1P6l2j33j0J20or3N9J16n9r7kN3K0j4nM1K5n2p4pR2L3n4MP1j7
5548E5j26j2J07K1n2J4L7lo3m1K2O2L6n3j7N0j7r5j9R8N0n1m0N5Oq9k0O8N6ll4
5579Bj6K0Kp3NR0M3n8l5K1K1o2l1P8O8k5p0K3J9l3l4J5P6L6o3n9K4K1m5oN8O0
5611G2k9q8lM0j4l4K3Q8j3o2m9K9K9j1j7M3N6l9o7j2O0Qm4J8Q7j8q2k4M5K6j6
5642BMK7L0m7n5rN9J0l0%N8kj00k4P0L9m5pM7Po1l9J1M4J8k2nK4J4p3l8P6N6m1
5676bj5M6ko1k6N2M0Mk1oJnl7j7N6O2m6m6L6J5p5j5N8N4l2k5Pkk1j9PM7L7k2o0
$$ y = [-32, -113, -20, 134, 45, -76, 7, 77, -71, -137, 10, 104, 11, -30, 0, -9, -47, -59, -49, -1, 77, 37, -73, -48, 44, -29, -134, 2, 127, 35, -69, -12, 35, -48, -68, 3, 60, 56, 38, -36, -42, 26, 14, -50, 3, 130, 63, -84, -54, 43, -10, -76, 9, 82, 55, -30, -61, -46, -15, -5, -21, 0, 76, 44, -89, -99, 21, 15, -78, -19, 97, 38, -59, -61, -8, 12, -2, -7, 34, 59, 7, -67, -74, 18, 51, -3, 1, 72, 55, -71, -83, 24, 45, -7, 7, 44, 41, -22, -63, -41, 21, 57, 4, -13, 37, 20, -75, -94, 4, 54, 3, -37, 18, 24, -65, -85, -17, 39, 36, 2, -14, 6, 8, -65, -60, 30, 73, 15, -20, 1, 22, -40, -71, 7, 75, 50, -20, 3, 22, -11, -45, -30, 46, 82, 19, -40, -16, 5, -40, -46, 12, 72, 43, -45, -48, -8, -22, -56, -33, 55, 42, -20, -69, -40, -11, -22, -39, 4, 60, 21, -46, -58, 2, 10, -34, -16, 71, 53, -29, -53, -8, 18, 2, 6, 33, 63, 16, -39, -48, 11, 21, -9, -9, 49, 47, -53, -77, -7, 32, -13, -20, 27, 34, -27, -66, -55, -11, 7, -15, -20, 4, 18, -55, -93, -17, 39, -2, -17, 29, 27, -34, -60, -8, 32, 36, 15, 9, 10, 5, -32, -49, 7, 69, 23, -23, 13, 28, -47, -62, -4, 50, 18, -7, 0, -2, -23, -42, -35, 12, 49, 27, -33]
5711c3KL8n1j9N5P9n8n5K3Ok8KL3K2K1k6l7rL1j7k1N7N8m3o2QM8l2k5O0K5k0l8
5744fj7OJ2J9k1J4L5j2q2nO8j3m2N0M6n8n1J8L1j1K0J0pJ6j3o4%M9L4l6J2N0m0
5777A2o1J2M2lJK7kj2j8j8j0M4M3m4j9M1j5o4JP6ml9J8J6k6l2oJ9K8K7k6l9K1
5810a0Mn7nP9L4o2JJ7nm4L1L7j5J0Qk9j6K0j7j5M6L9n1l1M8jn8J4P6qk7j6Ol1
5844b8JK5oK5L3l6p5L3K5l1RN9ro1j2L5j0k0N1Ok5J0J0n1JN7k0l4N1N2p6l5M8
5877BLl6K3O5k9k1mj0l5M1L9k9KM3n8o9L7O3l5j0N8k1p6J3M3j8PL1rm4J8Rm6R
5911d4P8j9n6M8L3n7l8O3J0m3L7L1l9k2K7k6pN7L7o6oM7n8m7N7O7n5k1L5l1n2
5942f0K3M7k1KK4j4n5M2J4n8L0O3j9p6N2J3n1j8P5Lk5L0nn6JM5j4j4O0J1p2k1
$$ y = [-33, -31, 7, -44, -63, -8, 71, 13, -42, -19, -13, -41, -39, -6, 16, 37, 11, -26, -35, -4, -21, -42, 15, 73, 30, -32, -24, 24, -8, -33, 27, 52, 32, -6, -23, -17, -5, 14, -7, 7, 42, 30, -52, -57, 11, -2, -44, 6, 52, -6, -57, -39, -8, -19, 1, 11, 4, 20, 7, -57, -57, -8, 26, -10, 2, 52, 12, -49, -37, 5, 2, 3, 30, 28, 16, -2, -20, -30, 14, 57, 13, -6, 35, 20, -44, -43, 33, 29, -10, 8, 24, -2, -34, -40, -21, 7, 34, 8, -31, -10, -6, -63, -68, 11, 45, -17, -16, 1, -4, -48, -17, 20, 5, 15, 23, -6, -22, -2, -19, -34, 12, 51, 0, -31, 17, 16, -42, -28, 48, 40, 13, -3, 3, -28, -27, -2, -8, 17, 50, 14, -61, -28, -3, -34, -25, 34, 25, -36, -48, -13, -23, -43, 8, 14, -11, -1, 9, -42, -41, 16, -4, -38, 13, 65, -11, -46, 2, 5, -31, -8, 57, 28, 7, 3, -7, -42, -1, 38, 9, 11, 54, -4, -73, -36, 27, -8, -18, 40, 19, -57, -44, -1, -19, -12, 19, 10, -34, -16, -7, -53, -44, 34, 15, -41, 7, 40, -17, -55, 8, 18, -25, 12, 43, 4, -18, 9, -17, -24, 33, 70, 4, -2, 45, -13, -60, -3, 64, 9, -12, 23, -8, -60, -37, 10, -11, -9, 15, 1, -54, -12, 2, -56, -26, 37, 18, -58, -6, 7, -44, -62, 13, 16, -9, 21, 16, -40, -39, 6, -8, -22, 38, 49, -23, -44]
5974d4N9k0m3O8N4o8j8L0k4k8L3M4n1LM1m5m3N8K1o9K2Q3m0q6M1M3o5pP3On8K3
6006gJ3o2K0M9j5j3M8J1r0rP7j4m9O4M1o3m4N0j1j5M4K4m2j0L3m7l0P3K9q5RO9
6038D8l5q3M5N2l7j2M7j0n6RJ9m1L7N0l9l9M6K9r0oJ00j1n2L2K2n1k9M7J7k4L6
6069B1Qm4PL0l8k6P5M0p8k8O8l1p0N6M4k0j7K7k5l0K4J9l4K1N0o3m0M2K6p0KQ3
6101B9J3p2J4K7m5JL7M%K1pm9NM7k0m3O4L5o5k4M0J8n8K9K9kk6Ok8lJ3K0k9J9
6135@L4m3n1L8N1n1j4N5Pn7kJ6rRK4j8qL0k6m2K4O5rn4L9L4n0l4M0K3kkJ1j7P
6170A8k4k0K2L6Lm2NK6k5n0K8N1rk7NNj2k5K1j4M1jk6mK4om6J3N0Nm2mK0ml3K6
6206a5K8J6j5k7J1J0j7j1J5M0km0pL1pj6%M8Kl4l1J1K3k3j1L0K2j6l9rL1kj3p
$$ y = [-44, 15, -5, -48, 20, 74, 6, -12, 18, -6, -34, -1, 43, -8, -5, 36, -9, -52, 6, 27, -42, -20, 63, 23, -63, -22, 21, -44, -51, 22, 28, -30, -7, 6, -56, -36, 13, -2, -15, 33, 44, -46, -55, 22, 8, -41, 23, 64, 1, -43, 7, -4, -19, 25, 49, 7, -3, 30, -17, -47, 26, 55, -30, -21, 48, 13, -70, -25, 27, -10, -22, 25, 15, -41, -32, -13, -54, -17, 33, -6, -45, 1, 30, -60, -66, 34, 23, -29, 3, 25, -26, -55, -8, 9, -15, 21, 29, -15, -8, 22, -16, -42, 33, 73, -5, -33, 35, 4, -66, -10, 34, 14, -3, 24, -1, -31, -7, 12, -22, -1, 49, -14, -54, -12, 14, -56, -54, 29, 42, -30, -16, 11, -34, -33, 4, 8, 8, 29, 22, -27, -22, 25, 5, -38, 26, 61, -4, -28, 12, 30, -28, 1, 30, 28, 2, 8, -20, -23, -10, 10, -19, 0, 34, -9, -60, -22, 29, -22, -36, 19, 26, -31, -33, -17, -26, -17, 7, -11, -19, 11, -15, -57, -33, 32, 23, -31, 8, 42, -8, -42, -2, 21, 19, 17, 28, 11, 18, -6, -26, -4, 32, 35, -7, -2, 24, -1, -51, -23, 28, 19, -8, -3, 2, -10, -35, -14, -28, 13, 12, -14, -18, 6, 0, -46, -33, 17, 22, -20, -24, -4, -8, -41, -15, 13, 29, 14, -13, -2, 8, -9, -20, -5, 35, 33, -7, -14, 17, 10, -6, -6, 42, 44, 10, -21, -10, 13, -10, -21, 9, 31, 15, -24, -33, -2, -4, -17, -24]
6240b4J9K8l8l2K6L0j8k1L1K7k0n4J4L9Kj9J0K1ll2k7J3M3Nn3M8L3l1n3J4N4k2
6272A0mkJ8qm0nJ9K9pj7rK6j0n0%P4Jo1OM4j1m8RM5njomJ1Lk4j5N7L4o6k8O9k
6310C2o8NP6km9J4J8k2j9J3nJ9K2k7m3L3L9p2k0Q6L2q9j1O6l2m8L1K5%pNl4jN2
6344A9k3m7N2O2q1m4P8J7n8mQ2j4m6QoqK1K5m9NO9m3q2N2Q2p7n4R7L7j04k4O9
6376A1j2l2L3J1l1K4No9PR3j3j13N8J02r4p4Q8N1q1KO8k6m3L9%l9M8N3q2k7J15
6407G2j7j23M8J09n9q8R2K2q0j8P7k2l6N4j6q3N7O4j14j3J40Pj66M4J11n5j09
6434a02R5N8q0lN4m2k2P2k1o9P6O9j12o1J28Pj19L0J36o4j03O9M8p5qP8l5j6P4
6463F2m2r8P3J03j38m5J46J5j57MJ34m9r1P6N8p9nM6n3k0J11j9j26P9J07j38p6
$$ y = [-24, -5, 23, -15, -47, -21, 9, -9, -30, 1, 28, 8, -46, -32, 7, 9, -10, 0, 21, 18, -14, -41, -28, 15, 20, -33, 15, 48, 17, -36, -22, 32, 10, 6, 4, 22, 14, -26, -31, -12, 17, 10, -7, -16, 10, 0, -50, -50, 24, 25, -36, -30, 14, 3, -45, -36, 9, 4, 3, -3, -7, 4, 7, -17, -32, 25, 59, -7, -35, 34, 32, -36, -31, 45, 43, -6, 8, 26, 4, -15, -2, -7, 12, 34, 7, -36, -3, 36, -36, -56, 30, 62, -27, -38, 28, -4, -52, -21, 4, 4, -3, 2, -32, -33, 19, -4, -51, 1, 63, -18, -62, 16, 33, -25, -29, 53, 39, -7, 1, -5, -13, 8, 33, -16, -11, 58, 15, -67, -15, 67, -10, -64, 33, 70, -34, -58, 11, -1, -33, 0, 11, -20, 4, 9, -60, -53, 40, 27, -86, -28, 74, -20, -94, -6, 45, -36, -34, 34, 8, -35, 4, 4, -35, 13, 66, -16, -43, 72, 55, -68, -20, 89, 30, -58, 34, 56, -24, -42, 35, 13, -23, 31, 15, -68, -11, 53, -61, -74, 66, 73, -93, -49, 62, 7, -102, -7, 51, -29, -32, 22, -20, -42, 30, 9, -60, 16, 85, -27, -88, 40, 47, -72, -42, 94, 30, -73, -4, 44, -31, -39, 39, 4, -12, 62, 20, -78, -5, 98, -40, -85, 61, 76, -81, -77, 57, 8, -83, -7, 51, -28, -33, 13, -40, -60, 51, 32, -94, -15, 92, -46, -122]
6490a22J52N1j39kJ43m8r7O1L7p5L8O1p9j6J13l8j53R8J46j19j13J55M6j70oJ36
6516F0k3p8N9K1r5M9N2r5k0J45l0j58P4J52j31j22J49P9j49mJ26m0p9O2K3q7P7
6543A7Q3j33n0J63k8j76R1J83j13j40J21O0j37MJ13k4o9O6j4r1P6R0j53k5J73
6568H7Jk13O3J65q4j43J28Q2j32j4R6m9n8R0mj00Q8R5j50o9J84K9j95N6J85r3
6594D5j55J01Q3r7%Q2n5l7Q5l6j04R2J25j53r6J88L4k00J3J78n1j43R2P1r6JP2
6621C9p1l2J22k0j39Q7J28j54j24K02P0j80j1J68m7j36Q6N5l6oP7j02l5J31j9
6646E3j52Q9J59j48j25J60Q5j82j6J62k3j23O1M3q7L5N6r5k7J58k2j68N1J72j24
6671hj31J62R8j54n2J11j0r0O2L7n5M3N1j13l4J54lj59N6J68j00j43J07J06j24
$$ y = [-122, 30, 81, -58, -60, 83, 35, -62, -1, 36, -39, -1, 60, -19, -35, 78, 40, -113, -15, 131, 12, -101, 54, 100, -70, -76, 60, 37, -41, 18, 39, -56, -7, 45, -50, -70, 75, 45, -113, -39, 113, -18, -140, 9, 88, -61, -65, 61, 21, -58, 4, 27, -60, 17, 100, -33, -83, 80, 52, -124, -33, 150, 37, -103, 18, 78, -59, -55, 58, 34, -35, 31, 17, -74, 2, 92, -61, -86, 87, 88, -125, -62, 103, 19, -124, 4, 86, -46, -60, 36, -13, -71, 19, 15, -85, 3, 98, -52, -121, 63, 92, -103, -47, 138, 45, -110, -9, 74, -23, -23, 59, 4, -33, 52, 16, -88, 4, 129, -24, -120, 68, 102, -98, -85, 93, 42, -101, -9, 62, -34, -33, 39, -32, -64, 58, 38, -101, -14, 114, -40, -164, 38, 108, -72, -83, 85, 38, -98, -12, 43, 7, 1, 78, -24, -59, 72, 53, -99, -10, 149, 1, -124, 36, 121, -61, -77, 85, 62, -61, 0, 43, -44, -9, 47, -48, -75, 83, 61, -107, -56, 116, -8, -139, 23, 121, -33, -85, 26, 16, -74, -12, 25, -30, 13, 64, -49, -83, 71, 68, -91, -35, 133, 33, -110, -3, 103, -21]
6696b1n4J29op0L8J1p8O2O3j06l9J61Kj93J0J84o2j44R5J05r8p0Q0Nm3N4Lp1O3
6725A0N1j12n7J69L8j77OJ64m0j40O0J07p2m5O2rl3N5l5p0P2J04j15q1J42M3j74
6752g7j1J67nj34L3P6m9m2M4j7JN8m1r3P5R0j01r8J44O7j46l9J26J2r8OP3%j8
6781CNm4RQ1l4p6N6J10r7j12J02Q0j01n1J09K3p3j7K9JOJl7J4O9l6j05L3J28p6
6811@r3Q7R9j00o4N5L2k9k0J3J9J8k0n0J1Q3j3r3L7J05m8j01L5R6k7p1K8N7j1
6840C5m8k4L7M9j2p0PQ2k8r2J4R5lj00J7P4j0p9jO8K6l3n1J9N8k6p1K5P9Mr2p
6872e8P7J8p4j9Q0L4n8n2N6M1l2m9K0P7j5p3nP1Ro4qN5L1n0o0L4N8m1o4L4Q0m1
6904A2p5J5Q0k7m6mN6K7m3o2L2P5k4p7K4Q7j9r0MJ01j1q3K1O6j1m5k1J8N7j6l9
$$ y = [-21, -75, 54, 48, -22, 16, 27, -51, 11, 74, -32, -71, 90, 92, -101, -91, 93, 31, -113, -18, 87, -11, -81, -1, 4, -39, 15, 18, -53, 10, 61, -51, -108, 61, 99, -78, -72, 92, 52, -88, -28, 79, 7, -38, 24, 15, -18, 37, 2, -68, 4, 108, -7, -88, 54, 97, -77, -88, 79, 74, -60, -27, 49, 0, -42, 2, -15, -14, 44, 3, -90, -15, 75, -26, -124, 20, 87, -59, -98, 28, 40, -58, -52, 21, 21, 3, 8, -36, -27, 54, 20, -56, 0, 110, 13, -99, 3, 83, -18, -69, 40, 63, -10, -27, 2, 3, 9, 10, -27, -13, 56, 20, -85, -52, 76, 0, -93, -6, 93, -7, -71, -16, 16, -13, -33, -20, -1, 17, -3, -53, -42, 41, 28, -65, -28, 77, 29, -72, -37, 59, 32, -39, -11, 46, 35, -13, -37, 0, 49, 37, -33, -26, 56, 28, -64, -50, 45, 42, -58, -41, 33, 23, -56, -57, 11, 37, 4, -47, -28, 30, 4, -67, -42, 37, 41, -51, -58, 19, 37, -37, -56, 24, 58, 0, -52, 4, 45, 13, -36, -16, 61, 46, -27, -32, 39, 48, -16, -24, 31, 62, 12, -48, -14, 44, 3, -61, -27, 53, 12, -63, -48, 32, 5, -41, -45, 11, 38, -5, -67, -35, 40, 16, -61, -37, 50, 31, -59, -55, 46, 35, -48, -27, 39, 28, -17, -38, -20, 37, 21, -18]
6935a8nQ0Nj18mJ16Pj02QQ9j0r5J2N3Kk9j3jL3J3o3l8J02L9j00m8J17K2j22j3
6965h1J28jo8nM5%j5j6j6M1O2o4q2Q9P8j26n6J25O8j34k9J00No4oL1NJ9j5o5K2
6996b5R3o9q8Q2J19j17j12J25P3j26l2Q8J1m1Nok1M8J7r1L5J20n8j38P4J30q4
7023A2j08J30O8j17m3Q0Rl6K3%m1O3K8j23j1J41j6j58N6J70r7j42J02Q6r8l4P5
7050A9j1l6L1k4o5R1P0j35l8J67mj96L8J89o5j39R3Q7r0k9P3k4j3P6m3q9Q8Q7
7078A08j42o3J82M0k14K0J86p1j56R4R2q8j9N5l7l1Q9n1r8R5J31j50j09J86M3
7103I2k03J6J86k6j55O7O3p1QN7o1k7J28l9j58R8J69j47j32J92R2k04l1J68k7
7128E5j26O4O8o9J9N9j02k7J30k6j63R5J73j44j76J72J11j76l7J62rj19L7M1p3
$$ y = [-18, -23, 57, 62, -56, -60, 56, 63, -39, -31, 58, 48, -47, -35, 18, 20, -9, -22, -23, 10, 23, -40, -78, 24, 63, -37, -85, 32, 54, -68, -81, 47, 46, -22, -27, 18, 18, 3, -13, -29, 12, 74, 10, -72, 17, 95, -31, -87, 38, 106, -28, -57, 43, 48, -16, -22, 9, 14, 33, 18, -47, -25, 68, -1, -89, -7, 112, -5, -117, 8, 81, -45, -77, 11, 22, -19, -14, -20, -41, 7, 24, -67, -32, 88, 30, -108, -34, 96, 12, -96, 34, 102, -15, -58, 22, 31, -5, 18, 18, -23, 40, 68, -55, -66, 75, 59, -99, -43, 127, 30, -112, -10, 76, -22, -56, 19, 8, -28, 3, -21, -86, 5, 75, -60, -98, 69, 65, -131, -93, 96, 31, -108, -15, 72, -18, -47, 26, 2, -11, 65, 22, -67, 21, 108, -34, -97, 85, 125, -89, -69, 117, 46, -110, -16, 76, -12, -31, 24, -13, -44, 45, -6, -104, -9, 122, -28, -137, 49, 92, -111, -95, 91, 65, -90, -23, 40, -31, -23, 34, -27, -54, 74, 35, -123, -25, 144, -3, -135, 57, 149, -55, -86, 82, 55, -71, -7, 61, -8, 11, 70, -32, -59, 71, 45, -118, -23, 150, 6, -170, 2, 113, -63, -100, 62, 53, -66, -29, 12, -61]
7153f1N4P4j03n0J70j9k02P6K11j19j83J61J31j71n7J32Lj04P3K3p1N1P5j38o1
7178a05K03K6k28N1K09j22j88J40J29j29n6J14j2j03P2Mq9R5R4j57q2J93L5k14
7202a20K2K23p7j82J10J26j16n2R5j2n3Q9%j30O9J20j49j08K19P0k23k0K09n2
7226E8j91J09J23q3n2P5n5m1J02mj25P9J41j71j37K06J01k18k5J99k8j70O2J10
7250F5q2l5P9n1m5J26jj58O5J68j44j41K00J07k05n6J85mj49N4J03q5j1N2p7l2
7276g2J45Oj68M2J68j10j74J76J27j83p0J63Jj18L9N5n9J2O6r2l5J63rk04M2K12
7302A23r8j65J44J25j54p9J29L0p5L7L1q3M0P1r9m8J66J6j96J5J95o4j89J19J31
7327A22j14q7J07J1o7L9mp3N8R2j08q1J57M1j94KK04m6j65O1J15p7p3P9J5k6L6
$$ y = [-61, -7, 67, -36, -86, 84, 65, -137, -61, 150, 31, -152, 9, 140, -31, -88, 44, 47, -57, 16, 39, -32, 19, 94, -44, -105, 98, 124, -104, -53, 156, 34, -154, -14, 115, -14, -70, 44, 32, -71, 1, 5, -84, 11, 105, -52, -134, 59, 94, -120, -98, 125, 48, -134, -24, 102, -14, -66, 29, 17, -36, 53, 53, -77, -8, 112, -37, -145, 74, 144, -79, -99, 110, 58, -133, -24, 99, 16, -36, 39, -16, -57, 45, 41, -84, -5, 136, -35, -172, 34, 135, -83, -108, 91, 63, -107, -45, 65, -17, -52, 27, -24, -69, 57, 56, -102, -37, 131, -13, -154, 46, 153, -52, -108, 77, 73, -76, -22, 81, -4, -15, 37, -40, -72, 73, 79, -89, -47, 121, 11, -163, 13, 140, -43, -113, 50, 51, -67, -28, 27, -32, -20, 46, -46, -81, 82, 73, -131, -89, 123, 25, -140, 4, 129, -25, -104, 25, 55, -20, 17, 48, -35, 5, 76, -23, -71, 95, 111, -85, -70, 125, 61, -128, -9, 122, 8, -79, 28, 39, -28, 11, 7, -66, -8, 84, -24, -105, 52, 93, -101, -99, 105, 59, -106, -45, 70, -7, -80, -1, 14, -12, 24]
7354B4j6o5M8J03r8r1J60O9k06j5J74Lj64L9J18n5o5N6nk7N9j3r0M2J27j25j04
7381a17J26Q3j58m3J71jj40K2R0l4k3J5nKM9k7r8O8J11r0j14J21J06j54o3J47
7407D4L6r7j2O3j5j1Nk7nQ4k6j13N5J33r2j32J05J18j07q2J01M3q6k9M3JJ9kn3
7436c9mQ6j7j20L6J35m8j32O5J15o0r7O1P6l5l2LJ0L6mo6%R4Qj26J4J21l6j06
7465f2L0J11k5r8J7O6j0l8k1K2M3J2q8j6R7Pj05qJ26Jj29QQ6Np3pN7K6l3m0J0
7496b9N7J4p3j8Q3K1q8l0J00L4q5k8O9L4o8l4L5N3k0n2oO2K0p6l1P6L5o6m8O0
7526AN4n6o7M5P0l2o4K8N4lp9j3P1L5o4m0O4L8n8m8M8O2rp7J8P1kq4LQ0K5p1l5
7559c5N6L1n1l5K6N9j3o9j1Q0Nr4%Q9K0r3l7Q7K8p8j9M8M1l1m1oO5J6o1l0P6M2
$$ y = [24, 8, -57, -9, 94, -4, -95, 65, 134, -72, -87, 87, 90, -74, -35, 83, 28, -37, 19, 14, -13, 46, 33, -57, -15, 112, -13, -117, 9, 92, -66, -109, 62, 61, -79, -57, 33, -1, -24, -9, -14, -12, 37, 10, -88, -20, 91, 1, -113, 8, 114, -40, -103, 44, 80, -17, -29, 34, 19, 8, 13, -14, -19, 65, 39, -74, -19, 114, 22, -110, -5, 113, 6, -76, 25, 68, -18, -47, -4, -3, 16, 14, -39, -43, 43, 26, -94, -58, 77, 29, -103, -38, 77, 17, -80, -19, 57, 22, -10, -7, 3, 39, 35, -31, -31, 63, 71, -55, -41, 80, 44, -62, -32, 79, 54, -44, -27, 39, 29, -9, -30, -8, 35, 47, -41, -57, 40, 47, -58, -66, 60, 61, -68, -60, 26, 31, -42, -49, 8, 34, 1, -39, -29, 28, 42, -31, -49, 34, 55, -33, -63, 37, 71, -14, -42, 27, 61, -7, -41, -6, 47, 27, -25, -31, 31, 51, -25, -56, 20, 55, -11, -59, 1, 55, -1, -68, -23, 47, 15, -49, -21, 33, 30, -49, -62, 9, 44, -20, -60, 4, 42, -16, -64, -16, 46, 37, -40, -22, 49, 47, -37, -34, 46, 71, 0, -35, 21, 52, 1, -34, -8, 51, 38, -31, -42, 38, 43, -51, -51, 38, 58, -35, -72, 15, 43, -35, -54, -6, 35, 4, -37, -43, 22, 38, -23, -53, 23, 65]
7591F5r3m3R1N4r1m5R2L4o3k6L1K4ok6k0N1L8o7n6O6P8q2o7Q7N2q2p1Q0L9n7j9
7622c2J8K0J9k9n9L3Q0k4j05L7J31q5j01Q6R4p4p8O4M0l4k8J8LL8on9kR8Mj36
7652f9L3J36n3j24O8Q7o6o0N4L1k6Lj2m0O1L7r5l1J32Nj43pJ54l8j31M7J10n1
7680A2o5N5Kj7J9j3n3Q3O9j25m9J42L1j59pJ61j6j33K5J15m9n3L2Oj2N9m2p7O6
7709GP9r2q6J40P0j65l8J47qj20K2R5m9l3L6k5k2P6j2j13O1J32j12j21J43J03
7735A15j56n6J61Rj14lR8l5j9N1n2j6R6j6j39M6J65j05j51J26J31j59p8J51K3
7760G3j16J9O3m5kM4o9l8J16K2j62L3J68q4j68J17J42j32q0J28J6j03L2M5m2J5
7786hO1p2p0J53K1j71J1K00n8j87J05J51j15j03J04L8p8K1L6p4K6P8r9o6J59N6
$$ y = [65, -28, -71, 20, 74, -17, -62, 30, 64, 1, -25, 6, 30, 24, -2, -22, 29, 67, 0, -56, 10, 88, 6, -61, 26, 78, -4, -75, 5, 44, -13, -32, -14, 6, 25, -4, -63, -30, 50, 26, -79, -42, 89, 4, -97, -11, 83, 9, -69, -5, 35, 1, -27, -9, -6, 32, 26, -33, -35, 63, 67, -69, -36, 100, 47, -77, -9, 78, 12, -48, 6, 37, 11, 14, 2, -38, 23, 60, -35, -66, 66, 71, -72, -79, 75, 37, -94, -47, 63, 12, -53, 2, 4, -13, 6, -7, -60, 23, 92, -33, -82, 60, 91, -68, -75, 86, 70, -63, -38, 77, 28, -25, 7, 13, 1, 60, 18, -59, 7, 86, -6, -92, 48, 118, -47, -85, 62, 54, -66, -44, 51, 2, -31, 5, -20, -42, 34, 22, -91, -30, 102, -10, -131, 12, 115, -41, -97, 64, 73, -41, -44, 54, 19, 0, 51, -1, -17, 79, 63, -76, -30, 135, 30, -121, 5, 136, -23, -101, 50, 73, -43, -24, 39, -6, -8, 36, -33, -71, 45, 67, -95, -62, 106, 22, -146, -29, 113, -19, -99, 29, 45, -58, -26, 19, -23, -8, 53, -19, -89, 64, 85, -86, -75, 125, 67, -120, -15, 136, 21, -82, 22, 60, -18, 3, 39, -35, -9, 69, -30, -96, 63, 119]
7812A19k12rJ90m4j71Q2J49q9j00R5jn3N2K1q1M5R1j14j00J63R4k03l0J97j2j78
7838i9O8J24o4r1Q4Rn5O7J7j16L3J22r9j12J54J09j96q1J95Pj64M9J20o2q3O3
7864amn0Q1K2j33L9J49j02j48J59J20j78r7J84N0j72L3J14n9m5O0j8m1R8Pj60
7890i2L1J85r4j48J41J24j73j00J67N5j28RP9o5k7P5n1m6J19J0j70LJ88n9j58
7915a25R6J59j51j20J48N6j04OO5n4%Q1p4m9J14M7j82j1K21l0k00Q2J49j15j06
7940i7J18O1p9j8M3o3J5R4o5q5J33M5j82l3K10lj95N4J47q7j08Q4N1o8J3K9o8
7967e4L0J02q8j13J38Q6j68n5J90L0j83J2J44l6r2P0K4m2J7L2r0L2J27p6j35J00
7993BJ29j55r0J72N0j63nJ23k8q3N1Rl7M1J4r7L6J09o4j43J13J31j33r9J38P0
$$ y = [119, -93, -102, 88, 44, -127, -45, 104, 15, -85, 10, 9, -44, 8, 29, -52, -7, 84, -30, -130, 33, 127, -76, -106, 91, 79, -99, -31, 93, 29, -62, 22, 31, -24, 43, 60, -56, -23, 99, 0, -112, 42, 151, -45, -126, 69, 76, -88, -39, 81, 19, -64, -1, -5, -55, 26, 48, -85, -46, 103, 1, -147, 12, 132, -46, -143, 41, 91, -81, -48, 66, 7, -38, 22, 4, -37, 61, 68, -92, -61, 124, 30, -118, 23, 147, -26, -126, 41, 96, -32, -23, 56, -9, -36, 39, -12, -58, 61, 71, -99, -96, 92, 33, -125, -29, 130, -21, -141, 7, 63, -41, -35, 30, -24, -24, 57, -17, -66, 48, 95, -87, -98, 123, 93, -107, -25, 124, 9, -97, 21, 82, 3, -15, 28, -35, -20, 74, 9, -76, 57, 102, -80, -113, 97, 94, -101, -47, 100, 13, -95, -11, 40, -28, -15, 14, -54, -24, 78, -10, -123, 15, 101, -67, -122, 68, 98, -85, -73, 71, 35, -57, 13, 37, -5, 12, 44, -46, -14, 113, 37, -98, 2, 131, -24, -114, 58, 108, -55, -60, 63, 35, -48, 3, 12, -25, 16, 30, -67, -31, 78, 14, -129, -16, 115, -18, -117, 21, 91]
8019I1j42k8J04Rm9J8Kl0N5J1r9K6J39n9j46Q7J30j09j07J16P7r5m7O4Nk7J0k9
8047b3k2Q0J4j19LJ41l0j51N6J50q7j08P1Q3o9m7M9J2jJ8m8k2O7M0j21rJ50j9
8075E8j43K7J40m6r9M3Q2l5m4J3jK6K5n5m2R5M0j24m3J43K4j52J9J05j1r8ON4
8103GJ0k8j7kL0L2o9m5J13M0r1o5J11L9j06k9R7L5p8k4N0J6nl6k3O1M6o9m4O5
8133B1P6j07p7J12N3p6o3P5K8l8m8K5N5kn3l8M8M1m3o8O9P2p5n8M0O9m1o1M0O6
8163D2j5n9qM8K8n2k8M5O6o0o7M1Q3l7p8L8O8j0q8LO5K2p0j1N1L3n6m4
$$ y = [91, -51, -79, 25, 34, -15, 3, 5, -25, 30, 41, -58, -32, 107, 48, -98, -11, 119, 10, -97, 19, 96, 1, -46, 18, 23, -4, 6, -23, -45, 35, 49, -70, -67, 74, 44, -107, -51, 99, 12, -96, -25, 58, -11, -58, -9, 3, 2, 20, -28, -50, 17, 57, -64, -73, 77, 58, -85, -58, 82, 36, -63, -20, 62, 27, -17, -4, -5, 21, 46, -9, -51, 44, 84, -40, -83, 60, 84, -68, -49, 56, 45, -53, -47, 7, 17, -11, -28, -30, 0, 32, -37, -82, 31, 71, -20, -85, 26, 65, -41, -70, 27, 62, -16, -40, 10, 26, 21, -15, -38, 23, 69, 0, -44, 21, 97, -10, -87, 25, 78, 2, -61, 14, 42, 4, -44, -19, 36, 34, -19, -57, -9, 32, -11, -79, -10, 62, -13, -71, -31, 38, -3, -64, -24, 42, 27, -32, -40, 8, 36, -16, -44, 1, 67, 7, -60, -19, 64, 27, -51, -13, 55, 45, -43, -40, 25, 47, -23, -34, 17, 50, -6, -50]
8191e0
$$ Imaginary data points
##PAGE= N=2
##DATA TABLE= (X++(I..I)), XYDATA
0@%%%%%%%%%%%%%qJ6j6J6j6K4l2L2m0M9n7P2q1R0j06J22j44J68j91K15k42K76
35A47l14L53l95M42m95N54o16O83p57Q37r26J024j129J244j370J510j665J835
53I62k020K229k466K732l034L385l795M276m860N581o498P714r403J1930j6170
68i437K5021p3844J21764P5572k24680O5874J37650j39940j19710J70311L7875
79F6456j18032O7372Q9428j63015m2529J80907l0805j77132J25781J51164j80083
90c0488j01014K07801K3745k03896L7085J59154r1061p5204J37967M433j45734
101g7212N2853Q5433j26758j2014K00112k9832k01972P2834J37882j52812q2342
112a33828K10420N4393j84483L553J13734r3246o4919J40227J9975j16091O2654
$$ y = [0, 0, 0, 0, 0, 0, 0, 0, 0, 0, 0, 0, 0, 0, -8, 8, -8, 8, -8, 16, -16, 16, -24, 25, -32, 40, -41, 49, -57, 65, -79, 89, -102, 113, -129, 147, -167, 186, -209, 233, -262, 292, -324, 359, -398, 439, -487, 537, -592, 652, -718, 792, -873, 962, -1058, 1171, -1295, 1437, -1597, 1788, -2007, 2269, -2591, 2990, -3508, 4206, -5197, 6733, -9437, 15584, -58260, 63504, 139076, -85604, -19730, 117920, -22020, -141730, 28581, 66456, -51576, 15796, 105224, -57791, -100320, 80587, 49782, -127350, -1569, 149595, -30488, -131502, 76299, 100044, -103852, -66767, 92387, 1326, -73878, 64089, 68522, -77212, -24359, 61074, -65684, -77698, 122414, 92582, -109390, -36556, 101326, -51486, -133828, 76592, 130985, -53498, -49945, 63789, -29457, -94376, 45851, 65826, -50265, 12389]
123A2389P4272j50300m2615J85947q576j77153Q2333J55892j35936j14123J54236
134C6366M4187j54490K1450J27997o3405n8893J00645k0370j27205P1284J02361
145G9927j13168l3476J68940j9776j96058M4626J53972q5681q4782J39878M3899
156I8301j44530r329Q8312n5488l0811J13625m788j14009N5887P8636j25541n1381
168a01116J63890K0494j55644L4975J34216q4932j06502R8693N0745r4118J7303
179b1996Q4967n9051m6506P9884k2636j03783P7699J08755j01914o5916J27558
190E7061P395j56135K1883J42210l9182q1677P4676K7537r7422K067O8079m2472
202a5980j4921R5327j8505j13354M6784Q7588r4427n9856J31563M1334j25101
$$ y = [12389, 86661, -63639, -106254, 79693, 71117, -106036, -23703, 132189, -3747, -117870, 36366, 80553, -73937, -52487, 75510, 12105, -46788, 53857, 33487, -93718, -22434, 79927, -33241, -66717, 102223, 82447, -113611, -68985, 84987, -694, -85476, 54402, 98301, -46229, -55558, 32754, -22734, -53545, 60080, 55292, -58717, -2830, 75806, -49735, -101116, 62774, 83268, -72376, -37401, 96815, 11883, -94619, 4074, 54819, -39299, -21996, 62971, 3920, -42586, 37298, 14662, -89121, -11422, 97333, -4581, -70497, 57061, 64456, -91679, -69796, 72414, 33232, -48445, 26231, 53768, -43654, -41587, 26492, -15980, -30901, 64426, 45921, -67433, -20649, 66939, -27488, -87344, 44219, 85553, -39548]
213c9548m363R7864m3664p6759O2420M2412n1992J6520M4242o3841l2996P7177
225B7472q508q3868O0243R6169q2180q2039Q4494L4921r6653K450R9601j2933
237C9169o2276K7740R303n2586K0252M9251m0152j2020P5732j8233j01897K9986
249c5731Q8532n2644n9640Q4091M5651q6326k8422N8379r603l5948L8208K0414
261B6961l3158J5747K0441o1121k0261P8246P729p2423K8574P5027n3884p6609
273f4731M9583M9180m4187j0221M9659m841l5855O901m164k3021L4048L6027m1272
286b894j8847N4402p598p7216J3039P6687j3618n0295L1190L2795m2614k8887
298c3856K4275J0142o0J9457o280k6242J5783J3039m4693j1611O4782J8301n6765
$$ y = [-39548, -43911, 53953, 10289, -66470, -4050, 38362, -13630, 2890, 47132, -16709, -49705, 27472, 18964, -64904, -4661, 91508, 9328, -72711, 11783, 46704, -49949, -47499, 52102, 39169, -23107, 4633, 13936, -38650, -18398, 30853, -9299, -21319, 54413, 36180, -65717, -35731, 52801, 157, -59483, 24608, 70259, -16067, -44489, 13890, 4287, -31661, 6547, 26961, -6197, 9550, 29991, -31130, -51391, 26855, 34584, -37839, -9265, 65762, 11878, -64731, -15148, 34032, -10155, -20376, 29283, 24442, -11413, -4512, -8676, -31697, 2351, 38378, -2894, -21741, 32661, 25063, -52153, -39114, 37573, 23955, -26340, 4850, 37645, -4969, -33856, -9581, 561, 501, 19958, 13678, -12564, 3219, 16258, -28435, -40046, 24736, 43037, -13728]
311a3728n166M6799j7518n1143J7638M4132l557j4940L810n543p660L879j0924
324a3921p415L6227K4754l9271k7241L3664R275m3747k033N2257J2063l5972j1026
337a2386J4862k841j3233R6J2421J9132P018k4472k2824J6090J5762k1928q847
350b1150L7649K0230l4225k7036J7357J4474j5555p594K2164K0342j0823k7075
362a1242q498J5646Q865j1511j455K4234J1517k6924k6440J1611K2225n464j3553
375a0989J4865K3442j3139l5534l368K7829P216j7305L440K4169j290k9452j4265
388b4381J4564J6554k5p672L894J4129o090l1784q437L3768J7226k4579o303K9053
402A9917j039l9172q306K9866J1790j0415M0N851k386o777j3647q472K3136K6237
$$ y = [-13728, -18894, 27905, 10387, -40756, -23118, 21014, 17457, 2517, 6327, 784, -6876, -2997, -13921, -21336, 14891, 39645, 374, -26867, 6797, 16072, -27675, -29708, 22549, 34612, -1360, -12386, 2476, -365, -13598, -13502, -1081, 18051, 25069, 597, -22227, -6137, 9625, -12303, -21150, 16499, 36729, 2504, -24532, -7175, 7299, -8256, -15850, 6314, 26656, 15833, -11242, -19740, -4094, 4771, -6740, -8195, 16039, 27556, 632, -25808, -14197, 8028, 2564, -10989, 3876, 27318, 14179, -21355, -24723, 3106, 10322, -6983, -3543, 20626, 19336, -10116, -24381, -9817, 6737, 6712, -960, 2934, 17063, 10973, -20811, -29248, 4520, 21746, -2833, -9136, 19917, 18878, -20294, -28600, 1266, 13056, 2641, 2681, 8532, 6146, -631, -14278, -22750, 386, 26623]
416B6623j8302k3456K2591J3586l9611j7824M2828K1935k8122p713K0479o593
428F421k1902J176Q659P356J6967k404k7985K155K4751k0708l0559L6398M0796
441D1121l3124l1969K9650J1267l7245m235L4190N863j0513M494r885j6487J5510
454a363P777k6161J0516M6908j5549n3189J6763L8740l1587k7601M4565K5693
466C5512l5153j2502J7462j1486j0506K0570Q23j2231K5314R205m8288j1425M9874
479A7169j879m5923K5544N0096l3897m4850K8228J9611k9070L262L0654r280j2226
492b561J5371j6886k9570L2374L0650l9019j1041N4292o080o6476J0573N5266
504B6893k0101l2548L7183J9470l8458p396J9478j7368k808L8373o830l6961K7045
$$ y = [26623, 8321, -15135, 7456, 21042, -18569, -36393, 6435, 28370, 248, -7465, 13014, 6421, -15481, -14305, -5646, 1710, 18677, 16273, -11712, -9557, 15194, -5514, -36073, 325, 41121, 7997, -23972, 5678, 16945, -20300, -24535, 9655, 15518, 5005, 9499, -386, -16873, -1363, 6414, -19747, -9231, 37677, 22128, -31061, -14298, 24442, -7145, -34746, 9819, 35512, 359, -12143, 5319, -6167, -16673, 3897, 4720, -7511, 17803, 27008, -21280, -32705, 17169, 15290, -30633, -5089, 45007, 11110, -33740, -5512, 14099, -14971, -11709, 18945, 9665, -2561, 12810, -4076, -33646, -1272, 29378, -9641, -20682, 33610, 27530, -38946, -28373, 26893, 6792, -25756, 11427, 30897, -7561, -14957, 4521, -12847, -15655, 22718, 15888, -21073, 5972]
517E972K6775n4595k3894O4848J5214n6763R497N0974k9775m5660K9802K2403
529A4798k5029J0413K6464k7940j6470L2415j2602m2188L7777M9451m5735l4947
541c3593N2543R078o4085N032O0088j2195l4688K7140J0068l7954M817K6873k4747
554a1623n551M9375q072n7206K2255M6015m6558l5427O3613K6914n8476n175M5631
567B5715k2491l7438L2515J9451k6912J5049K5156m3133k2338N0138J17n2341
579c6512L1329N9284m6634n2483M7956K4406n3000K461N4797j4336l5479K4380
591F169M117l7622J8641L6896l5106j7963N5271j394o7615J5176N9536l4109m2990
604d0993N3118L0382n3390j1485L8033j8214k5843L7701J3387l4860J5300K7781
$$ y = [5972, 32747, -21848, -45742, 19106, 34320, -22443, -12946, 38028, 8253, -37407, -7605, 14798, -10231, 182, 26646, -1294, -17764, 14651, 2049, -40139, -2362, 47089, 1354, -33593, 18950, 28028, -36057, -31025, 29063, 16868, -17820, 9320, 19388, -18566, -13749, 13124, -11623, -17174, 32201, 24129, -33077, -10822, 35193, -11365, -46792, 16821, 43735, -14741, -19916, 25715, 3224, -34214, -1699, 17752, -9160, 5889, 31045, -12088, -34426, 15712, 15829, -36512, -5183, 54101, 7467, -45016, 2940, 27346, -25654, -23193, 31604, 17268, -18211, 6169, 10286, -27336, -8695, 28201, -6905, -24868, 30403, 29009, -38606, -23430, 36106, 1997, -40993, 12125, 42507, -10883, -22368, 15665, -2549, -28392, 9309, 22696, -12164, 3136, 30917]
616C0917m9103k7568O2027J6321n7302J3983N6622l9198n5799M2415L4863l8828
628a0650q74M0217k1394l1699K9877M631l8503K4234M3446m2489l2335N6940J1867
641C3268o7910N064O3320k1948m5206M1090K8286m7169j0838L3295j7621j7113
653b3482M4817P666m8560J1403L6353m4804l1232O6575K8099o1380o180M9284
665B8559k5796m5899L9302L4951l2801m324K7302k6988k4454M0557Q450m3956
677b5097J8636M6659l9981m1145N1965K4091n9392n880N6462j0069l9287K8410
689E372K0012m0402n153L2139j6731j3297M6098L034n9572N388M7810k9639l3535
702c8476N7467L0499o0955j9945M3547r375l1106L4383K4753l5073m596K4724
$$ y = [30917, -18186, -45754, 16273, 32594, -24708, -10725, 45897, 6699, -49100, -6685, 28178, -10650, -11524, 28693, 7299, -24400, 5477, 10108, -28395, -4161, 39285, -3204, -35539, 21401, 33268, -34642, -29578, 33742, 11794, -33412, 7678, 35964, -11205, -22043, 11252, -6369, -23482, 21335, 29001, -19559, -8156, 28197, -16607, -47839, 18736, 46835, -14545, -20725, 28559, 2763, -43136, -3834, 31117, -1684, -6008, 21294, -5694, -30148, 10409, 18859, -25097, -6461, 40198, 217, -40928, 11037, 35128, -24264, -30144, 26318, 16249, -23038, 5372, 25384, -15018, -20171, 11968, -4763, -18060, 28038, 31072, -28500, -23112, 24698, -4941, -38476, 18991, 49490, -11465, -31410, 12137, 2762, -28344, 6039, 30792, -4281, -8877, 15847]
714A5847k7424j9857M8444J2131n2103P920N0301k9704m5229M2164L0657m7812
726a4665j1650M6586l883l2118J9535J0776l5144M379L6097j7706j9030M0346
738B3523L540o0200J113N6187j1949l6478L5931K5475m9762k0873L7999K381j9109
751a2222K5173J0607l6724n44K8896k2959k0421M6005J5527n2889k917M9284j6028
764A0788m3529K8670L1080l3354j1542L4347m994k6260J6775O463l0301J2128
776i729L9077k1798l0001L3405J1043n0806j144N5813k706l9259J6573J9905l3762
789a3389j1865L2615K058j5037J9464J998l6616M245L4887j7895k5180L7065J9778
802C2128m5420j1926M1245l695l5122J6537K6407j9893r167K0599r158j9495J9086
$$ y = [15847, -11577, -31434, 17010, 29141, -22962, -15042, 35259, 5555, -39674, 2490, 33147, -14665, -26315, 20271, 16388, -15730, 3805, 14581, -20563, -16184, 19913, 2207, -16823, 23523, 27063, -33137, -32024, 24163, 12214, -24264, 11667, 37142, -12620, -33493, 4506, 6887, -12222, 12951, 23558, -13166, -13710, 15186, -7773, -28194, 17811, 33338, -19551, -22468, 26816, 10788, -32741, -4071, 27009, -6345, -17887, 16460, 11466, -14794, 1981, 8444, -21857, -9729, 29348, 7550, -22451, 10954, 21997, -28809, -29953, 25860, 23154, -16105, 468, 20373, -13389, -25254, 7361, 9419, -5618, 13846, 15844, -20772, -16527, 18360, 465, -24715, 12350, 32128, -13292, -25218, 16027, 12332, -22790, -6253, 20154, 261, -8906, 11693, 2535, -16960, 2126]
815B126P817k6275J0791L5792k1889l6416K5755K1743l4323o372M2929J338l5469
828a2453M194J5793j7748k378K4854m253j4929J7600J137l4276M812L7839j1551
841H641k9176K5490K2355l4570j7293L0569M836k2974R667J7508j4389o008J2882
854G538j1959j3815K3702J1150k6328J940L0151j5169l4588J8132K7686j8684
866b44j1904K4286K385k4413K35J1001p696L947J7501j0149j5851J6122M931k8180
880a8029J276L4794l153k8423J0928J9872k0393j6280J9194R057j0713M717O029
893H876j3083j616J1406j0755j0120K3664J2068k6155p102K4002m809k5979J0605
906h998K4960q323j3304Q771P36j1829L041O185n471O569J3286j3426j7190J4350
$$ y = [2126, 9943, -16332, -5541, 30251, 8362, -28054, -2299, 19444, -14879, -21251, 21678, 23016, -12453, -8259, 7534, -10214, -12592, 12262, 8009, -6920, 10680, 11817, -22459, -17647, 20192, 8641, -20535, 4955, 27310, -7260, -24553, 6016, 10852, -12122, -2455, 15053, 664, -5344, 7538, -4421, -18236, 5466, 16616, -9712, -7772, 22379, 7210, -27378, -9246, 18440, -244, -12148, 12138, 14523, -9890, -9655, 1346, -6350, -2403, 15098, 4949, -10902, 5220, 10151, -18029, -16753, 18041, 14888, -13535, -2607, 17265, -3128, -19408, -214, 8843, -1870, 2847, 8876, -4207, -5823, 5583, -5172, -15292, 8372, 20440, -5715, -12817, 11185, 6376, -19603, -8998, 15962, 7639, -5665, 3106, 3842, -7987, -4946, 1239, -4232, 2337, 15623, 2197, -14993, -643]
920f43J0453j9629l239K6482L008k3499j311J3824o265r146R313O837k781K077
934E481k740j2327K769J3234o698r642J6508J1181k0702j2579J6300N789j3887
947g313J869J5231j036j0167j907j139q57O967K057o503N175R785j2105j5852
961a5795J1102J4241r784p054J4008N274j4882p392P102L907l13J883P3N6K323
976D749n827j0503N556J4364k911j0395O599Q571j1329j1970Q128J0993k386m245
990f06K691K037l345n785l071N602R507p96q440J178O607o161j0784N696J3520
1005G850m68q908J46N125l255p802K30Q992O237l806o679Q43L824m292o525N129
1021c359J1292K59r371k890N072j10o948k40J0213O133p060p996K712M309m728
$$ y = [-643, 9810, -9819, -13058, 13424, 16432, -7067, -8378, 5446, -819, -9965, -652, 6185, 3404, 5481, 2741, -9586, -6817, 6417, -281, -9923, 6585, 17766, -2936, -15515, 785, 6574, -7313, -5444, 9787, 8751, -1416, -3323, -4462, -5319, 1648, 3705, -2798, 2377, 12162, 57, -15795, -4693, 9548, -236, -7290, 6718, 11992, -2890, -10282, -3180, 727, 414, 2297, 2370, 2426, 4749, -1078, -11581, -6025, 8339, 5428, -4967, 1632, 10203, -1126, -13096, -4968, 6025, 3639, -606, 2085, 4122, 777, -5008, -8079, -2477, 7030, 6234, -2206, -1028, 5579, -582, -11366, -5670, 7850, 7382, -1526, -1380, 3745, 490, -7312, -7082, 1910, 8147, 4341, -2338, -1495, 2329, -1963, -8488, -3359, 7933, 8192, -1179, -4069, 1003, 893, -6055, -6295, 3918, 10051, 2991, -5005, -2293, 2016, -2712]
1036b712m206P019Q676k588q456k322L499J157l351l70P483N909o939j0241K723
1051d719P755l719n746P920R144o325j0206J082M870p52j549K422M129K118m743
1066A681q898M08R516M58p691M448J0819o246j4074K754J0197k161m597N454M481
1081F549l824m847l121k98O509M532n869j728R146j656j5247j15J5268P78j0249
1096d172M030Q715o781r201K706M119J041L430l82m951K480K926j0026m842J4598
1111C690P282j2850l247J2183k616j4681K734J2330q24m196L200j000m708J682
1125a021q26n040P430J0985q737j1081R614N794j4755l471J7505L903j2719j50
1139b569P008n684n263N352J594n86O980j070j2626J522J1421p226j0167J4316
$$ y = [-2712, -6918, 101, 8777, 6189, -2267, -4589, -1090, 67, -3284, -3654, 3829, 9738, 2799, -7442, -4719, 3036, -683, -6429, 1491, 10635, 4310, -5896, -4814, 56, -696, -2245, 177, 4306, 6424, 1681, -7217, -6809, 2707, 3165, -4526, -78, 10741, 4495, -9579, -6825, 3372, 1211, -3386, 2068, 6549, 2725, -2122, -5243, -5541, 968, 5500, -369, -2097, 7049, 5393, -9854, -9969, 5299, 6077, -4172, -142, 8573, 1792, -7409, -4703, -584, 457, 3887, 3505, -1446, 1034, 3960, -6066, -10908, 3690, 10972, -1878, -5125, 7058, 4442, -10239, -7505, 4825, 4001, -195, 3005, 2005, -2703, -1021, -1847, -6887, 543, 11528, 2791, -8290, 1324, 7118, -7637, -11108, 6397, 10300, -2419, -2569, 4439, -1245, -6508, -1156, 438, -148, 6832, 5762, -6864, -5342, 6079, -1147, -11314, 3002]
1153C002J1712j4968r263J2030J516j2034L255J1073k511l454L206n510o077Q770
1167G47L700j0266L908J5048q372j7534Q621J2504j1240o080J5300L972j3065
1180b757j426N523m963n80Q674k273n484Q948J489j6545o16J7663k557j4405R766
1195D57J3256j3505j1672J0911M397q476L838P961o013k846N505p137p761J3455
1209B370Q357j4214k049J6059n467j9214P495J6335p786p707J0987J437j1840
1222e237J224N670n916K046J1509o120j1330J0288O444j6894l252K0010Q99j6665
1236g324M926J2628j0607j0220R998M265o318N241N083j0446k616R708n807r970
1250a1459J4393J2023j6053q672J4809j45j6418N628J6357n630r032O534m45r067
$$ y = [3002, 14714, -254, -9517, 2513, 4029, -8005, -4750, 6323, 3812, 358, 3564, -1946, -8023, 747, 4447, -5819, -1911, 13137, 4765, -12769, -4148, 8356, -2884, -8964, 6336, 10308, -2757, -4183, 1340, -3623, -4203, 4471, 2198, -3286, 5662, 7151, -9394, -10010, 7653, 5096, -9309, 457, 13713, 208, -11464, -553, 3844, -4632, -794, 7167, 1154, -1692, 3813, -3324, -11085, 2370, 10727, -3487, -5536, 10523, 5056, -14158, -6663, 9672, 1886, -5821, 5166, 6603, -5237, -4013, 1657, -4259, -2213, 9296, 3176, -8154, 2134, 8578, -8316, -11568, 8442, 9341, -7324, -2398, 10230, -377, -10597, -599, 3666, -2652, 2589, 7672, -2774, -5390, 4318, -1489, -11459, 2934, 14957, -1096, -9768, 5041, 4896, -11522, -5894, 10463, 4833, -4199, 2335, 1890, -7177]
1264g177N322O800q164N93J2818o694j5196J0148J1834j4511o940J8055L579j6103
1278e636J398J0925p841p255R679K476o148O681L638j4452k859J4676k631j2054
1292i403J2180J2765j6619j2202J3870M505j1661M623J2171p207q264N836j472
1305h78o689R460P241j2222k575J3950m390j5903Q799J4242j1612r204J4157M661
1319I037j3149j83Q092o104l625J0024L62p646O482L609j5341l058J8013J381
1333G894j3873O352J1239j3816j1727J3022P650q044K161O531q822n635Q339r34
1347C37o769J0092P399j4726n736J5180l9j5284N469J3983q396r383J0385M115
1361F627j0276J78N992n677o96J1075k064j0993N644O142j2994l567J8189L751
$$ y = [-7177, -1855, 4945, -3219, -2626, 10192, 3498, -11698, -1550, 10284, -4227, -11167, 6888, 10467, -5636, -4238, 6687, -1154, -8409, 1270, 3746, -2402, 4279, 7917, -6535, -9394, 5282, 2651, -9403, 2777, 15542, -1077, -13279, 591, 5096, -6565, -1942, 10229, 3022, -5242, 594, -878, -7567, 1893, 9134, -3088, -5663, 8287, 3897, -12006, -3207, 11035, -577, -9781, 4376, 9037, -4112, -4295, 3797, -2307, -5932, 4092, 4454, -3192, 3290, 6899, -8442, -11500, 6513, 7894, -5979, 373, 11612, -2204, -13931, -909, 6741, -1303, 858, 7389, -1433, -7068, 1271, 337, -6432, 3660, 11059, -3667, -9403, 5777, 5738, -9546, -4077, 9906, 1510, -7873, 2512, 6627, -3649, -3471, 2521, -3156, -3852, 7223, 5159, -5834, -190, 5952, -7042, -10609, 7580, 11331]
1375A1331j5285J33R517q073p973J1179O912o842J9K671q686k169J1118l75q766
1390e289P486P707j3361p269J4242L551j3076J766J1588n013p692O725K148p691
1404d178K063N342n733Q7J0656l845j3174N286R603q970m497J4441L208j4631
1418d342k365Q585l036l672Q517K557p334O93K333p935j24J2503n23j1154M510
1433g87Q613r798p730J1264N342r699n63Q196k924n557M153L95n356M239N442
1448E230o438j913R067k669j2336M203J1694m813o662Q113K978j0571k409P303
1462G77%j550N193j007p158K265L898o659p87J1458L20j1556J439Q647n582p028
1478g330P635N440o104j253M386k926l114M029m99m208N439N200p671m263P920
$$ y = [11331, -3954, -3821, 5696, -2377, -10350, 829, 7741, 899, 918, 3589, -5097, -7266, 3852, 3477, -5289, 2197, 9904, -3457, -10726, 3516, 7067, -6009, -4243, 7345, 2332, -5360, 1365, 3513, -4178, -2115, 3227, -2506, -2419, 8237, 4392, -8782, -3496, 6107, -2863, -7360, 7081, 10289, -4342, -6707, 1878, -1158, -4830, 3687, 6244, -1090, -397, 1936, -5999, -6123, 6380, 5857, -5297, -787, 7826, -1972, -9702, 1562, 6904, -2795, -3358, 4838, 1914, -3643, 510, 905, -4451, -212, 5230, -1208, -3121, 5946, 3277, -9059, -4856, 6838, 2025, -4637, 3476, 6454, -4117, -6526, 777, 777, -773, 4420, 3413, -3745, -1480, 2418, -4241, -5028, 6430, 6750, -4806, -3367, 5280, -302, -7330, 305, 5745, -359, -1612, 2774, -152, -3266, 763, 264, -3944, 1495, 6695, -976, -5239, 2681]
1493B681K11r426K777J0462k656p405L182K472n454l94N102k27p35L285k882o430
1509e437L547N468n163k315Q681J344r831j109P238j507m913M167M016l361j413
1524e88J238k885o57M814m60m157M139M320p039n113O732L140o041M25O800j437
1540C231n918O22J860j483J509K715k050p19K995k778n588L774O262l546l797
1555b911N220J950o796k165N101J220k205J446J236k027m65O4k591Q62N258l43
1571B854m825J613L816m358m475M698M512l040j900K684k81l078k36J033O28K304
1587A949Q29l367j095K970j196m162K657N671j785m457J608K123l047j815K806
1602c11K135j90l72j372j440J113N27k101R22M514l07m930l75L303j136k865K321
$$ y = [2681, 2892, -6534, -3757, 6705, 4049, -3356, -174, 2298, -3156, -3550, 1552, 1325, 590, 3875, 993, -5437, -1890, 3578, -1585, -3900, 4781, 6125, -3706, -4815, 2423, 916, -3997, 170, 4186, 825, -588, 650, -2235, -2892, 1922, 1462, -2695, 1444, 5764, -1275, -6388, 344, 3484, -2557, -2132, 4668, 3231, -2687, -2065, -205, -1688, -179, 2536, 486, -233, 2762, -16, -5604, -1830, 4432, 886, -2911, 2309, 4259, -2537, -4702, 399, 1619, -586, 860, 2096, 69, -396, -332, -2923, -2061, 3197, 2854, -1971, -358, 3458, -900, -5375, -677, 3835, 795, -1105, 1579, 1298, -1780, -2016, -983, -355, 1949, 2778, -589, -1684, 1286, 90, -4072, -1415, 4256, 2471, -1986, -378, 1745, -1302, -3117, -311, 1824, 1634, 1262, -110, -1550, -437, 90, -2011, -1089, 3425, 3118, -1812, -2187, 1116, -20, -2885, -564]
1619e64L636r13k582n53J59M2K92p7P38K259j21l781j356K944P56k480Q47L728
1637B974m10l857r71J807N23o67M40J411Q05j145k606p64K284J332j491j8K568
1654B215o1l661j423K474J530j058j97J564M44j988k103L74K221R64j062j86J463
1671A510l08k868j105K435J986r05r49J039N24j964j972J079K642N15j496k27
1687f4J141p06k350k58K520J624r27j145M09L55j388j449J159K733M54k072p02
1704f66J285m39k252K64K947J106j647j082M76jj040m94J209K036L59k056j323
1721a318J189M21j850J1L118J100k543j434J153J57j257K25J690J047l65j512
1737a68j295O43J112q63m83K428J380k787k191J689J168j545n3K349O38j675j216
$$ y = [-564, 3072, 2159, -423, -976, -817, -775, -483, -560, 178, 2437, 2316, -1465, -2821, 123, 879, -1601, -754, 2974, 2564, -1293, -2264, -457, 66, -601, -161, 1250, 2055, 910, -1696, -2460, -176, 1156, -335, -353, 2215, 2154, -1507, -2930, -456, 1074, 16, -181, 1383, 1827, -161, -2264, -1890, 331, 1295, 233, 47, 1510, 1202, -1666, -2771, -336, 1650, 745, -204, 835, 1359, -605, -2577, -1498, 1144, 1659, 163, -64, 1077, 371, -1979, -2237, 283, 1907, 980, -165, 244, 599, -789, -2238, -1079, 1654, 2108, 36, -666, 619, 180, -2072, -1808, 1139, 2245, 598, -484, -8, -9, -1049, -1543, -334, 1702, 2061, 5, -1318, -129, 292, -1558, -1547, 1571, 2671, 128, -1306, -153, 4, -1253, -1028, 662, 1709, 1344, -168, -1463, -820, 292, -571, -1054, 1374, 2754, -33, -2224, -535, 633, -912, -965, 1384, 2022, 347, -869]
1754h69k16K74Q41K48m11R98J215k013k649J426K392j196j106K297J109k607j681
1771a948J152P91j32N45L53j31J75r18k004O36K791j46j985J201J794k398k509
1788b733J809K057q58l51J147k33j188l89m60J53K000Q19j931l83J839j095k861
1805b658J361L232o90j926J117P56j938r31J147O91M68P38r02j344Q43L74k001
1822a663J97L291L13k921m8J939j310j981J607K016n66n58J40r05m93P77k92m18
1840h75K076J141k661j490K103K74k319Q55K986n03k235J98N02r23J63J070q6
1857B76K88R08j434j996J398J652j680o01K788M64k972o15J841l17j115J238J129
1874A252o55k79k63j380J14J909j15j228J471J223k622j879K158J366j492J63
$$ y = [-869, -1085, -811, 30, 278, -133, 865, 2080, 67, -2582, -1156, 1236, 40, -1066, 1231, 2340, -267, -1948, -796, -5, -137, 408, 761, 630, 805, -113, -2117, -1481, 1310, 1164, -821, 380, 2174, -224, -2733, -924, 1133, 275, -76, 1071, 838, -350, -739, -1199, -1046, 954, 1773, -158, -541, 1298, 203, -2658, -1297, 1935, 1245, -681, 436, 1192, -746, -1677, -530, 161, 629, 1367, 465, -879, -36, 338, -1663, -1466, 1825, 2138, -783, -831, 1108, -202, -2183, -576, 1440, 874, 316, 456, -449, -942, -165, -457, -875, 1201, 2342, -319, -1809, 294, 568, -1751, -896, 2090, 1587, -648, -450, 52, -871, -708, 362, 276, 564, 1472, 38, -1958, -560, 1092, -588, -1189, 1599, 2063, -909, -1524, 317, 0, -1115, 123, 1252, 597, 318, 55, -1325, -1211, 698, 583, -645, 826, 2049, -573, -2452, -294, 1072, -420, -257]
1890b57J846o06j902qM79r7R51P40j062l07J136r65j951J408K235j252j373J721
1908G36O85k193p12J472K24m06Q14J99q43P4j17j439L70K459Q3j880M84J127j894
1927g57j500K035J707r12m59N02q04r02N62L90L7J115L02j846o09J585j24j610
1945a288R22J943r22j541Q89P24j199m74Q73K83R5N84m89j062L17L60j044L28
1963g01K225J74k160m60R94o18p06J513J319p44r28l26n62J81J142J63m44O62
1981G24J14j731n17J723N10j303J84J261m90j092L51M43m54k6M13j5L49M97r36
2000Ej212O52Q96n50P0J441j05j946o62R80M42M2O81K60p63p08l67j11Q53J171
2020A069k78r77J70K60r47l05J312O49q91l74N59k1n02l3J34O0L16J22k72J86
$$ y = [-257, 1589, 983, -919, -927, -448, -545, 406, 1146, 84, -223, 913, -52, -2003, -595, 1640, 388, -985, 736, 1421, -772, -1484, -12, 212, -194, 620, 819, -24, 50, -67, -1506, -1136, 1323, 1406, -474, 10, 1137, -757, -2257, -222, 1485, 573, 114, 616, -188, -1090, -528, -138, -101, 1014, 1316, -530, -1139, 446, 322, -1288, -366, 1577, 655, -886, 3, 727, -472, -946, -73, 210, 305, 889, 400, -662, -345, 15, -1029, -701, 1524, 1698, -462, -922, 72, -546, -1252, 261, 1580, 836, -92, -418, -980, -799, 343, 506, 62, 724, 838, -893, -1410, 313, 823, -480, -296, 965, 475, -617, -266, 177, -277, -303, 110, 95, 444, 941, 5, -1207, -555, 341, -209, -139, 1302, 1197, -749, -1411, -431, 11, 53, 734, 994, 231, -477, -844, -955, -102, 1069, 791, -186, -16, 244, -703, -1008, 304, 953, 62, -312, 247, 226, -276, -309, -175, -115, 201, 323, 51, 237]
2040B37K81q43q56P82J123j97l78L72k56j097k62Q66P64K86j46o42n60K3NN6Q27
2061C85P65o30j070N9M34k39p0O57L64m19m16l6J06N7r1j28L13N23j76n63j1K10
2083B4l67k63O54P37j40o16l32j07k1J44M18N05J68n95q30p9N19J98N0M05K30
2104G02n87o96K5L87K26R8P2M0m1l04l89P7M90N4k25K38L76l83o00J8L01N7J26
2127F2K96Q8k20l79m21M4N88L53j47JJ27m92o25K33O61J44n5R8j62m12j67N1J70
2150a64M00K79l10k90J38j29m63J86O77O3l33Q1O7m38k46K53K56J42K39p4m52
2171a18j17R6k19N9O43K79m90k71J69k38l18L98N13o6j29Ll27l04K22K18m7K93
2193B49K99m30m86J88J29k62K06N73m7m48k7l5l05J07M43O9q0J74j89n33LM08
$$ y = [237, 518, -325, -1181, -399, 724, 527, 149, 521, 265, -832, -1094, -228, 536, 822, 676, 34, -526, -503, -498, -442, 385, 1150, 520, -550, -491, -57, -296, -366, 291, 655, 236, -180, -216, -110, -53, -144, -272, 41, 564, 388, -175, -186, 24, -343, -606, 48, 785, 645, 29, -303, -410, -431, -287, 131, 636, 804, 209, -621, -700, -181, 17, 67, 472, 702, 115, -581, -556, -169, 57, 155, 227, 267, 226, -78, -467, -390, 100, 154, -71, 167, 543, 160, -440, -422, -121, -64, 62, 358, 446, 226, -153, -574, -530, 58, 411, 264, 265, 392, -100, -725, -492, 169, 313, 258, 356, 194, -218, -385, -334, -164, 236, 515, 205, -85, 53, -76, -539, -353, 324, 387, 54, 135, 202, -236, -482, -229, 27, 169, 408, 334, -118, -235, -139, -358, -299, 344, 623, 133, -138, 31, -207, -525, -127, 386, 320, 191, 194, -133, -437, -215, 3, -44, 249, 548, 118, -368, -180, -51, -313, -107, 466, 419, -29, -56, -91, -396, -289, 154, 223, 143, 317, 128, -405, -402, 6]
2215Fk5l9M33Q2n65k27K10p1m2M36K44k95j40J6k97j53M14K99j50K7J64l89l89
2238d51K29K60o0J54K97k33m19L6O4j46K10M32p3l06K1o3l12P3M11R8r9J01r0
2261A34m03p5K81L8J7K95O0l82k03J21m0n1L01K50j44j60n3j97q4K42K04rO2M7
2285B51k96k97J45K05jQ0K10o4l18j53M5P1J28J49M1l7j07k13j42J23K47Q1k9
2308A19M7j2k53k32J18K65Q6k2J5K4j85k44K6K29J60K1j1n6q8j33j31Q1K97J82
2332C03j78j45R6p6l15M6M22J29k19k2O0j96j65J01J46J19J57j05k84LJ57k29
2354a95j11M81K80m32k37K98p1l66J66M03k3j06L3j79j96K13P5k21K57M42l70
2375A41n51L15L28m63q8O33J11n21l1J94k35n3L42j7j51L27k6o74N0O63j95n21
$$ y = [6, -19, -58, 375, 457, -108, -335, -125, -196, -238, 198, 442, 147, 7, 23, -274, -427, -13, 286, 136, 163, 327, -62, -451, -222, 38, -22, 132, 429, 196, -223, -187, -123, -269, -59, 373, 300, -6, 15, -48, -360, -287, 124, 222, 123, 224, 134, -269, -344, -63, -25, -8, 287, 347, -35, -238, -117, -157, -208, 93, 343, 199, 39, -14, -211, -295, -53, 151, 142, 204, 251, -45, -342, -197, 8, 7, 87, 297, 233, -85, -238, -193, -122, 6, 155, 196, 159, 52, -161, -303, -180, 67, 148, 119, 166, 154, -99, -331, -213, 52, 138, 116, 131, 155, -30, -274, -248, -19, 141, 162, 151, 95, 7, -126, -257, -176, 121, 303, 125, -20, 76, 0, -315, -269, 153, 282, 63, 41, 101, -95, -260, -159, -13, 106, 263, 158, -126, -123, 34, -195, -306, 175, 455, 23, -214, 84, 13, -353, -187, 216, 193, 87, 120, -59, -255, -42, 33, -188, 69, 511, 141, -410, -95, 233, -230, -318, 315, 426, -95, -126, 68, -167, -220, 122, 105, -46, 281, 255, -419, -369, 294, 99, -422]
2397d22N45N13p03m47N53J29m73K39M36k92j47K46l15l52O14L20o82L7Q00l80
2417B19r48M98P52n60l50P46P9p21P2L64l78M5O30k96n37N96K73j022p5J172j19
2438D40r91M84P76q10n89P91J90n79L40M10o38j28O67m30o64R31O25j134k76J190
2458F05k32j234N43J054o63n39P86J9q19L65M75o87P7J011n33j021Q62P13j284
2477e02l22J517Oj368M09R65q31n55R30R6p31N44M24j045q9J193m71j120J097
2496A47R78j438o34J483L5j405M99J174p80n91Q82j35r07P39O09j103m7J434n68
2515C72j505J020J180j371o70J638J69j532L34J052q39m90J111j10r67Q09O00
2532H01j442j87J706l64j605J033J336j500r31J580K78j419M35J089q80n24J077
$$ y = [-422, 123, 636, -67, -514, 39, 168, -305, -66, 370, 78, -69, 177, -138, -490, 124, 444, -238, -201, 599, 219, -729, -231, 521, -39, -389, 357, 436, -285, -213, 151, -227, -182, 448, 152, -385, 211, 484, -538, -613, 559, 440, -551, -67, 709, -101, -690, 101, 291, -288, 52, 462, -176, -304, 363, -67, -731, 200, 825, -309, -585, 605, 373, -861, -318, 736, 73, -466, 320, 339, -480, -115, 360, -327, -250, 761, 228, -793, 69, 782, -502, -824, 693, 699, -669, -260, 705, -126, -681, 249, 345, -386, 158, 582, -463, -552, 641, 170, -950, 147, 1125, -313, -947, 536, 571, -834, -335, 839, 59, -532, 350, 215, -692, 47, 656, -447, -494, 940, 372, -1133, -113, 1067, -304, -974, 664, 833, -699, -365, 687, -152, -642, 469, 359, -608, 201, 801, -641, -828, 878, 514, -1091, -58, 1278, -222, -1153, 427, 705, -714, -279, 810, -70, -594, 483]
2549D83k78j093J022Q61j526k96J828l81j866R13J558j327r51J609K68j498L29
2566c45J007r12l47J321l27j279J036Q94j725m11K071j23j967P84J567j345j067
2583a168J545L81j374M30R63j084l74J391m08j393J190J160j771o36K071l6k094
$$ y = [483, 205, -888, 134, 995, -531, -827, 1001, 620, -1246, -333, 1225, -102, -1053, 556, 824, -674, -345, 662, -250, -597, 724, 397, -882, 154, 1048, -677, -1088, 983, 860, -1107, -323, 1244, -101, -1168, 377, 758, -616, -186, 777, -307, -681, 710, 302, -1091, 99, 1259, -512, -1148, 923, 887, -1207]
$$ [...]
8191a6
##END NTUPLES=NMR FID
##END=
