##TITLE=1H_LY-Ni-400-ac 240
 CDCl3, 8 sc, 
 18.1.2019
##JCAMPDX= 6.0         $$ Bruker NMR JCAMP-DX V2.0
##DATA TYPE= NMR FID
##DATA CLASS= NTUPLES
##ORIGIN= UXNMR, Bruker Analytische Messtechnik GmbH
##OWNER= root
$$ XWIN-NMR		Version 3.5
$$ Fri Jan 18 14:46:02 2019 Russian Standard Time (UT+4h)  she@DPX200
##.OBSERVE FREQUENCY= 200.1313
##.OBSERVE NUCLEUS= ^1H
##.DELAY= (6, 6)
##.ACQUISITION MODE= SIMULTANEOUS
##.ACQUISITION SCHEME= undefined
##.AVERAGES= 8
##.DIGITISER RES= 18
##SPECTROMETER/DATA SYSTEM= spect
##.PULSE SEQUENCE= zg30
##.SOLVENT NAME= CDCl3
##.SHIFT REFERENCE= (INTERNAL, CDCl3, 0, 15.7039)
##AUDIT TRAIL= $$ (NUMBER, WHEN, WHO, WHERE, WHAT)
$$ ##TITLE= Audit trail, XWIN-NMR		Version 3.5
$$ ##JCAMPDX= 5.01
$$ ##ORIGIN= Bruker BioSpin GmbH
$$ ##OWNER= she
$$ F:/spectra/data/she/nmr/H-F/1/audita.txt
$$ ##AUDIT TRAIL=  $$ (NUMBER, WHEN, WHO, WHERE, WHAT)
(   1,<2019-01-18 14:44:47.59 +0400>,<she>,<DPX200>,
      <created by zg, POWCHK disabled, PULCHK disabled
       configuration hash MD5:
       00 E9 B6 7A A2 85 ED C7 34 08 36 98 17 FE 4E 26
       data hash MD5: 16K
       46 F6 56 13 2A 22 3A CF 2D 82 F3 2D E6 EA C5 AE>)
$$ ##END=
$$ 
$$ hash MD5
$$ AD CA 54 B7 E2 F8 8E C0 CF C5 BA 5F DA 80 43 2E
##$RELAX= 
##$RELAX= 
##$RELAX= 
##$RELAX= 
##$RELAX= 
##$RELAX= 
$$ Bruker specific parameters
$$ --------------------------
##$DU= <F:/spectra>
##$EXPNO= 1
##$NAME= <H-F>
##$PROCNO= 1
##$TYPE= <nmr>
##$USER= <she>
##$AMP= (0..31)
100 100 100 100 100 100 100 100 100 100 100 100 100 100 100 100 100 100 
100 100 100 100 100 100 100 100 100 100 100 100 100 100 
##$AQSEQ= 0
##$AQ_mod= 1
##$AUNM= <au_zg>
##$AUTOPOS= <>
##$BF1= 200.13
##$BF2= 200.13
##$BF3= 200.13
##$BF4= 200.13
##$BF5= 200.13
##$BF6= 200.13
##$BF7= 200.13
##$BF8= 200.13
##$BYTORDA= 1
##$CFDGTYP= 0
##$CFRGTYP= 5
##$CHEMSTR= <none>
##$CNST= (0..31)
1 1 145 1 1 1 1 1 1 1 1 1 1 1 1 1 1 1 1 1 1 1 1 1 1 1 1 1 1 1 1 1 
##$CPDPRG= <>
##$CPDPRG1= <>
##$CPDPRG2= <>
##$CPDPRG3= <>
##$CPDPRG4= <mlev>
##$CPDPRG5= <mlev>
##$CPDPRG6= <mlev>
##$CPDPRG7= <mlev>
##$CPDPRG8= <mlev>
##$CPDPRGB= <>
##$CPDPRGT= <>
##$D= (0..31)
0 1.2 0 0 0 0 0 0 0 0 0 0.03 0 0 0 0 0 0 0 0 0 0 0 0 0 0 0 0 0 0 0 0 
##$DATE= 1547808287
##$DBL= (0..7)
120 120 120 120 120 120 120 120 
##$DBP= (0..7)
150 150 150 150 150 150 150 150 
##$DBP07= 0
##$DBPNAM0= <>
##$DBPNAM1= <>
##$DBPNAM2= <>
##$DBPNAM3= <>
##$DBPNAM4= <>
##$DBPNAM5= <>
##$DBPNAM6= <>
##$DBPNAM7= <>
##$DBPOAL= (0..7)
0.5 0.5 0.5 0.5 0.5 0.5 0.5 0.5 
##$DBPOFFS= (0..7)
0 0 0 0 0 0 0 0 
##$DE= 6
##$DECBNUC= <off>
##$DECIM= 32
##$DECNUC= <off>
##$DECSTAT= 4
##$DIGMOD= 1
##$DIGTYP= 9
##$DL= (0..7)
0 120 120 120 120 120 120 120 
##$DP= (0..7)
150 150 150 150 150 150 150 150 
##$DP07= 0
##$DPNAME0= <>
##$DPNAME1= <>
##$DPNAME2= <>
##$DPNAME3= <>
##$DPNAME4= <>
##$DPNAME5= <>
##$DPNAME6= <>
##$DPNAME7= <>
##$DPOAL= (0..7)
0.5 0.5 0.5 0.5 0.5 0.5 0.5 0.5 
##$DPOFFS= (0..7)
0 0 0 0 0 0 0 0 
##$DQDMODE= 0
##$DR= 18
##$DS= 0
##$DSLIST= <SSSSSSSSSSSSSSS>
$$ [...]
##$SUBNAM2= <"">
##$SUBNAM3= <"">
##$SUBNAM4= <"">
##$SUBNAM5= <"">
##$SUBNAM6= <"">
##$SUBNAM7= <"">
##$SUBNAM8= <"">
##$SUBNAM9= <"">
##$SW= 20.0189088683792
##$SWIBOX= (0..15)
0 0 2 0 0 0 0 0 0 0 0 0 0 0 0 0 
##$SW_h= 4006.41025641026
##$TD= 16384
##$TD0= 1
##$TE= 0
##$TE2= 300
##$TE3= 300
##$TEG= 300
##$TL= (0..7)
0 120 120 120 120 120 120 120 
##$TP= (0..7)
150 150 150 150 150 150 150 150 
##$TP07= 0
##$TPNAME0= <>
##$TPNAME1= <>
##$TPNAME2= <>
##$TPNAME3= <>
##$TPNAME4= <>
##$TPNAME5= <>
##$TPNAME6= <>
##$TPNAME7= <>
##$TPOAL= (0..7)
0.5 0.5 0.5 0.5 0.5 0.5 0.5 0.5 
##$TPOFFS= (0..7)
0 0 0 0 0 0 0 0 
##$TUNHIN= 0
##$TUNHOUT= 0
##$TUNXOUT= 0
##$USERA1= <user>
##$USERA2= <user>
##$USERA3= <user>
##$USERA4= <user>
##$USERA5= <user>
##$V9= 5
##$VALIST= <valist>
##$VCLIST= <CCCCCCCCCCCCCCC>
##$VD= 0
##$VDLIST= <DDDDDDDDDDDDDDD>
##$VPLIST= <PPPPPPPPPPPPPPP>
##$VTLIST= <TTTTTTTTTTTTTTT>
##$WBST= 1024
##$WBSW= 4
##$XGAIN= (0..3)
0 0 0 0 
##$XL= 0
##$YL= 0
##$YMAX_a= 102560
##$YMIN_a= -103713
##$ZGOPTNS= <>
##$ZL1= 120
##$ZL2= 120
##$ZL3= 120
##$ZL4= 120
##$ABSF1= 10
##$ABSF2= 0
##$ABSG= 5
##$ABSL= 3
##$ALPHA= 0
##$AQORDER= 0
##$ASSFAC= 0
##$ASSFACI= 0
##$ASSFACX= 0
##$ASSWID= 0
##$AUNMP= <proc_1d>
##$AZFE= 0.1
##$AZFW= 0.1
##$BCFW= 1
##$BC_mod= 2
##$BYTORDP= 1
##$COROFFS= 0
##$CY= 11.3945322036743
##$DATMOD= 1
##$DC= 2
##$DFILT= <>
##$DTYPP= 0
##$F1P= 18.9103706918063
##$F2P= -1.10871071338519
##$FCOR= 0.5
##$FTSIZE= 0
##$FT_mod= 4
##$GAMMA= 1
##$GB= 0.15
##$INTBC= 1
##$INTSCL= 1
##$ISEN= 128
##$LB= 0.24
##$LEV0= 0
##$LPBIN= 0
##$MAXI= 10000
##$MC2= 0
##$MEAN= 0
##$ME_mod= 0
##$MI= 1.114404
##$NCOEF= 0
##$NC_proc= 0
##$NLEV= 6
##$NOISF1= 3.799351
##$NOISF2= 2.8
##$NSP= 1
##$NTH_PI= 0
##$NZP= 0
##$OFFSET= 15.70392
##$PC= 1
##$PHC0= -9134.252
##$PHC1= 11.20004
##$PH_mod= 1
##$PKNL= yes
##$PPARMOD= 0
##$PSCAL= 0
##$PSIGN= 0
##$REVERSE= no
##$SF= 200.130013532006
##$SI= 16384
##$SIGF1= 3
##$SIGF2= 2
##$SINO= 400
##$SIOLD= 16384
##$SREGLST= <1H.CDCl3>
##$SSB= 0
##$STSI= 0
##$STSR= 0
##$SW_p= 3612.71676300578
##$SYMM= 0
##$S_DEV= 0
##$TDeff= 0
##$TDoff= 0
##$TI= <>
##$TILT= no
##$TM1= 0
##$TM2= 0
##$TOPLEV= 0
##$USERP1= <user>
##$USERP2= <user>
##$USERP3= <user>
##$USERP4= <user>
##$USERP5= <user>
##$WDW= 1
##$XDIM= 8192
##$YMAX_p= 0
##$YMIN_p= 0
$$ End of Bruker specific parameters
$$ ---------------------------------
##NTUPLES= NMR FID
##VAR_NAME=  TIME,          FID/REAL,        FID/IMAG
##SYMBOL=    X,             R,               I
##VAR_TYPE=  INDEPENDENT,   DEPENDENT,       DEPENDENT
##VAR_FORM=  AFFN,          ASDF,            ASDF
##VAR_DIM=   8192,          8192,            8192
##UNITS=     SECONDS,       ARBITRARY UNITS, ARBITRARY UNITS
##FACTOR=    0.0002496,     1,               1
##FIRST=     0,             0,               0
##LAST=      2.0444736,     0,               0
##MIN=       0,             -103713,         0
##MAX=       2.0444736,     102560,          0
$$ Real data points
##PAGE= N=1
##DATA TABLE= (X++(R..R)), XYDATA
$$ [...]
1925H37j063p30J369N42j437k39J173p3p30L29J51m37M17M19q73j61J065k69j067
$$ 837 -226 -956 413 955 -482 -721 452 379 -351 -22 129 -308 109 528 -345 -506 559 290 -777
1944g77P72R64j115q23J185N82r50k21N69j49k04L86j33l85M10K31o54kP92k40
$$ -777 -5 959 -156 -979 206 788 -162 -383 186 37 -167 219 86 -299 111 342 -312 -314 478 238
1964B38q26M07Q34m60p76L81N85k19l09J37M2j81R1J90j10m1J11j93k16M32L43
$$ 238 -588 -181 653 193 -583 -202 383 164 -145 -8 34 -147 -56 134 24 -17 94 -99 -315 117 460
1985D60n79l94O63L26p19j59O81m0n41L21L42n43j54N86m8l99L33Q4o58J91Q59
$$ 460 -119 -513 150 476 -243 -402 279 239 -302 19 361 -182 -336 250 202 -197 136 220 -438 -247 612
2006F12l93p67N58M33p16o4Q24k84p25N06N03o44j85O11j57m14M67J79p15M1P35
$$ 612 219 -548 10 443 -273 -337 487 203 -522 -16 487 -157 -342 269 112 -302 165 344 -371 -330 405
2027D05k20n25M62J79o96O4Q19j95p07K74M49l75j65M24m0l69J96K18k66o0K95
$$ 405 185 -340 122 301 -395 -331 488 293 -414 -140 309 -66 -231 193 153 -216 -20 198 -68 -128 167
2048A67j35k33L45J73n59j69O54J92o03j24M74o5l73K16L23k24k82J68R9l9J18
$$ 167 32 -201 144 317 -242 -411 243 435 -168 -292 182 117 -256 -40 283 59 -223 -55 44 5 123
2069A23m9l45K06M90l76n57M88N45n37m31O02J87o21k5N82l0l86K8K4rL39Qo09
$$ 123 74 -271 -65 425 49 -508 -20 525 -12 -443 159 346 -275 -300 282 252 -134 -106 -82 -91 248 256 -353
2092c53O2P32k00p58M07P13n55n90O00M34n59k91L82J72r5p4k35l3N15Q3o62m8
$$ -353 -291 441 241 -517 -110 603 48 -542 58 492 -67 -358 24 196 101 27 -208 -241 274 357 -305 -353
2114c53P33j07p61K48P79k93p49K30O40r4m63n3K46K29o6l80p4M77J93n76j88
$$ -353 380 273 -488 -240 539 246 -503 -273 367 273 -190 -243 3 232 166 -214 -288 189 382 -194 -382
2135c82O51J67p64j84Q31K58p92l22O11L86l95l50J61L13M2l41k01L96L72n08
$$ -382 269 436 -328 -512 319 577 -215 -537 74 460 65 -285 -124 189 231 -110 -311 85 457 -51
2155e1n01O04O19o72o89O26P35n35o66L40N45j38m02o6L22K48l11m57L53O72l78
$$ -51 -552 52 671 -1 -690 -64 671 136 -530 -190 355 217 -185 -251 71 319 8 -449 -96 576 198
2176A98q44L45R52k69r60J79Q53m7p10o8N40J95l93l46K93N24k01p29J02R00L5
$$ 198 -646 -301 651 382 -578 -399 454 407 -303 -371 169 364 -29 -375 -82 442 241 -488 -386 514 549
2197E49r99j70R71K87q86l33P33L78n58m43M05M90k14o10L4P22J78q25l83Q61
$$ 549 -450 -620 351 638 -248 -581 152 530 -28 -471 -66 424 210 -400 -366 356 534 -291 -674 187
2217A87N40q01o53O96O85n59o80M22O68k51o87P0P05J78p41l98O90O39o19p95
$$ 187 727 -74 -727 -31 654 95 -585 -163 505 254 -433 -363 342 520 -221 -619 71 710 91 -704
2237g04N03Q75l63q95K46Q67j13q31m6P98K30p69m29O74O37n25p93L22Q91j33
$$ -704 -201 674 311 -584 -338 529 416 -415 -461 337 567 -202 -631 43 680 155 -638 -316 575 442
2257D42r31k0R09J70q96k78Q59L94p97n42O81O89m99p99K55Q77lq84k24Q71L96
$$ 442 -489 -509 400 570 -326 -604 255 649 -148 -690 -9 680 181 -618 -363 514 511 -373 -597 274 670
2278F70q32n34Q03O18p28p19O24Q11m36q77J88R06P3q62l40Q03N47p42o77O70
$$ 670 -162 -696 107 725 -3 -722 -98 713 277 -600 -412 494 567 -295 -635 168 715 -27 -704 -34
2298c4P68n74q69M57R26k86r65N2R67J93q99m60Q10O56o77p91N47Q70m23r07K58
$$ -34 734 160 -709 -252 674 388 -577 -525 442 635 -264 -724 86 742 65 -726 -179 691 268 -639 -381
2319c81R67q7r79j51R67L99q98o21P69Q15o25q99M41R45k65r58Q3R67J11r40l47
$$ -381 586 499 -480 -631 336 735 -163 -784 -15 800 175 -724 -283 662 397 -561 -478 489 600 -340 -687
2340f87R08N78q37p74O91R33n10j006K98J028j15r89r1R35L05r02n14Q39P13p28
$$ -687 221 799 -38 -812 -121 812 302 -704 -406 622 507 -482 -573 362 667 -235 -749 90 803 75
2360G5q92N65J023l54j079J37J055Q8r80l14R19M92q29o65P26Q52n98r85M12J076
$$ 75 -817 -252 771 417 -662 -525 530 618 -362 -676 243 735 -94 -759 -33 819 221 -764 -352 724
2380G24k07j081n3J047K89r54n09Q44O85p28q25N94R56m52j049K58J112m0j099
$$ 724 517 -564 -617 430 719 -235 -744 100 785 57 -768 -174 782 330 -719 -461 651 611 -488
2399d88k18J021M56q88o78P52Q38o01r65M49J054k88j108R8J114J35j077l65R68
$$ -488 -706 315 771 -117 -795 -43 795 194 -771 -322 732 444 -664 -566 548 683 -394 -759 209
2418B09O19q37q03O38R51m38j053K72J103q5j117j10J096L30j036n58R11P61p38
$$ 209 828 -9 -812 -174 777 339 -714 -442 661 576 -541 -651 445 775 -261 -819 92 853 115
2437A15r29N29J052l24j108J01J121J06j101k93J022N13r25p31Q01R06o13j043
$$ 115 -814 -285 767 443 -665 -564 557 663 -438 -731 291 804 -121 -852 -51 855 242 -801
2455h01L89J123j66j128o2J091K71j010m97R32O90q07q72O53J031m58j133K30
$$ -801 -412 711 545 -583 -645 446 717 -293 -790 142 832 25 -847 -194 837 379 -754 -524
2473e24J174Lj134k45J067M59r51o49Q09Q28o64r77M74J104k73j175M4J192J81
$$ -524 650 653 -481 -726 341 800 -151 -800 9 837 173 -804 -330 774 501 -674 -630 562 743
2492G43j128m19J015O25q69p95O90R52m98j066K98J150r0j188j58J182L67j079
$$ 743 -385 -804 211 836 -33 -828 -138 814 316 -750 -452 698 608 -580 -738 444 811 -268
2510b68n89R36P81p49r35N53J035l37j097J05J155J11j149l29J099N61j006p53
$$ -268 -857 79 860 111 -824 -271 764 427 -670 -565 590 701 -448 -777 322 883 -123 -876
2528h76Q31R13o16j043M08J103j83j129m6J106K94j082n00R69P34q60r19O93J062
$$ -876 -45 868 252 -791 -383 720 537 -592 -638 468 762 -320 -820 149 883 23 -896 -203 859
2547H59m83j149K61J178l5j152j96J074M33r86o20Q30Q41o81j018M84J167k82
$$ 859 376 -773 -512 666 631 -521 -717 357 790 -196 -816 14 855 174 -844 -360 807 525
2565E25j233O0J236J57j161l67J046N66r08p31P28R08n25j053K93J163o1j223
$$ 525 -708 -648 588 745 -416 -783 263 829 -79 -810 -82 826 301 -752 -459 704 643 -580
2583e80j81J226L76j146n76J021P35q48q52O25R77l99j089J68J134R9j140l53
$$ -580 -761 465 841 -305 -881 140 875 27 -825 -200 777 378 -711 -543 591 690 -450 -803
2601h03J096N81r97p85Q68R41o95j054N12J109k90j137N1J139J92j069m59R74
$$ -803 293 874 -123 -908 -40 901 206 -848 -336 773 483 -654 -603 536 728 -341 -800 174
2619A74P10q39r11O53J085m75j190K86J240r7j237j21J193L07j046n38Q90P44
$$ 174 884 45 -866 -213 872 397 -793 -507 733 636 -601 -722 471 778 -268 -806 84 828
2637H28o78r58M69J100k21j227J1J262K01j262l63J180N23j053o93Q69Q39o06
$$ 828 150 -808 -339 761 540 -687 -676 586 787 -475 -838 342 865 -188 -881 -12 827 221
2655B21r69L39J078o4j152j95J173M47j158o31J058Q00r26r34P66J014n34j088
$$ 221 -748 -409 669 605 -547 -742 431 878 -280 -911 147 947 21 -913 -147 867 333 -755
2673g55K73J120J0j099l03J048N41r48p68Q31R69o89j114N03J216l16j236R3J227
$$ -755 -482 638 648 -451 -754 294 835 -113 -881 -50 919 230 -884 -381 835 519 -717 -624 603
2692F03J16j151l55J017N93q31p96O05R98m21j139K13J257lj334j70J292L77j195
$$ 603 719 -432 -787 230 823 -8 -804 -199 799 378 -761 -548 709 706 -628 -798 494 871 -324
2711c24n49J033O98q15q44N64R65k62j094j4J164K69j203m74J186O74j133q15
$$ -324 -873 160 858 43 -801 -237 728 466 -628 -642 522 791 -412 -886 300 974 -159 -974
2729i74R70R39p39j019M77J040j91j066r1J067L74j029o49R70Q61q54j049P30
$$ -974 -4 935 196 -823 -346 694 503 -563 -654 413 787 -242 -891 79 940 86 -963 -233
2747b33J163n62j225L47J222p0j176j88J078M23r45o53P88Q91o09j092M19J233
$$ -233 930 368 -857 -510 712 642 -534 -722 356 779 -166 -819 -31 860 251 -841 -422 811
2765H11k18j310J5J335J59j254l78J146N58r63p33P29Q89m88j015K24J147K2j219
$$ 811 593 -717 -702 633 792 -462 -840 306 864 -99 -832 -103 786 298 -717 -493 654 676 -543
2784e43k85J252N08j217o80J096Q24r34r39P24J012m66j045J67J074J31j063m35
$$ -543 -828 424 932 -285 -965 131 955 21 -918 -194 818 352 -693 -526 548 679 -384 -819
2802h19J051O99r86r14Q74J086p26j182N40J211l31j191Q7J134J77j037m59R11
$$ -819 232 931 -55 -969 -95 991 265 -917 -377 834 503 -688 -601 533 710 -327 -786 125
2820A25P38p68r77O09J157m25j301K62J330n1j314j45J224L41j085n54R13P52
$$ 125 863 95 -882 -273 884 459 -842 -580 750 699 -615 -760 464 805 -280 -834 79 831
2838H31o88r52M40J116j91j214n5J275K66j264m68J198O43j066p79Q82R02o42
$$ 831 143 -809 -369 747 556 -658 -713 562 828 -436 -904 294 937 -129 -908 -26 876 234
2856B34j012L62J096q6j125j98J133M59j083o97R96Q78q63j025P06J112m99j169
$$ 234 -778 -416 680 594 -531 -729 404 863 -220 -917 79 957 94 -931 -225 887 388 -781
2874g81K57J180Mj141k74J054N29r20p78P73R78o05j131M12J250k35j290K9J277
$$ -781 -524 656 660 -481 -755 299 828 -92 -870 -97 881 276 -855 -443 807 572 -718 -689 588
2893E88J88j205l91J049O15q58q08O34R82m03j109J65J209O3j266k56J258M41
$$ 588 776 -429 -820 229 844 -14 -822 -188 794 391 -718 -553 656 719 -547 -803 455 896
2911H96j179o17J029P72q30q91N76R87k92j081K9J125K27j148m41J100O55j019
$$ 896 -283 -900 129 901 71 -820 -244 743 451 -630 -601 524 751 -397 -838 262 917 -102
2929a02q13Q69R53o87j043M47J091j84j118q2J103L42j045n66R55P61q42q99O54
$$ -102 -915 -46 907 220 -823 -376 715 531 -587 -669 434 776 -269 -835 120 881 39 -860 -206
2948b06J063m57j159K38J173K5j176k45J115M59j009o51Q54Q24o88r57M81J054
$$ -206 857 400 -759 -521 652 677 -499 -744 371 830 -179 -830 24 848 160 -797 -316 738
2966G38k41j124j4J149K50j127m65J071O36r51p82P79R00n71r87L27J053p9j092
$$ 738 497 -627 -641 508 758 -369 -834 237 873 -78 -860 -81 819 248 -739 -412 641 562 -530
2985e30j79J088M35j051o36R55Q02q12r18O32R86m09j021J52J061R1j047l40J009
$$ -530 -709 379 814 -237 -873 82 884 72 -846 -214 772 363 -658 -506 555 646 -401 -741 268
3004B68N81r49p46Q10Q97o60r84M55J011k09j026m0J032K76j017m96R44P11q52
$$ 268 849 -100 -846 -36 861 201 -783 -328 683 474 -552 -592 440 716 -301 -797 147 858 6
3023Fq69P26R47n29r93K93J011n3r84k12R54M63r03o76Q37Q39p24r53N70J017
$$ 6 -863 -137 810 281 -712 -419 592 539 -445 -657 297 760 -143 -819 18 857 133 -820 -250 767
3043G67l87j033J68R98R5r50l33Q69N63p76p70O91R08n48j024M01J055j97j063
$$ 767 380 -653 -485 513 608 -342 -675 194 757 -19 -789 -98 810 262 -762 -361 694 497 -566
3062e66j4J012K55r35m68Q22O53p08q09N73R12m14r68K11R84K3r88k55R52M61
$$ -566 -580 432 687 -248 -716 106 759 51 -758 -185 727 313 -655 -444 540 563 -425 -680 272 733
3082G33q57o66P83P92o65q61N13R09l28r01R0Q91J48q34m16P73O64p16q58O41
$$ 733 -124 -790 -7 785 120 -741 -228 681 353 -548 -458 433 581 -253 -669 104 768 52 -806 -165
3102a65R78n44j023M17J011k63r26L9Q16K19p19m75O21P12n15r26M41J039l39
$$ -165 813 269 -754 -337 674 411 -515 -476 340 559 -160 -635 -14 698 183 -743 -302 737 398
3121C98j081K06J065p7r75q9Q44K96p13m99N64P02m11q72K78R75j26j017j9R95
$$ 398 -683 -477 588 511 -464 -553 291 587 -126 -625 -61 641 230 -642 -364 611 485 -532 -551 444
3141D44J85r32l53Q56M90p33o32N86P73m58q15K57Q46n2q39j71P94L90p61n67
$$ 444 629 -303 -656 200 690 -43 -675 -89 684 226 -589 -332 514 462 -377 -548 246 636 -125 -692
3161f92O90P29o21q46N42R18m42r16K90Q39q0p44j58O26M13n22o39M32Q51l77
$$ -692 -2 727 106 -740 -198 720 278 -638 -348 491 411 -333 -491 135 548 26 -613 -181 670 293
3181B93r90L24J063k69j038J71R59k6q11j57O31L71m61n82L03P78j81r25O7J026
$$ 293 -697 -373 690 421 -617 -446 513 487 -324 -481 150 521 60 -522 -219 559 378 -547 -480 546
3201E46J2j053r1R94K01q81l15P04M46n27n74L37O95j51p78k8Q25J92q54l29Q39
$$ 546 558 -495 -586 408 609 -272 -587 117 563 36 -538 -201 494 343 -435 -463 362 554 -300 -629 210
3222B10M71p67o22O83P03n46p44M08P53k47p31N3O85J73o34l88N72N77m98p59
$$ 210 681 -86 -708 -25 678 132 -612 -204 549 302 -429 -376 309 482 -152 -540 32 609 111 -648
3242f48M50Q92l90r62L12R41j94q60O7P31Q5n81k74M25M95k96p24J83Q86q8r85
$$ -648 -198 694 304 -658 -346 595 401 -459 -392 339 424 -157 -431 -6 489 193 -531 -348 538 450 -535
3263e35K7J018L0r93q4Q68J90p05k85M85M07k76n53R3P21O2q26k16Q86L20q82
$$ -535 -508 510 540 -453 -537 331 521 -184 -469 16 423 147 -406 -313 408 470 -356 -572 314 634 -248
3284b48l85Q31M45p50m79N91N45m06n85J93N95J9o19k07O45L83o31n69O06O85
$$ -248 -633 198 643 -107 -586 5 550 144 -441 -248 347 366 -253 -460 185 568 -63 -632 -26 659
3304F59n49p53M86P62l96p60K74P19q6o46j05N19L24m40m85L41O73k77q18K02
$$ 659 110 -643 -157 605 209 -551 -277 442 356 -290 -395 124 448 8 -477 -136 537 260 -558 -356
3324c56R05j25r24P5Q77j6p82q4O61K10m77l74K73N26r8o49m0P91J22q83k10R00
$$ -356 549 424 -500 -425 452 436 -346 -430 231 441 -36 -410 -137 389 291 -358 -398 393 515 -368 -578 322
3346C22K82q49l15P41L49o07l92M07M69j76n41n7N96K32o25l86O83M77o94n63
$$ 322 604 -245 -560 181 530 -77 -469 -62 407 231 -310 -367 229 461 -164 -550 133 610 -84 -647
3366f47O62O24n84o18M36O01k72n70R4N35J21n07l20M43N15m07o47L74P56l44
$$ -647 15 639 55 -563 -127 474 202 -368 -274 261 382 -125 -445 -2 513 106 -541 -167 589 245
3386B45q11K94Q10j84p72O4O62O5n40k07M24L55l02n32J95O68p7p82qQ38P1q37
$$ 245 -566 -272 538 354 -418 -354 308 373 -167 -374 50 405 103 -429 -234 434 357 -425 -433 405 476 -361
3408c61j45Q10J94p00k58N41L16l46m13J96M96rn98j57O75K88p05l83O99M46o66
$$ -361 -506 304 498 -202 -460 81 397 51 -362 -166 330 321 -277 -434 241 529 -176 -559 140 586 -80
3429h0m72N74N04m61m94K71M98q3n00r5M96K79m84m59M82N99m73o81M14P08l56
$$ -80 -552 22 526 65 -429 -158 340 257 -243 -338 158 437 -47 -506 -24 575 102 -579 -165 543 187
3450A87o88K66O47j50n69mM74J94l97l66L13N40k46o66J80P52j14q04P4P73jp02
$$ 187 -501 -235 412 262 -307 -311 163 357 -40 -406 -93 447 201 -465 -285 467 353 -451 -377 396 395 -307
3472c07p4N87J86m59l19L34M35j77n41M1O41N5p11j40P25K22o90l01O30L56n39
$$ -307 -381 206 392 -67 -386 -52 383 206 -335 -294 347 402 -309 -449 276 498 -192 -493 137 493 -46
3493d6l96L83M65k48n03Q7N25P2n38k31N49L51n32m38M80N49m45n90L72N91k65
$$ -46 -442 -59 406 158 -345 -258 267 339 -199 -430 119 470 -62 -500 -20 529 84 -506 -134 457 192
3514A92n79J34N52K6n05j72M27L31l66m64L01N90k61o67J99P28j48p12O3O65K0
$$ 192 -387 -253 299 325 -180 -352 75 406 40 -424 -123 467 206 -461 -262 466 318 -394 -331 334 354
3535C54n60j36M47K55l19m00J93N40j05o47L6P07K8p23q2O86J55n93k48M77L19
$$ 354 -206 -342 105 360 41 -359 -166 374 269 -378 -342 365 393 -330 -412 274 429 -164 -412 65 384
3556C84l39m13K09M96r0n55k2O03J28o10k26O06K98n28l78M24M54l22n07K10N58
$$ 384 45 -368 -159 337 247 -308 -330 273 401 -209 -435 171 469 -59 -437 -13 441 119 -388 -178 380
3577C80j14n56j9N51J24n14k44M57L62l74m73K89N58k08o26J34O43n6o25k4N80
$$ 380 266 -290 -309 242 366 -148 -392 65 427 53 -420 -131 427 219 -407 -273 370 314 -311 -335 245
3598B45J11m83k40L87L48k69m75J88N58q8o43J5O83L7o34j22N88J81m76k84L70
$$ 245 356 -127 -367 20 368 99 -376 -188 370 282 -361 -346 337 374 -260 -382 206 387 -89 -373 -3
3619cL82k44m83J21N69k2o23o1O33J34n96k06N36K67m30l60L30M31k04n21Q2N83
$$ -3 379 135 -348 -227 342 320 -303 -364 269 403 -193 -399 137 404 -26 -386 -56 375 171 -350 -268 315
3641C15J8o11j03N85J89n38k49M42L41l39m32K36N02j21n66J9O15P0o21j41N68
$$ 315 333 -278 -381 204 393 -145 -394 48 389 50 -382 -146 356 235 -331 -312 303 373 -248 -389 179
3662A79K26m94k89L73L84k74m52J45N45n8n83l6O01J31n89k12N40K72m47l45L28
$$ 179 405 -89 -378 -5 379 105 -347 -202 343 285 -298 -334 267 398 -191 -403 137 409 -38 -383 -55
3683e5M34k26m97J08N31Qn72r7N84J79n45k63M62L41l49m22K37N01j39n51L2O07
$$ -55 379 153 -344 -236 295 303 -269 -366 218 397 -148 -411 51 392 43 -379 -142 359 220 -331 -299 308
3705C08M1n95j32N82J90n01k74L87L62k54m58J47N22j8o00o8O40J19o11j97N70
$$ 308 349 -246 -378 204 394 -107 -381 6 368 114 -344 -197 325 307 -293 -361 279 398 -213 -410 160
3726A60K59m86l02L52L79k18m52O8N14P1n78j69N80K54n81l06N52L42m71l82L50
$$ 160 419 -67 -369 -17 362 144 -308 -240 274 345 -233 -402 178 432 -149 -455 97 439 -32 -414 -64
3747f4M27k14m59O9M94O9n06j99N11L07m83l96M34M62l66m99K79N35j63n58L5
$$ -64 363 149 -310 -241 253 322 -184 -383 128 435 -48 -444 -10 452 86 -413 -134 401 238 -320 -285
3768b85N56P3n31j72M64K79l91l74L09M51j88n50J09N98k4o39n1O33J30n92k10
$$ -285 271 344 -187 -359 105 384 -7 -381 -72 379 191 -359 -250 348 324 -315 -366 267 397 -195 -405
3789d05N12K79m04l27K53M08j16m74l4N71J37o12k46O55K92o14l41N45L63m31
$$ -405 107 386 -18 -345 -92 316 200 -274 -308 263 400 -212 -458 197 489 -125 -466 79 442 11
3809A1l71K77M02j27m14n5M57K08m88l45N16M31n10m96M81M99l78n24K88M96j39
$$ 11 -360 -83 319 192 -222 -277 180 388 -100 -445 71 502 -8 -504 -23 476 98 -426 -138 358 219
3830B19m64k0M45J50m01l20L88M31l39n31K69O21k19o37J29O26m9n90n8N69J43
$$ 219 -245 -265 180 330 -71 -391 -3 428 89 -442 -173 448 229 -408 -279 347 298 -292 -350 219 362
3851C62m61k70L64L74k63m48J34N51l7o00p6O48J60o49k28O12K73n42l26M53L65
$$ 362 -99 -369 -5 369 106 -342 -208 343 306 -294 -370 278 438 -211 -439 173 446 -96 -422 31 396
3872C96l06l95J25M33M2m71k06N16L29n36m42N65M72n19n06M61M98l67m59K00
$$ 396 90 -305 -180 253 295 -176 -382 134 463 -73 -515 50 522 3 -503 -42 456 89 -370 -170
3892a70M53l6m10j65L72L56l70m84L54O00l49o50L23O59k43o37J48N75k4n00j13
$$ -170 283 247 -163 -328 44 400 30 -454 -100 500 151 -499 -176 483 240 -397 -249 326 302 -198 -311
3913c11M19K47l06m20K21N39j40o22P7O77k3o95o1O89J29o28k17N31K75l94l40
$$ -311 108 355 49 -371 -150 389 249 -373 -296 381 358 -337 -398 291 420 -208 -425 106 381 -13 -353
3934c53K62M18j08n02l9N51J88n92k87O14L62o16m21N70M68m82m61L33M36j62
$$ -353 -91 327 219 -283 -322 229 417 -175 -462 152 514 -102 -523 47 515 33 -428 -95 341 179
3954A79m18%M15J79m27l70M35N09m14o13L95O60l74o42L00O15j85n51L0M67J08
$$ 179 -239 -239 176 355 -72 -442 -7 502 88 -525 -130 530 156 -486 -186 429 244 -307 -277 190 298
3975B98l61k64K92M21k40n88J90O96j24p38O8P22j1o82n8O10J44m88k40L33L50
$$ 298 -63 -327 -35 386 146 -442 -252 444 320 -418 -350 372 361 -321 -379 231 375 -113 -353 -20 330
3996C30j89m45O2N47N5o50j33O85K50p00l02O31L37n50l65M37M04l08m20J16M62
$$ 330 141 -304 -242 305 360 -290 -423 262 512 -188 -490 141 478 -72 -437 0 404 96 -324 -208 254
4017B54N9m65k29M77L74n12m76N13N57m67o00L81N96k97n48J84N04l0m64j52M05
$$ 254 313 -152 -381 96 470 -42 -518 -5 552 85 -515 -134 462 165 -383 -199 305 275 -189 -341 64
4038F4L30l34m82K66O10k31o72J82P26j21p26N1O64L3n78j27M74K36l43l61J84
$$ 64 394 60 -422 -156 454 223 -449 -267 459 338 -388 -337 327 360 -218 -345 129 365 22 -339 -155
4059a55N05p1n92m4O55J31p05j93P19K40o73k79N55L31m08l75K45M18p6m63j03
$$ -155 350 279 -313 -357 298 429 -276 -469 250 490 -183 -462 93 424 16 -359 -114 304 228 -235 -338
4080c38N24K60n59l87N72M64n59n10N23N19m19n23K94N01j24m62o0M44K24m23
$$ -338 186 446 -113 -500 72 536 -23 -533 -10 509 90 -433 -139 362 238 -224 -284 160 384 -39
4100c9l81M00M98l55o08L15O62k42o91J61O64o8n93p5N31J99m41l17L33M19k21
$$ -39 -420 -20 478 123 -485 -170 492 250 -441 -280 384 316 -277 -352 179 378 -63 -380 -47 372 151
4121A51n29J22O30k8o88p8P17J59o76k46O27K89n06l58L96M02k26m68O3N05R7
$$ 151 -378 -256 374 346 -342 -420 297 456 -220 -466 161 450 -56 -414 -18 384 158 -310 -247 258 355
4142C55n59k32N99L47o05m30N74M93n08n07L95M99k51m81P9M80R5m62k71M50M21
$$ 355 -204 -436 163 510 -95 -525 49 542 34 -473 -78 421 170 -311 -232 248 343 -119 -390 60 481
4163D81m58n25M09O19l71o47K85O31j76n96N1N55Q2m79k45M21L92l52n19K71O18
$$ 481 23 -502 -93 526 155 -492 -207 424 248 -348 -297 258 340 -139 -384 37 429 77 -442 -171 447
4184D47j73o60P5O84no49j07O22K00n50l02M53M09l55m86K31N42q8n94n0O07J73
$$ 447 274 -386 -311 373 368 -281 -388 234 434 -116 -418 35 444 89 -397 -166 376 288 -306 -356 251 424
4206D24n96k93N86L82n32m52M46N05l54n37K20N60p3n46j04N27K52m84l90M50
$$ 424 -172 -465 121 503 -29 -481 -35 470 116 -421 -201 359 286 -260 -364 163 415 -69 -459 -9
4226iN06m13n76L46O27k74o30J71O16m3n55j17M97K67m24m04L35N40k77o26K15
$$ -9 497 84 -492 -146 481 207 -423 -252 364 321 -234 -351 146 413 -11 -415 -80 460 183 -443 -228
4247b28O59j29o77L6O47P8n86k01N10L16m00m57L11N51k13o12J05O43j4o27j09
$$ -228 431 302 -375 -339 308 386 -200 -401 109 425 25 -432 -121 430 217 -395 -290 353 339 -288 -397
4268c97O04K14n48l36M94M28l73n22K60N97j58o20M8O14O9n90j97N42L22m65m21
$$ -397 207 421 -127 -463 31 459 86 -436 -176 421 263 -357 -309 305 374 -216 -413 129 451 -14 -435
4289d35L80N26k82o09J81O53q1o52k7O10J26n62k38M84L51l74m79K89N71j90o33
$$ -435 -55 471 189 -420 -239 414 333 -319 -346 264 390 -172 -410 74 425 51 -428 -139 432 242 -391
4310c91Q2O50K1o49j13N96K29n12l43M26M53l43n38K26O23j23o63K3O56J01o29
$$ -391 -309 341 362 -287 -400 196 425 -87 -430 -4 449 106 -432 -206 417 294 -369 -346 310 411 -218
4331b18k04N45L16m35m28L39N21k28o01J29O56l1o89n4O62J44n74k73M79L69l46
$$ -218 -422 123 439 4 -424 -85 436 208 -393 -264 392 361 -328 -382 280 424 -150 -423 56 425 79
4352G9m80K39N52j13o26oO85Q1o83j64O38K49n62l40M50M20k97m95J38N73j5o18
$$ 79 -401 -162 390 277 -349 -355 330 411 -272 -436 202 451 -111 -451 -1 419 122 -373 -235 338 323 -295
4374b95j00O46K15o46k90N85L68m83m64L92N01k42n48R4N92L7n96j60N83K56n32
$$ -295 -395 251 466 -180 -470 115 483 0 -464 -72 429 187 -361 -267 325 362 -234 -394 189 445 -87
4395h7l69M66M62l75n33K47O15j43o55L5O57P2o32j63N50K78m76l61L51M56k09
$$ -87 -456 10 472 97 -436 -189 426 283 -372 -337 320 392 -240 -403 147 425 -51 -412 -61 395 186
4416A86n55P2O59L3p04j29P26J90o68k74O00L03m58l51K75M61j42n14l1N87J72
$$ 186 -369 -297 362 395 -309 -438 288 478 -190 -464 136 439 -19 -370 -95 366 224 -290 -321 266 438
4437D38o45k86O68L68o34m20N55M47m43m64K99M66j09n09o5N44J96n34l48N21
$$ 438 -207 -493 175 543 -91 -511 44 491 48 -416 -117 349 240 -269 -334 210 406 -128 -476 45
4457D5M64m88n33M11N91l29o03K26N85o9n91n1N49J92n07l10M10M50l23n45K20
$$ 45 509 21 -512 -101 490 161 -442 -216 369 300 -291 -342 207 399 -108 -418 -8 442 119 -426 -206
4478b06O14j02o63PO90R6o96j59O45K30n62l03M11L94k73m50J06N19N4n94j91
$$ -206 408 306 -357 -350 340 436 -260 -419 226 456 -106 -409 2 396 123 -327 -221 298 352 -242 -433
4499d33O41L09o62l94O55M08n73m51M71M49l07m39R2M68Q6m65k61M73M23m88n34
$$ -433 208 517 -145 -539 116 524 -49 -500 -29 420 113 -326 -234 234 320 -145 -406 67 490 2 -532
4520e32M94O05m64o18L63O19k60n79J35N20M3m68k15L91L77l17n00K51O08k20
$$ -532 -38 567 103 -515 -152 467 207 -372 -237 283 326 -142 -357 34 411 94 -406 -155 453 233
4540B33o90J57P26p0p17j9O57J18n72k15M59L14l29m09J71N02l4n63q5O35J73
$$ 233 -457 -300 426 356 -361 -380 277 395 -177 -392 67 381 52 -357 -186 316 282 -281 -366 269 442
4561D42o69k68O85L41o28l95N25M17l99m08K24M33o5m33j39M71L07m82m45N00
$$ 442 -227 -495 190 531 -97 -492 33 450 51 -357 -133 300 235 -198 -337 134 441 -41 -486 14
4581A4N38n00n92M57O19l83n93K46N39j02m48o5L81K41l45m12K82N75k44o78J95
$$ 14 552 52 -540 -83 536 153 -440 -194 345 243 -205 -270 111 352 7 -405 -123 452 208 -470 -275
4602b75P30j47p27Q6O95j6n98r9M93K03l51l13K28M39j20n45j8O52J04o90j97
$$ -275 455 308 -419 -333 362 346 -252 -351 142 345 -6 -319 -91 348 228 -317 -335 317 421 -269 -466
4623d66P02K35o48k70N79L03m56l44K89M07j39m27m0M55J94m99l38N35M44n28
$$ -466 236 471 -177 -447 132 435 -21 -365 -76 331 192 -235 -275 180 374 -125 -463 72 516 -12
4643a2n24N07N24m20n22L21N08j97m84M5M39J35l67l24L29M55k90n70K67O50k11
$$ -12 -536 -29 495 75 -447 -126 382 185 -299 -254 185 320 -47 -371 -42 413 123 -447 -180 470 259
4664B59o91J48O77p9o18mN50R0m34k26L10L59j84m68O2N59L3o37j01O72J62o82
$$ 259 -432 -284 393 314 -304 -308 242 332 -102 -328 -18 341 157 -311 -249 310 343 -294 -395 277 439 -243
4686b43k11O38K49n18k89L90L13k39l80Q0M29J09m83k58N12L54n09m33N37M65
$$ -243 -454 184 433 -85 -374 16 329 90 -290 -210 219 328 -155 -413 99 453 -56 -489 48 513
4706E13m97m99M22M62k66m42J20M09L5l72k08L57L70l30n07L21N73k88o19K56
$$ 513 16 -483 -61 401 135 -307 -187 222 257 -115 -323 34 404 74 -433 -112 461 173 -446 -190
4726a90O09j75o00Q3N33M2m44j57L32K90k63l88J71N07j02n67J2O14N4o23j17
$$ -190 419 244 -356 -273 260 302 -142 -299 33 323 60 -328 -157 350 248 -319 -307 307 361 -262 -379
4747c79N98J72n27k48M38L05l06l49J70L80m0m24r3M85K01m94l14N07L96m92m30
$$ -379 219 391 -136 -384 54 359 53 -296 -126 254 214 -210 -303 182 383 -111 -425 82 478 -14 -444
4768d44M31M35l53m22K31M07r4l69p9L62K34l51l65L23M84l27n49K92N72k27n62
$$ -444 -13 422 69 -353 -122 285 191 -178 -257 105 339 -12 -377 -54 430 103 -446 -154 418 191 -371
4789c71J66N07p5m33n2L61J87k97l15K22M49j62n34J00N88m5n96oN56P7n02j39
$$ -371 -205 302 227 -206 -258 103 290 -7 -322 -100 349 187 -347 -247 341 296 -300 -306 250 327 -175 -314
4811c14M12K23l15l11K19L87j30m45N1M58Q5n00j65M83K37m42l06M07L48l35l93
$$ -314 98 321 6 -305 -86 301 171 -274 -223 235 320 -180 -345 138 375 -67 -373 34 382 47 -346
4832c46K45M17j54m23N1L93Q5l76k07L33L36l10m25K75M83k26n18K02N09j34m82
$$ -346 -101 316 162 -261 -210 183 268 -108 -315 18 354 44 -381 -106 377 151 -367 -165 344 210 -272
4853b72M3M28N7l43j87K64L19j82m37J42N10r9n55P1N37j1n13n0M44J26l44k22
$$ -272 -229 199 256 -87 -274 -10 309 127 -310 -168 342 243 -312 -241 296 285 -228 -278 166 292 -52 -274
4875b74K55L10j53l95P7M40j2m92m4M91J13m68j71M21K24l33l04K46L80j69m11
$$ -274 -19 291 138 -257 -180 260 248 -244 -288 203 316 -152 -323 98 322 -11 -315 -69 311 142 -269
4896b69P4M27K0m31q3L96J65l53k52L07L35k57l86J69M43j11m55L9M48M1m21j18
$$ -269 -195 232 252 -179 -262 134 299 -54 -306 1 336 79 -307 -138 305 194 -261 -222 226 267 -154 -272
4918b72L67J70k76k58K02L51j34m27P7M72k0m80m4M64R4m07j60L33K19k39l01
$$ -272 95 265 -11 -269 -67 284 150 -277 -200 272 252 -228 -272 192 286 -121 -281 52 271 32 -269
4939b69J68L43p6l96jM43N5m44j16M23J68l53k32K94K68k03l19J12L79l4m07m5
$$ -269 -101 242 166 -230 -231 212 267 -177 -293 130 298 -55 -287 7 275 72 -247 -135 244 210 -197 -242
4961b42M23J03m15j46L56K11l03k62K10L18j22l53L5L94K4m11q7M16J39l87j91
$$ -242 181 284 -131 -277 79 290 -13 -275 -65 253 131 -222 -187 207 231 -180 -267 149 288 -99 -290
4982b90L29K33k43k91J61L31n4l67l4L95R7l90j44L62K14l49k30K79K66j96l20
$$ -290 39 272 29 -262 -101 230 176 -191 -225 170 267 -123 -267 95 309 -40 -270 9 275 79 -241
5003b41J21L35j6l56o4L69J29l38j97L21K36k82k78J99L27j40l39L5L75K9l84
$$ -241 -120 215 199 -157 -221 148 277 -61 -258 63 299 17 -261 -62 265 125 -214 -179 196 225 -159
5024a59q1L57J32l08j77K33K47j80k88J14L26k4l73n7L87J14l73j68L77J79l08
$$ -159 -240 117 249 -59 -236 -3 244 64 -224 -110 216 192 -181 -238 149 263 -110 -278 99 278 -30
5045c0k19K40K42j51k63M8L01L8l36j08L37J97l43k43L32K77k96k89K25K80j45
$$ -30 -249 -9 233 82 -181 -133 168 206 -130 -238 99 296 -47 -290 42 319 23 -266 -41 239 94
5066I4k71M7K71L6k68j34K73K19k65k86K34L35k02l46J46L50q8l20PL03N5k70
$$ 94 -177 -130 141 177 -91 -225 48 267 2 -284 -50 285 83 -263 -117 233 145 -175 -168 135 190 -80
5088h0j21K38J89j87k64J56L05q3l50J5L80K5l83o4L59J15l27j57K72J89j89k31
$$ -80 -201 37 226 39 -225 -69 236 153 -197 -182 198 223 -160 -224 135 250 -77 -234 38 227 38 -193
5110a93J26K38j3k87o3L06J32l12j91L14K21k90k59K74K64k25k47J29K47m7k28
$$ -193 -67 171 158 -129 -192 114 246 -66 -257 57 278 -12 -271 3 267 42 -205 -76 171 124 -104
5131a04p3K31J60k15k52K31K88j96l42J82L69j70l37J25L06o2k59k6K17J08j64
$$ -104 -177 54 214 -1 -253 -22 266 70 -272 -90 279 109 -228 -103 203 141 -118 -144 73 181 17
5152A7k04J15K80q0l33N3L77k9l83j2L74L9l38p5K82J10k03j68J31K17o6k43k2
$$ 17 -187 -72 208 128 -205 -152 225 196 -187 -199 175 214 -124 -199 83 193 -10 -178 -47 170 104 -139 -161
5175a61K87Q7l25j43L56J63l38j87L01K06k47k11J84K12r6k01%J93J02k09j83
$$ -161 126 213 -112 -255 101 264 -74 -261 40 246 -1 -212 -28 184 88 -113 -113 80 182 -27 -210
5196b10K14K54k30k74J96L30j93l38J68K91r3k63M4K10L0j78j11J31K08q6l07
$$ -210 4 258 28 -246 -50 280 87 -251 -83 208 115 -148 -104 106 136 -42 -153 -22 186 100 -207
5217b07Q2L36n2l72M0L61Pl61j6L02M2k22q7J55J39p4k05RK61O2l03j13L36J31
$$ -207 -125 211 159 -213 -173 188 195 -166 -182 120 162 -60 -147 8 147 73 -132 -123 138 200 -103 -216 120 251
5241B51l45j46L30J48k74j73K25J68j41j50L4J71K9j76j33K22K03k22k73K20K84
$$ 251 -94 -240 90 238 -36 -209 16 184 43 -107 -73 98 127 -49 -182 40 243 21 -252 -32 252
5262B52k08k81J79K74j49k51R9J98j0j57q1J34J50j05k29R8K91q5l15M6L42m3
$$ 252 44 -237 -58 216 67 -184 -85 113 103 -54 -135 -1 149 44 -185 -87 204 119 -196 -150 192 149
5284A49l14L5K83kk38m6J77R4r9j61L9K09K4k52o9K94R4l12j30L06J49k77j42
$$ 149 -165 -130 153 151 -87 -133 44 138 39 -122 -83 126 150 -102 -171 123 217 -95 -225 81 230 -47 -189
5307a89K33J30j81j31Q4J49Qj56r6J68J59j84k04K07K30k03k63K17K32j70k16
$$ -189 44 174 -7 -138 -54 95 103 -53 -149 19 178 -6 -210 -3 227 24 -239 -22 210 40 -176
5328a76J30J67n7j30m0J30J15r0k04Q4K65q6k93Q3L01p8k96N6K76k9k12k9J59
$$ -176 -46 121 64 -66 -106 24 139 49 -155 -71 194 108 -185 -102 199 121 -175 -119 157 128 -84 -113 46
5351D6O9j06j23N9J83j9k28k2K50N2k70p2K75Q5k55j06K30J12j58j27Q4J45l8
$$ 46 115 9 -114 -55 128 109 -119 -141 109 161 -109 -181 94 179 -76 -182 48 160 2 -125 -41 104 66
5374F6j32l7J57R8j83j38J83J87j77k25J75K23j49k15J24J94q1j52J5J19O0j02
$$ 66 -66 -103 54 152 -31 -169 14 201 24 -201 -26 197 48 -167 -43 151 70 -82 -67 52 112 10
5396A0j28R5J82p8k46P4K67o1k73N1K60n6k10J7J66K8j12q8N5J35Jj86j9K32K8
$$ 10 -118 -23 159 81 -165 -91 176 115 -158 -107 153 97 -113 -96 70 98 -14 -102 -47 88 89 -97 -116 116 144
5421A44k43n6K49O3k24q4J98R8j44j02Q9J11k7j41k4J61O5j84r6J86J20j65j49
$$ 144 -99 -155 94 157 -67 -151 47 145 1 -101 -12 99 72 -69 -93 68 133 -51 -147 39 159 -6 -155
5444a55J50J63j28j66R6J54m5j71K1J29M5j15q2R7J23p5j70P0J82k7k26L8K13
$$ -155 -5 158 30 -136 -40 114 69 -102 -81 48 93 -22 -104 -7 116 41 -129 -59 123 96 -130 -92 121
5467A21j8j95mJ79J3j30n0Q0Q9k6j31nJ73L2k10n2K29N2k22n0J90O0j49p0J07
$$ 121 103 -92 -96 83 96 -34 -84 -4 85 59 -72 -77 96 128 -82 -134 95 147 -75 -125 65 125 -24 -94 13
5492A3Q8n2j09j5J27O5j64q9J68J04j57j25J49J33j19j43R2J29m3j32jJ37M0j20
$$ 13 101 49 -60 -75 52 117 -47 -136 32 136 -21 -146 3 136 17 -126 -34 95 52 -80 -81 56 96 -24
5516b4r1J25R5q4j30Q9J29n2j55L1J65pj59l0J49M6j11p3J03Q5p3r5K0J31Jj46
$$ -24 -115 10 105 21 -109 -20 109 57 -98 -67 98 91 -68 -98 51 97 -14 -87 16 101 28 -67 -47 84 85 -61
5542f1m0J65N4j57p9J50J06j61r1J11R8p2j12M4J06K5j29n9J29R8j41j15J41J21
$$ -61 -101 64 118 -39 -118 32 138 -23 -114 -3 95 23 -89 -45 61 86 -43 -102 27 125 -16 -131 10 131
5566A31j16j28Q7J29m8j26J9J09K1j00n6R9Q3r2j11P7J44p5j37L9J45l3j20j0
$$ 131 15 -113 -26 103 55 -71 -52 57 78 -22 -78 21 104 12 -99 -22 122 47 -90 -51 94 61 -59 -69
5590f9J15M6j13p5R7R2p8j14P1J00k5j23JJ38J0j20m6J12P9j09r4R4R7m6j35O3
$$ -69 46 92 -21 -96 1 93 15 -99 -28 72 47 -76 -75 63 73 -47 -93 19 98 -11 -105 -11 86 40 -95 -32
5616c2J08k1j30NJ19L5j00o4Q8R5p9j16N8J33m5j28K0J15Kj04k5J03N3r8p1O4
$$ -32 76 55 -75 -70 49 84 -16 -80 8 103 24 -92 -34 99 54 -74 -54 61 63 -41 -66 37 90 -8 -79 -15
5642a5J05n7j31M6J15j8r6j3J13L0j12n7R0R0p8r5N9J23o3j21L6J14mj09j5Q9
$$ -15 90 33 -98 -52 63 45 -51 -64 49 79 -33 -90 0 90 12 -83 -24 99 36 -85 -49 65 61 -48 -63 26
5668B6M7p7o7N2J09m6j27K1J67m6j34K0J31Qj19k9P9M6m8p8K7J09k2j31J6J38
$$ 26 73 -4 -71 -19 90 44 -83 -62 105 59 -75 -55 76 84 -35 -64 15 61 13 -65 -38 71 49 -82 -66 72
5694G2Jj34l0J28L3j04l9P8M7l8p0K1J00j0j08mJ03L4j08n2J06O3q8q2Q3Q5n8
$$ 72 73 -61 -91 37 70 -34 -73 5 52 14 -56 -35 65 55 -53 -57 46 80 -28 -80 26 89 1 -81 2 87 29
5721B9r5L9R0j6j00OP4M3p2o6P8O8n5j00L9J21m4j13K0J11oj07LQ8J6o0n2M4Q1
$$ 29 -66 -27 63 47 -53 -47 27 70 -2 -68 10 78 23 -77 -38 83 39 -74 -54 57 51 -56 -53 35 51 -9 -61 -17 64
5750F4j8j05J1J03K0j37j3J40J4j21k7R8L1o6o2O9N7k1o8j6P6M9j10n5J18P6j04
$$ 64 46 -59 -48 55 75 -62 -75 65 79 -42 -69 29 60 -6 -68 1 58 37 -31 -47 29 78 -32 -87 31 107 3
5777Cq7J01O2p1p2M4Q4l7o5NM5L3m4p6O7Q1n4j03N4J14m9j27M9J14k6j01J6Q5
$$ 3 -84 17 79 8 -64 -20 64 27 -38 -33 12 45 1 -75 -8 73 19 -84 -30 84 35 -92 -43 71 45 -56 -40 45
5805D5on4l2M4O1l1p3J4R8Mj26nJ33Nj15l4J25K0q6l8O3M5l8m9JP1J3p9n6R2P1
$$ 45 39 -15 -47 -3 58 27 -46 -32 66 70 -56 -61 72 77 -38 -72 53 73 -13 -51 12 57 19 -30 -29 42 55 -24 -80 12 83
5836H3j03o3J06O8j02p2Q7O3n9n3K6M4J3n1m5N0P5n3r9O8R6n4j01O1J04m4j07
$$ 83 -20 -83 23 91 -11 -83 4 67 8 -45 -19 25 38 -13 -58 -8 67 14 -85 -17 79 25 -76 -15 89 45 -62
5863f2L2P7jo1k3M7M1j8p3J1J01oj32J7J17Lj24j0J21Jj02oN3M0m2m3RO1K4p1
$$ -62 -30 47 46 -15 -38 9 50 32 -41 -30 71 65 -67 -50 67 70 -54 -64 57 58 -44 -50 3 43 1 -42 -33 28 52 -19
5893a9m5R3N5j12n2R0Q6j09n1O7O8n9o1M3M7jl8m2N2N4n0q5N7J02n4j14N0J16
$$ -19 -64 29 84 -28 -80 10 96 -13 -64 3 71 12 -49 -6 41 40 2 -40 12 66 16 -69 -12 90 36 -78 -28 88
5921H8l9j10L2Q4k4n2oL7L0k9p5K8Q3Jj09KJ27Jj29j1J28J1j10j0Q3L0n7m7K7
$$ 88 49 -61 -29 55 31 -21 -27 10 40 11 -64 -36 47 48 -61 -59 68 69 -60 -71 57 68 -42 -52 31 61 4 -43 -16
5950a6N3J7p4l9Q5N7j01o2J16O9j24n3Q9O1o3n9L0N1qn6j1O1M6o3p8N4R6n3j02
$$ -16 37 54 -20 -59 26 83 -18 -80 36 105 -19 -72 17 78 15 -44 -14 37 29 -27 -38 23 69 6 -72 -18 78 25 -77
5979g7N4R4m7j01M3Q7j6q5lP5L1n2o1L7P6oj10QJ26Oj39JJ12J6j01k1R2K8o6l9
$$ -77 -23 71 24 -77 -34 53 37 -48 -51 24 55 3 -58 -21 55 49 -61 -53 73 79 -60 -59 53 69 -32 -53 39 67 1 -38
6009c8L2O0j4o3k6Q7M0r5p1J05Q0j13n9P9P5q8n7O2O1k5o2j9O0N3o5p2O6R0p1
$$ -38 -6 54 40 -23 -49 38 78 -17 -88 17 97 -16 -75 4 79 -9 -66 -4 57 32 -30 -49 11 64 -1 -73 -7 83 12
6038A2r5O4R8n8r8M2R9j9j01J7P3K7m8o2M5P7k9r8K7J17k9j22J7J14J5j11k9Q4
$$ 12 -83 -19 79 21 -77 -35 64 45 -56 -39 34 61 13 -49 -4 73 44 -54 -27 90 61 -61 -44 70 85 -26 -55 29
6066B9L8p9l8M6N2k7p2JR1J9r8l7J01N4j01o2Q7O9p1p2N2P8l8o3MP2J8p2l6O2
$$ 29 67 -12 -50 -4 48 21 -51 -50 41 60 -38 -75 26 80 -21 -83 4 73 2 -70 -18 60 22 -41 -37 35 53 -19 -55 7
6096GP7o5r4N8J21o8j18O0J06k8j03QQ3K2p2l9M5O6l5r4K5J05k8j11J3J11J7j20
$$ 7 84 19 -75 -17 104 36 -82 -22 84 56 -47 -39 44 66 -6 -45 0 66 31 -63 -38 67 39 -72 -59 52 69 -51
6124e1lJ01J5q8m4P3O0m9o3J5Q5Lj08j3J05L5j00n1R4O0o7q3O9Q4n2p0OJ00pq1
$$ -51 -54 47 62 -26 -70 3 63 14 -49 -34 51 54 -54 -67 38 73 -27 -78 16 76 9 -74 -5 79 27 -43 -37 63 56 -25
6154b5m4R8M9p8o6N9J01o6r9M3J06k4j16J5J00Jr1k9Q0M6o0p3N1R2k9j04RJ14
$$ -25 -69 29 78 0 -66 -7 94 28 -71 -28 78 54 -62 -47 53 54 -37 -66 14 60 0 -73 -22 70 41 -63 -54 60
6182F0kj24LR7L9r7l1O2P7n5q2L2R6j5j06j1J08L2j10m7J00N8r2o4O6Q2m8q9L2
$$ 60 58 -66 -63 34 73 -24 -55 7 84 29 -53 -21 75 60 -46 -57 51 83 -27 -74 26 84 -8 -72 -6 76 28 -61 -29
6211b9R6j5r5k0R1M9r7n9Q5O1n5j00P3R0l9r4mJ08J3j02k7J05L7p1p8P5P9m3j07
$$ -29 67 52 -43 -63 28 77 -20 -79 6 67 12 -88 -15 75 36 -58 -62 46 59 -43 -70 35 72 1 -77 -2 77 34 -73
6240g3M2R4j2j02j4J20K9j15l8R2O2p9q9N9J01l6j09J8R8J7j15j3R6N3r3q6R9
$$ -73 -31 63 51 -51 -65 55 84 -31 -69 23 85 6 -83 -24 77 41 -68 -50 48 65 -50 -63 33 86 -7 -93 6
6267FP5p1q0L2J07j7j09RQ4L4r6o0J05O9q6p8O4R4m3j00J7J13kj00m2J15N1j13
$$ 6 81 10 -70 -38 69 52 -57 -48 36 70 -26 -86 19 88 2 -76 -12 82 39 -61 -44 69 67 -33 -75 40 91 -22
6295b2n2Q1Q2q3q2N8Q9k1j03nJ13L0j17l6Q2P4q4r6R0Q1n2j01L4J09lj19rR9M0
$$ -22 -74 7 89 6 -76 -18 71 50 -53 -58 55 85 -32 -68 14 88 4 -92 -2 79 27 -74 -40 69 66 -53 -62 37 77
6324G7j00n9Q1Q5p2q6M6J04l5j09J0J30Nj11l3R6O6r9p1O7J00o7r8M0J08j7j06
$$ 77 -23 -82 -1 84 12 -74 -28 76 41 -68 -58 72 77 -34 -67 29 95 -4 -75 -8 92 25 -73 -33 75 58 -48
6351d8j5J01N8j24n8J10P4j07q7O3J20m8j05J8R9J1j09l1J06N7q7r2R1J07q6j08
$$ -48 -63 38 96 -28 -86 24 98 -9 -96 -33 87 39 -66 -48 51 62 -47 -78 28 85 -2 -94 -3 104 18 -90
6377i0O1J14m2j02KJ17J3j01l5R0O3q0r3O5J18m1j30J2J42%j37j7J18L5j06n3
$$ -90 -29 85 43 -59 -57 60 73 -28 -63 27 90 10 -83 -18 100 59 -71 -59 83 83 -54 -71 47 82 -24 -77
6403g7Q4P7p1r2M4J11k1j23k0J37L1j26n2J27N9j00q9J01R9p6j07M8J19j4j25
$$ -77 7 84 13 -79 -35 76 55 -68 -88 49 80 -46 -98 29 88 -12 -101 0 99 23 -84 -36 83 69 -56
6428e6j4J13N5j24p5J09R8q1j26P4J32o0j28L3J26nj28j9J18N5j02q5P1J15m6
$$ -56 -70 43 98 -26 -101 8 106 25 -101 -27 105 45 -83 -50 76 71 -57 -76 42 97 -5 -90 -19 96 50
6453E0j38L4J42k1j49PJ39K1j30m4J16O8r6r0P0Q4j1j23jJ56Nj43l3J26P7j37
$$ 50 -88 -54 88 67 -82 -75 64 85 -45 -89 27 95 -1 -91 -21 63 52 -71 -72 84 89 -54 -87 39 116 -21
6479b1p8J21J00j10j02P7J12l4j11j0J16K8j10p1J14Q4j03j18J00J35q6j31N5
$$ -21 -99 22 122 12 -90 -13 99 65 -46 -56 60 88 -22 -93 21 105 2 -116 -16 119 33 -98 -43
6502d3J47l7j32j4J21M0j08o5R2Q4n9j37N8J57l8j54J9J59qj40l0J35O2j15r3
$$ -43 104 67 -65 -79 42 82 -26 -91 1 85 26 -111 -53 104 66 -88 -69 90 82 -58 -88 47 109 -6 -99
6527i9J05R6n5j22L6J31Nj55l2J55O1j54q9J53R3j24j13R0J32q2j13K3J26J9j37
$$ -99 6 102 47 -75 -39 92 97 -58 -90 65 126 -28 -117 36 129 5 -108 -18 114 32 -81 -58 68 87 -50
6552e0m8J32P3j15j21J15J41j05j40P7J58n3j55J8J42K2j34m6J16P8r2j25Q0J55
$$ -50 -98 34 107 -8 -129 -14 127 22 -118 -41 117 64 -91 -73 69 91 -43 -89 27 105 13 -112 -32 123
6576A23n2j77M2J85l1j66pJ66J7j41m5J05R3r0j22N2J47l1j47j1J77J9j69n7J69
$$ 123 71 -106 -64 121 90 -76 -83 83 100 -41 -86 19 112 22 -100 -48 99 68 -79 -90 87 106 -63 -120 49
6601D9O3j51p2J14Q9q2j21O4J27Jj50j8J48N9j53r2J45J20j29j41J15J54p8j61
$$ 49 112 -39 -111 3 92 10 -111 -47 80 81 -69 -87 61 120 -33 -125 20 140 11 -130 -15 139 61 -100
6625a00N5J36j2j50k1J43N7j13r6R7J26p1j75O7J75m6j73K4J66J2j68l1J38O7
$$ -100 -45 91 79 -71 -92 51 108 -5 -101 -4 122 51 -124 -57 118 72 -101 -77 89 101 -67 -98 40 107
6649A07j20r5Q0J19m0j59J7J78J2j80l3J86N4j83n9J61Q6j29j03R1J15n3j33R
$$ 107 -13 -108 -28 91 51 -108 -91 87 99 -81 -114 72 126 -57 -116 45 131 2 -101 -10 105 52 -81 -72
6673g2J51L2j54o8J56R6j53j24J45J19r8j55R3J63p3j49J1J38M3j42q1J38J06
$$ -72 79 111 -43 -111 45 141 -12 -136 9 128 30 -125 -32 131 58 -91 -80 58 101 -41 -122 16 122
6696A22j28j22Q6J67q4j68N5J79j7j94QJ62L2j34p5J24Q9p1j37N0J61k3j80PJ79
$$ 122 -6 -128 -42 125 41 -127 -72 107 90 -104 -96 66 98 -36 -111 13 102 31 -106 -56 105 82 -98 -91 88
6721H8K9j83o0J79O9j43q2J15R4q5j14L3J43J1j66m0J68Q1j87q3J52J17j39j29
$$ 88 117 -66 -126 53 122 -21 -103 12 106 21 -93 -60 83 94 -72 -112 56 137 -50 -133 19 136 -3 -132
6745a32J05J51r2j34L4J52j3j38l8J40P7j31j03J14J34j05j44Q5J59n1j68K7J57
$$ -132 -27 124 32 -102 -68 84 71 -67 -105 35 112 -19 -122 -8 126 21 -123 -38 121 70 -98 -71 86
6768H6Mj40n6J47O9r9j21R9J35o1j65L1J75j4j74k2J80M4j58q2J45R3j13j07P9
$$ 86 90 -50 -106 41 110 11 -110 -11 124 63 -102 -71 104 90 -84 -106 74 118 -40 -122 23 116 3 -104 -25
6793b5J23m9j38jJ61K5j63n9J66R3j62j08J36J28j10j38Q3J36l1j53j0J57M3j38
$$ -25 98 49 -89 -90 71 96 -67 -126 40 133 -29 -137 -1 127 17 -121 -38 98 67 -86 -96 61 104 -34
6817c4p2J32R5j16j31J02J64r0j68O6J64k4j64qJ38N5j41q8J12J18q1j55O6J69
$$ -34 -106 26 121 5 -126 -24 140 50 -118 -52 112 88 -76 -84 54 109 -32 -120 -8 110 29 -126 -60 109
6841A09l6j71NJ79J1j70l7J38R2j32j03J02J24p6j40N5J45oj72j0J57M9j54p3
$$ 109 73 -98 -93 86 97 -73 -110 28 120 -12 -115 -13 111 35 -105 -50 95 89 -83 -93 64 113 -41 -114
6865a14J38J11j20j37J06J40o8j64M4J50Qj62l9J45Q2j35j10J27J26j06j47P2
$$ -114 24 135 15 -122 -16 124 56 -108 -64 86 94 -68 -107 38 120 -15 -125 2 128 22 -125 -53
6887e3J71m9j77K5J50K7j54n3J31J00j24j20R8J44o2j66M6J63rj70j8J55M9j44
$$ -53 118 69 -108 -83 67 94 -60 -113 18 118 -6 -126 -28 116 54 -112 -66 97 88 -82 -100 55 104 -40
6911d0p3J26J08r8j43R5J43n0j61J1J66J3j55n0J59P1j41j00J04J40j00j38N4
$$ -40 -113 13 121 23 -120 -25 118 68 -93 -82 84 97 -58 -108 51 122 -19 -119 -15 125 25 -113 -59
6934e9J60k9j70JJ64M3j63o5J37R4j24j18R0J60p4j59L9J65Oj74j9J41P2j56q7
$$ -59 101 72 -98 -97 67 110 -53 -118 19 113 -11 -129 -39 121 47 -112 -73 92 98 -76 -95 46 118 -38 -125
6959a25J25J28j06j26O2J59m8j56PJ61J0j47n5J44R2j49j12J19J30p9j58N6J63
$$ -125 0 128 22 -104 -42 117 69 -87 -80 81 91 -56 -111 33 125 -24 -136 -17 113 34 -124 -68 95
6982I5rj67j3J53M2j49p9J38J11j21j30R2J56o6j72M4J72rj63k8J60N1j28q9J03
$$ 95 86 -81 -94 59 101 -48 -127 11 122 1 -129 -37 119 53 -119 -75 97 88 -75 -103 57 108 -20 -109 -6
7007fJ26r1j34O0J58k8j71mJ77L0j69p5J65R3j46j10J03J36p1j57M9J52oj57m0
$$ -6 120 29 -105 -45 113 85 -86 -90 87 117 -52 -127 38 131 -15 -125 -22 114 43 -114 -65 87 81 -76 -116
7032a16J70O9j58j02J56J18j34j29R6J49p6j45L0J62jj45m3J48Q8j47j15J14J41
$$ -116 54 123 -35 -137 19 137 3 -126 -30 119 43 -102 -72 90 89 -56 -99 49 137 -10 -125 -11 130
7055A30q5j63O9J67m9j58J1J68K0j69m0J27J00j10j25Q0J44o1j63K2J89oj83l0
$$ 130 45 -118 -49 118 69 -89 -78 90 110 -59 -99 28 128 18 -107 -27 117 56 -107 -85 104 98 -85 -115
7079a15J80N4j64p5J25J19j06j34Q0J31k1j67NJ64M4j71p0J57J04j58j19J43J27
$$ -115 65 119 -45 -120 5 124 18 -116 -36 95 74 -93 -88 76 120 -51 -121 36 140 -18 -137 6 133
7102A33j10j37P0J40k0j52j8J46N0j29r3J26J29j16j57J09J62q6j70N7J73k7j61
$$ 133 23 -114 -44 96 76 -76 -94 52 102 -27 -120 6 135 19 -138 -29 133 47 -123 -66 107 80 -81
7125h1j8J38P3j26j02R8J34r1j41M0J87k8j91J8J85J5j83m3J67P5j42r3R7J21
$$ -81 -99 39 112 -14 -116 -18 116 25 -116 -76 111 83 -108 -90 95 110 -73 -116 51 126 -16 -109 -12 109
7149A09o1j40K8J62Jj76m0J86O0j73r8J72J02j32j37J10J38o5j44K8J34K3j46
$$ 109 48 -92 -64 98 99 -77 -117 69 129 -44 -142 30 132 0 -137 -27 111 46 -98 -70 64 87 -59
7172e9n5J42R3j19j33J28J32r2j70P9J67n5j57K2J56Nj22n6J02J06j02j34Q0J70
$$ -59 -114 28 121 2 -131 -3 129 37 -133 -54 113 58 -99 -77 79 84 -38 -94 8 114 12 -122 -42 128
7196A28o5j87M5J90j0j97RJ67K4j45o3J22P9q7j14O9J39k6j75rJ80L2j78n9J77
$$ 128 63 -124 -79 111 101 -96 -87 80 104 -41 -104 18 97 10 -104 -35 104 78 -97 -106 74 106 -72 -131 46
7221D6Q1j55j00J37R8q4j25M6J40k3j30m0J44Q0j40j05J38J26j19j40R4J70r9
$$ 46 127 -28 -128 9 107 23 -102 -56 84 61 -69 -109 35 115 -25 -130 8 134 15 -125 -31 139 40
7244D0j52N7J50k3j39k0J28O2r4j16J05J16p1j65O0J86l7j95K1J73Lj59k5J34
$$ 40 -112 -55 95 72 -67 -87 41 103 9 -107 -2 114 43 -122 -62 124 87 -108 -87 86 89 -70 -95 39
7268C9M7j08q4P1J21k9j50J0J75Pj86l1J93L8j74o1J43R0j16r0Q2J03m2j21MJ27
$$ 39 86 -22 -106 -35 86 57 -93 -83 92 99 -87 -118 75 113 -61 -122 21 111 -5 -95 -13 90 48 -73 -69 58
7294E8N2j45p9J53R1j46j13J35J25j06j40Q4J31l7j38LJ32L5j19p6J04J03r3j29
$$ 58 110 -35 -114 39 130 -16 -129 6 131 25 -115 -31 100 63 -75 -72 60 95 -24 -100 4 107 14 -115
7318a15P2J59p0j58M1J64k5j54LJ41K1j23n6J00R8o5j15M3J26rj66J5J51K9j64
$$ -115 -43 116 46 -112 -71 93 68 -86 -83 58 79 -44 -100 0 98 33 -82 -39 87 78 -88 -73 78 107 -57
7343e7n3J67N2j24p9J03P9n4r4J1J22kj25n5J52O6j48q3J32J12j29j09R7J20o4
$$ -57 -110 57 109 -15 -94 9 88 34 -60 -49 73 71 -54 -109 43 109 -39 -122 10 122 -7 -116 -19 101 37
7368C7j16L1J14jj08l7J05Q8j13j07R7J23p8j37O7J41m7j28kJ35J5j18m0R5P3
$$ 37 -79 -48 66 65 -43 -80 25 113 0 -107 -10 113 35 -102 -35 106 59 -69 -71 64 79 -39 -79 16 89
7393H9q4q7N2J33m6j56K3J56%j48k3J41M6j41n4J10P3p9r1N4J16k9j17k2J35K8
$$ 89 5 -82 -30 103 57 -99 -76 80 80 -68 -91 50 96 -45 -99 11 84 5 -86 -32 84 55 -62 -84 51 79
7419G9j27n0J19Q7j30r3J19J00q5j10N6J09j3j15k2J22M3r7q5J08J01j00j10O6
$$ 79 -48 -98 21 108 -22 -115 4 104 19 -91 -35 74 61 -54 -76 46 89 -8 -93 15 116 16 -94 -28
7443b8J35o7j26L4J32k1j17NR5M3j06o8Q2R9n7j30N0J30k6j43QJ40Nj09m6J13
$$ -28 107 40 -86 -52 80 59 -58 -53 42 85 -21 -89 -7 92 35 -95 -45 85 59 -84 -76 64 69 -40 -86 27
7469B7O9j02q5Q1R7n5j13M9J08mj25k5J21O3j24p4J18Q9j11r5P5J02l8j10K5R8
$$ 27 96 -6 -91 -10 87 32 -81 -32 76 72 -53 -78 43 106 -18 -92 26 115 4 -91 -16 86 48 -62 -37 61
7495F1J7j15m1J12P4j16r4R5J09q1j22P6J10l7j24J6J12K7j16m6R8P3p8j00P2
$$ 61 78 -37 -78 34 108 -8 -102 -7 102 21 -101 -25 85 48 -76 -60 52 79 -37 -83 15 88 10 -90 -18
7520a8J12o9j08L6J35k3j31KJ18M5j09p1Q5Q3p0j03O2J13l8j19J3J13K4j27l6
$$ -18 94 25 -83 -47 88 65 -66 -64 54 99 -10 -81 4 87 17 -86 -24 89 51 -68 -55 58 82 -45 -81
7545h1J17N7j12o6Q6R1p1j10N1J18j8j38PJ17K4j11n3J15P8r5j00P8J10n3j21
$$ -81 36 93 -19 -85 1 92 21 -89 -38 80 62 -76 -69 48 72 -39 -92 23 101 6 -94 -16 94 41 -80
7570h0L2J27j5j23j2J26N2j24o2Q9Q2p2j14Q1J01m1j18K3J24jj28k9J17O1j18
$$ -80 -48 79 64 -59 -71 55 107 -17 -79 10 92 20 -94 -13 88 47 -71 -48 76 75 -53 -82 35 96 -22
7595b2q2J02R9p5j21N3J22qj30j0J23K8j18m5J05O6q5j01O9J22n8j21K6J36j4
$$ -22 -104 -2 97 22 -99 -46 76 68 -62 -72 51 79 -39 -84 21 87 2 -99 -30 92 34 -87 -61 75 61
7620F1j24mJ20L9j02o9R4R2q3r7N3J24m6j32J2J37Rj43k1J25M4j01p7R6R6q0j03
$$ 61 -63 -67 53 92 -10 -79 15 107 24 -73 -20 104 58 -74 -62 75 84 -59 -80 45 89 -12 -89 7 103 23 -80
7647h0M1J21l0j22lJ33K3j23n5J22P1j09q0Q2R7o2j06M1J08mj10k3J09O2j10o9
$$ -80 -39 82 52 -70 -73 60 83 -40 -95 27 98 -11 -91 -9 88 26 -80 -39 69 65 -45 -68 41 103 -7 -76
7673g6R7Q7r1j06P5J07m1j22K6J18Nj19l0J06N0r6q0P5J07o8j16M2J31j4j48J1
$$ -76 21 108 17 -89 -14 93 52 -70 -44 74 79 -40 -70 36 86 -10 -90 -15 92 24 -92 -50 81 67 -81 -70
7699g0J30J1j09n4J31N6r2q9P5R9m3j25K9J13Qj26k3J40L6j23o4J16P0q6q9P3
$$ -70 60 71 -38 -92 39 95 3 -86 -11 88 45 -80 -51 62 70 -56 -79 61 97 -26 -90 26 96 10 -79 -6
7725fR2m0j10J5J09J5j10m9J18O3j04r1J04R6q9j06N7J16k4j31RJ10K4j03m2Q4
$$ -6 86 46 -64 -49 60 75 -35 -84 34 97 -7 -98 6 102 13 -93 -36 80 56 -75 -66 44 68 -35 -77 7
7751GP5o8j18Q1J09m7j40M2J43j4j39%J26K5j08n3Q1R2o2j08N2J12k5j40lJ47
$$ 7 82 14 -104 -23 86 39 -101 -59 84 70 -69 -69 57 82 -26 -79 2 94 32 -76 -24 88 63 -77 -80 67
7777F7K3j52k9J27N1j09o8R7Q5p4j08M3J18oj27k1J31M6j31p0J15R5j05j03R1
$$ 67 90 -62 -91 36 87 -22 -90 7 92 18 -90 -47 71 65 -62 -83 48 94 -37 -107 8 103 -2 -105 -14
7802a4J07p0j04M2J08j7r9j1J00M7p9r9Q6J17q9j22O6J32n5j28K1J41j3j19qJ00
$$ -14 93 23 -81 -39 69 52 -47 -58 42 89 10 -89 -3 114 25 -97 -31 101 46 -82 -61 80 67 -52 -60 40
7828D0M1q1r0Q0R5m1j32K9J47j2j56MJ44Mj21m0J13N4r5o5O3R4l3j16kJ29K3j38
$$ 40 81 0 -90 -10 85 44 -88 -59 88 76 -80 -76 68 72 -49 -89 24 78 -17 -82 -19 75 42 -74 -76 53 76 -62
7856f2k8J35M6j21o2J04Q7r3q8P1R7m2j04PJ05K2j06n9J05R2r0j18J00J29j01
$$ -62 -90 45 91 -30 -92 12 99 6 -82 -11 86 44 -60 -53 52 74 -32 -91 14 106 16 -102 -2 127 26
7881B6j24N2J31m0j06nJ09K3j02m9Q0R7o4j18L2J67n5j49J5J73Kj65lJ31K3j10
$$ 26 -98 -46 85 45 -61 -66 43 66 -36 -85 -5 92 28 -90 -58 109 54 -95 -80 93 95 -70 -73 58 81 -29
7907b9m1P5Q0n1j03K3J21J7j50l4J59L9j49n8J47O0j24p2Q9Q3n1j18M2J05Qr8
$$ -29 -70 5 85 34 -69 -46 75 92 -58 -92 67 106 -43 -101 46 106 -18 -90 -1 82 31 -87 -45 60 68 -30
7933c0m9J06O4j11r7J15J04q7j32Q6J25m5j36L4J19nj04k9R2P1q1r8O5J25m7j57
$$ -30 -79 27 91 -20 -117 -2 102 15 -117 -31 94 49 -87 -53 66 61 -43 -72 20 91 10 -88 -23 102 55 -102
7959a02N1J60l2j65J4J33K8j20m6J16M7p5r6N0J33l2j32oJ56J6j67k3J48N3j55
$$ -102 -51 109 77 -88 -74 59 87 -33 -79 37 84 9 -87 -37 96 64 -68 -74 82 98 -69 -92 56 109 -46
7984d6o1J19P7r4q4N8Q8lj18j7J37M5j39p0J27J00j30r8J10J14r3j22O5J18j5
$$ -46 -107 12 89 -5 -89 -31 57 54 -64 -81 56 101 -38 -108 19 119 -11 -109 1 115 22 -100 -35 83 68
8009F8j12j8J04N1j05r0J07J01q6j29O6J51m7j52K8J53j8j33j5J19M9j12p7Q9
$$ 68 -44 -62 42 93 -12 -102 5 106 20 -109 -43 108 61 -91 -63 90 72 -61 -76 43 92 -20 -97 -8
8033hR3o5j15N4J28j0j45k8J64K8j60l8J39P3j36o9R5R0o0j02L4J10J7j37m1J41
$$ -8 85 20 -95 -41 87 77 -68 -96 68 96 -64 -102 37 110 -26 -95 0 90 30 -72 -38 72 89 -48 -89 52
8059E2N5j28r7J52R3j25j09R9J06o6j14K8J27jj25l6J19Q2j21j06J00J32q8j47
$$ 52 107 -21 -118 34 127 2 -107 -8 98 32 -82 -54 73 72 -53 -89 30 112 -9 -115 -15 117 29 -118
8083a18Q0J39l5j53J8J36K1j41l4J02Q2q1j09O0J38o5j36L6J49qj47rJ41L2j37
$$ -118 -38 101 66 -87 -69 67 88 -53 -87 15 97 16 -93 -33 105 40 -96 -60 89 81 -66 -75 66 98 -39
8108c9n4J07Q1r1j00O5J10k5j24JJ38J5j26o2J41P3j37q9J18J04r4j18O5J18l3
$$ -39 -93 14 95 4 -96 -31 79 54 -70 -69 69 84 -42 -104 37 110 -27 -116 2 106 12 -106 -41 77 44
8133D4j12KJ20L5j23p1J32Q6j15j08J07J19q4j32N9J25pj46nJ34M2j25p3J11R5
$$ 44 -68 -66 54 89 -34 -105 27 113 -2 -110 -3 116 32 -100 -41 84 77 -69 -74 60 102 -23 -96 15 110
8158A10q1j32P4J33m3j46J2J52Lj42k2J33M9j20p2Q6J05q8j10O3J27k2j44pJ38
$$ 110 29 -103 -29 104 61 -85 -73 79 82 -60 -82 51 100 -20 -92 -6 99 11 -99 -36 91 69 -75 -82 56
8183E6L5j47m3J38P0j11r2Q5
$$ 56 91 -56 -99 39 109 -2 -94 -9
8191i
$$ Imaginary data points
##PAGE= N=2
##DATA TABLE= (X++(I..I)), XYDATA
0@%%%%%%%%%%%%%%%jRj6J6j6J6k1K9l2L3m1M9n7O7p6Q9j04J20j36J53j70J89k13
$$ 0 0 0 0 0 0 0 0 0 0 0 0 0 0 0 0 -1 8 -8 8 -8 8 -13 16 -16 17 -24 25 -32 35 -41 48 -56 64 -72 81 -89 100 -113
38a13K40k67K96l31L68m08M52n00N52o09O72p39Q13q95R86j088J201j328J471
$$ -113 127 -140 156 -175 193 -215 237 -263 289 -320 352 -387 426 -469 517 -571 630 -698 773
57G73j634J824k044K304k620L011l508M163n077O451q765J3615m0591P1704O2954
$$ 773 -861 963 -1081 1223 -1397 1614 -1894 2269 -2808 3643 -5122 8493 -32098 39606 102560
72A02560j38664m1692R4201N4001p4222n3003L5763P0189j1462q0836j5804J02870
$$ 102560 -36104 -77796 16405 70406 -3816 -56819 -21056 49133 37671 -43165 -58969 43901
84D3901L4525j12959n6530J15409O6917j03443p7037Q5153Q1601n4849q1743K8460
$$ 43901 78426 -34533 -91063 24346 91263 -12180 -89217 -4064 77537 22688 -59055 -30595
96c0595P6736r265q0741o997Q7650K9337q9177n0578Q1366O9694o7743q5526M7124
$$ -30595 46141 36876 -43865 -50862 36788 66125 -23052 -73630 7736 77430 9687 -75839 -28715
109b8715R5626k5906r8160R933R8589J873r6553j2821Q9474K1810p9728l3685
$$ -28715 66911 41005 -57155 -47222 51367 53240 -43313 -56134 33340 55150 -24578 -58263
121e8263O7676N3756m6876p5975J8610R0877O009r8813k1065J02983K8545j02158
$$ -58263 9413 63169 16293 -59682 -41072 49805 55814 -42999 -64064 38919 67464 -34694
133c4694l0500R6436L1330q6064l7401O7605M8707m1050o1279J2390P4262J4446
$$ -34694 -65194 31242 62572 -23492 -60893 6712 55419 14369 -46910 -34520 39742 54188
145E4188q5429l7570Q9237N1072q6159n2996Q1728N1182p5175n2825O1626N8041
$$ 54188 -31241 -68811 20426 71498 -14661 -67657 14071 65253 -9922 -62747 -1121 56920
157E6920m0601o4918J4522P1248J3664p2950l7953O9363N3522o4010o2336N7652
$$ 56920 16319 -48599 -34077 37171 50835 -22115 -60068 9295 62817 -1193 -63529 -5877
169e877O7529m8915p0135L8749P2843k6778p7736R348Q0633J2865p5929l3758
$$ -5877 61652 12737 -57398 -18649 54194 27416 -50320 -40972 39661 52526 -23403 -57161
181e7161O4355M9437m9473n9886L4108O6340k1074p1694J0847P8621k20q5035
$$ -57161 7194 56631 7158 -52728 -18620 47720 26646 -45048 -34201 44420 44200 -40835
193d0835j2682Q6258K5997q0507l8401O7465M9114m7450n5843K4652N8409m861
$$ -40835 -53517 32741 58738 -21769 -60170 7295 56409 8959 -46884 -22232 36177 31316
205C1316o0686j0186O5520K2506p1433l3542P5139M3968p2981n3335O2017N8911
$$ 31316 -29370 -39556 25964 48470 -22963 -56505 18634 62602 -10379 -63714 -1697 57214
217E7214m3475n9009K2169N5731k017n2331j5553N0541K9796n1112m1495N3079
$$ 57214 13739 -45270 -23101 32630 30613 -21718 -37271 13270 43066 -8046 -49541 3538
229C538N2647n2356o2746M5238O8816l1850o8887J5010O3556J963n4974j6465
$$ 3538 56185 3829 -58917 -13679 55137 23287 -45600 -30590 32966 34929 -20045 -36510
241c6510M6569K7986m1097l8704L7690N0149l3259o1165K5546O9436j4035p2768
$$ -36510 10059 38045 -3052 -41756 -4066 46083 12824 -48341 -22795 46641 32606 -40162
253d0162p6O9678J3900o1035k4425N0267L1622m0392l7592L1838M4367k3368n2424
$$ -40162 -40238 29440 43340 -17695 -42120 8147 39769 -623 -38215 -6377 37990 14622 -37802
266c7802J2959O0290N22o4935j5771O3826K9295n7352l8414M7892M2877l7763
$$ -37802 -24843 35447 35969 -28966 -44737 19089 48384 -8968 -47382 510 43387 5624
278E624m4256K8296M5156j8951m7503P798N0983O484n2993k2778N1254L7891m5323
$$ 5624 -38632 -10336 34820 15869 -31634 -23836 27147 33631 -19362 -42140 9114 47005 1682
291A682m8797L6491N3851k7118n3934J8876N1819j1323n0026K305M8962R782m7065
$$ 1682 -47115 -10624 43227 16109 -37825 -18949 32870 21547 -28479 -26174 22788 32570 -14495
304a4495k4507M2532L9570l4462n1519K3849N7884j3166n8702M486N6112K207
$$ -14495 -39002 3530 43100 8638 -42881 -19032 38852 25686 -33016 -28530 27582 29789
316B9789n2597q737M9125J7045m5039k7888L8534L9842k8432m9817J5584N5234
$$ 29789 -22808 -31545 17580 34625 -10414 -38302 232 40074 11642 -38175 -22591 32643
328C2643k501n5565q283N2346J5967m7840k1540M3630K7054l9351l4073L3128
$$ 32643 30142 -25423 -33706 18640 34607 -13233 -34773 8857 35911 -3440 -37513 -4385
340d385M2038k3462m8719J0632N1723L260n0213j5566M5267K4452l9167l0188
$$ -4385 37653 14191 -34528 -23896 27827 31087 -19126 -34692 10575 35027 -4140 -34328
352c4328L3942L4623k9484l9504K4198M4975j6192m9486M931N0927Q140m7965
$$ -34328 -386 34237 4753 -34751 -10553 34422 18230 -31256 -26325 24602 32742 -15223
364a5223k0415M1293K9566l3222l5270K5899L8834j9911m2107J4205M5813o864
$$ -15223 -35638 5655 35221 1999 -33271 -7372 31462 11551 -30556 -16351 29462 22598
376B2598m9004l214M9687J5191m6167k6608L8708L5064k9152l9728J9880M1427
$$ 22598 -26406 -29620 20067 35258 -10909 -37517 1191 36255 7103 -32625 -12745 28682
388B8682j2136m2150N425M3313J872m4615j1120M4240K1938m0504l2314L3019
$$ 28682 16546 -25604 -20179 23134 25006 -19609 -30729 13511 35449 -5055 -37369 -4350
400d350L9861k3075m3231J2993M3049m503m1287k332L9817Q949l8985j6690L7473
$$ -4350 35511 12436 -30795 -17802 25247 20744 -20543 -22875 16942 25891 -13094 -29784 7689
413G689K5808l3548l4883K6158M1578j6117m4323N538M3312L579m0345j0615L7442
$$ 7689 33497 -51 -34934 -8776 32802 16685 -27638 -22100 21212 24791 -15554 -26169 11273
426A1273J6386l5362k2353L3306K9270k9289l6302K1921M1517j1448m3309k65
$$ 11273 27659 -7703 -30056 3250 32520 3231 -33071 -11150 30367 18919 -24390 -24655
438b4655M1554J0883l7719j9060L3830K4900l1140k9691K9047L4422k5587l8907
$$ -24655 16899 27782 -9937 -28997 4833 29733 -1407 -31098 -2051 32371 6784 -32123
450c2123J8976M1833q867m1689l348L8312J5153l2815k4528K7387L0978k3556
$$ -32123 -13147 28686 19819 -21870 -25218 13094 28247 -4568 -29096 -1709 29269 5713
462E713l5329K1100L8676j8315m1447J3155M2738m630m1291o425L6595J7640k9511
$$ 5713 -29616 -8516 30160 11845 -29602 -16447 26291 21661 -19630 -26055 10540 28180 -1331
475a331k6808K2070L2985j6040l6633J1899L9006q391m0915L587M1953L787m0836
$$ -1331 -28139 -6069 26916 10876 -25757 -13858 25148 16757 -24158 -20571 21382 25169 -15667
488a5667j3296L6580K2920k9471l0463K0968L4683j2952l6036O341L6091o18l6171
$$ -15667 -28963 7617 30537 1066 -29397 -8429 26254 13302 -22734 -16393 19698 19080 -17091
501a7091n647L6447J3625l5886k2902L3146L1691k7654l7609K0142L9260j2088
$$ -17091 -22738 13709 27334 -8552 -31454 1692 33383 5729 -31880 -11738 27522 15434
513A5434l7126M565L3112K433k9356r989K6909J8866k5258k8719K3064L7729j9308
$$ 15434 -21692 -17127 15985 18418 -10938 -20927 5982 24848 -410 -29129 -6065 31664 12356
526A2356m3410J3951M4167p753m0134J665L3162M212k5892j0506K0191J8162j6321
$$ 12356 -31054 -17103 27064 19311 -20823 -19158 14004 18216 -7676 -18182 2009 20171 3850
539C850k7251J3121L6269r338m2712M467M4524Q47m1404n636L4819R652k7118
$$ 3850 -23401 -10280 25989 16651 -26061 -21594 22930 23777 -17627 -23263 11556 21208 -5910
552e910j3548K0313J8317j4924k4351J0220L1029n043l6562j329L8998Q402l7376
$$ -5910 -19458 855 19172 4248 -20103 -9883 21146 16103 -20459 -21788 17210 25612 -11764
565a1764j4869L2474J9488k6336k2347K0907K4476j6635k6900J2382K9626o713
$$ -11764 -26633 5841 25329 -1007 -23354 -2447 22029 5394 -21506 -9124 20502 13789
577A3789l1480j024L1320J0225k8688j9348K4195K6830j9177l1572J5049L3530
$$ 13789 -17691 -18715 12605 22830 -5858 -25206 -1011 25819 6642 -24930 -9881 23649
589B3649j2524l3652J0721L2896p599l1352J395K8059P844k2430j8137J5240K7159
$$ 23649 11125 -22527 -11806 21090 13491 -17861 -16466 11593 19437 -2993 -21130 -5890 21269
602B1269q512l3464L977L6986j882l8133J187L7212j84l4369k722K9614Q315k2827
$$ 21269 12757 -20707 -16730 20256 18374 -19759 -18572 18640 18456 -15913 -18635 10979 19294 -3533
616c533j6088J4110K4055m642l0044l368L3056Q183l3932r956L3829J0720l2676
$$ -3533 -19621 -5511 18544 13902 -16142 -19510 13546 21729 -12203 -22159 11670 22390 -10286
629a0286j2552K9500J6030k3564k0211J5367K3945o173k6429k773K7091J0337
$$ -10286 -22838 6662 22692 -872 -21083 -5716 18229 12056 -14373 -17146 9945 20282
641B0282k5922j5664K3737J8773k1836k0980K0457K3872j8270k7409J3665K9790
$$ 20282 -5640 -21304 2433 21206 -630 -21610 -1153 22719 4449 -22960 -9295 20495
653B0495o736k9040p25K5198P056j9963j2078J5031J6656j1028k1326P944K5784
$$ 20495 13759 -15281 -16006 9192 16248 -3715 -15793 -762 15894 4866 -16460 -8516 17268
666A7268n655k9717L653L2548r48l3043l020K9752P421k2725j0754J4149J2961
$$ 17268 11613 -18104 -14451 18097 17149 -15894 -18914 10838 18259 -4466 -15220 -1071 11890
679A1890o812j5571J795K0024J983k5706n711L0349R259l2072j1928L0459J3485
$$ 11890 5078 -10493 -8698 11326 13309 -12397 -18108 12241 21500 -10572 -22500 7959 21444
692B1444k5872j4377J8754J4806j0243j4863K261J5319L949j7507q786K1398J3721
$$ 21444 -4428 -18805 -51 14755 4512 -10351 -8090 7229 11178 -6329 -15115 6283 20004
705B0004k4784j8892K5045K2729k1615k3572J6119K1762j0375j9224M772J7305
$$ 20004 -4780 -23672 1373 24102 2487 -21085 -4966 16796 6421 -12803 -8031 9274
717I274J078j6162p121J5431J2861j4960j8271J4224K3384j1986k7259P672K8361
$$ 9274 10352 -5810 -12931 2500 15361 401 -17870 -3646 19738 7752 -19507 -11835 16526
730A6526k447k6183j648K2307M042j8916o176J6469R726j3656j4678R207J9596
$$ 16526 14079 -12104 -13752 8555 12597 -6319 -12495 3974 13700 44 -14634 -5427 14169
743A4169l540k3277k200K5479P245k6161j1127K4983J3343k2145j3570J8593J2817
$$ 14169 10629 -12648 -14848 10631 17876 -8285 -19412 5571 18914 -3231 -16801 1792 14609
756A4609j4900j2988J0350J4952l629j7607n059J9162J3408j9029j9091J8161
$$ 14609 -291 -13279 -2929 12023 8394 -9213 -14272 4890 18298 -731 -19822 -1661
768a661K1420j7406k1394J6395K0044j4118j8081J0166J6094m527j4658k641J3745
$$ -1661 19759 2353 -19041 -2646 17398 3280 -14801 -4635 11459 6932 -7726 -10367 3378
781C378J0858j2511j8522J0427K3459q105k4752O681K3509o232k1619N259J9957
$$ 3378 14236 1725 -16797 -6370 17089 8984 -15768 -9087 14422 8190 -13429 -8170 11787
794A1787k257j8017k887J5116Q929j1352j4438P267J8670l357k1110p8K1675K658
$$ 11787 9530 -8487 -11374 3742 12671 1319 -13119 -5852 12818 9461 -11649 -11727 9948 12606
808A2606k0956m236J9994N573j9300p861J8140J1308j5239j4804J0197J6800m055
$$ 12606 -8350 -12586 7408 12981 -6319 -14180 3960 15268 29 -14775 -4578 12222 8167
821H167j6956j664J6087O303j5357r987J5280J3106j5579j5729J5651J7796j4595
$$ 8167 -8789 -10453 5634 11937 -3420 -13407 1873 14979 -600 -16329 -678 17118 2523
834B523j9087J1611J9076o537j7315K11J4044N905j0571j0922Q401J4919q021
$$ 2523 -16564 -4953 14123 7586 -9729 -9518 4526 10431 -140 -11062 -2661 12258 4237
847D237j8447Q560K1476q500k3227O878K2897l619k0244p58J5915N437j0935r780
$$ 4237 -14210 -5650 15826 7326 -15901 -9023 13874 10255 -9989 -10747 5168 10605 -330 -10110
861a0110O546J3469l639j6615K192J9442j336k1800j61K2815K902k1611o400J8094
$$ -10110 -3564 9905 6266 -10349 -8157 11285 9949 -11851 -12012 10803 13705 -7906 -14306 3788
875C788R657j3161j1997Q201J3501m093j4673R57J5932J766j7248m780J8107Q387
$$ 3788 13445 284 -11713 -3512 9989 5896 -8777 -7820 8112 9878 -7370 -12150 5957 14344
889A4344j7809j2219J5832J5415j2421j7097Q351J7024m557j5792J379J4406J621
$$ 14344 -3465 -15684 148 15563 3142 -13955 -5604 11420 6863 -8929 -7550 6856 8477
902H477j3449n156J2837R530j1899j4214J0098J8155p442k0331M455K0247j713
$$ 8477 -4972 -10128 2709 12239 340 -13874 -3776 14379 6937 -13394 -8939 11308 9595
915I595j8398m97J5662K500j2991m978J0726Q451q562j2722N982J6874k838j9659
$$ 9595 -8803 -9300 6362 8862 -4129 -9107 1619 10070 1508 -11214 -5232 11642 8804 -10855
929a0855m59K0347L263j9078n092J6587O251j3823p394J1174R219q485j1904N278
$$ -10855 -11314 9033 12296 -6782 -11874 4713 10964 -2859 -10253 921 10140 1655 -10249 -4971
943d971J4866j378j7103k870J7777O734j6815r438J4723J0892j2320j1518J0064
$$ -4971 9895 8517 -8586 -11456 6321 13055 -3760 -13198 1525 12417 97 -11421 -1357
956a357J2152p821j3198N001J4466j241j5323l240J5006P692j3407j1214J0964
$$ -1357 10795 2974 -10224 -5223 9243 8002 -7321 -10561 4445 12137 -1270 -12484 -1520
969a520J3320q466j4157O389J4412m655j4670K735J4988J1j4891l671J3834P685
$$ -1520 11800 3334 -10823 -4434 9978 5323 -9347 -6612 8376 8387 -6504 -10175 3659 11344
983A1344j1580j1144Q492J3384n333j4385K765J4600r04j4655p38J4762K802j4613
$$ 11344 -236 -11380 -2888 10496 5163 -9222 -6457 8143 7239 -7416 -8154 6608 9410 -5203
997e203n601J3605Q809j1315j1685P994J3512m275j4104R57J3876J584j3447l626
$$ -5203 -10804 2801 11610 295 -11390 -3396 10116 5841 -8263 -7306 6570 8154 -5293 -8919
1011h919J3247N630j3033q074J2263J0742j0339j3070P232J4334l427j4314k48
$$ -8919 4328 9958 -3075 -11149 1114 11856 1517 -11553 -4321 10013 6586 -7728 -7976
1024g976J3338L239j2075n505J1089P508j0429r615R573J1839p854j3760N047
$$ -7976 5362 8601 -3474 -8979 2110 9618 -811 -10426 -853 10986 3132 -10628 -5581
1037e581J4666j428j4294k201J2814N205j0968p364R353Q952q178j0442P112J1989
$$ -5581 9085 7657 -6637 -8838 3976 9181 -1787 -9151 202 9154 976 -9466 -2354 9635
1051I635n427j3364K816J3967O69j3459m298J1872P335r773r405P858J0602o436
$$ 9635 4208 -9156 -6340 7627 8296 -5163 -9461 2411 9746 -27 -9432 -1574 9028 2592
1065B592j1412N280J2150l756j2806J366J2934J907j2091n528J0294Q661p928
$$ 2592 -8820 -3540 8610 4854 -7952 -6586 6348 8255 -3836 -9364 930 9591 1663
1078A663j0776N718J1832m080j2200K934J2323j709j2379j47J2024K841j0891
$$ 1663 -9113 -3395 8437 4357 -7843 -4909 7414 5705 -6674 -6821 5203 8044 -2847
1091b847n987Q823Q817o152j0732L523J1545j454j1599O4J1399J057j1187k455
$$ -2847 -8834 -11 8806 2654 -8078 -4555 6990 5536 -6063 -5999 5400 6457 -4730 -7185
1105g185J0822M472r888o904Q094R097n516j0476K688J0776k00j0297j704R636
$$ -7185 3637 8109 -1779 -8683 -589 8508 2992 -7484 -4796 5980 5780 -4517 -6221 3415
1119C415L150r175m632Q908O498q425q625P237J0532n261j1476K770J1215k99
$$ 3415 6565 -2610 -7242 1666 8164 -261 -8886 -1649 8883 3622 -7854 -5084 6131 5832
1133E832r966j822Q365L610p051n395O186P493n541r841M636J1922l207j2997
$$ 5832 -4134 -5956 2409 6019 -1032 -6427 -241 7252 1711 -8130 -3494 8428 5221 -7776
1147g776J345J2634N72j0910k236Q462L627o025n062M100O835k590r075J287J1258
$$ -7776 -6431 6203 6775 -4135 -6371 2091 5718 -307 -5369 -1269 5566 2976 -6099 -4812 6446
1162F446J60j2701j783J2808L271j1418m346Q936M938o094n363L542O040j367
$$ 6446 6606 -6095 -7878 4930 8201 -3217 -7563 1373 6311 217 -5146 -1604 4436 3069
1176C069p300n21Q901K473j0241m499J0636O275r772p430P894P788n580p586L344
$$ 3069 -4231 -4752 4149 6622 -3619 -8118 2518 8793 -979 -8409 -515 7273 1693 -5893 -2549
1191b549P262j434p200l10P466K237p762m440P519O733o433q602M622R675k671
$$ -2549 4713 3279 -3921 -4231 3235 5472 -2290 -6730 789 7522 1089 -7513 -2891 6784 4113
1206D113r814J120R351r7q715o19Q007J537p114k970N710M871l680o951J262Q667
$$ 4113 -5701 -4581 4770 4673 -4042 -4661 3346 4883 -2231 -5201 509 5380 1700 -5251 -3989 4678
1222D678J128r707k790R973L380r664l094R062K561q036k559O310L320l640m656
$$ 4678 5806 -3901 -6691 3282 6662 -3002 -6096 2966 5527 -2509 -5068 1242 4562 922 -3734
1237c734L64O016K863p169n241P952O399q378o406Q397N693p912m856O758M484
$$ -3734 -3370 2646 5509 -1660 -6901 1051 7450 -928 -7334 1063 6756 -1156 -6012 746 5230
1252E230m713m759J760N367J696n783m825N802O851n622p628N490P585n316p351
$$ 5230 517 -4242 -2482 2885 4581 -1202 -6027 -225 6626 1004 -6624 -1134 6451 1135 -6216
1267f216M730P211l427p163J491P013Q53o606l206N692N216m256o448K590O951
$$ -6216 -1486 5725 2298 -4865 -3374 3639 4492 -2114 -5320 372 5588 1332 -5116 -2526 4425
1282D425j226p193L06P723M73q593j492R130K761q727l817P210M319m913m443
$$ 4425 3199 -3994 -3688 4035 4508 -4085 -5577 3553 6314 -2413 -6230 980 5299 386 -4057
1297d057K294M555M08m956k724N638M492o776n512Q085O050q911o318Q439O174
$$ -4057 -1763 2792 3200 -1756 -4480 1158 5650 -1126 -6638 1447 7497 -1414 -7732 707 6881
1312F881o437n311L376M042k64l060k515L097M874m030o841N233Q204o078q665
$$ 6881 444 -4867 -1491 2551 2287 -773 -3288 -191 4683 653 -6188 -955 7249 1171 -7494
1327g494O201Q320n407p399L564O045r45m425j715K992L764k331n257K561O603
$$ -7494 -1293 7027 1620 -5779 -2215 3830 2885 -1540 -3255 -263 3501 1170 -4087 -1526 5077
1342E077k976p925K759Q702j704q501K57P519J100o308k213N130L183l935l938
$$ 5077 2101 -5824 -3065 5637 3933 -4568 -4311 3208 4308 -2000 -4213 917 4100 165 -3773
1357c773K752M393j623m867M98N641R64o590k889P105M732o857n635O125N377
$$ -3773 -1021 3372 1749 -3118 -2620 3021 3985 -2605 -5494 1611 6343 -514 -6149 -24 5353
1372E353n414m508M661L819l386l520J275L475J382l663l984M136O219m763p797
$$ 5353 -61 -4569 92 3911 525 -2995 -1720 1755 3137 -526 -4510 -374 5845 1082 -6715
1387f715N089Q333m932p555M414N909l702m354K504L435l04l014k716K676N636
$$ -6715 -1626 6707 1775 -5780 -1366 4543 841 -3513 -1009 2426 2122 -892 -3608 -932 4704
1402D704k235p653J963Q544j978q473J962P728j627o508Q95N129J92l988j685
$$ 4704 2469 -5184 -3221 5323 3345 -5128 -3166 4562 2935 -3573 -2678 2451 2643 -1345 -3030
1417c030L107L622k200n528R29O773M51p022j424O606J887o181k117N896K588
$$ -3030 77 3699 1499 -4029 -3100 3673 4124 -2898 -4322 2284 4171 -2010 -4127 1769 4357
1432D357n504l296M711L919l466m370J901M614k9m680j966M436L718m085m828
$$ 4357 -1147 -4443 268 4187 721 -3649 -1748 2866 2837 -1843 -3809 627 4345 260 -4568
1447d568M006N321m317n545M636N727m313n651L072N039j158l943r34K767K911
$$ -4568 -562 4759 442 -5103 -467 5260 947 -4704 -1632 3407 2249 -1694 -2628 139 3050
1462C050j965m646J657N954j740o754K082P017k348o863K141O270j176n135l79
$$ 3050 1085 -3561 -1904 4050 2310 -4444 -2362 4655 2307 -4556 -2415 3855 2679 -2456 -2835
1477b835L518J999j754l338M48M393J39n319k40O078L05o566n28O484J025n849
$$ -2835 683 2682 928 -2410 -1962 2431 2570 -2749 -2989 3089 3394 -3172 -3700 2784 3809 -2040
1493b040j672M689K416l181l022J558L403j84l619p95L930J486m424k167M893
$$ -2040 -3712 977 3393 212 -2810 -1252 2151 1967 -1652 -2447 1483 2969 -1455 -3622 1271
1508A271K971m957l803M498M313l572m370K441M016j290l505K06L031Q86k792
$$ 1271 4242 -715 -4518 -20 4293 721 -3649 -1208 2808 1518 -1987 -1781 1250 2136 -656
1523f56k032K776L270k830m462K707N370k258n711J601N370r16m523L01L486L33
$$ -656 -2688 88 3358 528 -3934 -1227 4143 1885 -3826 -2225 3145 2229 -2294 -1993 1493 1826
1539A826k620j160J969K294j454l590R48M736l48n473k34N575P58n123j034M271
$$ 1826 -794 -1954 15 2309 855 -2735 -1787 2949 2601 -2872 -3106 2469 3227 -1896 -2930 1341
1555A341J168l319j331K433J743j617k484P16L385L08m126j347M450K190m324
$$ 1341 2509 -810 -2141 292 2035 418 -2066 -1350 2035 2343 -1783 -3130 1320 3510 -814
1570h14k669L889K762l315k633K732K504k054k592J221K837j31l079j144L145
$$ -814 -3483 406 3168 -147 -2780 -48 2456 402 -2190 -969 1868 1737 -1342 -2486 659
1585F59K342k920l251K501L709k093l728J752L535j468l297J034L138l20k951
$$ 659 3001 81 -3170 -669 3040 947 -2781 -1029 2506 1038 -2259 -1225 1913 1593 -1358
1600a358o88K605J820k039k808J360L440p30l661K97L619r3l482o4L320L69l115
$$ -1358 -2046 559 2379 340 -2468 -1108 2332 1602 -2059 -1762 1857 1764 -1718 -1782 1538 1907 -1208
1617a208r11K712J634k029k345J160K819k57l002m43K956Q84k869j094K794J312
$$ -1208 -2119 593 2227 198 -2147 -987 1832 1575 -1427 -1870 1086 1970 -899 -1993 801 2113
1633B113k736j664K545K110k095k512J350K695m43k612l92K322J038k003j468
$$ 2113 -623 -2287 258 2368 273 -2239 -889 1806 1363 -1249 -1641 681 1719 -284 -1752
1648a752J823J804j776k159J738K544j529k848J064K898l57k672l62K144R77j556
$$ -1752 71 1875 99 -2060 -322 2222 693 -2155 -1091 1807 1450 -1222 -1584 560 1537 -19
1664a9j452J144J799r66k120Q84K482p64k775M71K840L4k579o33K039J191j409
$$ -19 -1471 -327 1472 506 -1614 -730 1752 988 -1787 -1316 1524 1558 -1021 -1654 385 1576 167
1681A67j570Q58J842n78k042M59K260l64k451J25K477L62k258r57J766J530j155
$$ 167 -1403 -545 1297 719 -1323 -864 1396 1032 -1419 -1294 1183 1545 -713 -1670 96 1626 471
1698D71j923O09K153l19k225K22K264j80k251JK134M18j821j039J303J648o70
$$ 471 -1452 -843 1310 991 -1234 -1012 1252 1072 -1179 -1178 956 1374 -447 -1486 -183 1465 795
1715G95k116J25K315J91k318k70K216K36k043k99J804O08j447j105R27J651l30
$$ 795 -1321 -1196 1119 1310 -1008 -1278 938 1174 -869 -1168 636 1244 -203 -1308 -381 1270 940
1732I40k047k11K178N58k053o77J799O68j518p24J264R44r57j381O26J804j96
$$ 940 -1107 -1318 860 1418 -635 -1312 487 1155 -363 -1087 177 1121 164 -1217 -591 1213 1017
1749A017k088j88K060N01j768o37J278P23q29q46M91J140k64j626J20K079N0k362
$$ 1017 -1071 -1259 801 1302 -466 -1103 175 898 69 -777 -286 854 590 -1036 -916 1163 1213 -1149
1767a149j90K245L32j799l72J119M09m03n81j21R19M21j430n58K014N62k370n58
$$ -1149 -1339 906 1238 -561 -933 186 595 192 -389 -510 409 830 -600 -1158 856 1418 -952 -1510
1785a510K365N01j926m04J188L33l88l62k62N60O76r78q58J477R12j858r27J958
$$ -1510 855 1356 -570 -974 214 547 159 -203 -465 95 771 -207 -1065 412 1324 -534 -1461 497
1803D97R25j684q92J133Q09m96p20l0O94L68q23n27J026O23j177p77J165J002
$$ 497 1422 -262 -1154 -21 788 292 -428 -458 236 604 -219 -746 280 903 -274 -1051 114 1116
1821A116r30j219N23J373j03j427j63J380K26j286j56J179P2r87j60O75M67k26
$$ 1116 186 -1033 -510 863 760 -667 -830 550 776 -510 -666 513 585 -402 -562 113 580 354
1839C54r01l01J339P23j657q99J805P57j778l98J613Lj257J90P50j22q7k14o12
$$ 354 -547 -848 491 1214 -443 -1342 463 1220 -558 -956 657 660 -597 -407 343 221 134 -80 -692
1858f92P03J194j153j514J454J453j585j060J546N51j367j43J024m9m62l2k13
$$ -692 11 1205 52 -1462 -8 1445 -140 -1200 346 897 -470 -613 411 362 -100 -132 -345
1875c45K63Q36m91j283O88J454p83j358Q04J065p61p60O67N67n18n25K22N71J57
$$ -345 -82 754 263 -1020 -332 1122 339 -1019 -215 850 89 -671 -4 563 45 -480 -258 313 470
1894D70n49n17M24P33k00p87j1P78J35p99j79Q89J70j033j22J146N6j126j8Q67
$$ 470 -79 -596 -172 561 361 -426 -437 341 476 -323 -502 387 557 -476 -598 548 604 -522 -540 327
1914C27L9m26j0j47J0O12r1q71L72R21q26q09J231O55j431m18J348R6r86K08M51
$$ 327 366 -60 -70 -217 -207 405 314 -557 -185 736 -90 -899 332 987 -444 -862 486 582 -404 -196 255
1935B55m06J43M55o85k93R97m1j084N02J033r73q95J207P07j102m10P65K5l75
$$ 255 -151 -8 447 -238 -531 466 425 -659 -157 876 -97 -992 215 922 -180 -590 175 200 -175
1954a75K94K8m12K68L27n41j13P23j13q30L44Q29m49q11M27O96k77m67J56J63
$$ -175 119 147 -265 3 330 -211 -324 399 286 -544 -200 629 180 -631 -204 492 215 -252 -96 67
1974F7j50N1J89q9j38J00p5j40K99K86n00l90O29L66p05k53P11O5o15J76M56m49
$$ 67 -83 -32 157 68 -70 30 -45 -185 114 400 -100 -490 139 505 -200 -453 258 323 -292 -116 340 -109
1996a09k47N87P7n29J75K51m93N5P90l01q42M56O22o34k56P87j07q05L92O46n85
$$ -109 -356 231 308 -221 -46 205 -288 -233 557 256 -586 -130 492 -142 -398 389 282 -523 -131 515 -70
2017g0l61O58K5n43L14K98o03n7P59j38o63L52L52n87m6P88j55p94K32O07l18
$$ -70 -431 227 252 -291 23 321 -282 -339 420 282 -381 -29 323 -264 -310 478 323 -471 -239 368 50
2038E0l12M08M8l99J08L07k34j49K95k9k60K36J89m69j67O33J86o34j75N23M9
$$ 50 -262 146 194 -205 -97 210 -24 -173 122 93 -167 69 258 -211 -378 255 441 -193 -368 155 204
2059B04m16J54L44k35l24J96K06r3J7j9k33J28M23k76n48M29N73n13m97N65L14
$$ 204 -212 -58 286 51 -273 -77 129 36 53 34 -199 -71 352 76 -472 -43 530 17 -480 85 399
2080C99o24q3O14k0n07K4K24k1J58K4m80oO89j13p50K96P31m83o43N78N16o02
$$ 399 -225 -308 306 286 -221 -197 27 6 164 188 -292 -298 391 278 -472 -176 555 72 -571 7 523 -79
2102g9l48M86K29k48j22p2K2L82P6o13q9P05k5p35J90P56k83p65K69O96j59n50
$$ -79 -427 59 288 40 -82 -154 -132 250 326 -287 -376 329 304 -431 -241 515 232 -533 -264 432 273 -277
2124b77K5L56J33j48l09nM23J34n32j86O18J94p26j71Q08K13q26k95P15L56n18
$$ -277 -252 104 237 89 -220 -225 198 332 -200 -386 232 426 -300 -471 337 550 -276 -571 144 500 -18
2145a8l51K63L34n3l06j32L49K89m43m31N49N71o50o50O52P27o02o98M32O02k29
$$ -18 -369 -106 228 175 -131 -263 86 375 -68 -499 50 621 -29 -679 -27 700 98 -600 -168 434 205
2166B05m71L8L52J76l27l43L16N69l56p78L71R23l44r52K26R20j14p81k2O28J22
$$ 205 -266 -228 124 300 -27 -370 -54 515 159 -619 -248 675 331 -621 -395 525 411 -370 -392 236 358
2187C58m66k60L45M26k42o32J61Q23m8r56r8J005K38r60l08P99L66o42m05M95
$$ 358 -108 -368 -23 403 161 -471 -310 513 465 -491 -589 416 654 -306 -614 185 551 -91 -496 -1
2207aM59l28n41J28O75N8p86k80Q49M94q44o11P46O84o35o71M80O63l40o70J78
$$ -1 458 130 -411 -283 392 450 -336 -616 233 727 -117 -728 18 702 67 -604 -124 539 199 -471 -293
2228b93O79N6p23k91P15N40o73p19N58Q39m35q93L22Q67j84q40M4Q20J25p90l10
$$ -293 386 442 -281 -572 143 683 10 -709 -151 688 253 -640 -318 549 365 -475 -431 389 514 -276 -586
2249e86P09N42n93p30M23Q62k37r20N6R20R8r16k21Q88L38q41m67P49O11n88p49
$$ -586 123 665 72 -658 -235 627 390 -530 -474 446 544 -372 -593 295 633 -208 -675 74 685 97 -652
2270f52L92Q34j35q72j23Q70L24q53m69Q23N76p69o81O87P75n39q57L18R03n5
$$ -652 -260 574 439 -433 -556 314 638 -215 -684 139 715 -54 -735 -48 727 188 -669 -351 552 497
2290D97r00k18Q55M53p87o12P10P27o27q23N37Q92l82r47J73R56R5r44l44Q52
$$ 497 -403 -621 234 687 -100 -712 -2 725 98 -725 -188 704 322 -625 -452 504 599 -345 -689 163
2310A63N79p54p29O25Q24m72r02L47R37j73r71l1R66K79r48n03Q47P21p08q50
$$ 163 742 -12 -741 -116 708 236 -666 -319 618 445 -526 -557 409 688 -260 -763 84 805 97 -753
2330g53N39R12l56r50J71R57J9r53k34R34M67q86o84P67Q68n99r87M10J016k02
$$ -753 -214 698 342 -608 -437 520 539 -414 -648 286 753 -133 -817 -50 818 219 -768 -358 658 456
2350D56r95j7R75J99r10m22Q78O11p91p92O46R67m81j039K41J075k1j029j99R48
$$ 456 -539 -556 419 618 -292 -714 164 775 -16 -808 -162 805 324 -715 -474 601 580 -449 -648 300
2370C00M05q77n82P70P67o61r26N23J044l37j080Q7J070J74j011m07R10N92p88
$$ 300 705 -172 -754 16 783 122 -804 -281 763 426 -654 -567 503 677 -334 -741 169 761 -27
2389b7p63O69R04n39j009L71J087j61j111p5J070L33r64n77Q35P61o79q99N19
$$ -27 -790 -121 783 244 -765 -394 693 532 -579 -654 416 749 -215 -792 43 804 125 -774 -255
2408b55J004l55j083J82J129Oj100k58J041M96r09p17P30Q93n36j030L73J083
$$ -255 749 394 -689 -507 622 628 -472 -730 311 807 -102 -819 -89 804 268 -762 -389 694
2426F94j82j113NJ099K17j077m44R83O48q14q66O43J003m23j075J96J111J3j098
$$ 694 512 -601 -596 503 720 -357 -801 182 830 16 -850 -207 796 373 -702 -506 605 618 -480
2445d80k12J046M27r91o27Q71Q26p09r86N06J085k63j153O0J108J81j047l90R74
$$ -480 -692 354 781 -210 -837 34 860 151 -835 -329 756 493 -660 -600 508 689 -358 -748 226
2464B26N87q80p76P45R46n49j093L42J162j10j171j28J129L40j007n70Q91P39
$$ 226 813 -67 -843 -98 848 299 -794 -452 710 600 -571 -699 430 770 -237 -807 84 823
2482H23p35r07N65J047l84j141J64J189Q2j172l05J069N29r42p09P68Q72n79j008
$$ 823 88 -819 -254 793 409 -732 -568 621 703 -469 -774 295 824 -118 -827 -59 813 234 -774
2501g74L95J121k09j174j9J186K55j139m74J020O91q60q42O29R88m37j068K22
$$ -774 -379 742 533 -641 -660 526 781 -358 -832 188 879 19 -823 -194 794 357 -711 -489
2519d89J136j3j153k20J137M52j059o66R36Q29p44r81N31J059k86j128P0J140
$$ -489 647 634 -519 -739 398 850 -209 -875 61 890 146 -835 -304 755 469 -659 -589 551
2537E51J50j094m00J036O14r20q27P78R91n87j099L72J163j56j153r2J137K89
$$ 551 701 -393 -793 243 857 -63 -890 -112 879 292 -807 -435 728 572 -581 -673 464 753
2555G53j035n09R19P23p69r34N97J083l82j204J62J251M9j208k66J121M62j003
$$ 753 -282 -791 128 851 82 -852 -255 828 446 -758 -596 655 704 -504 -770 351 813 -190
2573a90o37Q23Q35o35r94M15J122j93j191o7J231K89j178m97J088O49r22p93P26
$$ -190 -827 -4 831 196 -798 -383 739 546 -645 -712 519 808 -370 -867 221 870 -52 -845 -119
2592a19R37n31j020K83J106k9j145k32J128M64j046o88R45Q59p87r98N99J101
$$ -119 818 287 -733 -450 656 627 -518 -750 378 842 -204 -892 53 912 125 -873 -274 827
2610H27m05j144J62J162O5j110l21J022N91r15q12P43R98n55j142L79J215j72
$$ 827 422 -722 -560 602 667 -443 -764 258 849 -66 -878 -135 863 308 -834 -455 760 588
2628E88j266nJ223K13j125m32R78O53p98q44N70J033l38j175J05J253J01j265
$$ 588 -678 -683 540 753 -372 -804 174 827 29 -815 -245 788 450 -725 -620 633 734 -531
2646e31k91J241M37j118o10R63P61p29r15M72J034k05j109p1J158L19j176n21
$$ -531 -822 419 856 -262 -872 91 852 123 -792 -320 714 509 -600 -671 487 806 -370 -891
2664h91J108P10r87q65Q47R67o51j058M09J120j34j126j53J070M25r93o62Q92
$$ -891 217 927 -60 -925 -78 889 238 -820 -411 709 575 -551 -704 366 791 -202 -864 28
2682B8Q72p61j039O04J161m10j230J94J245Jj187k45J100M82r39o98P23R13n19
$$ 28 900 139 -900 -296 865 455 -775 -581 664 665 -522 -767 333 815 -124 -822 -99 814 295
2701B95j061L06J204j16j297j01J338K76j262m62J135O20r30p71O91R03m20j009
$$ 295 -766 -460 744 628 -669 -770 568 844 -418 -880 255 875 -55 -826 -135 768 348 -661
2719f61J10J128J32j168l91J224N63j175p52J065Q94q70r88O35J026l42j054N3
$$ -661 -551 577 709 -459 -850 374 937 -238 -990 75 969 99 -889 -254 772 430 -624 -571
2737e71J065K32j054n17J006P57r13r55Q04J099o46j201M57J228k07j215l7J121
$$ -571 494 726 -328 -845 161 918 5 -950 -146 953 307 -894 -437 791 584 -631 -668 453
2755D53K99j000n50Q64P76p03r98N19J175l15j289J17J329Q1j310k75J221M59
$$ 453 752 -248 -798 66 842 139 -859 -340 835 520 -769 -652 677 758 -552 -827 394 853
2773H53j059o56Q63Q19o19r58L63J082r9j184j63J247M13j258n87J153P58j022
$$ 853 -206 -862 1 820 201 -757 -394 688 589 -595 -758 489 902 -356 -943 210 968 -54
2791e4q74Q28R70n88j042L13J074j7j070k92J076N53j024q08R41J002q08j132
$$ -54 -928 -100 870 282 -760 -447 627 610 -460 -752 324 877 -147 -955 -14 988 180 -952
2809i52O28J210m27j209K02J160N7j098l38R93O12q49q62O84J079n17j232L19
$$ -952 -324 886 459 -750 -548 612 669 -429 -767 226 838 -11 -873 -189 890 373 -859 -540
2827e40J331j33j328m5J268K38j151m47R88O52p93q59N67J035l09j171O7J250
$$ -540 791 658 -670 -715 553 791 -360 -807 181 833 40 -819 -252 783 474 -697 -630 620
2845F20J57j263l84J241N58j149p04R83Q31p72r46N16J048k28j127m7J137L41
$$ 620 777 -486 -870 371 929 -220 -924 59 890 118 -828 -312 736 508 -619 -666 471 812
2863H12j111o03J043Q10r47r55P93J076o11j151M00J168j27j164j34J103L86r77
$$ 812 -299 -902 141 951 4 -951 -158 918 307 -844 -444 724 597 -567 -701 402 788 -189
2881a89o48Q47Q74p02j041N03J189l25j276J38J292P5j248k76J114N12r65p02
$$ -189 -837 10 884 182 -859 -356 833 508 -768 -630 662 737 -511 -787 327 839 -126 -828
2899h28P32R04n12j046K74J177n9j237j60J252L55j214n36J108O83r23q27O87
$$ -828 -96 808 296 -750 -476 701 642 -595 -755 497 852 -362 -898 210 893 -30 -857 -170
2917a70R56m36j043J70J104R7j134l33J123N49j067p30R53Q88p84j012N69J073
$$ -170 786 350 -693 -523 581 678 -456 -789 334 883 -184 -914 39 927 143 -869 -300 773
2935G73l05j119N7J108K22j088m58J022O59r04q45P58R82n70j098L50J161j06
$$ 773 468 -651 -594 514 736 -352 -810 212 871 -33 -878 -120 862 292 -806 -456 705 599
2953E99j180j33J153L59j075n47R47P23p82q86N91R94l52j099J10J154J36j155
$$ 599 -581 -714 439 798 -277 -824 123 846 64 -822 -231 763 411 -688 -578 576 712 -443
2971d43l53J099N59j019p11Q66Q35o72r36M53J008k03j067n3J090L03j051n36
$$ -443 -796 303 862 -157 -868 -2 833 161 -775 -322 686 483 -584 -637 453 756 -295 -831
2989h31R94P24q94q57P31R48n14j021K91J039l9j048k19J040M50r83o64Q82Q30
$$ -831 163 887 -7 -864 -133 815 301 -720 -429 610 571 -477 -696 344 794 -189 -853 29 859
3008H59p38r42N64J003l33j036Q0J043J56j018l92R72O15r04p86P86R03o13r81
$$ 859 121 -821 -257 746 413 -623 -543 500 656 -362 -754 218 833 -71 -857 -71 832 219 -762
3027g62M04J024j80j000q1R60L38r34n45Q71P58p87r10O62R96m94j031K70J024
$$ -762 -358 666 486 -514 -595 365 703 -231 -776 95 853 66 -844 -182 814 320 -711 -441 583
3046E83l2r83k07R00M54q29o67P48Q39o21r67M72J045l04j070R6J032J41r79l47
$$ 583 551 -432 -639 261 715 -114 -781 -33 806 185 -782 -310 735 431 -639 -543 489 630 -349 -696
3066f96Q65N79p71p29O33Q62m89r51L09J004j06r98j38R71L62q93n80Q28P29p22
$$ -696 169 748 -23 -752 -119 743 254 -697 -388 616 510 -488 -626 345 707 -186 -766 62 791 69
3086F9q47N91R14m28r16K13Q91L5q64k90Q17N40p44p64O82R18o01j005N06R96
$$ 69 -778 -187 727 299 -617 -404 487 522 -342 -632 185 725 -19 -783 -101 817 216 -789 -283 713
3106G13l46r60J50Q85P6p67l54O70O11n66q32M74J001l81j079K69J092j56j020
$$ 713 367 -593 -443 442 518 -249 -603 67 678 112 -720 -246 755 374 -705 -436 656 500 -520
3125e20rR17J97p93l98O40O11m99p90L42R29k02r96N0J011J02r75k59Q90M22p86
$$ -520 -529 388 585 -208 -606 34 645 146 -644 -302 627 425 -571 -521 490 592 -383 -642 248 670 -116
3146a16n75O72O99n31p88L49Q56j63q58m4Q18K78p80m82P15O62o58q01N90Q91
$$ -116 -691 -19 680 149 -639 -290 566 403 -455 -499 319 597 -183 -665 50 712 54 -747 -157 734
3166G34m85r39L67Q94j92q01n0P09K83n79n17M70P55m11r35L53J052l04j068K28
$$ 734 249 -690 -323 571 379 -422 -472 237 520 -59 -576 -106 649 238 -697 -344 708 404 -664 -436
3186d36R97j04q87n5P21K57n39m80L65O98k31q77J34R94l7j051n9J044J38r41
$$ -436 561 457 -430 -485 236 493 -46 -526 -161 537 306 -571 -437 557 520 -531 -590 454 592 -349
3206c49k57Q07L76o20n15M41O36k50p29O3P87J13q31k69Q51L93q00n47P35O51
$$ -349 -606 201 577 -43 -558 -117 519 269 -460 -397 390 503 -328 -597 254 647 -153 -700 35 686
3226F86o16p19M76P51l25p42J51P04P2o70k78N91M90n37o68M82Q22m08r36L41
$$ 686 70 -649 -173 578 253 -489 -338 366 438 -232 -510 81 571 34 -634 -152 670 262 -674 -333
3246c33R58k56r04J35P97ro36j79N06L85l46o20K21Q09j21r47O4R99kj003o1R42
$$ -333 625 369 -535 -400 397 388 -248 -427 79 464 118 -502 -281 528 407 -540 -476 523 521 -482 -543 399
3268C99J17p69k28N73L43l79m79K07O33j7p92j33Q69K76q95l60Q73M06p99m59
$$ 399 516 -253 -481 92 435 56 -423 -216 417 400 -392 -525 344 620 -275 -635 238 644 -155 -614
3288f14O84M94m83n68K91N84p1o19j18O38L02o53m79O35O26n68p18N08P53m45
$$ -614 70 564 81 -487 -196 388 317 -302 -420 218 520 -133 -612 23 649 81 -637 -129 624 179
3308A79p57L34P45j85o86oN93J94m77l85L89N68l09p46K26Q88j58r35J02R05m9
$$ 179 -578 -244 501 316 -370 -376 217 411 -66 -451 -62 506 197 -549 -323 565 407 -528 -426 479 430
3329D30q26l2P09J60n74k93L73M47j81n88M0O97R7q51j60R01K44q82l12Q19L25
$$ 430 -396 -428 281 441 -133 -426 -53 394 213 -375 -335 362 459 -392 -552 349 593 -289 -601 218 543
3350E43o75l60N08M22k92n02O6N65J59o31l04O51M30o91n31O92N93o21o37N18
$$ 543 -132 -492 16 438 146 -356 -290 275 434 -197 -501 150 580 -111 -642 50 643 22 -615 -97
3370i7O16l58n69J84N32K9n29k15M71M25m38n89M11O90l66p76L28Q13k44p97J23
$$ -97 519 161 -408 -224 308 337 -192 -407 64 489 51 -538 -127 563 197 -579 -251 562 318 -479 -356
3391c56P18no02j27M82K67l51m42K42O07j27p35K7Q18K9q36r4Q33J69p62k30O06
$$ -356 362 357 -245 -372 110 377 26 -416 -174 433 306 -429 -402 416 445 -391 -485 348 517 -245 -475 131
3413A31K98m21l79K69M51j06n48o6O34K23o98l41P08M24o90m56O31M71n11n09
$$ 131 429 8 -371 -102 349 243 -305 -371 263 486 -212 -553 155 579 -111 -567 64 535 24 -485
3433d85L72N00j85m82j1M91J83m86l75M86N39m80o41M53O76l80o94L09O66k05
$$ -485 -113 387 202 -280 -291 200 383 -103 -478 8 547 67 -574 -121 555 175 -519 -210 456 251
3453B51o16P0N45R6m34k93L44M57k70o01J99P27j44p79R0P72l2p41k8O54J15n28
$$ 251 -365 -295 250 346 -88 -381 -37 420 150 -451 -252 475 331 -448 -358 414 382 -359 -387 267 382 -146
3475a46k52M00L64k49m76J06N97jo64j08P17J83p07k68O83L07n74l77M58M25l25
$$ -146 -398 2 366 117 -359 -253 344 343 -321 -429 288 471 -236 -504 179 486 -88 -465 -7 418 93
3496I3m63J62N20j2n31j49N51K72n39l83N03M94m77n65M08N99l19n96K16N68o4
$$ 93 -370 -208 312 300 -231 -380 171 443 -96 -479 24 518 41 -524 -116 483 164 -432 -216 352 288
3517B88n29q3M50K61l93l97L24N33k77o42K19P19j93o94J11O80k7o16p4M98K00
$$ 288 -241 -324 126 387 -6 -403 -79 454 177 -465 -246 473 280 -414 -303 377 350 -266 -340 158 358
3538C58l73l43K60M67j52o02R1O68ro92p2P02J32o53j85N28K81m12l59K79M45
$$ 358 -15 -358 -98 369 217 -385 -294 374 365 -327 -399 303 435 -218 -403 125 406 -6 -365 -86 359
3559C59j51n25L3N75Q1o13j74N99K68n57l55M75M31l79m90K69N42j55n66L9N58
$$ 359 208 -317 -284 291 372 -241 -415 184 452 -105 -460 15 446 67 -423 -154 388 233 -333 -294 264
3580B64Q4n45j89N00K93m14m28L57M95k49n83J71O27j02o28K0O13N6n26j83M38
$$ 264 348 -197 -386 114 407 -7 -435 -78 417 168 -415 -244 383 281 -347 -327 286 342 -184 -367 71
3601G1L02l31m21K37N23j30o21N8O67Mo58q2O27J47n44k14M13L28l05m25J81N13
$$ 71 373 42 -379 -142 381 251 -370 -312 355 359 -299 -381 246 393 -151 -365 48 376 71 -354 -173 340
3623C40p6n92j6O21J10o22j73N79K35m77l22L70M00k52m89J42N48k4o03n7O05
$$ 340 264 -328 -344 277 387 -235 -408 171 406 -71 -393 -23 377 125 -364 -222 326 302 -301 -358 247
3644B47J43n70k14N07K86l93l87K89M54j76n36O8O10J8o20j02N93J85n41k52M42
$$ 247 390 -180 -394 113 399 6 -381 -92 362 186 -350 -282 328 346 -274 -376 217 402 -139 -391 51
3665E1L30l26m13K03M84q8n65MN99Q7o10j57N74K49n10l19L95L88k66m68J66N06
$$ 51 381 55 -358 -155 329 241 -324 -320 279 366 -244 -401 173 422 -88 -407 -12 376 110 -358 -192 314
3687C14l0n77n5N95J37n70k14N09L07m09l91K93M69j88n36Q8N81Ko12o6N88J50
$$ 314 284 -293 -348 247 384 -186 -400 109 416 7 -384 -91 378 190 -346 -258 323 325 -287 -353 235 385
3709C85n27k42M47L19l26m18K05M90q1n71pO15R5o33j60O02K13n26k74M23L38
$$ 385 -142 -384 63 382 56 -362 -157 333 252 -319 -326 289 384 -249 -409 193 406 -120 -394 29 367
3730C67k93m10J41M87rn36j10N74K16n95k88N82L23n14l66M09M15k79m52J32N00
$$ 367 74 -336 -195 292 283 -253 -363 211 427 -168 -456 126 449 -65 -431 -22 393 114 -338 -206 294
3751B94Mn19j37N08K57n05l35M58M16l87m96L37N13k16n42Q6N67J5n37j36N04
$$ 294 298 -221 -358 150 407 -98 -433 25 441 54 -442 -105 408 192 -350 -264 303 318 -219 -355 149
3772A49K28m39l28L60M10k50n05J56N71n4o34j2O34J08o15j83N67K24m46k99L22
$$ 149 377 -62 -390 -30 380 130 -375 -219 352 298 -336 -348 286 394 -221 -404 163 387 -59 -358 -36
3793c6L70j90m32M4N18Q4n84j95O33K63o39l12N77L58m91l68L51L93k07m03K9
$$ -36 334 144 -288 -244 274 358 -226 -421 212 475 -164 -476 101 459 -32 -400 -49 344 137 -266 -237
3814b37M37J30m72k71N07L86n25m58M90N11m32n20L34N09k10m92P1M55R0m28k53
$$ -237 200 330 -142 -413 94 480 -45 -503 -13 498 66 -454 -120 389 179 -313 -242 213 303 -125 -378
3835c78M24L68l64m95L13N81k47o24J68O37j00o06PN69R2m94k15M25K97k90m19
$$ -378 46 414 50 -445 -132 449 202 -422 -254 383 283 -323 -316 253 345 -149 -364 61 358 68 -351
3856c51J94M91o9n79l3O23J42o53k12O40K50n97k79N06L21l62l90K23M20n0m50
$$ -351 -157 334 265 -314 -347 276 418 -235 -447 193 443 -154 -433 73 394 32 -358 -135 285 235 -215
3877b15j22M88K76n35l94N59M80n53m97M92N01m15m65K78M43j13m36o9L97K58
$$ -215 -337 151 427 -108 -502 57 537 -16 -513 -21 480 65 -400 -122 321 208 -228 -297 100 358
3897C58l50m33L67N24l55o13L39O77l07o47K03N95r2n32l7M59J84l75l40K74M70
$$ 358 8 -425 -58 466 111 -502 -163 514 207 -440 -237 358 266 -266 -303 156 340 -35 -375 -101 369
3918C69j76n76J12O45m9o91j5P09R2o83j66N84K46m58l04L13L83j82m39J3N20
$$ 369 193 -383 -271 374 325 -366 -381 328 420 -263 -429 155 401 -57 -361 -48 335 153 -286 -273 247
3939B47J18n62k45N96L38o12l81N78M42n20m74M10M61k61m21P5M18Q8m19k66M33
$$ 247 365 -197 -442 154 492 -120 -501 77 519 -1 -475 -65 396 135 -286 -211 207 295 -124 -390 43
3960D3M33m40n58M21O27l83o57L53O26k50n83J13N15K1m02j93L27L52k58n10K10
$$ 43 476 36 -522 -101 526 143 -514 -161 465 215 -368 -255 260 281 -121 -314 13 365 107 -403 -193
3981a93O41j48p34R9P45l3p14k1O48Q8n42j97M03L18k80m04J44M92j2n80j18O86
$$ -193 448 300 -434 -335 410 377 -337 -358 290 378 -164 -361 42 360 80 -324 -180 312 300 -280 -398 288
4003B88J91o96k73O51L36o06l46N00L80l70m08K10M42l7m62j42M73L08n16m22
$$ 288 479 -217 -490 161 497 -109 -455 45 425 55 -353 -143 299 262 -200 -342 131 439 -77 -499
4023d99N07N24m83n86M40N85l32n76K43N20r8m78o8M36K45l81m05L00N45k45o42
$$ -499 8 532 49 -537 -97 488 156 -420 -177 343 245 -233 -301 135 380 -1 -406 -106 439 194 -448
4044d48J99P15j73p26R1O98ko33p2N16J82l89l17K72M45j32n48nO37Q9o84j59
$$ -448 -249 466 293 -433 -342 356 354 -279 -351 165 347 -42 -359 -87 358 226 -322 -327 310 399 -285 -444
4066d44P14K10o94k80O30L18m99l52L28M00j54m45j8N06J74n40l18N53M41n79
$$ -444 270 480 -214 -494 136 454 -45 -397 -69 331 177 -268 -286 220 394 -146 -464 89 530 -49
4086d9m79N43N14m80n36L67N24k04m87J6M63J44m26l16M13M40l69n71L46O43k90
$$ -49 -528 15 529 49 -487 -120 404 200 -287 -271 192 336 -90 -406 7 447 78 -493 -147 496 206
4107B06o70K10O65j12o26mN72J20m77k63L78L75k70m81J75N83q1o61j7P10J00
$$ 206 -464 -254 411 299 -327 -331 241 361 -116 -379 -1 374 104 -377 -202 381 300 -361 -378 332 432
4128D32o81j98O40K61n67l24M51L77l07m23J41M81K5n22j74N69K95o01m06N88
$$ 432 -249 -447 193 454 -113 -437 14 391 84 -339 -198 283 308 -214 -388 181 476 -125 -531 57
4148E7M81n50m99M61M97l31m97J83M83nm72j69M60L36m55m70M28N80m02o20L11
$$ 57 538 -12 -511 -50 447 116 -381 -198 285 280 -192 -361 99 435 -20 -490 -62 518 116 -504 -193
4169a93O55k39o09J14N77J9n22j51M32L16l70m57L07N56k16o37J45O53m3o70m7
$$ -193 462 223 -386 -272 305 324 -198 -349 83 399 29 -428 -121 435 219 -418 -273 380 337 -333 -380
4190c80O42J56n82k56M90L42l92m44K91N02j43n70J6O11J01o00k35N85L50n63
$$ -380 262 418 -164 -420 70 412 20 -424 -133 369 226 -344 -328 283 384 -216 -451 134 484 -79
4210g9m13M89M80l96n38L04N45j54n39j3N34J59m93l24M70M54m41n36L84O04l19
$$ -79 -492 -3 477 81 -457 -153 392 238 -301 -314 220 379 -114 -438 32 486 45 -491 -107 497 178
4231A78o23K17O27j11n83m3N28J96m60l48L91M78l14n85K49O55j82o71P7O74Q
$$ 178 -445 -228 399 288 -295 -338 190 386 -74 -422 -31 447 133 -452 -203 452 270 -401 -324 350 358
4252C58o17j35N35K68m48l91L48N04k43n83J59O30o3o46m3O33J38n75k71N29L80
$$ 358 -259 -394 141 409 -39 -430 -82 422 179 -404 -245 385 322 -324 -367 266 404 -171 -442 87 467
4273D67m38m76L23N60k07o24J04O11L4o13j20N73K34m95l77M25M85l37n75K42
$$ 467 29 -447 -124 436 229 -395 -291 320 354 -259 -379 194 428 -67 -444 -19 466 129 -446 -204
4293b04O25j37o49K1O39Q8n87k02N23L11m35m26L38N35k47o21J46O77m9o62p3
$$ -204 421 284 -365 -344 295 383 -204 -406 117 428 -7 -433 -95 440 193 -428 -282 395 346 -316 -389
4314c89O38J80n72k78M81L88l81m85K64N74j60o44O3O63M3o49j49N84K64m92l81
$$ -389 249 429 -143 -421 60 448 67 -418 -154 420 260 -384 -321 342 385 -264 -413 171 435 -57 -438
4335d38M07M63k90n53J66O41q5o62j8O75J01o06k18N18L16m06m14K74N28j61o12
$$ -438 -31 432 142 -411 -245 396 311 -351 -369 306 407 -199 -417 101 417 11 -403 -129 399 238 -374
4356c74O5O71K1o90j13O75J96n98l07N11L77l66m57K08N55q9o01l6O30J54o50
$$ -374 -309 362 383 -307 -420 255 451 -147 -454 57 434 68 -389 -181 374 285 -316 -352 278 432 -218
4377b18k51O23L30n45m11M50M68l13n32J80N68m5n72j04N89J99n58k98M92M24
$$ -218 -469 154 484 -61 -472 -22 446 133 -399 -219 349 304 -268 -372 217 416 -142 -440 52 476
4397D76m39m90L17N69k03o21P9O58L8o61j26N94K17n05l12L95M22k69n17J35O29
$$ 476 37 -453 -136 433 230 -391 -312 346 384 -277 -403 191 408 -97 -409 -14 408 139 -378 -243 386
4418C86l9o85p7P14J74p19k20O32K84n24l42L83M03k12m84L8N67J07o21k33O62
$$ 386 347 -338 -415 299 473 -246 -466 166 450 -74 -416 -33 370 158 -326 -288 279 386 -235 -468 194
4439A94L18o63l75O04M28n03m65L77M71k18m79K7N24J41n50k85N32M27n15n03
$$ 194 512 -151 -526 78 506 3 -462 -85 386 168 -311 -284 240 381 -169 -454 78 505 -10 -513
4459e13M63N60l69o09K76O00j50n93K0N69J19n27k57M63L72l64m85K60N91j57
$$ -513 -50 510 141 -468 -192 408 258 -335 -315 254 373 -154 -411 52 424 60 -425 -165 426 269
4479B69o53M4O94M3p03j20O63K07o07k80N10L43l50m30J83M90nn61j37O24K49
$$ 269 -384 -340 354 397 -306 -426 237 444 -163 -443 67 410 60 -370 -187 303 298 -263 -400 224 473
4500D73o53l48O61M13o31m25N39M41l97m44K05M58j5m51j87M59L57m76m84M99
$$ 473 -180 -528 133 546 -85 -510 29 470 73 -371 -166 292 277 -174 -361 98 455 -21 -505 -6
4520fN70m90o00M08O09l28n85K08N45m4n01j27M38K96l67m47K90N75k46o52J85
$$ -6 564 74 -526 -118 491 163 -422 -214 331 287 -214 -341 97 393 26 -421 -131 444 198 -454 -269
4541b69P12j03p31K3O89P0o15j73N23K61l91l68K53M59r9n42k5O07J42o63k39
$$ -269 443 340 -391 -368 321 391 -224 -397 126 387 -4 -372 -119 340 241 -301 -326 281 423 -240 -479
4562d79O82L12o59l66N86L90m66m05L20M16j41m44l1M57K18m77l78M97M75m97
$$ -479 203 515 -144 -510 76 466 0 -405 -85 331 190 -254 -285 172 390 -87 -465 32 507 10
4582A0n67M82O06m05o21L04N66j60m91J9M17J50l61l33L34M84k65o37K18P05j66
$$ 10 -557 -75 531 126 -495 -191 375 215 -276 -257 160 310 -51 -384 -50 434 169 -468 -250 455 289
4603B89p23J15P12m7o58m5N73J25m16k58K86L76j70m87M8O11N8o79j48O90K31
$$ 289 -434 -319 393 346 -312 -357 216 341 -75 -333 -47 329 159 -328 -280 331 389 -290 -438 252 483
4624D83o98k42O07K89n24l32M00L73k12m26M0M47J28m86k80N40L97n41m78M89
$$ 483 -215 -457 150 439 -85 -417 -17 356 144 -282 -242 205 333 -153 -433 107 504 -37 -515 -26
4644b6N51m70n28L78N16k68m92J29M49N9m12k29L50L89l12n14K81O11k39o78J77
$$ -26 525 55 -473 -95 421 153 -339 -210 239 298 -114 -343 7 396 84 -430 -149 462 223 -455 -278
4665b78P01j18o57M6N76M7m91j55L68K88k43m11J10N27j8n98o8O64J24o90j71
$$ -278 423 305 -352 -306 270 317 -174 -329 39 327 84 -327 -217 310 292 -306 -374 290 414 -276 -447
4686d47O59K38n85k73M60L05l18l52J58L98J5m37j84M91L09n16l90N22M67n45
$$ -447 212 450 -135 -408 52 357 39 -313 -155 243 258 -179 -363 128 437 -79 -469 53 520 -25
4706b5m65M72M67l51m66K15M14m0l88j17L66K82l47m35L25N46l10n96K68O14k20
$$ -25 -490 -18 449 98 -368 -153 261 221 -167 -284 82 364 17 -418 -93 453 143 -453 -185 429 209
4727B09o00J32N62k4m78r5L87K16k80l51K18M47j49n39O3O04J7o11j00O03J72
$$ 209 -391 -259 303 279 -199 -294 93 309 29 -322 -104 343 194 -345 -282 322 339 -272 -372 231 403
4748D03n83k03M89K68l75l28K39L80j15m16j5M49J45m89k57N01L60n01m11M75
$$ 403 -180 -383 106 374 -1 -329 -90 290 175 -241 -256 193 338 -151 -408 93 453 -48 -459 16
4768A6M19l95m31K92M15j71l79QL57J57l48k97L33M26l22n22L02N71k50n78K02
$$ 16 435 40 -391 -99 316 145 -234 -226 131 288 -60 -357 -24 402 80 -442 -140 431 181 -397 -195
4789a95N36j10m92J6M02J16l25k48K54L77j79m98J42N58r1n91K9N84L2n29j16
$$ -195 341 231 -261 -245 157 273 -52 -300 -46 331 152 -346 -204 354 263 -328 -299 285 317 -212 -328
4810c28M68J88l78k64K74L51j86m11P6M66K1m88j14M93J96m60k88M28L35l67l82
$$ -328 140 328 -50 -314 -40 311 125 -286 -210 256 277 -211 -325 168 364 -96 -384 44 379 12 -370
4831c70L00M06k05m14R4M10K3l87j52L61K78l29l74K83M61k57n09K24N27j79m86
$$ -370 -70 336 131 -283 -189 221 244 -143 -295 66 344 15 -359 -76 385 128 -381 -157 370 191 -295
4852b95Q4M41J5l85j23K98K60k27l64J49M68j12n29P9N59n0n44kM72R9m00j91
$$ -295 -211 230 245 -140 -263 35 295 68 -296 -147 321 209 -320 -241 318 268 -276 -278 194 293 -107 -298
4874b98L26K48k00l54J09M34m4m65k7M91P7m63j42M15K21l83k63K92L30j96l84
$$ -298 28 276 76 -278 -169 265 221 -244 -271 220 297 -166 -308 107 328 -55 -318 -26 304 108 -276
4895b76J17M05j2m39n3M11J37l85k17L43K82k86l51K09M23j36m53O0M58J6m43
$$ -276 -159 246 234 -205 -258 153 290 -95 -312 31 313 27 -324 -115 308 172 -281 -221 237 253 -190
4916a90p1L78J55l27k27K46L10j79l72R5M49m9m75qM80O1m39j16L66J88l08k31
$$ -190 -261 117 272 -55 -282 -36 274 95 -277 -182 267 218 -257 -265 215 276 -163 -279 87 275 -33 -264
4938b64K11L15j17l78L4M31K5m46q7M29J39l90j96L44K29k43k96J53L38o0l78
$$ -264 -53 262 145 -233 -199 232 257 -189 -276 153 292 -98 -294 50 279 36 -260 -107 231 171 -207
4959b07pM10O6m16j28L91J81l41k38K61K86j66l43Q8L85Mm13o8M15J21m04j80
$$ -207 -214 196 262 -154 -282 109 290 -51 -289 -28 258 92 -251 -163 222 226 -187 -255 160 281 -123 -303
4981c03L70K22k91k68K14K97j07l37PL82O5l97j16L77J70l62k24L19K59k38l02
$$ -303 67 289 -2 -270 -56 241 134 -203 -196 186 251 -146 -262 115 285 -77 -301 18 277 39 -263
5002b63J59L35p7l41j9L53R4l47j62L38K01k89k66K42L12j79l47R2L81k2l68o6
$$ -263 -104 231 154 -187 -206 147 241 -106 -268 70 271 -18 -284 -42 270 91 -256 -164 217 195 -173 -239
5024b39L74J15l27j66K82K20k40k47J47L11p2l44j8L69R6l96j36L80J74l37k13
$$ -239 135 250 -77 -243 39 259 19 -228 -81 230 158 -186 -204 165 261 -135 -271 109 283 -54 -267
5045b67K81K18j97k41J04K73j1l09q3L43J71l55k30L40K59l16k75K73K84j95k82
$$ -267 14 232 35 -206 -102 171 160 -149 -232 111 282 -73 -303 37 296 -20 -295 -22 262 67 -215
5066b15J08K69qk63r8K72J85k70k58K56L06k20l34J74L47j12l50N5L37Pk95q6
$$ -215 -107 162 154 -109 -207 65 250 -20 -278 -22 284 64 -270 -96 251 139 -211 -156 181 188 -107 -193
$$ [...]
8191I8
##END NTUPLES=NMR FID
##END=
