##TITLE=1H_LY-Ni-400-ac 120
 CDCl3, 8 sc, 
 18.1.2019
##JCAMPDX= 6.0         $$ Bruker NMR JCAMP-DX V2.0
##DATA TYPE= NMR FID
##DATA CLASS= NTUPLES
##ORIGIN= UXNMR, Bruker Analytische Messtechnik GmbH
##OWNER= root
$$ XWIN-NMR		Version 3.5
$$ Fri Jan 18 15:29:01 2019 Russian Standard Time (UT+4h)  she@DPX200
##.OBSERVE FREQUENCY= 200.1313
##.OBSERVE NUCLEUS= ^1H
##.DELAY= (6, 6)
##.ACQUISITION MODE= SIMULTANEOUS
##.ACQUISITION SCHEME= undefined
##.AVERAGES= 8
##.DIGITISER RES= 18
##SPECTROMETER/DATA SYSTEM= spect
##.PULSE SEQUENCE= zg30
##.SOLVENT NAME= CDCl3
##.SHIFT REFERENCE= (INTERNAL, CDCl3, 0, 15.7039)
##AUDIT TRAIL= $$ (NUMBER, WHEN, WHO, WHERE, WHAT)
$$ ##TITLE= Audit trail, XWIN-NMR		Version 3.5
$$ ##JCAMPDX= 5.01
$$ ##ORIGIN= Bruker BioSpin GmbH
$$ ##OWNER= she
$$ F:/spectra/data/she/nmr/H-F/1/audita.txt
$$ ##AUDIT TRAIL=  $$ (NUMBER, WHEN, WHO, WHERE, WHAT)
(   1,<2019-01-18 15:27:44.07 +0400>,<she>,<DPX200>,
      <created by zg, POWCHK disabled, PULCHK disabled
       configuration hash MD5:
       00 E9 B6 7A A2 85 ED C7 34 08 36 98 17 FE 4E 26
       data hash MD5: 16K
       ED 02 57 9B 49 82 DB 36 F0 92 DB 8D 84 85 D4 17>)
$$ ##END=
$$ 
$$ hash MD5
$$ 25 81 8D 99 41 7F 15 81 0E 98 49 B5 21 E1 B3 90
##$RELAX= 
##$RELAX= 
##$RELAX= 
##$RELAX= 
##$RELAX= 
##$RELAX= 
$$ Bruker specific parameters
$$ --------------------------
##$DU= <F:/spectra>
##$EXPNO= 1
##$NAME= <H-F>
##$PROCNO= 1
##$TYPE= <nmr>
##$USER= <she>
##$AMP= (0..31)
100 100 100 100 100 100 100 100 100 100 100 100 100 100 100 100 100 100 
100 100 100 100 100 100 100 100 100 100 100 100 100 100 
##$AQSEQ= 0
##$AQ_mod= 1
##$AUNM= <au_zg>
##$AUTOPOS= <>
##$BF1= 200.13
##$BF2= 200.13
##$BF3= 200.13
##$BF4= 200.13
##$BF5= 200.13
##$BF6= 200.13
##$BF7= 200.13
##$BF8= 200.13
##$BYTORDA= 1
##$CFDGTYP= 0
##$CFRGTYP= 5
##$CHEMSTR= <none>
##$CNST= (0..31)
1 1 145 1 1 1 1 1 1 1 1 1 1 1 1 1 1 1 1 1 1 1 1 1 1 1 1 1 1 1 1 1 
##$CPDPRG= <>
##$CPDPRG1= <>
##$CPDPRG2= <>
##$CPDPRG3= <>
##$CPDPRG4= <mlev>
##$CPDPRG5= <mlev>
##$CPDPRG6= <mlev>
##$CPDPRG7= <mlev>
##$CPDPRG8= <mlev>
##$CPDPRGB= <>
##$CPDPRGT= <>
##$D= (0..31)
0 1.2 0 0 0 0 0 0 0 0 0 0.03 0 0 0 0 0 0 0 0 0 0 0 0 0 0 0 0 0 0 0 0 
##$DATE= 1547810863
##$DBL= (0..7)
120 120 120 120 120 120 120 120 
##$DBP= (0..7)
150 150 150 150 150 150 150 150 
##$DBP07= 0
##$DBPNAM0= <>
##$DBPNAM1= <>
##$DBPNAM2= <>
##$DBPNAM3= <>
##$DBPNAM4= <>
##$DBPNAM5= <>
##$DBPNAM6= <>
##$DBPNAM7= <>
##$DBPOAL= (0..7)
0.5 0.5 0.5 0.5 0.5 0.5 0.5 0.5 
##$DBPOFFS= (0..7)
0 0 0 0 0 0 0 0 
##$DE= 6
##$DECBNUC= <off>
##$DECIM= 32
##$DECNUC= <off>
##$DECSTAT= 4
##$DIGMOD= 1
##$DIGTYP= 9
##$DL= (0..7)
0 120 120 120 120 120 120 120 
##$DP= (0..7)
150 150 150 150 150 150 150 150 
##$DP07= 0
##$DPNAME0= <>
##$DPNAME1= <>
##$DPNAME2= <>
##$DPNAME3= <>
##$DPNAME4= <>
##$DPNAME5= <>
##$DPNAME6= <>
##$DPNAME7= <>
##$DPOAL= (0..7)
0.5 0.5 0.5 0.5 0.5 0.5 0.5 0.5 
##$DPOFFS= (0..7)
0 0 0 0 0 0 0 0 
##$DQDMODE= 0
##$DR= 18
##$DS= 0
##$DSLIST= <SSSSSSSSSSSSSSS>
$$ [...]
##$SUBNAM2= <"">
##$SUBNAM3= <"">
##$SUBNAM4= <"">
##$SUBNAM5= <"">
##$SUBNAM6= <"">
##$SUBNAM7= <"">
##$SUBNAM8= <"">
##$SUBNAM9= <"">
##$SW= 20.0189088683792
##$SWIBOX= (0..15)
0 0 2 0 0 0 0 0 0 0 0 0 0 0 0 0 
##$SW_h= 4006.41025641026
##$TD= 16384
##$TD0= 1
##$TE= 0
##$TE2= 300
##$TE3= 300
##$TEG= 300
##$TL= (0..7)
0 120 120 120 120 120 120 120 
##$TP= (0..7)
150 150 150 150 150 150 150 150 
##$TP07= 0
##$TPNAME0= <>
##$TPNAME1= <>
##$TPNAME2= <>
##$TPNAME3= <>
##$TPNAME4= <>
##$TPNAME5= <>
##$TPNAME6= <>
##$TPNAME7= <>
##$TPOAL= (0..7)
0.5 0.5 0.5 0.5 0.5 0.5 0.5 0.5 
##$TPOFFS= (0..7)
0 0 0 0 0 0 0 0 
##$TUNHIN= 0
##$TUNHOUT= 0
##$TUNXOUT= 0
##$USERA1= <user>
##$USERA2= <user>
##$USERA3= <user>
##$USERA4= <user>
##$USERA5= <user>
##$V9= 5
##$VALIST= <valist>
##$VCLIST= <CCCCCCCCCCCCCCC>
##$VD= 0
##$VDLIST= <DDDDDDDDDDDDDDD>
##$VPLIST= <PPPPPPPPPPPPPPP>
##$VTLIST= <TTTTTTTTTTTTTTT>
##$WBST= 1024
##$WBSW= 4
##$XGAIN= (0..3)
0 0 0 0 
##$XL= 0
##$YL= 0
##$YMAX_a= 119997
##$YMIN_a= -126092
##$ZGOPTNS= <>
##$ZL1= 120
##$ZL2= 120
##$ZL3= 120
##$ZL4= 120
##$ABSF1= 10
##$ABSF2= 0
##$ABSG= 5
##$ABSL= 3
##$ALPHA= 0
##$AQORDER= 0
##$ASSFAC= 0
##$ASSFACI= 0
##$ASSFACX= 0
##$ASSWID= 0
##$AUNMP= <proc_1d>
##$AZFE= 0.1
##$AZFW= 0.1
##$BCFW= 1
##$BC_mod= 2
##$BYTORDP= 1
##$COROFFS= 0
##$CY= 11.3945322036743
##$DATMOD= 1
##$DC= 2
##$DFILT= <>
##$DTYPP= 0
##$F1P= 18.9103706918063
##$F2P= -1.10871071338519
##$FCOR= 0.5
##$FTSIZE= 0
##$FT_mod= 4
##$GAMMA= 1
##$GB= 0.15
##$INTBC= 1
##$INTSCL= 1
##$ISEN= 128
##$LB= 0.24
##$LEV0= 0
##$LPBIN= 0
##$MAXI= 10000
##$MC2= 0
##$MEAN= 0
##$ME_mod= 0
##$MI= 1.114404
##$NCOEF= 0
##$NC_proc= 0
##$NLEV= 6
##$NOISF1= 3.799351
##$NOISF2= 2.8
##$NSP= 1
##$NTH_PI= 0
##$NZP= 0
##$OFFSET= 15.70392
##$PC= 1
##$PHC0= -9127.81
##$PHC1= 4.200044
##$PH_mod= 1
##$PKNL= yes
##$PPARMOD= 0
##$PSCAL= 0
##$PSIGN= 0
##$REVERSE= no
##$SF= 200.130013532006
##$SI= 16384
##$SIGF1= 3
##$SIGF2= 2
##$SINO= 400
##$SIOLD= 16384
##$SREGLST= <1H.CDCl3>
##$SSB= 0
##$STSI= 0
##$STSR= 0
##$SW_p= 3612.71676300578
##$SYMM= 0
##$S_DEV= 0
##$TDeff= 0
##$TDoff= 0
##$TI= <>
##$TILT= no
##$TM1= 0
##$TM2= 0
##$TOPLEV= 0
##$USERP1= <user>
##$USERP2= <user>
##$USERP3= <user>
##$USERP4= <user>
##$USERP5= <user>
##$WDW= 1
##$XDIM= 8192
##$YMAX_p= 0
##$YMIN_p= 0
$$ End of Bruker specific parameters
$$ ---------------------------------
##NTUPLES= NMR FID
##VAR_NAME=  TIME,          FID/REAL,        FID/IMAG
##SYMBOL=    X,             R,               I
##VAR_TYPE=  INDEPENDENT,   DEPENDENT,       DEPENDENT
##VAR_FORM=  AFFN,          ASDF,            ASDF
##VAR_DIM=   8192,          8192,            8192
##UNITS=     SECONDS,       ARBITRARY UNITS, ARBITRARY UNITS
##FACTOR=    0.0002496,     1,               1
##FIRST=     0,             0,               0
##LAST=      2.0444736,     0,               0
##MIN=       0,             -126092,         0
##MAX=       2.0444736,     119997,          0
$$ Real data points
##PAGE= N=1
##DATA TABLE= (X++(R..R)), XYDATA
$$ [...]
$$ plain form
1566 -652 -596 -660 881 1134 -762 -357 1668 -179 -2969 -421 3065 875 -2038 -179 1477 -748 -1791
1583 -1791 421 1514 543 -35 -627 -1278 -12 1291 -135 -966 1260 1556 -1823 -2438 1161 2164 -532
1600 -532 -995 932 532 -1267 -942 408 873 923 222 -1251 -982 846 533 -1129 67 2136 365
1617 365 -2396 -1098 1472 836 -690 21 884 -54 -995 -800 22 1043 1178 -387 -1344 4 825 -673
1635 -673 -1028 1209 1831 -654 -1925 -198 989 139 -366 361 713 11 -937 -1061 158 1426 744 -879
1653 -879 -649 645 75 -1271 -300 1636 1114 -934 -1252 31 536 -59 -262 424 871 32 -1262 -1041
1671 -1041 643 1287 43 -737 151 547 -645 -1178 235 1489 663 -857 -909 145 405 -339 -366 766
1689 766 1086 -356 -1474 -519 892 672 -284 -177 510 193 -891 -951 429 1392 460 -918 -611 482
$$ packed form
1566f52N6o4J541K53j896M05K025j847k790K548L486k190k913J859J656k225j043
1583a791K212J093r71n78n92o51J266J303j426q31K226K96l379o15L599J003k696
1600e32m63J927m00j799L25J350M65N0p01j473K69J828l13j662J196K069j771
1617C65k761J298K570o36j526P11Q63r38r41J95Q22J021J35j565r57J348Q21j498
1635f73l55K237O22k485j271J727J187q50n05P27L52p02r48j24J219J268o82j623
1653h79K30J294n70j346R71J936n22k048l18J283N05n95k03O86M47q39j294K21
1671a041J684O44j244p80Q88L96j192n33J413J254q26j520n2J054K60p44k7J132
1689G66L20j442j118R55J411k20r56J07O87l17j084o0J380R63r32j378L07J093
$$ plain form
1707 482 132 -845 -150 1273 821 -860 -1143 -2 612 186 -157 134 513 65 -980 -956 617 1392 24
1726 24 -1015 -12 654 -536 -1041 473 1372 244 -857 -609 -3 230 130 -86 170 700 58 -1310
1744 -1310 -827 1100 1127 -599 -609 718 279 -1155 -632 938 935 -61 -472 -418 -183 241 81 -318 390 1045
1764 1045 -339 -1656 -222 1393 313 -892 227 947 -487 -1218 -28 792 452 148 -228 -606 -53
1781 -53 427 -368 -486 1055 1092 -1099 -1472 636 1034 -588 -437 973 446 -928 -655 176 288 513 458
1800 458 -515 -619 505 192 -1073 -37 1707 406 -1638 -567 1026 47 -844 407 967 -212 -683
1817 -683 -238 -246 119 914 184 -920 18 847 -681 -1277 934 1648 -604 -1316 454 611 -763 -344 866
1836 866 404 -284 -77 -438 -646 609 1000 -553 -704 963 429 -1575 -609 1643 751 -1122 -296 764
$$ packed form
1707D82l50r77O95J423m52j681k83J141O14m26l43K91L79m48j045K4J573P75j368
1726B4j039J003O66j190n05J514Q99j128j101K48O06K33j00k16K56N30o42j368
1744a310M83J927K7j726j0J327m39j434N23J570lr96m11N4K35M24j60l99P08O55
1764A045j384j317J434J615j080j205J119P20j434p31J190Q20l40l04l76l78N53
1781e3M80p95j18J541L7k191l73K108L98j622J51J410n27j374K73Q31J12K25n5
1800D58r73j04J124l13j265J036J744j301k044J071J593r79q91J251N60j179m71
1817f83M45qL65P95p30j104R38Q29j528n96K211P14k252p12J770J57j374M19J210
1836H66m62o88K07l61k08J255L91j553j51J667n34k004R66K252q92j873Q26J060
$$ plain form
1854 764 -311 -784 337 521 -32 314 79 -1079 -421 1194 302 -1121 279 1387 -671 -1755 435
1871 435 1433 -285 -679 579 218 -806 -195 369 -119 326 875 -546 -1354 435 1114 -751 -748 1404
1889 1404 849 -1549 -995 1050 528 -610 252 638 -498 -511 212 -282 -231 1151 670 -1375 -774 1146
1907 1146 166 -1328 391 1743 -297 -1600 24 727 -325 -46 804 -64 -611 187 -144 -912 530
1924 530 1647 -332 -1566 360 1005 -992 -844 1462 1048 -1109 -772 459 -101 -286 757 427 -618
1941 -618 48 401 -988 -705 1544 1105 -1322 -791 1127 18 -1418 282 1587 -49 -982 41 42
1958 42 -540 407 816 -451 -387 777 -237 -1521 329 1847 -185 -1468 431 941 -970 -832 1111
1975 1111 760 -640 -184 168 -619 -103 1011 -16 -894 582 845 -1223 -1043 1429 1065 -1234 -590
$$ packed form
1854G64j075m73J121J84n53L46k35j158O58J615q92j423J400J108k058j084K190
1871D35R98j718l94J258l61j024O11N64m88M45N49j421q08J789O79j865LK152
1889A404n55k398N54K045n22j138Q62L86j136j3P23m94N1J382m81k045O01J920
1907A146r80j494J719J352k040j303J624P03j052K79Q50q68n47P98l31p68J442
1924E30J117j979j234J926O45j997J48K306m14k157L37J231n60j85J043l30j045
1941f18O66L53j389K83K249m39k427N31J918j109j436J700J305j636r33J023J
1958D2n82R47M09j267O4J164j014j284J850J518k032j283J899N10j911J38J943
1975A111l51j400M56L52p87N16J114j027q78J476K63k068J80K472l64k299O44
$$ plain form
1992 -590 1142 43 -1147 201 904 -225 -273 407 -400 -655 796 646 -1060 -347 1370 19 -1639
2009 -1639 153 1588 -312 -1287 503 879 -674 -482 629 4 -442 483 187 -888 146 1176 -502
2026 -502 -1332 780 1279 -976 -1037 1138 699 -1204 -436 1002 127 -542 326 102 -714 202 785 -582
2044 -582 -612 1162 526 -1585 -549 1556 344 -1292 159 1141 -527 -1057 465 579 -272 232 361
2061 361 -850 -507 955 183 -1033 451 1407 -775 -1659 648 1334 -593 -650 938 286 -1066 -245
2078 -245 576 -52 158 755 -426 -1164 419 938 -764 -560 1447 610 -1679 -754 1271 390 -803 325
2096 325 757 -582 -658 294 -23 -131 944 414 -1288 -547 1124 37 -1202 570 1534 -624 -1535 344
2114 344 889 -406 -165 752 -27 -641 108 -8 -568 555 1198 -576 -1282 592 883 -984 -607 1429
$$ packed form
1992e90J732j099j190J348P03j129m8O80q07k55J451j50j706P13J717j351j658
2009a639J792J435j900r75J790L76j553J92J111o25m46R25k96j075J034J030j678
2026e02q30K112M99k255o1K175m39j903P68J438q75o69Q68k24q16R16N83j367
2044e82l0J774o36k111J036K105j212j636J451R82j668n30J522J14q51N04J29
2061C61j211L43J462p72j216J484R56k182q84K307O86j927n7J588o52j352Q21
2078b45Q21o28K10N97j181p38J583N19j702K04K007q37k289R25K025q81j193J128
2096C25M32j339p6R52l17j08J075n30j702P41J671j087j239J772R64k158r11J879
2114C44N45j295K41R17p79o14P49j16n60J123O43j774p06J874K91j867L77K036
$$ plain form
2132 1429 728 -1254 -620 702 59 -380 473 331 -461 8 240 -766 -336 1282 564 -1278 -393 1156
2150 1156 -117 -1299 351 1367 -234 -961 134 242 -369 147 453 -286 -93 602 -379 -1099 507
2167 507 1333 -462 -1090 672 794 -999 -747 952 651 -520 -196 190 -297 -71 452 -150 -341 702
2185 702 408 -1159 -636 1175 548 -1053 -185 1079 -71 -1112 -6 760 71 -150 136 -248 -293 367
2203 367 62 -623 298 1059 -368 -1296 252 1081 -354 -780 641 734 -605 -659 229 278 77 254 -94
2222 -94 -439 208 355 -616 -431 1028 689 -1001 -695 790 386 -743 -116 809 189 -559 -289 -11 90
2241 90 414 167 -472 -63 574 -250 -947 277 1188 -74 -1006 20 657 -247 -566 303 578 28 -288
2260 -288 -338 -204 348 465 -270 -366 528 366 -842 -620 823 787 -506 -544 373 259 -436 -292 321 450
$$ packed form
2132A429p01j982O34J322o43m39Q53j42p92M69K32j006M30J618p18j842Q85J549
2150A156j273j182J650J016j601p27J095J08o11N16L06p39J93O95r81p20J606
2167E07Q26j795o28J762J22j793K52J699l01j171L24L86m87K26N23o02j91J043
2185G02k94j567N23J811o27j601Q68J264j150j041J106P66o89k21K86l84m5O60
2203C67l05o85R21P61j427r28J548Q29j435m26J421R3j339n4Q88M9k01J77l48
2222i4l45O47J47r71J85J459l39j690L06J485m04j129O27R25o20p48K70K78J01
2241I0L24k47o39M09O37q24o97J224R11j262r32J026O37r04l19Q69K75n50l16
2260b88n0J34N52J17p35r6Q94j62j208K22J443l6j293l8R17j14o95J44O13J29
$$ plain form
2280 450 165 -292 -550 -30 550 78 -507 144 740 -173 -997 -105 872 291 -485 -150 336 42 -415 -274
2300 -274 272 567 173 -547 -465 329 390 -358 -300 605 520 -562 -766 214 653 68 -345 20 340 -8 -532
2321 -532 -324 470 667 -104 -626 -75 427 -44 -497 87 723 236 -653 -556 265 513 -67 -338 183 464
2341 464 -217 -770 -110 724 423 -383 -367 196 198 -333 -375 294 681 106 -681 -456 401 423 -334 -288 583 451
2363 451 -598 -738 257 670 78 -319 -51 209 14 -355 -312 380 752 -37 -832 -202 619 69 -647 107
2383 107 860 84 -851 -370 430 330 -38 -91 10 146 16 -503 -392 627 809 -435 -837 319 591
2402 591 -530 -573 670 738 -390 -648 -20 219 136 94 -79 -13 362 -33 -862 -204 1082 504 -882 -327
2422 -327 789 44 -917 -9 926 249 -465 -240 -91 -31 281 76 -348 252 658 -530 -1114 419 1190
$$ packed form
2280D50k85m57k58N20N80m72n85O51N96r13q24Q92R77n81p76L35M86k94m57J41
2300b74N46K95l94p20Q2P94O1p48N8R05q5j082k04R80M39n85m13L65L20l48n24
2321e32K08P94J97p71n22N51N02m71m53N84O36m87q89R7Q21K48n80k71N21K81
2341D64o81n53O60Q34l01q06J6N63Kn31m2O69L87n75p87K25Q57K2p57M6Q71j32
2363D51j049j40R95M13n92l97K68K60j95l69M3O92L72p89p95O30Q21n50p16P54
2383A07P53p76r35M81Q00j00l68n3J01J36j30n19J11J019J82j244m02J156K72
2402E91j121m3J243O8j128k58O28K39q3m2j73O6L75l95q29O58J286n78j386N55
2422c27J116p45r61R08R35o77p14K25J49O0L12k05m24O00M06j188n84J533P71
$$ plain form
2441 1190 -273 -878 464 658 -704 -702 518 592 -56 -85 -181 -390 169 439 -381 -313 914 481 -1237 -714
2461 -714 1116 614 -877 -179 949 -21 -912 -92 480 138 220 171 -565 -320 653 34 -881 314 1340
2480 1340 -330 -1484 205 1125 -361 -740 669 612 -592 -478 139 -56 188 664 -211 -856 355 700
2498 700 -871 -720 1317 940 -1227 -834 930 331 -855 88 881 -72 -475 14 -299 -307 811 589 -898
2517 -898 -359 1061 -102 -1462 273 1695 -127 -1322 204 741 -585 -459 701 339 -283 159 -172
2534 -172 -897 250 1237 -278 -1071 699 894 -1257 -1054 1329 1032 -963 -507 724 -135 -746 321
2551 321 491 -226 277 384 -981 -743 1179 708 -1179 -220 1433 -189 -1711 175 1493 -104 -794
2568 -794 414 261 -704 -36 516 -302 17 949 -313 -1470 322 1446 -534 -1147 1001 1017 -1292 -999
$$ packed form
2441A190j463o05J342J94j362KJ220P4o48k9r6k09N59K70q20O8J227m33j718N23
2461g14J830n02j491O98J128r70q91Q20N72l42Q2m9p36K45R73o19r15J195J026
2480A340j670j154J689R20j486l79J409n7j204J14O17j95K44M76q75o45J211L45
2498G00j571J51K037l77k167L93J764n99j186R43P93r53m03M89l13qJ118k22j487
2517h98N39J420j163j360J735J422j822j195J526N37j326J26J160l62o22M42l31
2534a72p25J147R87j515p93J770J95k151K03K383k97j995M56J231q59o11J067
2551C21J70p17N03J07j365K38J922m71j887R59J653j622j522J886J318j597o90
2568g94J208j53r65O68N52q18L19R32j262j157J792J124j980o13K148J6k309K93
$$ plain form
2586 -999 1042 613 -678 40 491 -512 -322 570 -208 -589 909 787 -1317 -861 1364 579 -1401 -95
2604 -95 1517 -123 -1393 179 870 -353 -234 579 -191 -539 579 231 -1059 101 1459 -282 -1545
2621 -1545 494 1362 -824 -1161 1010 901 -917 -461 689 -82 -456 495 150 -702 352 859 -885
2638 -885 -1020 1164 924 -1299 -575 1439 246 -1488 -80 1179 -97 -607 447 133 -653 206 514
2655 514 -659 -182 1264 32 -1602 29 1516 -311 -1238 795 1129 -961 -998 681 451 -401 315
2672 315 385 -720 -270 691 -324 -788 999 1115 -1224 -1210 1070 708 -1101 -130 1350 -9 -1215 -65
2690 -65 465 -212 242 738 -455 -750 571 246 -1092 136 1688 -39 -1675 -16 1145 -416 -765
2707 -765 905 782 -770 -549 227 -217 -8 931 136 -1010 61 761 -761 -883 1277 1174 -1144 -1018
$$ packed form
2586i99K041m29j291P18M51j003J90Q92p78l81J498j22k104M56K225p85j980J306
2604i5J612j640j270J572O91j223J19Q13p70l48J118l48j290J160J358j741j263
2621a545K039Q68k186l37K171j09j818M56J150p71l74R51l45q52J054N07j744
2638h85j35K184k40k223P24K014j193j734J408J259j276n10J054l14p86Q59L08
2655E14j173M77J446j232j634J631J487j827r27K033L34k090l7J679k30q52P16
2672C15P0j105M50R61j015m64J787J16k339J4K280l62j809R71J480j359j206J150
2690f5N30o77M54M96j193k95J321l25j338J228J552j727j636J659J161j561l49
2707g65J670j23j552K21P76m44K09R39p95j146J071P00j522j22K160j03k318J26
$$ plain form
2725 -1018 788 298 -872 167 1000 -123 -602 37 -272 -430 761 797 -796 -580 869 19 -1340
2742 -1340 177 1630 -6 -1279 76 639 -521 -385 726 325 -357 87 -126 -792 180 1159 -143
2759 -143 -984 479 785 -993 -882 1119 920 -790 -502 528 -73 -553 281 389 -190 169 288 -775
2777 -775 -587 933 582 -928 -240 1085 -93 -1299 54 1134 -27 -634 228 218 -439 -48 290 -203
2795 -203 73 679 -229 -1052 218 1014 -391 -822 715 789 -852 -780 628 482 -367 -15 300 -246 -172
2814 -172 208 -262 -279 723 505 -897 -560 846 306 -926 -39 1050 22 -922 -97 450 -75 -74 275
2833 275 -94 -180 242 -129 -658 265 984 -194 -952 248 723 -507 -655 655 699 -439 -461 133 23
2852 23 -56 250 30 -212 258 193 -702 -419 844 558 -731 -376 668 80 -802 -59 740 189 -348 -134
$$ packed form
2725a018J806m90j170J039Q33j123m79O39l09j58J191L6j593K16J449q50j359
2742a340J517J453j636j273J355N63j160J36J111m01o82M44k13o66R72R79j302
2759a43q41J463L06j778J11K001j99j710K88J030o01m80Q34J08n79L59J19j063
2777g75J88J520l51j510O88J325j178j206J353J080j161o07Q62j0o57L91L38m93
2795b03K76O06r08q23J270P96j405m31J537P4j641P2J408j46q49L52L15n46P4
2814a72L80m70j7J002k18j402L37J406n40j232Q87J089j028r44Q25N47n25JL49
2833B75l69q6M22l71n29R23P19j178p58J200M75j230j48J310M4j138k2N94j10
2852B3p9L06k20k42M70o5q95K83J263k86j289L55J044n88q82P43P99n51n37K14
$$ plain form
2872 -134 -94 -108 219 130 -268 131 521 -333 -892 218 915 -113 -640 261 489 -434 -548 286 474 65
2892 65 -80 -197 -254 131 251 -248 -154 604 305 -786 -516 644 487 -443 -181 479 91 -524 -261 233
2912 233 299 187 -87 -369 -74 300 -95 -434 278 713 -198 -829 -36 588 5 -360 152 393 -116 -422
2932 -422 -214 152 391 198 -281 -281 245 157 -467 -190 659 451 -503 -531 238 309 -175 -145 279 289 -119 -423
2954 -423 -255 259 446 -23 -351 35 292 -227 -518 161 682 119 -517 -249 231 113 -207 -72 333 317
2974 317 -216 -529 -129 424 266 -223 -133 294 114 -457 -351 350 546 -40 -426 -99 223 -15 -302 2
2994 2 498 265 -400 -480 123 380 -5 -198 113 304 -94 -490 -223 398 443 -145 -392 59 268 -214 -410
3015 -410 235 597 20 -519 -240 207 141 -110 -56 205 235 -170 -499 -140 516 342 -307 -245 333 145 -515
$$ packed form
2872a34M0j4L27q9l98L99L90q54n59J110O97j028n27R01K28r23j14Q34J88m09
2892F5j45j17n7L85J20m99R4P58k99j091K70J160j57r30K62O60l88o15K63M94
2912B33O6j12k74k82K95L74l95l39P12M35r11o31P93O24n83l65N12K41n09l06
2932d22K08L66K39j93m79%N26q8o24K77Q49k08r54k8P69P1m84L0M24J0m08l04
2954d23J68N14J87m69l28L86K57n19k91O79N21n63o36K68M80j18l20J35M05j6
2974C17n33l13M00N53j58m89R0M27j80n71J06P01J96n86l86L27L22k38k87L04
2994BM96k33o65q0O03K57l85j93L11J91l98l96K67O21M5n88k47M51K09m82j96
3015d10O45L62n77n39K79M47o6k51N4K61L0m05l29L59O56j74o49O2N78j88o60
$$ plain form
3036 -515 -265 512 456 -217 -358 -23 118 4 -74 -5 257 283 -263 -598 43 613 65 -457 77 452 -223
3057 -223 -613 65 559 153 -219 -141 -50 11 31 -125 -52 433 289 -555 -539 397 484 -345 -261 491 237 -546 -375
3080 -375 298 318 45 -22 -124 -120 125 -2 -351 127 692 18 -785 -153 616 24 -503 202 557 -158 -531
3101 -531 -68 179 109 179 8 -278 22 245 -325 -419 534 665 -466 -668 342 381 -451 -231 550 271 -348
3122 -348 -231 -22 -56 225 307 -229 -212 385 58 -711 -72 897 224 -721 -124 528 -149 -485 248 462 -46
3143 -46 -151 -78 -285 -16 484 38 -456 200 512 -508 -743 498 753 -359 -489 362 172 -495 -127 379
3163 379 106 4 114 -312 -412 353 434 -421 -236 685 130 -920 -212 827 196 -534 74 370 -289 -343
3183 -343 188 105 2 337 8 -639 -70 648 -73 -584 396 706 -536 -777 401 552 -329 -179 374 -32
$$ packed form
3036e15K50P77n6o73j41L35J41j14p8O9K62K6n46l35O41N70n48n22N34L75o75
3057b23l90O78M94m06l72P8R1O1K0j56P3M85j44q44J6R36Q7q29Q4P52k54p83J71
3080c75O73K0k73o7j02MK45j27l49M78N65o74q03O32P69n92n27P05L55p15l73
3101e31M63K47p0P0j71k86L00K23n70r4R53J31j131k02J010L9q32K20P81k79o19
3122c48J17K09l4K81Q2n36J7N97l27p69O39R69o73r45N97O52o77l36P33K14n08
3143d6j05P3k07K69N00m46m94O56L12j020k35J241K55j112j30Q51j90o67L68N06
3163C79k73j02J10m26j00P65Q1q55J85R21n55j050P08J039o31p30O08K96o59n4
3183c43N31q3j03L35l29o47N69P18p21n11R80L10j242k41J178J51q81J50N53m06
$$ plain form
3203 -32 -361 36 49 -187 302 439 -480 -565 492 395 -657 -198 841 156 -840 -150 569 -24 -306 249
3223 249 171 -277 17 126 -355 -26 668 30 -766 44 705 -289 -695 456 683 -431 -499 333 178 -316
3243 -316 88 255 -187 -27 301 -287 -498 467 565 -559 -451 658 270 -793 -190 735 101 -510 66
3262 66 245 -277 -103 271 -130 -149 461 93 -731 -94 770 -43 -690 287 702 -432 -673 354 427 -257
3282 -257 -62 284 -181 -262 238 -15 -357 362 574 -509 -666 498 466 -587 -208 781 147 -760 -169 422
3302 422 -43 -87 323 -28 -391 111 145 -463 -10 822 80 -893 -103 660 -185 -548 471 613 -420 -485
3322 -485 169 46 -101 360 223 -409 -96 324 -335 -473 641 706 -567 -651 429 236 -559 2 706 51
3342 51 -496 -65 5 -215 258 473 -269 -346 351 12 -731 59 961 72 -792 -17 451 -310 -357 480 392 -268
$$ packed form
3203c2l29L97J3k36M89J37r19q5J057r7j052M59J039o85r96O90P19n93k82N55
3223B49p8m48K94J09m81L29O94o38p96Q10O61r94m06J151K27j114o8Q32j55m94
3243c16M04J67m42J60L28n88k11R65R8j124J08J109l88j063O03R25o34o11N76
3262F6J79n22J74L74m01j9O10l68q24O37Q64q13o47R77M15j134k41J027P3o84
3282b57J95L46m65q1N00k53l42P19K12j083j57J164l2j053L79R89o34r07N91N91
3302D22m65m4M10l51l63N02L4o08M53Q32p42r73P90P63q45l63J019J42j033o5
3322d85O54j23j47M61j37o32L13M20o59j38J114O5j273q4J080j93p95N61P04o55
3342E1n47M31P0k20M73K15p42p7O97l39p43P90R02q89q64P75M68p61m7Q37q8o60
$$ plain form
3364 -268 -148 -12 -332 -6 598 76 -512 160 417 -544 -563 685 656 -506 -401 391 26 -463 108 449
3384 449 -47 -85 107 -316 -350 457 416 -458 -201 582 -44 -833 43 799 -6 -539 136 243 -350 -182 299
3405 299 56 -53 258 -73 -559 81 616 -163 -511 408 495 -573 -534 510 407 -354 -109 316 -104 -279
3425 -279 108 41 -143 291 302 -471 -373 508 252 -586 -47 715 1 -712 -46 468 -76 -233 210 99 -218
3446 -218 21 27 -312 68 547 -82 -609 131 504 -347 -484 464 508 -397 -385 247 120 -198 98 184 -118 24
3468 24 125 -319 -286 480 386 -480 -283 491 81 -617 -37 623 105 -391 -38 105 -149 -9 177 -65 -14
3489 -14 264 -135 -558 83 630 -62 -488 198 402 -367 -457 303 388 -117 -135 40 -117 -68 152 -32 -107 299
3511 299 231 -483 -378 448 345 -357 -146 431 52 -498 -137 325 147 -30 12 -126 -129 114 27 -227 129 469
$$ packed form
3364b68J20J36l20L26O04n22n88O72K57r61j9J248k9j162J05P92l65m89N71L41
3384D49m96l8J92m23l4Q07m1q74K57P83o26p89Q76P56q05n33O75J07n93J68M81
3405B99k43j09L11l31m86O40N35p79l48R19Q7j068L9J044j03p61K45M25m20j75
3425b79L87o7j84M34J1p73R8Q81k56q38N39P62p14p13O66N14n44j57M43j11l17
3446b18K39Ol39L80M79o29n27P40L73q51j37R48M4r05J2O32j27l18K96Q6l02J42
3468B4J01m44L3P66r4q66J97P74m10o98N80O60n18m96L53J43k54J40J86k42N1
3489a4K78l99m23O41N47o92m26O86K04p69r0P60Q5n05j8J75j57M9K20j84p5M06
3511B99o8p14J05Q26j03p02K11N77l79n50L61M62j78j77M2j38lK43q7k54L56L40
$$ plain form
3533 469 -111 -586 -4 468 -53 -328 199 331 -206 -362 15 153 115 95 -78 -182 56 107 -240 -166 417
3554 417 341 -404 -372 249 230 -240 -86 322 146 -230 -209 -30 94 189 59 -176 -39 189 -98 -354 98 512
3576 512 28 -414 -87 245 -35 -213 68 257 60 -172 -208 -74 173 186 -100 -129 178 102 -321 -256 304 345
3598 345 -144 -269 61 129 -119 -140 115 238 91 -184 -233 29 241 35 -161 61 242 -67 -372 -51 347
3619 347 198 -155 -126 106 62 -156 -138 152 276 24 -282 -175 117 128 -113 -84 198 163 -217 -315 50 273
3641 273 102 -152 -51 145 10 -248 -114 257 259 -101 -251 -32 123 -4 -101 48 227 80 -235 -239 106 261
3663 261 -1 -162 56 189 -110 -315 17 324 138 -159 -140 33 34 -73 -78 89 227 42 -298 -227 185 206
3685 206 -136 -118 209 132 -282 -253 157 239 -5 -105 -42 16 11 -74 -81 136 292 -32 -355 -82 283 45 -225 73
$$ packed form
3533D69n80m75N82M72n21k75N27J32n37j56L77J38l8k0j73j04K38N1l47P4N83
3554D17p6p45L2O21j9m70J54M08j76l76K1J79J24R5j30k35J37K28k87k56M52M14
3576E12m84m42L27L32k80j78K81J89j97k32l6J34K47J3k86k9L07p6m23O5N60M1
3598C45m89j25L30O8k48k1K55J23j47k75m9K62K12k06j96K22J81l09l05L21L98
3619C47j49l53K9K32m4k18J8K90J24k52l06J07K92J1k41K9K82l5l80r8L65K23
3641B73j71k54J01J96j35k58J34L71Kl60j50K19J55j27r7J49J79j47l15mL45J55
3663B61k62j61K18J33k99k05L32L07j86k97J9J73Jj07nJ67J38j85l40P1M12K1
3685B06l42J8L27p7m14K9M10Q2k44j00O3N8nq5pK17J56l24l23K73L65k38k70K98
$$ plain form
3709 73 305 -39 -327 -73 178 119 1 -17 -38 12 24 -140 -110 256 283 -215 -333 132 210 -190 -151 263 207 -209
3733 -209 -226 17 69 64 68 -57 -62 101 -14 -291 -34 408 136 -352 -120 266 -7 -265 73 325 23 -175 -72
3756 -72 -30 21 148 49 -124 57 185 -212 -333 216 406 -134 -303 148 155 -234 -155 219 162 -67 -51 -92 -136 100
3780 100 180 -114 -96 273 69 -425 -163 407 165 -292 -42 231 -80 -256 35 167 35 54 -5 -222 -54
3801 -54 233 33 -228 146 353 -197 -432 153 366 -101 -173 208 103 -210 -92 100 14 83 165 -148 -263 136
3823 136 215 -237 -122 391 149 -441 -196 313 80 -204 66 194 -98 -133 27 -57 -18 250 84 -317 -63
3844 -63 308 -56 -345 173 417 -150 -373 116 193 -136 -50 200 26 -114 48 -38 -180 162 310 -167 -274
3865 -274 216 202 -355 -183 392 180 -316 -88 183 -64 -142 125 82 -74 87 62 -266 -119 340 89 -333
$$ packed form
3709G3K32l44k88K54K51n9j18j8k1N0J2j64L0L66K7m98j18M65P8m00L9M14n6m16
3733b09j7K43N2nMj25nJ63j15k77K57M42k72m88K32L86k73k58L38K52l02j98J03
3756g2M2N1J27r9j73J81J28l97j21N49J90n40j69M51Pl89P9L74n7k29J6m1m4K36
3780A00Q0k94J8L69k04m94K62N70k42m57K50K73l11j76K91J32j32J9n9k17J68
3801e4K87k00k61L74K07n50k35N85K13m67p2L81j05l13J18J92q6O9Q2l13j15L99
3823A36P9m52J15N13k42n90K45N09k33k84K70J28k92l5J60q4L9K68j66m01K54
3844f3L71l64k89N18K44n67k23M89P7l29Q6K50j74j40J62q6j42L42J48m77j07
3865b74M90j4n57J72N75k12m96K28K71k47p8K67m3j56J61k5l28J47M59k51m22
$$ plain form
3886 -333 6 351 -120 -406 121 352 -95 -163 131 44 -154 31 102 -84 64 236 -137 -331 159 298 -202
3907 -202 -221 332 197 -368 -199 275 112 -133 64 99 -150 -79 92 -91 -67 296 141 -380 -158 328 43
3928 43 -318 106 381 -111 -354 42 167 -74 40 164 -73 -135 99 -40 -210 181 387 -144 -378 122 228
3949 228 -243 -142 356 173 -277 -140 96 -34 -1 206 28 -170 48 77 -263 -95 415 200 -358 -147 242
3970 242 -50 -284 143 331 -69 -199 1 -54 -84 183 153 -151 -53 160 -137 -310 175 415 -97 -293 111
3991 111 143 -226 -79 281 132 -120 -22 -34 -160 76 253 -40 -153 155 87 -327 -141 373 172 -256 -54
4012 -54 184 -79 -207 98 163 -19 5 22 -173 -89 218 89 -203 29 246 -133 -338 107 290 -70 -166 120
4034 120 54 -170 -42 114 6 19 118 -86 -202 111 198 -129 -125 243 132 -284 -141 225 95 -144 14 127
$$ packed form
3886c33L39L45m71k86N27K31m47o8K94q7j98J85P1j86J48J72l73j94M90J39n00
3907b02j9N53j35n65J69M74j63k45J97L5k49P1J71j83K4L63j55n21K22M86k85
3928D3l61M24K75m92k43L96J25k41J14J24k37o2K34j39j70L91K06n31k34N00J06
3949B28m71J01M98j83m50J37K36j30L3K07j78j98K18K9l40J68N10k15n58K11L89
3970B42k92k34M27J88m00j30K00n5l0K67l0l04R8K13k97j73M85K40n12j96M04
3991A11L2l69J47L60j49k52R8j2j26K36J77k93j13L08o8m14J86N14k01m28K02
4012e4K38k63j28L05O5j82K4J7j95Q4L07j29k92K32K17l79k05M45J83l60r6K86
4034A20o6k24J28J56j08J3R9k04j16L13Q7l27ML68j11m16J43L66j30k39J58J13
$$ plain form
4056 127 -65 -82 39 -22 -35 137 64 -213 -86 190 3 -236 53 272 -61 -236 33 137 -64 -53 106 32
4078 32 -61 18 -14 -122 65 193 -60 -177 101 138 -170 -132 201 149 -140 -82 88 6 -61 51 66 -10 40 21 -138
4103 -138 -71 168 102 -149 -37 167 -33 -221 18 208 16 -102 2 13 -62 4 50 -3 26 91 -72 -173 50
4126 50 179 -35 -114 111 109 -144 -138 105 121 -14 -9 12 -40 -30 29 -9 -3 123 46 -166 -89 132 85 -94 1 150 6
4153 6 -160 -22 87 40 9 4 -34 -42 14 -21 -58 66 134 -40 -165 11 105 -21 -76 74 91 -64 -92 -7 43 39 55
4180 55 -3 -28 27 33 -68 -27 133 88 -97 -83 59 37 -74 -3 84 43 -56 -60 -11 18 66 32 -36 -6 41 -40 -97 27
4208 27 131 12 -91 -18 49 1 -49 33 82 23 -49 -72 -30 49 50 -6 -18 50 27 -82 -63 83 103 -5 -46 15 30 -33
4236 -33 -30 30 72 26 -30 -58 0 48 24 -7 13 65 -9 -83 -25 81 67 -18 -20 10 -1 -39 -29 33 66 20 -37 -52 15 48 -7
$$ packed form
4056A27j92j7J21o1j3J72p3k77J27K76j87k39K89K19l33j75K69J04k01J1J59p4
4078C2r3P9l2j08J87J28k53j17K78L7l08L8L33n2k89N8J70q2o7J12J5p6N0j9j59
4103a38O7K39o6k51J12K04k00j88K39J90j92j18J04J1p5O6M6n3K9O5j63j01K23
4126E0J29k14p9K25kk53OK43J6j35NK1n2J0N9l8OJ26p7k12P7K21m7j79R5J49j44
4153Fj66J38J09m7l1nl8qN6l5l7J24O8j74j25J76R4j26n5J50J7j55k8Q5N0mJ6
4180E5n8k5N5Oj01M1J60m5j85J4J42k2j11P1Q7m1r9mM9K9M8l4o8L0M7q1n7J24
4208B7J04j19j03P3O7m8n0Q2M9n9p2k3M2P9Jn6j2O8k3j09J9J46K0j08m1O1J5o3
4236c3LO0M2m6n6k8N8M8k4l1K0N2p4p4N8J06j4q5kL0j1l8J0O2L3m6n7j5O7L3n5
$$ plain form
4267 -7 -10 55 39 -41 -67 5 66 27 -8 4 21 11 -41 -13 49 69 14 -45 -23 27 10 -20 9 51 31 -43 -65 0 58 15 -15
4298 -15 -6 23 -18 -65 -19 56 49 -18 -44 -18 10 -10 -19 30 56 26 -50 -49 8 48 5 -19 21 35 -24 -61 -4 48 46 -5 -11 13 5 -17
4332 -17 -2 22 58 33 -44 -23 33 28 -10 -14 48 26 -40 -30 6 42 22 -14 -16 -4 -9 -24 -31 18 50 16 -52 -22 42 19 -20 9 55
4365 55 19 -40 -16 22 25 8 2 -10 10 15 -20 -23 40 64 1 -49 17 48 -2 -13 34 57 -11 -25 -18 7 18 19 -5 -2 27 10 -46 -37
4399 -37 54 49 -33 -41 19 7 -33 -21 26 24 -8 -22 -27 -4 42 13 -19 -13 49 9 -60 -7 75 31 -50 3 52 -8 -21 18 34 19 4
4432 4 -11 -32 1 45 -10 -41 29 67 -28 -71 36 74 -11 -41 29 24 -31 -12 5 5 15 25 -22 -47 42 53 -43 -40 70 43 -68
4463 -68 -40 86 38 -45 2 46 2 0 21 1 15 52 39 -44 -19 86 11 -78 11 104 -8 -73 25 68 -16 -28 29 3 -11
4492 -11 25 11 -55 14 72 -30 -83 54 97 -59 -70 70 81 -69 -35 64 28 -45 11 12 -19 24 61 -51 -53 81 71 -83
$$ packed form
4267glO5j6q0k6P2O1l9l5J2J7j0n2K8O2K0n5n9K2N0j7l0K9M2k0p4k2O5N8m3l0
4298a5RK9m1m7M6P5po7k6K6K8k0rM9K6l0p6JN7M0m3k4M0J4n9l7N7N2kn1oK4qk2
4332a7J5K4L6k5p7K1N6nl8mO2k2o6J0L6L6k0l6kJ2nj5pM9L2l4o8L0O4k3l9K9M6
4365E5l6n9K4L8Lj7oj2K0Nl5lO3K4o3n0O6L1n0j1M7K3o8j4PK5J1Jk4LK9j7n6R
4399c7R1nq2qO0j2m0J2M7kl2j4nK3M6k9l2OO2m0o9N3Q2m4q1N3M9o0j3L9J6j5j5
4432Dj5k1L3M4n5l1P0L8r5m3J07L8q5l0P0nn5J9J7%J0J0m7k5Q9J1r6LJ10k7j11
4463f8K8J26m8q3M7M4m4kK1k0J4L7j3q3K5J05p5q9Q9R3j12o5R8M3q4j2N7k6j4
4492a1L6j4o6O9N8j02n3J37M3j56j1J40J1j50L4R9l6p3N6Jl1M3L7j12kJ34j0j54
$$ plain form
4520 -83 -40 141 53 -102 -9 95 1 -70 33 53 -18 -7 21 -42 -13 97 34 -104 -1 120 -27 -125 53 117 -58
4545 -58 -104 61 50 -63 -8 60 -2 -5 49 -21 -84 60 120 -67 -100 104 88 -127 -56 134 66 -99 -11 74 -22 -35 54
4572 54 13 -45 54 45 -110 -56 149 52 -141 -5 154 -30 -148 43 124 -41 -58 50 -4 -55 39 32 -78 7 119
4597 119 -44 -157 61 160 -76 -126 117 108 -122 -74 118 46 -49 30 45 -57 7 84 -43 -66 119 95 -158 -94 164
4622 164 55 -164 -13 161 -18 -116 39 71 -38 7 55 -46 -44 105 18 -147 20 180 -31 -180 65 156 -99
4645 -99 -130 107 87 -86 -34 67 -19 -29 77 -12 -103 61 120 -111 -121 149 133 -149 -80 176 49 -143 -18 116
4669 116 -11 -40 53 -4 -73 61 63 -118 -32 174 14 -186 5 188 -32 -166 69 139 -84 -102 71 13 -44 44
4693 44 38 -96 -2 115 -47 -136 114 165 -129 -152 123 110 -129 -51 141 39 -95 7 40 -25 43 99 -60 -68 116
$$ packed form
4520h3M3J81q8j55R3J04r4p1J03K0p1J1K8o3K9J10o3j38J03J21j47r8J78O4j75
4545e8m6J65j1j13N5O8o2lN4p0o3J44O0j87l3K04j6k15P1J90o8j65Q8Q5r6j3Q9
4572E4m1n8R9rj55N4K05r7j93J36J59j84j18J91Q1j65j7J08n4n1R4pj10Q5J12
4597A19j63j13K18R9k36n0K43rk30M8J92p2r5P9J5j02O4P7j27k3J85k4k53O4K58
4622A64j09k19J51J74j79r8J55L2j09M5M8j01KJ49q7j65J67J60k11j49K45R1k55
4645i9l1K37k0j73N2J01q6j0J06q9r1J64N9k31j0K70j6k82O9K56j27j92J25J34
4669A16j27k9R3n7o9J34Kj81Q6K06j60k00J91J83k20j34K35P0k23j8J73n8n7Q8
4693D4oj34R4J17j62q9K50N1k94k3K75j3k39P8J92j02j34J02L3o5O8N6j59qJ84
$$ plain form
4718 116 58 -147 -32 213 42 -184 -4 146 -37 -122 74 90 -39 -30 18 -59 -16 110 6 -134 20 143 -89
4741 -89 -157 115 165 -97 -122 84 65 -86 -3 76 10 -13 30 -50 -78 84 110 -97 -69 158 56 -161 -43 180 61
4766 61 -125 -3 84 -22 -51 42 6 -9 61 7 -111 -1 151 -8 -147 48 148 -92 -159 63 116 -50 -67 41
4790 41 14 -48 11 5 -19 63 77 -100 -105 101 108 -118 -52 143 60 -135 -59 112 48 -38 13 23 -16 6 9 -51 21 134 11
4819 11 -140 5 138 -8 -125 52 149 -34 -123 12 72 -1 -6 4 -18 17 28 -57 -69 86 119 -79 -99 93 82
4844 82 -100 -54 105 81 -61 -48 24 27 28 23 -11 10 76 -6 -103 -3 152 37 -115 -20 100 -2 -97 10 91 22 -44
4871 -44 -31 -10 35 35 -17 -34 57 58 -84 -103 71 109 -48 -78 39 68 -59 -75 42 79 22 -37 -51 1 54 3 -41 21
4899 21 97 19 -103 -39 99 55 -51 -12 67 28 -64 -50 40 83 26 -51 -34 36 33 -39 -44 70 94 -45 -97 11 72 10
$$ packed form
4718A16n8k05J15K45j71k26J80J50j83q5J96J6j29RM8p7M3J26j04j40J54J23k32
4741h9o8K72N0k62k5K06j9j51Q3P9o6k3M3q0k8J62K6k07K8K27j02k17J18K23j19
4766F1j86J22Q7j06k9R3l6j5P0n4j18J10J52j59j39J95J00k40o7K22N3j66j7J08
4790D1k7o2N9ok4Q2J4j77nK06Pk26O6J95q3j95P6J71o4q6N1J0l9K2Lo0P2J13j23
4819A1j51J45J33j46j17J77R7j83q9J35O0p3nJ0k2L5J1q5j2J55L3j98k0J92j1
4844H2j82M6J59k4j42J3P2LJnl4K1O6q2r7J00J55j15j52R5J20j02r5J07Q1o9o6
4871d4J3K1M5%n2j7R1Jj42j9J74L8j57l0J17K9j27j6J17L7n7n9j4N2N3n1m4O2
4899B1P6p8j22O4J38m4j06L9P9l9r2J4R0M3n7p7J7P0lp2nJ14K4j39n2J08O1o2
$$ plain form
4927 10 -52 6 54 5 -78 -32 44 82 -4 -63 16 61 -11 -58 8 92 47 -67 -54 35 57 -6 -36 31 86 -8 -85 -8 102
4956 102 60 -45 -28 46 30 -42 -45 31 96 30 -66 -57 45 46 -40 -39 64 72 -65 -108 19 77 1 -34 12 44 4 -43 -38 32
4986 32 76 11 -77 -12 71 12 -77 4 115 36 -89 -48 60 45 -18 -1 34 28 2 -36 -39 57 103 -19 -84 24 75 -36
5014 -36 -84 68 104 -30 -81 -3 42 -19 -10 -1 4 17 0 -81 -48 86 64 -75 -48 92 31 -104 -27 114 64 -60 -28 13
5042 13 -10 -1 14 -11 31 54 -21 -109 20 128 -1 -96 55 104 -52 -94 50 97 -11 -23 7 -14 -4 28 -24 -32 71
5069 71 56 -111 -102 91 84 -87 -43 107 37 -109 -34 76 27 -6 18 -13 -30 43 23 -63 10 139 8 -140 11 127
5095 127 -8 -93 57 102 -46 -75 23 29 2 45 25 -53 10 74 -63 -96 98 118 -85 -97 95 52 -96 -37 102 39
5121 39 -66 -24 1 -29 36 63 -57 -46 79 9 -131 -9 156 29 -139 -1 105 -30 -76 60 77 -8 -7 12 -53
$$ packed form
4927A0o2N8M8m9q3M6P6L8q6n9P9M5p2m7O6Q4m5j14J3Q9K2o3l0O7N5r4p7P7J10
4956A02m2j05J7P4j6p2lP6O5o6r6RJ02Jq6JJ03Qj37m3J27N8p6l5M6L2m0m7NP0
4986C2M4o5q8O5Q3n9q9Q1J11p9j25M1J08j5o3J7L5ok6l8lR6M6j22o5J08N1j11
5014c6m8J52L6j34n1P8M5o1RRNJ3j7q1L3J34k2j39K7J40o1j35P7J41n0j24L2M1
5042A3k3RJ5k5M2K3p5q8J29J08j29r5J51M9j56m2J44M7j08j2L0k1J0L2n2qJ03
5069G1j5j67RJ93pj71M4J50p0j46P5J10m9l3K4l1j7P3k0q6P3J29j31j48J51J16
5095A27j35q5J50M5j48k9R8Ok7M3k0p8O3O4j37l3J94K0k03j2J92m3j48N9J39o3
5121C9j05M2K5l0O5K7j20J1J25p0j40J22J65j27j68J38J06j35m6J36J7q5JJ9o5
$$ plain form
5146 -53 -2 103 17 -81 53 102 -79 -130 95 124 -69 -76 86 42 -90 -17 60 9 10 37 -46 -77 64 75 -84 -36 122
5173 122 30 -153 -31 147 23 -98 41 69 -42 -47 42 14 -2 63 17 -99 -13 123 -5 -96 66 141 -74 -123
5197 -123 59 91 -54 -35 71 -7 -44 21 12 -44 41 79 -78 -91 75 75 -110 -42 134 39 -137 -30 85 -2 -51 51
5223 51 30 -43 15 20 -58 -11 105 14 -116 -7 123 -37 -102 72 120 -55 -70 62 44 -41 24 52 -31 -6 63 -36 -79
5250 -79 71 102 -73 -76 93 46 -106 -36 109 26 -67 3 42 -32 -18 35 -22 -33 64 16 -100 -19 109 1 -112 20
5276 20 105 -36 -90 48 63 -40 -32 34 -9 -31 39 6 -55 30 91 -41 -89 43 71 -69 -42 94 44 -76 -31 48 -18
5303 -18 -22 40 0 -42 15 31 -76 -27 87 28 -99 -24 82 -17 -90 26 89 -23 -52 19 23 -23 26 43 -32 0 50 -22
5331 -22 -76 57 96 -31 -62 67 45 -57 -24 71 31 -41 6 4 -34 11 48 -22 -34 37 11 -77 -22 102 33 -73 -10 47
$$ packed form
5146e3N1J05q6r8J34M9j81n1K25K9j93pJ62m4j32P3P7n1JK7q3l1J41J1j59M8J58
5173A22r2j83J22J78j24j21J39K8j11nQ9k8j6O5m6j16Q6J36j28r1J62P5k15m9
5197a23J82L2j45J9J06p8l7O5rn6Q5L8j57j3J66%j85O8J76r5j76J07J15q7m9J02
5223E1k1p3N8Np8M7J16r1j30J09J30j60o5J74M8j75j5J32j8q5O5K8q3K5O9r9m3
5250g9J50L1j75lJ69m7j52P0J45q3r3P0L9p4J4N3n7j1R7m8j16Q1J28j08j13J32
5276B0Q5j41n4J38J5j03QO6m3k2P0l3o1Q5O1j32m8J32K8j40K7J36n0j20M5P9o6
5303a8mO2m0m2N7J6j07M9J14n9j27P5J06r9p3J16O3j12k9P1Mm6M9J7p5L2N0p2
5331b2n4J33L9j27l1J29k2j02L3R5m0p2M7kl8M5L7p0j2P1k6q8N5J24o9j06O3N7
$$ plain form
5359 47 -22 -54 20 34 -22 -11 2 -33 -17 34 10 -38 14 55 -33 -72 47 64 -24 -28 46 28 -34 -7 49 12 10 24 -9 -29 24
5390 24 38 -28 -16 61 16 -68 -27 62 9 -50 7 29 -17 -22 -1 3 -1 30 17 -49 -11 51 1 -48 16 50 -27 -48 23 40 -31 -17
5422 -17 21 10 -17 -4 0 -5 25 35 -14 -23 31 28 -41 -15 47 25 -35 -13 32 6 -12 12 14 -7 10 6 -20 0 34 17 -31 0 29
5455 29 -18 -41 7 43 -9 -6 8 9 -8 -11 -2 -4 4 15 -15 -16 16 20 -5 -15 28 19 -20 -7 25 13 6 7 17 1 -9 3 0 1 28 8 -15
5492 -15 -13 12 5 -14 -2 14 -2 -19 -2 5 -4 -12 -2 -7 -8 0 -16 -4 -2 23 -4 -7 0 8 -3 -5 14 12 2 -5 9 0 9 14 7 4 10 -1 11 7 12 22
5534 22 19 11 8 -10 -2 -2 13 14 11 8 -3 1 9 10 5 8 -5 3 2 -10 -16 -2 10 -6 -7 -15 1 0 11 10 13 0 -6 1 0 10 4 6 13 4 -4 11 -4 15 22
5579 22 13 -3 3 3 2 -5 9 18 3 -9 -17 -3 14 6 3 11 15 5 0 -16 13 13 -1 -10 1 -8 -7 -17 20 25 14 -10 -9 3 23 7 13 21 10 -2
5619 -2 -14 7 31 24 6 15 21 7 -15 -7 40 29 0 -11 -4 9 -11 -3 10 21 12 -18 -27 6 25 -3 -7 19 33 -9 -45 2 21 10 -3
$$ packed form
5359D7o9l2P4J4n6J1J3l5J6N1k4m8N2M1q8l9J19J7q8mP4j8o2K7N6l7kJ4l3k0N3
5390B4J4o6J2P7m5q4M1Q9n3n9N7K2m6nK1MmL1j3o6L8O2n0m9O4L4p7k1P1J7p1J4
5422a7L8j1k7J3MnL0J0m9rN4lo9K6O2k2o0K2M5k6j8K4Kk1J7mk6K0L4j7m8L1K9
5455B9m7k3M8L6n2LJ4Jj7lRkQJ1l0jL2Mk5j0M3rl9J3L2j2pJJ0j6j0J2lJK7k0k3
5492a5KK5pj9J2J6j6j7J7PrqJ0njQj6J2KK5k7lPQj1kJ9kj0pJ4rRNplOj1J2mNJ0
5534B2lqlj8Q%J5Jllj1MQJnLj3Qjj2oJ4J2j6jqJ6jJ1jLj3oPjJ0oKPrqJ5j5J9P
5579B2rj6O%jpJ4Rj5j2qJ4J7qlQMj0nj6K9%j4rJ1rJj0L7Nj1k4JJ2K0j6OQj1j2
5619bj2K1K4pj8ROj4k2QM7j1k9j1PJ3k0QJ3J1rl0rL3J9k8mK6J4m2l6M7J9j1j3
$$ plain form
5654 -3 1 0 2 -2 -1 19 39 18 -33 -29 24 16 -7 1 41 21 -23 -33 13 24 12 6 2 12 -5 -9 -24 17 48 -2 -37 -6 28 -16 -43 19
5690 19 47 1 -45 -13 8 9 10 0 -12 18 9 -39 -31 46 56 -34 -45 35 31 -39 -22 47 39 -13 -8 -13 -4 17 23 5 12 57 -1 -74 -14 81
5726 81 32 -58 8 51 -11 -63 7 60 20 -7 -7 -29 -18 30 -8 -28 33 67 -45 -91 31 73 -16 -33 65 41 -59 -30 36
5755 36 25 11 30 -10 -39 21 41 -39 -17 107 52 -93 -52 88 25 -54 17 77 2 -52 -8 0 16 54 27 -57 -17 57 -24
5784 -24 -87 47 126 -28 -121 17 61 -48 -33 73 51 -31 -23 -16 -44 28 84 -13 -63 56 51 -101 -57 134 100 -88 -41
5811 -41 67 8 -59 26 80 13 3 15 -64 -26 97 59 -84 -18 117 -28 -162 19 143 -4 -88 29 43 -70 -27
5836 -27 48 15 10 45 -38 -120 19 116 -42 -94 98 96 -129 -119 110 98 -48 -19 59 -24 -43 33 9 -23 84 69 -109
5863 -109 -79 114 64 -109 -2 167 1 -174 -7 114 -16 -42 42 8 -56 2 29 -60 27 135 -11 -162 22
$$ packed form
5654cMjKmJK0K0k1n1MN3qk3QM0k0m4j0M6J1j2omJ0j7mj5M1L1n0l5L1L4m4k7O2
5690A9K8m6m6L2K1JJj0j2L0rm8QP7J0r0j1Q0mp0J7O9qn2NnRK1Oj8PM5n8p3O0R5
5726H1m9r0O6M3o2n2P0N3m0k7%k2J1M8l8k0O1L4j12m6J22M2q9j7R8k4j00K9O6
5755C6j1j4J9m0k9O0K0q0K2J24n5j45M1J40o3p9P1O0p5n4M4QJ6L8k7q4M0P4q1
5784b4o3J34P9j54r3J38M4j09J5J06k2q2QPk8P2N6r7n0J19nj52M4J91l4j88M7
5811d1J08n9o7Q5N4o7j0J2p9L8J23l8j43O6J35j45j34J81J24j47q4J17J4j13M3
5836b7P5l3nL5q3q2J39R7j58n2J92kk25J0K29j2j46K9P8q3j9P6k4l2J07j5j78
5863a09L0J93n0j73J07J69j66j75J67J21j30k6Q4l4o4N8K7q9Q7J08j46j51J84
$$ plain form
5886 22 130 -62 -121 102 118 -100 -114 58 42 -49 39 54 -44 5 63 -74 -84 125 120 -125 -100 127 57 -149 -27
5911 -27 162 41 -106 -6 57 -42 13 65 -22 -31 81 10 -150 -12 174 -13 -160 32 155 -69 -151 75 113 -52
5935 -52 -29 39 -35 -32 58 5 -69 75 128 -111 -144 112 134 -114 -68 150 45 -146 -41 94 25 -16 53 -10 -79 35
5961 35 56 -85 -18 170 37 -194 -42 160 1 -119 65 144 -63 -120 21 38 -15 63 38 -100 -18 76 -47 -126
5985 -126 118 166 -109 -172 71 102 -107 -41 140 39 -82 -32 16 -28 46 98 -43 -83 71 52 -147 -27 211 70
6009 70 -158 -39 117 -14 -101 67 108 -12 -32 -9 -52 -15 120 25 -112 14 114 -75 -166 100 173 -66 -126 44
6033 44 36 -93 -24 83 27 -8 21 -53 -83 68 119 -75 -63 127 52 -161 -70 165 72 -101 -15 73 -27 -52 28 36 22
6060 22 69 2 -130 -26 135 12 -112 33 140 -69 -164 46 124 -11 -43 46 9 -45 -21 3 -12 54 83 -81 -121
$$ packed form
5886B2J08j92n9K23J6k18j4J72j6r1Q8J5r8M9N8j37j0K09nk45K5K27p0k06J22
5911b7J89j21j47J00O3r9N5N2q7rJ12p1j60J38J86j87j47J92J23k24q2K26L8j65
5935e2K3O8p4LR0n3p4J44N3k39l3K56K2k48M6K18j05j91J05J35o9m1O9o3o9J14
5961C5K1j41O7J88j33k31J52K02j59j20J84P9k07n7J41J7n3P8k5j38Q2R4j23p9
5985a26K44M8k75o3K43L1k09O6J81j01j21N0M8m4P4N2j41m0J54j9j99J20K38j41
6009G0k28J19J56j31q7J68M1j20k0K3m3L7J35r5j37J26J00j89r1K66P3k39o0J70
6033D4qj29O9J07n6l5K9p4l0J51N1j94J2J90p5k13R1K35r3j73Q6Q8j00k5Q0Qj4
6060B2M7o7j32J04J61j23j24J45J07k09r5K10P8j35l2Q9l7n4K4K4j5O6K9j64m0
$$ plain form
6085 -121 68 99 -87 -60 135 76 -127 -76 92 43 -29 12 21 -12 -9 -2 -41 28 135 41 -121 -31 123 -12 -116 43
6111 43 142 -12 -115 -13 43 -7 4 20 -14 8 22 -65 -77 75 114 -63 -97 59 61 -97 -72 100 77 -48 -62 14
6137 14 12 14 19 -4 4 62 -17 -117 -20 126 51 -89 -16 91 -20 -104 -3 106 45 -35 -26 -27 7 30 -6 -21 59 70 -94
6166 -94 -122 50 102 -33 -64 44 48 -69 -87 32 74 39 -22 -40 -10 29 1 -46 18 102 21 -112 -48 82 43 -59 -16
6193 -16 76 17 -65 -54 33 73 43 -24 -33 24 30 -37 -47 79 96 -27 -97 -4 60 -4 -45 29 59 5 -69 -54 34 79 21 -40
6223 -40 -24 50 -23 -82 -8 89 57 -65 -62 30 49 -21 -15 46 76 -18 -86 -43 64 71 -12 -16 41 52 -45 -69 37 99 33 -51 -34
6254 -34 30 28 -44 -28 74 73 -42 -111 -4 67 18 -33 14 56 0 -79 -57 43 82 11 -62 -8 46 -7 -86 3 107 56 -81
6283 -81 -56 35 34 -25 -11 54 45 -14 -65 -48 62 90 -8 -58 36 60 -57 -71 65 128 -2 -77 -27 30 -8 -17 7 43 44 -11
$$ packed form
6085a21J89L1j86K7J95n9k03N1J68m9p2M1Rl3LPl9O9J07r4j62R0J54j35j04J59
6111D3R9j54j03J02N6n0J1J6l4K2J4q7j2J52L9j77l4J56Kj58K5J72k3j25j4P6
6137A4kKNk3QN8p9j00R7J46p5j40P3J07j11q4J01J09o1q0RjL4K3l6j5Q0J1j64
6166i4k8J72N2j35l1J08Mj17j8J19M2l5o1j8L0L9k8m7O4Q4q1j33O4J30l9j02M3
6193a6R2n9q2J1Q7M0l0o7rN7Oo7j0J26J7j23p0R3O4o4m1P4L0n4p4J5Q8M5n8o1
6223d0J6P4p3n9P4R7l2j22LR2J9p0OO1L0r4o8M3J07Pq3mN7J1r7k4J06O2o6q4J7
6254c4O4kp2J6J02jj15o9J07P1m9n1M7M2n6p9K2J00L9p1p3N4N4n3p9Q9J04n1j37
6283h1K5R1jn9J4O5rn9n1J7J10K8r8n0R4K4j17j4J36O3j30p5N0N7l8rK4L6Jn5
$$ plain form
6313 -11 -95 -30 87 61 -59 -31 80 18 -115 -57 90 82 -38 -33 8 1 -3 -9 3 57 77 -26 -102 -2 117 -1 -74 49
6341 49 110 -53 -108 18 104 30 -12 9 5 -1 4 -31 -21 97 75 -98 -111 65 77 -86 -41 116 52 -107 -91 42 32
6368 32 -5 -1 -12 -33 20 -22 -79 13 149 12 -141 -26 109 -16 -106 41 125 -12 -90 -24 12 11 46 17 -35 21 52
6395 52 -69 -94 94 139 -61 -111 75 62 -99 -56 107 65 -44 -34 -17 -29 38 48 -34 -35 82 11 -155 -48 170
6420 170 65 -126 -16 102 -15 -105 35 97 13 -11 -15 -61 -18 79 13 -71 53 122 -91 -166 75 156 -47 -83 86
6445 86 60 -104 -56 55 35 17 37 -58 -92 39 73 -82 -47 136 56 -183 -88 137 44 -94 4 76 -41 -78 16 8
6471 8 1 80 44 -113 -26 120 0 -124 65 181 -59 -165 28 107 -49 -44 74 33 -57 -3 -7 -58 57 111 -65 -111
6497 -111 65 87 -129 -89 166 91 -147 -75 98 0 -78 29 63 -24 -1 11 -92 -37 125 48 -135 -21 149 -30
$$ packed form
6313a1q4O5J17k6j20K8J11o2j33N8J47qj20NM1pmoJ2N4K0j03p6J00J19j18p3J23
6341D9O1j63n5J26Q6p4m2K1moNl5J0J18k2j73j3J76J2j63M5J57o4j59J6J33j0
6368C2l7Mj1k1N3m2n7R2J36j37j53J15J35j25r0J47Q4j37p8O6L6jL5k9n2N6L1
6395E2j21k5J88M5k00n0J86j3j61M3J63m2j09J0J7j2O7J0q2jJ17p1j66J07K18
6420A70j05j91J10J18j17r0J40O2q4k4mm6M3R7o6q4J24O9k13p5K41Q1k03l6J69
6445H6k6j64M8J11k0j8K0r5l4J31L4j55L5J83q0k39R5K25r3j38R8P2j17l7R4q
6471HpP9l6j57Q7J46j20j24J89J16k40j06J93P9j56NJ18m1r0N4mn1J15N4j76m6
6497a11J76K2k16M0K55p5k38P2J73r8p8J07L4q7K3J2j03N5J62p7j83J14J70j79
$$ plain form
6521 -30 -174 36 171 -33 -111 43 54 -59 -3 62 0 4 63 -30 -126 53 144 -61 -113 108 101 -146 -113 126 73 -86
6547 -86 -11 40 -29 -54 30 -11 -40 93 54 -139 -85 141 50 -149 7 166 -20 -177 -9 101 -17 -26 59 -8 -62
6572 -62 25 10 -73 48 147 -39 -161 44 122 -83 -87 131 119 -118 -92 56 16 -28 45 23 -59 -7 35 -90 -67 138
6598 138 83 -141 -96 101 15 -137 10 155 -2 -106 -13 6 -29 35 63 -43 -29 66 -30 -133 41 184 -19 -143
6622 -143 28 92 -79 -73 94 95 -41 -31 0 -43 12 95 9 -64 62 61 -139 -98 136 110 -106 -71 91 -4 -128 4
6648 4 93 -2 -28 -2 -59 -58 61 47 -77 -8 115 -22 -160 9 155 -7 -94 48 67 -67 -57 52 28 3 38 -30
6674 -30 -77 8 90 -46 -71 99 95 -107 -87 99 72 -65 -24 83 3 -60 -15 12 1 48 24 -81 -42 78 19 -99
6700 -99 1 137 -4 -134 -16 86 -14 -53 44 27 -24 -7 -11 -16 28 87 -20 -74 24 80 -77 -84 89 99 -64 -75
$$ packed form
6521c0j44K10J35k04p8J54J1j13N6O5o2MN9r3r6J79R1k05n2K21pk47L3K39n3j59
6547h6P5N1o9k5Q4m1k9J33l9j93N4K26r1j99J56J59j86j57J68J10j18rQ5o7n4
6572f2Q7j5q3J21R9j86j22K05P8k05mK18j2k37K6J48m0m4P3k2q2N2M2j25K3K05
6598A38n5k24M5J97q6j52J47J45j57j04R3J9l5O4K8j06J4R5r6j03J74J43k03j24
6622a43J71O4j71OJ67Jj36J0L1m3N5Q3q6p3J26jk00M1K34k6k16L5J62r5j24J32
6648DQ9r5k6K6n7JJ19j4j24O9J23j37j38J69J46j62q7J42J9j34J0J09k4k5L5o8
6674c0m7Q5Q2j36k5J70mk02K0J86k7j37M1J07q0o3M5K7j1M7k4j05L9J20n9j18
6700i9J00J36j41j30J18J02j00l9R7j7n1J7mnM4N9j07n4R8N6j57pJ73J0j63j1
$$ plain form
6726 -75 46 29 -42 -7 33 3 5 -6 -50 -40 73 48 -70 -31 78 -2 -112 -6 112 21 -77 -22 24 -27 -32 8 3 16
6754 16 29 -42 -92 9 82 -3 -67 49 84 -64 -77 52 80 -5 -25 19 1 -7 -3 6 24 67 32 -69 -51 59 47 -49 -17
6783 -17 67 13 -79 -39 53 27 -23 -7 -6 3 9 -19 -33 35 73 -19 -79 13 65 -20 -69 34 69 -31 -68 -15 34 32 18 4 1 23
6815 23 -2 -38 -13 70 43 -58 -50 46 28 -42 -11 56 48 -31 -49 -15 16 27 -15 -26 17 17 -37 -61 14 76 -9 -54 -6 39 -15
6846 -15 -42 -3 66 22 -31 -39 2 27 15 -22 -11 42 17 -52 -40 44 49 -11 -29 14 29 -18 -32 19 57 19 -41 -31 8 19 -16
6877 -16 -19 23 38 -23 -54 -11 44 24 -27 -16 27 6 -40 -23 21 40 -5 -41 -23 25 0 -30 -5 34 25 -32 -43 21 40 10 -19
6908 -19 3 36 6 -46 -25 44 52 -9 -21 6 14 -14 -20 21 49 18 -24 -25 11 34 -1 -12 9 32 -12 -63 -1 43 22 -27 2 11 -8
6941 -8 -32 -17 11 36 3 -40 -28 18 19 -26 -8 38 30 -39 -46 37 49 5 -26 15 14 -3 -15 2 29 48 5 -45 2 27 16 -28 5
$$ packed form
6726g5J21j7p1L5M0l0Kj1m4J0J13k5j18L9J09q0j10J06J18r1r8N5M6n1nM0nJ3
6754A6J3p1n0J01P3q5o4J16L5j48j3J29K8q5k0M4j8qMRJ8M3l5j01J8J10j2r6L2
6783a7Q4n4r2M0R2k6n0J6JROk8j4O8L8r2o0R2N2q5m9J03L5j00l7N3M9kj4j4lK2
6815B3k5l6K5Q3k7j01QR6j8p0L1O7qp9j8L4L1J1m2j1M3%n4k4P5O2q5m5M8M5n4
6846a5k7L9O9m4n3qM1K5j2l7J1N3k5o9J2Q4No0j8M3J5m7j4N1L8l8o0J0L9J1l5
6877a6lM2J5o1l1M3N5k0n1J1M3k1m6J7M4J9m5l6J8M8k5l0K5L9rn7j1O4J9l0k9
6908a9K2L3l0n2K1O9Qo1j2K7Qk8oM1K8l1m2jL6K3l5j1K1K3m4n1O2M4k1m9K9Rj9
6941hk4J5K8K5l3m3J2M6Jm5J8M6qo9pQ3J2m4l1M1jj7j2J7K7J9m3n0M7K5j1m4L3
$$ plain form
6974 5 65 3 -55 -9 24 18 -10 -2 1 15 4 -21 -5 31 32 -24 -32 20 20 -39 -21 37 40 -37 -30 9 12 14 8 8 21 21 -6 -26 5 60 23
7011 23 -33 -2 47 -7 -48 12 54 16 -31 -2 -5 12 1 -1 -12 11 12 -42 -47 20 49 -22 -44 29 19 -44 -29 37 45 3 -18 -12 0
7044 0 -2 4 -5 5 48 2 -52 2 53 24 -32 6 49 -5 -28 10 36 26 11 -2 -4 8 23 7 -9 37 48 -33 -59 21 43 -34 -20
7077 -20 24 15 -37 -39 6 19 12 10 -14 -18 7 11 -27 1 59 23 -50 -18 37 13 -25 15 52 1 -18 2 7 2 30 4 -24 3 19 -19
7111 -19 -39 45 64 -22 -35 17 21 -12 -9 29 13 -10 -14 -16 -27 22 9 -42 -23 22 1 -63 -4 44 17 -48 -9 35 -10 -25 16 9 6
7144 6 7 -10 -26 12 49 2 -25 21 41 -22 -49 35 43 -10 -19 22 5 -20 3 15 16 20 19 -19 -26 36 33 -35 -1 48 12 -59 -19 45 7
7179 7 -21 8 15 -12 -12 -8 -9 9 36 -5 -50 4 38 -19 -29 43 53 -19 -36 29 28 -1 4 25 -4 -1 5 -16 -7 48 39 -38 -32 36 6 -49
7215 -49 -3 50 0 -56 -16 -2 -7 -2 12 8 -12 2 -20 -47 22 57 -3 -50 3 31 -24 -22 42 32 -16 -20 8 3 1 48 14 -5 23 24
$$ packed form
6974EO0o2n8M6L3ok8QLJ4j1k5J6L6Jn6qN2%n9J8N8Lp7PL9LKo%J3%k7k0L1N5l7
7011B3n6L1M9n4m1O0M2l8m7K9lJ7j1kj1K3Jn4nO7K9p1k2P3j0o3J5O6Qm2k1OJ2
7044@kOrJ0M3m6n4N4N1k9n6L8M3n4k3L8K6j0j5j3kJ2J5j6j6M6J1q1k6Q0K2p7J4
7077b0M4rn2kM5J3pkk4mK5Ml8K8N8l6p3L2N5k4l8M0L7n1j9K0NnK8k6k8K7J6l8
7111a9k0Q4J9q6j3N2Ml3LL8j6k3mkj1M9j3n1J9M5k1o4N9M8k7o5L9M4m5j5M1pl
7144FJj7j6L8L7m7k7M6K0o3k7Q4Qn3rM1j7k5K3J2JMjl8pO2lo8L4M9l6p1M0O4l8
7179Gk8K9Pk7%MjJ8K7m1m5N4L4n7j0P2J0p2j7O5jk9NK1k9LOk1RN5rp7OO8l0n5
7215d9M6N3n0n6M0J4nNJ4mk0J4k2k7O9L5o0m7N3K8n5KO4j0m8mK8nkM7l4j9K8J
$$ plain form
7249 24 -37 -10 69 55 -28 -14 41 6 -37 5 52 9 -9 -10 -2 -17 17 29 -21 2 30 -19 -64 15 49 0 -39 28 31 -34 -24 35
7281 35 27 1 5 -11 -22 -2 39 -8 -16 58 30 -58 -28 54 30 -28 2 40 -3 -34 3 27 29 21 16 -24 -13 30 8 -40 8 48 -16
7314 -16 -72 2 38 -4 -37 18 25 -22 -18 -5 5 5 25 -10 -34 15 24 -42 -12 53 38 -53 -26 28 26 -24 7 47 8 -3 -1 -8 -6 49
7348 49 23 -42 -12 49 -8 -49 20 68 -4 -36 12 27 -16 -17 11 17 6 -1 -13 -29 10 50 -9 -33 27 22 -44 -33 46 33 -23 -23 19
7381 19 3 -7 13 8 20 32 6 -31 -5 49 17 -29 10 51 -7 -51 2 50 11 -13 15 8 -10 0 6 -3 24 31 -21 -46 23 36 -15
7414 -15 -22 41 26 -44 -43 22 28 -8 -4 7 -13 -16 -3 -24 10 44 11 -48 -20 47 0 -36 20 54 5 -35 -17 21 13 8 -3 1 4 10 -7
7449 -7 -16 30 47 -20 -36 13 30 -33 -38 38 24 -18 -31 -2 1 13 7 2 2 16 -8 -36 -7 44 20 -38 -13 35 -8 -48 2 43 28 -12
7483 -12 -15 10 8 3 0 -1 29 24 -32 -38 16 45 -1 -29 21 31 -25 -37 -3 34 11 -19 -24 -8 13 -10 -7 12 36 14 -48 -26 32 27 -21
$$ packed form
7249B4o1K7P9j4q3J4N5l5m3M2M7m3j8jQj5L4J2n0K3K8m9m5P9L4m9l9O7Lo5J0N9
7281C5qk6Mj6j1K0M1m7qP4k8q8L0Q2k4n8L0L8m3l1L7K4Kqnm0J1M3k2m8M8M0o4
7314a6n6P4L6m2l3N5Pm7MJ3J0%K0l5k4M9Ro6L0O5j5r1K7N4kn0L1M0l9j1KpKN5
7348D9k6o5L0O1n7m1O9M8p2l2M8J5m3jK8Oj1pj2j6L9M0n9k4O0no6J1P9j3n6%M2
7381A9j6j0K0nJ2J2k6l7K6N4l2m6L9M1n8m4N3M8l9k4K8pj8J0OrK7Pn2k5O9J3n1
7414a5pO3j5p0JO5Ol6MJ1k0lJ3k1L4L4l3n9K8O7m7l6N6L4m9m0J8L8qnj1MLOj7
7449grM6J7o7j6M9J7o3nP6j4m2j3K9LJ2on%J4k4k8K9N1k4n8K5M8m3m0N0M1j5m0
7483a2lK5knljL0nn6oN4K9m6k8N0J0n6j2L4L7k3l0nJ6K1k3LJ9K4k2o2K2N8nm8
$$ plain form
7518 -21 0 27 8 -27 -30 22 36 13 -16 -13 2 10 -17 -12 37 44 -16 -31 3 33 15 -11 12 34 10 -36 -24 30 49 4 -21 0 17
7551 17 -12 -18 -1 39 23 -28 -48 -3 21 -5 -15 14 24 -11 -45 -11 28 32 -26 -12 17 1 -19 -17 23 43 10 -28 -16 20 27 -12
7583 -12 -8 43 40 -24 -49 4 36 8 -14 10 17 7 -28 -29 31 47 3 -34 -29 28 4 -38 4 52 15 -57 -35 19 9 -17 -8 7 12 -6
7617 -6 -38 -16 30 42 -8 -38 11 17 -23 -34 41 55 -7 -44 -1 21 0 -15 3 14 20 -12 -51 -5 45 26 -40 -20 35 4 -64 -19
7649 -19 54 33 -38 -36 1 -3 -3 -7 -10 12 22 -24 -70 5 60 -1 -47 21 42 -33 -67 17 55 16 -8 3 -11 -3 18 -8 6 45 35
7682 35 -54 -56 37 50 -40 -24 59 15 -66 -36 38 26 -2 1 -18 -25 8 -3 -42 20 69 5 -87 -15 64 -14 -52 26 69 -15 -54 -13
7714 -13 19 16 19 6 -19 5 30 -49 -46 61 70 -35 -62 41 39 -47 -23 57 34 -34 -37 -4 -13 32 33 -22 -13 33 -2 -69 -5 94 15
7747 15 -82 -19 52 -26 -61 29 53 4 -16 -13 -29 -2 49 1 -38 31 49 -63 -83 37 80 -22 -49 43 30 -57 -24 48 23
$$ packed form
7518b1K1K7j9l5lN2J4k3k9LJ5Qk7NM9Po0j5L4L0j8k6K3K2k4m6J2N4J9m5k5K1J7
7551A7k9oJ7M0j6n1k0M5K4k6j0K9J0l5l4L4L9Mn8J4K9j6k0KM0K0l3l8J2L6Pl9
7583a2MN1lo4k5N3L2k8k2K4Pj0l5jO0J6m4l7NN7k4m2M2M8l7p2K2N4j0k6RJ5Nj8
7617fl2K2M6J2n0l0M9Om0j1P5J4o2l7M3K2k1j5J8J1Ol2l9M6N0j9o6K0N5l1o8M5
7649a9P3k1p1KL7m%mlK2J0m6m6P5N5o1m6O8K1p5l4Q4L8l9k4J1j4QK1k6J4L9j0
7682C5q9kR3J3r0J6Q3m4q1L0P4j2k8Lj9pL3j1l9O2M9o4r2P2P9p8l8P8M3q4l9M1
7714a3L2lLj3k5K4K5p9LJ07Rj05k7J03kq6K4Q0k3o8lL3rM5Jn5RM6l5o7O4R9p9
7747A5r7O3P1p8l5R0K4m9k0Lj6K7N1m8l9O9J8j12k0J20M3j02k7R2j3q7L3P2k5
$$ plain form
7776 23 9 14 -22 -48 29 46 -44 -14 82 33 -98 -22 77 27 -58 9 57 -23 -53 -3 1 3 33 -11 -68 -25 53 -8 -64 43 84
7807 84 -48 -92 22 64 -26 -22 37 21 -33 -14 -4 -11 47 70 -38 -57 39 38 -73 -28 98 40 -80 -50 50 1 -31 29
7835 29 44 -16 -10 -1 -44 0 87 29 -77 -9 62 -33 -87 40 103 -31 -80 7 8 -26 0 42 -1 -4 19 -31 -55 63 96 -36
7865 -36 -53 54 51 -77 -37 99 55 -45 -24 16 -10 -9 39 20 -3 39 6 -90 -25 111 36 -76 5 78 -37 -95 22
7892 22 70 -4 -26 9 -13 -34 21 11 -23 33 50 -63 -75 43 82 -41 -40 75 42 -79 -37 56 30 -7 20 7 -25 14
7920 14 25 -21 4 88 23 -99 -40 83 19 -61 17 76 -16 -69 9 33 -3 23 21 -32 -19 36 -19 -60 42 87 -45 -72 33
7949 33 56 -48 -34 72 34 -32 -27 1 -12 7 40 -9 -25 46 19 -67 -23 98 48 -69 -18 61 2 -56 20 67 -2 -16 -12
7978 -12 -18 -16 49 17 -38 18 52 -39 -91 33 79 -24 -56 38 24 -45 -32 29 18 12 17 -29 -37 12 39 -36 -21 65 31 -85 -39
$$ packed form
7776B3j4Nl6k6P7J7r0L0R6m9j31P6R9n0q5O7M8q0l0N0MKL0m4n7M3P8o1n6J07M1
7807H4j32m4J14M2r0MN9j6n4J9J0pN8K3j08j9R6jj11M5J26n8j20L0J00m9l2O0
7835B9J5o0ORm3M4Q7n8j06O8P1r5n4J27O3j34m9Q7Jl4K6M2m3lK3n0k4J18L3j32
7865c6j7J07lj28M0J36m4j00K1M0k6JM8j9k3M2l3r6O5J36p5j12Q1P3j15n8J17
7892B2M8p4k2L5k2k1N5j0l4N6J7j13j2J18L9j23JJ15l3j21M2R3k6l7K7j3l2L9
7920A4J1m6K5Q4o5j22N9J23o4q0P8N9r2n3P8K4l6K6kn3J3N5n5m1J02M5j32k7J05
7949C3K3j04J4J06l8o6NK8j3J9L3m9j6P1k7q6M4J21n0j17N1P9n9n8P6M7o9j4M
7978a2oKO5l2n5N6L4r1n2J24M6j03l2R4j4o9J3O1j1oNm6qM9K7p5J5Q6l4j16M6
$$ plain form
8009 -39 67 46 -31 11 49 -8 -39 0 14 19 32 7 -56 -7 43 6 -41 38 78 -36 -84 8 58 -6 -22 17 13 -31 -22 -22 -12
8040 -12 33 45 -25 -49 29 31 -49 -22 74 30 -71 -47 30 15 -6 14 28 -4 -2 -18 -15 10 66 15 -50 1 53 -12 -56 21 83
8071 83 -9 -56 0 22 -12 -5 7 12 14 -9 -43 -40 32 39 -41 -41 22 18 -57 -37 56 44 -26 -32 4 2 -16 1 7 20 31 -9 -52 -10 64
8106 64 20 -36 6 71 -8 -52 -9 60 21 -17 -6 -4 -2 -8 -15 -9 36 30 -40 -50 24 47 -17 -28 32 30 -41 -57 18 40 16 -10 -8 -4 8
8141 8 -18 -26 17 43 -2 -53 -28 21 9 -25 8 50 12 -44 -27 20 35 25 3 0 12 7 -20 -17 40 45 -17 -43 -3 24 -21 -20 28 42
8175 42 1 -42 -29 8 27 -6 -24 4 12 -28 -39 5 43 28 -30 -26
$$ packed form
8009c9J06k1p7M2L8n7l1L9J4NJ3k5o3M9N0l7m7P9M0j14m8R2N0o4j6L9mm4R%J0
8040a2M5J2p0k4P8Kq0K7R6m4j01K4P7j5k1K0J4l2Kj6LK5N6n1o5N1N2o5m4P7O2
8071H3r2m7N6K2l4PJ2NKk3l4LP2Pq0%O3mp5K0R3j2p0oL6kj8J7OJ3J1m0m3M2P4
8106F4m4n6M2O5p9m4M3O9l9l8J1KKopOM5op0j0P4K3o4j1O0kp1j6P5K2k4k6KMJ2
8141Hk6qM3K6m5n1K5M9j2l4L3M2l8n6J7M7J5j0k2lJ2nk7LN7No2k6M0K7m5JM8J4
8175D2m1m3J3L7J9l3j8K8Qm0j1M4L8j5n8M
8191b6
$$ Imaginary data points
##PAGE= N=2
##DATA TABLE= (X++(I..I)), XYDATA
$$ plain form
0 0 0 0 0 0 0 0 0 0 0 0 0 0 0 0 0 -8 8 -8 8 -8 16 -16 16 -24 24 -32 37 -40 48 -56 64 -72 81 -93 105 -118 132
37 132 -148 166 -185 206 -230 254 -280 312 -344 379 -418 462 -509 559 -615 679 -751 828 -916
56 -916 1017 -1131 1263 -1420 1607 -1833 2117 -2481 2975 -3677 4767 -6686 11048 -41437 48120
71 48120 110145 -54882 -34823 70541 4798 -96517 -2572 57568 -6804 2178 60091 -33404
83 -33404 -94033 28998 76474 -50714 -36585 99975 32150 -125920 -41640 96221 18680
94 18680 -57976 33560 48843 -56860 -44900 37613 1718 -19835 59960 31897 -88939 -37794
106 -37794 80466 5133 -79122 39776 97848 -51488 -98166 38371 57544 -39769 -9537
117 -9537 57050 -10533 -51752 17498 12575 -43350 24971 77150 -36723 -83122 43340 59370
$$ packed form
0@%%%%%%%%%%%%%%%qJ6j6J6j6K4l2L2m0M8n6O9p7Q8j04J20j36J53j74J98k23K50
37A32k80L14l51L91m36M84n34N92o56P23p97Q80r71J068j174J294j430J579j744
56i16J933k148K394k683L027l440L950m598N456o652Q444j1453J7734n2485Q9557
71D8120O2025j65027K0059J05364o5743j01315R3945O0140o4372Q982N7913r3495
83c3404o0629J23031M7476j27188J4129J36560o7825j58070Q4280J37861p7541
94A8680p6656R1536J5283j05703J1960Q2513l5895k1553P9795k8063j20836N1145
106c7794J18260p5333q4255J18898N8072j49336m6678J36537J9173r7313L0232
117i537O6587o7583m1219O9250m923n5925O8321N2179j13873m6399J26462J6030
$$ plain form
129 59370 -67499 -38937 91140 34462 -84912 -22639 56437 -8677 -34247 36562 21210
140 21210 -39391 4204 30015 -43924 -29245 72901 29941 -78646 -13933 76779 -12984 -79636
152 -79636 28128 74073 -28342 -47866 30039 14242 -36286 8256 31004 -23279 -8477 44168
164 44168 -14213 -64820 25295 67792 -34983 -54419 52175 42200 -64387 -35505 56721 20178
176 20178 -37765 6313 24283 -25840 -13084 27614 -10484 -24676 42342 29835 -61069 -31835
188 -31835 61613 16429 -60922 6143 66320 -14934 -61460 11555 35316 -15031 -4844 26063
200 26063 -10737 -24301 18933 3386 -37513 15967 59820 -18967 -62964 19775 46396 -33810
212 -33810 -32991 48417 31684 -41939 -24097 20227 -632 -7218 23512 4941 -25510 7182 17490
$$ packed form
129E9370j26869K8562J30077n6678j19374O2273P9076o5114k5570P0809j5352
140B1210o0601M3595K5811p3939J4679J02146m2960j08587O4713R0712q9763o6652
152g9636J07764M5945j02415j9524P7905j5797n0528M4542K2748n4283J4802N2645
164D4168n8381n0607R0115M2497j02775j9436J06594r975j06587K8882R2226l6543
176B0178n7943M4078J7970n0123J2756M0698l8098j4192O7018j2507r0904K9234
188c1835R3448m5184p7351O7065O0177q1254m6526P3015K3761n0347J0187L0907
200B6063l6800j3564M3234j5547m0899N3480M3853p8787m3997Q2739K6621q0206
212c3810Q19Q1408j6733p3623J7842M4324k0859o586L0730j8571l0451L2692J0308
$$ plain form
225 17490 -34357 -20876 53705 30243 -50597 -23640 41381 2127 -43658 10074 46165 -4244
237 -4244 -28698 256 -858 -10335 17795 17595 -19635 -5051 27096 -14499 -46011 18705 55224
250 55224 -12139 -42473 15762 25069 -29063 -21343 29779 21141 -11500 -5858 -4908 -16827 6575
263 6575 24488 -8310 -16419 24870 13845 -43258 -23110 43026 25296 -30230 -10670 25526
275 25526 -3627 -29002 1276 20966 6544 2271 -1772 -20075 -8636 21296 5463 -20753
287 -20753 9479 32216 -15172 -43070 6820 36154 -2573 -19491 10898 13012 -15628 -15646 3628
300 3628 8750 11949 9635 -13996 -20352 9655 15064 -16302 -9761 30402 17019 -32194 -24237 19561
314 19561 16614 -10884 -3326 13559 2534 -12154 -10912 -3809 10073 20206 1056 -21638 -4805
$$ packed form
225A7490n1847J3481P4581k3462q0840K6957O5021l9254m5785N3732L6091n0409
237d244k4454K8954j114r477K8130k00l7230J4584L2147m1595l1512O4716L6519
250E5224o7363l0334N8235R307n4132P720N1122q638l2641N642R50j1919K3402
263F575J7913l2798q109M1289j1025n7103K0148O6136j7730n5526J9560L6196
275B5526k9153k5375L0278J9690j4422m273m043j8303J1439K9932j5833k6216
287b0753L0232K2737m7388k7898M9890K9334l8727j6918L0389K114k8640j8J9274
300C628N122L199k314k3631o356L0007N409l1366O541M0163j3383m9213P957M3798
314A9561k947k7498P558J6885j1025j4688J242P103J3882J0133j9150k2694J6833
$$ plain form
327 -4805 16427 -4605 -21215 10647 31576 -2428 -29506 -6819 15134 3474 -6565 3283
339 3283 9929 2685 -9580 -16073 -3552 18889 15649 -10902 -13419 9087 6457 -17972 -10700 21286
353 21286 20787 -10256 -19816 -1138 8870 176 -5205 3658 12883 4437 -15790 -17997 5832 20123
367 20123 3327 -12092 44 10650 -5623 -19156 -1147 21685 13522 -11163 -15194 1700
379 1700 7986 -4505 -8192 9244 18128 -1965 -21684 -10173 12256 11585 -3699 -4717 6730
392 6730 5832 -10742 -16757 2643 21570 9807 -14218 -11197 8317 4252 -13673 -4995 18950
405 18950 14541 -11323 -17433 -1267 8525 3955 -2034 91 7343 4443 -13213 -17723 7467 23762
419 23762 1750 -17519 -269 12728 -7638 -17982 6363 21597 4189 -12308 -8819 -863
$$ packed form
327d805K1232k1032j6610L1862K0929l4004k7078K2687K1953j1660j0039R848
339C283O646p244j2265o493J2521K2441l240k6551k517K2506k630k4429P272L1986
353B1286m99l1043r560J8678J0008q694n381Q863R225q446k0227k207K3829J4291
367B0123j6796j5419J2136J0606j6273j3533J8009K2832q163k4685m031J6894
379A700O286j2491l687J7436Q884k0093j9719J1511K2429o71j5284j018J1447
392F730q98j6574o015J9400J8927j1763k4025L021J9514m065j7925Q678K3945
405A8950m409k5864o110J6166R792m570n989K125P252k900j7656m510K5190J6295
419B3762k2012j9269J7250J2997k0366j0344K4345J5234j7408j6497L489P956
$$ plain form
431 -863 3495 3665 -2027 -67 12110 4674 -21374 -16386 18394 19843 -11561 -11602 13885 5895 -20104
446 -20104 -10480 15321 13544 -1187 -5293 -7015 -4618 5740 3025 -8358 4622 20826 -3835
459 -3835 -30050 -3699 25795 3739 -17333 5546 17276 -9517 -19811 1817 11486 5231 4389
472 4389 -2408 -12517 -751 10367 -7251 -11498 19203 20854 -20704 -25630 14145 17422 -13299
485 -13299 -6763 19035 5903 -17191 -8359 3449 1743 8856 9881 -10812 -12034 11813 4007
498 4007 -22026 -166 33059 4945 -31505 -6251 21085 -2873 -15930 11071 16548 -7221
510 -7221 -9756 -1090 -6826 1394 19453 2343 -19875 2957 18197 -15949 -24039 21922 29284
523 29284 -16997 -22205 13260 8126 -17122 -1435 17767 2151 -5984 2295 -9075 -13771 14978
$$ packed form
431h63M358J70n692J960J2177p436k6048M988L4780J449l1404m1K5487p990k5999
446b0104R624K5801j777j4731m106j722K397J0358k715j1383J2980J6204k4661
459c835k6215K6351K9494k2056k1072K2879J1730k6793j0294K1628R669o255q42
472D389o797j0109J1766J1118j7618m247L0701J651m1558m926L9775L277l0721
485a3299O536K5798j3132k3094Q832J1808j706P113J025k0693j222K3847p806
498D007k6033K1860L3225k8114l6450K5254K7336k3958j3057K7001N477k3769
510g221k535Q666n736Q220J8059j7110k2218K2832J5240l4146q090M5961P362
523B9284m6281n208L5465n134k5248J5687J9202j5616q135Q279j1370m696K8749
$$ plain form
536 14978 19350 -15284 -12617 21968 4805 -32842 -5471 34245 7179 -23829 211 14177
548 14177 -10884 -11683 11677 6594 -4029 8154 474 -23177 -3082 27031 678 -24032 10827
561 10827 25549 -19980 -29413 18444 24298 -13586 -9923 14491 -1272 -15793 4060 7245 -7343
574 -7343 7591 16676 -16758 -23423 18721 19239 -22944 -10224 31489 6759 -33980 -6340 25307
587 25307 34 -14037 10348 8086 -13909 -2194 8678 -10815 -4389 25107 4988 -30354
599 -30354 -2653 27914 -7386 -27383 16667 28909 -16814 -23103 12954 8855 -13439 3211
611 3211 14564 -7305 -6840 11100 -7158 -20274 15860 26890 -17332 -22332 21116 12571 -29780
624 -29780 -8703 32401 8314 -22830 -1015 10739 -11534 -5597 16410 1310 -10316 12017
$$ packed form
536A4978M372l4634K667L4585j7163l7647K7371L9716k7066l1008K4040J3966
548A4177k5061p99K3360n083j0623J2183p680k3651K0095L0113k6353k4710L4859
561A0827J4722m5529r433M7857N854l7884L663K4414j5763j4521J9853L185j4588
574g343J4934R085l3434o665M2144N18m2183J2720M1713k4730m0739K7640L1647
587B5307k5273j4071K4385k262k1995J1715J0872j9493O426K9496k0119l5342
599c0354K7701L0567l5300j9997M4050J2242m5723o289L6057m099k2294J6650
611C211J1353k1869M65J7940j8258j3116L6134J1030m4222n000M3448q545m2351
624b9780K1077M1104k4087l1144K1815J1754k2273N937K2007j5100j1626K2333
$$ plain form
636 12017 5385 -28297 -7957 33442 7856 -28004 3397 25521 -15987 -28888 16425 24875
648 24875 -9616 -7939 9551 -8319 -14842 12094 10479 -11658 5838 20067 -17989 -31022 17155
661 17155 28622 -15220 -14252 23434 5440 -31534 -7328 24212 5306 -7138 8652 -1723
673 -1723 -20648 1160 16620 -7374 -5738 24793 4892 -36427 -10562 30916 5812 -20595
685 -20595 10049 20573 -18412 -23256 11351 12324 -3868 8379 7829 -19589 -12188 16838 1987
698 1987 -16344 15257 26108 -21041 -32005 15208 21596 -14352 -5430 22756 332 -24652 -2621
711 -2621 11149 -3135 4862 16961 -9343 -22402 8876 13671 -17248 -4737 30696 5809 -33457
724 -33457 -7838 23258 -624 -14346 12904 13552 -14762 -10364 7198 -3177 -3302 18257 6157
$$ packed form
636A2017o632l3682K0340M1399k5586l5860L1401K2124m1508j2901M5313Q450
648B4875l4491J677J7490j7870o523K6936j615k2137J7496J4229l8056j3033M8177
661A7155J1467m3842R68L7686j7994l6974K4206L1540j8906j2444J5790j0375
673a723j8925K1808J5460k3994J636L0531j9901m1319K5865M1478k5104k6407
685b0595L0644J0524l8985m844L4607R73j6192J2247n50k7418P401K9026j4851
698A987j8331L1601J0851m7149j0964M7213O388l5948Q922K8186k2424k4984K2031
711b621J3770j4284P997J2099k6304j3059L1278M795l0919J2511L5433k4887l9266
724c3457K5619L1096k3882j3722K7250O48k8314M398J7562j0375j25K1559j2100
$$ plain form
737 6157 -22715 -4819 19801 -5892 -20722 16087 25088 -16707 -22572 12829 10927 -13478 -315
750 -315 15758 -3113 -10739 5272 -925 -11959 10074 18330 -13267 -16960 16632 10458 -23007
763 -23007 -6163 26607 4636 -22625 -486 14968 -6499 -9158 10320 3659 -8725 5147
775 5147 5986 -14946 -4760 20441 2036 -21476 4167 21959 -9885 -21776 11632 17414 -11371
788 -11371 -9181 11964 1976 -11074 2471 5441 -7424 2298 13663 -7434 -16761 10394 14209
801 14209 -15208 -10250 20656 8834 -21036 -6976 15704 954 -10308 5994 7582 -7583
813 -7583 -2810 4898 -6895 -4235 15989 6097 -18450 -4298 17099 -2982 -18350 8634 20469
826 20469 -7832 -16450 5432 6481 -7199 1115 9374 -2882 -4768 5145 -4320 -12074 9298 17666
$$ packed form
737F157k8872J7896K4620k5693j4830L6809R001m1795n865L5401j902k4405J3163
750c15J6073j8871p626J6011o197j1034K2033Q256l1597l693L3592o174l3465
763b3007J6844L2770k1971k7261K2139J5454k1467k659J9478o661j2384J3872
775E147Q39k0932J0186K5201j8405k3512K5643J7792l1844j1891L3408N782k8785
788a1371K190K1145r988j3050J3545K970j2865R722J1365k1097r327K7155L815
801A4209k9417M958L0906j1822k9870J4060K2680j4750j1262J6302J588j5165
813g583M773P708j1793K660K0224r892k4547J4152K1397k0081j5368K6984J1835
826B0469k8301q618K1882J049j3680Q314Q259j2256j886R913r465p754K1372Q368
$$ plain form
840 17666 -8749 -15140 10085 8590 -15963 -6440 18713 7574 -13092 -4228 5086 -3989 -2259
853 -2259 8358 1482 -5183 4815 1817 -14501 -3811 18553 5963 -15292 -1431 12859 -5652
866 -5652 -14888 6707 14527 -2544 -6713 1378 -2509 -4552 5429 4223 -4886 2726 8345 -9059
880 -9059 -14536 8831 15260 -6744 -9345 9330 4858 -13134 -5555 10573 5369 -2895 389 -1819
894 -1819 -6340 1872 5761 -4117 -1841 11143 1832 -16182 -4871 14162 3877 -9887 1726
907 1726 9639 -4472 -10425 1423 5818 1391 2373 491 -6522 -2243 5706 -1476 -6487 6993 11037
922 11037 -7586 -13242 4478 9220 -4355 -4279 7311 3925 -6747 -4980 874 1672 4048 3965 -4027
937 -4027 -5167 3822 2028 -7947 -1100 12473 4100 -11445 -5289 6888 1572 -5315 1647 6482
$$ packed form
840A7666k6415o391K5225j495k4553R523K5153j1139k0666Q864R314r075J730
853b259J0617o876o665R998k998j6318J0690K2364j2590k1255J3861J4290j8511
866e652r236K1595P820j7071m169Q091l887k043R981j206r109P612N619j7404
880i059n477K3367O429k2004k601J8675m472j7992P579J6128n204q264L284k208
894a819m521Q212L889r878K276J2984r311j8014J1311J9033j0285j3764J1613
907A726P913j4111n953J1848M395m427R82j882p013M279P949p182n011J3480M044
922A1037j8623n656J7720M742j3575P6J1590l386j0672J767N854P98K376q3p992
937d027j140Q989j794r975O847J3573q373j5545O156J2177n316o887O962M835
$$ plain form
951 6482 247 -4321 -3467 -2148 2557 6585 353 -5860 770 4927 -5016 -7896 6021 10820 -2564
966 -2564 -8507 521 3676 -2509 -2480 3334 4108 733 -2858 -5421 -2033 5565 4512 -3591 -2275 5075
982 5075 565 -8710 -3076 8607 5789 -4203 -4025 1499 698 -2663 -1338 2633 4576 1727 -4684
997 -4684 -6046 1307 5666 -84 -3501 2731 4715 -3999 -7871 806 7359 2601 -3284 -1875 1337
1012 1337 3 -3142 -2019 3590 6011 44 -6458 -3413 3473 2464 -2604 -440 4983 2139 -5645
1027 -5645 -5693 2033 5788 1385 -2858 -701 2285 -830 -4958 -1330 5875 5076 -2635 -5200 -338 2437
1043 2437 -543 -2031 1892 4763 634 -5740 -4688 2773 5205 -367 -2938 1849 2989 -3600 -5809
1058 -5809 1506 6511 2158 -3228 -2499 468 556 -1424 -1352 2575 5066 -86 -6781 -3493 4642 3424
$$ packed form
951F482o235m568Q54J319M705M028o232o213O630M157r943k880J3917M799j3384
966b564n943R028L155o185K9N814P74l375l591k563L388P598j053q103J316P350
982E075m510r275N634J1683k818r992J78N524q01l361J325L971J943k849o411
997d684j362P353M359n750l417O232J984q714l872Q677O553m758n885J409L212
1012A337j334l145J123N609K421n967o502L045O886j009n068K164N423k844p784
1027e645m8P726L755m403m243K157K986l115m128L628P205p99p711k565M862K775
1043B437k980j488L923K871m129o374J052P461K432n572k571M787J140o589k209
1058e809P315N005m353n386P29K967Q8j980P2L927K491n152o695L288Q135j218
$$ plain form
1074 3424 -3138 -959 4938 1019 -6362 -3741 3717 4387 374 -1591 -1274 -124 264 -1884 -1942 3881
1090 3881 6014 -2321 -7600 -131 5397 -732 -3810 3248 5197 -2653 -5918 -699 2833 2215 1219
1105 1219 -753 -1784 749 497 -4083 -1710 6876 4889 -5838 -5393 3746 2545 -4452 -838 6015
1120 6015 2232 -4204 -3168 -258 794 2625 1790 -2178 -785 3014 -1784 -6537 1694 8901 428
1135 428 -7177 -214 4497 -2466 -4392 3277 4940 -646 -2367 -1633 -2221 983 4172 -370 -3193 2973
1151 2973 3250 -6386 -5640 6573 6586 -4399 -3839 4005 780 -5291 -698 4343 1584 -91 106 -3435
1167 -3435 -2988 3806 3027 -3999 -410 6602 -832 -9234 -459 8242 762 -4993 1640 3445 -3448
1182 -3448 -3487 1934 1599 702 2819 -977 -5716 227 5344 -1880 -4572 5245 5862 -6469 -6855 4782
$$ packed form
1074C424o562K179N897l919p381K621P458O70m013j965L17J150L88k148n8N823
1090C881K133q335n279P469N528o129l078P058J949p850l265N219L532o18r96
1105A219j972j031K533k52m580K373Q586j987j0727M45R139j201o997L614O853
1120F015l783o436J036K910J052J831q35l968J393L799m798m753Q231P207q473
1135D28p605O963M711o963j926P669J663n586j721P34n88L204L189m542k823O166
1151B973K77r636P46J2213J3j0985N60P844l225o071M593N041k759j675J97l541
1167c435M47O794p79p026L589P012p434q402Q775Q701p480n755O633J805o893
1182c448l9N421l35q97K117l796m739N943N117p224k692R817O17j2331l86J1637
$$ plain form
1198 4782 4658 -3598 -1035 4278 -381 -3905 -43 413 -986 3543 3591 -4816 -4345 4850 2156 -6538
1214 -6538 -186 8883 471 -8471 -806 5279 -1194 -2851 3382 2145 -2756 -483 364 -3486 488
1229 488 6698 54 -6740 1151 5657 -4256 -6119 5931 6810 -4625 -4722 3216 847 -3618 1258
1244 1258 3523 -1111 -422 1883 -3593 -4405 5097 5517 -4822 -3333 6013 849 -8389 -777 8287
1259 8287 1321 -4881 602 1852 -3494 -1178 3461 122 -805 3694 -528 -7538 -430 7808 80
1274 80 -5798 3189 5487 -5812 -6598 4713 5183 -2324 -636 2350 -2724 -3279 2573 1198 -2070 3514
1290 3514 4287 -6055 -6591 5147 5031 -4697 -1205 6885 -219 -8237 -986 5321 544 -767 2790
1305 2790 -953 -4642 661 2453 -2682 562 6996 -436 -8987 -858 6780 -801 -4320 4451 4667
$$ packed form
1198D782j24q256K563N313m659l524L862M56j399M529M8q407M71R195k694q694
1214f538O352R069q412q942P665O085o473j657O233j237m901K273Q47l850L974
1229D88O210o644o794P891M506r913j863J2050Q79j1435r7P938k369m465M876
1244A258K265m634O89K305n476q12R502M20j0339J489R346n164r238P612R064
1259H287o966o202N483J250n346K316M639l339r27M499m222p010P108Q238p728
1274H0n878Q987K298j1299p86J1311M70p507J688K986n074n55N852j375l268N584
1290C514P73j0342n36J1738j16r728L492Q090p104q018P251O307m777j311L557
1305B790l743l689N303J792n135L244O434p432q551Q129P638p581l519Q771K16
$$ plain form
1320 4667 -5344 -5059 2661 1914 -671 2892 1506 -4536 -1703 3297 -1599 -3258 5640 5527 -6264
1335 -6264 -6171 4571 3136 -4502 276 6146 -685 -5568 -151 1622 -1210 2059 3840 -2839 -3983
1350 -3983 3024 1301 -5241 679 7949 -285 -7736 77 5019 -2054 -3093 4130 2775 -3574 -1589
1365 -1589 1325 -1679 -187 4547 236 -4988 815 4242 -3412 -4383 5259 4882 -4992 -3775 4088
1380 4088 1292 -3916 569 3573 -1064 -1666 1549 -1105 -2621 3039 3118 -4017 -2279 5061 906 -6149
1396 -6149 -81 6183 -520 -4955 1512 3386 -2387 -1928 2295 92 -1549 2139 851 -3805 -54
1411 -54 4423 -1418 -4708 2985 4970 -3636 -4428 3529 2722 -3594 -950 3631 31 -2511 662 260
1427 260 -2047 1606 3315 -2351 -3047 3186 1722 -4796 -1012 5901 1169 -5084 -585 3276 -1199
$$ packed form
1320D667j0011K85P720p47k585L563j386o042K833N000m896j659Q898j13j1791
1335f264R3J0742j435p638M778N870o831m883N417J773k832L269J781o679j144
1350c983P007j723o542N920P270q234p451P813M942p073j039P223j355o349J985
1365a589K914l004J492M734m311n224N803L427p654r71R642l77r874J217P863
1380D088k796n208M485L004m637o02L215k654j516N660P9p135J738P340m155p055
1396f149O068O264o703m435O467J874n773M59M223k203j641L688j288m656L751
1411e4M477n841l290P693J985q606p92P957q07o316K644M581l600k542L173m02
1427B60k307L653J709n666o96O233j464o518L784O913m732o253M499L861m475
$$ plain form
1442 -1199 -2321 2323 1895 -1585 -288 365 -2554 -391 4249 785 -3983 381 3516 -2564 -4215
1457 -4215 3331 4676 -2334 -3050 1677 430 -2362 691 2419 -425 -348 1057 -2223 -2945 2893 3709
1473 3709 -2453 -2273 3203 650 -4819 -700 4872 1277 -2761 -131 849 -1800 -582 2011 297
1488 297 -460 1779 -371 -4137 -354 4401 518 -3222 1090 2897 -2638 -3619 2159 3185 -781 -894
1504 -894 675 -1055 -1359 1119 607 -839 1598 1920 -2904 -3257 2451 2855 -2102 -1191 3032 514 -3690
1521 -3690 -1063 2458 909 -410 638 -401 -1574 364 813 -1284 262 3193 11 -3998 -619
1536 -619 3114 -29 -2257 1385 2488 -1526 -2499 401 994 147 905 355 -1428 -325 1061 -1065
1552 -1065 -1543 2309 2666 -2103 -2764 1432 1525 -1730 -629 2346 918 -1696 -1044 45 15 887 1075
$$ packed form
1442a199j122M644m28l480J297O53k919K163M640l464m768M364L135o080j651
1457d215P546J345p010p16M727j247k792L053J728k844P7J405l280p22N838Q16
1473C709o162J80N476k553n469M119N572l595m038K630R80k649J218K593j714
1488B97p57K239k150l766L783M755l883l740M312J807n535r81N778J026l966j13
1504h94J569j730l04K478n12j446K437L22m824l53N708M04m957R11M223k518m204
1521c690K627L521j549j319J048j039j173J938M49k097J546K931l182m009L379
1536f19L733l143k228L642J103m014r73K900N93q47P58n50j783J103J386k126
1552a065m78L852L57m769o61M196R3l255J101K975j428k614O52J089l0Q72J88
$$ plain form
1569 1075 -762 -833 1066 -50 -2378 -23 3214 778 -2581 -659 1619 -364 -1598 760 1818
1584 1818 87 -883 -740 -764 297 1435 99 -1069 655 1128 -1722 -2088 1592 2469 -756 -1589 621
1601 621 600 -1217 -693 999 1067 319 -380 -1242 -742 1049 877 -837 -134 1636 4 -2432 -799 2031
1619 2031 1120 -968 -385 687 -198 -1049 -354 645 1081 656 -786 -1417 66 1087 -245 -792 1052
1636 1052 1431 -1065 -2040 160 1513 298 -564 148 437 -330 -944 -543 644 1394 368 -1212 -830
1653 -830 648 336 -891 -45 1580 714 -1394 -1316 417 931 74 -284 279 501 -333 -1173 -560 1056
1671 1056 1316 -222 -1046 -47 520 -458 -823 567 1458 226 -1260 -929 409 666 -138 -268 606 673
1689 673 -697 -1405 -102 1266 721 -507 -443 291 68 -765 -534 779 1284 45 -1218 -657 616 395
$$ packed form
1569A075j837p1J899j116k328K355L237k436l359J922K278j983j234K358J058
1584A818j731r70J43k4J061J138j336j168J724M73k850l66L680Q77l225q33K210
1601F21k1j817N24J692O8p48o99q62N00J791j72j714P03J770j632k436J633K830
1619B031r11k088N83J072q85q51O95R99M36m25j442o31J483J021j332n47J844
1636A052L79k496r75K200J353j215q62P12K89p67o14M01J187P50j026j580L82
1653h30J478l12j227Q46J625q66k108P8J733N14q57l58N63K22q34q40O13J616
1671A056K60j538q24R99N67r78l65J390Q91j232j486L31J338K57q04j30Q74O7
1689F73j370p08J303J368n45j228O4P34k23q33K31J313N05j239j263N61J273k21
$$ plain form
1707 395 -565 -8 1145 469 -1184 -1101 404 962 214 -282 -16 247 -137 -815 -480 917 1294 -255 -1276
1726 -1276 -123 763 -274 -772 626 1282 -149 -1223 -525 390 477 170 -73 27 313 -163 -1093 -432
1744 -432 1292 1075 -814 -940 551 367 -982 -391 1174 854 -520 -788 -277 86 378 235 -182 182
1762 182 645 -464 -1430 70 1628 384 -1106 -62 856 -441 -1104 296 1117 313 -325 -420 -475 26
1780 26 548 -67 -375 745 752 -1171 -1380 867 1328 -526 -698 770 363 -1056 -597 601 555 255 103
1799 103 -574 -645 455 437 -709 -29 1449 202 -1776 -561 1354 368 -874 252 921 -388 -917
1816 -917 -58 243 259 676 66 -987 -172 833 -350 -1019 896 1518 -803 -1562 456 965 -571 -395
1834 -395 888 371 -643 -337 -117 -279 579 920 -561 -904 678 506 -1300 -484 1716 761 -1414 -592
$$ packed form
1707C95r60N57J153o76j653Q3J505N58p48m96K66K63l84o78L35J397L77j549j021
1726a276J153Q86j037m98J398O56j431j074O98R15Q7l07k43J00K86m76r30O61
1744d32J724k17j889j26J491j84j349N91J565l20j374k68N11L63K92j43m17L64
1762A82M63j109r66J500J558j244j490J044R18j297o63J400Q21q04o38r5n5N01
1780B6N22o15l08J120Pj923k09K247M61j854j72J468m07j419M59J198m6l00j52
1799A03o77p1J100j8j146O80J478j247j978J215J915r86j242J126O69j309n29
1816i17Q59L01J6M17o10j053Q15J005j183o69J915O22k321p59K018N09j536J76
1834c95J283n17j014L06K20j62Q58L41j481l43J582j72j806Q16K200r55k175Q22
$$ plain form
1852 -592 874 -48 -758 409 734 -179 -132 -17 -772 -250 1214 456 -1135 -32 1208 -543 -1628 592
1870 592 1684 -315 -1068 398 385 -772 -191 673 114 9 480 -514 -1211 486 1307 -522 -902 1063
1888 1063 747 -1573 -968 1351 840 -774 -104 589 -468 -638 372 188 -139 769 440 -1361 -812 1256
1906 1256 545 -1165 182 1555 -419 -1778 126 1216 -101 -291 596 -70 -821 43 264 -494 407
1923 407 1349 -459 -1720 261 1286 -631 -834 1308 956 -1374 -1025 753 383 -293 515 382 -776
1940 -776 -291 462 -505 -485 1365 953 -1478 -1048 1163 411 -1229 233 1592 -185 -1377 -23 508
1957 508 -246 291 783 -421 -677 543 52 -1157 355 1787 -235 -1736 230 1178 -713 -844 1123
1974 1123 844 -903 -538 366 -239 -109 899 84 -978 247 829 -929 -941 1403 1101 -1351 -863 1153
$$ packed form
1852e92J466r22p10J167L25r13M7J15p55N22J464p58j591J103J240j751j085K220
1870E92J092j999p53J466j3j157N81Q64n59j05M71r94o97J697Q21j829l80J965
1888A063l16k320O05K319n11j614O70O93j057j70J010j84l27R08l29j801N49K068
1906A256p11j710J347J373j974j359J904J090j317j90Q87o66p51Q64K21p58R01
1923D07R42j808j261J981J025j917k03K142l52k330L49J778l70o76Q08j33j158
1940g76M85P53r67K0J850m12k431M30K211p52j640J462J359j777j192J354N31
1957E08p54N37M92j204k56J220m91j209J512J432k022j501J966R48j891j31J967
1974A123k79j747L65R04o05J30J008q15j062J225N82j758j2K344l02k452M88K016
$$ plain form
1992 1153 296 -1144 121 1085 -216 -614 295 -81 -546 637 696 -921 -489 1225 178 -1521 92
2009 92 1662 -205 -1467 417 1098 -617 -692 668 253 -563 248 331 -712 -31 1044 -332 -1273 654
2027 654 1331 -897 -1186 1067 861 -1192 -567 1140 306 -781 88 311 -554 60 809 -364 -691 872
2045 872 544 -1414 -547 1626 500 -1428 -114 1188 -388 -1122 542 881 -342 -182 288 -603 -468
2062 -468 943 415 -971 135 1182 -681 -1586 742 1572 -574 -985 735 397 -1065 -270 886 151
2079 151 -197 376 -349 -1053 402 1118 -535 -709 1106 516 -1645 -711 1528 654 -979 -20 733 -542
2097 -542 -752 463 397 -144 502 251 -1191 -540 1220 357 -1097 314 1360 -681 -1633 480 1283 -320
2115 -320 -482 580 11 -792 34 353 -280 340 923 -619 -1344 532 1109 -740 -693 1258 646 -1417
$$ packed form
1992A153q57j440J265R64j301l98R09l76m65J183N9j617M32J714j047j699J613
2009I2J570j867j262J884O81j715p5J360m15q16Q11Q3j043O81J075j376r41J927
2027F54O77k228k89K253k06k053O25J707q34j087Q69K23q65O14P49j173l27J563
2045H72l28j958Q67K173j126j928J314J302j576p34J664L39j223J60M70q91J35
2062d68J411n28j386J106J047j863r05K328Q30k146m11J720l38j462P95J156p35
2079A51l48N73p25p04J455P16j653j74J815n90k161R34K239q74j633R59P53j275
2097e42k10J215o6n41O46k51j442O51J760q63j454J411J046k041r52K113Q03j603
2115c20j62J062n69q03Q26L19o33O20N83j542p25J876N77j849M7J951o12k063
$$ plain form
2133 -1417 -735 981 390 -480 264 368 -527 -223 339 -364 -244 1101 463 -1340 -527 1197 164 -1192
2151 -1192 304 1373 -318 -1216 142 609 -224 -2 459 -219 -329 400 -182 -859 490 1279 -479 -1248
2169 -1248 528 919 -844 -742 1028 722 -754 -470 313 -70 -123 421 10 -399 411 348 -969 -523 1217
2188 1217 645 -1096 -372 1031 19 -1118 58 993 69 -452 18 -82 -244 328 226 -454 140 847
2206 847 -367 -1238 291 1216 -269 -915 490 730 -670 -727 447 516 -45 9 -100 -397 128 396 -382
2225 -382 -349 869 558 -1070 -740 900 591 -731 -202 809 124 -743 -261 282 225 263 65 -457 -165
2244 -165 504 -87 -752 315 1126 -165 -1143 10 829 -122 -568 329 581 -171 -483 -220 36 370 395
2263 395 -283 -447 358 328 -708 -476 887 737 -670 -713 399 376 -392 -228 416 389 -96 -410 -390 138
$$ packed form
2133a417O82J716n91q70P44J04q95L04N62p03J20J345o38j803Q13J724j033j356
2151a192J496J069j691q98J358M67q33K22M61o78j10P29n82o77J349P89j758p69
2169a248J776L91j763J02J770l06j476K84P83l83n3N44m11m09Q10o3j317M46J740
2188A217n72j741P24J403j012j137J176R35r24n21M70j00j62N72j02o80N94P07
2206H47j214q71J529R25j485o46J405K40j400n7J174O9n61N4j09k97N25K68p78
2225c82L3J218l11j628L30J640l09j322N29J011o85q67M82N43n7L8j98n22K92
2244a65O69n91o65J067Q11j291r78J153Q19r51m46Q97K52p52l12K63K56L34K5
2263C95o78j64Q05l0j036K32J363j50j407m3J112k3p68J64O44k7m85l14K0N28
$$ plain form
2283 138 596 125 -504 31 594 -197 -894 61 994 247 -674 -242 381 60 -369 -100 392 449 -50 -596
2303 -596 -374 420 463 -305 -313 489 377 -637 -689 400 756 -36 -487 -48 290 -51 -442 -123 543 532 -308
2324 -308 -707 -32 519 57 -400 106 617 36 -746 -425 469 577 -121 -410 112 358 -230 -620 73 800
2344 800 328 -557 -449 249 275 -238 -235 357 537 -123 -735 -302 545 466 -334 -338 441 330 -642 -622 460 768
2366 768 -48 -496 -118 221 8 -277 -124 417 563 -221 -847 -126 751 189 -589 49 756 -59 -910 -247
2386 -247 672 405 -187 -201 6 82 -27 -314 -162 624 639 -555 -884 321 715 -392 -547 637 666 -580
2406 -580 -765 158 463 116 -15 -88 -98 165 -45 -612 -64 1026 378 -1018 -471 808 176 -830 40
2425 40 972 140 -730 -300 166 124 243 107 -294 58 468 -437 -901 523 1227 -317 -1058 350 743 -597
$$ packed form
2283A38M58m71o29N35N63p91o97R55R33p47r21M32O23l21m29K69M92N7m99n46
2303e96K22P94M3p68qQ02j12j014n2J089L56p92m51M39L38l41l91L19O66j1q40
2324c08l99O75N51m62m57N06N11n81p82L21Q94J08o98k89N22K46n88l90O93P27
2344H00m72q85J08O98K6n13LN92J80o60o12M33Q47p9q00mP79j11r72K0J082L08
2366G68q16m48L78L39k13k85J53N41J46p84o26P21Q77n62p78O38P07q15q51O63
2386b47R19k67n92j4K07P6j09k87J52P86J5j194l29J205L94j107j55J184K9j246
2406e80j85R23L05l47j31p3j0K63k10n67N48J090o48j396N47J279o32j006Q70
2425D0R32q32q70M30M66m2J19j36m01L52M10r05m64J424P04j544p41J408L93j340
$$ plain form
2445 -597 -650 669 696 -283 -369 -113 -196 188 455 -223 -382 632 364 -1133 -626 1214 727 -972 -413 876
2465 876 17 -966 -21 757 165 -119 3 -432 -279 612 237 -705 164 1120 -377 -1471 269 1361 -233
2484 -233 -904 531 658 -699 -590 409 267 76 400 -221 -824 231 776 -583 -674 1135 846 -1340
2502 -1340 -963 1064 617 -864 -70 896 -128 -743 9 91 -133 614 484 -895 -545 932 126 -1251
2520 -1251 241 1651 -193 -1583 113 1029 -393 -554 723 425 -548 -147 39 -522 260 1146 -221
2537 -221 -1190 443 962 -998 -949 1371 1096 -1165 -833 785 145 -725 295 672 -274 -149 255 -668
2555 -668 -582 1134 790 -1178 -496 1256 -40 -1598 224 1675 -106 -1166 228 494 -592 -111 691
2572 691 -77 -241 600 -213 -1262 321 1532 -365 -1289 772 1043 -1213 -1020 1220 865 -842 -298
$$ packed form
2445e97n3J319K7r79q6K56q3L84K67o78j59J014k68j497N07J840m87j699N59J289
2465H76q59r83R45P78n92k84J22m35J53Q91l75r42Q69R56j497j094J740J092j594
2484b33o71J435J27j357J09R99j42j91L24o21o03J055N45j359r1J809k89k186
2502a340L77K027m47j481P94R66j024o15P52Q2k24P47j30j379L50J477q06j377
2520a251J492J410j844j390J696R16j422j61J277k98r73M01J86n61P82Q86j367
2537b21r69J633N19j960M9K320k75k261L32J618o40q70J020L77r46J25M04r23
2555f68Q6J716l44j968O82J752j296j558J822J451j781j060J394K66j086M81Q02
2572F91p68j64Q41q13j049J583J211j897r24K061K71k256J93K240l55j707N44
$$ plain form
2589 -298 548 -327 -437 571 104 -565 552 668 -1167 -873 1358 767 -1383 -323 1464 -50 -1518
2606 -1518 152 1154 -245 -547 459 -10 -606 372 401 -805 -45 1293 -185 -1548 376 1478 -651
2623 -651 -1255 949 1054 -992 -703 803 192 -574 325 332 -611 89 781 -643 -949 1043 1001 -1237 -772
2642 -772 1359 388 -1497 -159 1375 17 -901 270 348 -580 33 632 -410 -335 963 64 -1502 -18
2660 -18 1613 -120 -1360 548 1158 -935 -1097 859 783 -512 -55 379 -584 -370 734 34 -700 701
2678 701 960 -1181 -1230 1174 1019 -1048 -383 1234 -3 -1374 -58 889 -8 -74 491 -421 -847 478
2696 478 530 -778 11 1417 -127 -1779 -54 1437 -148 -899 720 755 -936 -740 508 228 -56
2713 -56 649 79 -1049 -109 885 -378 -756 1103 1052 -1278 -1185 947 697 -770 3 978 -183 -884 35
$$ packed form
2589b98Q46q75j10J008m67o69J117J16j835K94K231n91k150J060J787j514j468
2606a518J670J002j399l02J006m69n96R78K9j206P60J338j478j363J924J102k129
2623f51o04K204J05k046K89J506o11p66Q99Pr43P00O92j424l06J992m2k238M65
2642g72K131r71j885J338J534j358r18J171P8r28O13N99j042P5J298q99j566J484
2660a8J631j733j240J908O10k093j62J956p6j295M57M34r63K14J104p00p34J401
2678G01K59k141m9K404j55k067O65J617j237j371J316R47q97o6N65r12m26J325
2696D78N2j308P89J406j544j652J725J491j585p51J619L5j691J96J248k80k84
2713e6P05n70j128R40R94j263l78J859n1k330R3K132k50j467P73R75j161p01R19
$$ plain form
2732 35 175 -178 597 664 -807 -769 774 272 -1092 153 1543 -124 -1532 -15 943 -277 -439 682
2750 682 349 -599 -183 85 -440 198 1053 -149 -1103 257 854 -741 -809 1140 967 -969 -762 629
2768 629 191 -522 235 543 -223 -147 207 -505 -428 909 661 -921 -439 976 51 -1221 104 1285 -18
2787 -18 -903 92 392 -374 -131 423 -36 -121 415 -187 -914 221 1068 -263 -905 546 784 -828 -803 762
2807 762 666 -481 -247 327 -158 -257 246 4 -222 509 395 -850 -573 873 460 -852 -128 1006 -10
2826 -10 -1033 -67 711 44 -237 183 -29 -280 126 29 -445 233 857 -241 -1026 186 834 -369 -665
2845 -665 620 696 -581 -633 251 249 -61 156 73 -259 72 197 -498 -288 838 535 -814 -515 684 220
2865 220 -720 -22 838 140 -571 -201 103 23 212 170 -229 -27 374 -264 -724 294 951 -138 -805 158
$$ packed form
2732C5J40l53P75O7j471L8J543n02j364J245J390j667j408J517R58j220j62J121
2750F82l33r48M16K68n25O38Q55j202r54J360N97j595o8J949j73j936K07J391
2768F29m38p13P57L08p66P6L54p12P7J337k48j582M82J415r25j272J325J181j303
2787a8q85R95L00p66K43N54m59q5N36o02p27J135Q47j331o42J451K38j612K5J565
2807G62r6j147K34N74m85r9N03k42k26P31j14j245K77J446m13j312P24J134j016
2826a0j023R66P78o67k81M20k12k51M06r7m74O78O24j098p85J212O48j203k96
2845f65J285P6j277n2Q84kl10K17q3l32L31J25o95K10J126l03j349K99J199m64
2865B20r40O98Q60o98p11L70L04q0J89m2l99K02M01o38m60J018O57j089o67R63
$$ plain form
2885 158 526 -370 -509 412 558 -100 -289 -165 -117 161 301 -158 -186 422 182 -756 -430 743 543 -508
2905 -508 -329 445 102 -539 -152 426 325 -4 -212 -310 -19 347 38 -325 219 571 -275 -812 78 746
2925 746 63 -437 72 340 -193 -426 -37 309 318 28 -364 -294 220 206 -327 -137 583 314 -625 -529 353 426
2947 426 -163 -198 231 186 -243 -373 -56 373 392 -120 -418 2 302 -140 -387 246 643 -17 -627 -206 366
2968 366 198 -189 -51 285 173 -301 -457 30 496 239 -300 -223 217 84 -385 -213 444 467 -201 -522 -82
2989 -82 299 57 -239 34 410 111 -499 -408 262 455 -9 -266 56 223 -138 -403 -41 492 362 -273 -445
3010 -445 76 312 -129 -294 264 532 -114 -588 -168 362 225 -128 -68 160 108 -234 -396 26 546 273 -419
3031 -419 -331 277 173 -409 -177 549 371 -378 -448 54 212 32 -62 19 167 115 -295 -456 187 657 57 -519
$$ packed form
2885A58L68q96j39R21J46o58j89J24M8K78J40m59k8O08k40r38L26J173k00j051
2905e08J79P74l43o41L87N78j01l29k08r8K91L66l09l63N44L52q46n37Q90O68
2925G46o83n00N09K68n33k33L89L46Rk90l92P0N14j4n33J90P20k69r39R6Q82P3
2947D26n89l5M29m5m29j30L17M29J9n12k98M20L00m42k47O33L97o60o10M21N72
2968C66j68l87J38L36j12m74j56M87M66k57n39P7M40j33m69J72O57K3o68l21M40
2989h2L81k42k96K73L76k99o10R1O70J93m64k57L22J67l61k65L62N33j30o35j72
3010d45N21K36m41j65N58K68o46m74M20N30j37l53O0K28n2l42j62M22N20k73o92
3031d19Q8O08j04n82K32P26j78p49p0N02J58j80r4Q1J48n2m10j61O43M70o00n76
$$ plain form
3053 -519 -6 432 -180 -537 187 631 79 -383 -188 49 68 66 -30 -5 279 148 -535 -435 493 560 -342 -373
3075 -373 398 226 -557 -313 467 373 -99 -168 -127 -93 116 83 -194 92 519 -85 -790 -110 725 138 -543 116
3097 116 526 -216 -582 58 400 118 35 -50 -256 -33 239 -152 -300 459 568 -528 -706 389 536 -377
3117 -377 -283 509 229 -487 -284 149 96 157 203 -246 -302 270 128 -550 -43 860 167 -844 -219 603 -10
3138 -10 -496 230 500 -161 -351 -27 -73 47 438 78 -469 46 466 -366 -609 562 799 -415 -643 338
3158 338 314 -429 -122 481 150 -194 -19 -194 -283 345 466 -372 -343 524 143 -831 -180 909 239 -682 -83
3179 -83 424 -212 -378 254 255 -87 96 -21 -523 -61 670 29 -602 239 633 -494 -755 487 704 -342
3199 -342 -341 349 47 -394 49 223 -78 145 303 -414 -539 499 499 -551 -269 749 170 -884 -171 721
$$ packed form
3053e19N13M38o12l57P24M44n52m62J95K37J9kr6K5K84j31o83J00R28O7r02l1
3075c73P71j72p83K44P80r4m72o9M1L4K09l3k77K86M27o04p05O80Q35n87o81O59
3097A16M10p42l66O40L42k82q3q5k06K23K72l91j48P59J09j096j78J095J47r13
3117c77R4P92k80p16K03M33n3O1M6m49n6N72j42o78N07R03o93j011O25Q22o13
3138a0m86P26K70o61j90L24m6J20L91l60n47N15M20q32k43J171K37j214k28R81
3158C38k4p43L07O03l31l44J75j75q9O28J21q38K9Q67l81r74O51J089o70r21N99
3179h3N07o36j66O32Jl42J83j17n02M62P31o41o31Q41L94j127k61J242K17j046
3199c42JO90l02m41M43J74l01K23J58p17j25J038%j050K82J018n79j054P13Q92
$$ plain form
3219 721 76 -410 147 223 -300 -83 215 -175 -61 528 34 -757 -11 746 -162 -692 394 707 -463 -618
3239 -618 388 353 -304 -32 309 -135 -154 263 -133 -392 404 561 -517 -521 614 354 -730 -198 793 155
3259 155 -628 -11 369 -177 -170 285 4 -215 287 115 -626 -93 773 37 -736 166 698 -386 -716 415
3279 415 574 -305 -248 276 -94 -302 214 148 -270 211 466 -470 -654 514 611 -504 -305 696 162 -807
3299 -807 -160 612 96 -223 202 10 -415 50 285 -259 -65 665 41 -905 -126 776 -18 -573 353 572
3319 572 -499 -602 289 292 -106 183 162 -424 -209 347 -95 -373 534 609 -635 -729 486 454 -463 -60 670
3340 670 1 -653 -83 258 -35 179 382 -277 -458 276 186 -513 67 891 8 -921 -88 618 -137 -375
3360 -375 425 386 -414 -316 118 -76 18 519 59 -572 4 437 -358 -462 663 632 -607 -577 426 209 -420
$$ packed form
3219G21o45m86N57P6n23K17K98l90J14N89m94p91P46P57r08n30J086L13j170j55
3239f18J006l5o57K72L41m44j9M17l96k59P96J57j078mJ135k60j084N32R91o38
3259A55p83O17L80n46PM55k81k19N02j72p41N33Q66p36p73R02N32j084l30J131
3279D15J59q79N7N24l70k08N16o6m18M81K55r36j84J168R7j115J99J001n34r69
3299h07O47P72n16l19M25j92m25M65K35n44J94P30o24r46P79R02p94n55R26K19
3319E72j071j03Q91Ll98K89k1n86K15N56m42k78R07P5j244r4J215l2r17M03P30
3340F70o69o54N70L41k93K14K03o59j81P34r0o99N80Q24q83r29Q33P06p55k38
3360c75Q00l9q00R8M34j94R4N01m60o31N76M33p95j04J125l1j239L0J003k17o29
$$ plain form
3381 -420 87 492 -63 -300 45 -121 -212 435 423 -432 -330 494 70 -699 71 881 12 -683 39 382 -245
3402 -245 -195 357 147 -187 78 -33 -437 72 619 -100 -587 259 494 -523 -538 564 495 -423 -274 320
3422 320 -20 -305 124 180 -108 122 218 -409 -350 492 334 -524 -133 645 15 -726 -16 614 0 -330 166
3443 166 151 -243 -50 143 -147 36 456 -68 -613 95 568 -217 -486 427 514 -467 -481 314 242 -208 5
3464 5 198 -118 -96 113 -179 -195 433 374 -491 -353 470 188 -550 -38 665 88 -522 -87 248 -51 -35 186
3486 186 -12 -102 139 -72 -415 129 621 -46 -565 102 431 -296 -421 375 465 -216 -288 63 -11 -52 158 47
3508 47 -122 162 149 -421 -323 501 404 -384 -254 376 74 -483 -85 456 164 -162 -74 -69 -97 125 114 -145 79
3531 79 352 -138 -565 60 557 4 -369 135 304 -225 -362 125 291 74 -21 -98 -164 49 158 -135 -122 349
$$ packed form
3381d20N07M05n55k37L45j66r1O47j2q55J02Q24m24p69P70Q10q69o95P22L43o27
3402b45N0N52k10l34K65j11m04N09N47p19m87Q46K35j017j5J102o9r18J49N94
3422C20l40k85M29N6k88K30R6o27N9Q42j58q58L91P78o30p41P10O30o14l30M96
3443A66j5l94J93J93k90J83M20n24n45P08M73p85k69R13Q7r81j4P95p2m50K13
3464EJ93l16K2K09k92j6O28n9q65J38Q23k82p38N12P03n77o10M35L35k99J6K21
3486A86j98r0K41k11l43N44M92o67n19O67L29p27j25P96R0o81p2L51p4m1K10j11
3508D7j69K84j3n70R8Q24r7p88J30O30l02n57L98N41k92l26Q8Nk8K22j1k59K24
3531G9K73m90m27O25M97n53l73N04J69n29j37M87J66k17r5p7o6K13J09k93J3M71
$$ plain form
3553 349 237 -437 -381 308 310 -228 -130 297 103 -297 -187 112 184 134 -11 -206 -66 172 -34 -251 132 461
3575 461 -17 -481 -77 334 53 -190 84 258 -18 -230 -149 63 220 171 -132 -165 125 104 -255 -163 356 333
3597 333 -226 -337 80 179 -89 -110 144 188 -22 -244 -191 107 258 30 -180 11 182 -85 -302 36 386
3618 386 153 -252 -186 114 93 -111 -65 190 219 -63 -290 -110 220 186 -93 -90 152 100 -225 -240 147 332 47
3641 47 -222 -82 132 19 -178 -31 270 197 -179 -277 15 183 30 -103 43 165 -5 -261 -168 179 279
3662 279 -29 -216 15 153 -87 -241 91 342 80 -244 -143 96 86 -33 -28 105 161 -47 -271 -129 255
3683 255 240 -148 -158 159 107 -264 -187 238 276 -68 -184 -31 51 11 -33 -22 112 183 -100 -348 -42 319 75
3706 75 -239 23 251 -88 -337 -12 268 109 -74 -75 -42 0 47 -58 -45 237 215 -258 -332 167 300 -129 -163
$$ packed form
3553C49j12o74N6O89Kn38R8M27j94m00J10K99P2n0j45j95J40K38k06k17L83L29
3575D61m78m64M04M11k81k43K74J74k76k12Q1K12J57m9l03l3K90k1l59R2N19k3
3597C33n59j11M17R9k68k1K54M4k10k22N3K98J51k28k10J91J71k67k17L38L50
3618C86k33m05O6L00k1k04M6K55K9k82k27J80L30l4k79LK42n2l25j5L87J85k85
3641D7k69J40K14j13j97J47L01p3l76r8K92J68j53j33J46J22j70k56R3L47J00
3662B79l08j87K31J38k40j54L32K51k62l24J01K39j0j19NJ33N6k08k24J42L84
3683B55j5l88j0L17n2l71P7M25L8l44j16J53Q2m0m4J1J34P1k83k48L06L61k44
3706G5l14K62K28l39k49L25K80j59j83jL3M2M7j05J3K82k2m73p4M99J33m29l4
$$ plain form
3729 -163 245 169 -256 -232 122 170 46 16 -53 -78 65 17 -183 29 376 86 -399 -147 291 66 -259 66
3751 66 301 -34 -264 -64 68 62 108 36 -143 -8 149 -139 -256 238 404 -164 -357 132 235 -183 -144 265
3773 265 187 -134 -118 -34 -43 127 192 -93 -125 183 66 -356 -108 432 192 -343 -108 256 -34 -243 70 231
3795 231 11 -64 -30 -163 -45 246 61 -229 59 283 -199 -401 195 421 -109 -260 147 115 -222 -81 181
3816 181 70 13 77 -135 -231 149 257 -162 -144 324 145 -434 -181 394 164 -245 3 204 -106 -166 78 56
3838 56 -8 169 42 -306 -84 308 5 -316 132 389 -190 -419 130 289 -126 -108 177 33 -161 -1 29
3859 29 -102 129 257 -165 -298 198 242 -276 -170 407 194 -358 -143 257 27 -166 109 133 -98 -5 82 -161
3881 -161 -69 331 132 -337 -48 343 -65 -390 134 406 -116 -279 106 97 -162 1 155 -43 -15 146 -111
$$ packed form
3729a63M08p6m25K4L54M8j24l0o9k5J43m8k00K12L47k90m85K52M38k25l25L25
3751F6K35l35k30K00J32oM6p2j79J35J57k88j17M94J66n68j93M89J03m18L9M09
3773B65p8l21J6Q4rJ70O5k85l2L08j17m22K48N40k40n35K35L64k90k09L13J61
3795B31k20p5L4j33J18K91j85k90K88K24m82k02N96K26n30j51M07l2l37J41K62
3816A81j11n7O4k12r6L80J08m19J8M68j79n79K53N75k30m09K48K01l10o0K44k2
3838E6o4J77j27l48K22L92l03l21M48K57n79k29N49J59m15J8K85j44j94J60L0
3859B9j31K31J28m22j33M96M4n18J06N77k13n52K15M00k30j93K75K4k31R3Q7k43
3881a61R2M00j99m69K89L91m08l25N24K72n22j63L85rk59J63J54j98K8J61k57
$$ plain form
3902 -111 -309 146 355 -155 -255 254 189 -370 -197 343 173 -186 -2 113 -120 -90 148 -8 -58 201 105
3923 105 -358 -175 359 122 -298 43 358 -146 -395 77 281 -49 -61 109 -87 -186 81 48 -139 116 309
3944 309 -177 -420 120 307 -162 -167 317 146 -348 -187 174 59 -20 142 15 -208 -5 122 -133 -53 362
3965 362 157 -400 -185 291 62 -242 124 312 -111 -288 22 73 -7 149 136 -167 -131 141 -44 -236 182
3986 182 392 -143 -381 82 207 -151 -80 283 107 -210 -91 38 -72 66 224 -49 -202 91 110 -249 -99
4007 -99 378 190 -309 -136 209 -16 -182 117 219 -53 -92 13 -103 -52 208 117 -199 -35 217 -98 -299
4028 -299 135 344 -79 -241 83 106 -158 -48 156 34 -55 52 -57 -170 92 213 -98 -159 199 121 -255
4049 -255 -144 262 135 -177 -29 152 -43 -107 64 51 -19 101 60 -170 -78 204 60 -192 46 268 -54 -276
$$ packed form
3902a11j98M55K09n10j00N09o5n59J73N40j70l59J84J15k33L0K38j56n0K59r6
3923A05m63J83N34k37m20L41L15n04k49M72K04l30j2J70j96r9K67l3j87K55J93
3944C09m86k43N40J87m69nM84j71m94J61L61j15p9J62j27k23K03J27k55Q0M15
3965C62k05n57K15M76k29l04L66J88m23j77L10N1q0J56j3l03L6K72j85j92M18
3986A82K10n35k38M63J25l58P1L63j76l17J19J29j10J38J58k73j53K93J9l59J50
4007i9M77j88m99J73L45k25j66K99J02k72l9J05j16N1K60r1l16J64K52l15k01
4028b99M34K09m23j62L24K3k64J10K04j22q9J07j09j13K62J21l11o1L58p8l76
4049b55J11M06j27l12J48J81j95o4J71j3p0J20m1k30R2K82j44k52K38K22l22k22
$$ plain form
4071 -276 56 206 -45 -83 94 40 -97 -14 24 -62 56 146 -73 -197 73 159 -131 -125 205 145 -190 -131 114 56
4095 56 -66 45 81 -36 -20 25 -78 -28 188 107 -166 -61 165 5 -183 49 241 20 -160 -13 64 -30 -1
4118 -1 78 14 -7 49 -63 -137 69 197 -25 -146 52 103 -132 -119 143 141 -56 -79 2 -18 -23 49 23 -20 72 22 -144
4145 -144 -87 158 106 -97 -24 126 1 -150 -3 152 61 -31 0 -26 -25 38 39 -21 51 103 -70 -152 25 144 -9
4170 -9 -75 64 83 -69 -97 32 76 16 -3 -31 -52 -12 22 -52 -16 103 48 -118 -102 75 65 -53 -23 88 29 -95
4196 -95 -57 28 62 55 17 -47 -16 34 -10 -54 56 130 -4 -104 -19 74 10 -36 32 75 -3 -67 -40 9 45 49 -24 -40 15 13
4226 13 -70 -48 78 87 -53 -82 4 35 -27 -19 55 53 12 -56 -52 7 65 23 -19 8 38 -22 -73 7 104 64 -38 -40 18 9 -19 -5
4258 -5 47 58 -8 -60 -42 34 45 -10 -10 11 19 -47 -70 18 67 16 -34 -19 7 -18 -28 -9 50 56 -23 -65 -23 29 18 -14 7 39
$$ packed form
4071b76L32J50k51l8J77n4j37Q3L8q6J18R0k19j24K70Q6k90OL30o0l35N9K45n8
4095E6j22J11L6j17J6M5j03N0K16q1k73J05K26j60j88K32J92k21j80J47P7r4K9
4118aP9o4k1N6j12p4K06J28k22j21J98N1k35J3K62kj97k3Q1k0nP2k6m3R2n0j66
4145a44N7K45n2k03P3J50j25j51J47J55r1r2L1k6JO3Jo0P2N2j73q2J77J19j53
4170io6J39J9j52k8J29M4o0j9k8k1M0L4p4L6J19n5j66J6J77j0j18L0J11n9j24
4196i5L8Q5L4pl8o4L1N0m4m4J10P4j34j00Q5R3o4m6O8M3p8o4K7M9L6Mp3j6N5k
4226A3q3K2J26Rj40k9Q6L1o2QP4km1o8MN9N8m2m2K7L0o0n1Q0R7m0j02kN8rk8J4
4258eN2J1o6n2J8P6J1n5%K1Qo6k3Q8M9n1n0J5K6k5j0J9N9Op9m2M2N2j1l2K1L2
$$ plain form
4290 39 13 -53 -52 35 61 15 -30 0 12 -12 -32 -3 60 42 -25 -43 1 25 5 3 26 45 11 -47 -25 33 47 1 -35 4 15
4321 15 -25 -50 2 53 20 -43 -33 8 14 -4 -9 27 45 1 -55 -20 46 47 -7 -21 34 24 -32 -32 36 56 20 -8 5 13 20 10 -1
4354 -1 22 45 -7 -57 -15 56 20 -16 4 42 7 -51 -31 30 30 7 -6 -21 -8 -2 -14 -29 21 51 -20 -61 2 46 -12 -22 24 49
4386 49 -10 -35 4 22 28 13 -2 -6 28 22 -17 -6 60 45 -34 -52 43 46 -22 -17 33 32 -20 -11 -7 16 25 21 -24 -10 34 0 -60 -7 78
4421 78 13 -64 -3 43 -3 -34 9 32 1 -1 -4 -22 9 49 8 -44 17 54 -24 -56 47 92 -22 -50 28 43 -19 -15 37 20 -4
4452 -4 23 -14 -40 35 48 -33 -52 59 41 -71 -53 75 43 -57 -25 45 -6 -31 9 2 -6 25 24 -56 -12 72 25 -88 -9 97
4482 97 -10 -93 22 78 -7 -52 28 29 -10 19 18 -19 23 80 -9 -78 41 87 -48 -86 70 75 -64 -52 71 31 -50 -5
4510 -5 22 -16 -2 48 -42 -59 64 63 -85 -51 115 44 -116 -28 114 8 -84 23 57 -15 -30 29 -21 -20 65 27 -90 0
$$ packed form
4290C9k6o6JQ7K6m6m5L0J2k4k0K9O3j8o7j8M4K4k0kK3J9l4n8K2N8J4m6l6L9J1
4321A5m0k5N2N1l3o3J0M1Oj8nL6J8m4n6L5O6Jn4j4N5j0n6%O8K0l6k8J3QPj0j1
4354aK3K3n2n0M2P1l6l6K0L8l5n8K0O1%k3j3j5J3Oj2j5N0L0p1m1O3M4n8j0M6K5
4386D9n9k5L9J8Oj5j5mL4ol9J1O6j5p9j8R5Lo8NN0jn2RMK3Rmm5J4M4l4o0N3Q5
4421G8o5p7O1M6m6l1M3K3l1klj8L1M0m1n2O1L7p8l2J03M5j14k8P8J5o2MN2j7k4
4452dK7l7k6P5J3q1j9J11j8j12J8J28l2j00L2P0n1k5M0pqL1jq0M4Q4m7j13P9J06
4482I7j07q3J15N6q5m5Q0Jl9K9jl7M2N7q9o9J19M6j35l8J56Nj39J2J23m0q1M5
4510eK7l8J4N0r0j7J23jj48L4J66p1j60Q8J42j06r2J07L4p2j5N9n0JQ5l8j17R0
$$ plain form
4538 0 115 -6 -109 58 147 -53 -109 60 83 -48 -30 66 -1 -36 38 -3 -64 39 94 -56 -115 84 88 -117 -83 132
4564 132 62 -130 -43 78 -9 -55 42 24 -46 25 50 -90 -49 142 46 -149 -30 150 -8 -154 41 158 -28 -90
4588 -90 58 40 -44 17 56 -41 -19 102 -26 -146 61 168 -64 -139 104 106 -132 -91 123 53 -82 -5 53 -52 -27
4613 -27 76 -32 -82 87 82 -148 -88 167 76 -172 -30 173 0 -147 19 100 -35 -36 57 -10 -51 94 44 -119
4637 -119 9 169 -28 -172 60 182 -66 -143 94 94 -100 -72 73 12 -47 59 10 -96 40 108 -81 -124 135
4660 135 129 -156 -98 159 61 -171 -29 132 -2 -89 40 23 -69 31 63 -82 -52 141 31 -196 -10 193 -7
4683 -7 -171 62 154 -73 -116 82 64 -39 10 31 -78 -17 110 -30 -119 81 153 -133 -167 116 124 -131 -76 133 30
4708 30 -131 -19 57 -27 12 74 -46 -102 90 72 -130 -41 189 42 -217 -28 162 -6 -122 52 113 -53 -67
$$ packed form
4538@J15j21j03J67Q9k00n6J69K3j31J8R6o7l5P4m1o1J03N5j50n9J99Mk05L4K15
4564A32p0j92Q7J21q7m6R7j8p0P1K5j40M1J91r6j95J19J80j58j46J95J17j86o2
4588i0J48j8q4O1L9r7K2J21j28j20K07J07k32p5K43Kk38M1K14p0j35P7N8j05K5
4613b7J03j08n0J69nk30O0K55r1k48J42K03j73j47J66Q1j35jR3o7m1J45n0j63
4637a19J28J60j97j44K32J22k48p7K37%j94K8J45o1n9J06m9j06J36O8j89m3K59
4660A35ok85N8K57r8k32J42J61j34q7J29j7r2J00L2j45L0J93j10k27J86K03k00
4683gj64K33R2k27m3J98j8j03M9K1j09O1J27j40q9K00P2k86l4K83Qk55N5K09j03
4708C0j61J12P6q4L9O2j20n6J92j8k02Q9K30j47k59J89J90j68j16J74O1j66j4
$$ plain form
4731 -67 42 -6 -12 102 20 -123 4 147 -52 -149 104 169 -97 -162 85 88 -92 -37 92 2 -50 9 -28 -69 68
4756 68 105 -106 -97 107 54 -169 -48 198 56 -152 -23 112 -13 -60 45 45 -21 26 2 -98 2 144 11 -140
4780 -140 30 151 -72 -153 86 170 -50 -103 38 37 -47 3 28 -19 31 42 -85 -104 100 99 -111 -83 119 50 -156
4805 -156 -61 121 45 -89 -22 36 -22 -12 20 -18 7 101 8 -137 -9 149 5 -124 45 129 -37 -141 21 85
4829 85 7 -30 5 -10 -1 30 -32 -50 83 98 -98 -112 63 93 -97 -66 103 67 -90 -79 30 33 2 -4 -33 -9 31 -17
4857 -17 -99 -3 131 10 -134 -27 108 2 -96 9 108 14 -67 -32 26 31 46 -5 -16 41 49 -61 -71 96 107 -59
4883 -59 -86 41 62 -59 -55 54 76 -10 -57 -39 16 43 8 -45 13 74 -17 -115 -21 94 53 -68 -45 61 17 -65 -35 54
4911 54 66 -12 -70 -35 52 43 -30 -36 62 70 -57 -90 35 108 13 -54 9 50 -18 -72 -21 72 74 -28 -82 -8 55 -15 -59 14 72
$$ packed form
4731f7J09m8oJ14q2j43J27J43j99r7K53O5k66o5K47Lj80N5J29r0n2N9l7m1J37
4756F8L7k11RK04n3k23J21K46j42k08J29J35j25m7J05%o6M7k4j00J00J42j33j51
4780a40J70J21k23q1K39Q4k20n3J41jq4N0K5m7N0J1j27j9K04jk10K8K02o9k06
4805a56R5J82p6j34O7N8n8J0L2l8K5R4r3j45J28J58j44j29J69Q4j66j04J62O4
4829H5p8l7L5j5RL1o2j8J33J5j96j4J75L0j90L1J69l6j57J1J09Ll1ok9K4M0m8
4857a7q2R6J34j21j44J07J35j06r8J05R9r4q1L5N8NJ5n1j1N7Qj10j0J67J1j66
4883e9k7J27K1j21MJ09K2q6m7J8N5K7l5n3N8O1r1r8R4J15m1j21K3J06m4q2L0Q9
4911E4J2p8n8L5Q7rp3oR8Qj27l3J25P3r5o7O3M1o8n4N1R3Kj02n4P4O3p0m4P3N8
$$ plain form
4942 72 19 -85 -52 38 67 -27 -47 14 46 -29 -96 -8 86 51 -62 -48 32 29 -37 -37 41 77 -6 -73 -31 46 47 -20 -40 65
4972 65 68 -69 -86 57 94 -1 -56 0 27 -7 -51 -12 52 46 -25 -89 -21 65 22 -68 -6 95 10 -121 -51 68 27 -31 -21
5001 -21 18 11 -22 -46 -23 57 61 -33 -90 15 74 -42 -67 62 108 -47 -95 21 77 9 -30 14 29 10 -1 -56 -5 109
5029 109 69 -98 -59 90 41 -114 -22 111 36 -88 -52 22 11 -10 -3 -16 0 20 -34 -98 18 131 -17 -128 21
5054 21 94 -64 -95 59 98 -21 -54 -5 -3 -5 27 1 -25 58 50 -94 -80 100 102 -84 -59 94 37 -98 -31 94 40 -37
5082 -37 -7 -8 -27 33 23 -59 -8 97 -8 -150 -25 129 -8 -119 31 96 -61 -89 43 59 -2 14 11 -49 -3 66
5108 66 -25 -75 89 105 -97 -107 88 90 -84 -39 103 28 -89 -27 39 -3 17 45 -49 -73 53 31 -101 -9 137 14
5134 14 -150 -18 115 -20 -111 47 72 -51 -60 -4 -36 -17 66 8 -95 7 86 -58 -117 96 128 -78 -100 61 44
$$ packed form
4942G2n3j04L3R0K9r4k0O1L2p5o7Q8R4l5j13J4Q0lo6%P8L6q3o7M2P7Jo7k0J05
4972F5Lj37j7J43L7r5n5N6K7l4m4L9O4op1o4O8Q6m3r0O2J01q5j31P0J19m1n8J0
5001b1L9pl3k4K3Q0Mr4n7J05N9j16k5J29M6j55m8J16N6o8l9M4J5j9j1n5N1J14
5029A09m0j67L9J49m9j55R2J33p5j24L6P4j1k1Pj3J6K0n4o4J16J13j48j11J49
5054B1P3j58l1J54L9j19l3M9KkL2k6k6Q3qj44J4J80Kj86K5J53n7j35O7J25n4p7
5082c7L0jj9O0j0q2N1J05j05j42J25J54j37j11J50O5j57k8J32J6o1J6lo0M6O9
5108F6r1n0J64J6k02j0J95Kj74M5J42p5j17O2O6m2K0K8r4k4J26k2j32R2J46j23
5134A4j64J32J33j35r1J58K5j23rN6l2J9Q3n8j03J02P9j44n9K13L2k06k2J61j7
$$ plain form
5159 44 -81 -6 84 21 -26 16 -35 -61 66 88 -64 -54 107 29 -147 -40 149 25 -117 -9 80 -45 -66 53
5183 53 36 -24 18 3 -95 -25 109 -3 -109 39 113 -90 -129 83 116 -50 -49 50 1 -75 0 34 -32 25 67 -63 -90
5210 -90 67 80 -82 -55 124 27 -133 -40 107 11 -71 28 30 -49 -14 34 -30 -27 77 5 -116 -12 113 -21 -119 40
5236 40 97 -68 -103 46 59 -55 -12 41 -28 -27 44 -9 -71 53 86 -73 -98 80 75 -91 -45 109 32 -87 -12 55 -14
5263 -14 -16 35 -11 -31 38 22 -82 -26 106 13 -105 7 100 -36 -92 35 74 -47 -43 29 -13 -47 20 15 -51 0 73 -43
5291 -43 -94 54 81 -63 -69 78 50 -89 -44 61 17 -28 29 24 -36 9 36 -38 -29 85 28 -89 -22 94 9 -91 24
5318 24 88 -30 -63 11 36 -18 2 31 -36 -19 35 -18 -59 31 75 -53 -94 36 55 -67 -40 64 29 -51 -10 27 -9 13
5346 13 41 -2 -44 34 17 -57 -22 88 34 -81 -25 65 1 -48 30 45 -15 -35 2 -18 -12 34 13 -52 -3 41 -38 -74 26
$$ packed form
5159D4j25P5R0o3m7M2n1k6J27K2j52J0J61p8j76J07J89j24j42J08Q9j25k1J19
5183E3j7o0M2j5r8P0J34j12j06J48P4k03l9K12L3j66JR9m9p6P5L4o6N7M2j30k7
5210i0J57J3j62K7J79r7j60R3J47r6q2R9Kp9L5M8o4LJ04p2j21J04J25j34r8J59
5236D0N7j65l5J49J3j14M3N3o9JP1n3o2J24L3j59k5J78nj66M6J54p7j19P5O7o9
5263a4kN1m6k0O9j6j04N6J32r3j18J12R3j36n6J27L9j21MP2m2l4O7no6N1P3j16
5291d3n1J48K7j44oJ47k8j39M5J05m4m5N7no0M5K7p4RJ14n7j17O7J16q5j00J15
5318B4O4j18l3P4K5n4K0K9o7J7N4n3m1R0M4j28m1J30J9j22K7J04l5q0M1L7l6K2
5346A3K8m3m2P8j7p4L5J10n4j15N6R0o4m9P8J5o0k0L7k0OM6k1o5M9M4p9l6J00
$$ plain form
5375 26 70 -37 -56 25 24 -47 -27 36 9 -26 -6 -10 -33 17 46 -26 -30 50 12 -62 -16 69 18 -39 -8 44 6 -26 7 25 2
5406 2 11 18 -35 -10 45 10 -42 6 45 -30 -56 17 32 -29 -22 19 8 -33 -17 0 -22 5 16 -23 -43 19 16 -39 -17 39 14 -40 -25
5439 -25 15 9 -26 5 20 3 -13 1 -24 0 26 14 -13 16 31 -9 -26 20 54 5 -25 7 20 -7 -22 8 -2 -1 -1 -11 -23 8
5471 8 17 -6 -22 12 3 -38 -23 28 22 -16 -7 10 6 8 6 12 13 20 11 -12 -1 24 9 -12 11 11 -7 -17 5 23 15 9 14 12 9 0 5 13 9 1 -7 -17
5513 -17 -3 2 -2 -5 16 12 -1 -17 -13 -2 -4 -2 -13 -13 -8 -10 -7 7 1 21 -2 -6 -4 1 2 20 20 1 6 -2 4 2 7 16 6 -1 2 0 9 13 0 16 6 -12
5557 -12 -15 -3 6 -2 4 13 5 -6 -9 -10 -3 12 -3 -6 -9 0 -19 8 -9 6 11 -18 -12 3 2 -6 -6 16 10 7 -9 -10 3 22 12 7 7 12 -5 -11 12 33
5599 33 9 -2 -6 1 -4 -20 -1 9 12 -3 -21 -8 4 5 1 2 17 2 -18 -15 -3 18 -4 -19 -10 0 0 -25 7 10 24 -20 -21 -4 5 11 -1
5636 -1 13 20 12 -15 -16 20 27 2 -12 12 19 -17 -19 3 39 -1 -15 -19 -11 -6 -6 -8 -4 21 -12 -36 -25 17 5 -24 -13 14 8 -42 -24 17 28
$$ packed form
5375B6M4j07j9Q1jp1K0O3k7l5K0mk3N0K9p2mQ0l8p4M6Q5n1n7L1N2l8l2L3J8k3
5406BRPn3K5N5l5n2M8L9p5k6P3J5o1PM1j1m1J6J7k2K7J1l9k0O2ln5K2N6k5n4J5
5439b5M0ol5L1J5j7j6J4k5K4K6j2k7K9J5m0j7M6L4m9l0L2J3k7j5L0j0J%j0j2L1
5471HRk3j6L4rm1J5N1ol8RJ7mKkOJPrk3J1K5j5k1K3%j8j0K2J8qoNklrNQmqqj0
5513a7J4NmlK1mj3j6MJ1kKj1%NkLJ4oK0k3mKNJJ8%j9NqOkNRj0pLkRMj3J6j0j8
5557a2lJ2RqORqj1ljPJ5j5llRj9K7j7J5Nk9OJ5jq%K2olj6jJ3J9j0n%Nj7oK3K1
5599C3k4j1mPnj6J9J0Lj5j8J3J2JmJJ5j5k0LJ2K1k2j5RJ0%k5L2LJ4m4jJ7ROj2
5636aJ4Pqk7jL6Pk5j4K4Pl6kK2L6m0j4mQN%kMK5l3k4J1M2j2k9J1K7on0J8M1J1
$$ [...]
8191A4
##END NTUPLES=NMR FID
##END=
