##TITLE=1H_LY-Ni-400-Hex 240
 CDCl3, 8 sc, 
 18.1.2019
##JCAMPDX= 6.0         $$ Bruker NMR JCAMP-DX V2.0
##DATA TYPE= NMR FID
##DATA CLASS= NTUPLES
##ORIGIN= UXNMR, Bruker Analytische Messtechnik GmbH
##OWNER= root
$$ XWIN-NMR		Version 3.5
$$ Fri Jan 18 14:52:38 2019 Russian Standard Time (UT+4h)  she@DPX200
##.OBSERVE FREQUENCY= 200.1313
##.OBSERVE NUCLEUS= ^1H
##.DELAY= (6, 6)
##.ACQUISITION MODE= SIMULTANEOUS
##.ACQUISITION SCHEME= undefined
##.AVERAGES= 8
##.DIGITISER RES= 18
##SPECTROMETER/DATA SYSTEM= spect
##.PULSE SEQUENCE= zg30
##.SOLVENT NAME= CDCl3
##.SHIFT REFERENCE= (INTERNAL, CDCl3, 0, 15.7039)
##AUDIT TRAIL= $$ (NUMBER, WHEN, WHO, WHERE, WHAT)
$$ ##TITLE= Audit trail, XWIN-NMR		Version 3.5
$$ ##JCAMPDX= 5.01
$$ ##ORIGIN= Bruker BioSpin GmbH
$$ ##OWNER= she
$$ F:/spectra/data/she/nmr/H-F/1/audita.txt
$$ ##AUDIT TRAIL=  $$ (NUMBER, WHEN, WHO, WHERE, WHAT)
(   1,<2019-01-18 14:51:07.82 +0400>,<she>,<DPX200>,
      <created by zg, POWCHK disabled, PULCHK disabled
       configuration hash MD5:
       00 E9 B6 7A A2 85 ED C7 34 08 36 98 17 FE 4E 26
       data hash MD5: 16K
       08 4F 10 2D 5C B0 51 1E D0 96 3D C2 2C 68 CA 77>)
$$ ##END=
$$ 
$$ hash MD5
$$ 85 E4 DD BE B0 EC D7 43 D1 12 3A AD 8C A9 0F 1F
##$RELAX= 
##$RELAX= 
##$RELAX= 
##$RELAX= 
##$RELAX= 
##$RELAX= 
$$ Bruker specific parameters
$$ --------------------------
##$DU= <F:/spectra>
##$EXPNO= 1
##$NAME= <H-F>
##$PROCNO= 1
##$TYPE= <nmr>
##$USER= <she>
##$AMP= (0..31)
100 100 100 100 100 100 100 100 100 100 100 100 100 100 100 100 100 100 
100 100 100 100 100 100 100 100 100 100 100 100 100 100 
##$AQSEQ= 0
##$AQ_mod= 1
##$AUNM= <au_zg>
##$AUTOPOS= <>
##$BF1= 200.13
##$BF2= 200.13
##$BF3= 200.13
##$BF4= 200.13
##$BF5= 200.13
##$BF6= 200.13
##$BF7= 200.13
##$BF8= 200.13
##$BYTORDA= 1
##$CFDGTYP= 0
##$CFRGTYP= 5
##$CHEMSTR= <none>
##$CNST= (0..31)
1 1 145 1 1 1 1 1 1 1 1 1 1 1 1 1 1 1 1 1 1 1 1 1 1 1 1 1 1 1 1 1 
##$CPDPRG= <>
##$CPDPRG1= <>
##$CPDPRG2= <>
##$CPDPRG3= <>
##$CPDPRG4= <mlev>
##$CPDPRG5= <mlev>
##$CPDPRG6= <mlev>
##$CPDPRG7= <mlev>
##$CPDPRG8= <mlev>
##$CPDPRGB= <>
##$CPDPRGT= <>
##$D= (0..31)
0 1.2 0 0 0 0 0 0 0 0 0 0.03 0 0 0 0 0 0 0 0 0 0 0 0 0 0 0 0 0 0 0 0 
##$DATE= 1547808667
##$DBL= (0..7)
120 120 120 120 120 120 120 120 
##$DBP= (0..7)
150 150 150 150 150 150 150 150 
##$DBP07= 0
##$DBPNAM0= <>
##$DBPNAM1= <>
##$DBPNAM2= <>
##$DBPNAM3= <>
##$DBPNAM4= <>
##$DBPNAM5= <>
##$DBPNAM6= <>
##$DBPNAM7= <>
##$DBPOAL= (0..7)
0.5 0.5 0.5 0.5 0.5 0.5 0.5 0.5 
##$DBPOFFS= (0..7)
0 0 0 0 0 0 0 0 
##$DE= 6
##$DECBNUC= <off>
##$DECIM= 32
##$DECNUC= <off>
##$DECSTAT= 4
##$DIGMOD= 1
##$DIGTYP= 9
##$DL= (0..7)
0 120 120 120 120 120 120 120 
##$DP= (0..7)
150 150 150 150 150 150 150 150 
##$DP07= 0
##$DPNAME0= <>
##$DPNAME1= <>
##$DPNAME2= <>
##$DPNAME3= <>
##$DPNAME4= <>
##$DPNAME5= <>
##$DPNAME6= <>
##$DPNAME7= <>
##$DPOAL= (0..7)
0.5 0.5 0.5 0.5 0.5 0.5 0.5 0.5 
##$DPOFFS= (0..7)
0 0 0 0 0 0 0 0 
##$DQDMODE= 0
##$DR= 18
##$DS= 0
##$DSLIST= <SSSSSSSSSSSSSSS>
$$ [...]
##$SUBNAM2= <"">
##$SUBNAM3= <"">
##$SUBNAM4= <"">
##$SUBNAM5= <"">
##$SUBNAM6= <"">
##$SUBNAM7= <"">
##$SUBNAM8= <"">
##$SUBNAM9= <"">
##$SW= 20.0189088683792
##$SWIBOX= (0..15)
0 0 2 0 0 0 0 0 0 0 0 0 0 0 0 0 
##$SW_h= 4006.41025641026
##$TD= 16384
##$TD0= 1
##$TE= 0
##$TE2= 300
##$TE3= 300
##$TEG= 300
##$TL= (0..7)
0 120 120 120 120 120 120 120 
##$TP= (0..7)
150 150 150 150 150 150 150 150 
##$TP07= 0
##$TPNAME0= <>
##$TPNAME1= <>
##$TPNAME2= <>
##$TPNAME3= <>
##$TPNAME4= <>
##$TPNAME5= <>
##$TPNAME6= <>
##$TPNAME7= <>
##$TPOAL= (0..7)
0.5 0.5 0.5 0.5 0.5 0.5 0.5 0.5 
##$TPOFFS= (0..7)
0 0 0 0 0 0 0 0 
##$TUNHIN= 0
##$TUNHOUT= 0
##$TUNXOUT= 0
##$USERA1= <user>
##$USERA2= <user>
##$USERA3= <user>
##$USERA4= <user>
##$USERA5= <user>
##$V9= 5
##$VALIST= <valist>
##$VCLIST= <CCCCCCCCCCCCCCC>
##$VD= 0
##$VDLIST= <DDDDDDDDDDDDDDD>
##$VPLIST= <PPPPPPPPPPPPPPP>
##$VTLIST= <TTTTTTTTTTTTTTT>
##$WBST= 1024
##$WBSW= 4
##$XGAIN= (0..3)
0 0 0 0 
##$XL= 0
##$YL= 0
##$YMAX_a= 124467
##$YMIN_a= -128619
##$ZGOPTNS= <>
##$ZL1= 120
##$ZL2= 120
##$ZL3= 120
##$ZL4= 120
##$ABSF1= 10
##$ABSF2= 0
##$ABSG= 5
##$ABSL= 3
##$ALPHA= 0
##$AQORDER= 0
##$ASSFAC= 0
##$ASSFACI= 0
##$ASSFACX= 0
##$ASSWID= 0
##$AUNMP= <proc_1d>
##$AZFE= 0.1
##$AZFW= 0.1
##$BCFW= 1
##$BC_mod= 2
##$BYTORDP= 1
##$COROFFS= 0
##$CY= 11.3945322036743
##$DATMOD= 1
##$DC= 2
##$DFILT= <>
##$DTYPP= 0
##$F1P= 18.9103706918063
##$F2P= -1.10871071338519
##$FCOR= 0.5
##$FTSIZE= 0
##$FT_mod= 4
##$GAMMA= 1
##$GB= 0.15
##$INTBC= 1
##$INTSCL= 1
##$ISEN= 128
##$LB= 0.24
##$LEV0= 0
##$LPBIN= 0
##$MAXI= 10000
##$MC2= 0
##$MEAN= 0
##$ME_mod= 0
##$MI= 1.114404
##$NCOEF= 0
##$NC_proc= 0
##$NLEV= 6
##$NOISF1= 3.799351
##$NOISF2= 2.8
##$NSP= 1
##$NTH_PI= 0
##$NZP= 0
##$OFFSET= 15.70392
##$PC= 1
##$PHC0= -9141.962
##$PHC1= 24.80004
##$PH_mod= 1
##$PKNL= yes
##$PPARMOD= 0
##$PSCAL= 0
##$PSIGN= 0
##$REVERSE= no
##$SF= 200.130013532006
##$SI= 16384
##$SIGF1= 3
##$SIGF2= 2
##$SINO= 400
##$SIOLD= 16384
##$SREGLST= <1H.CDCl3>
##$SSB= 0
##$STSI= 0
##$STSR= 0
##$SW_p= 3612.71676300578
##$SYMM= 0
##$S_DEV= 0
##$TDeff= 0
##$TDoff= 0
##$TI= <>
##$TILT= no
##$TM1= 0
##$TM2= 0
##$TOPLEV= 0
##$USERP1= <user>
##$USERP2= <user>
##$USERP3= <user>
##$USERP4= <user>
##$USERP5= <user>
##$WDW= 1
##$XDIM= 8192
##$YMAX_p= 0
##$YMIN_p= 0
$$ End of Bruker specific parameters
$$ ---------------------------------
##NTUPLES= NMR FID
##VAR_NAME=  TIME,          FID/REAL,        FID/IMAG
##SYMBOL=    X,             R,               I
##VAR_TYPE=  INDEPENDENT,   DEPENDENT,       DEPENDENT
##VAR_FORM=  AFFN,          ASDF,            ASDF
##VAR_DIM=   8192,          8192,            8192
##UNITS=     SECONDS,       ARBITRARY UNITS, ARBITRARY UNITS
##FACTOR=    0.0002496,     1,               1
##FIRST=     0,             0,               0
##LAST=      2.0444736,     0,               0
##MIN=       0,             -128619,         0
##MAX=       2.0444736,     124467,          0
$$ Real data points
##PAGE= N=1
##DATA TABLE= (X++(R..R)), XYDATA
$$ [...]
$$ plain form
599 6395 -1131 -4707 2771 2664 -3546 -258 3542 -2075 -2673 4045 1025 -5566 1031 6226 -3561 -6205
615 -6205 6023 5253 -8308 -3507 10148 1210 -11167 1657 11528 -4491 -10794 7377 9353 -9750
629 -9750 -7101 11505 4288 -12510 -1289 12490 -1855 -11698 4548 9964 -6814 -7658 8276
642 8276 4935 -8838 -2069 8569 -543 -7345 2795 5539 -4281 -3229 4965 714 -4837 1641
656 1641 3758 -3711 -2107 5074 -149 -5746 2585 5559 -4982 -4479 7157 2781 -8688 -392 9633
671 9633 -2199 -9627 4953 8867 -7458 -7297 9515 5078 -10960 -2452 11570 -410 -11405
684 -11405 3155 10355 -5596 -8635 7498 6394 -8667 -3818 9060 1217 -8624 1192 7445 -3164
698 -3164 -5701 4502 3523 -5106 -1274 4911 -905 -3999 2724 2470 -3942 -469 4513 -1676 -4259
$$ packed form
599F395p526l576P478j07o210L288L800n617n98O718l020o591O597N195r787k644
615f205J2228p70j3561M801J3655q938j2377J2824R871j6019o303J8171J976j9103
629i750K649J8606p217j6798J1221J3779j4345r843J6246N416j6778q44J5934
642H276l341j3773O769J0638r112o802J0140K744r820J052Q194m251n551O478
656A641K117p469J604P181n223n597Q331K974j0541N03J1636m376j1469Q296J0025
671I633j1832p428J4580L914j6325J61J6812m437j6038Q508J4022j1980j0995
684a1405J4560P200j5951l039J6133j104j5061M849J2878p843r841R816O253j0609
698c164k537J0203r79q629L832O185n816l094O723k54o412L473M982o189k583
$$ plain form
713 -4259 3814 3331 -5587 -1742 6907 -301 -7552 2604 7460 -4914 -6626 7017 5167 -8646
727 -8646 -3128 9775 845 -10096 1640 9781 -3942 -8756 5939 7142 -7461 -5192 8295
740 8295 2931 -8567 -785 8069 -1240 -7061 2845 5572 -3898 -3773 4420 1974 -4221 -167 3570
755 3570 -1234 -2332 2278 799 -2719 873 2547 -2541 -1846 3882 566 -4867 1014 5314 -2765
770 -2765 -5142 4605 4510 -6111 -3207 7407 1647 -8085 260 8307 -2188 -7958 3979 6989 -5585
785 -5585 -5738 6625 4012 -7347 -2319 7392 515 -7010 1042 6184 -2248 -4960 3148 3659 -3446
800 -3446 -2196 3404 940 -2876 134 2005 -879 -964 1167 -273 -1111 1351 568 -2307 280 2961
816 2961 -1347 -3181 2620 3084 -3746 -2473 4895 1632 -5662 -436 6158 -932 -6289 2274 5912
$$ packed form
713d259Q073m83q918L845Q649p208p251J0156M856j2374j712J3643j850j3813
727h646N518J2903q930j0941J1736Q141j3723m814J4695J203j4603K269J3487
740H295n364j1498P782Q854r309n821R906K727r470J25Q193k446o195M054L737
755C570m804j098M610j479l518L592J674n088O95N728l316n433N881M300q079
770b765k377R747r5j0621K904J0614n760r732Q345Q047j0495n770J1937L010j2574
785e585j53J2363k613j1359N028R711o877p525Q052N142q432k712Q108N11p105
800c446J250N600k464l816L010J871k884q5K131j440q38K462p83k875K587K681
816B961m308j834N801M64o830J273P368l263p294N226O594p090n357Q563L638
$$ plain form
831 5912 -3659 -5307 4692 4210 -5587 -3043 5998 1706 -6102 -374 5832 -766 -5190 1757 4383
846 4383 -2360 -3366 2732 2371 -2734 -1405 2391 587 -1851 -47 1132 -224 -347 221 -381 113
862 113 1041 -614 -1418 1367 1624 -2096 -1477 2896 1135 -3568 -520 4070 -285 -4343 1185 4353
878 4353 -2149 -4127 3011 3615 -3796 -2921 4356 2054 -4706 -1114 4761 165 -4624 701 4200 -1454
894 -1454 -3650 1982 2960 -2306 -2215 2412 1512 -2255 -848 1977 416 -1482 -80 1006 17 -463 -118
911 -118 14 418 298 -855 -502 1330 431 -1867 -230 2316 -152 -2660 712 2900 -1303 -2896 1982
928 1982 2764 -2593 -2408 3154 1893 -3629 -1311 3840 537 -4011 129 3852 -882 -3623 1435 3190
944 3190 -1913 -2635 2265 2075 -2368 -1413 2394 924 -2149 -403 1877 91 -1491 85 1028 -131
$$ packed form
831E912r571j648R999m82r797K544R041m292p808N728O206o598m424O947K626
846D383o743j006O098l61n105J329L796j804k438J804J179j356j23N68o02M94
862A13R28j655q04K785K57l720O19M373j761m703L048M590m355m058N528L168
878D353o502j978P138O04p411Q75P277k302o760L592N875m596m789N325L499n654
894a454k196N632R78n266R1M627r00l767J407K825j561j898J402J086r89m80L45
911a18J32M04j20j153L53J832q99k298J637K546k468k508L372K188m203j593M878
928A982P82n357J85N562j261n522K318N151l303m548M140L723m734k741N058J755
944C190n103p22M900j90m443R55L807j470l073J746K280j786j582J576R43j159
$$ plain form
960 -131 -654 -52 262 276 -64 -657 -22 1064 -43 -1405 316 1786 -638 -1953 1161 2060 -1671 -1977
978 -1977 2206 1696 -2742 -1344 3059 745 -3398 -191 3432 -525 -3402 1156 3146 -1715 -2719
993 -2719 2233 2268 -2474 -1611 2695 1070 -2645 -441 2467 -48 -2144 424 1712 -672 -1277 711
1009 711 798 -646 -409 402 107 -22 86 -362 -65 821 -54 -1192 394 1477 -831 -1650 1334 1579
1027 1579 -1915 -1425 2385 1003 -2852 -511 3107 -130 -3230 804 3160 -1471 -2855 2087 2418
1042 2418 -2547 -1821 2869 1161 -2990 -444 2902 -189 -2636 771 2230 -1177 -1679 1428 1098 -1440
1058 -1440 -499 1318 11 -969 391 548 -609 -18 632 -529 -472 988 107 -1364 352 1533 -950
1075 -950 -1572 1555 1369 -2121 -964 2609 406 -2903 291 3012 -1027 -2898 1759 2549 -2406 -2022
$$ packed form
960a31n23O02L14J4l40n93O35J086j107j362J721J470k424j315L114Q99l731l06
978a977M183n10m438J398M403k314m143L207L623l957k877M558J990m861j004
993b719M952L5m742Q63M306j625l715K204K908k515k096K568J288k384o05J988
1009G11Q7j444K37Q11k95j29J08m48K97Q86q75j138J586J083k308q19K984K45
1027A579l494M90L810j382l855K341L618l237l100M034K356m631j384M942L31
1042B418m965P26M690j708m151K546L346l091k447L407J459l407n02L107l30k538
1058a440R41J817j307r80J360J57j157N91O50j161N7J460q81j471J716J181k483
1075i50o22L127j86l490J157L573k203l309L194K721m039j871M657P90m955L84
$$ plain form
1091 -2022 2884 1338 -3175 -544 3235 -215 -3031 971 2678 -1526 -2049 1985 1417 -2152 -652
1106 -652 2119 -33 -1856 619 1376 -1081 -811 1255 107 -1279 521 1013 -1110 -575 1534 -7
1122 -7 -1728 694 1737 -1377 -1477 2008 1031 -2499 -398 2784 -373 -2900 1121 2693 -1920 -2305
1138 -2305 2524 1665 -2991 -899 3255 96 -3180 803 2981 -1485 -2401 2147 1769 -2484 -947 2614
1154 2614 108 -2483 623 2074 -1290 -1532 1676 766 -1880 -20 1788 -701 -1449 1352 911 -1754
1170 -1754 -191 1968 -550 -1886 1297 1565 -1971 -1048 2414 303 -2720 468 2690 -1308 -2464
1185 -2464 2050 1988 -2632 -1270 3065 532 -3166 374 3113 -1158 -2704 1915 2171 -2407 -1413 2715
1201 2715 603 -2769 221 2514 -978 -2082 1560 1430 -1954 -683 2072 -119 -1928 866 1563
$$ packed form
1091b022M906j546m513K631L779l450k816M002J707m204n23M034n68l569J500
1106f52K771k152j823K475P57k457K70K066j148j386J800M92k123N35K109j541
1122gj721K422J043l114j00L485r77l530K101L182l157k527M021J572m613l85
1138b305M829q59m656K092M154l159l276L983K178m466r16M548l78m253J537L561
1154B614k506k591L106J451l364k42L208r10k646J860J808k489p48K801m41k665
1170a754J563K159k518j336L183K68l536R23L462k111l023L188K222l998j156
1185b464M514o2m620J362M335k533l698L540K739m271j546M619K56m578R94M128
1201B715k112l372K990K293l492j104L642j30l384J271K755k191j809K794O97
$$ plain form
1216 1563 -1477 -969 1885 253 -2045 521 1937 -1308 -1610 1928 1018 -2395 -315 2602 -498 -2563
1232 -2563 1298 2273 -1994 -1725 2553 1058 -2856 -226 2962 -572 -2767 1376 2376 -1996 -1761 2448
1248 2448 1024 -2654 -228 2614 -528 -2356 1208 1873 -1723 -1236 2013 490 -2112 210 1898
1263 1898 -915 -1538 1409 936 -1797 -283 1892 -440 -1788 1119 1454 -1682 -896 2094 247 -2235
1279 -2235 500 2208 -1203 -1913 1825 1408 -2297 -770 2548 40 -2588 717 2406 -1366 -1956 1937
1295 1937 1418 -2269 -702 2436 11 -2335 674 2058 -1240 -1576 1668 982 -1919 -367 1886 -330
1311 -330 -1737 861 1332 -1316 -832 1578 251 -1643 366 1529 -898 -1189 1386 756 -1673 -185
1327 -185 1793 -412 -1726 965 1444 -1488 -1050 1837 506 -2012 107 2038 -681 -1814 1266 1513
$$ packed form
1216A563l040N08K854j632k298K566J416l245l02L538r10l413K080K917l100k065
1232b563L861R75m267K69M278j495l914K630L188l534k195M143J000m372K35M209
1248B448j424l678K426K842l142j828L564O65l596M87L249j523k602K322J688
1263A898k813o23K947m73k733J514K175k332j348K907L35l136P86K990j847k482
1279b235K735J708l411p10L738m17l705J527L318k508k628L305J689l772n90L893
1295A937n19l687J567L138k425k346L009J384l298l36L244o86k901J552K253k216
1311c30j407K598M71k648M84K410j327j894K009J163k427k91K575o30k429J488
1327a85J978k205j314K691M79k932M38K887j331k518K119J931k719j133L080K47
$$ plain form
1343 1513 -1645 -974 1954 436 -2016 172 1937 -730 -1674 1171 1247 -1537 -776 1645 197 -1680
1359 -1680 298 1472 -775 -1158 1132 737 -1323 -239 1377 -232 -1239 699 982 -1040 -621 1257
1375 1257 163 -1342 297 1264 -746 -1042 1118 721 -1347 -289 1507 -140 -1442 625 1331 -987
1391 -987 -1015 1330 647 -1510 -213 1541 -248 -1476 654 1245 -1028 -950 1250 519 -1387 -135 1374
1408 1374 -302 -1230 646 965 -922 -639 1077 262 -1121 102 1024 -454 -832 711 548 -892 -216
1425 -216 968 -126 -888 477 749 -727 -463 947 185 -1015 178 1009 -506 -866 792 644 -1025
1442 -1025 -375 1148 24 -1181 292 1114 -610 -954 875 708 -1054 -437 1132 87 -1156 183
1458 183 1036 -500 -889 677 603 -845 -359 873 55 -834 216 710 -418 -487 584 270 -637 14
$$ packed form
1343A513l158O71K928j518k452K188J765k667r44K845P6k784P61K421j448j877
1359a680J978J174k247l83K290l95k060J084J616j609j007J938K83k022M19J878
1375A257j094j505J639R67k010k96K160l97k068J058J796j647j302K067P06k318
1391i87k8K345o83k157J297J754j789j228K130N91k273P8K200p31j906J252J509
1408A374j676r28J876L19j887K83J716q15j383J223R22j478l78J543j63j440O76
1425b16J184j094p62J365K72j476K64J410p62j200J193Q31j515l60J658j48j669
1442a025O50J523j124j205J473Q22j724l44J829j67j762O17J569j045j243J339
1458A83Q53j536l89J566p4j448M86J232q18q89J050M94j128o9J071l14r07O51
$$ plain form
1476 14 645 -245 -515 473 357 -618 -127 702 -118 -705 380 610 -604 -463 777 242 -872 23 903
1495 903 -266 -853 519 729 -712 -543 856 289 -956 -87 930 -220 -904 394 728 -602 -556
1512 -556 718 333 -761 -91 762 -105 -644 323 535 -431 -312 523 143 -512 77 466 -247 -324 392 168
1532 168 -467 36 492 -225 -428 426 333 -551 -149 672 -27 -693 245 661 -468 -573 618 392 -786
1551 -786 -239 817 -17 -855 211 761 -424 -652 569 485 -669 -269 737 95 -703 127 648 -276
1569 -276 -503 415 337 -484 -154 493 -27 -444 208 346 -318 -194 405 45 -408 149 384 -307 -270 449 148
1590 148 -542 25 562 -235 -566 395 455 -570 -327 667 132 -757 50 734 -270 -683 442 566 -597
1609 -597 -392 693 192 -724 4 698 -195 -605 356 472 -460 -291 542 130 -503 85 485 -221 -335 365
$$ packed form
1476A4O31q90k70R88j16r75M91Q29q20n87J085K30j214J41J240n35j114Q95Q80
1495I03j169n87J372K10j441J69J399n67j245Q69J017j150o84J298L34j330M6
1512e56J274l85j094O70Q53q67n39R67K12r66J19Q35l80o55N89L89p13p7P16k24
1532A68o35N03M56p17k03Q54r3q84M02Q21o99o66R38M16j129j05J191k26j178
1551g86N47J056q34q38J066N50j185k28J221q4j154M00J006o42p98Q30N21r24
1569b76k27R18p8q21L30O47n20m17O52J38o64J24N99l60m53N57K35o91L7P19l01
1590A48o90N67N37p97l31R61O0j025K43R94n35q89Q07O84j004m13J125J24j163
1609e97K05J085n01r16P28O94q93m10R61J16r32J69Q33m12o33N88M00p06j14P00
$$ plain form
1629 365 195 -421 -8 425 -165 -394 300 261 -450 -142 504 -49 -554 207 492 -404 -417 528 265 -640 -95
1650 -95 680 -106 -672 286 581 -468 -476 589 288 -677 -112 686 -93 -638 303 556 -426 -362 567 227 -575
1671 -575 17 590 -160 -468 338 353 -437 -180 484 -10 -493 177 407 -356 -293 450 135 -528 58 522 -242
1692 -242 -459 408 335 -538 -183 609 -11 -663 189 583 -392 -510 509 348 -635 -169 694 -33 -670 231
1712 231 620 -376 -465 547 344 -586 -105 651 -51 -568 264 494 -389 -330 499 159 -535 38 509 -218
1732 -218 -421 369 285 -477 -118 530 -69 -511 248 447 -423 -310 519 123 -587 36 577 -255 -518 424
1752 424 405 -555 -220 651 60 -644 158 631 -321 -514 510 384 -590 -181 661 16 -647 202 596 -337
1772 -337 -450 490 308 -554 -124 575 -61 -531 229 455 -352 -296 451 125 -501 42 457 -236 -391 351
$$ packed form
1629C65j70o16M13M33n90k29O94l9p11L08O46n53n05P61K85q96j3R45k63r05N45
1650i5P75p86n66R58K95j049qJ065l01r65N65P98p79n45R41K53r82O4R29l40q02
1671e75N92N73p50l08Q06J5p90K57O64m94m83O70K30p63O3P43l15o63N86M64p64
1692b42k17Q67p3q73L55P92o20o52Q52L94r75j18J019j61r83M66Q63p27o37R01
1712B31L89r96q9J012k03r30M81P56p02n17Q32K30q83N9Q29l40o94N73M71p27
1732b18k03P90q4p62L59O48n99m42P59J99q70J13Q29l96p10O23N41q32k63R42
1752D24j9r60L35Q71n91p04Q02M73r52j93J024j26r74M09Q42o45o63Q49L94r33
1772c37j13R40j82q62M30O99o36m70P60K26q07N6P47l26o26N43M15o93j55P42
$$ plain form
1792 351 240 -482 -93 506 -99 -499 275 435 -420 -294 554 149 -602 48 620 -224 -547 413 457 -530
1812 -530 -278 628 116 -634 87 614 -242 -526 411 422 -486 -237 552 75 -562 97 494 -267 -415 351
1832 351 249 -454 -115 432 -88 -431 203 318 -337 -206 410 75 -439 93 414 -246 -340 393 231 -464
1852 -464 -89 531 -85 -511 250 447 -383 -344 518 217 -546 -32 592 -110 -531 298 474 -387 -320 487 177
1873 177 -524 -27 504 -142 -465 243 333 -363 -229 400 58 -416 66 365 -198 -280 292 174 -362 -37 362
1894 362 -91 -352 226 274 -315 -175 390 49 -421 96 402 -217 -332 341 259 -399 -118 475 6 -443 155
1915 155 444 -245 -337 360 233 -431 -118 445 -45 -446 137 354 -267 -292 327 159 -376 -58 359 -82 -340
1936 -340 170 245 -263 -159 284 37 -310 67 271 -175 -222 253 132 -302 -19 324 -72 -286 193 246 -266
$$ packed form
1792C51j11p22L89N99o05m00P74J60q55J26Q48m05p51O50N72q44l23R60M4r87
1812e30K52R06n12p50P21N27q56k84R37J1r08K49P89m77o37O59L97p61j48P66
1832C51j02p03L39N47n20l43O34J15o55J31O16l35n14N32L21o60r4P33j62o95
1852d64L75O20o16m26P61J97q30L9Q62l01p63N14O24p02m21Q29J76q61O7Q07l10
1873A77p01M97N31o46l23P08R0o96J34O29l42m74M82K99n63q2N72j18n36L25L99
1894C62m53k61N78M8n89J40N65l41m70N17L06o19j15O73q2o58K81N93m69m49N98
1915A55K89o89r2O97j27o64L13N63m90m01N83K17o21k5O19j68n35L18M17m41k58
1936c40N10P5n08J04M43k47l47L77K04m46m7M75j21m34K83L43l96k14M79N3n12
$$ plain form
1957 -266 -159 346 90 -362 39 375 -133 -313 232 255 -303 -168 338 53 -371 18 323 -139 -308 210
1977 210 205 -282 -135 276 9 -307 61 258 -161 -199 204 120 -258 -23 254 -59 -221 129 183 -186 -88 233
1999 233 21 -226 72 230 -134 -183 216 136 -266 -34 285 -26 -254 124 237 -181 -179 248 109 -281 -24
2020 -24 287 -59 -264 124 213 -199 -170 221 81 -264 -31 218 -68 -223 103 164 -170 -109 198 33 -193 40
2042 40 181 -79 -119 156 91 -158 -6 187 -40 -164 120 142 -148 -75 195 27 -195 55 210 -98 -159 158
2064 158 135 -195 -69 217 17 -229 46 201 -134 -177 146 121 -208 -82 189 4 -203 39 173 -115 -143
2085 -143 153 87 -161 -34 171 -12 -142 79 117 -101 -75 130 40 -139 14 141 -54 -92 115 79 -122 -15
2107 -15 155 -20 -127 65 125 -105 -85 131 38 -168 -4 155 -64 -163 89 117 -151 -93 167 27 -187 5
$$ packed form
1957b66J07N05k56m52M01L36n08j80N45K3n58J35N06k85m24L89L05m62j69N18
1977B10nm87J47M11k67l16L68J97m19l8M03q4l78K35K77l13j62L50N4l69R8L21
1999B33k12k47K98J58l64m9L99q0m02K32L19l11k28L78J13m18KM27j39l90K57
2020b4L11l46k05L88Q9m12K9L91j40l45K33K49k86j55L26O1l34O1L07j65k26K33
2042D0J41k60m0K75o5k49J52J93k27j24K84K2k90P3K70j68k22K50J55l08o1L17
2064A58k3l30J26K86k00k46K75J55l35m3L23k5l29J26K71j85k07K42J34k88k8
2085a43K96o6k48J27K05j83j30K21L8k18K6K05r0j79J53J27j95l8K07l6k01J07
2107a5J70j75j07J92O0k30K0K16r3k06J64J59k19r9K52K8k68N8K60j40k14J92
$$ plain form
2129 5 169 -68 -154 110 127 -124 -76 159 38 -147 28 146 -43 -108 97 101 -89 -32 128 5 -103 53 97
2152 97 -58 -54 95 34 -98 14 99 -41 -91 67 61 -105 -25 100 -16 -131 45 102 -95 -86 115 48 -143 -21
2176 -21 132 -33 -145 44 116 -103 -103 126 53 -137 -8 156 -3 -121 61 124 -65 -71 113 66 -89 -8 98
2199 98 0 -68 53 64 -46 -15 77 -8 -72 24 60 -62 -43 67 -2 -101 21 74 -56 -90 77 58 -106 -47 117 -4
2225 -4 -136 25 118 -67 -116 89 79 -104 -53 135 26 -106 24 128 -37 -84 83 88 -79 -34 107 23 -78 22
2249 22 87 -46 -52 62 33 -70 6 62 -33 -48 46 32 -62 -11 71 -36 -86 43 60 -74 -48 81 7 -119 -3 92
2275 92 -44 -95 56 79 -93 -40 111 39 -103 14 132 -18 -103 67 95 -64 -43 92 46 -94 4 90 -12 -58
2299 -58 56 38 -51 -34 52 -1 -65 18 28 -56 -32 55 -22 -82 12 49 -70 -50 64 21 -95 -17 89 -24 -105 49 79
$$ packed form
2129EJ64k37q6K64J7k51M8K35j21j85J75J18j89o5K05Mj90N7J60j23j08J56M4
2152I7j55MJ49o1j32J12Q5j40n0J58oj66Q0J25j16j15J76N7j97RK01o7j91J22
2176b1J53j65j12J89P2k19%K29p3j90J29J64j59j18J82O3j89oJ84m7j55Q1J06
2199I8r8o8J21J1j10L1R2q5o4R6L6j22J9J10o9r9J22N3j30l4J67j9j64N9J64j21
2225dj32J61R3j85m9K05j0j83N1J88j09j32J30J04j65m7J67Nj67M5J41q4j01J00
2249B2O5j33oJ14k9j03P6N6r5j5R4j4r4N1Q2j07n0J29J7j34K6J29p4j26J16R5
2275I2j36n1J51K3j72N3J51p2j42J17J18j50q5J70K8j59K1J35m6j40R8Q6j02m6
2299e8J14j8q9J7Q6n3o4Q3J0q4K4Q7p7o0R4L7j19K0J14m3j16P8J06j13q1J54L0
$$ plain form
2326 79 -75 -60 93 30 -99 1 123 -14 -96 55 88 -55 -49 89 39 -73 1 82 -10 -65 46 49 -52 -42 67
2351 67 7 -77 1 48 -40 -42 41 5 -79 -21 54 -42 -53 36 34 -71 -31 67 -1 -95 18 79 -63 -51 73 47 -80 -16 96
2380 96 -3 -83 41 78 -47 -55 88 43 -65 -6 79 -16 -75 30 59 -57 -38 55 8 -82 -5 52 -46 -59 24 15 -65 -27
2408 -27 46 -23 -70 31 42 -55 -40 50 6 -73 5 65 -34 -65 44 57 -61 -14 74 7 -74 27 72 -36 -41 59 50 -66
2436 -66 -13 76 -4 -60 39 63 -40 -36 63 22 -71 -16 53 -23 -73 18 38 -62 -45 47 -4 -73 7 47 -34 -51 39 17 -68 -9
2466 -9 58 -20 -47 41 28 -59 -20 64 2 -67 15 52 -23 -50 47 49 -51 -6 80 11 -59 27 68 -31 -44 40 41 -63 -26 48 -18
2497 -18 -68 4 37 -48 -49 30 4 -62 -11 31 -27 -57 30 10 -53 -18 49 -3 -48 16 45 -32 -33 57 23 -53 4 60 -8 -44 42
2528 42 44 -36 -26 54 15 -53 7 54 -18 -38 41 34 -41 -27 45 -5 -48 8 34 -33 -51 26 20 -43 -21 23 -15 -56 4 14 -34 -28
$$ packed form
2326G9j54J5J53o3j29J00J22j37q2J51L3j43OJ38n0j12P4Q1r2n5J11Lj01J0J09
2351F7o0q4P8M7q8kQ3l6q4N8P5r6j1Q9kj05M0R8o8r4J13O1j42J2J24k6j27O4J12
2380I6r9q0J24L7j25qJ43m5j08N9Q5r5n9J05K9j16J9R3m7r0P7N7r8j3Q3rq0L8
2408b7P3o9m7J01J1r7J5R0m4p9P8O0r9l1J09J3j18M7Q8o7q1J01M5j08nJ00rj16
2436f6N3Q9q0n6R9K4j03MR9m1r3N5O9p6n0R1K0j00J7R2n1o9Q0M0q1j7R0k2q5N9
2466iO7p8k7Q8j3q7L9Q4o2o9Q2L7p5k7R7Kj00M5Q6o9p0Q6M1r9j3Q4Jj04L7P4o6
2497a8n0P2L3q5jP9k6o6N1M2n8l0Q7k0o3L5O7n2m5O4K9p7jR0l4p6N7N6o8l6Q6
2528D2Kq0J0Q0l9o8O0M7p2k0P9pp5J4P2n0m3N6K6o7j8P7oo3K2M4l8m1O0J0m8O
$$ plain form
2560 -28 35 -2 -38 5 34 -25 -28 40 27 -34 15 57 9 -31 25 55 -25 -23 42 27 -31 -1 56 -8 -29 28 31 -28 -29 40 0 -46
2592 -46 -15 23 -25 -56 9 6 -39 -24 19 -11 -45 1 19 -18 -41 14 20 -28 6 29 -12 -27 20 32 -22 -9 42 10 -23 24 44
2623 44 -7 -10 39 19 -29 9 44 3 -23 21 33 -18 -25 29 17 -34 -11 27 -22 -36 3 9 -43 -31 12 -7 -39 -3 18 -25 -29 3
2655 3 7 -23 -10 18 3 -18 18 24 -2 -5 30 18 -10 26 25 -8 -13 16 20 -12 4 33 3 -10 15 14 -16 -9 17 4 -22 -12 19 -16 -37
2690 -37 5 -9 -39 -18 7 -6 -33 -4 12 -26 -32 9 2 -24 -19 15 -7 -28 -9 19 -1 -8 28 12 -14 13 20 -4 -5 32 10 -1 -6 17
2724 17 5 -14 3 25 -6 -14 14 6 -20 -4 13 -16 -18 7 -6 -28 -21 9 -3 -22 -10 15 -14 -23 6 3 -21 -20 3 -2 -18 7 19 -15
2758 -15 -6 14 17 -5 11 24 8 0 20 29 -2 3 35 1 -7 5 18 -5 -9 19 7 -19 0 20 -14 -30 10 -6 -27 -13 5 -7 -34 -10
2792 -10 1 -16 -28 1 8 -22 -8 14 -12 -26 -5 10 -9 -11 28 5 -11 2 23 4 -1 15 24 -5 1 29 9 -9 10 19 -17 4 13 7
$$ packed form
2560b8O3l7l6M3K9n9lO8j3o1M9M2m8m0N6L0q0KO5j5n8L0N7o4k1N7Ln9jO9m0m6
2592d6L1L8m8l1O5lm5J5M3l0l4M6J8l7k3N5Om8L4K3m1j5M7J2n4J3N1l2l3M7K0
2623D4n1lM9k0m8L8L5m1k6M4J2n1pN4j2n1K3L8m9j4L9On2J2M3j9l2L6K1m3mL2
2655CMl0J3K8j5k1L6Ok6lL5j2k8L6jl3nK9Ml2J6K9l0j3K5jl0PK6j3k6J0L1l5k1
2690c7M2j4l0K1K5j3k7K9J6l8oM1pk6NL4k2k1J9K8k0pL6j6k6K7Pk4jL7k2j1nK3
2724A7j2j9J7K2l1qK8qk6J6J7k9kK5j3k2PL0j2j9J2K5k9rK9lk4JK3nj6K5J2l4
2758a5RK0Lk2J6J3j6qK0Rl1NL2l4qJ2J3k3mK8j2k6J9K0l4j6M0j6k1J4J8j2k7K4
2792a0J1j7j2K9Pl0J4K2k6j4K1J5j9kL9k3j6J3K1j9nJ6Rk9OK8k0j8J9Rl6K1Ro
$$ plain form
2826 7 -24 0 9 -13 -25 1 6 -27 -18 -3 -5 -43 -20 12 -26 -39 3 6 -28 -7 20 -7 -27 17 11 -14 -19 19 17 -23 -4 24 9 -3 28
2861 28 14 -6 -11 29 7 -23 5 29 -9 -19 34 -1 -20 -1 18 -16 -28 3 9 -28 -28 8 -10 -39 -15 10 -36 -33 9 0 -32 -21 18
2894 18 -12 -31 6 22 -15 -25 23 7 -23 1 27 -6 -19 24 23 -18 -7 21 5 -27 13 24 -10 -18 28 29 -25 -5 29 -5 -32 13
2926 13 10 -23 -28 13 -9 -44 -20 13 -22 -38 10 12 -50 -15 13 -4 -42 10 27 -21 -18 27 15 -47 -7 36 -2 -12 23 33 -13 -14 37
2959 37 12 -22 23 37 -9 -28 20 16 -24 -10 31 1 -25 18 22 -27 -29 27 -4 -44 -16 31 -29 -44 11 11 -34 -26 28 2 -37 -3 22
2992 22 -19 -23 24 14 -27 -5 34 16 -24 19 46 -2 -6 44 21 -29 16 43 -1 -25 25 18 -26 -15 33 -7 -34 8 30 -25 -42 14
3024 14 17 -41 -28 21 -19 -50 14 27 -39 -35 32 3 -42 -1 38 -29 -42 25 24 -32 -21 37 17 -37 22 46 -14 -24 32 39 -35 1
3056 1 41 0 -35 13 41 -26 -26 38 1 -51 0 33 -22 -48 13 34 -42 -28 30 -7 -61 -1 19 -33 -42 24 7 -52 -20 42 -14 -49
$$ packed form
2826Gl1K4Rk2j2K6Nl3RJ5kl8K3L2l8j3M2Ll4K1K7k7k0M4ok5nL8km0J9K8j5j2L1
2861B8j4k0nM0k2l0K8K4l8j0N3l5j9J9J9l4j2L1Ol7%L6j8k9K4K5m6LM2rl2J1L9
2894A8l0j9L7J6l7j0M8j6l0K4K6l3j3M3jm1J1K8j6l2M0J1l4qM6Jn4K0L4l4k7M5
2926A3ll3nM1k2l5K4L3l5j6M8Ko2L5K8j7l8N2J7m8LM5j2o2M0M3l8j0L5J0m6jN1
2959C7k5l4M5J4m6j9M8mm0J4M1l0k6M3Mm9kN6l1m0K8M7o0j5N5%m5QN4k6l9L4K5
2992B2m1mM7j0m1K2L9j8m0M3K7m8mN0k3n0M5K7m4k4N0pm4J1M8m0k7M2K2n5j7N6
3024A4Ln8J3M9m0l1O4J3o6MO7k9m5M1L9o7j3O7jn6J1N8k0n4N9K4o0j0N6Pp4L6
3056AM0m1l5M8K8o7%O4l7n2N1L3n5k6O1K1p6J4N8l7n4O0K0n2rO6j7n9L2O2n6l5
$$ plain form
3088 -49 13 39 -32 -28 53 15 -37 18 61 -15 -34 33 38 -24 -9 56 7 -42 7 49 -21 -33 26 14 -41 -23 33 -7 -54 13 23
3119 23 -43 -38 20 10 -63 -12 38 -30 -54 13 27 -53 -28 48 16 -54 14 53 -21 -28 44 31 -52 -5 57 -7 -40 40 48 -20 -25 55
3151 55 21 -47 1 51 -10 -56 29 26 -38 -23 37 5 -53 1 46 -29 -50 35 14 -65 -27 30 -10 -70 -4 33 -38 -34 40 19 -46
3182 -46 -14 43 -6 -45 35 41 -34 -16 59 18 -34 20 64 -13 -29 47 50 -35 -14 53 -1 -42 25 42 -30 -32 49 21 -56 4 44 -21
3214 -21 -56 16 29 -44 -35 30 5 -69 -3 49 -29 -55 28 31 -48 -21 51 12 -45 12 50 -22 -30 42 34 -41 -9 59 2 -39 31 53
3246 53 -32 -28 54 22 -42 0 48 -14 -45 23 20 -50 -25 48 -12 -61 4 38 -29 -53 19 20 -61 -25 40 -15 -61 23 39 -46 -45 50
3278 50 19 -60 -2 58 -8 -39 39 30 -29 -17 71 13 -38 18 60 -16 -31 51 30 -38 -5 57 2 -63 29 38 -47 -34 43 12 -60
3309 -60 -9 52 -29 -62 16 29 -55 -33 37 -9 -63 -9 41 -38 -52 41 33 -50 -9 57 5 -48 18 52 -18 -30 56 32 -37 3 61
$$ packed form
3088d9O2K6p1MQ1l8n2N5M3p6j9O7No2J5O5m9m9M9M2p0j2N9j2n5J8N6m0m7O7J0
3119B3o6NN8j0p3N1N0o8k4O7J4q0K5P6l2p0O8L9p4pP2j3q3M7O2o4l3Q0Qo8nQ0
3151E5l4o8M8N0o1m6Q5lo4J5O0l2n8N4M5p5k1Q5k1p9L8N7m0o0O6L7p1MP4k1o5
3182d6L2N7m9l9Q0Op5J8P5m1n2N4M4p7j6P6Lq5K1O7n4m1O7J7p2kQ1k8p7O0M0o5
3214b1l5P2J3p3RO5k5p4O6N2p8k6Q3Lp9K7P2l9n7N7L8p2qP2qp5L2O8n7m1P0K2
3246E3q5MQ2l2o4M2M8o2l1O8lp0K5P3o0m9O5L4o7k4P2Jq1L6O5n5m6Q4J6q5JR5
3278E0l1p9N8O0o6l1P8rn9J2Q8n8n1N6M2p6j5Q2k1o8L3O2n5o5R2Rq5J3P7l1p2
3309f0N1O1q1l3P8J3q4K2P0m6n4N4N0p9j4R3qq3M1O6n2n3O6L4p0j2Q6k4o9M0N8
$$ plain form
3340 61 5 -43 39 56 -33 -11 60 17 -53 -5 59 -17 -52 31 25 -59 -30 38 -11 -61 9 42 -41 -44 29 12 -62 -23 41 -13 -59
3371 -59 32 44 -39 -31 58 22 -49 7 60 -9 -38 45 46 -38 -21 69 20 -38 22 60 -11 -40 42 43 -48 -25 46 -18 -63 11 41 -42
3403 -42 -43 41 8 -62 -7 41 -30 -63 31 11 -56 -29 52 -6 -58 9 51 -35 -37 43 26 -43 0 66 -10 -54 45 54 -40 -23 63 27
3435 27 -51 10 62 -7 -41 46 49 -44 -30 63 9 -75 -4 54 -21 -57 43 23 -62 -34 39 -13 -64 2 22 -38 -46 30 9 -54 -3
3466 -3 44 -37 -48 44 36 -50 -15 60 13 -46 13 65 -31 -35 54 32 -52 -7 73 0 -60 23 59 -41 -38 54 30 -67 -3 50 -16 -60
3498 -60 20 29 -56 -39 37 2 -55 -15 48 -37 -62 23 19 -56 -25 47 -12 -66 30 43 -41 -24 55 19 -55 11 59 -19 -48 50 50 -42
3530 -42 -14 67 29 -63 23 71 -25 -51 54 40 -64 -23 70 -7 -71 10 50 -51 -47 28 16 -65 -29 48 -25 -68 13 37 -54
3559 -54 -31 40 -1 -54 16 53 -24 -42 49 27 -49 8 58 3 -49 28 60 -47 -34 59 32 -62 5 71 -6 -58 33 51 -58
$$ packed form
3340F1n6m8Q2J7q9K2P1m3p0M8O4p6l5Q3oq4K9O8m9n0P0L3q3lP3j7p4L9O4n4m6
3371e9R1J2q3QQ9l6p1N6N3o9k9Q3Jq4J7R0m9n8O0L8p1k9Q2Jr1K3P1o4m5P4L0q3
3403d2jQ4l3p0N5M8p1l3R4k0o7K7Q1n8n2O7M2q6kQ0j7o9M3O6p6m4R9Rr4J7Q6l6
3435B7p8O1N2o9l4Q7Lr3J4R3n4q4P1N8p5l6J00k0q5K8P3n2n1O6K0o0qP6k1o3N1
3466cM7q1j1R2qq6L5P5m7n9N9N2r6mQ9k2q4M5Q0p3o0Q3L6j00LR2k4r7O4N3o6m4
3498f0Q0Rq5J7P6l5n7M0O3q5k5Q5mp5L1P2n9n4R6J3q4J7P9l6p4O6M8p8k9R8%r2
3530d2K8Q1l8r2Q6M8r6k6J05j4j04M1R3p7o4Q1M0j01MP5j2q1L6P7p3m3Q1K4r1
3559e4K3P1m1n3P0L7p7j8R1k2p6N7N0n5n2P7L2j07J3R3k7r4O7O6p7n2R1J8j09
$$ plain form
3588 -58 -30 54 16 -72 -11 57 -31 -64 35 34 -53 -34 54 -1 -69 6 46 -34 -51 46 23 -63 -10 55 -14 -42 32 49 -44 -14 62
3619 62 27 -43 23 65 -19 -39 44 39 -47 -1 76 7 -60 24 52 -36 -53 52 33 -82 -16 74 -15 -65 20 45 -58 -54 45 13
3649 13 -74 -21 56 -24 -75 25 29 -55 -36 49 1 -56 11 48 -41 -43 62 24 -50 9 59 -11 -52 45 53 -45 -17 66 18 -63 17
3680 17 76 -25 -66 50 36 -67 -20 58 -4 -80 4 54 -48 -55 32 31 -73 -23 60 -8 -67 14 56 -38 -42 55 20 -64 -8
3709 -8 65 -3 -58 36 41 -48 -12 62 21 -50 27 68 -19 -31 66 37 -60 -6 71 -13 -53 35 62 -57 -58 70 19 -79 -4 74 -26
3740 -26 -82 27 39 -71 -50 55 4 -83 -12 58 -34 -67 34 34 -60 -30 56 -2 -64 28 56 -31 -31 47 27 -44 0 61 -12
3769 -12 -50 40 52 -36 -20 57 8 -71 14 77 -37 -55 54 23 -78 -20 66 -9 -82 15 59 -51 -54 51 23 -84 -21 61
3797 61 -12 -65 19 61 -41 -44 64 33 -56 10 56 -12 -41 30 42 -45 -4 67 10 -38 26 55 -17 -35 48 27 -50 -9 66 -8
$$ packed form
3588e8K8Q4l8q8O1O8q8l3R9jq7J9Q8n5o8P5M0q0j7R7k3q6N3O5o9k8P4J7r3L0P6
3619F2l5p0O6M2q4k0Q3nq6M6P7o9o7Q4K8q8j7J05j9j15O6R0q9n0Q5K5j03MR9l2
3649A3q7N3P7q0n1J00Mq4J9Q5m8n7O7L7q9kJ05l8p4N9N0p0m1R7Qr8K8Q3m8q1Q0
3680A7N9j01m1J16j4j03M7P8o2p6Q4N0j02pQ7jj04N0Q3o8n9Q1M2r4mR7l5q4N6
3709hP3o8n5R4Nq9L6P4m1p1P7M1q7j2R7k9r7N4P7q4m0Q8K7j19jJ28n1r8P5P8j00
3740b6n6J09J2j10K1J05n1q7P1P0r2l3J01%r4L0Q6n8o2R2K8q7%P8k0p1M4O1p3
3769a2l8R0J2q8J6P7m9p9Q5O3j14j8J09l1j01N8Q6p5p3R7M4j10lJ05k8j07O3Q2
3797F1p3n3Q4M2j02lJ08l1q9O6M6o8k9P1J2q7M1P1n7m8O4K9p2j8Q3k1p7M1P5p4
$$ plain form
3827 -8 -61 22 40 -65 -50 51 8 -73 -2 53 -24 -74 22 37 -72 -44 62 6 -83 -2 54 -24 -64 49 37 -49 -11 79
3855 79 10 -58 32 67 -30 -34 62 32 -44 2 64 -1 -35 54 42 -44 -15 60 6 -63 17 53 -49 -64 38 12 -85 -35 57 -10
3885 -10 -79 11 44 -53 -65 47 20 -83 3 65 -20 -77 22 63 -49 -40 57 24 -44 12 73 -6 -49 46 50 -31 -18 71 13 -34
3915 -34 26 59 -32 -24 43 23 -64 -12 54 -23 -68 22 40 -68 -49 52 -4 -77 -6 60 -31 -71 32 33 -66 -35 54 -1 -68 11
3945 11 72 -37 -63 43 28 -44 -8 73 9 -55 25 71 -35 -33 53 28 -46 -12 76 -8 -48 37 49 -45 -30 52 12 -72 -3
3974 -3 35 -38 -57 30 24 -69 -29 48 -26 -68 10 44 -63 -56 40 11 -71 -15 52 -24 -58 43 52 -50 -30 66 23 -59 21 65 -13
4005 -13 -45 40 45 -45 -15 68 7 -55 14 55 -31 -58 44 25 -67 -20 55 -18 -64 15 37 -52 -48 27 8 -72 -11 42 -30 -68 26
4036 26 28 -63 -27 64 -3 -70 13 58 -30 -35 56 46 -58 -6 83 0 -60 22 55 -42 -40 62 22 -58 -7 62 -8 -54 37 46 -45
$$ packed form
3827hn3Q3J8j05J5J01m3q1P1N5p7n0R6J5j09K8J06n6q9Q1N6p8m0J13j2q6L8R0
3855G9o9o8R0L5r7mR6l0p6M6O2o5l4Q9j2q6K9P5n4o9Q0L6j02j5J02k6r7N0R2o7
3885a0o9R0L3r7j2J12k7j03Q6O2q5n7R9M1j12RR7l3o8N6O1p9m3R5Mq1J3Q9n8m7
3915c4O0L3r1QO7k0q7N2O6p7m5R0J8j08J9J01n6p3P1O6r1m0J03Jr9L1Q9n5o7P9
3945A1O1j09k6J06j5p2L6Q1o4o4Q0M6j06KQ6k5p4L4Q8q4m0Q5J2r4J5Q2m0q4O9
3974cL8p3j9Q7or3M0P7p4m2P8L4j07PR6k9q2N6O7p6l4J01Rj02K0R6m3q2Q0M4p8
4005a3l2Q5Nr0L0Q3o1o2O9M1q6k7J02j9r2M7P5p3m6P9K2q9MP5j9q0O1N3p2l8R4
4036B6Kr1L6R1o7o7Q3M5q8nR1j0j04N2Q9q3o0Q2L3r7KJ02m0q0N1O9p0m6R1Rr1
$$ plain form
4067 -45 -40 43 -2 -65 -11 35 -35 -58 36 9 -78 -18 47 -23 -68 12 35 -58 -44 51 8 -64 -2 57 -13 -54 36 55 -49 -24
4097 -24 68 22 -66 17 77 -17 -55 51 54 -56 -17 68 5 -60 12 54 -43 -56 29 21 -66 -21 44 -25 -69 12 18 -53 -34 38 0
4128 0 -68 -10 45 -34 -61 33 32 -57 -11 64 -2 -57 17 59 -34 -37 65 26 -53 -9 84 -6 -62 49 71 -42 -45 66 21 -65
4158 -65 -2 66 -11 -64 30 36 -57 -40 54 2 -74 -11 34 -32 -53 33 14 -57 -20 49 -20 -52 23 31 -49 -39 58 13 -72 18 67
4189 67 -33 -53 45 52 -64 -20 75 17 -55 18 68 -27 -47 51 39 -62 -18 63 -1 -61 3 46 -50 -57 44 17 -65 -23 45
4218 45 -16 -67 23 29 -52 -31 51 -8 -74 11 44 -52 -55 48 27 -70 -10 70 -9 -65 36 69 -32 -24 78 31 -66 3 84 -13
4248 -13 -81 50 66 -48 -24 61 19 -78 -1 54 -31 -54 32 33 -64 -38 41 4 -64 -2 45 -50 -53 33 12 -60 -4 47 -18 -69
4278 -69 34 22 -58 -27 58 4 -65 24 68 -33 -51 64 46 -67 -19 90 2 -79 18 66 -41 -43 55 36 -57 -19 58 -17
$$ packed form
4067d5NQ3m5o3N4M6p0k3R4k7q7O0O5p0m5Q0K3r3J4R5m3p2O2N9p0m1R0J9j04K5
4097b4R2m6q8Q3O0r4l8J06Lj10L9Q5o3o5P2M2r7j3Q5qq7M5O5o9m4Q1Op1J9P2l8
4128@o8N8N5p9k7R4jq9M6P5o6n5P4M2r3lJ02l9p9M4R3r0n6J11K2j13lJ11m5q6
4158f5O3O8p7n3R4Or3J7R4n2p6O3M5o6k1Q6j9p1L7O9o9l2P5Qq0J0R7m5q5R0M9
4189F7j00k0R8Pj16M4R5n8p2P3N0r5k0R8j2j01M4Q1o4o0O4M3r6pJ01k7q2M2O8
4218D5o1n1R0Oq1K1Q2n9o6Q5L3r6lJ03k1r7O0Q0p9n6J01L3j01QJ02m7r7O9Q1r7
4248a3o8J31J6j14K4Q5m2r7P7N5q5k3Q6Jr7K6P9l7o8O2M7r5lQ6k1p2N6N1o5n1
4278f9J03j2q0L1Q5n4o9Q9M4j01j8J15j8j13M8J09q8q1R7M8j07kR8j9r3L8P7p5
$$ plain form
4306 -17 -77 15 38 -51 -64 35 6 -78 -18 35 -27 -63 32 16 -73 -24 42 -15 -61 8 40 -53 -35 50 21 -48 12 72 -16 -54
4336 -54 56 50 -61 -25 71 17 -63 20 66 -27 -52 63 50 -54 -31 69 13 -80 1 53 -35 -66 30 12 -64 -31 45 -18
4364 -18 -62 14 34 -42 -30 37 2 -57 14 53 -27 -45 40 40 -50 -3 64 -2 -51 29 57 -37 -32 66 35 -54 -1 82 -9 -65 20
4395 20 52 -42 -41 59 17 -66 -3 58 -22 -69 25 35 -71 -35 52 0 -67 -9 31 -21 -47 39 27 -65 -13 55 -7 -48 16 32
4425 32 -31 -19 60 23 -37 11 59 -16 -38 51 53 -43 -8 71 7 -49 20 57 -27 -40 47 38 -60 -26 49 -10 -69 10 48 -35 -48
4456 -48 19 14 -62 -24 49 -22 -59 18 32 -40 -28 33 10 -52 14 47 -18 -33 40 32 -44 -2 44 3 -36 34 52 -21 -12 51 24 -46
4488 -46 -4 61 -2 -46 26 37 -40 -12 48 -3 -70 1 48 -26 -48 22 17 -59 -28 40 -13 -60 10 44 -41 -48 32 22 -58 -17 58
4519 58 -7 -46 18 51 -16 -18 53 29 -32 16 59 -3 -31 40 47 -16 -13 46 4 -38 23 54 -25 -25 35 17 -46 -9 45 -16 -51 16
$$ packed form
4306a7o0R2K3q9j3R9k9q4O0N3o2l6R5j6q9M9O6n7m6O9L2r3J8Q5k9o9O0O0q8l8
4336e4J10oj11L6R6n4q0Q3M6r3k5J15j3j04K3J00n6r3Q1N2q8l1R6j8p6L3P6o3
4364a8m4P6K0p6J2O7l5n9P1L9q0j8Q5%r0M7O7o6m9Q0K8r4NR8l1q9N3Q3r1n6Q5
4395B0L2r4JJ00m2q3O3O1q0m7R4J0j06L6Q7n2o7N8M0n2k6Q6j2r2N2O8o2m1O4J6
4425C2o3J2P9l7o0M8M8p5k2Q9Kr6L5P9o4n6O9L7q4j3Q7rr8L4P5n9n9P9L8q3j3
4456d8O7np6L8P3p1l7P7J4p2J2O1k3o2O6L3o5j5P3qp6M2M6m1l9P0J8p3RO3k7p0
4488d6M2O5o3m4P2J1p7K8O0n1o7P1M7p4k2P0np6L1O8n3m7P0L4q5pQ0j0q0M1P5
4519E8o5l9O4L3o7kP1k4o1M8M3o2k8P1Po3LN9m2m2O1L1p9%O0j8o3L7N4o1l5O7
$$ plain form
4551 16 40 -47 -40 24 8 -52 -5 38 -20 -46 31 24 -42 -29 43 8 -47 5 61 -14 -32 37 39 -35 -5 58 13 -39 15 51 -17 -13
4583 -13 50 33 -45 -2 44 -8 -35 26 25 -28 -24 23 -4 -53 -11 31 -42 -56 17 26 -63 -28 46 -7 -67 12 41 -35 -35 32 25 -40 -7
4616 -7 58 4 -38 27 55 -24 -23 44 33 -40 -2 53 -14 -37 32 42 -28 -24 44 16 -42 1 46 -18 -42 12 13 -49 -24 31 -16 -54
4648 -54 -4 20 -38 -45 28 1 -56 -5 33 -24 -47 21 35 -40 -24 50 14 -53 1 55 -15 -33 28 37 -31 -14 61 4 -47 11 43
4679 43 -31 -33 34 21 -40 -5 41 -12 -43 4 30 -47 -29 29 -8 -73 -12 34 -26 -42 23 11 -52 -21 34 3 -61 -7 37 -39 -39
4710 -39 31 18 -41 -7 55 8 -41 35 54 -19 -18 45 33 -32 12 45 5 -56 41 45 -45 -32 33 4 -63 0 44 -25 -49 24 31 -44
4742 -44 -25 42 -12 -60 1 30 -38 -34 25 11 -48 -2 43 -32 -39 19 27 -40 -28 41 8 -51 21 53 -13 -25 52 42 -22 -4 57 15
4774 15 -42 14 60 -24 -39 36 22 -58 -21 44 -10 -52 14 32 -39 -35 28 -2 -57 -8 35 -23 -48 25 16 -47 -27 40 1 -53 9
$$ packed form
4551A6K4q7PO4j6o0M7M3n8k6P7po6J3P2l5n5N2N6p5j8O9Kp4L0O3m5n2N4L6o8M
4583a3O3j7p8M3M6n2k7O1jn3MM7k7m9M2M2p3j4P3Rq9L5P4n3o0P9K9p6%O7po5L3
4616gO5n4m2O5K8p9JO7j1p3L8N5o7k3O9J0p0MO8k8n8M3M5o4k4N4Jo2K5N5m7l8
4648e4N0K4n8pP3k7n7N1L8n7k3O8J4p5J6P4l6o7N4N4p0j8O1Ro8J7P5n7n1N8L2
4679D3p4kO7j3o1L5M6n3l1M7K6p7J8N8l7o5O1M6o0j6O5j2o3L1N5l1o4N4M4p6%
4710c9P0j3n9L4O2m7m9P6J9p3JO3j2o5M4L3m0o1R7Mr0J3O5k9o7O3M4o9k4P3Pp5
4742d4J9O7n4m8O1K9o8MN9j4n9M6M5p5pN8Qo7J2O9l3n9P2L2o6j2P7j0o4J8O1m2
4774A5n7N6M6q4j5P5j4q0L7O5n4m2O6J8p1MO3l0n5M9M3n8k5P3ro3K0O7l9n4O2
$$ plain form
4805 9 48 -31 -36 41 31 -34 6 51 3 -34 41 51 -27 -12 56 17 -49 -1 42 -17 -40 47 27 -39 -16 46 6 -57 -7 42 -33
4836 -33 -46 27 11 -44 -16 30 -15 -51 11 30 -43 -35 33 6 -42 -4 36 -22 -32 31 34 -32 -15 47 10 -34 31 50 -14 -25 44
4867 44 26 -46 5 57 -2 -45 27 53 -30 -35 45 7 -45 -4 46 -17 -55 7 20 -43 -33 26 -6 -54 0 31 -22 -35 22 16 -35
4898 -35 -7 38 -1 -32 16 32 -17 -11 49 20 -26 21 54 -8 -16 40 32 -35 -14 59 2 -36 12 50 -39 -37 34 10 -45 -15 39 -10
4930 -10 -47 -4 29 -51 -60 18 -1 -55 -11 22 -19 -39 12 23 -38 -15 33 2 -36 10 34 -19 -20 27 24 -23 13 43 5 -27 34 37
4962 37 -19 -24 45 26 -41 -1 34 -23 -31 29 19 -39 -30 30 -1 -52 -6 23 -22 -50 18 10 -42 -19 25 -10 -61 19 27 -32 -30 31 2
4995 2 -43 -13 30 -9 -36 16 31 -21 2 39 9 -19 20 42 -13 -15 16 20 -26 -3 50 -7 -37 13 30 -38 -37 27 12 -47 -20 27
5027 27 -19 -49 7 14 -44 -29 17 -2 -56 -11 8 -21 -39 13 20 -26 -12 25 -6 -29 18 33 -13 -10 35 20 -20 12 38 -3 -22 29
$$ packed form
4805IL9p9nP7j0o5M0M5m8l7P5J0p8J5O8l9o6M8M3n9k3Q7k0o6K3O2m0o3N0M9p5
4836c3j3P3j6n5K8M6m5l6O2J9p3QO8k7m8L8M0n8j0O3Lo6J7O2l7m4O5J9o4j1O9
4867D4j8p2N1N2n9m3P2K6q3nQ0l8n2M1N0o3l8O2J3o3J0N9l2m8N4L1n3j3N7on1
4898c5K8M5l9l1M8J6m9OO0k9m6M7L3o2qN6qo7K1P3n7l8M8L8q9KP1k4n5L0N4m9
4930a0l7M3L3q0rP8j9n4M4L3m1k0N1J1o1K3M8l1l8M6K4n3jM7lm7L6L0l8l2O1L
4962C7n6nO9j9o7M0L5n7qO0j0n8RO0l1n1M6K9m5k8O8qn2K3M4l5n1Q0Qn9KO1k9
4995Bm5L0M3l9k7N2J5n2K3L7l0k8L9K2n5kL1Mm6K3N3n7l0N0J7o8JO4j5n9K7M7
5027B7m6l0N6Pn8J5M6j9n4M5J9k9j8N2Pm6J4L7l1k3M7J5m6LM5j5m0L2K6m1j9N1
$$ plain form
5059 29 42 -27 -9 24 -1 -33 -12 33 -10 -48 18 18 -21 -20 24 -3 -48 -6 4 -37 -32 3 0 -44 -17 27 -31 -34 13 22 -34 -18 35
5092 35 2 -39 1 36 -1 -16 28 29 -11 -5 41 13 -28 23 30 -16 -20 15 23 -19 -6 33 -14 -34 -8 10 -33 -26 8 7 -35 -2 20 -24
5126 -24 -45 3 14 -50 -27 18 2 -31 1 24 -14 -10 23 22 -19 -9 33 3 -22 13 28 -17 -11 33 29 -25 -1 25 2 -30 11 21
5158 21 -20 -10 22 13 -34 -15 22 -22 -40 5 5 -38 -18 14 -13 -42 -6 11 -29 -25 8 6 -29 -1 32 -1 -31 9 36 -28 -19 30 21
5191 21 -32 12 40 6 -27 20 31 -13 -9 30 17 -14 4 30 -9 -31 34 22 -25 -9 23 -7 -33 -1 13 -34 -35 9 -4 -38 -12
5222 -12 11 -11 -40 12 25 -32 -20 24 8 -30 9 28 -2 -21 35 30 -29 -4 40 7 -20 23 36 -15 -13 26 27 -25 -3 49 4 -36
5254 -36 6 27 -21 -18 24 11 -33 -15 23 -9 -34 2 2 -29 -22 14 -4 -47 -11 18 -27 -20 22 11 -40 -2 39 -7 -29 17 19 -30 -7
5287 -7 41 26 -30 -1 33 3 -16 23 31 -12 -8 32 10 -32 -2 34 -13 -43 16 17 -40 -23 25 -6 -36 -5 21 -20 -33 7 -1 -35 -24
$$ packed form
5059B9J3o9J8L3k5l2K1M5m3l8O6%l9JM4k7m5M2J0m1NL5lm4K7M4n8lM7Rn6J6N3
5092C5l3m1M0L5l7j5M4Jm0OM6k8m1N1Pm6mL5Qm2J3L9m7k0K6J8m3PL4jm2L3K2m4
5126b4k1M8J1o4K3M5j6l3L2K3l8ML3jm1J0M2l0k5L5J5m5OM4mn4K4K6k3l2M1J0
5158B1m1J0L2rm7J9L7m4j8M5%m3K0L2k7k9L6J7m0ML3kl5K8L3l3l0M0K7o4RM9r
5191B1n3M4K8l4l3M7J1m4ML9j3l1J8K6l9k2O5j2m7J6L2l0k6L2J4m7jM4j3l4K6
5222a2K3k2k9N2J3n7J2M4j6l8L9J9l0j9N6nn9K5M4l3k7M3J3n1KL9Jn2K2N2m5m0
5254c6M2K1m8LM2j3m4J8L8l2k5L6%l1PL6j8m3L6K9m5PM2j1n1L8M1m6k2M6Km9K3
5287gM8j5n6K9L4l0j9L9Qm3MM0k2m2L0L6m7l0N9Jn7J7M8l1l0L1K6m1j3M0ql4J1
$$ plain form
5320 -24 21 -11 -35 8 13 -23 -22 25 7 -33 2 30 -17 -19 24 21 -24 -8 42 11 -28 21 47 -22 -12 34 19 -25 -1 26 -4 -37
5352 -37 15 26 -38 -28 16 -8 -45 -6 32 -15 -38 12 8 -33 -28 23 -10 -41 -2 21 -30 -30 17 13 -24 -9 29 -15 -31 23 29 -26 -10
5385 -10 33 17 -25 6 41 2 -17 21 21 -19 -7 36 7 -33 6 17 -27 -29 4 -5 -37 -11 14 -13 -36 -3 1 -28 -27 5 -14 -35 2
5418 2 23 -4 -25 19 7 -23 -3 31 9 -27 14 32 -16 -16 40 21 -28 13 36 -1 -18 30 33 -19 -18 36 15 -39 -8 16 -24 -45
5450 -45 6 22 -28 -27 9 -3 -41 -3 2 -25 -26 11 -3 -40 -12 15 -17 -35 -1 13 -23 -5 16 6 -25 7 25 -12 -12 12 19 -24 6
5483 6 22 -4 -24 25 23 -3 -13 25 13 -27 6 22 0 -36 10 13 -38 -27 9 0 -41 -22 13 -14 -34 0 4 -24 -22 3 -3 -30 2 10
5517 10 -13 -21 9 6 -22 -7 23 -6 -17 6 21 -6 -12 27 22 -12 12 38 -4 -19 12 21 -13 -11 17 -3 -26 -8 15 -17 -29 1 8 -29
5551 -29 -23 9 -10 -33 -11 16 -27 -30 0 -5 -24 -14 9 -3 -13 6 11 -14 -5 17 22 -14 11 36 -1 -1 15 8 -9 1 23 3 -9 19
$$ packed form
5320b4M5l2k4M3Nl6JM7j8m0L5K8m7kM3lm5J6N0l1l9M9K6o9J0M6j5m4K4K7l0l3
5352c7N2J1o4J0M4k4l7L9L8m7k3N0mm1NN1l3l1L9K3n1%M7ml7J5L8m4j6N4On5J6
5385a0M3j6m2L1L5l9j9L8%m0J2M3k9m0L9J1m4kL3rl2K6K5k7k3L3Mk9JL2j9k1L7
5418BK1k7k1M4j2l0K0L4k2l6M1J8m8%N6j9m9M1K3l7j7M8Ln2JN4k1n4L1K4m0k1
5450d5N1J6n0JL6j2l8L8Nk7jL7j4l7K8K7l2j8L4J4l6J8K1j0l1L2J8l7%K4Pm3L0
5483FJ6k6k0M9kk6j0L8j2m0L3J6k2l6M6Ln1J1L6rm1J9L5k7k0L4Mk8KK5ok7L2Q
5517A0k3qL0lk8J5L0k9j1K3J5k7oL9nl4K4K6m2j5L1Rl4KK8k0k3J8K3l2j2L0Pl7
5551b9OL2j9k3K2K7m3lL0nj9J0K3j2j0J9Nk5RK2Nl6K5K5l7%J6pj7J0K2k0j2K8
$$ plain form
5585 19 16 -17 -25 7 8 -37 -2 17 -23 -31 -7 -5 -42 -21 7 -9 -34 -7 11 -16 -30 5 8 -20 -21 10 9 -13 7 15 -10 -19 8 18 -10
5620 -10 11 24 -3 9 12 9 1 4 20 12 -17 11 22 -1 -8 16 1 -36 -11 11 -1 -27 -9 1 -23 -29 10 -12 -28 -19 2 -5 -29 -14 0
5655 0 -21 -15 7 1 -20 -7 9 -9 -9 7 18 -3 -6 24 8 -5 9 30 6 -2 16 9 4 8 21 3 -13 13 13 -32 -9 15 -8 -24 -12
5690 -12 9 -24 -22 9 1 -27 -23 6 -12 -30 -2 7 -16 -30 2 5 -23 -3 12 4 -11 -2 12 0 -4 12 14 -7 3 17 7 -4 10 14 -7
5725 -7 1 14 8 -12 8 20 -4 -23 7 0 -24 -17 12 -11 -29 -8 14 -11 -25 4 -2 -26 -15 17 -8 -21 -4 2 -18 -12 15 9 -13 -8 24
5760 24 3 -3 12 27 3 3 17 8 0 6 23 0 -3 15 17 -15 7 16 2 -8 1 6 -24 -20 -1 -13 -25 -5 10 -17 -32 -2 5 -31 -17 7
5796 7 -8 -32 -17 15 -20 -32 -3 4 -19 -14 21 4 -7 -1 24 8 -11 17 21 -20 4 18 9 -6 6 20 -2 -10 21 3 -8 3 15 -5
5830 -5 -10 4 3 -21 -16 0 -17 -26 0 2 -26 -30 3 -6 -30 -13 7 -18 -38 -4 2 -17 -12 10 8 -19 6 24 -5 -4 12 15 -2 -12 25 12 -19
$$ packed form
5585A9ll3qL2Jm5L5J9m0qK4Kl7K1K8j6k5K7J8k7j4L5Lk8jL1jk2K0Qk5rK7J0k8
5620a0K1J3k7J2LlqLJ6qk9K8J1k3pK4j5l7K5K2j2k6J8J0k4oL9k2j6RK1pk4J5J4
5655@k1OK2ok1J3J6j8%J6J1k1lL0j6j3J4K1k4qJ8pnMJ3j8j6K6%m5K3K4k3j6J2
5690a2K1l3KL1qk8MK9j8j8K8Rk3j4L2Lk8K0J5qj5RJ4j2mJ6Kk1J0J4j0j1J4Mk1
5725gQJ3ok0K0J2k4j9L0pk4PK9k3j8K1K2k5j4K9ok4J1L2k5j3J7Ok0OK7ok2NL2
5760B4k1oJ5J5k4%J4rqOJ7k3lJ8Kl2K2Rj4j0RNl0MJ9j2j2K0J5k7j5L0Pl6J4K4
5796Gj5k4J5L2l5j2K9Pk3NL5j7j1OK5j6j9K8Mm1K4J4rj5J2J4k2qL1j8j1J1J2k0
5830enJ4jk4NJ6j7rK6Kk8mL3rk4J7K0k5k0L4Oj9NK2kk7K5J8k9JJ6Lj7j0L7j3l1
$$ plain form
5867 -19 12 16 -6 0 14 14 -17 -9 10 -4 -16 -3 -5 -27 -26 -4 0 -34 -7 13 -18 -31 5 -8 -37 -21 -1 -6 -31 -5 2 -19 -7 13 19
5902 19 -18 -8 25 -6 -5 15 24 -2 -9 25 9 -16 2 15 4 -12 10 24 -10 -11 12 -2 -18 -4 -2 -10 -21 3 2 -22 -9 9 -21 -31
5936 -31 -6 -1 -19 -21 7 -4 -27 -6 11 -10 -20 10 13 -21 -2 22 7 -15 9 18 1 -5 12 8 -2 -2 23 2 -7 9 10 -5 -10 12 1
5971 1 -18 -11 10 -9 -18 -2 -11 -10 -15 -1 -18 -28 -12 0 -15 -17 -2 -11 -22 -1 17 -17 -13 5 0 -19 -8 13 7 -5 15 23 0 -5 25 21 -2
6008 -2 -4 19 0 -14 10 21 10 -10 5 1 -10 -10 21 -7 -12 -8 -1 -12 -18 3 -6 -18 -16 5 -8 -15 0 -9 -15 -12 -2 -10 -18 -1 2 -6 -10 15 4 -14
6048 -14 -2 13 6 -1 20 12 -1 -3 18 9 -3 10 23 6 -5 5 3 -4 -9 6 -6 -15 -8 0 -16 -25 -1 -2 -21 -15 0 -12 -18 -21 9 -4 -18 -1
6086 -1 1 -20 -16 3 1 -13 12 13 -5 4 13 -4 6 13 20 0 1 16 7 -4 4 23 10 0 12 15 -8 -11 6 -11 -22 -16 -2 -7 -11 -4 11 -20 -22 -2
6126 -2 -10 -13 -8 5 -9 -8 -15 4 -21 -14 2 2 -17 -4 5 0 2 24 14 2 21 11 2 -6 5 16 -12 0 7 14 2 16 15 -10 -5 11 0 -20 -10
$$ packed form
5867a9L1Mk2OJ4%l1QJ9j4j2J3kk2JK2Ml4K7K0l1j3L6j3k9J6K0nk5K6Pk1J2K0O
5902A9l7J0L3l1JK0Rk6pL4j6k5J8J3j1j6K2J4l4jK3j4j6J4Kqj1K4jk4J3J8l0j0
5936c1K5Nj8kK8j1k3K1J7k1j0L0Ll4J9K4j5k2K4Rj7oJ7mj0%K5k1rJ6Jj5nK2j1
5971Aj9PK1j9rJ6rJnJ4j7j0J6J2j5kJ5rj1K1J8l4MJ8nj9J1K1oj2K0Qk3nL0mk3
6008bkK3j9j4K4J1j1k0J5mj1%L1k8nMPj1oK1rj2KK1j3pJ5roLJ0qqJ7LqmK5j1j8
6048a4J2J5ppK1qj3kK1rj2J3J3j7j1J0kpnJ5j2rPQj6rK4jj9OJ5j2olL0j3j4J7
6086aKk1MJ9kj4K5Jj8RRj7J0PPk0JJ5rj1QJ9j3j0J2Lk3lJ7j7j1OJ4nmPJ5l1kK0
6126bqlNJ3j4JpJ9k5PJ6%j9J3RnKK2j0j2J9j0rqJ1J1k8J2PPj2J4jk5NJ6j1k0J0
$$ plain form
6165 -10 5 -13 -18 -16 -2 -24 -12 -13 -3 -9 -18 2 -1 -4 -10 7 -8 -6 4 5 -14 0 19 -1 6 5 13 -1 11 20 8 1 5 6 1 3 16 11 -17 1
6205 1 5 3 -6 3 7 -15 -10 12 -3 -12 0 18 -16 -24 -7 -1 -18 -22 -6 -8 -14 -7 3 -9 -9 -3 2 -12 -14 10 14 -4 4 14 5 0 14 9 -5 16 14 -1
6247 -1 3 17 18 -5 2 23 1 -5 -1 12 -5 -14 6 7 -4 -9 5 -15 -12 -2 5 -17 -22 11 0 -20 -12 5 -5 -15 7 6 -10 4 7 3 -7 14
6285 14 16 13 6 13 13 11 10 17 12 -5 9 11 15 8 16 13 -14 2 13 2 -6 -4 -1 -26 -12 -8 -14 -16 -7 4 -10 -25 -5 0 -11 -6 10 1 -14 1 6 -8 -17
6328 -17 4 8 -8 -8 25 5 -4 17 12 -3 -1 15 4 9 6 16 8 6 11 13 -3 4 21 -6 -6 5 9 -14 -18 -4 -4 -14 -13 10 -13 -26 -7 2 -23
6367 -23 -13 19 -7 -9 -3 8 -5 -16 -4 22 -11 3 17 4 -11 9 18 2 -3 11 20 4 9 12 11 5 5 7 -13 -5 11 -14 -21 1 -8 -8 -6 11
6405 11 10 -13 -16 3 -18 -28 -7 9 -19 -31 6 -7 -21 -11 9 -16 -7 6 2 -22 -2 20 5 -1 2 23 1 -4 11 26 2 1 21 9
6439 9 -2 4 15 -3 -11 -2 4 -2 -4 2 -4 -11 -2 6 -15 -18 -4 -8 -23 -7 0 -11 -24 -6 0 -13 -14 11 -3 -25 -4 4 8 -13 1 15 -3 -3 26 1
$$ packed form
6165a0J5j8nKJ4k2J2jJ0orK0lloJ7j5KJ0Jj9J4J9k0PjQj4J2Rj2pMJnKJ3nk8J8
6205AMkrRMk2NK2j5rJ2J8l4qJ7Oj7mJ6koPJ0j2%ONj4kK4Mj8QJ0rnJ4nj4K1kj5
6247aMJ4Jk3PK1k2oMJ3j7rK0Jj1nJ4k0LJ0Pk2nL3j1k0QJ7j0j0K2jj6J4Lmj0K1
6285A4KlpP%kjPnj7J4KMpQlk7J6J1j1qKLk5J4MokRJ1j4j5K0Nj1NJ6rj5J5Nj4r
6328a7K1Mj6%L3k0rK1nj5KJ6j1NlJ0qkNKj6PJ7k7%J1Mk3mJ4%j0JK3k3j3J9Rk5
6367b3J0L2k6kOJ1j3j1J2K6l3J4J4j3j5K0Rj6nJ4Rj6NLjo%Kk0QJ6k5pK2r%KJ7
6405A1jk3lJ9k1j0K1J6k8j2L7j3j4J0K0k5RJ3mk4K0K2j5oLK1k2nJ5J5k4jK0j2
6439Ij1OJ1j8qROokOopRQk1lJ4mj5J6Pj1j3J8Oj3jK5j4k2K1QMk1J4J4j8%K9k5
$$ plain form
6479 1 -1 10 16 8 -1 12 10 -4 5 21 3 -5 13 19 0 -9 12 -2 -10 -6 -4 -7 -12 -1 -5 -28 -21 -18 -15 -20 -12 2 -10 -13 1 7 -12 -10 -1 -2 -24 0 13
6522 13 -1 3 10 14 -10 6 22 12 -3 18 19 6 8 18 17 -7 8 24 -3 4 13 10 1 -5 -2 -2 -5 -2 -6 -18 -22 -13 -1 -11 -9 -5 -1 -20 -3 1 -20
6563 -20 -7 7 5 -10 -1 8 -10 -10 7 4 -3 8 26 11 -3 15 12 -6 -3 17 12 1 8 12 9 -13 1 12 -8 -2 -3 0 -13 -8 -1 -12 -13 -18 -12 -29
6603 -29 -20 -8 -5 -21 -9 -12 -26 -7 -6 -3 -3 -8 3 -9 -9 -7 7 3 -1 8 10 -1 10 13 0 -1 15 10 -8 2 11 10 1 13 -2 -9 -19 -8 3 -3 -11
6644 -11 -3 -17 -18 -17 -4 -23 -12 -1 -6 -20 -9 -5 -17 -11 -6 -3 -5 -7 2 1 -3 17 13 0 -7 11 4 16 2 12 18 7 3 15 5 -6 15 3 4 -2
6684 -2 8 -10 -9 4 2 -10 -6 -7 -9 -18 -2 -7 -16 -12 0 -7 -12 -12 -12 -7 -17 -8 0 -14 -9 0 -4 -3 11 -1 1 3 14 -1 1 1 20 15 -1 10 16 -2 10 16
6728 16 3 8 3 8 4 -8 6 2 -7 -14 3 -4 -17 -7 -10 -3 -12 -14 -8 -15 -8 -13 1 -18 -11 -4 -5 -12 0 0 1 -8 8 4 -10 4 5 0 9 15 4 8 1 13 5 2
6774 2 17 -3 2 -2 5 6 -12 -6 5 -4 -7 -1 -8 -18 -18 -9 -12 -22 -8 0 -12 -17 -10 -1 -15 -5 -2 -1 -4 -1 6 -6 0 3 4 -1 -1 10 -5 5 12 18 5 5 7 12
$$ packed form
6479AkJ1OqrJ3kj4RJ6j8qJ8Oj9rK1j4qMKlnJ1mk3PLLnQJ4j2lJ4Oj9KRjk2K4J3
6522A3j4MPMk4J6J6j0j5K1Jj3KJ0jk4J5J6k7PRlroL%lLmj2mRJ2j0KMMj9J7Mk1
6563b0J3J4kj5RRj8%J7lpJ1J8j5j4J8lj8LK0nj1PMlk2J4J1k0OjLj3NPj1jnOj7
6603b9RJ2Lj6J2lj4J9JL%nJ1j2%KJ4mmRKj1J1Lj3jJ6nj8J0RjrJ2j5pj0J1J1oq
6644a1Qj4jJJ3j9J1J1nj4J1Mj2ONLkkRjmK0mj3pJ8pJ2j4J0Oj1mJ2j0j1K1j2Jo
6684bJ0j8JJ3kj2MjkrJ6nrMJ2pn%%Nj0RQj4NRmJJ4j2KKJ1j5K%J9nj6J1Oj8J2O
6728A6j3NnNmj2J4mrpJ7pj3J0lPrkOpPnJ4j9PPjpJ2%JrJ6mj4J4JnROj1MpJ2ql
6774BJ5k0NmPJj8OJ1rlOpj0%Rlj0J4Qj2nPRj4J0LJlLPj2OLJn%J1j5J0POj3%KN
$$ plain form
6820 12 -1 9 7 -2 15 -2 0 -10 -5 5 -6 -6 -13 -2 -7 -8 -15 -24 -11 -18 -7 -13 -18 -14 -9 -9 -11 -9 -8 -9 -13 2 -8 -17 6 -1 -7 0 13 1 6 8 19 10
6864 10 -2 13 10 -5 2 14 10 1 0 7 -9 5 5 -6 -12 -3 -6 -8 -15 -12 -13 -21 1 -5 -7 -19 -21 12 -20 -15 -14 0 -14 -13 10 -10 -9 -4 -1 -4 -6 7 13 6
6908 6 4 6 4 -1 18 19 3 -1 17 -1 5 1 -5 -2 2 -4 -9 -10 -14 -3 -21 -20 -5 0 -22 -14 -4 -9 -21 -8 -15 -24 -20 -7 -10 -17 2 -4 -7 -7 7 0 -10 -8 1 4
6954 4 -7 -3 11 3 -7 1 9 6 5 7 7 5 3 -4 -4 0 2 -3 -9 -8 -10 -17 -7 2 -7 -16 -19 -10 -13 -19 -13 -4 -25 -24 -4 0 -22 -8 6 -2 -19 1 5 4 0 -2 9 4 3
7003 3 9 15 -5 1 10 17 13 19 5 2 8 7 -1 -6 4 10 -10 -2 -9 -6 -12 -3 -5 -19 -12 -2 -22 -19 -7 -13 -7 -14 -2 1 -14 -3 3 3 -1 8 5 -1 -6 -4 9 -6 9
7050 9 11 1 9 10 10 9 2 2 17 1 -1 9 2 -8 16 3 -13 -2 3 -7 -4 -6 -9 -16 -12 -11 -8 -23 -16 -10 -31 -21 -9 -5 -14 -14 7 0 -14 -5 3 0 -8 1 10
7095 10 3 2 5 10 -5 -2 15 7 5 10 20 7 6 10 9 4 3 16 -4 -11 4 1 -7 4 4 -1 -17 1 0 -3 -14 -9 -13 0 -16 -9 -19 -14 -5 -13 -13 -1 3 10 2
7140 2 2 9 -13 -1 5 17 5 8 12 2 9 5 16 17 11 5 -2 14 11 13 -6 -2 7 6 -4 -7 4 -3 -4 -9 -11 -11 -15 -5 1 -12 -14 -17 -16 -9 -15 -15 -13 -5 -4 -4 6 4
$$ packed form
6820A2j3J0krJ7j7Kj0NJ0j1%pJ1njprJ3pJ1onMN%kKJjmJ5j0rK3poPJ3j2NKJ1r
6864A0j2J5lj5PJ2mrjPj6J4%j1oRlkpLjqK2okj2kL3l2NJJ4j4JK3k0JNLlkJ3Op
6908FkKknJ9Jj6mJ8j8OmoLMonjmJ1j8JJ5Nk2QJ0nj2J3prMJ3lpJ9ol%J4pj0KRL
6954Dj1MJ4qj0QQljK%kkp%MKnoJkpJ0RrrlRloORk1JK0Mk2J4J4qj7K0MjmkJ1nj
7003COOk0ORPmOj4lOjqnJ0Ok0QpLoRkj4PJ0k0LJ2oOpJ2Lj5J1O%mRlonKJ3j5J5
7050IKj0QJ%jp%J5j6kJ0pj0K4j3j6J1Nj0LklpMJLj5POk1J0J2Mr%K1pj4RQlqRR
7095A0pjLNj5LJ7qkNJ0j3jMjnjJ3k0pJ5lqJ1%nj6J8jlj1NmJ3j6Pj0NRq%J2MPq
7140B%Pk2J2OJ2j2LMj0PmJ1JoopJ6lKj9MRjj0lJ1pjnk%mJ0Oj3klJPo%KQJ%J0k
$$ plain form
7188 4 6 2 -9 0 7 -3 4 8 7 5 3 12 8 7 8 15 -1 -1 -3 4 2 9 -3 -7 -2 -3 0 -3 -14 -11 -4 -19 -21 -16 -19 -23 -16 -25 -19 -13 -6 -14 -10 -11 -6 4 -8 -1 -6 -2 8 6
7240 6 -7 -2 2 1 3 -1 15 3 18 6 11 2 9 -9 -1 13 0 -4 -4 -8 -4 1 -10 -8 -10 -7 -18 -9 -12 -9 -4 -14 -6 -17 -13 -12 -7 -8 -5 -6 -18 -7 -5 1 -3 3 6
7287 6 3 -1 -1 7 8 1 7 -3 6 8 11 5 -3 1 5 -6 -3 0 -5 -8 -11 -9 -10 -22 -11 -11 -3 -5 -4 -10 -9 -14 -15 -19 -12 -9 -10 -7 -7 -6 -4 -3 8 -10 1 9 -2 5 3 4 1 -5 9
7340 9 1 2 9 1 9 6 -12 8 3 6 -10 -2 -13 -8 -9 -6 -10 -5 -6 -9 -16 -19 -15 -13 -16 -16 -16 -21 -16 -14 -28 -25 -15 -14 -7 -19 -4 2 -1 0 3 -5 7 -6 2 2 -3 7 -2 8
7390 8 -6 5 6 -3 13 8 0 3 -1 -7 0 6 -8 -15 -19 -9 -11 -17 -18 -7 -12 -11 -7 -14 -14 -8 -14 -1 -25 -7 -2 -15 -13 -15 -8 -9 2 5 6 -5 10 3 3 -5 3 4 -3 7
7438 7 7 5 11 8 14 7 4 0 2 2 -12 2 -10 -4 -2 -12 -17 -23 -11 -5 -23 -16 -8 -16 -5 -13 -9 -13 -20 -8 -7 -14 -5 -8 -2 -4 5 -3 -8 8 -4 -1 4 17 11 4 1 1 2 6
7488 6 15 3 10 9 3 3 -11 -3 7 -2 1 -6 -4 -13 -10 -6 -18 -11 -14 -15 -14 -8 -16 -3 -10 -19 -13 -10 -5 -14 3 -6 -4 3 5 -7 6 13 -3 1 -3 -11 6 9 4 -2 13 6 9 6
7538 6 8 -8 12 -2 2 6 1 -4 7 -7 -9 -8 -5 -13 -16 -6 -4 -19 -15 -12 -16 -17 -10 -5 -21 -14 -1 -15 6 -2 -10 -3 0 9 2 8 6 -4 5 3 10 8 7 11 6 17 6
$$ packed form
7188DKmj1RPj0PMjkkRmjJPj6%kPkPj2mNjLlj1LPj5kNlmPrOOPqMjNJ0j2PnMJ0k
7240Fj3NMjKmJ6j2J5j2NrPj8QJ4j3m%mMNj1KkLj1RlLNj0Qj1MJNjLjj2J1KOmOL
7287Flm%QJpOj0RKLoqMMj1LLnllKjj2J1%QkJoJnjmPLjL%JKJJ1j8J1Qj1PkJloJ4
7340IqJPqQlj8K0nLj6Qj1NjLmNjlplMKl%%nNKj4LJ0JPj2J5OlJLqJ2j3Q%nJ0rJ0
7390Hj4J1JrJ6nqLmoPOj4pmJ0kojJ1nJMp%OoJ3k4J8Nj3KkPjJ1LJj1J5p%qQJpJ0
7438G%kOlOplmK%j4J4j2OKj0noJ2Oj8PQqJ1qMmpJ2JpRlOkRqnJ6j2LNJ3opl%JM
7488FRj2Pjo%j4QJ0rLpKrLMj2PljJOqJ3prOLNrJ7rKPKj2J3Pj6MmqJ7LnoJ5pLl
7538FKj6K0j4MMnnJ1j4kJLqlJ0Kj5MLmjPNj6PJ3j4K1qqPLRpOkj0RkPkjMnJ1j1
$$ plain form
7585 6 11 13 1 -4 -6 -4 -14 4 -11 -1 -11 -10 -3 -8 4 -21 -19 -9 -6 -14 -8 -23 -7 -15 -25 -15 -6 4 -1 -11 -8 -3 0 -2 5 1 1 3 4 -2 -3 1 4 1 -5 8
7631 8 9 1 7 5 -1 1 -2 2 -4 -4 -10 -2 -6 -18 -13 -10 -16 -8 -13 -16 -14 -9 -11 -25 -16 -13 -13 -14 -7 -5 -5 -16 -4 -13 -6 5 -4 2 1 -4 -6 1 4 -4 -5 0 13 -2 0 -6 -1 -7 -2 6
7685 6 6 -7 -9 3 -9 -18 -13 -14 -18 -11 -18 -8 -18 -8 -9 -16 -17 -14 -23 -19 -11 -12 -9 -10 -12 -3 -8 -6 8 1 -15 -10 2 5 -10 5 -3 4 -3 0 2 3 11 1 0 -13 -4 3
7733 3 -14 -15 -7 -13 -15 -5 -14 -20 -6 -11 -14 -15 -15 -12 -23 -17 -2 -23 -17 -16 -14 -15 -23 -10 0 -20 -14 -6 -5 4 2 8 1 -13 -7 1 -2 8 -7 -6 0 1 9 2 -6 -6 -4 -4 -16
7782 -16 -19 -14 -11 -7 -8 -24 -19 -17 -18 -25 -17 -21 -26 -34 -7 -9 -20 -11 -11 -16 -18 -12 0 -10 -10 -1 -12 0 3 -12 -2 -1 -6 12 -2 -3 5 -1 2 11 8 -3 -5 3 5 1 -13
7829 -13 -2 -2 -6 -6 -2 -17 -11 -8 -13 -15 -20 -11 -19 -21 -16 -5 -16 -8 -13 -18 -8 -11 -11 -13 -10 0 -5 -3 6 7 10 -2 21 3 -5 6 -2 0 -9 1 8 -2 3 -4 -5 1 -10
7876 -10 -3 -9 -7 -10 -11 -4 -12 -16 -18 -17 -22 -17 -15 -9 -12 -21 -13 -11 -7 -19 -30 -16 -8 -6 -5 -7 -4 -15 8 6 4 -8 -5 -1 -1 2 -8 -2 0 -6 13 -2 -3 3 7 5 -1 3 -4 -20
7926 -20 -24 -15 -14 -12 -10 -10 -26 -16 -9 -14 -22 -19 -16 -10 -17 -15 -14 -8 -11 -11 -12 -10 -10 -22 -7 -3 7 8 -7 0 0 0 -6 7 6 -3 1 0 9 -5 -1 -3 3 -7 4 0 -5 2 -3 -14
$$ packed form
7585FNKj2nkKj0J8j5J0j0JPnJ2k5KJ0LqOj5J6qj0J0RJ0nj0LNLkPm%KJojMLloJ3
7631HJqOkoKlMo%oQmj2NLoQnlKNkj4RL%jPK%j1J2rPJ1rOjnkPLqjNJ3j5KoNoNQ
7685F%j3kJ2j2rNjmPpJ0j0J0jpjLrMQjLjkRnKJ4pj6NJ2Lj5J5qPpLKJQj0jj3RP
7733Cj7jQokJ0roJ4nlj%Lj1OJ5k1OJKjqJ3J0k0OQJRkOpj4OQlJ0j5JOJQpq%K%j2
7782a6lNLMjj6NKjpQmnqK7kj1R%nkOJ2j0%Rj1J2Lj5J0JnJ8j4jQoLRlj1kQKmj4
7829a3J1%m%Mj5OLnknRqkNJ1j1QnnJ0l%kLJ0nKRJLj2K3j8qJ1qKrJ0Pj0NpjOj1
7876a0PoKljPqmkJnNKOlrQKMj2j1J4QKJkLj1K3kkj2LM%Lj0OKoJ9j5jOMkoMpj6
7926b0mRJKK%j6J0PnqLLOpKJOl%jK%j2J5MJ0Jj5P%%oJ3jrMjRj4MkOj0J1mnPnj1
$$ plain form
7976 -14 -11 -11 -10 -13 -19 -11 -13 -18 -6 -20 -19 -16 -15 -7 -15 -19 -6 -10 -13 -9 -3 -9 -11 -2 -12 5 -5 1 -4 -4 8 6 -4 -3 8 2 -7 -1 2 -6 -6 3 -4 -5 -4 -4 -15 -16 -2
8025 -2 -15 -18 -22 -19 -14 -20 -22 0 -1 -16 -22 -4 -14 -4 -6 7 -9 -10 -4 2 -2 2 7 1 -6 12 9 9 4 7 0 4 16 -3 -5 -5 9 3 4 4 5 -9 -5 -2 -5 -6 -18
8072 -18 -13 -17 -25 -4 -5 -14 -15 -15 -18 -18 -8 -17 -12 -20 -9 -11 -13 -21 -4 -7 -6 -5 3 -3 -5 6 1 -2 5 3 9 1 15 0 -3 2 3 -9 -6 2 5 -3 -14 -5 0 -8 -12 -4 -22 -17
8122 -17 -13 -17 -10 -17 -20 -10 -17 -15 -7 -6 -16 -25 -11 -5 -20 -5 -5 -18 -6 -7 3 -2 -5 2 -8 2 1 5 -3 17 9 -12 -3 2 9 -5 0 7 -9 -11 -6 6 -19 -18
8166 -18 -9 -11 -21 -20 -16 -24 -17 -13 -10 -15 -16 -9 -13 -16 -22 -9 -10 -17 1 -8 -12 -17 -4 -4 -9
$$ packed form
7976a4L%JloQknJ2j4JLJQqmJ3mlMOokRj0J7j0On%J2kj0JJ1orOLq%RpjJ%j1jJ4
8025bj3lmLNokK2jj5oJ8j0J0kJ3j6jOOmMNopJ8l%nLpMJ2j9k%J4oJ%Jj4MLljj2
8072a8NmqK1jrj%l%J0rNqJ1kkqJ7lJJQokJ1nlPkOqJ4j5lNJj2LQLqj1RNqmQj8N
8122a7MmPplJ0pKQJj0rJ4Oj5J5%j3J2jJ0nlPj0J0jMqK0qk1RNPj4NPj6kNJ2k5J
8166a8Rkj0JMqPMLnjPmloJ3jpJ8rmnJ3%n
8191i
$$ Imaginary data points
##PAGE= N=2
##DATA TABLE= (X++(I..I)), XYDATA
$$ plain form
0 0 0 0 0 0 0 0 0 0 0 0 0 0 0 0 1 -8 8 -8 8 -14 16 -16 23 -24 32 -32 40 -48 53 -60 69 -80 89 -101 113 -129
36 -129 145 -162 182 -203 224 -250 279 -309 341 -377 416 -459 507 -558 615 -676 746 -823 907
55 907 -1004 1113 -1240 1384 -1555 1761 -2008 2317 -2718 3256 -4020 5202 -7270 11906 -43290
70 -43290 67824 124467 -108373 -90177 111225 73397 -123438 -43373 118070 23673 -113872
81 -113872 -262 98805 -12524 -84492 24146 65149 -25644 -49095 24215 32896 -15418 -22916
93 -22916 4679 15962 9157 -16520 -22087 21132 33916 -31864 -41529 45507 45129 -61821 -42458
106 -42458 78301 34852 -93403 -21401 105288 4138 -112720 16279 114494 -37791 -110667
117 -110667 58585 100837 -77151 -86365 91657 67898 -101228 -47355 105148 26396 -103259
$$ packed form
0@%%%%%%%%%%%%%%JrJ6j6J6k2L0l2L9m7N6o4P2q8J01j13J29j49J69j90K14k42
36a29K74l07L44l85M27m74N29n88O50p18P93q75R66j065J173j291J422j569J730
55I07j911K117k353K624k939L316l769M325n035N974p276R222j2472J9176n5196
70d3290J11114N6643k32840J8196K01402l7828j96835Q0065J61443r4397j37545
81a13872J13610R9067j11329p1968J08638M1003r0793k3451P3310Q681m8314p498
93b2916K7595J1283o805k5677n567M3219J2784o5780r665Q7036l78j06950J9363
106d2458J20759m3449j28255P2002J26689j01150j16858J28999R8215j52285p2876
117a10667J69252M2252j77988r214J78022k3759j69126N3873J52503p8752j29655
$$ plain form
128 -103259 -6585 96356 -10205 -85042 23053 71025 -30952 -55733 33760 40848 -31817
139 -31817 -27976 25724 18206 -16876 -12543 6507 11239 3764 -14229 -12553 20954 18680 -30368
152 -30368 -21167 41312 19573 -52399 -13939 62206 4558 -69650 7641 73685 -21705 -73825
164 -73825 36333 69869 -50192 -61969 62249 50872 -71327 -37274 76908 22446 -78546
175 -78546 -7533 76237 -6414 -70542 18133 61887 -27099 -51496 32627 40280 -34614 -29351
187 -29351 33416 19886 -29320 -12424 23476 7849 -16460 -6090 9547 7203 -3638 -10847
199 -10847 -671 16083 2461 -22538 -1897 28829 -1414 -34418 6974 38460 -14194 -40217
211 -40217 22659 39737 -31124 -36466 39265 31052 -45994 -23633 50843 14800 -53598 -5503
$$ packed form
128a03259R6674J02941j06561p4837J08095M7972j01977k4781Q9493P088p2665
139c1817L841N3700p518l5082M333J9050M732p475j7993J676L3507k274m9048
152c0368R201O2479k1739p1972L8460P6145n7648p4208P7291O6044r5390n2120
164g3825J10158L3536j20061j1777J24218j1377j22199L4053J14182n4462j00992
175g8546P1013Q3770q2651o4128Q8675M3754q8986k4397Q4123P653p4894N263
187b9351O2767j3530m9206J6896L5900j5627k4309J0370J5637k344j0841p209
199a0847J0176J6754j3622k4999K0641L0726l0243l3004M1392L1486n2654k6023
211d0217O2876J7078p0861n342P5731q213p7046K2361P4476l6043o8398M8095
$$ plain form
223 -5503 53695 -3980 -51729 12457 47508 -19787 -41736 25324 35012 -28737 -27633 30337 20750
236 20750 -29732 -14317 27774 9292 -24505 -5708 20576 3656 -16708 -3452 13011 4285
248 4285 -10455 -6441 8869 9039 -8730 -11793 9999 14339 -12283 -15885 15795 16650 -19600 -15914
262 -15914 23778 14001 -27607 -10861 30695 6547 -33048 -1760 33941 -3641 -33804 8802
274 8802 32286 -13662 -29684 17891 26308 -21016 -22134 23332 17944 -24379 -13595 24544 9635
287 9635 -23830 -6259 22332 3411 -20633 -1554 18529 254 -16680 231 14976 -223
299 -223 -13705 -143 13048 780 -12791 -1266 13196 1684 -13922 -1671 15029 1225
311 1225 -16284 -340 17431 -1145 -18516 2968 19156 -5209 -19395 7662 19131 -10137
$$ packed form
223e503N9198n7675m7749O4186L5051o7295k1949O7060R688o3749J104N7970r587
236B0750n0482J5415M2091j8482l3797J8797K6284j6920k0364J3256J6463q726
248D285j4740M014J5310J70j7769l063K1792M340k6622l602L1680Q55l6250L686
262a5914L9692r777m1608J6746M1556k4148l9595L1288L5701l7582l0163M2606
274H802K3484m5948j6022M7575Q417m7324j118M5466n388m2323J0784L8139j4909
287I635l3465J7571K8591j8921k4044J9079K0083j8275j6934J6911J4745j5199
299b23j3482J3562J3191j2268j3571J1525J4462j1512j5606J2251J6700j3804
311A225j7509J5944J7771j8576j7371K1484J6188k4365j4186K7057J1469k9268
$$ plain form
323 -10137 -18256 12631 16949 -14795 -15095 16713 12909 -18146 -10474 19061 7887 -19524 -5382
336 -5382 19437 2944 -18958 -765 18099 -1093 -16974 2636 15740 -3753 -14426 4557
348 4557 13178 -5044 -12081 5240 11146 -5321 -10505 5242 10020 -5242 -9816 5293 9820 -5477
362 -5477 -9870 5955 10070 -6544 -10129 7452 10149 -8499 -9950 9693 9467 -11014 -8765 12212
376 12212 7632 -13439 -6320 14370 4673 -15055 -2845 15456 978 -15374 1016 15066 -2744
389 -2744 -14275 4404 13260 -5742 -12068 6683 10632 -7437 -9377 7652 8018 -7777 -7014 7557
403 7557 6140 -7230 -5532 6936 5317 -6542 -5134 6519 5329 -6512 -5458 6885 5627 -7500
417 -7500 -5736 8245 5485 -9330 -5158 10275 4317 -11351 -3276 12202 1933 -12783 -268
$$ packed form
323a0137q119L0887M318l1744l00L1808l804l1055P672K9535j1174k7411J4142
336e382K4819j6493k1902J8193J8864j9192j5881J9610J3104j9493j0673J8983
348D557Q621j8222p037J7321N906j6467n184J5747M778j5262m574J5109M527j5297
362e477m393J5825M115j6614l585J7581K697j8648j451J9643k26k0481K249K0977
376A2212m580k1071P119K0690r697j9728J2210J8301j4478j6352J6390J4050j7810
389b744j1531J8679Q856j9002o326J8751L949j8069j940J7029L66j5795P63J4571
403G557j417j3370J698J2468j619j1859J408J1653j190j1841J054J2343j258j3127
417g500J764J3981k760j4815M172J5433n958j5668Q075J5478j0269j4716J2515
$$ plain form
430 -268 13159 -1383 -12939 3271 12548 -4881 -11611 6406 10370 -7625 -8965 8338 7270
443 7270 -8822 -5804 8656 4264 -8317 -3139 7599 2302 -6696 -1784 5910 1805 -5061 -1999
457 -1999 4663 2600 -4447 -3245 4677 3869 -5361 -4455 6240 4580 -7571 -4479 8849 3799 -10224
472 -10224 -2713 11388 1233 -12151 698 12607 -2669 -12397 4824 11748 -6751 -10549 8389
485 8389 8882 -9673 -7009 10297 4842 -10493 -2858 10009 970 -9100 499 7790 -1451 -6225
499 -6225 1912 4701 -1704 -3276 1057 2227 59 -1633 -1422 1582 2791 -2191 -4011 3286 4865
514 4865 -4877 -5216 6720 4963 -8637 -4010 10406 2472 -11786 -395 12641 -2048 -12813
527 -12813 4610 12224 -7117 -10949 9258 9007 -10920 -6634 11888 4011 -12092 -1354 11575
$$ packed form
430b68J3427j4542j1556J6210R277j7429o730J8017L964j7995j340J7303j068
443G270j6092L018J4460m392j2581N178J0738n297q998M912P694m105o866L062
457a999O662k063p047J202P922q08r230R06J0695j660j2151L092J3328n050j4023
472a0224P511J4101j0155j3384J2849J1909j5276r728J7221O924j8499l798J8938
485H389M93j8555K664J7306n455j5335P635J2867r039j0070R599P291r241m774
499f225Q137K789o405j572M333J170k168j692K11L004J209m982j820P297J579
514D865r742l39J1936j757j3600M627J4416p934j4258J1391J3036j4689j0765
527a2813J7423P614j9341l832K0207k51j9927M286J8522p877j6103J0738J2929
$$ plain form
540 11575 -1030 -10331 3028 8554 -4398 -6449 5034 4167 -4991 -2107 4171 323 -2856 869
554 869 1027 -1422 975 1228 -2876 -198 4537 -1335 -5561 3455 5995 -5755 -5617 8053 4412 -10168
570 -10168 -2561 11597 -3 -12525 2747 12451 -5709 -11621 8406 9939 -10640 -7533 12272
583 12272 4755 -12944 -1643 12818 -1272 -11759 3879 9947 -5901 -7661 7067 4916 -7489
596 -7489 -2315 6899 -146 -5639 2031 3750 -3223 -1443 3699 -873 -3161 3170 1979 -4843 -30
611 -30 6003 -2281 -6346 4763 5782 -7273 -4521 9243 2373 -10789 158 11430 -3075 -11243
625 -11243 5998 10207 -8584 -8258 10766 5784 -12088 -2777 12636 -292 -12222 3231 10870
638 10870 -5810 -8932 7589 6275 -8704 -3527 8803 704 -8044 1761 6552 -3599 -4382 4788
$$ packed form
540A1575j2605r301J3359N526j2952k051J1483q67r158K884O278l848l179L725
554H69J58k449K397K53m104K678M735n872m226R016K540j1750J38J3670l641j4580
570a0168P607J4158j1600j2522J5272R704j8160n912K0027J533k0579L107J9805
583A2272p517j7699J1301J4461j4090j0487J5638O068j5848j760J4728k151j2405
596g489N174R214p045n493P670J719o973J780N142m572k288O331j191o822M813
611c0O033q284m065J1109J019j3055K752J3764o870j3162J0947J1272j4505q168
625a1243J7241M209j8791L26J9024m982j7872R311J5413j2928j1930J5453P639
638A0870j6680l122J6521j314j4979N177J2330q099q748R805M791j0151p83R170
$$ plain form
652 4788 2011 -4978 517 4419 -2731 -3013 4472 1013 -5547 1313 5704 -3838 -5153 6101 3688
667 3688 -8013 -1653 9255 -867 -9714 3609 9374 -6228 -8152 8570 6255 -10321 -3808
680 -3808 11368 1015 -11601 1784 10953 -4460 -9593 6618 7549 -8186 -5131 8979 2521
693 2521 -8912 54 8123 -2228 -6626 3926 4638 -4905 -2408 5101 135 -4559 1855 3296 -3420
708 -3420 -1524 4317 -593 -4473 2766 3899 -4751 -2605 6334 753 -7313 1436 7586 -3790 -7149
723 -7149 5976 5944 -7924 -4220 9284 1994 -10033 401 10034 -2822 -9335 5014 8022 -6742
737 -6742 -6185 7975 4076 -8523 -1851 8379 -290 -7643 2067 6324 -3480 -4732 4222 2861 -4399
752 -4399 -1054 3987 -558 -2974 1853 1623 -2539 60 2741 -1717 -2265 3244 1226 -4447 155 5111
$$ packed form
652D788k777o989N495L902p150k82P485l459o560O860M391r542j315J1254k413
667C688j1701O360J0908j0122q847J3323N765j5602j924J6722k315j6576O513
680c808J5176j0353j2616J3385R169j5413n133J6211R31j5735L055J4110o458
693B521j1433Q966Q069j0351m398J0552P12r543K497P509m966m694O414J441o716
708c420J896N841m910l880P239J133q650K146Q939n581q066Q749O150j1376l359
723g149J3125l2j3868L704J3504p290j2027J0434R633j2856o513J4349L008j4764
737f742N57J4160l899j2599O672J0230q669p353R710M257r804j252Q954j361p260
752d399L345N041m545k416M827k30m162K599K681m458n48N509k018n673M602M956
$$ plain form
768 5111 -1930 -5351 3651 4857 -5411 -3925 6818 2473 -7807 -685 8313 -1201 -8151 3152
782 3152 7561 -4810 -6405 6185 4877 -7090 -3201 7404 1359 -7307 242 6601 -1732 -5624
796 -5624 2734 4312 -3351 -2897 3525 1584 -3159 -336 2521 -527 -1488 1098 359 -1215 805 854
812 854 -1906 -242 2612 -848 -3167 1948 3155 -3218 -2828 4359 2111 -5286 -1023 6004 -196 -6245
828 -6245 1644 6162 -2980 -5647 4204 4777 -5202 -3681 5802 2341 -6137 -1068 5978 -230 -5550
843 -5550 1296 4826 -2095 -3862 2619 2885 -2740 -1845 2607 983 -2148 -282 1492 -145 -767 232
859 232 -57 -110 709 -356 -1285 950 1543 -1729 -1584 2503 1348 -3223 -836 3849 127 -4244 740
876 740 4374 -1664 -4285 2589 3887 -3440 -3304 4094 2493 -4562 -1587 4775 640 -4718 290 4451
$$ packed form
768E111p041l421R002J206j0268J486J0743m345j0280P122Q998r514o950J1303
782C152M409j2371j595J2590j308j1967L889J0605o045q666P549O359q333l892
796e624Q358J578p663M54O422j941m743K823K857l048r61K586p39j574K020M9
812H54k760J664K854l460k319N115J207o373L90P187k248p397M263P027o200o049
828f245P889M518r142k667R851N73r979J521R483l461q478N069P046o208n320
843e550O846L530o921j767O481K66n625Q95M452j624l131J866J774j637o22R99
859B32k89n3Q19j065r29K235N93l272J45M087j155m571K387M685l722m371M984
876G40L634o038k621O874J298p327J36P398j601p055K975O362m135n358N008M161
$$ plain form
892 4451 -1103 -3962 1738 3312 -2189 -2599 2380 1835 -2375 -1170 2132 617 -1740 -208 1265 47
908 47 -723 -48 235 263 167 -629 -425 1084 461 -1623 -377 2070 26 -2536 395 2795 -1011 -2944
926 -2944 1634 2878 -2279 -2596 2931 2195 -3375 -1591 3786 942 -3952 -201 3942 -526 -3789 1137
942 1137 3376 -1739 -2947 2072 2327 -2356 -1749 2405 1171 -2268 -618 2055 257 -1651 51 1279
958 1279 -117 -841 47 432 120 -193 -500 -42 808 -33 -1275 132 1587 -480 -1888 902 2064
975 2064 -1380 -1999 1975 1880 -2453 -1502 2939 1058 -3243 -467 3416 -194 -3476 805 3251 -1487
991 -1487 -2992 1966 2491 -2382 -1946 2622 1360 -2666 -716 2601 212 -2300 266 1960 -562 -1512
1007 -1512 708 1017 -718 -619 494 204 -253 -11 -175 -114 583 31 -1016 225 1369 -580 -1561 1095
$$ packed form
892D451n554k859N700J574n501m10M979n45m210J205L302j515k357J532J473j218
908D7p70O75K83K8r6p96K04J509o23k084J246K447k044k562K931K400l806j933
926b944M578J244n157l17N527p36n570J784N377k844m894L751M143m468l263M926
942A137K239n115j208N019K55m683O07M154j234l439J650K673j798j908J702J228
958A279j396p24Q88L85l12l13l07M58Q50q41j242J407J455k067j408K790J162
975B064l444o19L974r5m333R51M441j881m301K776L883l610l282M281K446m738
991a487j505M958N25m873M36M568j262m026J950L317k389k512K566J694k522r50
1007a512K220L09j735R9J113k90m57K42j64O1O97n52j047J241J144j949r81K656
$$ plain form
1025 1095 1652 -1619 -1525 2149 1231 -2640 -790 2992 186 -3201 462 3207 -1148 -3041 1783 2664
1041 2664 -2323 -2133 2746 1506 -2952 -800 2982 123 -2801 492 2428 -1003 -1972 1305 1377 -1472
1057 -1472 -795 1395 230 -1160 212 779 -523 -286 650 -249 -586 759 314 -1204 98 1451 -661
1074 -661 -1586 1252 1481 -1854 -1191 2378 705 -2760 -72 2992 -656 -2964 1421 2749 -2096 -2312
1090 -2312 2656 1676 -3065 -975 3221 147 -3182 586 2866 -1289 -2398 1781 1750 -2080 -1031 2177
1106 2177 310 -1999 352 1652 -864 -1098 1186 447 -1314 201 1147 -857 -847 1309 285 -1663
1122 -1663 341 1755 -1020 -1627 1715 1292 -2252 -700 2705 48 -2860 770 2820 -1540 -2534 2220
1138 2220 1989 -2816 -1326 3123 470 -3260 348 3100 -1167 -2701 1858 2123 -2324 -1347 2614 554
$$ packed form
1025A095N57l271R4L674r18l871J850L782k806l387L663K745m355j893M824Q81
1041B664m987J90M879j240m458K152L782k859k924L293J936l431r69L277P2k849
1057a472O77K190j165j390J372N67j302K37R36q99l37J345m45j518J302J353k112
1074f61r25K838K29l335O63L569j673l465K688L064l648k308M385J328m845k16
1090b312M968r80m741K090M196l074l329L768K280m155j109M179l1l830J049L208
1106B177j867k309K351J300k516k34K284p39j761J515R46k004J0K156j024j948
1122a663K004J414k775o07L342m23l544J552L405k657k908L630K050m360r94M754
1138B220k31m805J490M449k653l730L608K752m267j534M559K65m447R77L961k060
$$ plain form
1154 554 -2560 290 2318 -974 -1824 1488 1135 -1842 -423 1842 -386 -1668 1031 1197 -1583 -565
1170 -565 1914 -151 -1936 956 1789 -1632 -1310 2245 690 -2598 77 2728 -908 -2633 1661 2216
1186 2216 -2387 -1675 2860 907 -3172 -69 3181 -766 -2931 1562 2489 -2168 -1804 2604 1029 -2767
1202 -2767 -184 2670 -624 -2340 1284 1743 -1810 -1075 2018 262 -2052 495 1772 -1183 -1289 1723
1218 1723 640 -1983 150 2050 -908 -1793 1638 1347 -2183 -686 2527 -89 -2627 885 2434
1233 2434 -1662 -2024 2295 1405 -2737 -643 2958 -179 -2901 988 2603 -1690 -2089 2243 1413 -2577
1249 -2577 -647 2647 -163 -2519 879 2138 -1480 -1573 1894 884 -2090 -123 2041 -570 -1747
1264 -1747 1179 1249 -1649 -634 1860 -97 -1879 787 1637 -1408 -1185 1907 604 -2184 124 2270
$$ packed form
1154E54l114K850K028l292q50L312l53k977J419K265k228j282K699J66k780J018
1170e65K479k065j785K892Q33l421L22L555j555l288K675K651l636j725M294N55
1186B216m603P12M535j953m079L103L250l947k165M493R27m657L64M408j575l796
1202b767K583K854l294j716L624M59l553P35L093j756k314K547J277k955j06L012
1218A723j083k623K133J900k958q85L431k91l530J497L213k616k538L512J549
1233B434m096l62M319q90m142K094L601l137k722L889J615m293l99M332q30l990
1249b577J930L294k810k356L398J259l618r3L467j010k974J967K164k611j177
1264a747K926P0k898J015K494j957j782K666Q50l045K23L092j303k788K308K146
$$ plain form
1280 2270 -832 -2075 1539 1685 -2077 -1091 2464 398 -2610 323 2498 -1070 -2228 1651 1690 -2143
1296 -2143 -1081 2376 364 -2405 356 2228 -966 -1799 1502 1307 -1796 -663 1927 9 -1843
1311 -1843 583 1529 -1130 -1117 1454 535 -1652 50 1599 -644 -1387 1176 1010 -1531 -452 1784
1327 1784 -91 -1760 716 1618 -1234 -1261 1666 781 -1958 -222 2028 -425 -1986 956 1660 -1485
1343 -1485 -1264 1811 716 -1996 -122 2014 -441 -1803 981 1490 -1371 -1017 1615 477 -1715 45
1359 45 1572 -577 -1352 948 947 -1256 -494 1373 2 -1326 482 1136 -876 -795 1182 395 -1314 69
1377 69 1319 -526 -1178 922 876 -1259 -536 1427 60 -1516 376 1403 -823 -1182 1174 855 -1416
1394 -1416 -422 1550 -11 -1518 460 1382 -838 -1112 1145 746 -1352 -327 1382 -96 -1313 478
$$ packed form
1280B270l102j243L614J46l762R86L555k066l008K933K175l568j158L879L9l833
1296b143J062L457k012k769K761J872l194q33L301j95l103J133K590j918j852
1311a843K426R46k659J3K571r19k187J702J549k243p43K563j66k541J079K236
1327A784j875j669K476R02k852k7K927q85k739J736K250k453j561K942P04l145
1343a485K21L075j095k712J874K136k455j362K784N09k861L54K632j138k192J760
1359D5J527k149p75K300jk203P62J867j371j328J808O54k012Q1J977p87j709J383
1377F9J250j845o52K100m6k135P23J963j367j576J892J027k226l59K356l19k271
1394a416R94J972j561j507J978R22k220k74K257l99k098J025J709j478j217J791
$$ plain form
1410 478 1117 -799 -814 1026 470 -1098 -70 1089 -277 -945 591 694 -820 -389 931 39 -951
1427 -951 303 821 -616 -621 850 331 -986 -5 1024 -338 -947 651 764 -926 -519 1085 186 -1200
1445 -1200 127 1154 -475 -1048 756 849 -971 -581 1107 269 -1152 60 1099 -334 -951 600
1461 600 761 -766 -485 868 199 -861 69 763 -337 -614 505 379 -622 -128 648 -123 -576 373
1479 373 450 -557 -244 669 8 -721 250 652 -502 -564 679 342 -857 -132 901 -133 -891 394
1497 394 792 -619 -640 812 427 -904 -172 949 -67 -913 303 802 -525 -661 654 440 -764
1514 -764 -233 767 -18 -721 219 598 -369 -420 489 243 -517 -21 505 -157 -399 327 250 -452 -84 463
1534 463 -145 -481 309 376 -503 -258 614 60 -682 163 696 -343 -624 566 501 -700 -315 802 102
$$ packed form
1410D78O39j916j5J840n56j568J028J159j366o68J536J03j514M31J320q92r90
1427i51J254N18j437nJ471n19j317R81J029j362o09J598J13j690M07J604q99j386
1445a200J327J027j629n73J804R3j820L90J688q38j421J212J039j433o17J551
1461F00J61j527K81J353o69j060R30O94j100k77J119j26j001M94P76p71m53R49
1479C73P7j007L13R13o61p29R71M02j154o2J243l37j199P25J033j034p58J285
1497C94L98j411k1J452l85j331P32J121j016q46J216M99j327j36J315k14j204
1514g64N31J000p85p03R40L79r67n1R09k46p60M96N26o62k42P26p7p02L68N47
1534D63o08l36P90O7q79K45Q72n54p42Q45N33j039k81J190o5j201L85J117p00
$$ plain form
1553 102 -855 108 800 -333 -726 492 568 -639 -385 722 181 -728 32 680 -191 -572 366 448 -447
1572 -447 -237 502 63 -484 112 393 -273 -291 352 91 -435 43 392 -258 -346 371 209 -499 -58 557 -115
1593 -115 -572 320 512 -483 -397 624 231 -736 -46 745 -163 -725 349 628 -531 -490 642 298 -709
1612 -709 -105 711 -105 -662 272 543 -413 -393 508 205 -540 -30 489 -154 -409 298 272 -404 -103 434 -79
1633 -79 -415 226 326 -390 -219 475 34 -557 121 513 -312 -478 471 335 -601 -182 674 -7 -683 206
1653 206 650 -386 -535 535 382 -653 -203 685 -16 -696 186 587 -392 -486 485 288 -576 -103 587
1672 587 -91 -533 260 423 -377 -263 483 92 -494 98 449 -276 -385 383 205 -514 -60 516 -154 -506
1692 -506 320 405 -470 -264 587 99 -621 117 629 -267 -548 465 438 -586 -274 664 66 -708 120 648
$$ packed form
1553A02r57R63O92j133l93J218P6j207K54J107n41r09P60O48q71l81R38Q2q95
1572d47K10P39m39n47N96K81o66j8O43k61n26M78L49o50q8P17j62p08M41O15o72
1593a15m57Q92J92r95Q6J021l93r67O90P91r08n62J074K79j159M1J132l44j007
1612g09O04Q16q16n57R34K71r56K0R01l03p45N10N19o43k55P07k6o76L01N37n13
1633g9l36O41J00p16J71O94m41n91O78L92q25j66R49j36r36M19Q56o81o76Q89
1653B06M44j036j49J070j53j035M50Q88p01o80Q82M01r79r4R71j97q64M73O90
1672E87o78m42P93J63q00J14P46l91n86N92L51p25j09P68j78p19M54N76o70l52
1692e06Q26Q5q75K06Q51m88p20P38N12q96k81J013k7j024L12R38n98p74Q28N28
$$ plain form
1712 648 -323 -563 463 400 -576 -235 624 32 -613 168 553 -334 -420 454 243 -534 -66 517 -144 -493
1732 -493 290 353 -454 -217 502 13 -534 158 485 -338 -375 489 230 -564 -47 590 -150 -571 339 462 -498
1753 -498 -332 586 134 -654 52 638 -245 -580 414 442 -567 -282 636 100 -661 89 623 -278 -532 412
1773 412 392 -527 -225 560 20 -575 138 495 -317 -377 420 224 -481 -40 486 -147 -441 292 312 -432 -174
1794 -174 499 -10 -522 187 459 -369 -369 504 223 -575 -47 615 -128 -593 319 501 -469 -364 581 201 -648
1815 -648 -23 631 -174 -589 326 452 -466 -339 529 149 -574 16 534 -185 -459 315 335 -403 -190 454
1835 454 21 -455 133 379 -275 -283 361 132 -435 12 434 -172 -385 323 289 -436 -156 506 -1 -525 161
1856 161 488 -324 -409 448 267 -552 -142 572 -43 -569 202 509 -342 -406 454 254 -519 -104 522 -54 -476
$$ packed form
1712F48r71k40J026o3r76L41Q59n92o45P81L85q87q6Q74k11p77M68N83o61l49
1732d93P83O3q07K37P19m89n47O92L27q23l7Q64k59p94N17O37p40m21R10J23r60
1753d98J66R18m52p88P06N86q83l35R94K8j009K85R18n36p61P50N34r01k54R44
1773D12k0r19L02P85n40n95P13L57q12o0P97j96p05M41N26o33k94P33K0p44K58
1794a74O73n09n12P09K72q28%Q73k81p98N28O62p43m65R12J82r70J05R45l80q49
1815f48O25O54q05m15R15J26r18J27Q68l80p23N90N18p19k74P74K0p38K13O44
1835D54m33m76N88K46o54qO44k29n67M47M22o06k13P08l4p25K80O62n07n24O86
1856A61L27q12q5Q57j81q19M10P14o15n26P71L07q51o4Q60k00p73M15O26n76m22
$$ plain form
1877 -476 205 384 -314 -284 363 144 -421 -9 384 -144 -324 250 227 -333 -86 367 -24 -354 167 319 -269
1898 -269 -217 357 109 -416 11 408 -161 -392 269 288 -385 -205 426 54 -474 66 438 -202 -391 322 299
1919 299 -401 -175 433 27 -443 87 388 -225 -356 291 212 -375 -126 357 -16 -361 121 300 -221 -206 268
1940 268 106 -308 11 295 -114 -242 214 174 -292 -88 297 -42 -320 139 264 -242 -214 299 116 -358 -22
1961 -22 364 -93 -335 189 291 -274 -226 330 111 -368 -10 351 -99 -332 183 254 -256 -177 284 66 -307
1982 -307 12 278 -119 -241 176 160 -228 -77 243 -17 -245 88 196 -182 -137 220 54 -244 26 239 -113
2003 -113 -204 169 158 -250 -91 256 -7 -292 67 241 -168 -222 207 139 -274 -73 279 -17 -278 93 246
2024 246 -160 -187 220 134 -246 -63 241 -27 -244 78 185 -164 -148 176 65 -203 -3 184 -72 -157 111
$$ packed form
1877d76O81J79o98L0O47k19n65M12L93n28j80N74k3n60K47M53l91l30N21J52n88
1898b69N2N74k48n25M27L97n69k31O61J9o73J80O31l72n28N40L72o40j89P13k3
1919B99p00K26O08m06m70N30L01o13j31O47p9n87K49M83l73l45M82J79n21J5M74
1940B68j62m14L19K84m09j28M56m0m66K04L85l39k78M59J25n06K8N13j83m74L36
1961b2L86m57k42N24J02n65M8N56k19m79L58L61m50k33N15P1n10P9M61k18l73
1982c07L19K66l97j22M17j6l88J51L20k60k28L33J08l78M5L57j66k98K70K13l52
2003a13r1L73j1m08J59L47k63k85L59J74m09n4M29o8m13K01L52k96k61L71J53
2024B46m06k7M07q6l80J83L04k68k17L22J07l49J6L24j11k68K00J87k56q5K68
$$ plain form
2045 111 109 -155 -62 179 -13 -185 68 157 -130 -114 164 53 -208 -8 187 -85 -201 125 153 -183 -112 198
2067 198 30 -223 19 211 -87 -185 137 147 -172 -95 202 27 -202 23 182 -82 -168 120 101 -166 -65 165
2089 165 10 -159 48 133 -94 -93 120 57 -140 -6 136 -40 -125 80 91 -127 -54 131 -5 -158 30 122 -107
2112 -107 -114 131 64 -161 -25 157 -37 -161 79 121 -128 -112 144 47 -171 -18 170 -37 -171 81 127 -118
2134 -118 -102 139 60 -152 -26 145 -30 -129 61 93 -111 -81 108 13 -123 3 95 -55 -87 77 54 -93 -21
2157 -21 88 -42 -92 68 62 -93 -54 107 1 -121 16 111 -67 -99 96 69 -133 -47 152 -5 -153 42 140
2180 140 -81 -106 108 80 -133 -50 143 6 -138 27 113 -69 -112 80 64 -101 -46 92 -8 -95 18 54 -59
2203 -59 -62 65 6 -81 15 60 -59 -65 68 18 -88 2 88 -42 -87 55 63 -104 -53 108 18 -133 8 123 -54 -113
$$ packed form
2045A11kk64R3K41j92j72K53Q9k87J6K78j11k61K00J95k72j16L26K8l36P1L10
2067A98j68k53K42J92k98r8L22J0l19P7K97j75k29K25J59k64q6K88j9k67J01K30
2089A65j55j69K07Q5k27JK13o3j97J34J42j76q5K05J1k18P3J85j36j53J88R2k29
2112a07pK45o7k25J36J82j94j24K40M2k49J6K56r7k18J53J88k07j34K52M6k45
2134a18J6K41p9k12J26J71j75r9J90L2k04L0J89r5j36J26R2j50l2J64k3j47P2
2157b1J09j30n0J60oj55L9J61j06j22J37R5j78l2J95k7k02Q6J99j57j48J95R8
2180A40k21k5K14k8k13Q3J93j37j44J65Q6j82m3J92j6j65N5J38j00q7J13L6j13
2203e9lJ27n9q7R6M5j19oJ33n0j06R0Q6j30m5J42Qj67N1J61r0j51J41J15j77n9
$$ plain form
2229 -113 75 102 -99 -66 108 38 -136 -4 123 -30 -112 59 79 -76 -58 84 32 -93 9 91 -28 -65 49
2252 49 26 -73 -20 58 -24 -64 36 24 -62 -27 64 -19 -82 42 64 -75 -54 87 23 -104 1 105 -37 -111 58 91
2278 91 -81 -67 98 45 -126 -20 120 -19 -103 37 100 -65 -69 86 43 -90 -19 83 -7 -85 17 46 -66 -41
2302 -41 39 -6 -74 15 46 -58 -39 59 14 -64 25 60 -36 -55 61 47 -86 -25 81 -12 -91 30 89 -71 -76 84 58
2329 58 -93 -19 99 -10 -101 26 84 -61 -72 74 37 -97 -17 70 0 -87 23 62 -47 -50 47 17 -79 0 56 -27
2355 -27 -51 44 34 -64 -20 54 -22 -56 32 51 -54 -29 69 9 -81 9 88 -36 -61 61 41 -81 -31 85 3 -88 13
2382 13 67 -56 -77 42 42 -82 -27 73 -14 -86 16 56 -49 -60 48 25 -75 -12 51 -32 -56 30 30 -64 -43 49 -19
2409 -19 -74 7 31 -51 -49 49 20 -63 7 70 -18 -51 38 47 -60 -30 69 12 -77 4 62 -53 -76 33 38 -74 -48 63 3
$$ packed form
2229a13J88K7k01L3J74p0j74J32J27j53q2J71K0j55J8J42n2j25J02Q2j19l7J14
2252D9k3r9N3P8q2m0J00j2q6L5R1q3o3J24K2j39K1J41o4j27J05J04j42p4J69L3
2278I1j72J4J65n3j71J06J40j39q4J40O3j65mJ55m3j33P1J02r0p8J02K9j12K5
2302d1Q0m5o8Q9L1j04J9R8m5p8Q9L5r6j9J16j4j33O1J06r3p9J21N9j60nJ60k6
2329E8j51P4J18j09r1J27N8j45j1J46l7j34Q0Q7p0q7J10L9j09lR7l0r6P9N6q3
2355b7k4R5j0r8M4P4p6l4Q8J9j05K5R8o0r0R0P9j24k5J22k0j22N0J16q2r1J01
2382A3N4j23k1J19%j24N5J00q7p2J02M0j05j1J08k3j00O3O3q3k4Q6%r4K1R2o8
2409a9n5Q1K4q2KR8k9q3P0O3q8l3Q9Rj07L0R9n7q9Q1N8j15k3J09Nj12K6J11o0
$$ plain form
2438 3 -80 11 55 -42 -61 52 32 -69 -19 65 -17 -69 22 44 -43 -39 52 0 -70 2 40 -31 -50 31 36 -49 -19 49 -8 -59 26
2469 26 50 -38 -32 57 25 -70 -9 61 -7 -61 37 47 -59 -29 56 13 -63 -6 54 -38 -69 27 42 -61 -35 45 -10 -73 3 33
2499 33 -38 -43 36 17 -59 -4 50 -14 -51 27 35 -50 -23 47 -6 -48 -6 39 -26 -44 43 14 -55 -8 57 -17 -55 27 38 -41 -39 46
2531 46 16 -59 3 60 -16 -55 19 27 -42 -26 37 18 -48 2 36 -21 -41 27 40 -46 -5 32 8 -33 9 26 -19 -21 31 15 -36
2562 -36 7 29 -16 -36 30 27 -36 -16 36 3 -47 14 41 -25 -33 20 20 -42 -18 40 4 -50 17 49 -30 -29 40 12 -40 -10 29 -17
2594 -17 -46 22 24 -29 -24 23 4 -36 -8 27 -28 -21 29 18 -26 -9 29 -4 -24 9 26 -17 -20 24 -1 -34 8 25 -25 -29 10 14 -39
2627 -39 -21 31 -11 -32 8 19 -28 -35 28 9 -35 -9 27 6 -40 13 26 -27 -29 15 11 -32 -6 12 -8 -16 13 20 -22 -4 21 2 -26
2660 -26 4 15 -17 -11 21 10 -19 -1 18 -15 -27 6 11 -13 -12 16 -8 -26 -3 14 -15 -21 18 10 -26 -6 17 -6 -24 19 21 -9 -23
$$ packed form
2438Cq3R1M4r7j9J13k0j01N0Q4q2n2R1K2q7MR1n2p0P2L8p1j9Q1Nq5L0O8n7n1Q5
2469B6K4q8OQ9l2r5O1P0o8n4R8J0j06L0Q5m3p6N7O0r2l1R6J5j03K6Q0n5o3P6L0
2499C3p1nP9j9p6N5N4o4l7P8Qq5K7P0n3m2M2M5o5j8Q7k9o9M7O5p4l8Q2J1p9KQ5
2531D6l0p5O2N7p6l9P4Qo9J6O3j9o6N0L4n7k0O8J3q6M1L7k4m1M2J7m5kN2j6n1
2562c6M3K2m5k0O6lo3K0N2l3n0O1K7o6qN3%o2K4N8l6n4O7L2p9JO9k8n2L0L9m6
2594a7k9O8Kn3NM7j9m0K8L5n5PN0j1m4J7L8l3k0L3J7m3lM4k5l3M2J7n0mL9Mn3
2627c9J8N2m2k1M0J1m7pO3j9m4K6L6k1m6N3J3n3kM4mm3K6J8k0qK9Pm2J8K5j9k8
2660b6L0J1l2OL2j1k9J8J9l3j2L3Nk4JK8k4j8K3J7k9oL9ql6K0K3k3j8M3Kl0j4
$$ plain form
2693 -23 13 4 -27 -8 26 5 -24 6 14 -14 -11 23 3 -26 1 25 -12 -16 11 3 -17 -3 21 -12 -18 5 14 -17 -9 18 -6 -16 -3 14
2727 14 -22 -19 9 3 -28 -12 10 -7 -35 -1 6 -19 -6 12 1 -23 -1 16 -8 -14 11 16 -25 -15 15 5 -17 -5 5 -13 -20 8 0 -20
2761 -20 -9 19 -2 -23 12 7 -22 -18 12 -6 -11 11 13 -14 -12 12 -11 -18 -9 9 -17 -30 7 11 -33 -17 15 -14 -26 -1 26 -10 -14 3 19
2796 19 -26 -13 22 7 -15 -5 26 -17 -18 5 2 -19 -3 1 -20 -15 9 5 -26 -16 9 -5 -20 -8 12 -12 -16 15 0 -13 -9 22 -2 -25
2830 -25 3 7 -14 -22 9 0 -29 -1 18 -12 -22 11 16 -17 -14 22 -2 -15 8 18 -1 -17 13 5 -29 -10 12 -10 -16 3 9 -22 -20 11 0
2865 0 -34 -11 10 -18 -27 8 7 -26 -4 19 1 -25 6 26 -21 -19 20 9 -28 -10 14 -17 -24 7 18 -26 -10 28 2 -22 3 22 -8
2898 -8 -26 17 24 -21 -8 41 4 -15 22 19 -21 -17 19 3 -29 -4 22 -19 -29 17 18 -27 -14 18 -8 -28 1 15 -27 -23 16 5 -26
2931 -26 0 29 -21 -29 16 27 -26 -16 21 14 -36 9 22 -19 -29 24 9 -35 -20 29 -6 -26 15 32 -16 -10 32 9 -26 -3 25 -20
$$ packed form
2693b3L6rl1J9L4k1k9L0Qk8LL4k0k9K7K4l7mK7qk0J4K4l3oK3Rl1QK7k4j0J3J7
2727A4l6LK8ol1J6K2j7k8L4Pk5J3J8j1k4K2J7k4oK5Nm1J0L0j0k2J2J0j8pK8qk0
2761b0J1K8k1k1L5nk9ML0j8nK2Kk7KK4k3pRJ8k6j3L7Mm4J6L2k9j2K5K7l6mJ7J6
2796A9m5J3L5j5k2J0L1m3jK3lk1J6Mk1NK4ml1J0K5j4j5J2K0k4mL1j5j3ML1k4k3
2830b5K8Mk1qL1rk9K8J9l0j0L3Nl3LL6k4j3K3J0j9j6L0ql4J9K2k2oJ9Ol1KL1j1
2865@l4K3K1k8rL5jl3K2K3j8k6L1K0m7KL9j1l7J8K4l1pL1J1m4J6L8k6k4K5J9l0
2898hj8M3Pm5J3M9l7j9L7lm0ML6j6l2K5K6m1j0M6Jm5J3L2k6k0K9J4m2ML9j1l1
2931b6K6K9n0qM5J1n3J0L7pn0M5J3m1j0N3j5m4J5M9l5k0M1J7m8OM2k3l5K3K8m5
$$ plain form
2963 -20 -33 5 12 -43 -29 25 -4 -47 1 22 -26 -42 11 4 -29 -3 33 -12 -33 5 19 -27 -20 28 10 -33 7 28 -18 -37 12 18
2995 18 -27 -18 25 -4 -39 12 20 -35 -28 23 5 -46 -15 30 -18 -37 3 23 -34 -27 35 8 -38 -3 21 -27 -42 17 9 -51 -28 39 -12
3028 -12 -44 6 27 -32 -42 25 7 -43 -15 35 -19 -38 16 36 -26 -40 36 6 -42 12 26 -21 -46 12 15 -43 -21 23 2 -39 -7
3059 -7 28 -32 -34 29 14 -48 -3 33 -14 -39 1 29 -48 -38 36 4 -44 -8 34 -24 -42 21 23 -41 -11 36 -9 -50 17 36 -30 -30
3091 -30 32 18 -40 -5 44 -13 -38 15 34 -44 -34 46 4 -52 -14 27 -39 -35 16 15 -35 -14 47 -2 -53 3 36 -29 -42 32 3
3122 3 -39 -6 40 -18 -54 21 40 -39 -26 31 9 -45 -3 47 -25 -40 25 34 -26 -24 50 4 -52 16 43 -26 -40 32 22 -63 3 41
3154 41 -12 -48 19 39 -50 -44 39 -1 -56 -4 37 -16 -56 21 31 -49 -26 49 2 -52 2 46 -35 -42 35 25 -51 -15 34 -10 -44
3185 -44 13 36 -41 -35 29 22 -57 -7 38 -12 -50 24 20 -38 -23 43 5 -63 -7 42 -30 -51 37 24 -56 -18 38 -15 -54 7 37 -39
$$ packed form
2963b0j3L8Pn5J4N4k9m3M8K1m8j6N3pl3K6L6m5k1L8J4m6PM8j8m3M0K1m6j9M9O
2995A8m5RM3k9l5N1Qn5PN1j8n1L1M5m8j9M0K0n7PO2k7m6L5K4m8j5N9qo0K3O7n1
3028a2l2N0K1n9j0O7j8n0K8N0n4j9N4K0o2j4P6l0m8N4J4m7k5N8Ln8K2M4k1m1L2
3059gL5o0kO3j5o2M5L6m7k5M0K8p7J0P4l2m8L6M2n8j8O3Ko4L0M7m5m1O7J9o6%
3091c0O2j4n8L5M9n7k5N3J9p8J0Q0m2n6L8M1o6MN1jn0K1O1m9n1N6L3o5j3P4k9
3122Cm2L3M6n8l6P5J9p9J3N7k2n4M2N0p2j5O5Ro0KP4m6n6O8K7o9j4P2j0q5O6L8
3154D1n3l6O7K0q9OQ3m0n5N2M1n3m0P7J0q0K3P5m7n4N4M4q1pP7j0p6L6M9m4l4
3185d4N7K3p7OO4pp9N0M5n0l8P4mn8J5O6l8o8N6M9p2k1Q8j3q0L8N6n3l9O1L0p6
$$ plain form
3217 -39 -41 35 18 -55 -7 50 -8 -48 27 44 -39 -38 47 7 -52 -16 46 -22 -39 33 38 -41 -26 39 -4 -63 15 41 -29 -34 39 9
3249 9 -51 -6 46 -9 -53 9 38 -46 -23 44 0 -59 -7 38 -30 -51 24 14 -59 -21 38 -14 -61 12 38 -36 -50 41 27 -53 -15
3280 -15 56 -7 -51 20 38 -37 -42 44 22 -62 -15 45 -29 -57 20 23 -60 -29 31 4 -51 3 46 -33 -41 30 24 -57 -5 53 -12 -50
3312 -50 11 32 -53 -34 35 12 -60 -12 52 -22 -60 30 34 -55 -20 47 7 -51 15 61 -22 -42 38 33 -52 -13 51 -7 -69 3 35
3343 35 -48 -48 43 11 -62 -19 40 -29 -45 22 24 -49 -27 47 6 -61 -3 42 -43 -47 26 22 -57 -20 49 6 -51 17 52 -27 -55 45
3375 45 10 -61 -7 60 -10 -55 35 40 -49 -32 51 13 -61 -2 49 -38 -58 28 21 -62 -30 41 -14 -67 -6 38 -48 -48 24 21 -50 -16
3407 -16 40 -24 -55 17 28 -52 -25 57 10 -55 7 46 -30 -48 30 27 -57 -16 57 -7 -74 20 53 -41 -41 52 23 -61 -9 56 -10
3438 -10 -61 23 54 -42 -44 37 7 -60 -13 48 -23 -65 29 32 -49 -31 41 -7 -59 3 54 -23 -42 45 20 -45 -13 47 -13 -43 29
$$ packed form
3217c9kP6j7p3M8N7n8m0P5J7q3JQ5m0n9L6O2o8j7P2Np9J5O5m3n9P8K6p0nP3l0
3249Io0M5N2n5m4O2K9q4K3O7m4n9N2M5o8k1P5j0p3L8N9n2m7P3K6p4j4R1j4q0L8
3280a5P1o3m4P1J8p5nQ6k2q4M7O0p4k8P7Lq3L1O0k7n5N4M3p9qP1oq1N2N8o5l8
3312e0O1K1q5J9O9k3p2M8O4p4l8R0Mq9L5O7m0n8O6M6q3k0Q0nq5L9O4n8o2P2L2
3343C5q3%R1l2p3M3N9o9j6O7Kp3K2P4m1o7N8M5q5mP3mp9L7O9m3n7O8L5p9k8J00
3375D5l5p1N4O7p0m5R0Nq9J7Q3l8p4N9N1q7k0Q6pq3L2P1n5n3O1M4q6%P2lp1L4
3407a6N6o4l1P2J1q0K7Q2m7o5O2L9p6j8P8lq4M1P3o4o7R4L3r4%R3k9q4N2O5o6
3438a0n1Q4L1r6kQ1l0o7M7O1p1m2R4Lq1J8P2m8n2O2N1p7j9Q7k5o5L2O0o0l0P2
$$ plain form
3469 29 39 -41 -29 40 10 -68 2 47 -33 -47 30 28 -64 -23 43 -11 -75 10 49 -49 -59 43 17 -71 -30 59 -8 -68 16 42
3499 42 -44 -46 28 6 -54 -6 51 -17 -48 20 26 -55 -29 46 4 -53 13 30 -41 -37 53 23 -45 -4 54 -8 -62 29 40 -60 -42
3530 -42 52 9 -69 -1 53 -34 -73 22 33 -65 -38 57 9 -87 -4 51 -36 -46 31 30 -66 -28 49 -15 -63 7 34 -45 -46 26 12
3561 12 -52 -4 35 -32 -48 37 40 -56 -23 47 -13 -64 14 53 -37 -50 40 11 -73 -26 49 -15 -77 14 39 -57 -57 49 21 -71 -20
3592 -20 50 -23 -68 25 44 -48 -33 45 10 -72 12 54 -28 -54 50 28 -52 -21 59 1 -62 13 34 -38 -36 53 3 -44 -1 38
3622 38 -28 -55 28 30 -53 -22 53 5 -77 13 48 -47 -70 43 27 -65 -33 61 -14 -79 5 44 -55 -58 36 29 -78 -28 55 -10 -63
3653 -63 22 47 -49 -39 43 6 -71 -4 45 -37 -60 24 20 -55 -23 38 -20 -77 14 38 -50 -41 43 4 -76 -7 58 -30 -67 28 40
3684 40 -73 -48 63 -4 -80 -8 61 -36 -74 34 42 -64 -37 46 11 -80 -1 60 -29 -50 46 44 -53 -26 62 -6 -58 18 43
$$ packed form
3469B9J0q0J2O9l0p8P0M5q0j4P7kr2M1O6n4o4Q5L9r8j0J02k6q8M1Q9o7o0Q4K6
3499D2q6kP4k2o0M8N7o8l1O8Oq1K6P5m2n7O6J7p1MR0l0o8M1N8o2n4R1J1j00J8
3530d2R4m3p8O8N4q7l9R5J1r8K7R5m8r6Q3N5q7j0P7jr6L8P7o4m8P0K7p9jP2j4
3561A2o4M8L9o7j6Q5Lr6L3P0o0n1P8L9r0j3R0k9q4M7P5o4o2R1K5r6%J06k8r2N1
3592b0P0p3m5R3J9r2J5P8l5q2Q4M2q2k6J04k2q0L1Q0n8o3P5K1p2KQ9n0m7M3L9
3622C8o6k7Q3Kq3L1P5m8q2R0L5r5k3J13j6r2L2R4p5o5Q4L9r9lR4pj07N0Q3o5n3
3653f3Q5K5r6J0Q2l7p7O7M9q2k3Q4mp5L2O1n8n7R1K4q8RQ4l9q0O9O5q8l7R5J2
3684D0j13K5J11o7p6P2O9r7l8J08Qj06K7Q3l5r1P9O1q9k1R6kr7K7Q8o8n2P6K5
$$ plain form
3713 43 -43 -36 43 -2 -62 0 56 -38 -38 26 31 -67 -27 57 -13 -69 24 48 -47 -60 38 20 -79 -23 70 -22 -67 19 51 -60 -58 50
3745 50 4 -74 -18 60 -20 -71 27 50 -51 -38 57 13 -61 3 56 -16 -50 44 29 -65 -14 51 -10 -55 26 43 -44 -49 52 12
3775 12 -72 -5 53 -29 -56 37 45 -68 -35 65 7 -77 1 74 -44 -69 39 39 -74 -39 65 1 -72 16 72 -45 -64 43
3803 43 21 -60 -12 65 -1 -51 29 62 -37 -28 53 15 -53 13 45 -46 -46 34 22 -65 -30 54 -13 -65 16 46 -57 -54 54 17 -80
3834 -80 -17 75 -26 -72 30 61 -56 -47 54 19 -80 -15 59 -30 -77 33 48 -57 -36 55 8 -66 16 46 -33 -57 43
3861 43 22 -53 -27 56 -12 -51 22 42 -38 -41 44 5 -73 -2 53 -32 -62 30 39 -71 -35 55 -10 -70 6 57 -41 -60 46 38 -63
3892 -63 -24 67 1 -71 20 68 -39 -51 56 26 -58 -14 62 1 -69 30 48 -48 -36 45 13 -58 8 50 -28 -41 39 37 -67
3921 -67 -23 48 -16 -58 14 41 -36 -45 66 22 -72 -7 67 -23 -77 39 41 -69 -41 65 27 -59 -2 65 -26 -65 49 52 -51
$$ packed form
3713D3q6PP9m5o0O2N6r4%O4Nr8M0Q4p0n6R3K4r5j3R8j8r9N6R3r2m5Q6L2j11KJ08
3745E0m6p8N6P8q0n1R8K3j01J3R5m4p4O4N3p2l4R4j5r4N1O5o1m5Q1J7q7nJ01m0
3775A2q4O7N8q2k7R3Qj13L3J00n8q4P8P3j18k5J08%j13L5J04o4p3Q8N6j17j9J07
3803D3k2q1M8P7o6n0Q0L3r9RQ1l8o8O6L2r1%Q0j2q7L5Q4o7n2Q1L0j03LJ08l7r7
3834h0O3R2j01m6J02L1j17RJ01l5r9O5P4q9m7J10J5j05K1R1m7p4Q2L0p9k4J00
3861D3k1p5K6Q3o8l9P3K0q0lQ5l9p8P1N5q5l0R2Rj10L6R0o5o0P6N1r8j9J06qj01
3892f3L9R1o6p2R1M8j07j2J07l0q4M4P6o1p0R9J8r6J2Q1l2p1O6M2p8j3Q0kj04
3921f7M4P1o4m2P2K7p7rJ11m4r4O5P4r0n4J16Kj10K8J06l8q6N7O7r1l9J14Lj03
$$ plain form
3950 -51 -22 73 -1 -67 14 54 -35 -51 40 33 -59 -21 57 -4 -73 11 44 -51 -36 53 14 -62 -3 46 -28 -58 40 37 -52 -16 58
3981 58 -1 -65 7 56 -35 -52 42 22 -70 -12 61 -12 -54 27 55 -42 -49 57 31 -67 -6 73 3 -53 31 52 -55 -43 55 19
4011 19 -72 -23 47 -34 -64 28 25 -65 -27 50 -3 -46 13 47 -42 -43 51 26 -63 -12 44 -20 -60 27 45 -59 -33 59 4 -64 9
4042 9 53 -38 -61 51 31 -61 -30 69 6 -71 23 60 -38 -55 51 28 -58 -29 52 -14 -58 10 46 -63 -59 35 3 -66 -11 48
4072 48 -16 -58 24 43 -54 -22 49 -11 -58 10 45 -43 -49 51 26 -60 -7 63 -23 -67 28 37 -50 -41 68 15 -73 -9 56 -9 -68
4103 -68 36 41 -58 -37 58 13 -73 -5 60 -31 -67 35 28 -56 -34 53 -13 -66 20 45 -43 -41 51 11 -67 -9 56 -19 -58 41 29
4134 29 -54 -29 59 8 -53 12 59 -33 -57 44 32 -69 -30 62 -14 -82 14 64 -50 -54 51 32 -70 -14 66 -10 -69 17
4162 17 46 -44 -48 55 17 -63 -1 60 -27 -66 23 40 -55 -22 52 -11 -60 23 51 -33 -38 59 19 -71 -4 68 -19 -55 45 62
$$ packed form
3950e1K9R5p4o6Q1M0q9j6R1pr2L8P8o1o9Q4L3r5J5Q9l9p6N9M9p4l0R8lq9L6P4
3981E8n9o4P2M9r1j7R4k0r2N8P3p3m2Q1K8r7pJ06k6r8O1P9p0n6Q4K1j07J2R8l6
4011A9r1M9P0q1l0R2lr0L8P7n3m3N9L4q9jR4k5q9N1N6o4m0Q7J8j04K6R2n5o8P3
4042IM4r1k3J12k0r2L1R9o3p7R4L7r8j7J06k3q6K9Q1o6m4O8L6j09MR4l2o9N5N9
4072D8o4m2Q2J9r7L2P1o0m7O8L5q8oJ00k5q6N3P0q6m4R5Rq7RJ09n3q8O4O5o5n9
4103f8J04Nr9K1R5m5q6O8O5r1l6J02pq4K2Q7o6n3Q6K5q8KR2m0p8N8O5p5l9R9j2
4134B9q3K5Q8n1o1O5M7r2k4J01j2j01L9R2p6o8R6N0j14mJ05j9j02N6Q0p6n9Q6
4162A7K9r0mJ03l8q0O2O1q7l9Q9J7r5L3P4o3m9Q3K8q4nR7m0r0O7P2q7l6J00J7
$$ plain form
4192 62 -65 -38 54 11 -79 3 63 -24 -52 34 43 -58 -41 49 14 -74 2 50 -32 -57 31 29 -60 -13 61 -10 -69 25 54 -43
4222 -43 -43 45 17 -72 -2 60 -31 -59 43 40 -53 -18 64 1 -67 26 63 -39 -53 55 38 -70 -1 80 -7 -64 16 59 -58
4251 -58 -45 50 19 -74 -22 58 -29 -65 25 36 -52 -38 46 7 -61 0 48 -17 -46 42 27 -57 -14 48 -10 -65 33 39 -54 -38 58
4282 58 6 -60 14 67 -33 -70 43 42 -62 -34 74 2 -74 16 78 -40 -63 46 34 -74 -41 54 -6 -71 15 46 -46
4309 -46 -58 39 23 -71 -6 53 -24 -51 28 38 -35 -23 47 -1 -58 8 47 -31 -48 38 24 -62 -7 61 -25 -72 24 48 -52 -39
4339 -39 62 19 -82 -11 72 -17 -67 36 52 -66 -42 57 19 -76 -9 63 -31 -70 36 37 -48 -34 49 12 -65 3 29 -31
4367 -31 -41 31 13 -54 1 57 -20 -50 39 45 -43 -15 61 -4 -60 12 56 -47 -52 36 28 -68 -21 60 -2 -60 21 58 -41 -46 58
4398 58 23 -67 -12 59 -17 -73 28 51 -52 -47 45 14 -70 -5 47 -20 -51 25 23 -45 -21 53 13 -46 19 46 -22 -40 36 27 -34
$$ packed form
4192F2j27K7R2m3r0Q2O0q7k8Q6Rj01J7R0l5q8P6M8q2k5Q8kq9M7P4p1n9R4K9r7
4222d3%Q8k8q9P0O2r1k8J02lr3L5Q2o3o8R3L7j02j4J08j7j08O9Q1q7n7Q0M3j17
4251e8J3R5l1r3N2Q0q7l6R0J1q8J4Q4l9o8O1M8o5k9Q8j5q4M3O2n8n5R8Or3J6R6
4282E8n2o6P4N3j00l7J13jj04K8J08p2p6R0O2j18k3J09j2j08L3R5o0o5Q6L1r2
4309d6j2R7j6r4O5N9p7k7P9J0p3J2P0m8n7O6L9p8j7Q6j4q6N5O8q6m7R6K4j00J3
4339c9J01m3j01P1Q3q9n0J03J6j18K4R9l8r5O7P2r4l9J06Jq5J4Q3l7p7O8K6o0
4367c1j0P2j8o7N5N6p7l0Q9Oq8K8P6o5n6P2M4j03nQ8qr6M7Q1o2n8Q1L7r9nJ04
4398E8l5r0N5P1p6n6J01K3j03NR2l1q4O5N2o7l1P6ko8K4P4m0n9O5K7o8j8P6ro1
$$ plain form
4429 -34 6 50 -9 -49 31 37 -51 -31 47 2 -69 9 56 -25 -47 37 35 -55 -20 59 -1 -67 9 50 -35 -45 37 21 -53 -24 51
4460 51 -19 -52 8 39 -36 -32 54 9 -57 0 53 -22 -51 33 37 -36 -20 51 3 -63 11 45 -32 -39 37 30 -53 -17 39 -9 -53 14
4492 14 30 -48 -37 29 2 -65 -3 37 -24 -63 25 26 -57 -22 44 5 -61 10 48 -25 -45 29 27 -54 -21 46 1 -52 1 44 -22
4523 -22 -33 34 31 -43 -2 41 -10 -55 16 21 -40 -26 41 6 -53 3 33 -32 -47 16 14 -50 -20 45 -4 -59 -8 36 -33 -51 36 27
4555 27 -54 -10 49 -12 -54 22 43 -36 -33 42 22 -46 -3 41 -10 -45 22 29 -41 -14 28 9 -45 12 44 -28 -31 31 13 -40 -18 37
4587 37 -7 -55 7 20 -39 -26 33 11 -49 -12 38 -22 -47 20 42 -51 -28 28 10 -51 -1 47 -26 -36 17 41 -39 -19 43 4
4617 4 -49 14 49 -22 -38 33 15 -50 -2 46 -8 -50 21 40 -32 -31 41 21 -44 4 46 -11 -40 34 34 -38 -15 43 8 -48 2 39
4649 39 -30 -35 38 14 -46 -9 40 -10 -43 15 54 -38 -26 54 24 -48 3 49 -1 -49 43 45 -35 -27 39 13 -59 -11 48 -8 -46 27
$$ packed form
4429c4M0M4n9m0Q0Oq8K0P8m5p1P8M7q1k2Q4kr0L5P9o0o6P6M1q5j0Q2j6p4K9P5
4460E1p0l3O0L1p5MQ6m5o6N7N3p5k9Q4Mp3J6P1m8o6P4L4p7pP6pq3L6N6m8m4O7
4492A4J6p8J1O6k7o7O2M0o1l9Q8Jq3L5O6l9o6P1L8p3k0P4kq1L3O7m5n3N3M3o6
4523b2j1O7lp4M1M3n1m5P1No1J4O7l5n9N6L0o5j5O3ko4L0O5m9n5N1M4o9j8Q7r
4555B7q1M4N9o1m2P6K1p9LP5k0o8M3M4n1l5O7Pp0K7M2j9n4N7L2p2lO2j8n3K2N5
4587C7m4m8O2J3n9J3N9k2o0L7N0o0k5O7K2r3K3N6j8o1N0M8p3j0N3K4q0K0O2l9
4617Dn3O3L5p1j6P1j8o5M8M8n4m2P1J9p2JP2k0o5M8M2n7k9P4%p2K3N8l5n6N0L7
4649C9o9nP3k4o0L7M9n0l3N8L9r2J2Q0l0p2N1M6n0m8R2Kq0QO6k6p2M8N9n6l8P3
$$ plain form
4681 27 28 -43 -32 31 0 -55 2 34 -32 -38 26 13 -38 -19 42 -17 -47 14 30 -40 -22 38 9 -56 -6 43 -16 -49 25 22 -42 -17
4713 -17 51 5 -50 2 38 -25 -42 25 26 -45 -14 41 -8 -44 16 24 -50 -44 28 8 -57 -9 35 -19 -64 12 32 -40 -27 42 8 -54
4745 -54 3 27 -25 -40 32 24 -43 -11 44 -14 -52 17 28 -31 -35 41 8 -57 -11 40 -27 -44 25 43 -40 -15 57 7 -55 9 47
4776 47 -18 -46 28 17 -60 -30 23 -20 -64 0 31 -34 -50 24 27 -47 -15 42 -10 -35 30 30 -43 -23 35 9 -41 4 42 -12 -37
4807 -37 31 26 -44 -5 47 5 -49 20 44 -40 -39 42 15 -45 -5 48 -10 -41 31 34 -44 -27 42 8 -56 0 44 -29 -50 11 33 -45
4839 -45 -29 27 2 -42 0 29 -20 -40 24 19 -38 0 46 -10 -45 15 29 -30 -24 49 8 -45 6 40 -28 -36 36 22 -60 -25 41 -16
4871 -16 -61 8 37 -39 -34 25 16 -58 -23 45 -19 -63 13 36 -47 -24 28 8 -56 -4 40 -17 -52 18 24 -37 -20 32 0 -32 13 34
4903 34 -17 -34 29 18 -29 -6 41 -22 -46 14 23 -40 -36 34 6 -53 2 41 -33 -41 32 27 -43 -24 35 -6 -54 1 41 -40 -39 22 18
$$ packed form
4681B7Jp1J1O3l1n5N7L2o6oO4j3n1J9O1n9l0O1J6p0J8O0k9o5N0M9n9l3P4lo4K5
4713a7O8m6n5N2L6o3j7O7Jp1L1N5m9l6O0Qp4OP2k0o5M8M4n4m5P6K0p2J3O9l4o2
4745e4N7K4n2j5P2qo7L2N5n8l8O9J1n9mP6l3o5M6N1o7j7O9J8q3K5P2n0o2O4L8
4776D7o5k8P4j1p7L0N3m3m4O4L1o5j6P4Lp4L2N7n2k5O5%p3K0N8k6n0M5L8n4k5
4807c7O8np0L9N2m2n4O9K4q4JQ1k7o0M0N3n8l1P2Lp8J7O9l4o4N6M4p3k1O1K2p8
4839d5J6N6k5m4M2K9m9k0O4nn7L8M6n6l5O0J4n9OP3m1n3N1L4o8qP2j4q2L5O6n7
4871a6m5O9K9p6NN9rp4L5O8o4m4P6K3q3K3N2k0o4N2M4n7l5P0Oo1J7N2l2l2M5K1
4903C4n1j7O3j1m7K3M7o3k4O0Ro3MP0k8n9N5L9p4qP3np0J9N9m1m8N5M0q1JO1m
$$ plain form
4936 18 -53 -23 39 -2 -42 18 29 -29 -31 31 11 -37 0 30 -24 -26 21 28 -27 -4 34 -6 -40 7 29 -26 -34 32 19 -46 -4 33
4968 33 -11 -40 9 30 -33 -32 20 3 -58 -7 30 -27 -37 16 26 -39 -12 29 17 -38 9 31 -11 -28 28 20 -41 -11 30 -7 -32
4999 -32 11 32 -32 -21 35 2 -39 -3 32 -10 -41 16 18 -39 -17 20 -7 -42 9 29 -30 -37 13 12 -40 -33 21 -25 -44 -4 18 -28
5031 -28 -21 12 12 -33 -14 29 -12 -33 4 20 -24 -15 28 5 -33 4 28 -12 -27 23 11 -34 -9 30 -5 -35 -4 17 -25 -33 14 7 -42
5064 -42 -19 31 -25 -33 12 8 -27 -26 31 -2 -43 -1 29 -26 -39 10 8 -45 -21 17 -5 -39 2 32 -25 -26 18 17 -32 -8 30 -12 -34
5097 -34 16 17 -21 -28 30 19 -27 0 15 -26 -32 17 7 -37 -23 26 -5 -34 4 29 -25 -34 15 13 -27 -6 28 -2 -39 6 23 -15 -20
5130 -20 4 -3 -37 -6 24 -22 -35 4 13 -25 -22 21 2 -32 14 38 -4 -36 28 28 -29 -13 20 0 -36 -4 17 -26 -35 18 3 -26 -12
5163 -12 14 -1 -33 14 19 -27 -31 15 -13 -29 -7 22 -18 -27 13 16 -39 -16 27 1 -43 2 32 -16 -20 28 15 -37 -11 27 0 -25 11
$$ packed form
4936A8p1L0O2m1m0O0J1n8kO2k0m8L7L0n4kM7Pn5K3L8m0l4M7K2n5qO6j3o5M2L7
4968C3m4k9M9K1o3JN2j7o1N1L7n7j0N3J0o5K7M1j2n5M7K2m2j7N6qo1L0M1l7k5
4999c2M3K1o4J1N6l3m1L6L5m2l1N7Kn7K2L7k7l5N1K0n9pN0jn2PN4m6j9M0K2m6
5031b8PL3%m5J9M3m1k1L7J6m4RM3k3l8L7K4m0j5N0j2m5K5L9l5l0L1K1m2qM7pm9
5064d2K3N0n6qM5ml5JN7l3m1M2L0n5j3M9kn3K4L8k2l4M1L0n7jM4jm9K4L8m2k2
5097c4N0Jl8pN8j1m6K7J5m1oM9j0m4J4M9l1k9L8K5n4rM9km0K1L4l0l7M5J7l8n
5130b0K4pl4L1L0m6j3L9Rl8LM3j9l4M6K4m2l2O4%n7J6L3k0l6L2K1m3rN3j5k9J4
5163a2K6j5l2M7Nm6mM6k8j6K2K9m0rM0Ln5K3M3k6m4M5L0m8mM8j3n2K6L8k7k5L6
$$ plain form
5196 11 31 -19 -27 16 4 -43 -8 27 -20 -38 15 29 -40 -22 12 3 -41 -4 26 -26 -37 4 2 -34 -12 28 -7 -31 9 17 -23 -29 26
5229 26 7 -38 -8 15 -8 -39 8 20 -33 -21 22 10 -37 -7 12 -21 -43 21 13 -33 -9 18 -12 -42 -7 20 -26 -39 9 6 -34
5260 -34 -24 16 -10 -37 -11 7 -30 -32 4 -14 -48 -9 19 -8 -35 21 16 -33 -14 27 -1 -38 13 33 -26 -32 27 15 -33 -2 34 -6
5292 -6 -39 6 30 -21 -23 25 9 -30 -4 15 -10 -38 23 10 -37 -17 24 1 -38 -4 17 -18 -35 20 9 -26 -17 23 -6 -32 5 25
5324 25 -21 -20 19 11 -28 -5 30 -14 -17 14 26 -23 2 35 17 -40 13 32 -31 -38 9 8 -39 -20 24 -14 -46 -8 16 -21 -31 23 6
5357 6 -29 -22 20 -17 -35 21 14 -22 -28 20 -2 -24 5 20 -17 -26 24 18 -26 -8 28 -6 -33 4 34 -21 -21 27 9 -29 8 37 -3 -25
5391 -25 28 32 -21 -18 25 8 -34 -1 25 -20 -32 11 8 -35 -10 15 -1 -38 -9 15 -17 -39 22 1 -24 -4 23 -6 -23 14 16 -16
5423 -16 -13 19 -5 -35 5 23 -11 -22 25 18 -26 0 30 -5 -20 9 30 -27 -22 22 7 -34 -20 23 -4 -39 10 26 -20 -20 19 0
$$ packed form
5196A1K0n0qM3j2m7L5L5m7j8N3J4o9J8L4rm4L7L0n2j1M1kl6K2M0l5k4M0Qm0oN5
5229B6j9m5L0K3k3l1M7J2n3J2M3j2m7L0J9l3k2O4qm6K4K7l0l0L5K7m6j3M8lm0
5260c4J0M0k6k7K6J8l7kL6j8l4L9K8k7k7N6nm9J9M1k8l7N1K0n9oN9j2m8L1L6m0
5292fl3M5K4n1kM8j6l9K6J9k5k8O1j3m7K0M1k3l9L4K1l5j7N5j1l5RM0k9k6L7K0
5324B5m6JL9ql9K3L5m4lL1J2m9K5L3j8n7N3J9o3pM7jm7J9M4l8l2L8K4l7j0N4j7
5357Fl5PM2l7j8N6pl6oM8k2k2K9J5l7rN0om4J8L6l4k7L7L0n5%M8j8l8L7K9m0k2
5391b5N3Mn3LM3j7m2L3K6m5j2M3lm3K5K5j6l7K9K4l2k2O1k1k5K0K7k9j7L7Kl2
5423a6LL2k4l0M0J8l4j1M7pm4K6L0l5j5K9K1n7NM4j5m1J4M3k7l5M9J6m6%L9j9
$$ plain form
5455 0 -42 -22 5 -14 -37 11 7 -23 -8 21 0 -25 9 16 -11 -4 18 11 -28 -5 14 -17 -24 19 18 -23 -8 20 -7 -32 -7 26 -19 -26
5489 -26 19 7 -26 -20 31 -6 -38 4 27 -27 -27 15 12 -33 -23 20 -12 -45 -7 17 -30 -22 18 15 -14 -6 27 1 1 3 18 -8 2 24
5523 24 8 -16 5 17 -9 -13 21 0 -26 -12 15 -13 -21 2 12 -21 -27 21 2 -28 -2 14 -19 -23 20 8 -18 -20 10 -2 -27 -15 7
5556 7 -12 -20 3 8 -22 -12 13 4 -16 1 6 -4 -11 15 10 -16 2 16 -3 -14 33 16 -7 2 12 0 -33 -1 1 -14 -13 10 1 -35 -20 17
5592 17 -18 -38 -2 9 -20 -16 11 -3 -34 -1 15 -16 -32 7 15 -8 -4 14 3 -21 -21 11 -1 -21 13 16 -7 -15 24 6 -15 14 14 1
5626 1 -14 15 8 -14 12 17 -1 -27 3 8 -23 -23 3 -10 -33 -6 10 -23 -21 1 -4 -21 -20 16 -5 -18 -7 14 -16 -20 8 6 -16 -2 12
5661 12 -8 -19 6 9 -9 2 4 0 -13 -14 18 -13 -5 10 9 -13 -11 7 -4 -25 13 9 -14 -15 14 -9 -19 -1 7 -15 -26 7 13 -31 -21 9
5697 9 -7 -30 -2 16 -16 -27 15 5 -9 -19 6 8 -7 -4 28 -10 -14 7 5 -15 -17 19 -8 -13 -4 1 -20 -12 13 11 -23 -10 11 -8 -13 17
$$ packed form
5455@m2K0K7j9k3M8ml0J5K9k1k5L4Pk7PK2pl9K3J9l1pM3jm1J5K8k7k5K5L3m5p
5489b6M5j2l3ON1l7l2M2K3n4%M2lm5J0M3l2l3L8K4m7QM0lk9QL3k6%KJ5k6J0K2
5523B4j6k4K1J2k6mL4k1k6J4K7k8qK3J0l3oM8j9l0K6J6l3mM3j2k6kL0j2k5J2K2
5556Gj9qK3Nl0J0K5rk0J7Nj0pK6nk6J8J4j9j1M7j7k3RJ0j2l3L2Kj5JK3rl6J5L7
5592A7l5k0L6J1k9MK7j4l1L3J6l1j6L9Qk3MJ8j1k4%L2j2k0L4Lk3qL9j8k1K9%j3
5626Aj5K9pk2K6Nj8k6L0Nl1%K6j3k3K7J6l3KK2nj7JL6k1j3J1K1l0mK8kk2J4J4
5661A2k0j1K5Lj8J1Kmj3jL2l1QJ5jk2KJ8j1k1L8mk3jK9k3j0J8Qk2j1L3Om4J0L0
5697Ij6k3K8J8l2j1M2j0j4j0K5Kj5LL2l8mK1kk0kL6k7nRNk1QK5kl4J3K1j9nL0
$$ plain form
5733 17 8 -27 -8 7 -3 -28 -6 19 -12 -20 2 3 -27 -9 9 -5 -27 -7 17 -7 -13 12 12 -9 -7 9 8 -12 14 11 -13 -18 11 -2 -13
5768 -13 -5 20 -7 -14 2 0 -15 -11 2 -5 -21 -7 14 -19 -16 9 -10 -28 -6 2 -22 -26 4 -3 -27 -17 13 1 -32 -2 18 -16 -16 2 13
5803 13 -13 -11 19 4 -23 6 17 -3 -14 9 13 -19 -12 12 8 -5 6 16 -6 -18 -3 3 -29 -11 0 -22 -27 -4 -4 -37 -11 10 -3 -22
5837 -22 1 5 -16 -30 5 10 -28 -8 7 0 -35 7 19 -15 -16 19 6 -25 -5 22 -1 -16 6 17 -16 -7 25 2 -12 -1 22 -14 -25
5870 -25 8 7 -22 -7 17 -16 -31 -16 7 -20 -18 3 -3 -25 -10 5 -17 -19 6 -4 -20 -7 10 -2 -26 -2 10 -1 -18 22 5 -24
5902 -24 -4 28 -9 -16 4 11 -3 -14 -6 3 -14 -14 14 -2 -11 6 13 -18 -14 15 -1 -21 -7 6 -11 -22 3 1 -28 -14 17 -9 -29 -12 -1
5937 -1 -14 -17 -2 -2 -20 3 8 -11 -8 0 6 -12 0 16 9 -19 3 15 3 -9 5 5 -23 -1 8 -4 -36 -1 15 -15 -13 2 -4 -31 -17 -3
5973 -3 -1 -27 1 -3 -11 -10 -8 0 -16 -10 3 -26 -18 -1 -6 -16 -15 5 -3 -22 7 16 -17 -7 13 11 -18 5 14 -14 -13 15 7 -20 -9 18 -5 -16 -8
$$ packed form
5733A7rl5J9J5j0k5K2K5l1qK2Jl0J8J8j4k2K0K4k4oK5%k1KJ6jk0K6lk4nK9j3j1
5768a3QK5k7pJ6kj5MJ3pj6J4K1l3LK5j9j8K2Qk4mL0pk4J0L0j2l3L0K0l4%J8J1
5803A3k6KL0j5k7K9J1k0j1K3Ml2PK4mj3J1J0k2j2J5Ol2J8J1k2nK3%l3K6K1j3j9
5837b2K3Mk1j4L5Nl8K0J5pl5M2J2l4jL5j3l1K0K7k3j5K2J1l3RL2k3j4J1K3l6j1
5870b5L3jk9J5K4l3j5J5K3k7KK1ok2J5J5k2kK5j0j6J3J7j2k4K4J2j1j7M0j7k9
5902b4K0L2l7pK0Pj4j1QRj7%K8j6rJ7Pl1MK9j6k0J4J3j7j1K5kk9J4L1k6k0J7J1
5937aj3lJ5%j8K3Nj9LQOj8J2J6pk8K2J2j2j2J4%k8K2Rj2l2L5J6l0KJ5ok7J4J4
5973cKk6K8mqJKQj6OJ3k9QJ7nj0JK0qj9K9Rl3J0K0kk9K3Rk8JK8qk7J1K7k3j1Q
$$ plain form
6012 -8 4 -11 -21 7 2 -15 -19 9 1 -22 0 -5 -9 -15 6 -3 -26 -16 8 -5 -8 -5 2 -20 -10 4 -5 -10 2 3 -7 -14 -4 2 -12 -3 12 -7 -12
6051 -12 -1 2 -7 -18 8 9 -30 -8 17 -6 -25 -3 9 -11 -24 -9 -8 -28 -19 -4 -20 -17 4 -3 -17 -12 -5 -8 -18 -6 -1 -4 -6 3 -3 -10 -13 10 -3
6090 -3 -9 4 -4 -8 -4 14 2 -9 3 5 0 -12 7 -4 -12 -5 -3 -3 -12 5 12 -9 -20 -1 -5 -23 -16 7 -3 -18 -7 2 -8 -12 -1 10 -20 -12 4
6129 4 -14 -5 -6 1 -17 -3 3 -1 -11 1 8 -4 -2 6 3 -13 -3 12 -3 1 -13 -2 -15 -14 8 -3 -5 0 3 -12 -23 -4 2 -23 -13 4 -9 -29
6167 -29 -9 3 3 -16 4 -2 -18 -8 -3 -14 -20 -9 -13 -7 -13 -4 -7 -13 -4 -6 6 -3 0 6 -2 5 10 5 -4 -16 2 -15 -9 -7 8 -10 -10 8 -13 -22 -8 -4 -21
6210 -21 -15 3 2 -23 -8 0 -13 -17 7 -2 -21 -15 -1 -7 -24 -19 -3 -10 -11 -6 -5 -15 -18 -3 -1 -16 -4 5 6 2 1 2 -1 15 8 -6 -12 2 1 -8 -14 -3 -3
6253 -3 -13 3 -1 -24 -25 -11 -16 -25 -26 -2 -7 -23 -4 3 -17 -19 -4 1 -7 -12 -1 -8 -22 -15 6 -9 -21 -7 -3 -8 -9 15 -2 -13 -8 -2 -12 -4 -5 -6 -7 5
6295 5 4 -12 -12 -1 -7 -18 -6 1 -10 -14 -5 -5 -19 -17 -5 -10 -30 -13 -2 -8 -19 -2 2 -11 -11 7 1 -9 -1 11 -7 -18 -1 6 -9 -1 6 -3 -8 -1 12
$$ packed form
6012hJ2j5j0K8nj7mK8qk3K2nmoK1rk3J0K4j3lLPk2J0J4rnJ2Jj0pJ0Oj4RJ5j9n
6051a2J1Lrj1K6Jl9K2K5k3j9K2J2k0j3J5Jk0RJ5j6LK1pj4NPlj0J2NlkRoplK3j3
6090coJ3qmMJ8j2j1J2Knj2J9j1qPK%rJ7Pk1j1J9mj8PK3j0j5J1Rj0mJ1J1l0QJ6
6129Dj8RjPj8J4Omj0J2Pj2KQlj6J0J5j5Mj4J1j3JK2j1kNLj5j1J9Ok5J0J7j3k0
6167b9K0J2%j9K0oj6J0Nj1oJ1mOoRloRkJ2rLOqPNnrj2J8j7OKJ5j8%J8k1rJ4Mj7
6210b1OJ8jk5J5Qj3mK4rj9OJ4oj7NJ6pjNJj0lJ5Kj5J2RJmjJlJ6pj4oJ4jroJ1%
6253cj0J6mk3jJ4nrjK4nj6J9Pk0kJ5NqnJ1pj4PK1j5j2J4MnjK4j7j1NOj0QjjjJ2
6295Ejj6%J1oj1J2Pj1mR%j4KJ2nk0J7J1oj1J7Mj3%J8oj0QJ2j8j1J7Pj5QPrnPJ3
$$ plain form
6336 12 6 -13 1 -2 -18 -7 -2 -5 -21 6 4 -18 -8 -2 -13 -14 -11 -4 -20 -24 1 -2 -29 -12 -10 -23 -25 -11 -6 -24 -20 -14 0 -15 -5 17 -4 -12 -2
6375 -2 14 -9 -5 17 -1 -4 -1 16 6 -11 -4 -3 -11 -8 -1 1 -17 -3 3 -14 -14 5 3 -6 -3 4 -4 -21 2 3 -20 -14 3 -7 -20 -4 2 -9 -31 6
6415 6 -1 -18 -24 8 0 -22 0 -2 -4 1 16 9 -4 -8 8 8 -3 10 8 -15 2 5 3 -19 -8 3 -7 -12 -5 0 -7 -8 1 0 -11 0 4 -6 -17 -2 -6
6456 -6 -11 -11 5 -4 -16 -4 8 -16 -19 -2 -3 -15 -12 7 -15 -26 -1 -7 -11 -1 18 6 -14 6 8 -18 -5 -1 10 -4 -11 14 -4 -12 -8 -1 -7 -16 -8
6495 -8 5 -14 -8 -8 -18 -22 -9 -12 -14 -12 -4 -1 -14 -11 -4 -11 -2 4 -4 -8 -5 9 -6 -13 -3 3 -6 -10 4 12 2 -6 8 -2 -5 4 10 4 -5 23 5 -11 2 16
6539 16 -10 -16 -2 -4 -16 -19 -17 -13 -12 -8 -13 -17 -18 -3 -10 -2 -5 -13 -4 -17 1 3 -19 -2 13 -6 -11 1 8 -1 3 12 8 0 1 18 -9 -4 -6 0 -6 -14 6 -1 -1 -8
6585 -8 3 2 -10 -4 2 -14 -14 0 -7 -17 -17 -9 -18 -21 -16 -9 -15 -11 14 -3 2 -5 6 -8 -9 15 12 -2 5 14 -5 -10 14 15 8 6 17 9 6 5 2 -3 -6 8 3 -11
6631 -11 -1 5 -11 -9 1 -1 -4 -7 -2 -2 -4 -14 2 -10 -18 -12 -6 -10 -16 -16 -14 -13 2 4 -8 -17 -11 -7 -12 -13 -3 -7 -14 10 4 -11 -11 8 10 -9 3 1 3 -7 -2
$$ packed form
6336A2oj9J4lj6J1Nlj6K7kk2J0Oj1jLPj6mK5lk7J7Kj3kJ4Nj8MOJ4j5J0K2k1qJ0
6375bJ6k3MK2j8lLJ7j0j7PJqLPKj8J4Oj7%J9krLPqj7K3Jk3OJ7j0j3J6Oj1k2L7
6415Fpj7oL2qk2K2kkNJ5pj3mJ6%j1J3kk3J7Lkk2J1J1j0nPNpjRjj1J1Mj0j1J5m
6456fn%J6rj2J2J2k4lJ7jj2LJ9k2j1K5omJ0J9j2k0K0Kk6J3MJ1j4pK5j8qMPorQ
6495hJ3j9O%j0mJ3lkKQLj3LPpROqmLJ4j5pJ0OrmJ4Qj0qJ4j0lROorK8j8j6J3J4
6539A6k6oJ4kj2lKMJMnmjJ5pQlqRj3J8Kk2J7J5j9nJ2PrMRmqJJ7k7NkOoqK0p%p
6585hJ1jj2OOj6%J4pj0%QrlNPoMK5j7NpJ1j4jK4lj4PRj9nK4JpkJ1qljlnlJ4nj4
6631a1J0Oj6KJ0kllN%kj0J6j2qOOmo%KJJ5Kj2rOMnjJ0mpK4oj5%J9Kj9J2kKj0N
$$ plain form
6676 -2 4 -16 -16 3 -7 -17 -5 -6 -17 -20 -4 -9 -20 -19 -10 -6 -18 -8 0 -11 -6 -7 1 -12 -15 -2 -8 -13 0 -9 -5 -6 -12 -2 -18 -5 -5 -7 -3 2 -2 -4 6
6719 6 9 0 -11 7 6 -14 -5 0 6 -8 -20 -2 -13 -14 -10 -11 -16 -10 -5 -1 -10 -11 -2 -18 -14 -4 -9 -7 -8 -9 -1 -6 1 2 8 -5 6 14 -16 -15 2 -1 -10 4 -2 2 5
$$ packed form
6676bOk0%J9j0j0J2jj1lJ6nj1JRMj2J0Qj1NjQj3lJ3onJ3rMjoJ0j6J3%kMNmkJ0
6719FLrj1J8jk0RNOj4j2J8j1jMjnONMrjRj6MJ0nKjjQnPJOj3J1Ql0JJ7lrJ4oML
$$ [...]
8191A5
##END NTUPLES=NMR FID
##END=
