##TITLE=1H_LY-Ni-400-Hex 120
 CDCl3, 8 sc, 
 18.1.2019
##JCAMPDX= 6.0         $$ Bruker NMR JCAMP-DX V2.0
##DATA TYPE= NMR FID
##DATA CLASS= NTUPLES
##ORIGIN= UXNMR, Bruker Analytische Messtechnik GmbH
##OWNER= root
$$ XWIN-NMR		Version 3.5
$$ Fri Jan 18 15:18:54 2019 Russian Standard Time (UT+4h)  she@DPX200
##.OBSERVE FREQUENCY= 200.1313
##.OBSERVE NUCLEUS= ^1H
##.DELAY= (6, 6)
##.ACQUISITION MODE= SIMULTANEOUS
##.ACQUISITION SCHEME= undefined
##.AVERAGES= 8
##.DIGITISER RES= 18
##SPECTROMETER/DATA SYSTEM= spect
##.PULSE SEQUENCE= zg30
##.SOLVENT NAME= CDCl3
##.SHIFT REFERENCE= (INTERNAL, CDCl3, 0, 15.7039)
##AUDIT TRAIL= $$ (NUMBER, WHEN, WHO, WHERE, WHAT)
$$ ##TITLE= Audit trail, XWIN-NMR		Version 3.5
$$ ##JCAMPDX= 5.01
$$ ##ORIGIN= Bruker BioSpin GmbH
$$ ##OWNER= she
$$ F:/spectra/data/she/nmr/H-F/1/audita.txt
$$ ##AUDIT TRAIL=  $$ (NUMBER, WHEN, WHO, WHERE, WHAT)
(   1,<2019-01-18 15:17:41.04 +0400>,<she>,<DPX200>,
      <created by zg, POWCHK disabled, PULCHK disabled
       configuration hash MD5:
       00 E9 B6 7A A2 85 ED C7 34 08 36 98 17 FE 4E 26
       data hash MD5: 16K
       B2 6F D3 6D E7 04 92 70 E1 B8 94 76 33 9B 27 7F>)
$$ ##END=
$$ 
$$ hash MD5
$$ CE 36 31 21 2F 44 24 9A A7 AE DD 73 D4 F3 6F FE
##$RELAX= 
##$RELAX= 
##$RELAX= 
##$RELAX= 
##$RELAX= 
##$RELAX= 
$$ Bruker specific parameters
$$ --------------------------
##$DU= <F:/spectra>
##$EXPNO= 1
##$NAME= <H-F>
##$PROCNO= 1
##$TYPE= <nmr>
##$USER= <she>
##$AMP= (0..31)
100 100 100 100 100 100 100 100 100 100 100 100 100 100 100 100 100 100 
100 100 100 100 100 100 100 100 100 100 100 100 100 100 
##$AQSEQ= 0
##$AQ_mod= 1
##$AUNM= <au_zg>
##$AUTOPOS= <>
##$BF1= 200.13
##$BF2= 200.13
##$BF3= 200.13
##$BF4= 200.13
##$BF5= 200.13
##$BF6= 200.13
##$BF7= 200.13
##$BF8= 200.13
##$BYTORDA= 1
##$CFDGTYP= 0
##$CFRGTYP= 5
##$CHEMSTR= <none>
##$CNST= (0..31)
1 1 145 1 1 1 1 1 1 1 1 1 1 1 1 1 1 1 1 1 1 1 1 1 1 1 1 1 1 1 1 1 
##$CPDPRG= <>
##$CPDPRG1= <>
##$CPDPRG2= <>
##$CPDPRG3= <>
##$CPDPRG4= <mlev>
##$CPDPRG5= <mlev>
##$CPDPRG6= <mlev>
##$CPDPRG7= <mlev>
##$CPDPRG8= <mlev>
##$CPDPRGB= <>
##$CPDPRGT= <>
##$D= (0..31)
0 1.2 0 0 0 0 0 0 0 0 0 0.03 0 0 0 0 0 0 0 0 0 0 0 0 0 0 0 0 0 0 0 0 
##$DATE= 1547810260
##$DBL= (0..7)
120 120 120 120 120 120 120 120 
##$DBP= (0..7)
150 150 150 150 150 150 150 150 
##$DBP07= 0
##$DBPNAM0= <>
##$DBPNAM1= <>
##$DBPNAM2= <>
##$DBPNAM3= <>
##$DBPNAM4= <>
##$DBPNAM5= <>
##$DBPNAM6= <>
##$DBPNAM7= <>
##$DBPOAL= (0..7)
0.5 0.5 0.5 0.5 0.5 0.5 0.5 0.5 
##$DBPOFFS= (0..7)
0 0 0 0 0 0 0 0 
##$DE= 6
##$DECBNUC= <off>
##$DECIM= 32
##$DECNUC= <off>
##$DECSTAT= 4
##$DIGMOD= 1
##$DIGTYP= 9
##$DL= (0..7)
0 120 120 120 120 120 120 120 
##$DP= (0..7)
150 150 150 150 150 150 150 150 
##$DP07= 0
##$DPNAME0= <>
##$DPNAME1= <>
##$DPNAME2= <>
##$DPNAME3= <>
##$DPNAME4= <>
##$DPNAME5= <>
##$DPNAME6= <>
##$DPNAME7= <>
##$DPOAL= (0..7)
0.5 0.5 0.5 0.5 0.5 0.5 0.5 0.5 
##$DPOFFS= (0..7)
0 0 0 0 0 0 0 0 
##$DQDMODE= 0
##$DR= 18
##$DS= 0
##$DSLIST= <SSSSSSSSSSSSSSS>
$$ [...]
##$SUBNAM2= <"">
##$SUBNAM3= <"">
##$SUBNAM4= <"">
##$SUBNAM5= <"">
##$SUBNAM6= <"">
##$SUBNAM7= <"">
##$SUBNAM8= <"">
##$SUBNAM9= <"">
##$SW= 20.0189088683792
##$SWIBOX= (0..15)
0 0 2 0 0 0 0 0 0 0 0 0 0 0 0 0 
##$SW_h= 4006.41025641026
##$TD= 16384
##$TD0= 1
##$TE= 0
##$TE2= 300
##$TE3= 300
##$TEG= 300
##$TL= (0..7)
0 120 120 120 120 120 120 120 
##$TP= (0..7)
150 150 150 150 150 150 150 150 
##$TP07= 0
##$TPNAME0= <>
##$TPNAME1= <>
##$TPNAME2= <>
##$TPNAME3= <>
##$TPNAME4= <>
##$TPNAME5= <>
##$TPNAME6= <>
##$TPNAME7= <>
##$TPOAL= (0..7)
0.5 0.5 0.5 0.5 0.5 0.5 0.5 0.5 
##$TPOFFS= (0..7)
0 0 0 0 0 0 0 0 
##$TUNHIN= 0
##$TUNHOUT= 0
##$TUNXOUT= 0
##$USERA1= <user>
##$USERA2= <user>
##$USERA3= <user>
##$USERA4= <user>
##$USERA5= <user>
##$V9= 5
##$VALIST= <valist>
##$VCLIST= <CCCCCCCCCCCCCCC>
##$VD= 0
##$VDLIST= <DDDDDDDDDDDDDDD>
##$VPLIST= <PPPPPPPPPPPPPPP>
##$VTLIST= <TTTTTTTTTTTTTTT>
##$WBST= 1024
##$WBSW= 4
##$XGAIN= (0..3)
0 0 0 0 
##$XL= 0
##$YL= 0
##$YMAX_a= 69888
##$YMIN_a= -72345
##$ZGOPTNS= <>
##$ZL1= 120
##$ZL2= 120
##$ZL3= 120
##$ZL4= 120
##$ABSF1= 10
##$ABSF2= 0
##$ABSG= 5
##$ABSL= 3
##$ALPHA= 0
##$AQORDER= 0
##$ASSFAC= 0
##$ASSFACI= 0
##$ASSFACX= 0
##$ASSWID= 0
##$AUNMP= <proc_1d>
##$AZFE= 0.1
##$AZFW= 0.1
##$BCFW= 1
##$BC_mod= 2
##$BYTORDP= 1
##$COROFFS= 0
##$CY= 11.3945322036743
##$DATMOD= 1
##$DC= 2
##$DFILT= <>
##$DTYPP= 0
##$F1P= 18.9103706918063
##$F2P= -1.10871071338519
##$FCOR= 0.5
##$FTSIZE= 0
##$FT_mod= 4
##$GAMMA= 1
##$GB= 0.15
##$INTBC= 1
##$INTSCL= 1
##$ISEN= 128
##$LB= 0.24
##$LEV0= 0
##$LPBIN= 0
##$MAXI= 10000
##$MC2= 0
##$MEAN= 0
##$ME_mod= 0
##$MI= 1.114404
##$NCOEF= 0
##$NC_proc= 0
##$NLEV= 6
##$NOISF1= 3.799351
##$NOISF2= 2.8
##$NSP= 1
##$NTH_PI= 0
##$NZP= 0
##$OFFSET= 15.70392
##$PC= 1
##$PHC0= -9137.819
##$PHC1= 19.20004
##$PH_mod= 1
##$PKNL= yes
##$PPARMOD= 0
##$PSCAL= 0
##$PSIGN= 0
##$REVERSE= no
##$SF= 200.130013532006
##$SI= 16384
##$SIGF1= 3
##$SIGF2= 2
##$SINO= 400
##$SIOLD= 16384
##$SREGLST= <1H.CDCl3>
##$SSB= 0
##$STSI= 0
##$STSR= 0
##$SW_p= 3612.71676300578
##$SYMM= 0
##$S_DEV= 0
##$TDeff= 0
##$TDoff= 0
##$TI= <>
##$TILT= no
##$TM1= 0
##$TM2= 0
##$TOPLEV= 0
##$USERP1= <user>
##$USERP2= <user>
##$USERP3= <user>
##$USERP4= <user>
##$USERP5= <user>
##$WDW= 1
##$XDIM= 8192
##$YMAX_p= 0
##$YMIN_p= 0
$$ End of Bruker specific parameters
$$ ---------------------------------
##NTUPLES= NMR FID
##VAR_NAME=  TIME,          FID/REAL,        FID/IMAG
##SYMBOL=    X,             R,               I
##VAR_TYPE=  INDEPENDENT,   DEPENDENT,       DEPENDENT
##VAR_FORM=  AFFN,          ASDF,            ASDF
##VAR_DIM=   8192,          8192,            8192
##UNITS=     SECONDS,       ARBITRARY UNITS, ARBITRARY UNITS
##FACTOR=    0.0002496,     1,               1
##FIRST=     0,             0,               0
##LAST=      2.0444736,     0,               0
##MIN=       0,             -72345,          0
##MAX=       2.0444736,     69888,           0
$$ Real data points
##PAGE= N=1
##DATA TABLE= (X++(R..R)), XYDATA
0@%%%%%%%%%%%%%%%%%%Lj1J6j6J6j6J6k4L2l2L4m2M8n4O2p0P8q8J00j10J23j37
40g2J53j71J89k09K32k55K80l10L42l78M16m57N05n56O14o82P59q45R46j068J211
61F44j389J616j912K322k924L884n667J0021l8522m0418J27341K703j18959J4557
75d6703J15338l7788r9432N0743Q5016o2889o4652O5610M7431o5517k9455N8108
87A5810J6895m8884p133L5915L857k3845m488J2036J0658l945j9537q13L1201
100A7727L12m2792M589N3615j4333o1407K7377O5504m3012o4646N9178N8878p4623
113a3633m8162Q7503L3463r6719j5754J01169l298j00519K2296R4749l9526q4446
125f2877N3679P0649o3720n4611O8981L7943o9424k2119O5407Q489n7795J791
$$ y = [0, 0, 0, 0, 0, 0, 0, 0, 0, 0, 0, 0, 0, 0, 0, 0, 0, 0, 0, 3, -8, 8, -8, 8, -8, 8, -16, 16, -16, 18, -24, 24, -30, 32, -38, 40, -48, 52, -58, 65, -72, 81, -90, 99, -110, 122, -133, 147, -163, 179, -199, 217, -240, 265, -291, 323, -359, 400, -445, 501, -567, 644, -745, 871, -1041, 1281, -1643, 2241, -3426, 6595, -31927, -72345, 54996, 57699, -61260, -46703, 68635, 30847, -68585, -17842, 67174, 4285, -60367, 5243, 52674, -12843, -42298, 15810, 32705, -16179, -23312, 12603, 16460, -7385, -11873, 163, 10821, 6876, -12661, -13474, 17727, 18039, -24753, -20164, 33451, 19118, -42289, -14912, 50592, 7580, -57066, 2112, 60990, -13633, -61795, 25708, 59171, -37548, -53302, 47867, 44569, -55950, -33654, 61095, 21569, -62877, -9198, 61451, -2269, -56880, 12101, 50044, -19380, -41499, 23908, 32397, -25398, -23607]
137b3607M7727q112l6633J0241K5857q417j6785L404J0416L857p440j2107Q138
150c461K0113j2327k6607J9453L0627k8656l1483L8839K8816m8843k2719N7493
162B1245J3591o3857k200O7181j0512o7046K3474O3395l5547n6477M5806M6944
174D5997n3455l5525N7959K3275n9097j1224N7028K90n2184Q651M5226j5069l7044
187b5172J8602K8541j9300k0700J7498J4254j3699r851Q718P812l372q136j506
200f311J0683N176j4919p072K0201O860k5818m424L0947q4l4914O215L7168j3441
214A0267l7380K1097L5371k8429l1288L4868K5399l9776j8194M2861J0279m3849
226a8774k249M2806n277l9940J1762L5580j6816l0252K0191K4410k1831j8696
$$ y = [-23607, 24120, 16008, -20625, -10384, 15473, 7056, -9729, -6325, 4091, 7948, 508, -11599, -3461, 16652, 4325, -22282, -2829, 27798, -858, -32341, 6498, 35314, -13529, -36248, 21245, 34836, -29021, -31221, 35960, 25448, -41598, -18124, 45271, 9724, -46753, -947, 45997, -7458, -42983, 14976, 38251, -20846, -32070, 24958, 25248, -26936, -18285, 26941, 11872, -25172, -6570, 21971, 2671, -18029, -531, 13723, 24, -9827, -1109, 6703, 3331, -4805, -6311, 4372, 9548, -5371, -12443, 7758, 14618, -11200, -15624, 15323, 15239, -19675, -13460, 23708, 10267, -27113, -6016, 29355, 926, -30362, 4506, 29905, -9871, -28065, 14796, 25075, -18774, -21023, 21783, 16506, -23434, -11672, 23908, 7092, -23160, -2969, 21441, -390, -19086]
238a9086K1844J3502k0449r309J8045O359j5068m762J2011M512r291n413P363
251B58P144o393r357O579J1622p919j3536J0230J4748j3325j4994J6823J4126
264A6006k0384j2132K3633R127k6224n257K7909Q77k8510L737K8020q223k6457
277a7878J2299K3957j5692k0789J8217J7169j9814j3435K0469R782k0284o511
289a2510J9386L769j7985j675J6302K89j4572M91J3003p00j1728N25J0886j08
303E373j0511m01J0627P56j1154q62J1974N97j2983J09J3984j271j4864K855J5469
318I698m753j5648O874J5397r079j4606J1204J3353j3103j1690J4700R659j5898
331c892p420J6609N061j6842k778J6655N77j6026J331J5090k940j3944M239J2668
$$ y = [-19086, 2758, 16260, -4189, -13498, 4547, 10906, -4162, -8924, 3087, 7599, -1692, -7105, 258, 7402, 1009, -8348, -1769, 9853, 1934, -11602, -1372, 13376, 51, -14943, 1880, 16006, -4378, -16510, 7123, 16250, -9974, -15231, 12678, 13555, -14955, -11218, 16802, 8579, -17878, -5579, 18378, 2686, -18103, 114, 17283, -2531, -15966, 4503, 14285, -5999, -12510, 6876, 10645, -7340, -9015, 7287, 7576, -6996, -6505, 6498, 5798, -5930, -5405, 5481, 5373, -5138, -5539, 5088, 5844, -5310, -6172, 5802, 6399, -6584, -6475, 7509, 6238, -8626, -5771, 9698, 4945, -10703, -3829, 11568, 2489, -12117, -913, 12440, -663, -12353, 2347, 12006, -3892, -11312, 5297, 10358, -6484, -9262, 7393, 7970, -8056, -6725, 8365, 5425, -8519, -4280, 8388]
345H388n140j1366N722J0178o032r114O128Q257o095p618N992P200n936o957N956
360d37O868o156o841O514O839p071o770P788O563q628o137R567N497j0484m614
375g502J1343L465j2031k118J2500O01j2723J006J2597k634j2166M149J1413n499
389B401j0433O641R255p497p969Q075O659q327n403Q345M282q115l369P768K673
404D986p353k205O958J924o662j825O506J804o537j796O754J744p128j551P636
419C255J171q174n82Q733k53r176J305R428k518r433L800R163n152q558O371P665
435G045p442o546Q268N206q760l813Q949K427q787j148Q344O9p669P52O886j271
451B510o042J476N322j426m756J160M402q01m329M24M531j61m962Q5N586l04o241
$$ y = [8388, 3248, -8118, -2396, 7782, 1750, -7364, -1236, 7021, 926, -6692, -700, 6500, 564, -6393, -437, 6431, 275, -6566, -52, 6787, -284, -7054, 734, 7297, -1331, -7468, 2099, 7596, -2888, -7502, 3841, 7306, -4725, -6843, 5657, 6258, -6465, -5459, 7138, 4504, -7662, -3513, 7900, 2401, -8032, -1391, 7864, 367, -7602, 473, 7132, -1195, -6598, 1747, 6029, -2086, -5455, 2313, 4986, -2367, -4572, 2386, 4310, -2352, -4177, 2329, 4133, -2404, -4200, 2554, 4298, -2830, -4381, 3255, 4426, -3748, -4330, 4403, 4150, -5026, -3721, 5707, 3189, -6244, -2444, 6719, 1567, -6991, -620, 7045, -397, -6943, 1325, 6531, -2229, -6042, 2907, 5334, -3453, -4601, 3743, 3812, -3857, -3105, 3781, 2510, -3532, -2056, 3266, 1840, -2916, -1756, 2646, 1845, -2484, -2060, 2471, 2310, -2652, -2567, 3019, 2715, -3526]
468c526Q08O876j622p341K688P594l956p510N295P059o631o244P826N046q738
483b376l629R325K029r498m05R243j162q601K500P666l526o456M190N144m401
498D3l908M273K791l748j938K977J448k082j385J188J717m79k394O3L290k5m296
515b465M07N281j219o034K400O442l802o474N351O033o878n090Q178L743r196
530c323k056R728J80r752J712R250l467q276M936O896n975n265O538L541o562
545a895j877O116M56n245O39M054j248k727J382J390j006k61J94n50R45Q98k238
562i73p50L519R5m648J055N410k540n666M184N412n868m604P384L293q567j573
578d837R268m34r388K486Q899m435p853O096O301p256m457P891K438p886m86P333
$$ y = [-3526, -2718, 4158, 2536, -4805, -2117, 5477, 1521, -5989, -694, 6365, -266, -6510, 1316, 6362, -2376, -6005, 3320, 5349, -4149, -4554, 4689, 3527, -5074, -2574, 5092, 1566, -4890, -700, 4444, 43, -3865, 408, 3199, -549, -2487, 490, 1938, -144, -1529, -341, 1376, 897, -1497, -1434, 1856, 1831, -2465, -2058, 3223, 2004, -4030, -1630, 4812, 1010, -5464, -113, 5920, -958, -6048, 2130, 5873, -3323, -5379, 4349, 4529, -5223, -3511, 5739, 2272, -6004, -1068, 5828, -147, -5412, 1126, 4667, -1895, -3772, 2344, 2800, -2445, -1806, 2248, 1000, -1727, -345, 1045, 39, -222, -28, -578, 367, 1265, -973, -1723, 1796, 1891, -2757, -1702, 3708, 1168, -4498, -314, 5098, -770, -5374, 2010, 5303, -3264, -4837, 4431, 3997, -5391, -2905, 5994, 1559, -6294, -198, 6103, -1153, -5610, 2281, 4719, -3167, -3653, 3680]
594C680j233o252K550M836l363l175L590J523l254n8K409j093j172J731k90j824
610a395J798J353l138l87M155r96m703K636M701m337m090N871K983p129j442P965
626C845m27q238K421P900m353p012O049N571p320l779Q066J773q200K63P725k101
642B183o692L599N266m590l572N031J781m875q9M150j289k980K210J522k612M3
658i14K428j533j693K733N22l519R42L788k540l484M055K682n354j399O249k11
674B752o654J989O506l750n823N323M645o575l082P355J299p615N55P331k332
689A924o498L825N274m903l751N518K094n601m39N159j026m247K138K998k791
704c26j595K936J55k578J111J767k085o08K608p18k666K085K236l341j325M283
$$ y = [3680, 2447, -3805, -1255, 3581, 218, -2957, 633, 2156, -1098, -1156, 1253, 160, -1012, 719, 429, -1395, 403, 1756, -1382, -1769, 2386, 1390, -3313, -677, 4024, -313, -4403, 1468, 4451, -2678, -4120, 3845, 3418, -4820, -2399, 5501, 1148, -5864, 185, 5756, -1564, -5343, 2723, 4496, -3704, -3441, 4284, 2183, -4509, -910, 4356, -234, -3806, 1225, 3006, -1869, -1958, 2192, 903, -2077, 133, 1655, -957, -914, 1514, -19, -1712, 1021, 1543, -1976, -1034, 2754, 214, -3270, 785, 3467, -1887, -3286, 2963, 2752, -3902, -1913, 4593, 843, -4980, 343, 4988, -1587, -4669, 2686, 3985, -3630, -3075, 4256, 1924, -4574, -749, 4525, -378, -4129, 1389, 3483, -2118, -2557, 2602, 1576, -2671, -533, 2465, -326, -1921, 1015, 1170, -1408, -297, 1470, -615, -1223, 1385, 667, -1999, 86, 2322, -1019, -2344, 1939]
720A939R6m846J367M933k888m519M298L636n435k413O225R19o587O75O483k225
736A658n915L603M944m660l682N341K282n604q17N405n28m812J664L884k449k749
752b435K839J536k824l87K403n94j655J270O66j581M05J498j460j013K333K00
768A201k917Q20L192j968l067L132K530m120j673M860N64n280O83N310j965m977
784c675L166M280m125l309M806K159n133r35N110k26m741J254M082k021l260K531
800c7K296k701j336K550M70k139J97J520o32p83P77oo27P08K21j271M04J611j162
819F0j644J948J428k701r39L328K15l725O35L872j567l723K460L323l276k669
835b975L902J839m263r22M400l4m230R04L842j635l259K182K527k474j774K547
$$ y = [1939, 2035, -2811, -1444, 3489, 601, -3918, 380, 4016, -1419, -3832, 2393, 3312, -3275, -2600, 3883, 1658, -4257, -654, 4290, -370, -4052, 1289, 3571, -2033, -2850, 2555, 2027, -2785, -1121, 2763, 314, -2435, 404, 1940, -884, -1271, 1132, 538, -1117, 153, 819, -762, -357, 1141, -319, -1332, 1001, 1201, -1716, -896, 2296, 328, -2739, 393, 2923, -1197, -2870, 1990, 2554, -2726, -2043, 3267, 1302, -3675, -509, 3771, -354, -3663, 1143, 3302, -1831, -2766, 2344, 2118, -2623, -1369, 2713, 692, -2568, -37, 2259, -442, -1778, 772, 1242, -897, -700, 820, 188, -595, 182, 176, -451, 257, 478, -793, -389, 1222, 60, -1584, 364, 1792, -909, -1848, 1480, 1695, -2030, -1395, 2477, 910, -2813, -353, 2970, -306, -2975, 927, 2766, -1497, -2419, 1981, 1947, -2283, -1379, 2463, 828, -2431, -249, 2278, -196, -1970, 577]
851E77J028k382m08K029q0j541L48R93m33m36K92l2J7L73m61n38R70N21j488k93
871i44J943j09k268O28K452j254k409J865K221k488j806K961J284l314o34L486
887A614n1l476P57L265j381k878J892K387k239j823K419J217k438o49K279J66
903A061k000J98J613m12j212M83P87l87m45J78K04J30j02m54J13Q00k72j085N71
922b31J281r54j355J362J293j790j074K167P43k470l12K664j92k724P40K631j236
939E43k414J703K088k095j622K307J154k428o42K388J80k248K36J970n52j652
955a084P47J279q16r11P50O09o04l63L60K36q2k22j73L15M26n49n77Q27O38j142
975c36n73J479L87j776j00K000k86k113P28K108j176j971J600J724j973j362K253
$$ y = [577, 1605, -777, -1185, 844, 764, -777, -429, 564, 131, -305, -13, -45, -28, 345, -116, -654, 316, 837, -651, -944, 999, 890, -1378, -750, 1702, 448, -1961, -96, 2125, -363, -2169, 792, 2076, -1238, -1872, 1614, 1563, -1913, -1156, 2109, 728, -2150, -258, 2129, -110, -1933, 486, 1703, -735, -1384, 895, 1061, -939, -741, 872, 460, -752, -269, 518, 131, -314, -136, 68, 198, 96, -358, -245, 555, 283, -802, -231, 1050, 96, -1259, 103, 1396, -394, -1468, 699, 1442, -1028, -1340, 1324, 1132, -1592, -852, 1779, 543, -1871, -168, 1920, -175, -1797, 510, 1664, -764, -1406, 982, 1162, -1086, -850, 1120, 568, -1084, -337, 942, 126, -785, -35, 574, -30, -393, -33, 203, 121, -101, -274, 41, 467, -82, -659, 168, 806, -336, -909, 570, 957, -819, -919, 1081, 795, -1318, -590, 1518, 342, -1629, -29, 1695, -278, -1640, 613]
992F13R27k410m55K436j4k341M54K138q50j827J101J469j275j062J292O87j217
1009c34l59J040J01p70M9M61n6j79k8o1K13K54m90l27Q07K91j133j17J417j90
1029E89j597N47J687r56j658J407J473j802j173K125P70k345k93K451k26k378
1045a379P06K191j161j877J494J464j723j013J812N37j750r5J540k48j272N14
1061b60Q97o09n13N88J51m26J41J78l21J57L90n18l31Q83J22j186K09J361o19
1080B94j420J079J319j516j086J908P10k197k23K342l15k336Q70K163j372j827
1096a607J775J392k075q70K184L08k135K18J931o93j570J002J153j210o51J215
1112C67J86j060K21P87n20m07O99k8o93M65N38q45k54J151j72j301O57J278j138
$$ y = [613, 1540, -870, -1325, 1111, 1097, -1244, -790, 1348, 498, -1329, -228, 1241, -34, -1096, 196, 883, -334, -693, 347, 448, -322, -273, 188, 132, -47, -75, -136, 77, 331, -159, -486, 321, 612, -521, -638, 779, 589, -1008, -461, 1226, 270, -1388, 19, 1492, -310, -1483, 642, 1412, -933, -1226, 1225, 999, -1379, -673, 1518, 357, -1520, -26, 1438, -285, -1298, 514, 1051, -699, -794, 746, 498, -774, -260, 637, 28, -485, 103, 254, -172, -31, 147, -174, -17, 373, -145, -476, 407, 529, -657, -448, 913, 294, -1126, -47, 1272, -244, -1330, 578, 1288, -909, -1132, 1210, 895, -1441, -571, 1592, 220, -1607, 168, 1560, -515, -1385, 799, 1107, -1028, -810, 1121, 428, -1142, -140, 1013, -197, -848, 367, 553, -507, -286, 501, -19, -426, 273, 245, -448, 17, 555, -290, -544, 607, 435, -866, -209, 1069, -69]
1131f9j104J584P65j941l12K154k15k225Q20K089j360j796J836J348k187p92K342
1148I37J98k347M03K146r38j807J372J317j639p44J699J88j588L45J302p62q76
1165g94J020L83j102J49R95o16p18J009L01j269K07J334p37j226J251R33j676
1182e56m78J952p6k060O62J983j240j718J749J299k126p72K347J47k376M80K208
1199A425j052j882J528J395j835q31J968K17j891L55J654q47j244J188P32j347
1215d67j75J343l80j107Q29P47j183k37J347l01j318Q29J110j319p19J663K17
1232H79j875L88J857r62j661J487J295j925p89K180J99k261M09K162j005j871
1248a493J506J420j857q60K016K76k016K98J843q14j481J217J012j461m51J497
$$ y = [-69, -1173, 411, 1176, -765, -1077, 1077, 862, -1363, -543, 1546, 186, -1610, 226, 1574, -613, -1405, 937, 1135, -1212, -809, 1337, 399, -1408, -36, 1281, -358, -1102, 597, 785, -803, -458, 844, 82, -794, 226, 609, -493, -344, 651, 35, -683, 326, 627, -642, -435, 899, 162, -1064, 187, 1120, -556, -1034, 918, 842, -1218, -556, 1427, 187, -1531, 218, 1517, -609, -1381, 966, 1113, -1263, -783, 1425, 373, -1509, 19, 1414, -421, -1252, 716, 933, -958, -603, 1051, 204, -1040, 148, 880, -467, -642, 701, 321, -786, 43, 790, -393, -630, 717, 416, -902, -73, 1037, -282, -1001, 662, 879, -996, -608, 1249, 287, -1374, 113, 1408, -517, -1306, 874, 1073, -1188, -779, 1383, 378, -1493, 13, 1433, -424, -1284, 732, 1008, -1008, -710, 1133, 319, -1162, 55, 1067, -394, -845, 652]
1264F52q1j378N92J090j001o33J223J36j294L94J178q85q99J287M64j540N5J618
1282I78o12j523J152J218j570q04J865K93k018L04J954q68j734J357J344j731
1298c95q42J937L00j981K71J836p80j538J199J106j442o23J550R9j469L88J257
1315H73p80r14J071M71j199jJ168m46r94Q56O49j153k31J278k23j278O87J109
1333I43j096p95J420L65j590J09J628o09j489J054J203j427q10J665L30j743J48
1350f94J688o29j462J027J130j317o98J463K51j469K09J324n91j062R01P16j083
1367b96l01J132j28j033M95Q02p87m82R52J19j024K74R45o43p41R39M41j141p2
1386e49J203l06j166P03R74j027o83J258L27j370O5J378m65j255Q24J015j111
$$ y = [652, 571, -807, -215, 875, -126, -759, 464, 600, -694, -300, 878, -7, -906, 381, 845, -695, -640, 978, 366, -1157, -5, 1213, -357, -1161, 704, 997, -1021, -717, 1237, 369, -1365, -8, 1336, -395, -1237, 700, 1000, -981, -710, 1126, 346, -1192, 7, 1113, -329, -952, 598, 697, -772, -384, 873, 93, -821, 250, 721, -478, -479, 689, 243, -751, 105, 754, -399, -630, 648, 425, -853, -166, 943, -153, -948, 472, 837, -753, -644, 984, 375, -1114, -60, 1143, -284, -1094, 571, 901, -842, -694, 994, 365, -1097, -70, 1060, -257, -955, 508, 759, -710, -501, 823, 232, -830, 71, 787, -296, -597, 535, 407, -626, -131, 671, -116, -598, 354, 473, -551, -277, 668, 25, -716, 223, 664, -477, -549, 654, 348, -818, -115, 859, -168, -851, 407, 734, -636, -571, 807, 342, -913, -89, 926, -185]
1403a85o96J293L24j351Q0J282m33j109P42Q40r55m97J039J66j029J78Q96m66
1421A19o82O75M07q09r4Q14k25p13N06N00p13k46Q24n6q34L81P26o45n76Q81L23
1442E63j007k0J060k98j016O12Q62q69o23J039L44j136k9J134k78j043N54Q75
1460G24p74o26R06L72r77o0R22k02p90M15O16n90l73O60J11o50J25N58l50l92
1480c75N10J70n86N3N91l07m86N14L34o82j01P59j32p76L86P10o22n53Q02L49
1500E58r25j05R65j55r28M02Q24o11o48P67M44q68j90Q95m7q45K79O99m55n36
1520d80N71L37o30j14N93r8n08K63L68l83k02M52rm34J97L70l68k24N10J9n74
1541c44J85N73l82m80N63L44p15j48P87o9p93K87P47m94o36O67M59p94k41Q64
$$ y = [-185, -881, 412, 736, -615, -535, 747, 314, -795, -53, 787, -168, -665, 374, 540, -489, -311, 585, 119, -563, 112, 519, -290, -384, 430, 205, -508, -2, 498, -215, -461, 363, 307, -527, -146, 580, -65, -641, 240, 563, -444, -464, 596, 298, -718, -106, 756, -113, -736, 303, 647, -489, -518, 616, 338, -705, -151, 724, -50, -676, 230, 602, -375, -435, 487, 285, -505, -90, 526, -64, -437, 223, 334, -316, -191, 367, 17, -375, 135, 305, -281, -228, 363, 56, -430, 84, 418, -264, -365, 394, 262, -514, -128, 582, -40, -593, 209, 558, -367, -472, 493, 338, -590, -188, 636, 25, -623, 144, 588, -280, -470, 425, 378, -467, -188, 511, 56, -480, 91, 428, -202, -316, 277, 179, -329, -66, 302, -81, -283, 169, 160, -274, -77, 293, -75, -299, 211, 230, -344, -159, 414, 32, -448, 115, 459, -256, -404, 383, 314, -479, -192, 555, 61, -575, 92, 551, -243, -484, 380]
1561C80J0q31J94P69m11o21N39M40o35k35O59L8o21J46N12l04l60L83K01m37o
1582a90M14j77l20L18J93m18j6M64j77m29L51L49n01k14O20K6o62J61O77l77n83
1603d91N50M61p08k69P94O1q09J58P54l63o74N66M77o54k82O96P7p01J29O10k96
1624H6m90M21L23m99j17N00q2m31K30L48l71j71M38%m54J84M09l58l04M99J42
1645C03n74M5O09k48n70M47M61n93l18P23J04p56R5P48l09o69N09N15o41l37P33
1666B77J10p51J20O70k99n75M58M08n71k06O06k1n78K15M74l63l27M89J37n14
1686b41O6M82k41m08M21K59n26q4N81j32n45L22M76n02l42O39J58p14O3P11k88
1707A55o41M83N19o54l23P45J07p77J21P24l21o37N04M66o40k58O99K6o82J84
$$ y = [380, 390, -441, -247, 522, 111, -510, 29, 469, -166, -401, 258, 296, -325, -179, 333, 29, -331, 52, 253, -184, -190, 224, 47, -273, 45, 238, -180, -196, 268, 91, -338, 13, 362, -139, -353, 267, 293, -369, -208, 469, 92, -491, 59, 520, -188, -457, 337, 398, -411, -253, 501, 138, -536, 30, 507, -147, -429, 267, 344, -357, -228, 382, 86, -404, 17, 340, -159, -276, 224, 142, -289, -59, 289, -82, -253, 185, 185, -269, -85, 324, -34, -338, 161, 303, -271, -226, 383, 135, -435, 12, 473, -120, -438, 285, 389, -367, -272, 476, 167, -502, 7, 522, -119, -456, 277, 387, -364, -244, 426, 127, -448, 10, 418, -153, -359, 247, 226, -352, -137, 337, -26, -353, 136, 273, -241, -175, 307, 66, -342, 79, 338, -188, -272, 309, 177, -368, -46, 430, -72, -414, 225, 383, -331, -268, 443, 155, -486, -3, 516, -138, -461, 284, 391, -386, -265, 459, 138, -499, 5, 471, -169, -427, 272, 298, -384, -200]
1727b00N94l64m60N03K84n87n8O04j73n13L66L86m93k05N77j9n89K24N26m14l92
1748d03N69K10o67OO92k29o50M54N10o17l41P36J22p78J03P58l34o69N29N13o72
1769a58l17P63P2p71J64O91l56n75N21L92o30j69O62m7o19K63N16m31l50N61J31
1790C13n97R0N69k98m63M82K86o03p7O48j37o21L47N30n57l72P02J48p53O4P60
1811D61l02o69N04N18o59l42P71J08p95J22P41l49o18N17M64o56k39P08J2o83
1831c86K01N99l80m36M98K68n79m9N75j62n05L57L76m83k00N62on93K23N34m21
1852gm14N77K36o78rO80k07o43M00N42n75l72O98J73p82R0P24k82o65M88N06o14
1874a34l15O92J06p01J25O23l01n17M73L39n51j42N88o6n40K27M58l92k96M93
$$ y = [-200, 394, 30, -430, 73, 357, -230, -288, 316, 143, -370, -4, 382, -111, -316, 261, 242, -347, -123, 403, -11, -403, 166, 376, -291, -285, 407, 178, -472, -18, 492, -125, -466, 270, 392, -386, -283, 475, 141, -528, 1, 514, -158, -475, 288, 360, -411, -247, 444, 88, -487, 34, 426, -204, -373, 289, 242, -377, -114, 402, -29, -379, 182, 313, -284, -194, 375, 77, -386, 96, 382, -221, -298, 350, 213, -408, -61, 469, -88, -460, 242, 390, -363, -299, 461, 159, -510, -6, 512, -147, -489, 282, 390, -405, -283, 458, 109, -509, 8, 472, -184, -423, 285, 297, -386, -185, 414, 34, -402, 96, 364, -215, -264, 311, 149, -356, 1, 377, -106, -306, 256, 250, -343, -120, 414, -7, -421, 156, 392, -286, -295, 385, 178, -465, -65, 477, -98, -470, 228, 401, -381, -291, 433, 151, -514, -26, 480, -134, -449, 243, 349, -352, -227, 396, 95, -422, 51, 390, -161, -303, 285, 219, -321, -94, 364, -28, -324, 169]
1894A69J14n41Q3N10k66m25M17K96n37j23N90q4n79K74N27m66l82N84K12o61j6
1915c04O76k00o25L76N14n31l36O26J41o52O3O26k37n49M08L98n16k26N78L2n44
1936b82J44M81l14l64M36K05m87l4M85j37m42K98L30m22j89N08jn03J55M62l14
1957A5l71M32K50n42o0N63r2n62K73M68m19l35N10J92n77j3N79j60n21L20M03
1978C53m10k90N10J18n15M5N00j98m23L37K86m16j38M44j9m24J60L53k79k65L85
1999A14J16m32K8M17j78l55L13K64m11j39M71k1m73J74M16k98l46M10K23m66q0
2020b53M91o3m76K12M18l30l22M27J78m67l2M66j06m09K36L19l10k24L76R5m06
2041a80N4L63j78l02K69K02l40p8L73p3l47J87K76k71j90L55N7l72N8L66j76l16
$$ y = [169, 283, -258, -175, 335, 69, -356, 61, 357, -180, -303, 287, 203, -376, -102, 425, -41, -423, 161, 373, -288, -304, 372, 172, -453, -77, 437, -94, -430, 196, 337, -315, -252, 374, 137, -412, -4, 394, -122, -348, 230, 262, -282, -138, 343, 29, -335, 101, 306, -181, -215, 270, 133, -309, -11, 319, -103, -292, 216, 215, -288, -133, 329, 15, -356, 76, 326, -216, -276, 287, 195, -367, -94, 374, -45, -380, 130, 322, -255, -268, 311, 151, -370, -50, 353, -57, -347, 163, 281, -234, -189, 311, 113, -310, 27, 313, -103, -241, 203, 184, -240, -80, 273, -6, -271, 114, 230, -202, -174, 243, 65, -290, 23, 287, -124, -263, 208, 187, -286, -112, 304, 6, -340, 70, 293, -173, -253, 238, 175, -301, -89, 329, -1, -323, 104, 282, -185, -217, 249, 143, -266, -30, 289, -21, -245, 131, 226, -180, -126, 237, 59, -243, 26, 228, -112, -190, 183, 110, -237, -50, 226, -45, -235, 120, 177, -195, -137, 229, 53, -263]
2063b63K82K33l60j26M16jm17J21L80k35l16L38K10l86r4M16l1l99J54L43k44
2084B1k59L19J55l62l9L58p5l23J70K49k53j60L04N2l11M4K91j52k36K34J43k78
2106a08n5L07n1k86J41K57k44j62K97P1l24L5L12j40k71K31K20l13j12L34K3l51
2128a89R0L20j76k64K49K04l23q7L35j7l15R7K83j83k22K46J35k98m1K89m5k74
2150a86J55J96k00j53K50O4k61L8K40j24j92K05J11k21n0K60n7k37J30K17k14
2171b9j51K58Q3k94K5K99j28k71K14K13k68j37L14N0l30M2L08j42k54K01J85k58
2193g0j15K86K7k80O7K47j41j88J88J10k18l1K26m1k17J26J66j83q7K09J6k18
2215a21N9K18j53j54K00R4k35rK46n7k55J55K10k10j67K57R2k89j2L06q4k80J67
$$ y = [-263, 19, 252, -108, -234, 182, 181, -236, -115, 265, 30, -286, 52, 262, -124, -218, 198, 167, -232, -78, 265, 21, -238, 81, 236, -126, -165, 193, 118, -205, -35, 214, -39, -199, 105, 157, -154, -110, 181, 29, -207, 27, 170, -108, -163, 144, 93, -193, -52, 205, -39, -201, 96, 167, -157, -122, 190, 50, -221, 10, 230, -83, -195, 139, 162, -189, -99, 221, 45, -219, 30, 234, -89, -176, 159, 142, -173, -76, 207, 24, -198, 48, 183, -115, -156, 133, 88, -186, -31, 165, -35, -188, 62, 126, -135, -97, 143, 19, -173, 32, 143, -78, -128, 132, 75, -162, -32, 185, -29, -180, 78, 161, -133, -108, 191, 63, -208, 6, 219, -49, -186, 128, 178, -152, -110, 198, 56, -198, 3, 188, -70, -185, 101, 128, -152, -85, 162, 21, -167, 21, 131, -87, -118, 108, 67, -150, -24, 142, -41, -128, 81, 97, -121, -62, 156, 3, -151, 49, 143, -92, -101, 145, 88, -167, -12, 198, -12, -179, 78, 170, -119, -131, 175, 91, -189, -22]
2238b2K19k28j64K79O0k75OK73q8k41J72J74k16j00K33Pk13N7K00j23j48J73P1
2261A06j94J0K07q8j75J54J10j98m4K33k9k35J17K01j74j67K34J00k76j8K84o1
2283I7k77J38K32k08j87K61J02k85pK70o6k48J35J90j70j49K37N2k30J2K09q3
2305B5j74J56J13j81m5K06l8j85J05J52j67q5K04J5k18N7K14j32j71J92J13k39
2327h3m9K61l3k63J13K32j78j75K32J06k71l0K65m5k60J32K11j88j58K23Q9k51
2349a20J0K35p5k01J32J66j88q4K12J1k21R2J68j34j29J85O5k13OK18q6k08J70
2372A1J46k10q5K53kk55Q0K31j65j75K11J17k56m4K63l5k51J11K19j88j58K28
2394D6Q0k42lK39q0k09J40J59j75r3K28J2k15N2K01j23j47J73R5k07l1K23n7k05
$$ y = [-22, 197, -31, -195, 84, 144, -131, -125, 148, 60, -181, -9, 165, -51, -151, 82, 89, -124, -67, 133, 10, -138, 35, 106, -88, -78, 129, 41, -134, 20, 130, -68, -112, 121, 92, -143, -26, 175, 1, -166, 68, 168, -108, -126, 158, 97, -180, -42, 190, -18, -205, 56, 158, -127, -134, 136, 70, -178, -43, 147, -23, -172, 65, 117, -113, -101, 108, 25, -149, 7, 120, -61, -106, 100, 62, -123, -18, 134, -33, -118, 86, 101, -117, -60, 154, 22, -149, 43, 156, -83, -132, 129, 96, -167, -54, 178, 0, -175, 57, 163, -108, -138, 127, 82, -178, -46, 165, -23, -181, 42, 131, -120, -110, 125, 50, -151, -19, 147, -41, -125, 87, 98, -123, -31, 137, 3, -126, 59, 124, -89, -83, 135, 49, -159, 11, 157, -53, -138, 115, 113, -142, -62, 169, 4, -171, 40, 157, -99, -143, 120, 85, -166, -55, 164, -24, -182, 46, 126, -116, -119, 120, 40, -169, -29, 130, -45, -138, 90, 102, -113, -61, 140, 17, -130, 43, 138, -69, -100, 123, 66, -139]
2418a39J31J44j70j07K24M0k29L0K18j20j80J74J44k32q1K69j9k60R8K19j64j70
2440a80K33R0k62LK44o6k33J38J77j94j08K15O1k39L4K19j03j85J82J21k04n4
2462a11K13j2k13Q2J89j57j31J99O0k28J6K23q5j93J49J38k07o9K23J2k52Q9K17
2485A52j43j83K11J10k33m8K41l0k41J16J97j58j64K29O3k21rK39n8k22J46J64
2507A58j85r7K20J7k19M9K01j30j47J78R0k04l0K23o2k01J22J63j96q3K15J5k21
2530a24L2K24j18j83J79J25k14o1K27J0k40R0K01j52j67K02R8k10l5K31l6k16
2552a37J11J74j61j05J87M3j99J2K03q8j61J31J24j74n8J93k3j83O9J69j29j34
2574a36J88M6j97JK13p5j98J43J42j73r4J95L9k14M6J97j03j62J59J10j80o8K12
$$ y = [-139, -8, 136, -34, -141, 83, 123, -106, -76, 142, 22, -158, 16, 160, -72, -153, 116, 97, -163, -65, 154, -10, -180, 53, 143, -119, -116, 128, 62, -171, -33, 144, -50, -158, 57, 118, -121, -87, 132, 29, -156, 26, 147, -57, -111, 102, 90, -123, -41, 148, -9, -140, 59, 119, -109, -93, 130, 45, -148, 1, 139, -68, -137, 86, 98, -154, -65, 152, 9, -174, 37, 147, -86, -134, 107, 77, -164, -48, 149, -9, -173, 56, 119, -102, -111, 128, 70, -152, -6, 158, -27, -124, 96, 113, -106, -57, 144, 14, -133, 45, 135, -69, -99, 124, 62, -139, -17, 146, -50, -133, 82, 97, -124, -92, 132, 14, -169, 10, 135, -79, -140, 87, 97, -143, -53, 148, -4, -171, 31, 129, -81, -116, 115, 79, -137, -26, 148, -13, -118, 69, 112, -87, -75, 128, 40, -121, 10, 134, -40, -98, 95, 72, -111, -42, 127, -2, -136, 52, 98, -99, -98, 115, 40, -158, -15, 127, -46, -140, 55, 94, -120, -74, 123, 20, -142, 17, 127, -53, -121, 91]
2597I1qj90O1J75j08j39J62P8j76k5J90m8j70R6J33j39q9J66L5j77K9J69q6j56
2621a26J45R2j74m5J84k0j90R9J40j27j05J59P1j98LJ85l9j80J03J42j57q9J90
2644F3K6j86K9J81q2j41J31R5j56n0J71jj74O1J37j01j10J27P1j54j7J64m5j54
2668a15J02J06j22p9J54J7j54K2J69q9j29J09J09j50n3J70nj59N8J43j07j14J36
2691A9O8j55j5J65k4j55Q5J16j20p6J41L8j52J7J47o5j29J13P8j35m8J48oj43
2715h8O1J27j08r9J27N2j43j1J52l6j36O2J27j06p7J42K5j41JJ45n8j15R2R7j25
2740c3n6J32K3j44M4J22p5r5J10O3j33k1J36l4j12O1J14j01q0J35K6j46QJ49p2
2765B1j19Q7Q3j25m0J33Lj32M5J14p6r4J13N1j17k8J49l2j27O3J13r8p2J15K9
$$ y = [91, 83, -107, -46, 129, 21, -118, 44, 122, -54, -79, 111, 63, -107, -11, 122, -17, -106, 60, 95, -82, -53, 116, 30, -126, 19, 111, -63, -108, 76, 56, -134, -35, 105, -22, -127, 32, 103, -95, -92, 93, 54, -126, -23, 119, -38, -127, 63, 89, -97, -68, 113, 31, -110, 21, 116, -40, -90, 81, 80, -94, -33, 104, 3, -107, 20, 91, -63, -80, 84, 39, -115, -13, 93, -29, -108, 46, 63, -91, -69, 100, 11, -118, -9, 100, -50, -103, 67, 62, -97, -39, 104, -3, -117, 19, 87, -68, -83, 82, 58, -97, -12, 104, -16, -92, 49, 87, -65, -48, 99, 34, -95, 18, 96, -39, -87, 61, 55, -88, -27, 100, -8, -107, 20, 72, -71, -82, 70, 34, -102, -40, 87, -19, -96, 46, 71, -70, -69, 76, 18, -97, -5, 92, -33, -89, 43, 66, -78, -34, 88, 13, -82, 28, 91, -42, -63, 73, 39, -73, -12, 102, 1, -79, 56, 82, -64, -56, 93, 21, -98, -11, 72, -53, -93, 40, 43, -89, -44, 70, -6, -100, 13, 64, -53, -81, 68, 36, -91, -28, 85, -13, -85, 30, 59]
2790E9j13JJ21l1j11R0O5j02l9J13Oj24M4R3o7q3J03N1j16j5J37m0j29O4R7j06
2816c2o1J22K8j47K4J44p5j01Q5P9j00m3J27nj26N2J08p4q1R8O0j26nJ14j6j19
2842g0O0R6r5o1J18K0j22J1J15n3r8Q6O2j06l2J30k3j15M9J10r8p4J15M1j37N
2868f6J18k2j18O7R0r8n6J21K3j29K0J24o9r3R1P0j16k0J29k3j06N2J01q5o6R2
2894C1M2j21OJ15m4j16Q1Q4j12k8J12mj10K1J11p0q8J07M2j12j9J18k0j14O3R6
2920G1r8o5J25J6j14J1J23n3r7Q1P8j14l6J24Rj17L4J15p7q9J02N6j34j1J31l4
2946C7j12P5Q4r3o9J25J7j30K6J16p5q4Q6O2j02l1J06j2j20O4R7q9n7J03L5j13
2972e4LJ14m9j04Q5Q1j05m4J27J0j26L7J14p6q7J07N5j15l3J22rj18M9J07p9q7
$$ y = [59, -54, -53, 68, 37, -74, 16, 81, -21, -60, 53, 59, -65, -21, 72, 5, -78, 25, 76, -40, -55, 82, 42, -87, -23, 74, -32, -93, 29, 57, -90, -66, 78, 3, -98, -13, 66, -34, -77, 50, 45, -81, -29, 79, 5, -76, 22, 82, -44, -49, 65, 49, -70, -10, 86, -9, -70, 48, 68, -54, -43, 72, 19, -79, 7, 69, -37, -69, 61, 38, -77, -28, 82, -16, -90, 25, 66, -71, -66, 52, 30, -88, -21, 69, -29, -85, 36, 59, -70, -50, 74, 5, -88, 3, 73, -43, -63, 66, 43, -63, -11, 90, 5, -61, 31, 73, -48, -42, 73, 29, -87, -6, 78, -34, -62, 50, 46, -64, -43, 68, -2, -90, 17, 59, -53, -72, 46, 26, -88, -25, 71, -27, -92, 33, 49, -65, -54, 69, 16, -81, 0, 78, -36, -72, 52, 61, -56, -22, 93, 16, -73, 29, 85, -49, -60, 71, 37, -75, 0, 84, -9, -78, 47, 64, -66, -40, 76, 1, -83, 3, 65, -37, -68, 38, 26, -94, -30, 67, -22, -79, 24, 59, -54, -51, 63, 14, -90, -5, 76, -29, -73, 54, 64, -62, -25, 89, 13, -74, 33, 88, -27, -60, 62, 53, -65, -16, 91, 12, -75]
2998g5J10M0j18j8J25l9j08P1P6q7o0J20Kj18L6J07o1j00J01N6j24mJ19j9j10
3023g8P1Q4r9m9J13J8j16K1J21o2r7Q5P1j07m2J29j2j21M8J00o9q6Q9N2j07j6
3049e9J11k2j10N9Q9r3o8J18J8j13J7J04m5r2P9O3r9k8J07%j05N2Q5p6n6J00L1
3076F7j05oJ20m9r8P8P7r8m0J09%j13K4J14n9j06J00O4j11k9J11Oj24M1J05p8
3102@p9R5L1r5k2J19l8q8O8P5r9m5J10Lr6K9J00o6q6R7N4j03k7J28j5j16N9R0
3130H3p8o8J03L5j22jJ08l7r8O3Q6r8n3J10J7j05K2R4n1r2Q2N6r6l1J13lj14L5
3158d0R4o0o5Q9L4j03OR6l3j04Q6N4q5l6J04J8r7K2R7o7o1O5P0j04k3J07j6j04
3186e6M8Q3p8o4R2K6r3j3R8k1r3N8O0o1p1J04J1r5J2R9m3o9P6M1p8k3R1lr6L6
$$ y = [-75, 35, 75, -43, -61, 64, 25, -83, -12, 64, -23, -83, 37, 39, -79, -43, 64, 3, -97, 4, 60, -64, -68, 51, 32, -78, -7, 77, -22, -71, 42, 60, -56, -35, 86, 24, -73, 12, 83, -24, -66, 63, 51, -70, -22, 78, 9, -77, 12, 64, -43, -59, 52, 30, -80, -21, 68, -25, -93, 25, 43, -70, -53, 51, 6, -86, -7, 56, -43, -71, 36, 36, -69, -17, 68, -8, -64, 36, 67, -38, -44, 76, 27, -71, 7, 84, -14, -54, 55, 55, -58, -34, 80, 21, -85, 15, 79, -32, -61, 50, 56, -68, -27, 78, 0, -79, 16, 47, -48, -70, 49, 11, -77, -9, 66, -33, -78, 32, 35, -61, -32, 68, 2, -84, 13, 67, -36, -63, 65, 50, -66, -7, 83, 5, -63, 40, 75, -47, -48, 60, 23, -75, -12, 74, -24, -77, 33, 50, -55, -33, 61, 10, -82, 0, 56, -40, -71, 42, 39, -75, -40, 54, -6, -71, 18, 52, -51, -45, 51, 18, -86, 0, 54, -31, -67, 37, 55, -42, -20, 77, 10, -51, 14, 84, -20, -43, 64, 48, -56, -8, 75, -3, -67, 25, 51, -42, -55, 43, 22, -71, -13, 47, -14, -85, 19, 30, -65, -53, 46, 3, -66, 10, 51, -27, -50, 41, 38, -58, -22]
3216b2Q6o1o7P8M5j01jR9k7q8O5P1q7m4R4K1j11K5R8n5q0P2M8r3l3J02Lj02M0
3245b5Q1o6n4P1M7j02j5J03j8q4L9O9o5m9R2Rq6J8R9l9r2O4O4p8k6R0%q3K7P7
3275F8o8n7P9L9r0nQ9l3q1N0P1p1m7R0J4r8RJ00m6p9O3N2o7l6Q0Qq4K5P5m8n5
3306e3O4L6p3j6R2j2q3L2O5n8m4P9K2q4J4P6k9p9O8N1q7j4P4qp4K9P2n5o3O1N7
3337F0r3qP7j3q2M2O8o8m4Q4J4q9PQ8k3p5M6O7p9l6R7j0p5L1O3l5n7O6K6p1j2
3368c4R0j5q1M5N8o4n0P9J4p8NQ6m1p1N6N3p5l2R8j6r2L4Q8o1n9P5L6q0j8Q1r
3399B2p6M3O7o0m9P4K1p1J0P2l7n9M2M7n1j9P2j2o5K1O8n9l6O0K2o1j7Q1k5p7
3429e2N7N3o9l6P3Pq6K2P1m3p2P2M8p8j9P7Nq7L7O5m8o1R2K5p9oO5mp6M3N4m7
$$ y = [-22, 64, 3, -64, 14, 59, -42, -43, 56, 29, -59, 6, 77, -10, -54, 40, 61, -50, -25, 73, 18, -62, 10, 58, -35, -68, 34, 37, -65, -25, 56, -10, -64, 7, 54, -48, -63, 40, 22, -62, -23, 46, -19, -68, 24, 33, -53, -35, 64, 25, -67, -3, 61, -17, -43, 47, 47, -36, -9, 68, 0, -57, 22, 61, -29, -34, 55, 22, -59, -9, 62, -9, -56, 34, 48, -50, -41, 59, 13, -66, -3, 49, -18, -54, 26, 34, -50, -25, 50, 2, -53, 11, 47, -26, -42, 50, 38, -45, -13, 52, -6, -50, 29, 51, -33, -19, 57, 28, -51, 17, 68, -19, -33, 41, 33, -41, -12, 60, 5, -58, 3, 60, -33, -41, 36, 23, -59, -17, 51, -17, -61, 23, 37, -52, -45, 43, 20, -55, -9, 58, -21, -57, 40, 30, -45, -14, 49, 14, -43, 23, 49, -22, -34, 56, 41, -40, 5, 63, -1, -51, 28, 42, -36, -31, 55, 14, -57, -1, 52, -23, -55, 43, 27, -65, -31, 57, -4, -63, 12, 48, -32, -50, 31, 22, -54, -11, 56, -4, -53, 21, 42, -29, -19, 53, 16, -43, -1, 46, -5, -24, 48, 36, -29, -8, 60, 1, -35, 25, 47, -14, -31, 50, 25, -52, 5, 58, -11, -47, 26, 33, -53, -31, 40, -3, -75, -3, 45, -33, -52, 25, 30, -57, -20, 45, -3, -64, 28, 53, -26, -32, 33, 29, -47, -4, 50, 3]
3461Cm9Q0J1p2LQ1m8o0O1K5m8k8Q2jp5K4O4o2l1O7J3q7J3P3l8o3N0N7p3l1P2J2
3493B5q3K9Q2m1o7O2M2o9k0Q4Mq6L0N7l9m1N8J8o8oP2k0n5K7N1o8j5O7lo3J0O1
3525C5l5m1O5J8o7jP7l2p2M4M9o8l0Q0J1q0NQ7l6o2N6N5p1l0O5J6p6K1O6l1n9
3556d1N2L7o4oP2rp0K6N1m8k8N1Rn1kO2k3n2L8L7o7j1O1po6K4O3n0l4N7K5p5P
3589c2O9j8o8M2O4p2l2Q2J0q0J4Q0l2o6N9K9n2l7P6Lp4J8P3l6n4M6L4o8rO8k8
3620Im5K7M9o0j4N3Mo7L1M5m6l5N4K2n9jO5j3p6N0N3n3m5P5K5q1OP3k9o8M7N4
3652E0m9l0N7J8p0OP3l6n3M6K9m3k7N5rm5K0M8l8l9M7J3n2LN7m0m9L8N0o1k6P1
3684A4ko1L1O9o4l7N9K8o4rO2Ko5L3N6m7m3P2Ro3oP2k4o6M9L7n3k7N9J7o5J8L3
$$ y = [3, -46, 34, 45, -27, -24, 57, 9, -51, 10, 35, -13, -41, 41, 40, -35, -11, 53, -9, -40, 27, 40, -47, -34, 39, 1, -62, -12, 45, -28, -59, 13, 25, -58, -29, 53, 12, -55, 7, 49, -20, -40, 44, 48, -38, -8, 49, 10, -31, 27, 45, -23, -29, 43, 23, -32, -5, 46, -22, -37, 30, 27, -36, -26, 35, 0, -41, 24, 42, -25, -26, 51, 19, -53, -9, 40, -28, -58, 22, 33, -47, -42, 45, 9, -53, 3, 58, -13, -43, 22, 38, -38, -17, 49, 18, -41, 11, 48, -16, -22, 50, 41, -29, -3, 48, 0, -28, 23, 32, -19, -21, 41, 18, -34, 4, 41, -26, -37, 24, 17, -49, -25, 38, -12, -46, 11, 36, -39, -32, 37, 19, -49, -7, 57, -15, -47, 35, 45, -35, -21, 59, 27, -39, 20, 49, -3, -40, 36, 39, -35, -17, 56, 20, -34, 12, 46, -22, -31, 37, 9, -36, -9, 40, -20, -34, 19, 23, -44, -13, 32, -14, -49, 5, 27, -32, -33, 32, 19, -57, -7, 46, -7, -52, 23, 48, -33, -27, 46, 17, -51, -4, 50, 1, -29, 28, 46, -24, -18, 55, 19, -34, 12, 41, -2, -29, 26, 17, -28, -8, 40, 2, -37, 10, 23, -29, -26, 31, -9, -58, -20, 30, -31, -57, 14, 12, -49, -18, 51, -13, -50, 9, 37, -27, -36, 26, 28, -37, -4, 52, 5, -38, 34, 43, -20, -26, 46, 22, -44, 5, 42, -11, -38, 21, 38, -27, -9, 24]
3717B4k0m7M9J7m4qM8kn9K7M2l7k4M0Lo1K4O1l7l9M5L6n7j0O5k5m5K6O6n4m9O5
3749B0L4q3rR0k2o2L2N6n4m1O1J5o7PN0j2m6K0M2m1k2N0Rn1J4K4k3l7M0K7o3R
3781c3M7j1m2L5L7n0l2P3Ln8J2N6k9m7O8J4n7j5P2j3n7J7N8l7n2M8K3n4j7P3j6
3812A6o2L0M6l4l8M5J8n7K0M1k9m1L2K7l7j0M4Jm7K6J8km2M9J4n8lO0k1l0L1L7
3844D4m6k7M6J3n6J5N5k6o0N8K9p3j4N9Qp4K6N0l2l5L8L0n5j1N1j0n3K9M4l8k9
3875d4O2Lm6J3M3k0l9K7K9m7lN4k6m2K2N6m6j8L3K6m7nN5qn8L5K8m0k4N0J0o9
3907c6RN6k5m3J9L5l4k1N2Kn2J1N0l9k8N0K1o7NM9jm6K8K9l5j1M3Km8J1L4k3k9
3940c2M1K6o3J3M5k0k8K2L2l5k7L9K4o0%M6j3m3K2L8m8j9N0Jl3oM7j8m9L9K4l8
$$ y = [24, 4, -43, 6, 23, -21, -29, 19, 17, -42, -15, 27, -10, -34, 6, 9, -52, -28, 33, -4, -43, 2, 38, -19, -29, 36, 11, -34, -8, 58, 4, -45, 20, 54, -29, -38, 52, 30, -32, 0, 56, 2, -39, 22, 37, -30, -23, 27, 15, -31, -11, 31, -10, -32, 18, 27, -24, -10, 14, -9, -46, -6, 21, -42, -33, 14, 3, -39, -4, 33, -17, -49, 24, 27, -31, -19, 37, 8, -39, 29, 43, -14, -29, 43, 30, -27, -10, 48, 11, -41, 7, 30, -24, -41, 32, 16, -46, -16, 30, -4, -42, 3, 21, -36, -16, 25, -4, -45, -13, 14, -23, -33, 11, 12, -35, -9, 9, 7, -35, 14, 28, -30, -33, 27, 6, -24, 7, 44, -2, -29, 17, 30, -26, -11, 44, 18, -42, 16, 45, -28, -42, 17, 25, -49, -23, 27, -5, -40, -2, 28, -27, -38, 13, 3, -50, -21, 23, -15, -44, 18, 21, -25, -12, 31, 11, -28, -1, 28, -19, -22, 32, 6, -36, -14, 42, -4, -22, 11, 37, -10, -15, 40, 32, -26, 9, 37, -3, -27, 23, 33, -36, -27, 29, 4, -39, -20, 15, -19, -40, 12, 14, -38, -27, 23, -16, -44, 6, 27, -40, -35, 14, 13, -33, -5, 24, -11, -22, 21, 23, -25, -14, 20, -3, -32, 9, 35, -28, -15, 30, 10, -18, 4, 36, 1, -26, 13, 37, -23, -23, 23, 10, -33, -11, 27, -21, -40, 10, 11, -22, -28, 19, 1, -48, -9, 15, -23]
3972b3j2L7J5m3J4L9k5l1L7K3l8kM1k1l1K0L2k9j2L4Rm5jL9j1l2J8K4m2mL5j3
4004Bl9K7L4l7k4L5J8n2J0M1k0l6J8L9l7j3L5K0n3kM8km2L9K3l1j6L6nl2J1L9
4036C4k0l4L2J8l9PL7j6l8J9K4m0k2O1oo0J9M1j3n1M4K5n3mM7km5J3M8l1l2L7
4068@K3m3pN0Kn4K1L3l1oK7Pk2rL8ql3J8K6l0j6L6qk8J2L1k1k8L2J3m8PL0j2l4
4103c2L3J8m7j8N7Nn1KN9l5l2L5L0m4j7N6j0l3K6L2m0j3L0J5m7OL3kl9L0K0l5
4135hlL1J0m4J6L1k1l2L0K1m9QK4j6k8K1L4m3k0L8J6n2K0L3l1k4J8L9n3KM2Nl8
4168b3RM2ql9K2K8l5j1L2jl4J5L0k6j8L3%l6J4L6k3k4K9J5l9rM1nm4J5L3l1k5
4201c7M2kl7LM2j3m1K8M0m1k0L6J4l3JM1k0l7L0L8m8jL8ol1J1K5j5k1J6K1k8j0
$$ y = [-23, -35, 2, 17, -26, -12, 27, 2, -29, 8, 31, -7, -9, 32, 11, -20, 0, 32, 3, -9, 25, 34, -11, -12, 27, 16, -16, 2, 26, -16, -20, 15, 2, -37, -10, 24, -13, -37, -2, 16, -36, -26, 15, -5, -41, -23, 16, -21, -34, 1, 21, -32, -34, 14, 12, -30, 9, 32, 1, -15, 21, 16, -16, -5, 34, 14, -20, 12, 30, -9, -2, 35, 19, -19, 0, 24, -16, -38, 23, 17, -43, -24, 17, 4, -47, -3, 22, -31, -35, 12, 10, -35, -22, 26, -5, -37, 0, 23, -20, -27, 23, 25, -29, -8, 25, -6, -12, 15, 22, 0, -9, 29, 21, -12, 6, 32, 2, -14, 22, 14, -14, -2, 29, 8, -20, 12, 25, -23, -16, 14, 2, -32, 1, 19, -28, -46, 11, 16, -35, -33, 26, -9, -41, -6, 24, -20, -37, 19, 9, -24, 2, 34, -6, -19, 11, 26, -21, -15, 18, 16, -23, 7, 27, -8, -11, 20, 30, -14, 2, 33, 12, -20, 10, 31, -18, -10, 14, -2, -30, -9, 25, -18, -38, 0, 16, -36, -16, 17, -14, -38, -20, 19, -34, -32, 10, 15, -23, -14, 28, 20, -19, 3, 31, -4, -15, 17, 16, -18, -3, 27, 1, -17, 16, 16, -20, -6, 30, 7, -17, 12, 27, -12, -21, 20, 15, -29, -14, 19, -12, -37, 5, 3, -34, -31, 11, -2, -43, -15, 25, -16, -36, 0, 14, -19, -18, 23, 3, -34, -4, 34, -14, -15, 23, 17, -14, -3, 22, 7, -14, 2, 23, -5, -15]
4234a5J8Ol3L6J1l4j5L3Ln4K7L3k9k0L6K3m5j7M6Nm8K4K2k7j2L2J9m2j0M3ol6
4266b6L6J3j5l7M7Kk8%L6qk8J4J7k5rK6kj8kL0k6j7K5J3l9J3K0j8k5K7J2l4kK7
4300aOl2ML9j5k6K1K5m3JL8%l5J5L2k7k3K2L1m0j0M4j1l2J9K4k5j5K8Nl7J5J8
4333A5j2j6J7Rm0LK5pl0K3J4l5jK4K0m9J1L4k1j6J7L1l2mK8J7n1J0L6pl3L2K8
4366D0n3JL4Rm1OK9k1l1L2J7l5jL9j5k6J2L2m7MJ5jm3L2L5k2l6L3K0l9j1M3k1
4399a0j9J4K9k2j4L4mj8j3M7k3j9K1K4k0j8M1rl8J0L5k2k1J8K3l2j9M9j6k7J6
4430cK8l2qK0lk3OK6j6k0K0L4n4jK7Pm1L1J5l1pL7Ol8j1N0j2l7K8L6l1k4L2K1
4464C2m3PK1Ml3K3K6k8k0K6J3m1KL4k0j9K3Lk6j1K8lk5RM4k8j9K4J3m3J1K6ol0
$$ y = [-15, 3, 9, -24, 12, 23, -11, -26, 7, 10, -44, -17, 16, -13, -33, 3, 26, -19, -36, 10, 15, -33, -9, 13, -14, -26, 6, 25, -17, -27, 16, 10, -26, 10, 23, 8, -29, 18, 20, -8, -8, 28, 20, -8, 6, 23, -2, -11, 15, 13, -5, -7, 23, -3, -20, 5, 18, -21, -8, 12, -6, -31, -4, 8, -26, -28, -1, 5, -27, -23, 16, 1, -25, -4, 21, -22, -21, 17, 17, -18, -3, 29, 2, -21, 1, 32, -8, -18, 26, 15, -17, 2, 26, 1, -14, 14, 19, -18, -3, 15, 3, -13, 4, 13, -27, -24, 1, -6, -36, -13, 1, -34, -35, -11, 9, -40, -29, 5, -16, -32, -15, 16, -16, -20, 8, 25, -26, -16, 20, 13, -20, 12, 40, -13, -12, 22, 31, -10, -4, 25, 4, -27, 5, 22, -13, -14, 25, 10, -16, -4, 28, -19, -15, 0, -1, -44, -12, 23, 1, -35, -2, 18, -21, -32, 11, -10, -29, -15, 14, -8, -22, 12, 8, -10, -23, 24, 1, -18, 3, 27, 7, -11, 30, 21, -17, -7, 28, 6, -15, 3, 26, -6, -25, 24, 8, -19, -3, 25, -7, -15, 5, 2, -21, -15, 11, -5, -25, -5, 29, -25, -26, 1, 8, -33, -2, 13, -18, -25, 12, 18, -20, -31, 19, 7, -30, -2, 34, 3, -21, 11, 32, -11, -4, 17, 21, -12, 11, 37, 9, -11, 15, 28, -13, -11, 23, 3, -16, 7, 10, -16, -27, 1, -2, -27, -18, 26, -2, -21, 3, 16, -27, -16, 10, 4, -26]
4498b6K7J7k5rL7nl9K5K6l0j7M2J0m7OL7ll8K1J9j8k5M0Lm0PK6ok9J2K6l3j1L0
4532A0Nl7LK3Ol8K9J5m1PK9kk1QK7j9k4L9jk9J6K7j1l4K7J8k9pJ9J2l6J2K4k6
4566Ak2L0J9k5qL9k1l5K5K4k5l3L4J9m0PK6j1m0K5K8k8k2M6kl2J3J7%k0J6Ok3
4599a2jK5J3k8ML1k2j7K7J1k8lL0k2k5L7J7l9k1M9mm2J5L4k8k7L4J9m4rL6rl3
4632c2J5L0k5j5L1J3m0NK7ol0K6Qj3j5L4Ql0J1K8j8k6M3Qm6NK5pl6K0K8k9k0K1
4666bK2l2LL1j6k3J3K0l1j2L2Qm4RL3j4j6J6K0m2NL6j3k6K1K9k0l5M1Mk6KL3j3
4700A3k6K0K1j8j4K6j4k4K3J7k3j1K6Pk7kJ1pk9K0K5k2k9L5J3m1KL1nl2K8K3l2
4733a5j2L8J4n6K1L5j7l4L6J5l9j4M8%k8J2J6kk2K2J4m4J0L5l3j4J2K9k4j8N0
$$ y = [-26, 1, 18, -7, -16, 21, 16, -23, 2, 28, -2, -19, 23, 33, -14, -8, 29, 26, -12, 9, 28, 10, -15, 25, 28, -12, -5, 21, 15, -14, -2, 24, -9, -20, 10, 15, -22, -19, 4, 10, -28, 1, 16, -25, -18, 11, 9, -12, -4, 23, 4, -20, 19, 18, -11, 5, 32, 21, -13, 14, 32, 3, -4, 15, 27, -9, 3, 27, 1, -21, 9, 28, 3, -5, 34, 13, -22, 3, 27, 2, -31, 3, 22, -18, -11, 15, 4, -36, -11, 17, -11, -33, 13, 11, -21, -8, 9, 9, -11, 5, 11, -12, -13, 12, 25, -3, 1, 32, 10, -7, 20, 31, 3, 0, 30, 8, -17, 20, 37, -2, -23, 26, 22, -20, -5, 29, 1, -26, 8, 27, -17, -26, 10, 1, -32, -17, 13, -12, -27, 4, 17, -23, -18, 9, 3, -27, -1, 7, -6, -21, 13, 21, -9, 2, 30, 12, -14, 29, 37, -9, -4, 21, 14, -22, -2, 26, -3, -23, -2, 20, -12, -9, 22, 6, -17, -4, 16, -15, -27, 5, 13, -31, -22, 11, -3, -19, -3, 17, -25, -20, 16, 3, -23, -2, 27, 7, -28, 13, 17, -9, -7, 26, 13, -13, 7, 28, 10, -4, 22, 8, -16, 7, 24, 1, -10, 16, 23, -4, -6, 5, -2, -31, -11, 14, -8, -37, -2, 11, -30, -28, 3, -2, -34, -6, 17, -15, -27, 11, 25, -31, -10, 25, 8, -26, 10, 25, -14, -28, 20, 20, -8, 4, 20, 18, -4, 18, 32, -12, -2, 33, 0, -14, -2, 27, 3, -15, 35]
4764C5k1m6K7K2k1k3L6Ol1j1L7nm0J7M9n1j2M0J0m3J3L3j0m2L1L3l9j0L6ql2K6
4796FK0k4j2K8J8m0nM2k8k0J0L0l3pL7ol0MK8j6k0J4J4l1oL4kk8J2K8k7k2L0J6
4830A4l4oM5rl5K1L7k8k6L8Ml7J1K5Lk9J6K7m4LL1ql5J0L0k3j7K4J1l0nK9kl5
4864b4L1J1l4jL6j2k8KL3k6k9L8Kk8ML9ql6K5J8j2l0M5J3m6QM2k0l4L9Rk7nL8
4898C3j6k6J2K3k4j4L0kl1mL7j1m1K7J5j6j6L1kl1J6L1l1j5L1Rl8nN9k8l6K7K9
4931B3k6k4M6%k8mM5j7k6J8K7l6rL3Nl3NJ2Jl2K2J6k3lK0mk8J2J1k4oK9Jk5OJ8
4967Bj3k4L7Oj5k3M1j2j0J2J0k0k5L9Kj3qK4nj9J8K3k6j3L2Ml0%K5ll0J2J9k9
5001a2jK5Nl9J3L1l4j3K8J5l7nK9rk4K0J8k4qK9rk1QL5j5k4K4Kj2j8M3Kl3K0K3
$$ y = [35, 14, -32, -5, 17, -4, -27, 9, 15, -16, -27, 10, 5, -35, -18, 31, -20, -32, 8, 18, -25, -12, 21, 11, -31, 0, 33, -6, -16, 20, 12, -20, 6, 26, 2, -10, 18, 36, -4, -9, 33, 5, -15, -5, 25, -8, -15, 22, 16, -14, -10, 18, 2, -18, -4, 10, -21, -27, 7, 5, -23, -11, 17, -10, -32, -2, 14, -20, -26, 19, 10, -25, -4, 33, 5, -21, 17, 21, -16, -5, 20, 23, -6, 10, 37, -7, -4, 27, 19, -16, -6, 24, 1, -16, 8, 19, -11, -16, 13, 11, -24, 7, 18, -16, -17, 19, 7, -21, -19, 14, -12, -41, -3, -1, -29, -25, 14, 6, -30, -5, 13, 1, -29, 16, 29, -17, -9, 33, 13, -21, 18, 27, 0, -5, 33, 17, -9, 3, 26, 2, -12, 18, 16, -15, -19, 18, 7, -34, -7, 8, -8, -24, 7, 5, -26, -10, 21, -10, -25, 6, 15, -23, -28, 31, 3, -33, -6, 23, -3, -27, 19, 19, -9, -13, 32, 15, -11, 7, 34, -2, -11, 22, 27, -6, -1, 11, 12, -20, 2, 18, -5, -8, 12, 8, -20, -8, 3, -21, -27, 2, 3, -22, -16, 2, -11, -35, 2, 8, -7, -30, 11, -1, -11, 1, 11, -9, -34, 5, 7, -6, -14, 10, 5, -14, 4, 27, 1, -12, 20, 24, -6, -6, 19, 16, -14, -2, 17, -12, -13, 12, 17, -22, -9, 22, -12, -25, 3, 18, -19, -24, 5, -4, -28, -8, 10, -14, -22, 7, -2, -23, -15, 20, 5, -19, 5, 7, -5, -23, 20, 22, -11, 9, 32]
5036C2k1k3L3Ml5lL3j5k0J4J9j9j6L1rk6LL6j7j7J1Pj9lK2mk8K1Jj8PL2j2j7K
5071a4K5qk2J8J8j1j3L2lk6%L4j4k4K0J8l4J0K3nl1MJ7j6j3J4K4m9J1L3j8l0K3
5104gK0k7j0K8J1m1jK8lk3K5J4k3k1K7Rk0J3J1qk9L5Rj7pK9kl0J0K1j4j9K9%k8
5139a1J0K5k6k3L3J7l3qJ9Ll2J2J5ol9M2Ok2qK9ok6J7L0k1j8J4J6k9OK2j0j7K1
5173BJ3k2j5M4j1k0J7J6j3rQJ4l3%K3Kk1jK9j9k6K8Jk7NK4j8j7J7J7l1pK9Jk8
5208b8QL7k7k7K7K5l1%K3Kk6QL3j6j4K0kj2j6L9j3j6J6J1k4mK8jl3RK7k1j9K8
5242A1jk3KJ7j3k8K1K3l4oL0%k1j3M2j0k0J4K7l3j3L8kl1J8K2k5j6L1J3j8oL2
5275B8k2j4KK4j3k0L0j1j9KL4l0j8K2K1k8j3L0Ll2K4Pk4j6K7J5k5mK8%l6K0K3
$$ y = [32, 11, -12, 21, 25, -10, -13, 20, 5, -15, -1, 18, -1, -17, 14, 5, -21, -18, 18, 1, -16, -5, 2, -17, -20, 2, -2, -30, -9, -8, -26, -19, 13, 1, -16, -14, 11, 3, -19, -1, 17, 6, -7, 25, 22, -4, -4, 30, 16, -8, 12, 30, -4, 6, 29, 24, -7, -3, 14, -2, -15, -1, 23, -26, -15, 18, 0, -30, -7, 13, -14, -24, 4, 15, -26, -27, 1, -2, -25, 0, 14, -9, -30, -3, 6, -14, -1, 10, 2, -27, 8, 17, 0, -7, 22, 20, -10, 0, 21, 7, -12, 17, 17, -11, -1, 24, -2, -25, 8, 25, -8, -16, 3, 6, -26, -14, 1, -5, -44, -2, 4, -18, -26, 3, -3, -29, -12, 18, -3, -21, -7, 9, -20, -14, 8, -2, -19, 2, 15, -7, -22, 22, 11, -9, 8, 24, 11, 2, 10, 24, -9, -9, 14, 16, -5, -6, 23, 4, -22, 6, 7, -20, -15, 9, -9, -26, -9, 8, -23, -30, -1, 0, -28, -20, 17, -10, -37, -10, 15, -16, -16, 7, 9, -17, -9, 24, 8, -6, 14, 12, 0, -16, 23, 10, -6, 10, 21, -3, -7, 21, 20, -13, -4, 23, 2, -17, 11, 10, -13, -11, 6, -7, -35, -14, 9, -25, -31, -1, -1, -22, -35, 7, -3, -23, -9, 18, -15, -28, 10, 8, -23, -5, 17, -8, -24, 7, 20, 2, -4, 28, 6, -8, -6, 18, 5, -15, 15, 4, -15, -13, 21, -9, -27, -5, 16, -12, -25, 5, 8, -24, 0, 7, -17, -33, -6, 9, -16, -20, 8, 8, -28, -8, 15]
5308A5k6k4L7Lk4OK8j5k6L6K4l1j2L5rk3ML4k8j0J7J2l3lL0j6k5QL6l1qJ9Rk4
5342a5J0J9k4j8K3J2l2J0L1j6l1J4K3k4j7M1J3m7MM2k0k6L5J1l3nL4Ok6KL4k0
5374A0k9K6J4k6lL4pk6KK4l1j3K8%j4JJ7k0j6K4J1l6OL3j7k3K0J7j0rJ5J5l4J
5408a6K9j3k6J8K9k4j9K5Mk1K2J9j9j6kL1k3j8M2qk9LL1j7j2J6J0l6LK4qk7K2
5441fJ2k3j3L0nk2J2L2k5k6L7Oj7jK5Lk9KK4k8j0L1Rm2J1L5kl7K4K1k7oK1Ol9
5476a7MK6j2k8L0Nl0NJ9Jk5QK4k2j3J4J1k8J1K8k1k1J9K7j8rK1Ql9J7K0j1k0J8
5510BJ8l0nL5j2j2kK4j5k1L1%k6nL2j1k6K6Pk2%OKj5KJ5j2rJ5Nj1j3K3nj9QK2
5547Bj7oK2lj8J1J8lk7J4K1j6%RJ3l5K2J4j0l5L2Jj6kJ9Kk4NJ4j4j4J9J0j5qJ7
$$ y = [15, -11, -35, 2, 5, -19, -13, 15, 0, -26, 10, 34, 3, -9, 26, 17, -6, -2, 32, 4, -6, 11, 23, -10, -13, 17, 1, -24, -16, 20, -11, -19, 0, 9, -15, -5, 14, -10, -28, -5, 7, -25, -15, 16, 0, -31, -17, 6, -18, -35, 6, 19, -28, -24, 18, -2, -28, 7, 18, -15, -20, 14, 20, -6, -4, 30, 10, -19, 7, 21, -5, -8, 26, 19, -7, -5, 19, -12, -25, 3, 3, -11, -10, 7, -13, -29, -5, 6, -30, -24, 9, -8, -31, -11, 6, -4, -13, 2, 17, -17, -16, 13, 0, -26, -8, 21, -3, -22, 3, 7, -14, 8, 27, 8, -8, -10, 21, -2, -20, 22, 14, -15, -12, 19, 2, -10, 6, 16, -20, -17, 7, -1, -28, -6, 6, -17, -30, 0, -5, -27, -15, 17, -8, -34, 3, 9, -8, -9, 16, 19, -10, -8, 16, -12, -22, 9, 18, -24, -13, 22, 20, -17, 7, 28, 1, -5, 16, 22, -17, -13, 13, 1, -27, 3, 8, -22, -17, 2, 3, -22, -14, 10, -12, -25, -11, 0, -28, -17, 11, -10, -31, -12, 15, -3, -12, 9, 17, -22, -5, 15, 4, -16, 2, 20, -10, -15, 20, 8, -4, -6, 18, 3, -18, 13, 13, -13, -18, 14, 3, -23, 3, 10, -12, -12, -6, -4, -19, -17, -2, -14, -23, -8, -3, -14, -27, -4, -9, -28, -20, 2, -15, -21, 1, -2, -20, -9, 9, 6, -21, -7, 14, -2, -2, 7, 20, -15, 7, 21, 11, -24, 8, 9, -7, -9, 10, 12, -12, -7, 7, -7, -21, -2, 8, -7, -15, 2]
5583Blk6J4J3pj0J3Mj5J2J3j2j1K0%k0OJ5mj5K3kplJ0Nj8nL6ql1K4Nk6mK1Jj1
5621arK7k1nPkpj2K0oj0NJ7j8j1J9J2k2NJ9j6j2K2nJ1j7K9j3j4J8J1j9j8K1Rj3
5657A%J6kj5J0K2k8k1L4Pm4J6J0kj8RJ9l1nK4Mm0J4K4j6j9K7%j8nL1rj9J1K2k4
5693a5oK7k%mJ0j6nJ7Pj5pK1kj7ML3k9j6J6J0j4j1K4Ol0PK3j6j8J5Lj6PQj0j2
5730b3J4knKkJ7j8J1K2k3nJ4J5k0oK3%k1NJ5k2lK6jk5RK4j5k0K1J1j7pJ1Jl3J9
5767hK2j7k8K2OolJ5Nk0lK3k7nJ8Qj9mJ7Ok7K2K1l0NK4%k0LJ1opJ4Qk1KK1j9j6
5806a3J1K4k8nJ3Rk8OK6j0l7K7J4j5j3K6j8nMJ3j5j5L2kpj4L0j2pPK6l7PJ9lj7
5842gQJ5rj1K2Ml1J7K0j3k2RJ9j7j5J5mj4j0K8Ll2J3J6k5rK3J1l7J3K4j1k5K1
$$ y = [2, -1, -27, -13, 0, -7, -17, -4, 0, -15, -3, 10, -2, -13, 7, 7, -13, -7, 8, 4, -11, 12, 10, 3, 0, 10, 15, -3, -8, 28, 20, -11, 13, 18, -8, -12, 9, 10, -1, -10, 17, -4, -9, -2, -4, -11, -23, -3, -9, -19, -14, 3, -15, -26, -7, 5, -17, -12, 7, -9, -21, 1, -4, 7, -10, 19, 6, -8, 10, 21, 2, -16, 5, 14, 1, 1, 17, 15, 0, 10, 32, 4, -17, 17, 24, -20, -4, 6, 4, -14, -5, 14, -17, -22, 2, 6, -34, -20, 4, -12, -31, -4, -4, -22, -27, 4, -5, -24, -13, 9, -15, -21, 6, 4, 4, 0, 10, -6, -11, 6, 13, -2, -9, 12, 10, -7, -3, 30, 1, -15, 1, 11, -3, -14, 10, 16, -14, -7, 16, 0, -18, -3, 0, -16, -9, -1, -11, -23, -9, -11, -16, -14, -16, 1, -17, -6, 16, -7, -12, 2, 17, -3, -9, 14, 14, -7, -2, 13, -9, -12, 14, 13, -12, -3, 21, 6, -14, 7, 18, 1, -6, 5, 6, -27, -8, 14, -3, -31, -9, -3, -9, -12, 3, 8, -12, -15, 8, -19, -24, -6, 2, -17, -21, -4, 2, -25, -3, 18, -12, -7, 17, 17, -3, 0, 11, 5, -2, 12, 20, -1, 1, 22, 3, -13, -2, 22, -6, -11, 2, 11, -17, -11, 15, 5, -32, -5, 9, -6, -19, 7, -11, -16, -12, 1, -14, -29, 3, 1, -6, -20, 10, -2, -9, -2, 24, -13, -6, 13, 10, -7, 1, 16, 7, -4, 18, 22, -9, 8, 28, 15, -7, 2, 21, 4, -11, 4, 0, -14, -24, 4, 7, -25, -12, 4, -21, -30, -7, 4, -33, -20, 4, -7, -32, -11]
5876a1J9k5LRJ3k8J7K0ql1L3Lk9RJ1Qj7RNj8j2L0Rk6NJ9ll2J9Nj6JK4j1k6J5J3
5913Fj2k6K5Mk0MK3pk3%L0k7nK7mj2J3J1kk1J7KlqJ1Lk8J0K7j7jOPj3oJ2kk4L7
5952A4Rk4j8K5Mk2LJ0j2k3L4mj7j0M1lk8OK0j9k0K8Mk5NL3j2j8RJ4mj2J3K6l2
5987ePK6k1j4J5J4j8j7K1Ml2K1J0j2j2J7oj5QRj1j1J5J2k8%K2nj5%K1j6j3K9J1
6022A1k4%K1qj9J9J6rj6K8lj7kK4j5pJ4Qj4k6M1pj8J3J0j9qQOj6j3K5mj7RM%j6
6060b1J9pj0J2J3j1j5J3K7l4LlJ4j4J1J5pk3J7MjqJ3Nj9JK2k3lJ7J0j1qPJj9Q
6097eJ4j0j1mK2k2J0J9k4qJ5Ok3pK9qj4K7j2LlJ0Kk2QJ9j3OmK3j5j3K7pj1j0J6
6134A0pj1J0OmpPRj4LJ5j9lMJ3j9lJ6j1j1J2J1k5nJ9rrK6Lj4mlJ1j4J0JJpJ8%
$$ y = [-11, 8, -17, -14, -5, 8, -20, -3, 17, 9, -22, 11, 14, -15, -6, 5, 13, -4, 5, 10, -8, -20, 10, 19, -7, -2, 17, 14, -18, 1, 6, -10, -9, 15, 4, -22, -7, 6, -6, -32, -7, -3, -23, -19, 4, -3, -26, -26, 4, -23, -28, -1, -5, -17, -4, 7, 5, -16, 1, 3, 0, -8, 3, 6, -22, -12, 15, -2, -3, 3, 10, -3, -9, 3, 1, -23, 14, 23, -1, -19, 6, 10, -12, -9, 1, -11, -34, 0, -4, -21, -31, 10, 7, -21, -15, 5, -14, -34, -6, -2, -27, -22, 11, -1, -19, -10, 4, 0, -12, 1, 27, -5, 2, 28, 7, -7, 8, 22, 4, -13, 8, 12, -20, 1, 11, -1, -13, 4, -2, -17, -9, 0, -11, -22, -7, 5, -23, -23, -1, -6, -21, -21, 0, -16, -29, 0, 11, -13, -13, 8, 0, -19, 0, 16, 7, -9, 19, 16, -1, -3, 21, 6, -1, 13, 21, 7, -19, 22, 15, -3, 10, 20, 1, -7, 1, 7, -9, -22, 3, -1, -18, -9, -5, -5, -21, -2, -9, -19, -7, 6, -5, -20, -7, 20, -14, -11, -14, 0, -14, -3, 12, 5, -18, -1, 3, 2, -6, 7, 12, -7, -6, 16, -7, -10, 7, 17, 6, -2, 5, 6, -13, -5, 9, -1, -12, -16, 6, -16, -6, 13, -11, -19, -4, 2, -21, -28, 1, -7, -21, 6, -6, -3, -6, 4, 6, -16, -8, 11, -2, 4, 0, 23, 8, -5, 22, 15, 4, -6, 10, 3, -8, 2, 8, 4, -3, 4, 13, -1, 2, 17, -2, -5, -1, 12, -7, -10, 6, -5, -16, -4, 7, -18, -23, -4, -13, -22, 4, 7, -7, -11, -14, -3, -17, -7, -6, -5, -12, 6, 6]
6174Fj5KK5j4rnK4lk8K3J1k1JJ7Kj6lK1j0l1K5Mk2KJ0Qk5PJ1qJ0Mkj6%J7okPO
6214Gj3pJ6l%%K2k2j2K5Mk2PK1j4j1J1J6j4j3K2Kk1NKjk0K0Pk7QPppONj0JoK0
6254Dj3KQj2lJ2Kj7KJ7j2lJ6Qk0JJ1J3j2j1K6roRJ3qk5K9j2k2kK3kj7J6J1k2j6
6292b1J5Oj9LRkj3ONrLPK0j7j6K6Kj1ONk0QK1j2LJ0j3j1MJ9Lk1PJ7k0j0J0J0j7
6331gnK3rk3K5J4j6k4J6J8k3mJ3%l0K5Rk8NJ7pq%J7lj3J3J4j1rK1j2PpJ1j1rL1
6369B0kk2MJ4j4JjOj5KK0oj6QJ9k2j2OJ2j4kJ0Mj8KK6j7j3K1kk3J6RJj4j0J6j4
6407b0MJ6Pj4jJ9pk0K2OoQlMj7J2Kj3j1K1lj4NMmj0J0Rj4kK0j8j4J4J8j7oJ2J6
6446A5k6JJ2j7oK3lknOJk1K6Rj0j1J2MrLLJj0J5JpqJ9j7j7K0K0l4qK8kk2qJ9n
$$ y = [6, -9, -7, 18, 4, -5, -10, 14, 11, -17, 6, 17, -4, -3, 14, 16, 0, -3, 18, 8, -23, 2, 6, -16, -14, -4, 4, -21, -14, -3, -11, -1, 3, 1, -15, -15, 2, -4, -6, 1, 7, -6, -13, 3, 0, 0, 0, 22, 0, -12, 13, 17, -5, 2, 23, 9, -2, 9, 25, 11, -2, 20, 22, 1, 6, 8, 7, -13, 7, 14, -13, -5, 2, -5, -12, -6, -1, -11, -10, -16, 4, -9, -7, 1, -11, -14, -2, 0, -17, -15, 2, -10, -13, 3, 11, -9, -8, 3, 16, 4, -7, 19, 10, 4, 13, 26, 18, -7, 22, 10, -12, -14, 9, 7, -10, 6, 17, -5, -21, -6, 0, -19, -16, -7, -9, -22, -16, -11, -20, -17, -10, 10, -7, -23, 3, 5, -6, 0, 5, -15, -7, 14, 2, 5, 15, 2, -9, -5, 14, 17, -4, 3, 20, 0, -10, 0, 10, -7, -12, 11, 2, -21, 4, 18, 2, -22, -6, 12, -11, -15, -2, -2, -32, -7, 2, -26, -21, -4, -11, -19, -19, -2, -5, -18, -5, 9, -2, -11, 10, -2, 5, -2, 9, -2, -11, 20, 18, -4, 0, 14, 0, 1, 0, 6, -9, -7, 13, 7, -9, -1, 18, -4, -16, -10, 2, -12, -14, -4, 0, -18, -16, 10, -7, -20, 1, -1, -24, -8, 1, 2, -12, -22, -6, -20, -16, 0, 7, -7, -8, 11, 4, -16, 6, 12, 6, 14, 11, 15, -2, 10, 12, -1, -12, 9, 6, -8, -3, 1, -3, -13, -3, 6, -8, -10, 10, -8, -22, -8, 10, -7, -13, -1, 15, -11, -10, 2, -15, -21, 2, -1, -3, -8, -2, -1, -22, 4, 13, 3, -8, 4, 8, -1, 2, 5, 6, -4, 11, 12, 5, -3, 16, -1, -18, 2, 22, -12, -20, 8, 6, -16, -24, -5, -10]
6486a0k1J7J0Pk7J5K5l7RJ1J5k8J4Kj3OJ1Kk1J0K0j4j0MJ4Nj0Pkj7J6Lj2jMNm
6523ErJ4Jj3LJ2k5j0J5J3j9%J6j2k1J6J2qj1J4%MpJ6qk7K4RrmJ3KqLOkkJ1qj3
6563gJ6KqpJ3kj1PPKj4OJpLLKk2ONmpJ0Ok1NQRj9OJ1%k8J4J9pqJ1NqMJ0kk4K2
6608GKqkJ7nk0J1J5j5j0J1nkJ2kqj2J3mnJ2mj1JKJ2j4JJ7j5Mj1J9jj9QJ5pj3K1
6648Gmj6OJ0J9k9J4Noj2J7%j0rJ1JmOPj5oQjj9J5Pj4j3K2opJ0OJj8J6Rqj5RNm
6690ej3L0qj0J5Jj5j0K0j1JKK5j8JKjj8J1%J3rqOlpJ0jrkQj4%K0pj4OJ3j3j2J6
6731hQnqJ2knMJ2j4j2J7LlqJ8lj1J6j0MmOJ3j9JMJj7PJ7ppLKmj2Rjj1OJ2j2pJ3
6775bkqlPnJJ4Lk2NJ4j3J1nLMpJ0oJKJ0jkOnlLJKk5OL2k6kRonNJ1lj5jNrLOMj0
$$ y = [-10, -31, -14, -4, 3, -24, -9, 16, -21, -12, -1, 14, -14, 0, 2, -11, -5, 6, 8, -13, -3, 17, 3, -7, -3, 11, 16, 6, 13, 11, -6, 10, 13, 1, 0, 4, 9, 5, -4, 10, 11, -2, 1, 13, -12, -22, -7, 6, -13, -13, 3, -9, -30, -14, -2, -10, -21, -7, -7, -3, -10, 6, -2, -29, -5, 4, -5, -9, 4, 6, -2, 1, 7, 5, 3, 14, 6, -7, 9, 11, 3, -4, 9, 7, -4, 3, 10, 12, -2, 4, 5, -2, 1, 4, 6, -16, -10, -5, -9, -16, -6, 0, -21, -16, -8, 1, -18, -12, -1, -1, -29, -15, 4, -3, -11, 0, 5, -3, 1, 11, 9, -15, 7, 9, 1, -1, 16, 11, -9, 2, 17, 2, -8, 3, -2, -4, 8, 6, -2, -14, -1, -5, -10, 2, -2, -13, -12, -10, 2, -12, -11, 6, -9, -5, -16, 3, 2, -17, -9, 6, -1, -14, 7, 3, -13, -7, 3, 22, -7, 7, 12, 6, -6, 11, 11, 1, -8, 3, 4, 0, 6, 13, -2, -8, 0, -1, -20, -5, 2, -12, -25, -3, -9, -16, -6, 0, 1, -17, -1, 8, 0, -15, -6, -1, -5, -18, 12, 4, -6, 9, 10, -5, -15, 5, -6, -5, -3, 22, 4, 5, 7, 6, -12, -1, -1, 12, 3, -5, 1, -2, -9, 1, 0, -9, -11, -3, -17, -17, 3, -4, -18, -12, 1, -12, -24, -8, 0, -5, -13, -1, -3, -8, -4, 8, -6, -18, -1, 2, -1, -9, 9, 6, -5, 11, 1, 5, 1, 7, 20, 1, 2, 6, 7, -10, -3, 14, 7, 0, 3, 5, 1, -11, -2, -3, -14, -8, 4, -8, -15, -2, -4, -12, -15, -8, -13, -12, 2, 5, -17, -12, 2, -11, 0, -5, -2, 2, -5, 5, -1, 0, 2, 12, 11, 9, 15, 10, 7, 10, 11, 13, -12, -6, 26, 0, -2, 7, 1, -4, 1, 12, 9, -6, -7, -2, -11, -8, -2, 2, -8]
6824hnJ2npOPnkKrNQKjjQmnJ6oOk0RJ1k2K3qkjLJ1k3KoRj3J0mJ7j3MOj7Oo%m%
6872a4J3j1MOqJj8K1Jj1J6Pj9oJ5MrNJ8j3j3J0LJ0lOMk2jJ6jj6J0p%%kNj5LPj
6914ej1J1Lk6J6QKoJJ0rkJ6Oj6jLmpJ4mQq%QqJ5nnj2J9Rk7jJ7jrOj0OoOKojPj4
6961a1qJ8lnJnlrJ2NmlMOj0J2LLj7PLkkJ4%k0J4Onj4J5J3mj2Pj5KMJ3jj4J0kj
7005Bj2MOj4MJ0mj7OLj4J7Rj6JLJ2rlL%nJ0J0j2ROlj5NJ1%qLOqNLqnlJ3rjJKk
7052dkKkmlPJj3J0J3j5kJ0j4onJ7rJJ4%JNPj4nJ8Lj2JJ5j4OjJ0rjlLlj5QjOnJ1
7098Gj6jJ6j1npJ3j2NLPj1oQLj4NRo%RlkQNMj7J2jj2lK0jrJ1Lj0OkMj0OlkrPK
7145@knJ3rj6J3Qq%KkqnJ3Poj2J1%JMRk4J3J8rrmMJkJ3Mj7KPmMLMj3%J7mppJ5
$$ y = [-8, -13, -1, -6, -13, -7, 0, -5, -7, -5, -14, -9, -1, 1, 0, -1, 7, 3, -2, 14, 8, 14, -6, 3, 14, -8, 15, 7, 5, 4, 7, 18, -5, -3, -9, 0, -13, -3, -7, 10, -3, 1, 7, -10, -4, -10, -10, -14, -14, -1, -12, -8, -2, -10, -9, -27, -6, -5, -16, 0, 7, -12, -18, -3, 1, -8, -3, 15, 2, -11, -1, 2, 12, 9, 15, 19, -3, -4, 12, 11, -5, 5, -2, -2, -2, -4, 1, -14, -11, -4, -5, -16, -5, -2, -28, -12, -4, -2, -8, -7, 3, -6, -8, 8, 14, -2, -3, 0, -4, -11, 3, -1, 7, -1, -1, 7, -1, 14, 9, 4, -8, 11, 20, -7, -8, 9, 8, -1, 5, -5, 1, -5, 1, 3, -3, -4, 3, -11, -19, -1, -4, -9, -8, -13, -16, -25, -13, -8, -12, -15, -11, -5, -15, -3, 0, 3, -14, -7, -4, -6, -8, 6, 6, -14, 0, 6, 1, -13, 2, 15, 11, -1, 6, -9, -7, -3, 10, 9, -5, 5, 3, 2, -10, -6, 0, -14, -10, 0, -4, -21, -15, -12, -26, -9, 0, -16, -15, -12, 0, -9, -12, -9, -9, -14, -4, 6, -6, 3, 9, 6, -9, -4, 7, 7, -1, 2, 8, 0, 5, 8, 0, -5, -8, 5, -4, -5, -4, -2, -4, -6, -4, -6, -10, -13, -6, -5, -18, -8, 5, -10, -12, -2, -16, -22, -27, -10, -19, -18, -4, -4, -3, 2, 9, -5, -10, 8, 11, -1, 0, 15, 1, 7, 6, 16, 7, 6, 3, 6, 3, -12, -4, -5, 1, -4, 7, -9, -10, 6, -5, -10, -17, -4, -16, -11, -8, -1, -12, -18, -10, -7, -21, -16, -7, -13, -13, -4, -7, -9, -1, 4, 8, -9, 3, 2, -10, -13, 7, 6, -3, 8, 11, 1, 7, 5, 9, -1, 5, 2, 0, -9, -2, 0, -2, -7, 6, -3, -19, -6, 2, -6, -6, -4, -6, -14, -19, -6, 1, -5, -17, -6, -6, -5, -1, 8, -16, -3, 15, 6, -3, -7, -3, -2, -4, 9, 13, -4, -2, 5, 1, 5, 8, 12, -1, -1, 16, 12, 5, -2, 13]
7192A3oj2LJklJ1qoKLJj0LkKLjNrJ5klKQqj0PPkjJPlJJ2j5qLJ1j0KLPj2J1p%j8
7241a4J8knmORk0J2mj0jJ7j1%LKj7j0J6K8k2qJ8mmJ8m%mk%lj1K3%j0PQk4RJ2j0
7283BqJ3%j1oMJ1q%k%nmRll%Lj8J7J7k4KOmLJJ3j0%KMLrmMKNQKj4JKpPKK%j0J3
7333Hpkjjj1JJKJJMMpjPrKLlkMNjj2POpjQMrNPj4MJ9qkMKmoQPj4KJ2mk5J1qKj0
7386a8RJ0j7PmOlJjpkRj3J6j1J5j1NnJ6rPLJrJ0joLJOj3J0LlPj1KnmRjPk1K0n
7432Cj0JlPj4KRmJlL%jMj0kJKmJ4kjL%J6j5MQmqJNjqPMrO%JqJ9j2jOKJj7%JlJ0
7484ArQqKLqPrnNK%j2QoRnJJ2LpOOKmLjpJ%J5j7ROj2klJM%rlJPoJMpJ1qLLnQj1
7539a2Rj4lkK0j2%J0jj1RoMLLOlll%J1jKj0K0ppqKJ3kj0NLppMmOj0RprJ4lomJ4
$$ y = [13, 7, -5, -2, -1, -3, -6, 5, -3, -9, -7, -4, -3, -13, -10, -12, -10, -7, -8, -3, -12, 3, 1, -2, 0, 8, 0, -10, -3, 4, 2, 1, 2, 9, 6, 7, 19, 4, -4, -1, 10, 0, 2, 5, 12, 0, 11, 4, 4, -14, 4, 2, -3, -7, -1, 8, -12, 0, -4, -14, -15, 2, -9, -9, -6, -4, -21, -31, -15, 13, -9, -17, 1, -3, -7, 11, 7, 7, 3, 1, 1, -2, -13, 10, 10, 0, 7, 15, -9, 0, 12, 2, -6, 7, 7, -4, -10, -6, 5, -3, -3, -5, -5, -10, -14, -5, -8, -11, -11, -8, -26, -9, 8, -16, -14, -8, -12, -9, -8, 5, -5, -5, -3, 1, 4, -5, -9, -5, -3, 2, 10, 12, -2, -1, 1, -6, 1, 3, 5, 5, -5, 8, 1, -1, -2, -3, -14, -13, -12, -10, -9, -8, -4, 0, -7, -8, -1, -10, -8, -5, -8, -10, -6, -1, -2, -14, -7, -1, -8, -9, -1, 3, -6, -1, 6, -8, -4, 15, 7, 5, 9, 11, 7, 1, 9, 16, 2, 4, 16, 12, -13, -2, -10, -8, -18, -9, 1, -16, -9, -13, -7, -10, -9, -10, -17, -19, -10, -23, -7, -18, -3, -14, -9, -14, 2, -7, 0, 3, 4, -5, 5, 4, -2, 1, 2, 8, -5, 5, 8, 5, 12, 1, 3, -2, -6, 3, 2, 9, -12, 8, 3, -7, -6, -9, -2, -16, -14, -5, -9, -8, -11, -8, -8, -9, -5, -15, -17, -16, -14, -18, -4, -6, -7, -4, -4, 12, -3, 1, 9, 5, -3, -2, 3, 2, -6, 1, 5, -4, 2, 2, 3, -5, 14, 2, 1, 7, 9, 10, -7, -7, -6, -9, 1, -8, 0, -8, -6, -3, -11, -4, -13, -18, -13, -11, -11, -23, -15, -21, -12, -17, -16, -4, -1, -8, -2, 4, 6, 2, 5, 4, -3, -2, -2, 13, -4, 5, 11, -1, -3, -6, -5, -1, -1, -10, -13, -12, -5, -11, -10, -6, -13, -2, -10, -7, -4, -9, -1, -12, -3, -17, -20, -22, -2, -14, -14, -4, -5, -16, -7, -13, -9, -6, -3, 3, 0, -3, -6, -6, 5, 4, 6, -4, 16, 9, 2, -6, -4, 9, 7, -3, 2, 5, -2, -9, -5, -9, -3, -13, -4, -11, -20, -6, -9, -15, -19, -5]
7587erRpJ6kqMpqJ4%oJ4j4J1nk%mLJ9omj0J2koMNj4J1J5k4J2pMLk3K0j1nJ3p%
7631gj1J4kPk6K2qNjkJQmN%knN%LQrqJ0RqjoMPJkljJ0rLlJlqnMrLJ0Lj2J4j1K
7682gj5J4JjnJ0Mj1mJ1jJJ7j2mKNMoNnrMMOj0RJj0QkoJ2k2J8kj7J0lloMJ8j4m
7727a1Qk3J7Nj0mmJ3kmJJ0p%LNpJ6oNj0JJ7j4J3KjqK%JpNkJj6OJKJj4Rj5J4j%
7773hj0J0Pj2RoOLljj2OJ7j5RNNj2nKONKMomPJopJ6rmRJ2j7qJ7j0llkklLkmM%
7822iRrKlJjrJ2J3j3%Op%JJJ0n%qJ7j2J7rKJ2k7J5mJ2j4%MrJ3r%kK%Ok9J3pmJ1
7868a1lnoPQOqJmJLRlj2OOL%J5jj2JJjMJQk2J3%JlmKnJ1lrJ1j6J7rjmkkJ4qj1
7917a6PoPqkLMOOk1J4%KJ3j4nJ4j0jMMQj5RJ4j7nJ6j3M%Pj0qLLoJOqJ2nlm%Lj0
$$ y = [-5, -14, -5, -12, 4, 2, -6, -2, -9, -17, -3, -3, -9, 5, -9, 2, -3, -5, -5, -9, -6, 13, 7, 3, -7, 5, 3, -3, 1, 6, -8, 3, 18, -6, 6, -1, 3, 6, -17, 3, -8, -13, 0, -7, -7, -18, -4, -6, 1, -25, -3, -11, -6, -7, -9, -8, 0, -4, 1, 1, -1, -6, -1, -1, 2, 10, 1, -7, 3, 12, 4, 3, -3, 1, 8, 9, 7, 4, 3, 13, 4, 7, 4, 5, 2, -6, -11, -7, -16, -13, -3, 0, -12, 2, -9, -7, -22, -8, -7, -8, -13, -3, 1, -10, -14, -3, -4, -3, 14, 2, -2, 0, 5, 9, 3, 8, 3, -6, -2, 2, 8, -2, 7, 8, -2, 6, 4, -2, 10, -12, 6, 4, -13, -3, -6, -9, -15, -11, 7, -7, -11, -3, -26, -9, -4, -14, -18, -22, -9, -11, -15, -14, -4, -11, -11, -8, -3, -10, 6, 0, 5, -5, -4, 13, -1, 12, 14, 13, 5, 7, 7, 8, 1, 6, 4, 5, -11, -5, -4, -2, -1, -15, -6, -21, -7, -8, -8, -18, -8, -1, -13, -4, -10, -4, -1, -4, -5, -17, -11, 6, -9, 0, 5, 10, -2, -7, -5, 1, 6, 8, 12, 6, 2, 9, 10, 4, -3, 13, 4, 0, 9, 21, 4, -4, 13, 3, 0, -3, -5, -7, -10, -7, -9, -13, -9, -9, 0, -9, -7, -10, -9, -10, -19, -7, 6, -7, -7, -1, -8, -8, -7, -6, 4, -1, -1, -9, 8, -4, 13, 4, 6, 18, -9, 6, 2, 14, 0, 0, 4, -5, 8, -1, -1, -3, -1, -1, 5, -24, -11, -18, -22, -11, -14, -19, -25, -18, -10, -4, -12, -11, -15, -14, -11, -2, -5, -17, -11, -5, -2, -2, 13, 12, 0, 1, 2, 1, 5, 6, 14, -8, 5, 5, 6, 3, -1, 1, -4, 7, 4, -5, 6, -10, 7, -2, -3, -7, -9, -11, 3, -5, -16, -9, -15, -8, -16, -18, -15, -11, -5, 1, -20, -6, -6, -4, 9, -5, -10, 4, -6, -7, -3, 1, 9, -6, 3, 17, 0, -5, 11, -2, 2, 2, 9, -1, -9, -6, -3, -9, -8, -2, -10, 2, -3, -6, -10, -10, -7, -17]
7964a7M%J0qJ0rJ1k0OJ1pNjJrOjKMRkkjlJKJ0o%mPqJPj2QmmPoKPj6RrLj5OlPJ5
8015Dk2RRokJlJ1k0J7mlJJ0qmkJ8jjJJoJ3npNlNLj0kJ5j5kNNpOj1JlK%j3mJ1P
8063dnllnRLKJJkOj3LJ2mNRqqRnLnQo%KpNmOJlnMjqRljrNmKLo%n%RmoPPj3J2m
8120a1jQNoJ0j0NlPkNRj1nNl%J0j0j1Q%mQj0KPnLKj3JmLmJNljJK%MmoJ5j9K2k1
8169a9J1OlL%lKJ4j1k%JoNLMJpoJ2qj
$$ y = [-17, -13, -13, -3, -11, -1, -10, 1, -19, -13, -2, -9, -4, -5, -4, -13, -7, -8, -6, -2, 7, 5, 3, 2, -1, 0, 2, 12, 6, 6, 2, 9, 1, 2, 9, -3, 5, 1, -3, 4, -2, 0, 7, -9, 0, -9, -6, -21, -15, -18, -11, 4, -18, -9, 0, -6, -8, -7, -10, 1, -19, -2, -6, -9, -8, 2, -6, -10, -12, 6, 5, 4, 5, 6, 0, 13, 8, 1, 6, 3, 8, 11, 1, -1, 14, -1, -3, 2, 7, 0, 6, -5, -4, -7, -5, -5, -18, -22, -11, -4, -9, -12, -15, -20, -11, -8, -6, -5, -4, -6, 0, -13, -10, 2, -2, 3, 12, 4, -4, 5, 0, 3, -2, 6, 0, 0, 2, -5, 0, -4, 2, 3, 0, -5, -1, -2, -10, -1, -4, -5, -14, -9, -13, -11, -8, -14, -14, -19, -19, -10, -14, -20, -13, -6, -19, -7, -11, -12, -4, 1, -5, 5, -5, 0, -3, 4, 2, 7, 16, 5, 0, 5, 2, 2, 12, 2, -9, -1, -1, -5, 3, -7, -5, 2, -3, 0, 2, -11, -10, -14, -11, -15, -14, -9, -12, -13, -12, -10, -10, -6, -10, -16, -1, -20, 2, -19, -8, -2, -5, -2, -2, -5, -3, 11, 0, -2, -2, -1, -7, -2, 1, 5, 6, -1, -7, 5, -3, -4]
8191d
$$ Imaginary data points
##PAGE= N=2
##DATA TABLE= (X++(I..I)), XYDATA
0@%%%%%%%%%%%%%%%%JrJ6j6J6j6J7k5L2l3M1m8N6o5P3q5R4j06J22j38J54j71J93
39A03k16K41k70L00l32L66m05M47m93N46o01O60p27Q02q84R76j080J197j330J483
59G83j663J875k131K445k843L373m111N206p038J0825l1187O3020L1334j31571
73f1683J1581J13643k3179j10823M7372R0451n5649p6625O6468N4614o5049l9177
85d8056O3338K1772n3069j2144M3220M222k9278m052J8107O648p195j5058J314
98a0231K4928J422l7235J725M8288q782n8071K0628O3914l4921o5766N1175O2321
111E9395o7064n4137Q1503M1205r2628k4927R9581O293j01485J2901R8271l1243
123B7665r0103M7074P7921n9271o2796O6972M6276o9802k9831O7935J4959o1988
$$ y = [0, 0, 0, 0, 0, 0, 0, 0, 0, 0, 0, 0, 0, 0, 0, 0, 0, 1, -8, 8, -8, 8, -8, 9, -16, 16, -17, 24, -24, 32, -33, 40, -45, 49, -57, 65, -73, 81, -90, 103, -113, 128, -142, 158, -174, 192, -213, 234, -259, 287, -314, 346, -381, 421, -463, 513, -567, 630, -700, 783, -880, 995, -1136, 1309, -1534, 1839, -2272, 2934, -4104, 6721, -24466, 38554, 69888, -61683, -50102, 63541, 40362, -70461, -23089, 67362, 11713, -64912, 1556, 56170, -8879, -48056, 15282, 37054, -16015, -28159, 15061, 19283, -9995, -14047, 4060, 10708, 3513, -11545, -10231, 14697, 16119, -21116, -19391, 28897, 20115, -37956, -17328, 46586, 11665, -54101, -2926, 59395, -7669, -61806, 19697, 60902, -31726, -56653, 42928, 49221, -52264, -39363, 58908, 27665, -62438, -15364, 62557, 3286, -59510, 7462, 53738, -16064, -45895, 22040, 36999, -24989]
135b4989k891N2975n480m2229R694L1108r816k1034O261J3193K7q465p948P341
149b253J6227r806k3621J5593K8994k3854l1488L3715L0590m3944k6177N3407
161A7383J8479o1034q119O5930m076o7561J7028O5636k9690o0296M0953N1997
173D6630n0009m1386N6121K9447n8935j7149N8450N558n4911M464M8916j2200
185A4996m1236J7193L2780j9321k4480J8673J7258j5809j1785J1320Q514o053
197B050p670Q28R183L532j2616o365J7478P254k3018n899K8471K403l3096K967
211a4498L6277r735l7555J7259L6621k4846l3571L1799K8530l7540k1931M1571
223A2381J4286m3600o233M3587j600m1587Q667L7930j4470l3022J8737K7350k1236
$$ y = [-24989, -27880, 25095, 19615, -22614, -12920, 18188, 8372, -12662, -6401, 6792, 6819, -1646, -9594, -2253, 13974, 4168, -19453, -3860, 25134, 1280, -30208, 3507, 34097, -9847, -36024, 17383, 35862, -25172, -33291, 32639, 28563, -38998, -21970, 43666, 13976, -46320, -5367, 46630, -3379, -44765, 11356, 40803, -18132, -35281, 23169, 28727, -26184, -21720, 27196, 14996, -26240, -9047, 23733, 4412, -20068, -1395, 15863, 54, -11731, -411, 8103, 2050, -5620, -4792, 4391, 7923, -4693, -11058, 6420, 13674, -9344, -15243, 13228, 15631, -17465, -14498, 21779, 12044, -25511, -8252, 28369, 3523, -30048, 1751, 30281, -7259, -29190, 12381, 26667, -16933, -23166, 20421, 18821, -22766, -14099, 23831, 9361, -23661, -4924, 22426, 1190]
236A190k1504K2020J5995k1301j1270J9341P664j6602n396J3527M473j0579m839
249g281Q232O199o733q203O341J0509p105j2644Q962J4259j1704j5020J5042J4713
263A5567j8643j3269K2066J0725k5016p281K7181L111k8353J447K8397o008k7365
276a7441J0343K5318j4076k2448J7062J9026j9141j5297K0255J1566k0469q088
288a3390J9892N067j8732k666J7178Q92j5441J76J3767o66j2310O57J1254l10
302E368j0637j47J0517O09j0844q51J1523P97j2480l01J3497o43j4476K002J5215
317I149l769j5623N796J5586p969j5062J0146J4050j2176j2577J3955J0723j5351
330c122q563J6315O247j6793l905J6801J654j6383L97J5593k184j4541L627J3313
$$ y = [1190, -20314, 1706, 17701, -3600, -14870, 4471, 12135, -4467, -9863, 3664, 8137, -2442, -7281, 951, 7150, 417, -7786, -1445, 9064, 1959, -10685, -1723, 12536, 832, -14188, 854, 15567, -3076, -16345, 5721, 16446, -8570, -15851, 11330, 14441, -13912, -12465, 15932, 9924, -17441, -7098, 18220, 4144, -18304, -1242, 17784, -1357, -16654, 3601, 15167, -5302, -13390, 6502, 11569, -7163, -9829, 7349, 8241, -7200, -7024, 6743, 6077, -6233, -5576, 5678, 5368, -5269, -5416, 5101, 5710, -5134, -5985, 5538, 6335, -6145, -6446, 7051, 6408, -8068, -6066, 9149, 5380, -10243, -4447, 11139, 3170, -11892, -1746, 12304, 128, -12449, 1506, 12229, -3122, -11685, 4630, 10877, -5916, -9821, 6980, 8634, -7749, -7352, 8241, 6057, -8484, -4857, 8456]
344H456m724j2021N475J0775n923r615O105Q669o117p900O040P385n961p050N940
359d66O897o047o858O303O841o775o820P406O671q201o352R073N858j0016n087
374g573J0923M065j1695k819J2309J379j2633J88J2685j825j2387L381J1816m852
388B962j0960O120R836p107q623P832P317q248o012Q365M845q249l802P962K980
403E218p552k402P138K048o804j861O553J800o487j812O618J787o924j679P379
418C020J388p923r03Q473J79q961P56R338j899r460L171R333m483q896N780Q155
434G068o940p140P882N896q560m522Q900L110q902j776Q602N85q025L80P284j049
450B793o469J413N683j474n014J317M537r96m321N99M388k69m731R1N260j70n906
$$ y = [8456, 3732, -8289, -2814, 7961, 2038, -7577, -1472, 7197, 1080, -6820, -780, 6605, 644, -6406, -466, 6431, 384, -6474, -171, 6670, -105, -6925, 481, 7152, -1049, -7401, 1672, 7530, -2486, -7573, 3350, 7415, -4280, -7099, 5210, 6589, -6044, -5856, 6829, 5004, -7383, -4002, 7814, 2962, -7998, -1878, 7958, 851, -7772, 60, 7377, -871, -6883, 1482, 6327, -1922, -5724, 2238, 5218, -2334, -4736, 2402, 4450, -2354, -4215, 2338, 4138, -2349, -4161, 2457, 4244, -2680, -4359, 3020, 4408, -3515, -4418, 4055, 4234, -4727, -3971, 5367, 3468, -5992, -2821, 6512, 2029, -6867, -1087, 7068, 128, -7012, 870, 6766, -1794, -6316, 2584, 5694, -3208, -4984, 3618, 4203, -3822, -3442, 3842, 2793, -3676, -2263, 3420, 1946, -3068, -1751, 2786, 1790, -2531, -1932, 2456, 2187, -2544, -2453, 2807, 2637, -3269]
467c269N16O562j171p147K131P511l296p604M642P343n980o699P265N687q321
482a830m376R078K842r468j213R425l97q990J871Q166l068p076L922N788m335
497C39m514M394L305m032k314L378J647k519j376J624J508q22k012K21K815%l791
514b149J60M802p68n692J782O282l070o526M582O305o118n619P568M491q749k927
530e646R508J137r800P66R569k624q827M237P636n526o107O323M421o619k692
545d244O400J129n726J45M687r98l408J391K038j236q13O54k00L38P93j582r05
562a537K912M62m115M27N069j756n592L354N585n025n082O676M006q030k464Q999
578C889N96r400J449R216l474q453N306P139o749n423P648L461p980j440P678
$$ y = [-3269, -2753, 3809, 2638, -4509, -2378, 5133, 1837, -5767, -1125, 6218, 238, -6461, 804, 6491, -1830, -6206, 2872, 5714, -3754, -4967, 4458, 4061, -4929, -3058, 5108, 2040, -5036, -1114, 4674, 339, -4175, 219, 3524, -508, -2822, 556, 2203, -316, -1692, -68, 1440, 618, -1394, -1173, 1642, 1642, -2149, -1989, 2813, 2045, -3647, -1865, 4417, 1347, -5179, -597, 5708, -410, -6029, 1539, 6030, -2719, -5646, 3862, 4999, -4801, -4035, 5534, 2910, -5917, -1680, 5956, 430, -5677, 646, 5067, -1552, -4244, 2156, 3285, -2441, -2296, 2391, 1393, -2015, -624, 1414, 178, -635, 19, -181, 157, 950, -632, -1537, 1375, 1837, -2278, -1851, 3218, 1462, -4130, -776, 4809, -216, -5298, 1378, 5384, -2646, -5110, 3889, 4485, -4915, -3466, 5750, 2276, -6177, -871, 6268, -481, -5904, 1744, 5205, -2775, -4215, 3463]
593C463m08o839J939N580l025m026L560K350l499p50K897n70j843J473M61j869
609a106J065J652k489r40L685k56m485J778M769l475m473N137L602o540k253P607
625C278N37q171J420Q158l405p527N241O345o741m731P769K789q205p48Q035j228
641B816p267K898O018m153m439M895K666n022r05M571o48l605J819K270k483p28
657a297K571p92k125K151J154l172J80L702j731l699L301L156m746k087N869O16
673C051o498J090O640k876o221M573N289o006l892P020K210p555l66P538j469
688B528o978L099N948m425m536N264K928n629j235N424l22m740J630L645k502
703I9k310K931Q47k830N29K214j648j221K406n3k705J422K498k756j804L856P42
$$ y = [3463, 3055, -3784, -1845, 3735, 710, -3316, 244, 2594, -905, -1655, 1242, 672, -1171, 302, 763, -1106, -41, 1611, -878, -1818, 1867, 1611, -2874, -1096, 3673, 198, -4275, 862, 4464, -2076, -4329, 3278, 3815, -4356, -2936, 5222, 1817, -5710, -469, 5876, -865, -5596, 2173, 4962, -3243, -3991, 4044, 2816, -4451, -1553, 4465, 312, -4127, 768, 3434, -1588, -2493, 2078, 1430, -2175, -356, 1914, -569, -1297, 1274, 482, -1643, 508, 1662, -1510, -1330, 2372, 641, -3058, 243, 3399, -1347, -3434, 2435, 3051, -3447, -2357, 4283, 1407, -4814, -241, 5048, -958, -4850, 2170, 4380, -3175, -3541, 3997, 2528, -4450, -1351, 4597, 172, -4364, 900, 3828, -1801, -3036, 2388, 2066, -2674, -1044, 2601, 99, -2211, 720, 1567, -1263, -734, 1480, -168, -1389, 1017, 964, -1741, -319, 2179, -577, -2381, 1475, 2217]
720B217m615O27M939k112m783L613M132m901l067N888J684o470j31O597j469o247
736d098K945N456m166m357N063K983n528j533N565J02n141J134M376k098l333
751b630K700K152k888r48K655j47k046R72J166j466j33J583r51j294J918O45k667
768a379K92L117j412l173K582K830l636k136M532J134n113O3N332j346n179K581
784i11M666l672l813M487K753n026j553N174L40m972P65M461j681l681K314K776
800B427k648j805K659Q91k394r6J858m59j169P52L79p44L66M68j011N8J467p45
818B54j676J551J589k341j215L035O04l545J99L823j106l821K033L539k876l039
834b992L619K264m119j377M347M40m340M79M064j287l578J941K906k361k141K549
$$ y = [2217, -2398, -1771, 3168, 1056, -3727, -114, 4018, -883, -3950, 1938, 3622, -2848, -2979, 3618, 2149, -4098, -1153, 4303, 137, -4220, 843, 3826, -1702, -3235, 2330, 2432, -2709, -1575, 2801, 703, -2630, 70, 2222, -666, -1614, 1041, 894, -1152, -180, 986, -480, -613, 970, 19, -1275, 643, 1288, -1379, -1087, 2030, 618, -2555, 27, 2857, -779, -2915, 1617, 2751, -2362, -2299, 3033, 1687, -3492, -911, 3755, 83, -3730, 757, 3510, -1516, -3069, 2105, 2445, -2527, -1762, 2699, 1018, -2663, -349, 2427, -221, -2026, 633, 1524, -870, -966, 892, 433, -736, 16, 395, -349, 17, 485, -526, -468, 999, 254, -1422, 129, 1718, -623, -1838, 1197, 1801, -1744, -1545, 2278, 1172, -2649, -616, 2923, 47, -2992, 627, 2891, -1228, -2605, 1742, 2182, -2158, -1679, 2385, 1098, -2480, -539, 2367, 6, -2135, 414]
850D14J389k491p02K217J53j795K33J272m35p16M05J77j58K17k07m78P03N50j221
869d73m35J726J07k113L68K366r31k441J561K344k182k049K730J566l154r72L419
886A437K84l512M12L393j082l105J666K662k093k104K352J515k445r17K365L93
902A221k148L0J820l40j396M54J001m55o23L12L04k9j27k76O7O37j88r40M03J211
922I38p41j339J140J335j568j186J978R31k340n48K591N4k720M56K712r98k543
939a848J475K251j891j855K197J407k383q95K416M04k329N8K119m20j818O69J467
956A024q05j088Q11P42p00m73M88K95k28k08n4K63K97m17n01O70O15r77o08J315
976D61M95j647k52J897r0k057N03K107r42k055J382J866j800j562K111J167k336
$$ y = [414, 1803, -688, -1390, 827, 980, -815, -582, 690, 255, -461, -56, 121, -37, 180, -27, -505, 198, 748, -473, -908, 818, 925, -1188, -820, 1546, 615, -1826, -265, 2079, -103, -2152, 578, 2144, -1010, -1982, 1437, 1721, -1791, -1379, 2014, 932, -2173, -507, 2155, 62, -2042, 310, 1825, -620, -1537, 828, 1221, -927, -897, 923, 583, -813, -359, 642, 187, -436, -124, 180, 151, 24, -252, -185, 452, 264, -676, -273, 938, 197, -1142, -2, 1333, -235, -1421, 557, 1488, -852, -1400, 1191, 1245, -1475, -1019, 1693, 695, -1848, -373, 1878, -13, -1868, 329, 1736, -647, -1542, 874, 1278, -1051, -993, 1126, 706, -1112, -443, 1024, 219, -869, -58, 684, -16, -489, -1, 294, 66, -142, -196, 67, 364, -53, -554, 116, 731, -246, -854, 461, 956, -691, -943, 954, 864, -1193, -690, 1417, 475, -1580, -198, 1668, -132, -1694, 417, 1584, -752]
993g52o94K436K16k410K54K256o70j989J000J651j204j269J293Q79j273n14J137
1010C47K23r12k9O46q5l17L2N3J07J68l37k99O39L18r68k07J280k3j527L67J649
1031A125p58j690J177J578j604j339J971R90k254n25K397L1k413M63K303r37k048
1048a533J332J696j643j226J774P73j779l27J666r0j405L72J108n76p08O09L21
1065C64n20J3L16k58j2L92l34l93P12K35j040L9J283m27j394Q44J385j299j218
1084a312J727Q92k071m66K290m0k366O03K265j132k012J579J648j962j117K143
1100F69N76k167m0K046m59j757Q47J390j144q93J228M12j170L1R56l94o08O25
1118A48J97p09K59O36o71m22J027M1j230L91J305q93j221J375R51j780n51K066
$$ y = [-752, -1446, 990, 1206, -1204, -950, 1306, 636, -1353, -353, 1298, 94, -1175, 118, 997, -276, -790, 347, 570, -342, -371, 275, 190, -127, -95, -42, 65, 233, -104, -403, 236, 554, -414, -621, 659, 636, -891, -524, 1125, 367, -1323, -146, 1432, -172, -1511, 460, 1450, -804, -1329, 1068, 1099, -1314, -851, 1452, 515, -1533, -201, 1495, -148, -1374, 400, 1173, -606, -933, 733, 643, -762, -390, 718, 142, -566, 43, 364, -156, -143, 173, -85, -97, 295, -39, -432, 280, 515, -525, -486, 797, 370, -1024, -180, 1205, -94, -1312, 415, 1307, -764, -1230, 1060, 1020, -1346, -743, 1522, 390, -1622, -43, 1605, -357, -1474, 669, 1245, -922, -962, 1084, 625, -1132, -285, 1105, -39, -932, 296, 708, -462, -431, 525, 131, -477, 148, 345, -364, -105, 531, -140, -562, 465, 506, -724, -333, 972, 79, -1142, 233, 1184, -596, -1147, 919]
1136I19M3k212N26K180j096j970J621J599k038j081K292M94k369J22K274o95j996
1153a387J178J568j512j036J682M61j673J02J463n60j108Q99O35j079j20J064
1169E77l76q86Q32N39j174n3J327m85j292J004J080j476p22J842K03k032L78K042
1187A328r66j875J517J520j951j049K272M55k377J63K332p79k065J304J652j690
1203b09j120J921N12j951P8J789o27j449J031J004j307m40J363j11j247O20R47
1220H04j036m94J282k4j351N70J237j103r28J528M70j801Q8J873o64j793J243
1237i9J492j725j052K073N11k243J05K235p12k038J277J660j694j147J958N72
1253A173k052K3J941n73j680J039J241j329p60J506J93j471L48J254q14q60J122
$$ y = [919, 962, -1250, -724, 1456, 360, -1610, 11, 1610, -428, -1509, 783, 1277, -1092, -970, 1304, 609, -1387, -209, 1359, -153, -1189, 493, 954, -719, -617, 846, 286, -822, 77, 712, -367, -487, 577, 201, -685, 147, 686, -488, -541, 786, 301, -991, 13, 1093, -383, -1105, 737, 940, -1092, -714, 1328, 362, -1513, 4, 1524, -427, -1476, 796, 1251, -1126, -963, 1369, 590, -1475, -171, 1481, -209, -1329, 592, 1104, -847, -769, 1020, 393, -1056, -25, 979, -328, -768, 595, 484, -763, -143, 804, -232, -726, 556, 532, -819, -249, 988, -115, -1043, 485, 955, -846, -758, 1115, 451, -1342, -99, 1393, -332, -1384, 689, 1200, -1043, -938, 1297, 585, -1453, -176, 1484, -210, -1357, 601, 1173, -879, -856, 1085, 512, -1168, -129, 1112, -217, -977, 529, 722, -749, -401, 853, 39, -821, 301]
1270C01L90j267J24J249o47j045J086O96j430k17J615l47j597Q88J386j360j035
1287a210J736N47j955QK009n94j853J119J549j545j099J842N82j977j5J930n35
1304E39j686R86J324j338q68J526L48j536J57J378n93j097R43P03j153k38J198
1321E93k44j075O69Q21j013m52J220J7j286M53J205r16r55J276N89j514j43J630
1339H75l55j580Q35J374j258j015J567N75j709j00J730l93j588Q37J304j185r32
1356a018J410M90j506kJ412m20j206P70Q83j008n12J126Q5j092L20R26o53o60
1374f55R03L03j015Q8R86m60q55P85O17j057k54J183j22j189N06J082q76q42J164
1393B92N25j345j33J405k72j334O49J141r63q73J223M98j326j23J322k59j209
$$ y = [301, 691, -576, -452, 797, 150, -895, 191, 887, -543, -760, 855, 508, -1089, -201, 1185, -175, -1210, 526, 1073, -882, -874, 1135, 541, -1312, -193, 1356, -189, -1288, 554, 1136, -841, -856, 1074, 539, -1147, -161, 1163, -175, -1043, 483, 831, -705, -548, 830, 237, -860, 83, 786, -367, -605, 593, 349, -726, -57, 764, -249, -701, 519, 536, -750, -297, 908, -8, -963, 313, 902, -612, -755, 875, 520, -1060, -225, 1149, -109, -1124, 443, 1018, -691, -791, 939, 546, -1042, -205, 1099, -86, -1018, 392, 882, -624, -626, 786, 366, -840, -70, 813, -195, -707, 419, 504, -588, -268, 658, 5, -655, 248, 551, -464, -376, 610, 150, -705, 80, 697, -360, -614, 569, 447, -742, -236, 846, -30, -872, 292, 817, -528, -661, 744, 472, -862, -213, 928, -35, -908, 315, 813, -513, -636, 686, 427, -782]
1410g82O01R82q59o80J012L22j045J8R75l36p99N89N57p67k36Q14q5p57L69O20
1430E13o18l90P80Q6q37K13Q28n23o73P81M43r28j90J040j24j041M38R52p30p64
1450g44R53N10j118j86J133j08j099M12R65o61p63Q51M96r52k08R43p1q62L24
1469a85P02n12m97O49K30o51nO17k48m80M21K95n48m1N80j98n43M18M23n93k25
1490c91P35j1p75K54P44m98o39P14M49q78k13R60l7r62K94Q76n24p42P11N32q25
1511b26l20Q98O8q83J68P81l57o39N26M54o18k10O02J4n68J90M38l44k64M15Q6
1532B11m41J23L89k94k88M44J37n46O8N84k87n27M87M04o39k52P52M4p94J72P91
1553E38m17o83N93N25p27l62Q32J38q59R1Q04k94o92M59N51o02l23O38J35o30
$$ y = [-782, -181, 801, -58, -738, 274, 596, -449, -431, 544, 208, -591, -2, 555, -212, -448, 366, 281, -476, -107, 513, -105, -495, 285, 371, -466, -253, 575, 52, -621, 160, 603, -325, -515, 525, 401, -640, -202, 750, 20, -744, 209, 719, -399, -585, 548, 440, -659, -247, 718, 57, -706, 145, 641, -311, -519, 424, 353, -509, -185, 517, 5, -492, 157, 387, -264, -269, 348, 100, -380, 41, 336, -212, -253, 327, 129, -414, 4, 427, -166, -391, 344, 333, -442, -188, 556, 58, -581, 133, 582, -296, -509, 451, 414, -548, -254, 622, 98, -644, 67, 599, -226, -546, 352, 420, -463, -295, 486, 129, -510, 16, 470, -148, -358, 244, 258, -310, -120, 318, -26, -290, 125, 211, -230, -107, 282, -12, -300, 144, 281, -265, -197, 387, 100, -427, 60, 464, -175, -427, 325, 369, -425, -253, 538, 121, -562, 31, 556, -171, -533, 299, 437, -422, -331, 473, 179, -513, -54, 497, -105, -428, 210, 345, -285]
1573b85N5N75k39m42L55K74m18j06M51j03l73K52K69l76j17M52p1m51K65L97m35
1594g1k90N63J30o52P4O63k67o30M68N27o48l64P56J69q10N6P81k71p16M68N56
1615D92n88l91P01J76p12K6O67k19n35L58M05m74k24N14J5m77J67L90l15k48M13
1636A41Q1m59J07M33k77l59M39K21n51m4O22j69n89L42N28n33l93O53K22p48j
1657c34P61k25p16M16O08n88m24P04K33p65%P22k13o39M19M84n35k96N96Q9o04
1678c07J31N31k87m15M39K21n06l5N33j73m77L56L49n07j63N87l3n93K42N28m25
1699dm25N79K62o96n1P21j67o87L76N90n64m28P01K19p67J0P56k24o76M17N51
1720D93n90l49O83J38p02P1O68k95n33M56L60n56j53N94o4n69K71M66m35l17N62
$$ y = [-285, -230, 345, 106, -336, 19, 293, -125, -231, 220, 117, -256, -4, 265, -111, -228, 224, 153, -298, -33, 364, -71, -361, 202, 332, -320, -246, 417, 150, -480, -12, 515, -133, -497, 259, 428, -382, -326, 455, 184, -532, -64, 492, -96, -487, 214, 390, -322, -296, 371, 152, -383, -25, 380, -94, -318, 196, 211, -266, -99, 291, -24, -272, 141, 222, -237, -130, 303, 26, -333, 106, 327, -224, -268, 354, 185, -404, -62, 466, -67, -460, 193, 415, -333, -334, 427, 202, -514, -98, 510, -78, -502, 202, 435, -330, -330, 392, 179, -460, -41, 443, -92, -388, 208, 297, -307, -176, 355, 68, -347, 92, 313, -193, -228, 305, 132, -345, 11, 360, -147, -310, 277, 244, -349, -107, 421, -4, -429, 150, 412, -284, -335, 386, 219, -468, -92, 498, -66, -494, 207, 426, -341, -331, 425, 201, -475, -58, 493, -97, -446, 237, 375, -327, -256, 412, 117, -416, 40, 400, -156, -309, 285, 221, -348, -77, 389, -46, -363, 199]
1741A99R9o01J27N70l38m64N03L05o24j00O85j26o80L35N86n35m37O89K42p72
1761c37nP74k19p20M39O06o17m15P18K01p77M4P40k64o40M54M98n91k79O43O7
1782C20o53J49N94l71m28N12K23n70k5N80k03n14M00L73n31k07O24mo51K39N88
1803D45m59m53O23K67p24n2P68j94p16M21N97n92m32P21K28p86OP76k37o98M42
1824d9N55n99l48O85J33o99P7O48k86n35M53L55n48j49N87o3n54K59M49m23k96
1845c48N50P7n71J06N64l28m71M95L25o23j39P00r7o72L11N94m96m54O52K68p48
1866c05n2P64j73p11L95N77n50m07O57K12p12K1O72k21n80L85M42n21k47N84M2
1887B72n81J57N02l13l86M55K08n26j7N34j88m83L52L72m93k03N68J9n97J88N55
$$ y = [199, 298, -303, -176, 394, 56, -408, 95, 400, -224, -324, 361, 235, -445, -110, 476, -59, -496, 193, 435, -337, -342, 432, 213, -507, -68, 538, -79, -494, 224, 425, -352, -308, 432, 168, -472, -18, 480, -111, -390, 253, 320, -333, -184, 410, 39, -389, 123, 346, -224, -249, 331, 128, -386, 14, 387, -144, -351, 273, 269, -382, -143, 445, -14, -467, 156, 423, -301, -353, 415, 221, -495, -74, 523, -69, -501, 220, 448, -338, -332, 444, 207, -491, -49, 506, -93, -441, 244, 377, -322, -245, 403, 117, -418, 35, 390, -158, -307, 280, 217, -337, -78, 371, -52, -348, 202, 279, -292, -186, 378, 50, -421, 74, 399, -224, -363, 337, 240, -432, -121, 473, -23, -477, 175, 443, -305, -357, 407, 234, -477, -82, 495, -55, -462, 195, 407, -305, -284, 388, 167, -413, -28, 414, -107, -354, 230, 272, -309, -152, 350, 37, -349, 106, 314, -212, -229, 305, 117, -366, -14, 358, -135, -338, 230, 249, -348, -160, 395]
1908C95l61m57N19L07o27j14O74q5o49K88N63m60m19N86K50o49n4O56j63n90L24
1929f6M79m71l13N40J35n67N4N38k32m43L82K80m53j18M86m9m82K27L91l67k64
1950c13M57J02n02P5M95k49m14L87L03m93j44N44rn70J92N12l39m06M64K86n65
1971a87j05N84p4n64K49M73l81l59M74K00n11m7N22j35m46K71L51l83k03M30O2
1992B21m49Q9M03k39l09L49J91m13m0M18j05l92K44L19l56j98M47M4m76J08M48
2013C04k29l90L60K78m29j52M85jm86J35M50k82l58L78K44m46j10M63l5m50J78
2034i3L76k84k64L49J57m02k4L95j21l31K22K59l10j46L63nl42J24L11k29k43
2055b38L17J36l63j8L81j21l41K38K81l34j81L92P4m18M7M11j79l59K94K54l58
$$ y = [395, 34, -423, 96, 403, -224, -338, 336, 251, -398, -110, 453, -7, -426, 160, 410, -239, -293, 363, 200, -390, -66, 413, -58, -371, 169, 304, -263, -209, 329, 97, -346, 36, 316, -137, -255, 231, 182, -300, -73, 318, -49, -313, 144, 246, -256, -181, 314, 65, -349, 38, 341, -152, -296, 248, 239, -331, -139, 373, 34, -372, 92, 378, -187, -292, 292, 218, -346, -97, 376, -5, -364, 110, 310, -201, -248, 274, 139, -307, -36, 315, -68, -271, 159, 221, -228, -139, 264, 25, -284, 65, 256, -157, -197, 221, 116, -276, -32, 287, -69, -267, 180, 224, -252, -144, 304, 75, -315, 45, 323, -106, -258, 227, 226, -260, -125, 325, 43, -315, 63, 307, -139, -249, 214, 179, -271, -93, 283, -1, -265, 84, 241, -161, -185, 210, 89, -242, -20, 239, -71, -217, 146, 141, -201, -77, 234, 5, -238, 79, 215, -148, -166, 215, 94, -247, -9, 272, -62, -243, 149, 223, -195, -148, 263, 84, -275, 19, 273, -85]
2076h5j55M07J7m01Q9L75j94l07K82K09l37j01L50ol50J34K91k16k19K86J15l18
2098a34NL02r4k86K08J95k59j00K88Rl06J10K70j99k09K82J15l18j5L29q8l20
2120b15J90K66k89j62L25O8l42J7L46j32k90K07K50l16j30L34L6l32M7L14j44
2141D8k63K35J73k80p5K83qk63R2K36j68j90K42P5k43MK41p6k25J69J70k21r6
2164a40K56Lk64J08K21j67j93K34J18k88l0L08p8k88J65K49k46j78L00Q2l12j0
2186a50L22r5k79J74K35k45j46K70O3k85K5K73j03k28J74J54k15p3K25Lk25Q1
2208d5J87j47j12J85M6k06J4K17j03j80J72J35k41n8K62l8k52J02K35j76k00K54
2230E1J15k80m1L12n2k95J39K44j93j92K50J17k78m4K98o3k54J31K15j98j29K26
$$ y = [-85, -240, 167, 184, -217, -128, 247, 53, -254, 28, 237, -100, -201, 149, 143, -207, -73, 218, 2, -217, 69, 184, -134, -129, 173, 79, -207, 1, 196, -63, -163, 125, 134, -172, -62, 208, 9, -200, 82, 197, -121, -136, 193, 105, -215, -25, 241, -48, -210, 115, 183, -159, -142, 204, 72, -218, -11, 239, -77, -207, 127, 163, -169, -122, 192, 48, -215, 20, 193, -87, -162, 121, 113, -150, -58, 178, 10, -180, 62, 137, -106, -102, 139, 63, -162, 7, 177, -44, -140, 116, 119, -145, -37, 184, 17, -176, 58, 176, -112, -142, 166, 88, -200, -35, 214, -32, -210, 90, 172, -140, -150, 172, 77, -202, -28, 207, -38, -184, 86, 149, -136, -111, 162, 59, -169, 5, 159, -56, -129, 96, 99, -126, -45, 142, -5, -117, 68, 114, -92, -78, 139, 36, -144, 28, 163, -78, -136, 126, 88, -164, -62, 173, -3, -203, 51, 166, -114, -155, 157, 105, -190, -51, 193, 0, -192, 58, 175, -103, -147, 151, 88, -166, -35, 180, -18, -147, 79]
2252G9N9k41K1K14j02j53J46J13j92l7K11n1j94J24J42j82q3K12K1k27N6K21j46
2275A1j93K16J26k50o6K85k8k80J07K48j65k02K21J50k82m6K85k7k74J05K31j55
2297A7j73J98J07k37k3K32n8j94J17J58j81p9K01Nj96O9J72j44j15J78O6k20K3
2320g7K26j13j91J65J50k33p5K39K6k74P5K45j57j97K06J59k62o9K69Lk62Q3K44
2343A80j54j92K21R7k30l3K27l1k17J09J72j65j08J96L9k19L6J97j05j55J70Q3
2365A18k07j0K13n1k14J41J75j98j11K21M6k61M8K52j37j97J80J55k35q3K63M
2387A12k59Q0K41j51j91K11J23k39m7K51l7k32R9K03j61j43K11O7k33RK21q6j84
2410a35J42J32j98p3K31j1k10P5J87j48j42K03Q0k39NK39q6k06J42J65k06j00
$$ y = [79, 138, -103, -82, 132, 30, -123, 23, 136, -56, -93, 118, 67, -127, -3, 139, -43, -126, 86, 107, -120, -64, 157, 11, -182, 34, 160, -90, -156, 129, 101, -179, -72, 176, 11, -191, 30, 180, -102, -148, 137, 110, -164, -59, 172, 17, -156, 42, 149, -88, -111, 121, 63, -131, -14, 144, -37, -116, 85, 90, -106, -37, 135, -9, -124, 54, 120, -100, -77, 149, 36, -155, 10, 160, -73, -148, 91, 117, -157, -82, 163, 6, -191, 15, 174, -88, -157, 112, 115, -147, -64, 180, 26, -166, 55, 152, -78, -111, 116, 85, -132, -23, 149, -16, -124, 72, 111, -108, -72, 125, 20, -135, 35, 118, -89, -99, 114, 63, -151, -10, 165, -33, -144, 77, 123, -138, -90, 162, 25, -172, 8, 163, -72, -155, 108, 112, -147, -67, 174, 23, -168, 43, 166, -73, -120, 131, 94, -138, -39, 164, 3, -140, 71, 138, -95, -86, 135, 49, -135, 7, 139, -59, -132, 99, 88, -122, -47, 140, -8, -150, 53, 133, -106, -101, 138, 52, -154, -12, 153, -53, -153]
2432a53K42K8k56N9K42j31k09K08J42k37q0K69j8k54J08K18j65j64K08R7k38p
2454i1K27o1k21J40J55j84r2K07K3k26O0K01j27j60J83R7k25k4K39n5k06J02J77
2477A39j74j14K20M0k37M0K40j05k09J80J49k23p8K45%k54P0K26j30j77K01J08
2499A57k33l7K39m1k22J09J78j68j14K01M5k20K6K01r8j62J61J10j95n4J97j0
2521G0k06R5J81j56j29K04O1k18OK20q6j91J49J64k08q8K22L4k45N4K23j17j95
2544a56J73J40k06p1K10J7k35O8K06j40j44J75R0k10qK09p0j66J11J36j67o5J88
2567H5kj80M1J83j16j54J68Q9k07j1K20m5j98J07J52j39j29J99O2k23J4K10n8
2590F8j96J27J53j89p8J96L3k06L1J82r4j66J52J14j79l9J69oj77O6J54j17j15
$$ y = [-153, 89, 117, -139, -80, 162, 31, -178, 30, 172, -65, -145, 124, 106, -148, -40, 178, 13, -151, 57, 154, -84, -91, 136, 75, -146, -6, 149, -35, -127, 80, 103, -123, -63, 138, 11, -149, 34, 131, -94, -118, 121, 66, -140, -38, 139, -35, -149, 71, 111, -126, -86, 154, 49, -160, 20, 169, -54, -132, 113, 113, -141, -71, 155, 25, -152, 49, 157, -76, -113, 126, 85, -137, -28, 150, -18, -132, 69, 114, -106, -80, 121, 23, -139, 22, 132, -63, -117, 80, 70, -136, -41, 140, -16, -145, 59, 120, -98, -92, 128, 42, -149, 0, 164, -44, -132, 90, 124, -121, -67, 156, 39, -156, 17, 157, -49, -120, 90, 107, -128, -60, 146, 6, -138, 37, 127, -83, -91, 118, 48, -118, -7, 129, -38, -103, 85, 83, -97, -56, 127, 11, -143, 25, 114, -93, -104, 116, 71, -127, -20, 132, -7, -136, 63, 125, -98, -84, 126, 68, -128, -1, 152, -37, -115, 81, 114, -92, -61, 121, 27, -139, 13, 127, -52, -91, 78, 72, -105, -39, 115, -2, -117]
2613a17J45O5j76%J82o5j49J14J25j65o4J74Qj80M8J81j04j38J51Q1j74l9J91
2636I4j9j85Q8J55j28j16J69N8j91QJ72o4j53R6J30j44q0J60L4j78K8J56p9j26
2660a15J30R2j59l5J65k1j57O1J34j04j01J38O1j61J0J53n0j32Q6J22j45p2J60
2683F0K4j58K1J71r4j16J10R3j42m9J62j1j57N9J22r0j17J34O4j56kJ45m1j40
2707a08R0J07j11q0J43L4j55K6J47r3j10J22Q2j37k7J44j8j38M6J30r5r3J29N8
2731I3j50qJ42k9j35P7J06j07o1J21K7j35J6J18n0j20J01P5j10m8J33jj30M9R8
2756G2q0q4J20M3j29%J32m2j15P2J10j16n9J31J8j38J8J38o4j17J02Q0j25l6J39
2781G0lj39L9J24q4q8J19M0j24LJ11k5j18O5R1r6n6J06K4j12J2J11n7r5R0N7r6
$$ y = [-117, 28, 93, -83, -83, 99, 34, -115, -1, 124, -41, -105, 69, 77, -103, -55, 126, 22, -116, 35, 116, -58, -97, 94, 75, -110, -22, 133, 5, -111, 58, 116, -75, -67, 105, 41, -112, -16, 114, -30, -110, 50, 84, -94, -66, 90, 11, -115, 15, 107, -52, -87, 78, 57, -100, -39, 95, -9, -110, 28, 89, -72, -62, 91, 41, -91, -5, 117, -28, -100, 60, 84, -74, -53, 118, 24, -92, 18, 111, -31, -80, 82, 71, -86, -27, 95, 5, -112, 22, 86, -70, -72, 73, 32, -108, -18, 89, -22, -102, 41, 75, -80, -54, 93, 0, -110, 12, 94, -43, -70, 74, 56, -82, -36, 94, -1, -94, 35, 93, -57, -65, 77, 48, -87, -10, 96, -11, -72, 49, 76, -59, -43, 75, 25, -95, 6, 81, -29, -77, 56, 55, -75, -26, 72, -8, -92, 28, 71, -58, -58, 74, 32, -83, -11, 99, -17, -76, 55, 73, -65, -47, 91, 27, -90, 12, 92, -33, -69, 70, 67, -72, -33, 91, 7, -81, 38, 78, -46, -43, 68, 43, -75, -10, 81, -15, -71, 35, 59, -53, -41, 70, 13, -82, 8, 65, -31]
2808c1m3J45k4j23M5J19q9q2J18N3j32j2J33l2j25P9Q8r9o8J31K4j41K9J21p1
2833A3q7Q3Q0j16k6J04jj22M6J08q7o7R5M8j19KJ12m0j02O7R6j09m9J10J8j27
2859g0L9J10o3r2Q4P4j19k6J22pj27O3J05r3o7J09N0j44KJ30m1j18Q5R2j23l8
2885f3J23Pj28K5J16p7r4J24M1j28rJ16j8j11N4J16j05o6J03L8j23J7J06m2r4
2910g2P3P2j01m0J36j2j17N0J03q1r3J16L1j08oJ13l6j04O4R3j00m8J28J4j29
2935e4J8J18o1r7Q1Q2j26l1J10J0j18L9J08r1p5R7N7j15j1J26l7r6N9Q1j03m6
2961g5J29qr7L2J02o7r3J10M6j07k4J19l1r8N5R9q9q1J23M0j40J1J27n4j10Q5
2987DQ3j22m2J30nj21L1J22q1r0J09N9j26k0J22k2j13N6J01r0n7J11L5j27K1J07
$$ y = [-31, -74, 71, 47, -76, -31, 88, -1, -83, 35, 88, -44, -56, 77, 45, -80, -1, 87, -12, -80, 51, 75, -66, -37, 84, 13, -74, 9, 89, -27, -53, 51, 50, -72, -26, 82, -5, -72, 23, 71, -48, -46, 66, 26, -76, -9, 87, -22, -71, 39, 57, -70, -31, 79, 16, -76, 8, 82, -37, -63, 59, 52, -75, -12, 93, 0, -67, 42, 92, -52, -50, 80, 39, -79, 6, 98, -25, -63, 60, 67, -61, -36, 80, 3, -91, 33, 74, -54, -63, 53, 35, -76, -22, 94, -11, -77, 26, 64, -59, -42, 64, 22, -72, 1, 73, -28, -68, 68, 56, -61, -11, 92, 11, -82, 34, 65, -43, -49, 64, 28, -76, -12, 81, -19, -67, 61, 75, -54, -36, 82, 21, -76, 5, 87, -39, -70, 40, 50, -68, -29, 79, -12, -87, 10, 67, -48, -59, 67, 30, -66, -7, 74, -29, -75, 54, 46, -51, -19, 83, 16, -77, 33, 79, -28, -52, 67, 36, -62, -7, 92, 3, -78, 45, 85, -55, -44, 83, 29, -81, 4, 87, -35, -77, 53, 48, -73, -42, 80, -1, -91, 18, 77, -49, -69, 53, 31, -82, -26, 75, -15, -72, 39, 74, -53, -32, 75]
3013G5m4j04R0O9j12l6J19j1j11N5Q8r1p1J25L1j13lJ13l6j07P9Q4j13n5J13K1
3039E5j28K3J26o0j03R3P4j14k3J15j0j17L4J12q0p8J09L5j09nJ15k7r4N8P6r3
3065a6m6J04J0j01L5R0p1q3R3N1j08k0J27k0j17O5R3r9o8J18K2j25J5J21m7j08
3091h5Q9P7j16l7J12Rj25M3R9n1r3Q7O8j03k9J04j1j07O2Q9p8p0J00K7j05J1J00
3118F7m4r5Q1O4q2n2J23k2r3K3J09p8p2Q4N2j19j3J06j4j05N6R0q3n9J07L9j27
3145e7LJ06l7j01Q1O8q2l8R3J7j05M2Q1n2p3P7N3j07j6J06k0j00N2Q9q3n6R8L2
3173G1j15J0R3m1q8P0P0r4l9J03J0j20K2J21o7p3Q2M5q5k9J10k5r7N0P6p3m6Q7
3201B8K5q5pR6k5r5P1N6p9l5Q9Jq3J5R2m8p6O9N2r8j6R9pr5K9Q8p4n4Q6K6q7L
$$ y = [75, 31, -73, 17, 86, -26, -62, 57, 46, -65, -10, 78, -13, -84, 41, 72, -41, -44, 69, 33, -74, 5, 89, -24, -79, 34, 55, -73, -50, 76, 16, -87, 6, 80, -34, -57, 58, 48, -69, -35, 77, -3, -81, 28, 63, -46, -51, 64, 37, -57, 1, 77, -16, -62, 42, 52, -49, -14, 76, 5, -78, 15, 66, -42, -62, 65, 45, -72, -7, 86, -13, -81, 37, 59, -66, -51, 70, 23, -85, 4, 81, -35, -72, 40, 49, -76, -33, 66, 15, -78, 9, 77, -26, -55, 49, 38, -69, -7, 82, 4, -66, 34, 61, -44, -33, 67, 23, -72, 9, 73, -9, -61, 62, 40, -53, -30, 79, 1, -71, 13, 65, -54, -67, 39, 25, -80, -24, 66, -17, -76, 31, 70, -57, -54, 52, 15, -86, -5, 63, -19, -57, 36, 53, -52, -10, 71, 19, -54, 23, 76, -31, -47, 59, 39, -61, -9, 80, -3, -59, 39, 71, -44, -34, 59, 18, -70, 0, 70, -24, -63, 40, 50, -70, -48, 73, 6, -67, 15, 60, -25, -54, 56, 31, -66, -16, 60, -13, -59, 28, 53, -32, -39, 57, 32, -63, 8, 64, -15, -50, 39, 40, -43, -28, 64, 16, -60, 9, 61, -37, -53, 46, 39, -56, -27, 61, -13, -67, 19, 45, -42, -39]
3233c9Q9k7r1O5P1p8n1Q6J6q9J2R6n1p1P7M5p6k4Q6Rr4K5R3p0o5Q2L5r4KR7l8
3264B8q0N0O1o9l6Q5Pq9J9Q1n2o2N9M8r1mQ4or2M2P1o0n1P3L4q9kR3l3q8O6O1
3296E8p6m2Q1K7q1OQ6l4p3O4M0o3m2R0jq2K8P1m7p2P9K8q5nQ5k3p5M3N6o9l2P8
3328A8K9r4J7P8l9p4P5L7p6k7R3Jq7L3P2o1m2O4L8q8j0R1k3q0M5O6o6l4Q0J1r1
3359d4L0P3m0p0N5L6n9j9P4kp7J9P0o0m5P4K9q9LQ9l4p2M7O7o8l7P3K7q7J8P7
3390E8m1p7P1M0p6j4Q3rp3J7Q8n9n8P6K1o6j6Q4k2p2M4N6n6l1O3Nq5L0N4l1n8
3421e4O0K9o5mP3k6n9L2O4o1l5P3Qp0J0P2j9p1L9O6p3m1R8Qq9RP8l4o7O5M5p2
3453a1l0P8qp3K7P0m7m6N9L0p3kO6j1p4M3M3n4m2Q4lo4K0N3m1l9O3L2o7j4O4m
$$ y = [-39, 50, 23, -68, -3, 68, -10, -61, 25, 41, -48, -36, 60, 9, -62, 15, 60, -16, -40, 46, 55, -39, -14, 79, 9, -56, 26, 61, -33, -31, 66, 28, -52, -2, 59, -10, -46, 39, 46, -43, -24, 57, 5, -57, 2, 50, -41, -45, 39, 33, -59, -17, 54, -6, -57, 16, 50, -39, -41, 52, 19, -69, -3, 58, -18, -60, 21, 48, -33, -27, 59, 25, -48, 16, 56, -7, -49, 41, 40, -42, -14, 57, 10, -62, 17, 45, -40, -45, 40, 17, -58, -15, 41, -28, -60, 18, 47, -47, -30, 48, 9, -65, 10, 47, -29, -56, 37, 38, -49, -16, 56, -5, -47, 17, 55, -33, -43, 48, 25, -55, -10, 56, -10, -44, 36, 47, -44, -14, 59, 19, -51, 4, 40, -19, -38, 36, 34, -43, -24, 46, -14, -59, 15, 44, -45, -42, 47, 13, -59, -12, 55, -13, -50, 23, 50, -37, -19, 58, 17, -60, 11, 51, -25, -39, 44, 35, -38, -21, 67, 8, -50, 26, 47, -19, -35, 49, 27, -45, -1, 55, -1, -32, 31, 36, -49, -19, 35, 4, -54, 6, 35, -30, -34, 39, 13, -46, -14, 50, -11, -46, 27, 35, -35, -25, 47, 28, -43, -4, 62, -11, -52, 46, 54, -35, -26, 52, 18, -49, 16, 61, -11, -41, 37, 29, -44, -17, 53, 6, -40, 19, 49, -24, -26, 40, 29, -45, -2, 41, -13, -55, 29, 26, -38, -18, 35, -6, -45, 18, 50, -17, -31, 33, 29]
3485B9q1M7N7m7m8P3J5p5J6P2k6p4L9N4n7l6P6J8q1mP8l1n4M6L7o2k4P7po8K9
3516a2N0n1k5N3J8o8QP3l6o1N3K7m6j9P1mp6L9O5o7m2P3K2o8nP8j9p6N2N7p2k9
3548c7O9J6q1J9O0k8o2M6M1o0k5Q3j6n8J0O3l8m8M6L8o3rP9l4m9L9L8n3k4O4m
3579B2n5J6P1n0n0O7K3o9oP6j8p5L8P1n5n1P5Oo9QP4j4p9N8M2n1m1O3J5p6RN6
3611C1k0n8M5L0n0j3N3kn8L5M9m4k1L7K5p0J0N8k8m2M7K5n5j7Q0j6n8J9O5l8o3
3642d4P3K8p1j7P9j8o8L4N7m5m6O0L4p2pO4j5o6K3O0o2k3N5J5m9jN7l3k2K8L1
3673C9n7J1M6k4n4M7M8o4j3O7po6K7O2m4n8O7L8p9j6O3Pp2J9O3m1m9N3L6o9j1
3704c1N7Mo4J8N6l5l6N0J8o7KN4rn6M4K8l5j5N7k1m9K6L7k1l4N6Nn4J4N7l0m1
$$ y = [29, -52, -5, 52, 5, -43, 30, 45, -30, -14, 58, 32, -42, -3, 51, -6, -42, 34, 52, -29, -33, 45, 14, -40, 6, 43, -19, -43, 34, 27, -41, -12, 38, -13, -38, 15, 33, -35, -27, 46, 10, -51, 2, 29, -17, -36, 35, 31, -45, -6, 59, -8, -50, 23, 45, -23, -28, 50, 31, -45, 7, 64, -8, -37, 32, 48, -33, -14, 46, 18, -44, 2, 43, -17, -42, 41, 25, -33, -23, 40, 2, -46, 0, 38, -25, -34, 45, 11, -38, 1, 39, -14, -38, 26, 22, -33, -17, 54, 4, -46, 21, 44, -25, -31, 45, 27, -48, -10, 61, 6, -45, 30, 36, -33, -25, 49, 35, -44, 14, 56, 5, -36, 27, 42, -34, -25, 31, 11, -47, -2, 28, -22, -35, 18, 16, -42, -7, 42, -2, -23, 14, 39, -31, -21, 37, 9, -33, 14, 39, -16, -33, 47, 31, -27, -8, 57, 19, -44, 29, 57, -14, -31, 48, 30, -38, -4, 53, 8, -38, 22, 56, -16, -23, 41, 26, -40, -17, 43, -19, -42, 13, 28, -21, -22, 35, 2, -20, 8, 39, -18, -7, 39, 15, -39, 8, 56, -8, -21, 46, 39, -27, 0, 62, 18, -40, 27, 65, -14, -30, 33, 40, -32, -13, 50, 9, -40, 13, 49, -20, -31, 26, 30, -34, -16, 40, 5, -31, 19, 37, -30, -28, 26, 17, -39, 5, 33, -2, -17, 40, 19, -30, -4, 33, 12, -22, 34, 39, -15, -1, 56, 26, -15]
3736a5M7K3o0k0M9J5n7RO3m8n0O0K8o7rP3j0p3K6N9l8m2M1M0o1rN8qn2J8O1l6
3768A5o1P3Pn2RN1k3m1L3K4l3j0L6Nn5L2M3n6j8N8Ko4J4O4l8l9K5M6o1k6O9jo4
3801c6J9N9l2n6M4M4o3k1P1qo4K3N7k8m8N0K0n3mO2j7n0L6K8l1k4N3ml6JN4l7
3833Il4M1K1n2%N6j4n4K7L6l8l2O1J0o8NO9l0n7L8M3m9l2N8K8p8PO5l0m0L4K8
3865B8n1nN0On3K1L6k4l6N9Lm5J2L5j3l9L2K0l3k5M2J2n3J8M8l6m0N2J4n4oM5
3897B0Qo3J9N5m4l4M9K8o6oN3jm1QM8m1k2O0pm4RN5l5l2M0K2n4KL8pl2J4M2l9
3931Bk3L7J8o3K1L4j5m4M6K8m3k1M5Rn6J5N7l6m8N3J1l9mM4j4m5K0N4l9k7N1J2
3963D0m9qM9om2K3L8l6k0M0J4m6oN3k5l1K5K9l9j6L0ll4K4K9l4k6M2%l2QM4k5
$$ y = [-15, 32, 55, -5, -25, 24, 39, -18, -9, 54, 6, -44, 16, 44, -23, -32, 41, 31, -42, -16, 43, 5, -37, 4, 44, -17, -26, 32, 24, -28, -10, 51, 15, -46, 27, 34, -18, -9, 42, 19, -22, 11, 35, 2, -8, 28, 33, -22, 10, 53, -3, -21, 37, 39, -25, -11, 53, 15, -24, 1, 47, -14, -40, 29, 28, -36, -17, 42, 10, -46, -2, 42, -21, -42, 29, 21, -43, -20, 37, 9, -39, 11, 31, -22, -26, 36, 19, -31, 5, 33, 2, -22, 31, 27, -9, -8, 46, 9, -25, 16, 37, -15, -15, 41, 27, -27, 0, 36, -2, -34, 27, 37, -31, -26, 43, 13, -44, -6, 37, -12, -44, 14, 42, -36, -29, 36, 6, -34, 0, 28, -23, -28, 22, 28, -25, -4, 32, 8, -28, 31, 34, -11, 1, 36, 23, -16, 16, 36, 3, -22, 20, 32, -21, -3, 45, 9, -31, 21, 35, -19, -25, 20, 28, -35, -16, 39, -5, -39, 10, 38, -28, -34, 19, 18, -23, -15, 33, -8, -30, 30, 23, -21, -12, 43, 8, -24, 16, 38, -16, -14, 24, 17, -15, -1, 41, 2, -21, 16, 34, -29, -8, 26, 11, -33, 13, 41, -2, -23, 22, 31, -25, -10, 47, 11, -37, 16, 27, -12, -16, 28, 14, -31, -11, 43, 4, -23, 28, 40, -9, -17, 32, 26, -16, 7, 45, 9, -11, 29, 43, -3, -9, 44, 19, -12, 13, 42, 3, -13, 17, 14, -20, 4, 33, -1, -27, 15, 15, -17, -9, 35, 10]
3996A0l8L2J8l0j7L8J0m0J3L9l2l3M2L1m9j2M5On2K1L5k6l8M5K6m8j6O2k4l4J8
4027BL1k4l0M3Rm2lL0j3k3K0K0l4oL5j1l8K5K0k5j1L0J5k6rM5j9l8L7K2m0oM7
4060C3om1jM9k7l0L1K7l5j6N6j3l6J2L1k7k5L0J1l3%L2pl8J9K4k8j0L3Ll6J3L2
4093B7k7l8M4K0m3jM3j6k4J5M2l9k3N7mm9kN3k0l8K4L9m4oL6ml9J0L9j0l9K3K1
4126B7l1j8L7mk3J4J9j1l4L0Rl0pM2j5l3K4K4l4pK9J0m8K9K6k4j9L0J1l7J5K8
4158B9j1m3J8M0k7j4K9K2n2mM5j5k9J2K9l8qK7Mj7j6M7k3k7K9J0k6j3L3Jl0J4
4190dL3m1oL9j0l1QM4j4l8L1K2l8j1M1lm9L7K3j3l4L1K5n2QM2pl7PL0k5k4L0J
4224A5m0NL5j7k4K4J6l3j0M4j0k8NL8k2k7K7J7l2jL9j0l9L2J3j5j8L7Om1QK8j1
$$ y = [10, -28, 4, 22, -8, -25, 13, 23, -17, -4, 35, 3, -30, 12, 43, -6, -18, 27, 33, -19, 2, 37, 11, -27, 18, 44, -4, -20, 42, 18, -16, 2, 33, 9, -21, 22, 31, -11, -14, 16, 3, -20, 0, 20, -14, -20, 15, 4, -34, -9, 11, -14, -25, 5, 20, -6, -15, 30, 11, -27, 10, 32, -8, -14, 33, 27, -14, -15, 34, 7, -23, 8, 35, 0, -16, 40, 27, -9, 3, 34, 7, -18, 12, 23, -10, -10, 22, 15, -23, -4, 20, -8, -18, 15, 18, -18, -5, 27, 0, -38, 6, 26, -17, -18, 25, 9, -15, 0, 42, 3, -20, 37, 33, -16, -18, 35, 15, -23, 1, 40, -4, -10, 26, 22, -17, -7, 32, 22, -17, 6, 27, -4, -22, 15, 11, -12, 2, 21, 10, -24, 6, 15, -15, -22, 20, 5, -28, -4, 20, -14, -21, 8, 18, -30, -1, 25, 1, -18, 12, 23, -14, 1, 29, 18, -25, -7, 33, 6, -8, 21, 43, -9, -13, 32, 17, -12, 0, 29, -9, -17, 10, 14, -3, -19, 28, 5, -22, 7, 17, -9, -22, 11, 12, -18, -4, 29, -12, -18, 21, 11, -20, -12, 32, 18, -20, 11, 33, -5, -16, 25, 22, -27, 10, 33, 20, -14, 17, 42, -10, -2, 40, 33, -4, 3, 33, 8, -16, 14, 15, -25, -20, 15, -2, -26, -2, 14, -19, -29, 15, 5, -23, -18, 20, -2, -29, -2, 15, -17, -18, 21, 11, -28, 4, 17, 2, -16, 21, 27, -14, -6, 22, 11]
4257A1l1K5L0l0j7L8Km0J6K7j5m0K9J6k6j6M4nm3K5K5k6j6M4j0l9J6K3j8j8K3
4288DKk3qL5Ll2K4L5m3k6M9Jk9OL7k4l8L8K7l9j4L7Qm2J3L5l3j3J1K8m2qM1ol5
4323b1J9Ljj8J5K7m1jM6j7k6J4J6k6qK5Mk4J0L9k5k2J8K6l4oM3j5l6K2L3l2m2
4356c5N4Pk8mL8k1l1K8K3l4k0K7J8l5QK4pl1L4Mk4mJ8Ml2J9J6j5k6M2Jl5RM0k4
4391Hk5L5J1l1jK7nk7J3K5k1k7M4J1m2mL9j3l1K1K6l1k8M0Ml4lM5j7l6K6J8k2
4424ej5L1Qk7OK2k5k7L3K5k8qK4mj5J3K7l2j0K7kk8RK2j2j7K0K8m1kL5j3k2J0
4458GK9l5k0L1J0k5j4L1jl4RM4k8k1L7Ml7NK5j0k7K7Qk3nL2kl1J2L7k7j9K6J4
4492B9l1oL6j5l4L1K1k2j6J4K1l7RL2j7l3K0K3k8j7L5Jl8JM6k8k5L2J6k2j9L9
$$ y = [11, -20, 5, 35, 5, -12, 26, 28, -12, 4, 31, 16, -24, 5, 21, -5, -21, 23, 18, -25, 0, 25, -1, -17, 27, 17, -22, -6, 17, -1, -19, 4, 6, -17, -25, 10, 13, -19, 5, 40, -3, -29, 20, 21, -8, -2, 35, 11, -27, 11, 38, -1, -15, 22, 30, -12, 1, 36, 3, -10, 1, 29, -13, -21, 20, 14, -21, -2, 1, 0, -18, -3, 24, -17, -18, 28, 11, -15, -1, 15, -11, -19, 6, 10, -14, -4, 35, 10, -12, 6, 32, -2, -8, 35, 20, -16, 6, 39, 7, -35, 19, 26, -2, -6, 32, 11, -20, 8, 31, -3, -23, 4, 22, -13, -5, 19, 12, -19, 15, 19, -5, -9, 9, 13, -19, 0, 16, 1, -25, 17, 18, -17, -8, 32, 8, -17, 18, 29, -2, -3, 24, 19, -8, 5, 30, 9, -18, 26, 37, -5, -9, 30, 17, -14, 7, 33, 2, -26, 14, 18, -16, -19, 26, 9, -27, -1, 17, -5, -20, 11, 19, -8, -2, 20, -5, -32, 1, 26, -2, -10, 14, 10, -5, 8, 35, 3, -7, 20, 18, -10, -1, 21, 9, -8, 12, 40, -1, -3, 32, 19, -3, 7, 36, 1, -19, 12, 22, -3, -17, 14, 13, -21, -12, 32, 4, -17, 20, 24, -13, -8, 17, 7, -20, 7, 15, -8, -13, 19, 17, -14, -2, 35, 8, -11, 15, 29, -2, -8, 28, 13, -21, 10, 31, 9, -7, 7, 28, -9, 0, 32, 15, -18, 2, 25, -3, -20, 15, 16, -22, -21, 25, -3, -28, 4, 20, -2, -21, 18]
4524A8nl7J8K2k1j9L8J5l8mK9kl3K2K9l0j3L4j0j7KL3k2j8L0Jj7rM4l5k7K5J6
4557A9j8l4N1%l5LL0j2k2K1K0l1qL2jl7QL2k0j6K9Nk5j3L0Ql2J8J7k3nJ8Rk7O
4592cL0j9j8J7J6j4k3L6j0l1J6K5j8k7K7J3k5nL3pl4K1J8j3k5L5Jl8OL1rl3K3
4625dJ9j4j8L8lk9MK9j0l1L5J8l7nL5j5rlK1k5j2M3rl3RL3k2k6K9J7l3j1K8Ml4
4660b1J2K6k1k5L5J5l4oK0Ol2K1K3k5j6K9Nk7ML6j7k4K5K1k9k6L9J1m0MM2k3k9
4693b1K4K6l0j2M9l0k9J7L3l4k2M0kl2QK4j0k2OM0l8j3M5om0K3K6k3l0M4J1l9
4725a7jM5mm1J4L9l2j7K7J7m9RM5k1l1J4K9l0nJ6Mk7RL3k0l6L1K1k6j1K0ok3K1
4759cK1k3k1M7rl4QL7k4l5N0%k2j1M4rl4K7L5m6j0J8K5m5LL3mm2K5J9k6j5L3%
$$ y = [18, 13, -24, -6, 16, -5, -24, 14, 29, -9, -13, 16, 14, -19, 3, 32, 2, -11, 23, 13, -4, -2, 31, 9, -9, 21, 22, 5, -4, 40, 5, -22, 3, 19, 1, -33, 18, 18, -17, -14, 16, 4, -18, 3, 23, -8, -16, 16, 15, -22, -14, 18, -2, -18, 11, 16, -9, -22, 8, 16, -16, 2, 19, -4, -9, 9, 18, -9, -3, 27, 8, -10, 7, 23, 9, -14, 22, 12, -19, -3, 22, 4, -23, 4, 17, -8, -13, 20, 13, -21, 0, 18, 5, -20, 15, 16, -22, -16, 15, 6, -27, -4, 15, 1, -17, 21, 18, -11, -7, 22, 12, -19, 16, 34, -3, -8, 27, 12, 3, 0, 21, -4, -16, 27, 18, -15, -6, 27, 5, -21, 8, 25, -8, -19, 9, 13, -21, -9, 17, -4, -29, 6, 21, -13, -19, 1, 7, -25, -4, 19, -6, -22, 7, 12, -15, -11, 25, 8, -16, 9, 30, 1, -25, 14, 25, -15, -11, 31, 8, -21, 3, 29, -1, -13, 36, 6, -23, -6, 27, -7, -29, 11, 9, -23, -15, 9, -1, -23, -17, 23, -15, -28, 17, 11, -29, -6, 20, -3, -33, 11, 22, -17, -18, 27, 23, -18, -4, 35, 3, -14, 13, 30, -19, -10, 35, 14, -17, -3, 26, -4, -9, 7, 11, -16, -7, 26, 6, -30, 1, 22, -4, -15, 5, -1, -24, -3, 18, -5, -26, 21, 12, -22, -14, 23, -1, -36, 14, 14, -8, -19, 25, 16, -18, 9, 44, -2, -12, 6, 31, -14, -11, 22, 18, -24, 1, 20, -6, -21, 12, 12]
4793A2k6KM2k6m2K7L0m3QK7Rm2K2K0k8qK7mk7lM2j3l6L5J2j8j2L3Pl4NK7j5k5
4827a5L5Ol0qM4j7m0L4K2k4k2L7Ml6PK3j3l0K0L2l2k2L7J0m1J1J9j5k0K3K1l5
4859a5lL6k1k0K3K6k7j0K2Ql7J8K6k0k9M7Nl1pL0Jl5J0M2l4j5L7J0n2J0L0j6l2
4892b3J7K6k3k5L6Qm0OL1nl8L4J0k7lL1jl7J4K3j6qK4Rl9J0L1k1j4L0Nl1lL9j0
4927B0k8J6L0k4l1K9J3m0NK8Rm3J5L2l5k0L2Qm1KM2j9k6K0K9k3j4L7%l2kL4j5
4960Hj0J9lk7NM4k5j6J7J6k0k1L2J4l8LK9j9k1K8J9l8j1L6ol7J8L7l2k8M0Ql1
4993a0qL5j4k4J9K7m3NK6%l4J2K4j5k2K8K1l2lL1j2k7K8K2k7k3L5Rl7KL6j9k3
5026a3J5L1m2rL6Km1OL2k2j3J9J7l5j2N3j5k6J2K2k8mK5Ok9rM0j3k5K2J1j4j9
$$ y = [12, -14, -12, 30, 4, -38, -11, 19, -24, -16, 11, 20, -22, 0, 20, -8, -16, 11, 7, -20, -23, 19, 6, -30, 5, 17, -1, -13, 20, 27, -7, -2, 25, 10, -15, 20, 26, -4, -12, 32, 15, -25, 9, 31, 7, -15, 22, 26, -10, -3, 20, 7, -23, -3, 29, -3, -25, 12, 22, -19, -8, 11, -4, -24, -1, 20, -15, -18, 18, -3, -23, 0, 26, -1, -11, 11, 19, -18, 0, 26, 6, -23, 24, 29, -2, -9, 21, 22, -13, -3, 39, 5, -10, 27, 37, -15, -5, 25, 9, -23, -6, 20, -3, -28, 8, 16, -24, -18, 13, 8, -30, 4, 14, -13, -16, 15, 14, -23, -9, 14, -2, -10, 14, 23, -16, -6, 25, 4, -10, 20, 25, -6, -9, 30, 20, -8, 8, 38, 14, -17, 12, 25, -15, -10, 18, 27, -16, -1, 31, -4, -24, 8, 16, -25, -23, 19, 0, -26, -6, 23, 0, -14, 23, 23, -9, -11, 23, 8, -2, 17, 14, -13, -8, 36, 11, -5, 12, 28, 8, -13, 19, 33, -5, -2, 27, 8, -13, 15, 34, -4, -15, 21, 15, -22, -4, 33, 1, -27, 13, 21, -10, -18, 17, 3, -21, -2, 25, -18, -13, 13, 13, -21, -9, 15, 0, -22, 6, 27, -5, -8, 23, 11, -16, 12, 34, 7, -16, 19, 28, -9, -7, 29, 10, -13, 2, 33, -9, -18, 18, 20, -21, -15, 17, -5, -18, 1, 18, -17, -29, 24, 9, -17, -5, 17, -11, -15, 10, 16, -13, -22, 18, 5, -20, 2, 13, -1, -20]
5059b0L4Rm0K6K1k3k6L2Qk5oL5mm2J7K7k3k3L1Qk9ML1j2k7QL1l7nL0j1j6JK5j5
5094fj1K3J2l4J3J4pk4QL0k5k1L7Ol2RK5ok3K1J4j4j5J9jk3J0K4k0k5L1Rk5rK8
5129A2pl2K8J6k3j7K5%rk0M3j5l5K5K4k2j0K7mj7jK9j3k2J8J8k8pL2kk4J0L1k4
5163Fj1J7Mk9J6K2ql4K2J0k8LK2Nl3J7K2j9k5K9J7m6pL7j2k6L2K1j8l3L0J2l0
5196a5jK9j5j1J6J6l4OK6Nk7J4J9ol1K3K0l6mK3Lm0J2L6k1j9K1%j5j3M6j6l0K1
5230BPj5j9L6%l4J4K6j0k5K5Pj0k9M8j6k8J7K6j4k3L1J5l6pL8j1k2J6K7k3l1L6
5263A8jl0MK8j1k0J7K3l3j1L2rk8QL8l4qK3Ql1kL2pj4J5Jj5qK7nj8NK7k0k4K1
5299bK2l0PK6j7rJ0K4l5k6M9kl2jL2j6j7J0L3k8j5M1lm6J1L7k4k4K1J6k9MK6n
$$ y = [-20, 14, 23, -17, 9, 30, 7, -19, 13, 21, -4, -10, 25, 21, -21, -4, 23, 0, -23, 8, 16, -13, -9, 22, 10, -17, -9, 22, -15, -20, 10, -1, -17, -16, 9, -6, -17, 6, 18, -16, -3, 11, 4, -20, -12, 18, -7, -28, 9, 15, -17, -8, 17, 11, -12, 9, 23, 9, -6, 13, 12, -11, -1, 23, 3, -22, 9, 18, -7, -16, 12, 5, -27, 1, 17, -6, -23, 2, 2, -7, -27, 16, 1, -34, -9, 15, -7, -17, 10, 6, -11, -12, 17, 4, -18, 0, 18, -10, -17, 15, 13, -11, -1, 30, 6, -5, 12, 16, -13, 3, 25, 17, -17, 5, 15, -13, -10, 12, 17, -16, 1, 23, 4, -21, 8, 25, -21, -28, 9, -3, -29, 3, 24, 6, -27, 3, 15, -15, -16, 13, -2, -13, 3, 19, -15, -9, 17, 22, -5, 9, 28, 22, -9, 14, 34, -2, -6, 17, 20, -20, -8, 28, 7, -12, 9, 9, -6, -19, 27, 11, -19, 2, 9, -6, -25, 11, 11, -23, -9, 17, 7, -18, 7, 14, 4, -25, 23, 7, -21, -4, 22, 8, -15, 16, 31, -5, -12, 26, 15, -7, 9, 36, 13, -18, 18, 17, -13, -9, 19, 8, -12, 5, 28, -5, -16, 16, 7, -21, -13, 25, -9, -17, 6, 14, -17, -19, 13, 6, -8, 7, 8, -7, -15, 12, 7, -11, -6, 21, 1, -23, -2, 20, -10, -3, 23, 6, -3, 7, 31, -4, -30, 19, 17, -15, -16, 16, 0, -17, -7, 26, -2, -17, 24, 21, -25, -14, 23, -1, -25, -4, 12, -17, -13, 13, 8]
5333Hl6K0J7j7%K0Jk3MK3oj8LL1l4lL4%l7PL6j5l6L3Mj5rL4j3j0MK1k2k8M3%k8
5370gpL4j0k4K1Rl2oL2ok1QK3j8j1L0Kk6kK7ll4L5Pk5KK2kk4QJ8j9j7K8Rk7nL7
5408B6ol9J7L6l6mJ4K5l8pL7j2l4K1J5k0nPK4l3LJ7ll2K5J5k7PK4j2k9J3L2k0
5442Ak3L2Rl0J0K8j4l1J5K3k7mK6ok5%L6j1k9J3K5k3j0K6ok5OJ9j3j8K3J4l4j0
5476c3L7j3j5J6J7j5j7K7pj3MK1mk5K4K2k7nK1Pk5RJ4j9k0L0Pj9pJ4Ol5J4K9k8
5511hj6K7Qk3JL0k4j6K3Ok1j5K9Oj8NJ6j7oJ6Kk0J1K1nk1kK5qj8J8J1k6J2K5j6
5547A2k5L5pj6nK2j6j3J7J8k5k7M8j1j9rL5j1k5K2J8k4k4L9%l2NK8rmJ5J2k1j2
5581iK5j0j9NK2k1lK3pj5J0K0j5k1L6rj7oL2rk2J5Ok0jK3J4j8j3K7j4k0J6J1k3
$$ y = [8, -28, -8, 9, -8, -8, 12, 13, -10, -6, 17, 11, -7, -4, 27, -7, -10, 24, 24, -13, -6, 30, 15, -21, 12, 16, 1, -8, 26, 13, 3, 7, 28, 6, -22, 21, 21, -7, -14, 20, 10, -14, 7, 16, -16, -22, 10, 4, -17, -9, 14, -4, -15, 15, 17, -9, -11, 16, 13, -21, 14, 21, -4, -2, 20, 18, -6, 2, 20, 1, -16, 12, 21, -6, -11, 26, 20, -19, -2, 34, -2, -6, 8, 33, -5, -12, 25, 13, -21, 0, 15, -5, -10, -3, 21, -12, -9, 8, 5, -27, -2, 13, -14, -7, 17, 5, -24, -11, 21, 1, -22, 10, 19, -11, -1, 27, 13, -18, -3, 20, -7, -11, 15, 9, -16, -16, 20, 9, -20, -7, 18, -5, -15, 11, 5, -20, -14, 5, -8, -26, -3, 11, -23, -33, 4, -9, -24, -8, 9, -6, -23, 4, -3, -16, -12, 9, 5, -20, 4, 26, -1, -6, 15, 22, -3, 6, 20, 1, -19, 11, 18, -1, -8, 6, 12, -23, -9, 20, -8, -24, 3, 11, -12, -11, 19, -5, -21, 2, 8, -13, -28, 1, 7, -11, -6, 10, -7, -13, 3, 5, -15, -4, 17, 12, -9, -11, 14, 6, -12, 6, 17, -9, 3, 28, 12, -13, 22, 15, -1, -6, 16, 0, -13, 4, 22, -3, -30, 18, 7, -12, -21, 14, 3, -22, 0, 18, -6, -30, 9, 9, -23, -18, 10, 1, -3, 12, 24, 3, -9, 16, 6, -13, -8, 14, -7, -10, 13, 6, -9, 1, 21, 6, -15, 21, 12, -5, -11, 21, 12, -10, 5, 11, -9, -10, 13, 27, 9, -4, 23, 9, -11, 5, 16, -7]
5616gk7L2K2l0qK1nj1KL0j4rPNqj2K7j1qJ0J4j6mJ5Lk1J7Qk0lK3nk2NK6j8j7Q
5654aK5j7k1K1J2l1RK0j9j1K1Ok6lJ3Ok4K1J0j6lPJ2k2NJ5rpJ2J5j4lJ4Kj4%L1
5691C6l7j2K1Nj7lJ0Jl4L4J1k4lJ2Oj5rK4j4j1K2%k5OJ9J8m3J7J9j9j1J9KpoK5
5727A7j3qMK0mj5K0j8qJ1J1j7JPJ0j7KJ2qk5NK0j3k0L8kk8J1J8jk3J1J9k6OPK
5764Fj5NJ7rj8K3Pk2jK8nk5KK6j2k0K2Nj7KJ7ok2OL3k4mOLk0OQlj9J3J3j8rL6
$$ y = [-7, -34, -2, 20, -10, -18, 3, -2, -13, -11, 19, 5, -4, 3, 8, 0, -12, 15, 4, -4, 6, 20, 4, 0, 15, 18, -3, 14, 22, 2, -1, 22, 17, -5, 0, 26, 8, -9, -1, 24, 7, -14, 7, 19, -12, -3, 17, -2, -13, 8, 14, -12, -15, -2, 4, -20, 1, 11, -5, -8, -1, 11, -11, -6, 9, 0, -7, 5, 20, 6, 3, 17, 19, 5, 5, 36, -1, -13, 8, 13, -4, -7, 3, 4, -30, 4, 15, -9, -12, 0, 6, -9, -18, 6, -8, -19, 3, 3, -22, -16, 3, 21, -22, -5, 14, -5, -16, 3, 5, -2, -8, 17, 4, -4, 0, 20, 16, 1, 21, 3, -5, 6, 17, 0, 1, 8, 18, 1, 3, 15, 7, -18, -13, 7, -6, -26, 12, 10, -18, -7, 11, 10, -13, -2, 17, -9, -3, 4, 6, -9, -4, 13, 4, -14, 9, 16, -6, -7, 21, 16, -9, -7, 19, 7, -13, 9, 14, -3, -1, 16, 10, -12, -6, 27, 3, -1, 5, 8, -12, -6, 2, -1, -20, -7, 6, -12, -21, 15]
$$ [...]
8191c
##END NTUPLES=NMR FID
##END=
