##TITLE=1H_LY-NV1*
 aceton-d6
 8 sc, 
 11.02.2022
##JCAMPDX= 6.0         $$ Bruker NMR JCAMP-DX V2.0
##DATA TYPE= NMR FID
##DATA CLASS= NTUPLES
##ORIGIN= UXNMR, Bruker Analytische Messtechnik GmbH
##OWNER= root
$$ XWIN-NMR		Version 3.5
$$ Fri Feb 11 13:11:06 2022 Russian Standard Time (UT+4h)  she@DPX200
##.OBSERVE FREQUENCY= 200.1305
##.OBSERVE NUCLEUS= ^1H
##.DELAY= (6, 6)
##.ACQUISITION MODE= SIMULTANEOUS
##.ACQUISITION SCHEME= undefined
##.AVERAGES= 8
##.DIGITISER RES= 18
##SPECTROMETER/DATA SYSTEM= spect
##.PULSE SEQUENCE= zg30
##.SOLVENT NAME= Acetone
##.SHIFT REFERENCE= (INTERNAL, Acetone, 0, 15.7039)
##AUDIT TRAIL= $$ (NUMBER, WHEN, WHO, WHERE, WHAT)
$$ ##TITLE= Audit trail, XWIN-NMR		Version 3.5
$$ ##JCAMPDX= 5.01
$$ ##ORIGIN= Bruker BioSpin GmbH
$$ ##OWNER= she
$$ F:/spectra/data/she/nmr/H-F/1/audita.txt
$$ ##AUDIT TRAIL=  $$ (NUMBER, WHEN, WHO, WHERE, WHAT)
(   1,<2022-02-11 13:08:57.46 +0400>,<she>,<DPX200>,
      <created by zg, POWCHK disabled, PULCHK disabled
       configuration hash MD5:
       00 E9 B6 7A A2 85 ED C7 34 08 36 98 17 FE 4E 26
       data hash MD5: 16K
       95 A9 4B 10 7E 7A E9 22 D2 DE FA CC C1 5C B1 54>)
$$ ##END=
$$ 
$$ hash MD5
$$ 65 F5 2A 11 70 0A C3 5E 43 87 FB 6E 30 E9 B1 3A
##$RELAX= 
##$RELAX= 
##$RELAX= 
##$RELAX= 
##$RELAX= 
##$RELAX= 
$$ Bruker specific parameters
$$ --------------------------
##$DU= <F:/spectra>
##$EXPNO= 1
##$NAME= <H-F>
##$PROCNO= 1
##$TYPE= <nmr>
##$USER= <she>
##$AMP= (0..31)
100 100 100 100 100 100 100 100 100 100 100 100 100 100 100 100 100 100 
100 100 100 100 100 100 100 100 100 100 100 100 100 100 
##$AQSEQ= 0
##$AQ_mod= 1
##$AUNM= <au_zg>
##$AUTOPOS= <>
##$BF1= 200.13
##$BF2= 200.13
##$BF3= 200.13
##$BF4= 200.13
##$BF5= 200.13
##$BF6= 200.13
##$BF7= 200.13
##$BF8= 200.13
##$BYTORDA= 1
##$CFDGTYP= 0
##$CFRGTYP= 5
##$CHEMSTR= <none>
##$CNST= (0..31)
1 1 145 1 1 1 1 1 1 1 1 1 1 1 1 1 1 1 1 1 1 1 1 1 1 1 1 1 1 1 1 1 
##$CPDPRG= <>
##$CPDPRG1= <>
##$CPDPRG2= <>
##$CPDPRG3= <>
##$CPDPRG4= <mlev>
##$CPDPRG5= <mlev>
##$CPDPRG6= <mlev>
##$CPDPRG7= <mlev>
##$CPDPRG8= <mlev>
##$CPDPRGB= <>
##$CPDPRGT= <>
##$D= (0..31)
0 1.2 0 0 0 0 0 0 0 0.06 0 0.03 0 0 0 0 0.0002 0 0 0 0 0 0 0 0 0 0 0 0 
0 0 0 
##$DATE= 1644570536
##$DBL= (0..7)
120 120 120 120 120 120 120 120 
##$DBP= (0..7)
150 150 150 150 150 150 150 150 
##$DBP07= 0
##$DBPNAM0= <>
##$DBPNAM1= <>
##$DBPNAM2= <>
##$DBPNAM3= <>
##$DBPNAM4= <>
##$DBPNAM5= <>
##$DBPNAM6= <>
##$DBPNAM7= <>
##$DBPOAL= (0..7)
0.5 0.5 0.5 0.5 0.5 0.5 0.5 0.5 
##$DBPOFFS= (0..7)
0 0 0 0 0 0 0 0 
##$DE= 6
##$DECBNUC= <off>
##$DECIM= 32
##$DECNUC= <off>
##$DECSTAT= 4
##$DIGMOD= 1
##$DIGTYP= 9
##$DL= (0..7)
0 120 120 120 120 120 120 120 
##$DP= (0..7)
150 150 150 150 150 150 150 150 
##$DP07= 0
##$DPNAME0= <>
##$DPNAME1= <>
##$DPNAME2= <>
##$DPNAME3= <>
##$DPNAME4= <>
##$DPNAME5= <>
##$DPNAME6= <>
##$DPNAME7= <>
##$DPOAL= (0..7)
0.5 0.5 0.5 0.5 0.5 0.5 0.5 0.5 
##$DPOFFS= (0..7)
0 0 0 0 0 0 0 0 
##$DQDMODE= 0
##$DR= 18
##$DS= 0
##$DSLIST= <SSSSSSSSSSSSSSS>
$$ [...]
##$SUBNAM2= <"">
##$SUBNAM3= <"">
##$SUBNAM4= <"">
##$SUBNAM5= <"">
##$SUBNAM6= <"">
##$SUBNAM7= <"">
##$SUBNAM8= <"">
##$SUBNAM9= <"">
##$SW= 18.0518050122584
##$SWIBOX= (0..15)
0 0 2 0 0 0 0 0 0 0 0 0 0 0 0 0 
##$SW_h= 3612.71676300578
##$TD= 16384
##$TD0= 1
##$TE= 0
##$TE2= 300
##$TE3= 300
##$TEG= 300
##$TL= (0..7)
0 120 120 120 120 120 120 120 
##$TP= (0..7)
150 150 150 150 150 150 150 150 
##$TP07= 0
##$TPNAME0= <>
##$TPNAME1= <>
##$TPNAME2= <>
##$TPNAME3= <>
##$TPNAME4= <>
##$TPNAME5= <>
##$TPNAME6= <>
##$TPNAME7= <>
##$TPOAL= (0..7)
0.5 0.5 0.5 0.5 0.5 0.5 0.5 0.5 
##$TPOFFS= (0..7)
0 0 0 0 0 0 0 0 
##$TUNHIN= 0
##$TUNHOUT= 0
##$TUNXOUT= 0
##$USERA1= <user>
##$USERA2= <user>
##$USERA3= <user>
##$USERA4= <user>
##$USERA5= <user>
##$V9= 5
##$VALIST= <valist>
##$VCLIST= <CCCCCCCCCCCCCCC>
##$VD= 0
##$VDLIST= <DDDDDDDDDDDDDDD>
##$VPLIST= <PPPPPPPPPPPPPPP>
##$VTLIST= <TTTTTTTTTTTTTTT>
##$WBST= 1024
##$WBSW= 4
##$XGAIN= (0..3)
0 0 0 0 
##$XL= 0
##$YL= 0
##$YMAX_a= 5937
##$YMIN_a= -17312
##$ZGOPTNS= <>
##$ZL1= 120
##$ZL2= 120
##$ZL3= 120
##$ZL4= 120
##$ABSF1= 10
##$ABSF2= 0
##$ABSG= 5
##$ABSL= 3
##$ALPHA= 0
##$AQORDER= 0
##$ASSFAC= 0
##$ASSFACI= 0
##$ASSFACX= 0
##$ASSWID= 0
##$AUNMP= <proc_1d>
##$AZFE= 0.1
##$AZFW= 0.1
##$BCFW= 1
##$BC_mod= 2
##$BYTORDP= 1
##$COROFFS= 0
##$CY= 11.3945322036743
##$DATMOD= 1
##$DC= 2
##$DFILT= <>
##$DTYPP= 0
##$F1P= 2.36226072786647
##$F2P= -0.459571619588291
##$FCOR= 0.5
##$FTSIZE= 0
##$FT_mod= 4
##$GAMMA= 1
##$GB= 0.15
##$INTBC= 1
##$INTSCL= 1
##$ISEN= 128
##$LB= 0.24
##$LEV0= 0
##$LPBIN= 0
##$MAXI= 10000
##$MC2= 0
##$MEAN= 0
##$ME_mod= 0
##$MI= 1.114404
##$NCOEF= 0
##$NC_proc= 0
##$NLEV= 6
##$NOISF1= 3.799351
##$NOISF2= 2.8
##$NSP= 1
##$NTH_PI= 0
##$NZP= 0
##$OFFSET= 15.70392
##$PC= 1
##$PHC0= -16312.02
##$PHC1= 3.200787
##$PH_mod= 1
##$PKNL= yes
##$PPARMOD= 0
##$PSCAL= 0
##$PSIGN= 0
##$REVERSE= no
##$SF= 200.130013532006
##$SI= 16384
##$SIGF1= 3
##$SIGF2= 2
##$SINO= 400
##$SIOLD= 16384
##$SREGLST= <1H.CDCl3>
##$SSB= 0
##$STSI= 0
##$STSR= 0
##$SW_p= 3612.71676300578
##$SYMM= 0
##$S_DEV= 0
##$TDeff= 0
##$TDoff= 0
##$TI= <>
##$TILT= no
##$TM1= 0
##$TM2= 0
##$TOPLEV= 0
##$USERP1= <user>
##$USERP2= <user>
##$USERP3= <user>
##$USERP4= <user>
##$USERP5= <user>
##$WDW= 1
##$XDIM= 8192
##$YMAX_p= 0
##$YMIN_p= 0
$$ End of Bruker specific parameters
$$ ---------------------------------
##NTUPLES= NMR FID
##VAR_NAME=  TIME,          FID/REAL,        FID/IMAG
##SYMBOL=    X,             R,               I
##VAR_TYPE=  INDEPENDENT,   DEPENDENT,       DEPENDENT
##VAR_FORM=  AFFN,          ASDF,            ASDF
##VAR_DIM=   8192,          8192,            8192
##UNITS=     SECONDS,       ARBITRARY UNITS, ARBITRARY UNITS
##FACTOR=    0.0002768,     1,               1
##FIRST=     0,             0,               0
##LAST=      2.2672688,     0,               0
##MIN=       0,             -17312,          0
##MAX=       2.2672688,     5937,            0
$$ Real data points
##PAGE= N=1
##DATA TABLE= (X++(R..R)), XYDATA
$$ [...]
$$ plain form
74 3963 5660 3273 3612 5816 3236 -953 -2259 -2575 -4931 -6536 -4994 -2712 -3012 -3062 -162 1737 68
91 68 324 3336 3235 1328 3383 5544 3469 2290 4059 3374 948 1334 2348 1026 92 512 167 -985
109 -985 -1953 -2635 -2831 -3158 -3449 -2031 -56 192 613 2402 2581 1386 1801 2183 395 -1042 -1274 -2531
127 -2531 -3961 -4145 -4472 -5105 -4937 -4566 -3909 -2126 -456 591 2535 4223 4108 4321 5357 4518 2818
144 2818 2651 2080 148 -575 -350 -1243 -2031 -1671 -1464 -1412 -858 -403 101 765 773 880 1712 1518 539 792 968
165 968 -352 -777 -177 -1212 -2706 -2563 -2751 -3842 -3639 -2825 -2992 -2853 -1789 -1073 -350 889 1668 2118
183 2118 2784 2854 2676 3064 2846 1848 1538 1201 -152 -825 -689 -1492 -2172 -1636 -1443 -1610 -667 253 321 964
203 964 1801 1697 1801 2215 1628 850 714 -37 -1163 -1379 -1779 -2864 -3118 -2829 -3136 -2960 -1994 -1604 -1281 -184
$$ packed form
74C963J697k387L39K204k580m189j306l16k356j605J542K282l00n0K900J899j669
91F8K56L012j01j907K055K161k075j179J769o85k426L86J014j322r34M20l45j152
109i85r68o82j96l27k91J418J975K48M21J789J79j195M15L82j788j437k32j257
127b531j430j84l27o33J68L71O57J783J670J047J944J688j15K13J036q39j700
144B818j67n71j932p23K25q93p88L60K07N2N54M55N04O64QJ07Q32j94r79K53J76
165I68j320m25O00j035j494J43j88j091K03Q14j67J39J064P16P23J239P79M50
183B118O66P0j78L88k18r98l10l37j353o73J36q03o80N36J93j67R43R20O8O43
203I64Q37j04J04M14n87p78j36p51j126k16m00j085k54K89l07J76R66L90L23J097
$$ plain form
223 -184 646 1197 2223 2821 2688 2881 2812 2010 1696 1522 338 -578 -638 -1380 -2141 -1566 -1224 -1621 -1064 -72
243 -72 -33 314 1321 1489 1303 1656 1662 1184 1081 763 -18 -415 -818 -1553 -1732 -1732 -2347 -2466 -1913 -1952 -1914 -858
265 -858 -288 -362 505 1458 1421 1811 2619 2355 1860 2029 1697 876 617 142 -881 -1343 -1564 -2005 -1847 -1352 -1293
286 -1293 -870 74 459 891 1928 2228 1890 2139 2074 1102 596 382 -713 -1605 -1665 -2107 -2621 -2246 -1986 -2079
306 -2079 -1485 -733 -464 198 980 1043 1227 1761 1629 1389 1657 1344 572 475 293 -470 -650 -589 -1202 -1492 -1085
327 -1085 -1146 -1173 -460 -134 -175 463 1057 1113 1562 2046 1685 1387 1423 808 94 -73 -700 -1612 -1805 -1974 -2424 -2176
349 -2176 -1658 -1590 -1119 -115 302 739 1633 1871 1643 1939 1945 1283 1049 870 -25 -640 -690 -1148 -1549 -1292 -1293 -1478
371 -1478 -1020 -543 -410 170 739 722 1019 1522 1413 1337 1627 1201 511 476 130 -683 -861 -912 -1644 -1934 -1580
$$ packed form
223a84Q30N51J026N98j33J93o9q02l14j74j184r16o0p42p61N75L42l97N57R92
243g2L9L47J007J68j86L53Om78j03l18p81l97m03p35j79%o15j19N53l9L8J056
265h58N70p4Q67R53l7L90Q08k64m95J69l32q21k59m75j023m62k21m41J58M95N9
286a293M23R44L85M32J037L00l38K49o5r72n06k14j095q92o0m42n14L75K60r3
306b079N94P52K69O62P82O3J84N34j32k40K68l13p72r7j82p63j80O1o13k90M07
327a085o1k7P13L26m1O38N94N6M49M84l61k98L6o15p14j67o27r12j93j69m50K48
349b176N18O8M71J004M17M37Q94K38k28K96Oo62k34j79q95o15n0m58m01K57jj85
371a478M58M77J33N80N69j7K97N03j09p6K90m26o90l5l46q13j78n1p32k90L54
$$ plain form
392 -1580 -1642 -1620 -920 -498 -336 348 950 1127 1590 1884 1591 1499 1457 807 281 122 -617 -1343 -1281 -1402 -1805 -1448
414 -1448 -985 -1066 -691 143 410 680 1326 1438 1285 1519 1453 998 917 655 -110 -421 -461 -1040 -1332 -1075 -1340
435 -1340 -1652 -1166 -804 -829 -278 359 418 713 1292 1376 1428 1614 1317 900 784 264 -369 -479 -849 -1585 -1569 -1306
457 -1306 -1639 -1488 -678 -491 -414 489 1130 1068 1424 1797 1458 1155 1116 719 218 -125 -664 -1066 -1178 -1473 -1588
478 -1588 -1173 -1116 -1247 -560 78 15 430 1227 1105 875 1409 1511 942 913 925 247 -243 -299 -647 -1038 -1126 -1317
500 -1317 -1389 -1155 -1044 -818 -171 111 188 843 1326 1135 1305 1663 1190 680 785 404 -403 -622 -833 -1446 -1584
521 -1584 -1342 -1370 -1173 -694 -496 -162 495 779 930 1435 1510 1145 1233 1271 656 289 237 -357 -913 -865 -998 -1326
543 -1326 -1177 -1046 -1118 -771 -354 -205 263 731 691 893 1358 1198 926 1152 900 141 7 -56 -767 -1156 -1046
$$ packed form
392a580o2K2P00M22J62O84O02J77M63K94k93r2m2o50n26j59p39p26O2j21m03L57
414a448M63q1L75Q34K67K70O46J12j53K34o6m55q1k62p65l11m0n79k92K57k65
435a340l12M86L62k5N51O37N9K95N79Q4N2J86k97m17j16n20o33j10l70p36J6K63
457a306l33J51Q10J87P7R03O41o2L56L73l39l03l9l97n01l43n39m02j12k95j15
478a588M15N7j31O87O38o3M15P97j22k30N34J02n69k9J2o78m90n6l48l91q8j91
500a317p2K34J11K26O47K82P7O55M83j91J70L58m73n10J05l81q07k19k11o13j38
521a584K42k8J97M79J98L34O57K84J51N05P5l65Q8L8o15l67n2n94n56M8j33l28
543a326J49J31p2L47M17J49M68M68m0K02M65j60k72K26k52p59j34o3p11l89J10
$$ plain form
564 -1046 -1307 -1558 -1199 -888 -769 -328 94 377 853 1175 1269 1493 1499 993 808 803 160 -385 -337 -711 -1376 -1211
586 -1211 -943 -1237 -1095 -495 -397 -307 317 687 714 970 1111 984 984 925 617 488 255 -315 -534 -523 -947 -1209
608 -1209 -924 -1011 -1252 -785 -336 -378 -11 626 676 814 1299 1340 1120 1154 901 391 196 -92 -643 -861 -1003 -1412
630 -1412 -1402 -1036 -998 -830 -193 108 211 790 1191 1093 1203 1335 972 689 629 195 -278 -419 -767 -1152 -1041
651 -1041 -1014 -1160 -882 -547 -608 -298 278 386 462 935 998 780 971 1028 622 458 382 -77 -365 -393 -726 -990
673 -990 -937 -1028 -1088 -707 -430 -356 114 520 529 844 1301 1187 1039 1200 873 323 230 -23 -640 -880 -948 -1318 -1345
696 -1345 -1053 -1006 -851 -384 -124 73 610 892 877 1095 1162 812 729 725 261 -101 -122 -524 -930 -810 -822 -1051 -854
719 -854 -546 -599 -309 200 305 453 860 923 878 1115 1072 726 616 420 -109 -319 -380 -811 -1045 -935 -1097 -1166
$$ packed form
564a046k61k51L59L11J19M41M22K83M76L22R4K24On06j85no43n45M8l74o65J65
586a211K68k94J42O00R8R0O24L70K7K56J41j27%n9l08j29k33n70k19J1m24k62
608a209K85q7k41M67M49m2L67O37N0J38M85M1k20L4k53n10j95k88n51k18j42m09
630a412J0L66L8J68O37L01J03N79M01r8J10J32l63k83o0m34m73j41l48l85J11
651a041K7j46K78L35o1L10N76J08P6M73O3k18J91N7m06j64p6m59k88k8l33k64
673i90N3r1o0L81K77P4M70M06RL15M57j14j48J61l27n50r3k53o17k40o8l70k7
696a345K92M7J55M67K60J97N37K82j5K18O7l50q3mm64l62k1m02m06J20j2k29J97
719h54L08n3K90N09J05J48M07O3m5K37m3l46j10j96n29k10o1m31k34J10j62o9
$$ plain form
741 -1166 -759 -521 -457 -15 386 413 700 1074 964 855 949 661 295 259 -19 -476 -593 -710 -1035 -969 -726 -787
763 -787 -644 -223 -106 37 534 731 691 953 1060 807 792 815 402 95 18 -368 -735 -693 -849 -1110 -964 -829
785 -829 -861 -538 -81 33 280 710 776 811 1091 1015 704 651 433 -68 -259 -357 -791 -995 -882 -991 -964 -568 -359
808 -359 -275 154 460 505 822 1074 907 861 922 585 280 272 -9 -424 -474 -597 -901 -816 -678 -803 -693 -373 -312
831 -312 -143 277 415 421 711 801 630 750 777 411 211 160 -264 -560 -541 -771 -1053 -882 -788 -833 -511 -105 -13
854 -13 286 709 812 906 1160 1055 784 728 459 3 -140 -329 -781 -913 -856 -1020 -978 -583 -464 -384 63 320
876 320 348 647 894 734 700 776 530 292 279 10 -327 -361 -522 -770 -651 -595 -740 -593 -330 -338 -153 278 369
899 369 396 740 818 686 807 810 457 287 219 -170 -440 -461 -718 -954 -841 -804 -818 -485 -193 -122 193 541 569 727
$$ packed form
741a166M07K38O4M42M01K7K87L74j10j09R4k88l66l6k78m57j17j17l25O6K43o1
763g87J43M21J17J43M97J97m0K62J07k53j5K3m13l07p7l86l67M2j56k61J46J35
785h29l2L23M57J14K47M30O6L5K80p6l11n3k18n01j91r8m34k04J13j09K7L96K09
808c59Q4M29L06M5L17K52j67m6O1l37l05qk81m15n0j23l04Q5J38j25J10L20O1
831c12J69M20J38OK90R0j71J20K7l66k00n1m24k96J9k30k82J71R4m5L22M06R2
854a3K99M23J03R4K54j05k71n6k69m56j43j89m52j32N7j64M2L95J19Q0M47K57
876C20K8K99K47j60l4P6k46k38j3k69l37l4j61k48J19N6j45J47K63qJ85M31R1
899C69K7L44P8j32J21Ll53j70o8l89k70k1k57k36J13L7j4L33K92P1L15L48K8J58
$$ plain form
923 727 991 841 640 662 432 30 -58 -218 -629 -734 -691 -858 -835 -548 -490 -416 -55 150 240 573 757 662 755
946 755 820 555 449 468 134 -186 -209 -428 -738 -672 -662 -823 -693 -422 -390 -169 200 316 416 709 773 706 833
969 833 743 404 288 153 -233 -410 -415 -700 -879 -687 -665 -707 -374 -130 -110 153 468 500 617 805 686 548 579
992 579 378 121 89 -116 -464 -518 -552 -783 -727 -506 -567 -533 -179 -29 22 374 597 562 710 838 672 596 567 264
1016 264 -10 -107 -389 -634 -625 -735 -888 -704 -516 -487 -202 193 267 398 743 784 685 801 704 366 226 101 -245
1039 -245 -405 -463 -685 -782 -636 -639 -582 -287 -147 -113 177 394 361 528 722 554 474 567 391 153 161 17 -302 -344
1063 -344 -396 -608 -622 -518 -602 -549 -294 -194 -70 269 405 402 652 762 590 612 605 254 21 -40 -337 -622 -631 -714
1087 -714 -886 -716 -527 -481 -196 106 205 400 695 716 692 812 656 371 318 173 -163 -270 -312 -576 -666 -535
$$ packed form
923G27K64j50k01K2k30m02q8j60m11j05M3j67K3K87N8P4L61K05R0L33J84r5R3
946G55O5k65j06J9l34l20k3k19l10O6J0j61J30K71L2K21L69J16J00K93O4o7J27
969H33r0l39j16j35l86j77nk85j79J92K2m2L33K44K0K63L15L2J17J88j19j38L1
992E79k01k57l2k05l48n4l4k31N6K21o1L4L54J50N1L52K23l5J48J28j66p6k9l03
1016B64k74r7k82k45Rj10j53J84J88K9K85L95P4J31L45M1r9J16r7l38j40j25l46
1039b45j60n8k22r7J46lN7K95J40L4K90K17l3J67J94j68q0R3j76k38Qj44l19m2
1063c44n2k12j4J04q4N3K55J00J24L39J36lK50J10j72K2pl51k33o1k97k85rq3
1087g14j72J70J89M6K85L02R9J95K95K1k4J20j56k85n3j45l36j07m2k64r0J31
$$ plain form
1109 -535 -571 -559 -307 -201 -167 97 285 281 463 606 482 488 571 382 221 231 3 -293 -317 -407 -648 -636 -545 -639 -560
1134 -560 -289 -202 -54 267 415 449 675 736 609 615 567 248 81 5 -303 -505 -473 -635 -771 -570 -455 -440 -198
1157 -198 72 104 266 534 547 542 671 563 372 364 221 -55 -137 -227 -505 -555 -482 -609 -610 -389 -355 -333 -31 153 198
1182 198 434 616 527 575 668 488 326 305 61 -220 -271 -414 -636 -594 -549 -641 -493 -227 -152 13 306 401 436 639
1206 639 667 524 520 442 162 26 -34 -282 -437 -401 -538 -643 -469 -413 -441 -230 -51 -64 116 356 344 388 552 460
1230 460 352 420 328 92 51 -63 -341 -420 -421 -580 -600 -439 -432 -385 -96 70 171 429 609 568 656 730 526 393
1254 393 331 21 -235 -288 -451 -671 -606 -589 -660 -496 -240 -177 -3 287 329 376 548 553 429 429 369 131 71 12 -201
1279 -201 -289 -280 -433 -493 -341 -354 -383 -185 -75 -116 81 304 299 384 573 510 420 484 391 159 95 -43 -316 -415 -464 -648
$$ packed form
1109e35l6J2K52J06L4K64J88mJ82J43j24OQ3j89j61J0k28k96k4r0k41J2R1r4P9
1134e60K71Q7J48L21J48L4K26O1j27Om8l19j67p6l08k02L2j62j36K01J15J5K42
1157a98K70L2J62K68J3nJ29j08j91qj43k76q2r0k78n0P3j27jK21L4K2L02J84M5
1182A98K36J82q9M8R3j80j62k1k44k81n1j43k22M2M5r2J48K66P5J65K93R5L5K03
1206F39K8j43mp8k80j36o0k48j55L6j37j05J74N6k8K11J79j3J80K40j2M4J64r2
1230D60j08O8r2k36m1j14k78p9jj59k0J61PM7K89J66J01K58J80m1Q8P4k04j33
1254C93o2l10k56n3j63k20O5J7p1J64K56O3J74K90M2M7J72Nj24%o0k38o0n9k13
1279b01q8Rj53o0J52j3k9J98J10m1J97K23nQ5J89o3r0O4r3k32o4j38k73r9m9j84
$$ plain form
1305 -648 -642 -536 -550 -436 -150 -25 84 380 512 455 583 665 458 343 323 51 -178 -212 -365 -537 -503 -488 -529
1328 -529 -369 -204 -168 26 215 239 334 533 498 416 500 419 189 175 140 -123 -231 -231 -413 -521 -439 -444 -492 -347 -231
1353 -231 -195 3 194 243 390 527 435 443 516 329 137 113 -79 -352 -372 -377 -581 -561 -389 -407 -319 -54 89 158 357
1378 357 479 456 550 543 385 325 268 16 -95 -104 -295 -447 -376 -442 -565 -394 -268 -307 -176 46 64 150 356 395 374
1403 374 482 450 313 297 203 -22 -102 -188 -420 -480 -409 -506 -509 -280 -202 -157 108 322 340 482 623 527 489 498 322 129
1429 129 51 -143 -360 -376 -451 -584 -501 -395 -437 -302 -58 -38 29 256 307 262 375 428 285 270 269 114 4 -3 -140
1454 -140 -254 -249 -346 -420 -320 -292 -322 -142 2 19 180 418 404 436 593 521 353 371 258 -18 -132 -233 -466 -562
1478 -562 -513 -575 -563 -396 -301 -203 53 202 254 421 503 417 422 450 253 112 104 -77 -260 -227 -281 -399 -343 -260 -301 -199
$$ packed form
1305f48OJ06j4J14K86J25J09K96J32n7J28Q2k07j15k0k72k29l4j53j72L4J5m1
1328e29J60J65L6J94J89K4R5J99l5q2Q4q1k30j4l5k63j08%j82j08Q2nm8J45J16
1353b31L6J98J91M9J47J37r2QP3j87j92k4j92k73k0nk04K0J72j8Q8K65J43O9J99
1378C57J22k3R4pj58o0n7k52j11rj91j52P1o6j23J71J26l9J31K22J8Q6K06L9k1
1403C74J08l2j37j6r4k25q0q6k32o0P1r7lK29P8M5K65K14J8J42J41r6l8Rj76j93
1429A29p8j94k17j6p5j33Q3J06m2J35K44K0O7K27N1m5J13N3j43j5jj55j10pj37
1454a40j14Nr7p4J00K8l0J80J44J7J61K38j4L2J57p2j68J8j13k76j14j01k33r6
1478e62M9o2J2J67R5R8K56J49N2J67Q2q6NK8j97j41qj81j83L3n4j18N6Q3m1J02
$$ plain form
1504 -199 -20 -9 75 249 282 275 416 425 316 340 327 142 58 27 -173 -311 -331 -450 -558 -462 -450 -455 -284 -142 -87 108
1530 108 317 329 414 532 441 346 371 243 -9 -61 -135 -345 -370 -314 -379 -371 -200 -139 -81 134 247 260 386 451 375 396
1556 396 391 228 141 124 -75 -217 -193 -313 -470 -416 -383 -475 -384 -228 -246 -137 78 145 201 375 427 367 422 395 239
1581 239 174 120 -97 -207 -220 -386 -444 -327 -318 -323 -114 30 67 229 407 390 423 504 386 288 264 114 -86 -140 -248
1606 -248 -418 -417 -403 -502 -448 -305 -302 -256 -56 22 30 200 294 270 341 400 297 259 267 130 23 17 -130 -265 -248 -280 -364 -254
1634 -254 -158 -178 -60 154 187 273 456 463 395 437 387 194 101 10 -213 -336 -385 -521 -554 -467 -461 -423 -226 -122 -67 139
1660 139 279 245 321 415 330 259 307 201 45 35 -35 -182 -182 -182 -276 -249 -158 -179 -127 36 57 86 246 292 273 374 397
1687 397 272 243 240 47 -97 -120 -275 -424 -423 -466 -541 -436 -335 -322 -164 10 75 192 372 367 349 430 365 225 206
$$ packed form
1504a99J79J1Q4J74L3pJ41Rj09K4j3j85q4l1k00j38k0j19j08R6J2nJ71J42N5J95
1530A08K09J2Q5J18r1r5K5j28k52n2p4k10k5N6o5QJ71O1N8K15J13J3J26O5p6K1
1556C96nj63q7j7j99j42K4j20j57N4L3r2R1J56j8J09K15O7N6J74N2o0N5k7j56
1581B39o5n4k17j10j3j66n8J17RnK09J44L7J62J78j7L3Q1j18r8k4j50k00n4j08
1606b48j70JJ4r9N4J43LM6K00P8QJ70R4k4P1N9j03l8Qj37j07oj47j35J7l2q4J10
1634b54R6k0J18K14L3Q6J83Po8M2n0j93r3r1k23j23m9j36l3Q7OL8J97J04N5K06
1660A39J40l4P6R4q5p1M8j06j56j0p0j47%%r4K7R1k1N2J63K1K9J60M6j9J01K3
1687C97j25k9lj93j44k3j55j49Jm3p5J05J01J3J58J74O5J17J80nj8Q1o5j40j9
$$ plain form
1712 206 128 -75 -139 -142 -273 -295 -211 -229 -228 -73 0 30 177 259 241 315 375 287 271 292 130 18 2 -117 -278 -284 -338
1739 -338 -460 -440 -367 -403 -326 -153 -111 -16 166 237 261 401 413 314 312 301 121 33 13 -157 -290 -244 -282 -337 -226 -135
1765 -135 -120 6 151 180 270 366 343 332 356 247 140 128 8 -166 -176 -217 -376 -396 -317 -388 -403 -258 -205 -194 -29
1790 -29 85 95 202 303 300 318 371 272 204 182 44 -74 -93 -187 -308 -277 -243 -294 -205 -50 -31 40 252 318 297 405
1816 405 409 291 258 205 21 -88 -143 -310 -385 -375 -437 -452 -331 -276 -260 -93 24 34 148 274 243 248 324 271 186 204
1842 204 148 12 -10 -47 -173 -178 -170 -248 -237 -133 -136 -110 52 112 111 251 338 278 302 343 222 133 108 -31 -176 -222 -315 -415
1870 -415 -400 -402 -416 -296 -176 -161 -12 164 186 245 389 366 276 322 284 109 44 28 -115 -207 -182 -224 -286 -200 -170 -154 -45
1897 -45 31 53 166 233 212 253 302 207 153 194 70 -70 -82 -139 -313 -320 -293 -374 -362 -267 -247 -182 -46 38 88 212 306 281
$$ packed form
1712B06p8k03o4lj31k2Q4j8JJ55P3L0J47Q2j8P4O0q8j6K1j62j12j6j19j61on4
1739c38j22K0P3l6P7J73M2R5J82P1K4J40J2r9kj1j80q8k0j70j33M6l8n5J11R1
1765a35J5J26J45K9R0R6k3j1K4j09j07j2j20j74j0m1j59k0P9p1j5J45N3J1J65
1790b9J14J0J07J01lJ8N3r9o8k2j38j18j9r4j21L1L4n1Q9J55J9P1K12O6k1J08
1816D05Mj18l3n3j84j09n5j67p5J0o2j5J21N5J6J67J17J0J14J26l1NP6n3q5J8
1842B04n6j36k2l7j26nQp8J1J04lK6J62O0jJ40Q7o0K4M1j21q9k5j39j45m6r3j00
1870d15J5kj4J20J20J5J49J76K2N9J44k3r0M6l8j75o5j6j43r2K5m2o2Q6L0J6J09
1897d5P6K2J13O7k1M1M9r5n4M1j24j40j2n7j74pK7q1J2R5K0O5J36Q4N0J24R4k5
$$ plain form
1925 281 347 355 255 214 182 42 -67 -74 -176 -280 -233 -228 -285 -188 -92 -80 16 138 160 217 298 279 225 259 190 65 37 -20
1953 -20 -174 -233 -216 -325 -373 -280 -285 -298 -167 -73 -54 65 193 189 261 327 303 270 285 167 72 54 -81 -212 -196 -217 -329
1980 -329 -281 -177 -193 -139 30 96 102 246 295 255 276 279 181 119 66 -59 -139 -157 -264 -318 -274 -283 -314 -189 -133 -145 -30 90
2008 90 91 144 264 248 217 282 257 154 140 94 -24 -73 -101 -201 -244 -214 -258 -244 -142 -98 -63 74 159 167 254 342 273 257
2036 257 272 146 26 -8 -112 -251 -270 -311 -381 -316 -258 -255 -158 -19 22 87 232 267 230 300 303 181 158 142 18 -67 -63
2063 -63 -176 -230 -197 -222 -246 -159 -123 -124 -22 64 65 130 228 183 180 265 214 117 124 77 -66 -100 -130 -233 -278 -237 -289 -288 -187 -144
2093 -144 -106 28 115 136 249 308 258 285 302 177 86 81 -26 -172 -162 -220 -320 -275 -204 -221 -158 -36 11 60 182 211
2119 211 206 262 240 187 173 133 0 -30 -48 -178 -224 -197 -247 -289 -201 -170 -180 -68 25 38 115 216 201 217 265 223 161 161 93
$$ packed form
1925B81O6Qj00m1l2j40j09pj02j04M7Nn7R7R6J2R6J22K2N7Q1j9n4L4o9j25k8n7
1953b0j54n9J7j09m8R3nj3J31R4J9J19J28mP2O6k4l3J5j18r5j8j35j31J6k1j12
1980c29M8J04j6N4J69O6OJ44M9m0K1Lr8o2n3j25q0j8j07n4M4rl1J25N6j2J15J20
2008I0JN3J20j6l1O5k5j03j4m6j18m9k8j00m3L0m4J4J02M4L5J37Q5QQ7Q8o9j6
2036B57J5j26j20l4j04j39j9m1p0O5N8LR7J39M1O5J45L5l7P0Lj22k3j6j24q5M
2063f3j13n4L3k5k4Q7L6jJ02Q6JO5R8m5lQ5n1r7Pm7j43l4l0j03m5M1n2JJ01M3
2093a44L8J34Q7K1J13N9n0K7J7j25r1nj07j46J0n8j00M5P1j7O3J22M7M9J22K9
2119B11nN6k2n3j4m0j33l0j8j30m6K7n0m2Q8L1j0J12R3J3P7J01j5J6M8m2o2%o8
$$ plain form
2148 93 -25 -52 -92 -210 -239 -200 -257 -246 -136 -106 -90 31 112 118 218 260 202 226 243 127 73 63 -48 -140 -118 -189 -266
2175 -266 -231 -199 -239 -177 -68 -54 0 127 145 162 242 246 199 216 189 78 48 2 -119 -174 -170 -244 -277 -206 -206 -202 -84 0 7 114
2205 114 220 206 234 296 240 177 166 76 -31 -73 -128 -225 -234 -212 -246 -220 -141 -132 -63 53 95 100 197 236 188 203 220 127 90 74
2235 74 -20 -97 -101 -157 -215 -186 -191 -222 -151 -92 -93 -19 82 95 123 225 229 198 237 204 108 93 46 -72 -124 -144 -227 -265 -213 -229 -215
2266 -215 -102 -36 -13 96 193 172 217 279 229 165 173 94 -27 -57 -114 -212 -211 -218 -251 -220 -146 -139 -82 34 60 87 194 202 170 220
2296 220 218 139 111 114 16 -61 -50 -113 -205 -159 -163 -219 -169 -114 -100 -37 42 64 109 202 204 176 232 194 106 97 47 -83 -117 -132 -232
2327 -232 -260 -211 -212 -211 -102 -48 -21 90 175 170 222 261 213 172 188 94 11 2 -71 -159 -155 -167 -232 -202 -141 -158 -111 -26 -1 37 134
2358 134 149 141 199 198 126 131 120 16 -33 -33 -129 -202 -182 -199 -240 -184 -134 -133 -43 37 64 133 211 213 202 229 191 116 97 38 -62 -94
$$ packed form
2148I3j18k7m0j18k9L9n7J1J10L0J6J21Q1OJ00M2n8K4J7j16n4j0j11r2K2p1p7
2175b66L5L2m0O2J09J4N4J27J8J7Q0Mm7J7k7j11l0m6j21n5Mp4l3P1%MJ18Q4PJ07
2205A14J06j4K8O2n6o3j1r0j07m2n5r7rK2l4K6P9RO9J16M2NR7L9m8J5J7r3l7j6
2235G4r4p7mn6n8K9nl1P1N9jP4J01J3K8J02Ml1L9l3r6j5m7j18n2k0q3l8N2j6J4
2266b15J13O6K3J09R7k1M5O2n0o4Qp9j21l0n7r8Jpl3L1P4PN7J16K6K7J07Ql2N0
2296B20kp9k8Lr8p7J1o3r2M6mn6N0N5J4O3P9K2M5R3Kk8N6l8q8rn0j30l4j5j00
2327b32k8M9jJJ09N4K7J11Q5nN2L9m8m1J6r4q3rp3q8Mj2o5L0O1j7M7Q5K5L8R7
2358A34J5qN8jp2Nj1j04m9%r6p3K0j7m1N6N0JR0Q0K7O9P8Kj1K7l8p5j9n9j00l2
$$ plain form
2390 -94 -118 -201 -223 -159 -204 -178 -94 -55 -58 56 109 106 164 203 156 156 162 101 42 22 -33 -118 -109 -143 -221 -184 -142 -182 -124 -54 -31 4
2422 4 107 143 139 206 224 178 175 160 61 7 -22 -111 -182 -179 -220 -251 -192 -156 -144 -55 24 42 118 201 187 178 216 172 98 89 37 -61 -81
2455 -81 -112 -183 -192 -153 -186 -164 -87 -64 -44 52 80 85 153 189 139 150 184 109 66 71 -1 -72 -82 -113 -186 -178 -166 -191 -149 -91 -77 -16
2487 -16 76 101 136 208 211 158 192 176 58 21 4 -109 -176 -145 -193 -241 -170 -142 -128 -40 22 43 121 173 166 190 222 151 101 115
2517 115 47 -47 -44 -76 -157 -165 -138 -181 -180 -108 -95 -92 -4 43 47 129 166 143 181 196 131 117 98 9 -53 -49 -116 -193 -162 -152 -207 -148 -72
2550 -72 -68 -4 86 115 134 205 219 162 171 140 53 26 -6 -102 -135 -137 -190 -210 -164 -157 -149 -66 -14 -7 56 114 106 140 183 147 115 133 79 29
2584 29 15 -16 -106 -112 -120 -172 -169 -117 -128 -93 -13 14 39 119 180 163 181 220 149 116 102 21 -42 -71 -132 -203 -184 -188 -215 -157 -85 -77 -8
2617 -8 67 87 116 178 178 149 162 139 65 45 16 -61 -86 -80 -134 -158 -106 -125 -127 -55 -19 -35 34 99 74 115 176 132 123 151 95 43 32
$$ packed form
2390i4k4q3k2O4m5K6Q4L9lJ14N3lN8L9m7%Oo1n9k0n5q5Rl4p8L7M2m0N8P0K3L5
2422DJ03L6mO7J8m6lj5r9n4k9q9p1Lm1l1N9L6J2Q9P9J8P6Q3j4rL8m4p4rn2r8k0
2455h1l1p1rL9l3K2P7K3K0R6K8NO8L6n0J1L4p5m3Np2p1j0l1p3QJ2k5M2N8J4O1
2487a6R2K5L5P2Ln3L4j6j18l7j7j13o7L1m8m8P1K8J4Q8O2K1P8N2pK4L2p1n0J4
2517A15o8r4Ll2q1qK7m3JP2J3LQ8M7MQ2L7k3L8J5o5j4j9q9o2Mo7p7L1J0n5N9P6
2550g2MO4R0K9J9P1J4n7Rl1q7k7l2r6l3kn3k0M6PQQ3N2PO3N8qL4M3l6l2J8n4n0
2584B9j4l1r0oqn2LN2j1L5Q0K7K5Q0O1j7J8L9p1l3j4q1o3k9o1p1J9mk7N8P2QO9
2617hP5K0K9O2%k9J3k3p4k0k9p7k5On4k4N2j9kP2L6j6O9O5k5M1O1m4rK8n6n2j1
$$ plain form
2650 32 -16 -109 -120 -137 -195 -199 -166 -161 -138 -43 -12 16 121 145 150 193 214 155 137 125 31 -28 -38 -122 -177 -152 -165 -176 -113 -65 -79
2681 -79 7 79 81 111 165 146 122 153 116 43 44 24 -55 -70 -72 -141 -155 -129 -148 -153 -99 -71 -61 16 62 65 120 176 139 156 176 121 65
2714 65 53 7 -75 -87 -111 -174 -169 -134 -152 -119 -44 -6 25 95 136 131 178 174 128 118 92 8 -27 -32 -111 -155 -130 -155 -179 -128 -106 -96
2746 -96 -33 19 14 73 123 115 121 155 151 105 113 80 3 -18 -46 -113 -142 -126 -154 -163 -105 -88 -62 22 61 68 144 168 141 146 160 83 39 40 -40
2781 -40 -103 -105 -132 -194 -155 -134 -145 -107 -25 -12 10 89 116 105 153 145 113 122 96 28 19 12 -63 -92 -88 -119 -148 -121 -113 -121 -72 -15 -19 34 92
2816 92 102 114 164 144 116 123 87 9 -12 -47 -133 -159 -149 -177 -192 -123 -107 -72 16 54 85 142 182 164 166 164 104 48 57 -18 -78 -77 -122
2849 -122 -160 -132 -108 -130 -86 -28 -25 -2 71 69 74 112 123 89 102 82 49 36 23 -34 -63 -70 -129 -148 -115 -122 -144 -76 -41 -34 37 98 105
2882 105 141 174 167 131 133 84 20 -2 -53 -131 -144 -140 -190 -158 -116 -107 -75 11 36 62 127 143 117 129 132 80 40 51 -9 -52 -54 -95 -126
$$ packed form
2650C2m8r3j1j7n8mL3NK3R5L1K8J05K4NM3K1n9j8j2r4n9j0q4n5K5j3j1O3M8j4
2681g9Q6P2KL0N4j9k4L1l7p3Jk0p9j5ko9j4K6j9nN4K8J0P7M6LN5N6l7J7K0n5n6
2714F5j2m6q2j2k4o3NL5j8L3P5L8L1P0M1nM7mm6j0k6q4l5np9m4K5k5k4N1K2J0
2746i6O3N2nN9N0qOL4mm6Ql3p7k1k8o7k9J6k8rN8J7K6Q4L9PP6K4k7NJ4p7m4Jq0
2781d0o3kk7o2L9K1j1L8Q2J3K2P9K7j1M8ql2Rk6o8rpp5k9Ml1k9K7QqM9N7mN3N8
2816I2J0J2N0k0k8Pl6p8k1l5q6k6J0k8j5O9J6L5Q8L8L1N7M0j8Kko0n6Rp5o0Jm5
2849a22l8K8K4k2M4N8LK3P3kNL8J1l4J3k0l3j3j3n7k9pn9j9L3pk2O8L5PP1O1P
2882A05L6L3pl6Km9o4k2n1p8j3Mn0L2M2RL2Q6K5K6O5J6k6J2Ln2m0J1o0m3km1l1
$$ plain form
2915 -126 -105 -109 -125 -97 -52 -62 -20 40 52 74 124 125 114 141 126 77 61 37 -35 -63 -73 -126 -153 -120 -134 -137 -77 -39 -31 37 86 93
2947 93 122 161 124 109 124 66 1 -19 -49 -106 -119 -105 -150 -133 -94 -94 -74 -5 12 33 91 112 100 123 136 95 93 90 29 -20 -10 -69
2979 -69 -108 -108 -123 -158 -123 -89 -86 -47 17 31 71 134 132 124 159 126 74 66 40 -43 -72 -84 -134 -161 -127 -134 -129 -67 -21 -19 62 97 91 119 155
3014 155 113 89 104 59 10 8 -31 -87 -75 -80 -129 -110 -84 -104 -67 -19 -17 -10 66 67 66 109 123 91 96 103 50 10 5 -58 -103 -106 -130 -159 -133
3049 -133 -103 -102 -51 6 15 75 128 144 133 172 142 93 76 44 -41 -52 -65 -122 -136 -110 -114 -110 -40 -28 -15 45 65 69 106 127 95 98 96
3082 96 49 37 32 -18 -65 -43 -71 -107 -103 -88 -116 -92 -46 -32 -6 53 67 65 107 126 90 112 109 51 18 -1 -50 -95 -77 -107 -128 -106
3114 -106 -89 -82 -24 29 30 76 123 113 118 136 113 73 79 32 -37 -36 -60 -113 -117 -109 -126 -122 -73 -68 -59 -1 28 32 75 114 99 110 111 86 47 52
3150 52 8 -36 -37 -75 -116 -106 -95 -130 -80 -26 -32 1 81 82 95 134 141 117 122 98 44 16 -21 -86 -103 -93 -139 -152 -110 -110 -109 -50 -18 -5
$$ packed form
2915a26K1mj6K8M5j0M2O0J2K2N0Jj1K7j5m9j6k4p2k8j0n3k7L3j4lO0L8QO8M9P
2947I3K9L9l7j5J5n8o5k0l0n7j3J4m5J7L9%K0O9J7K1N8K1j2K3J3m1klo1m9J0n9
2979f9l9%j5l5L5L4LL9O4J4M0O3kqL5l3n2qk6q3k9j2n0k7L4pNO2M6KQ1L5oK8L6
3014A55m2k4J5m5m9kl9n6J2nm9J9K6k0L7M8KPP6JjM3J4l2NPn3m0no3m5lk4k9K6
3049a33L0JN1N7RO0N3J6j1L9l0m9j7l2q5j1j3n7j4K6mMP0J2J3O0K0ML7K1l2Lk
3082I6m7j2nn0m7K2k8l6MJ5k8K4M6J4K6N9J4kM2J9l6K2ln8l3j9m9m5J8l0k1K2
3114a06J7PN8N3JM6M7j0NJ8k3m0Om7o9Jk4n3mQj7MM9NRN8K9MM3L9j5J1Jk5l9N
3150E2m4m4jl8m1J0J1l5N0N4oL3Q0JJ3L9Pk4Nk4n4k8l7o5j7J0m6j3M2%JN9L2J3
$$ plain form
3184 -5 43 80 67 86 110 97 69 72 40 -6 -3 -25 -72 -67 -63 -96 -75 -47 -51 -34 21 34 40 89 125 106 130 138 92 72 68 10 -44 -52 -103
3219 -103 -146 -130 -140 -149 -118 -83 -86 -28 38 38 58 104 110 93 110 94 44 25 7 -46 -60 -47 -82 -84 -52 -55 -62 -5 16 13 70 92 73 89
3253 89 124 104 89 94 59 8 5 -28 -84 -75 -94 -143 -132 -104 -122 -107 -45 -28 -19 54 79 71 113 113 82 83 83 23 -10 -10 -58 -96 -78 -82 -88 -56
3289 -56 -29 -20 23 63 74 102 132 124 92 114 90 48 27 5 -43 -66 -69 -108 -133 -121 -118 -127 -79 -55 -57 -4 31 30 62 80 76 81 92 54 33
3324 33 25 4 -49 -46 -45 -91 -78 -58 -57 -42 13 30 49 85 111 105 132 114 88 87 65 11 -12 -29 -83 -111 -114 -124 -143 -113 -94 -104 -50 1
3358 1 11 35 67 67 70 98 79 47 58 28 -5 -9 -20 -64 -62 -57 -74 -63 -18 -13 -1 43 68 72 90 128 111 108 110 75 37 31 -23 -75 -93 -94
3394 -94 -143 -134 -106 -126 -102 -51 -49 -11 42 58 62 86 95 57 74 56 24 -2 -1 -39 -58 -52 -56 -67 -35 -17 -29 14 43 45 68 105 98 88 117
3429 117 103 64 68 37 -14 -28 -25 -93 -106 -110 -128 -130 -93 -90 -89 -21 2 12 56 90 77 93 108 72 54 46 4 -28 -26 -49 -85 -68 -58 -64
$$ packed form
3184eM8L7j3J9K4j3k8Ll2m6Lk2m7NMl3K1K8mJ7N5J3OM9L6j9K4Qm6k0mn8n4qn1
3219a03m3J6j0rL1L5lN8O6%K0M6Oj7J7j6n0j9j8n3j4J3l5kL2lpN7K1lN7K2j9J6
3253H9L5k0j5Nl5n1ll3n6Rj9m9J1K8j8J5O2J7RP3K5qM2%l1J%o0l3%m8l8J8moL2
3289e6K7RM3M0J1K8L0ql2K2k4m2k1k2m8k3ll9k5J2LrM8K4kN3L5jL2J8mNJ1l8k1
3324C3qk1n3LJm6J3K0JJ5N5J7J9L6K6oK7j8k6jk2n4k3j7n4k8lj0j9L0J9j0N4N1
3358AJ0K4L2%LK8j9l2J1l0l3mj1m4KNj7J1M5NJ2M4K5MJ8L8j7lKl5l8on4n2j8j
3394i4m9RK8k0K4N1KL8N3J6MK4Rl8J7j8l2k6Jl8j9Omj1L2J8j2M3K9KK3L7pj0K9
3429A17j4l9Ml1n1j4Lo8j3mj8kL7LJO8K3J0M4L4j3J6J5l6j8qm2l2Kk3l6J7J0o
$$ plain form
3463 -64 -36 5 6 33 74 82 75 117 108 82 91 72 23 7 -7 -48 -84 -77 -88 -111 -101 -98 -90 -63 -31 -27 15 53 48 75 105 74 81 79 58 6
3499 6 20 -8 -49 -60 -48 -67 -82 -36 -31 -9 17 42 46 93 105 86 109 104 65 50 39 -17 -46 -40 -69 -117 -95 -95 -108 -88 -58 -64 -27 11
3533 11 29 36 69 77 68 77 68 34 31 19 -20 -37 -22 -53 -78 -62 -58 -59 -29 12 3 34 70 72 82 104 93 82 68 49 8 -8 -34 -90 -78
3568 -78 -96 -108 -107 -78 -88 -59 -8 -4 14 66 78 72 81 86 52 48 44 6 -16 -14 -32 -70 -44 -65 -72 -36 -18 -37 0 35 32 42 85 77 62 89
3604 89 75 43 38 22 -25 -36 -65 -89 -102 -93 -99 -97 -65 -34 -9 13 56 50 80 114 83 78 90 62 18 21 -10 -55 -57 -65 -70 -64 -55 -52 -25 6 12
3641 12 17 58 65 60 83 76 50 42 44 10 -21 -22 -42 -77 -63 -79 -92 -66 -50 -49 -34 8 16 28 63 67 68 86 85 56 57 42 -15 -9 -27 -56 -88
3678 -88 -67 -76 -92 -48 -45 -37 8 39 40 73 88 83 78 88 45 18 22 -25 -54 -53 -69 -89 -85 -56 -58 -41 -8 -5 18 56 54 60 76 80 70 63 76 20
3716 20 1 3 -39 -46 -50 -59 -75 -57 -51 -66 -27 5 -2 23 64 49 55 85 62 46 39 30 -9 -17 -23 -62 -74 -53 -70 -70 -31 -30 -22 27 39 53 65
$$ packed form
3463f4K8M1JK7M1QpM2rk6Rj9m9j6j4m1l6Pj1k3J0LQK7L2MM2L8nK7L0l1Pkk1n2
3499FJ4k8m1j1J2j9j5M6NK2K6K5MM7J2j9K3nl9j5j1n6k9Ok9m8K2%j3K0L0oL7L8
3533A1J8PL3QrRrl4lj2l9j7J5l1k5J6MjL0M1rL1L6KJ0K2j1j1j4j9m1j6k6n6J2
3568g8j8j2JK9j0K9N1MJ8N2J2oRNl4mml8k2Kj8l8K6k1pL6J8j9L7L5lJ0M3qj5K7
3604H9j4l2nj6m7j1k9k4j3RoKL2L1K5K2M3oL0L4l1nJ2k8m4Ll1m5kqnORLK7L1O
3641A2NM1PnK3pk6qKl4l1jk0l5J4j6j3K6J6JJ5M2QJ2L5MJJ8jk9Jj5n7Oj8k9l2
3678h8K1rj6M4LQM5L1JL3J5nnJ0m3k7Mm7k9Jj6k0MK9kJ7L3LK3L8kOJ6Mj0pJ3n6
3716B0j9Km2pmrj6J8Oj5L9L2pK5M1j5OL0k3j6prl9qol9j2K1j7%L9JQM9J2J4J2
$$ plain form
3753 65 85 74 78 81 44 37 24 3 -21 -26 -41 -66 -66 -59 -69 -56 -29 -28 -6 33 34 34 70 72 59 66 65 46 18 3 -33 -55 -50 -70 -80 -54 -55
3790 -55 -59 -16 19 18 51 74 73 84 95 68 55 50 37 -10 -12 -29 -58 -64 -52 -68 -55 -36 -45 -35 9 4 12 47 56 47 38 59 36 31 43 14 -13
3827 -13 -18 -29 -53 -52 -54 -56 -47 -36 -27 3 32 36 50 85 84 78 77 79 37 26 19 -27 -45 -61 -69 -91 -66 -67 -68 -26 -10 -5 37 61 48 67 83 63
3865 63 54 62 33 10 -1 -12 -49 -39 -40 -53 -54 -29 -22 -17 15 18 25 47 64 43 66 63 56 46 51 17 -8 -16 -39 -67 -52 -60 -77 -63 -40 -47 -26
3902 -26 -1 18 30 59 77 67 87 73 43 40 25 -11 -34 -29 -63 -68 -48 -50 -58 -17 0 5 41 54 56 69 74 63 38 59 40 7 1 -19 -47
3937 -47 -45 -55 -77 -65 -55 -52 -40 -14 -12 4 40 46 52 72 79 62 60 60 28 9 6 -28 -48 -47 -51 -68 -38 -29 -39 -10 26 19 40 71 71 63 69 55
3975 55 21 32 7 -14 -17 -29 -48 -56 -56 -57 -51 -33 -27 -24 7 26 36 54 74 53 59 75 55 25 45 10 -17 -22 -30 -56 -61 -33 -62 -45 -19 -2
4011 -2 10 53 40 51 77 81 55 50 58 15 -4 -10 -45 -65 -54 -60 -68 -48 -37 -25 1 10 20 36 55 60 56 75 65 40 37 32 -4 -2 -14 -34 -35
$$ packed form
3753F5K0j1MLl7pj3k1k4nj5k5%Pj0J3K7JK2L9J%L6Kj3Pjj9k8j5l6k2Nk0j0K6j
3790e5mM3L5jL3K3jJ1J1k7j3nj3m7kj7k9oJ2j6J3J9rJ0M4nQL5RrrK1k3nJ2k9k7
3827a3nj1k4JkkRJ1RL0K9MJ4L5jojKm2j1pm6j8j6qk2K5jjM2J6NM2K4j3J9J6k0
3865F3rQk9k3j1j1l7J0jj3jK5PNL2LPK2J7k1K3lpj0Nl4k5qk3k8J5qj7J4K3pK1
3902b6K5J9J2K9J8j0K0j4l0lj5l6k3Nl4nK0kqM1J7NL6J3KJ3Nj1k5K1j9l3ok0k8
3937d7Kj0k2J2J0LJ2K6KJ6L6OOK0Pj7k%l2j9ll4k0Jmj7L0Rj0K9L6pK1L1%qOj4
3975E5l4J1k5k1lj2j9q%jOJ8OLL1J9J0J8K0k1OJ6k0l0K0l5k7nqk6nK8k9J7K6J7
4011bJ2M3j3J1K6Mk6nQm3j9ol5k0J1oqK0J1J2K6RJ0J6J9NmJ9j0k5lnl6Kj2k0j
$$ plain form
4048 -35 -30 -46 -41 -28 -26 -23 0 14 21 36 52 46 39 58 46 29 25 -1 -28 -25 -38 -73 -66 -54 -62 -45 -24 2 2 46 44 60 79 78 67 71 52 24
4086 24 18 -8 -29 -49 -41 -57 -65 -44 -36 -41 -19 4 6 22 34 32 36 42 36 28 39 18 -4 -8 -16 -40 -42 -30 -50 -55 -38 -28 -34 5 1 14 43 72 65
4125 65 69 82 58 41 50 17 -17 -17 -29 -57 -51 -54 -58 -47 -22 -26 -9 17 26 29 52 57 37 46 45 20 17 12 -23 -26 -23 -40 -42 -40 -39 -54 -14 -3 -2 13
4165 13 44 43 48 58 63 60 60 33 22 7 -8 -29 -50 -46 -53 -66 -50 -54 -39 -16 -4 6 32 45 35 62 50 40 32 28 6 -13 -22 -29 -48 -35
4201 -35 -46 -54 -41 -15 -14 1 29 30 39 50 51 40 55 56 20 29 23 2 -7 -29 -44 -53 -47 -42 -57 -32 -26 -25 1 18 2 29 46 46 41 44 32 14 11
4240 11 -13 -30 -41 -40 -47 -48 -34 -49 -27 -1 5 21 52 61 44 64 51 36 35 39 -6 -10 -14 -35 -58 -36 -41 -51 -32 -36 -24 -18 8 4 18 37 30
4277 30 26 39 41 32 29 22 -3 3 -13 -21 -43 -46 -36 -43 -25 -12 -8 16 26 35 57 69 68 65 59 38 24 12 -11 -40 -41 -40 -60 -59 -33 -44 -32 -5 -1
4316 -1 11 33 44 25 39 45 39 42 39 17 13 5 -7 -31 -12 -32 -41 -23 -23 -17 -17 12 3 21 48 52 49 60 61 46 46 26 -1 -8 -20 -47 -58 -41 -58
$$ packed form
4048c5Nj6NJ3KLK3J4PJ5J6opJ9j2j7mk6k7Lj3l5PJ2qJ7K1K6%M4kJ6J9jj1Mj9k8
4086B4ok6k1k0Qj6qK1QnK2K3KJ6J2kMOoqJ1k1k2mqk4kJ2k0nJ7J0oL9mJ3K9K9p
4125F5MJ3k4j7Rl3l4%j2k8OlmJ1K5mJ7K6RLK3Nk0Rjk5lnl5lLj7kKJj5M0J1JJ5
4165A3L1jNJ0Nl%k7j1j5j5k1k1Mpj3J6mJ5K3J2J0K6J3j0K7j2j0qmk2j9rpj9J3
4201c5j1qJ3K6JJ5K8JRJ1Jj1J5Jl6Rok1rk2j5rONj5K5OJK6J7j6K7J7%nLj2j8l
4240A1k4j7j1JpjJ4j5K2K6OJ6L1Rj7K0j3j5jMm5mmk1k3K2nj0J9mJ2OK6mJ4J9p
4277C0mJ3Krlpk5Oj6qk2lJ0pJ8J3MK4J0RK2J2jlok1j4j2k3k9jJk0JK6j1J2K7M
4316aJ2K2J1j9J4OoLlk2mqj2k4J9k0rJ8%O%K9rJ8K7MlJ1Jj5%k0k7pj2k7j1J7j7
$$ plain form
4355 -58 -55 -29 -25 -21 -4 19 30 38 47 47 41 46 30 17 21 8 -10 -14 -20 -25 -41 -24 -35 -19 -13 -10 -7 14 18 23 41 44 34 40 42 29 15 11 -14 -26 -24
4396 -24 -36 -46 -48 -42 -51 -30 -24 -13 0 30 38 42 63 53 34 51 37 14 -10 2 -33 -35 -30 -42 -46 -38 -26 -17 2 17 17 28 53 38 40 30 8
4433 8 19 6 -12 -26 -22 -29 -47 -38 -45 -45 -43 -15 -24 -14 12 9 21 35 33 47 41 39 39 27 23 8 -11 -17 -28 -44 -32 -43 -47 -16 -16 -8 7 28 26 32
4473 32 45 43 31 24 10 -4 -14 -33 -34 -43 -40 -52 -51 -34 -27 -22 4 15 20 27 35 43 41 53 35 22 35 16 -3 4 -13 -34 -23 -33 -47 -29 -20 -25
4511 -25 -28 1 9 19 31 41 42 33 34 16 7 4 -11 -30 -38 -50 -46 -45 -39 -47 -17 -1 -7 20 26 24 37 48 40 36 46 27 18 8 -1 -15 -20 -25 -32 -48 -34
4552 -34 -35 -39 -9 -14 -3 13 29 16 33 47 37 25 40 4 -4 -14 -20 -38 -39 -41 -57 -43 -25 -38 -6 -3 4 29 41 49 39 50 44 33 35 23
4588 23 0 -11 -22 -31 -44 -40 -47 -48 -30 -24 -16 -9 20 8 21 35 33 27 25 8 1 8 -4 -19 -10 -27 -35 -45 -30 -22 -32 -14 -6 -10 10 30 17 35 43
4627 43 41 37 42 24 2 16 -22 -34 -21 -43 -42 -47 -52 -36 -34 0 -6 14 32 36 35 45 35 23 13 15 -17 -22 -26 -28 -24 -26 -30 -30 -28 -17 -7 10 13 16 24
$$ packed form
4355e8LK6MMJ7K3J1QR%oNj6j3Mj3j8monj6J7j1J6OLLK1MNJ8Lj0OKj3j4mk5j2K
4396b4j2j0kOrK1OJ1J3L0QMK1j0j9J7j4k3k4J2l5kNj2mQJ2RJ9J5%J1K5j5Kj0k2
4433HJ1j3j8j4Mpj8Rp%KK8rJ0K6lJ2J4kJ4ok%j2mj5j9oj1j6J2j1mL1%QJ5K1kO
4473C2J3kj2pj4j4j0j9jrLj2JJ7PNK6J1NPQQkJ2j8j3J3j9j9Pj7k1J1j0j4J8Rn
4511b5lK9QJ0J2J0JrJj8rlj5j9qj2MJOqL0J6oK7OkJ3J1qmJ0j9rj0rj4nnpj6J4
4552c4jmL0nJ1J6J6j3J7J4j0j2J5l6qj0oj8jkj6J4J8j3L2LPK5J2Qj0J1oj1Kj2
4588B3k3j1j1rj3MpjJ8OQPK9j2J3J4kokj7pPj2j5Rj7qj0J5Qj0J8QmK0K0j3J8Q
4627D3kmNj8k2J4l8j2J3k2JnnJ6KL4oK0J8MjJ0j0j2j0Kl2nmkMkm%KJ1J0J7LLQ
$$ plain form
4668 24 47 34 31 41 28 15 28 1 -13 -15 -27 -41 -39 -33 -32 -47 -19 -20 -15 13 15 18 28 38 28 29 26 12 -6 3 -15 -32 -21 -21 -33 -17 -26
4705 -26 -23 -6 4 3 17 34 33 22 37 34 17 26 17 10 7 -8 -26 -42 -28 -44 -37 -34 -36 -23 -14 3 9 24 37 21 37 48 30 12 17 17 -12 -13
4743 -13 -20 -40 -24 -28 -25 -24 -9 -9 -2 12 13 14 31 30 26 23 28 15 8 0 -6 -23 -21 -37 -45 -22 -37 -35 -19 -8 -15 6 16 10 31 28 41 34 32 25 12 16 0
4786 0 -15 -16 -18 -35 -36 -31 -26 -25 -9 6 6 19 33 18 28 35 33 19 20 10 -14 -13 -30 -48 -41 -38 -44 -29 -25 -23 -14 11 27 20 42 38 26 41 32 13 12
4827 12 14 -1 -4 -9 -23 -25 -19 -30 -31 -3 -13 -17 6 6 8 10 21 30 16 28 19 4 1 -4 -18 -18 -25 -37 -52 -29 -34 -19 -19 -6 -1 16 36 33 45 51 43
4868 43 35 35 8 5 3 -14 -29 -25 -28 -32 -36 -19 -27 -22 -4 5 -1 17 28 26 30 26 20 6 10 -9 -17 -11 -27 -30 -31 -27 -29 -15 -7 -16 -8 13 19 26 36 30 32 34 20 18
4914 18 24 15 -5 -27 -17 -33 -25 -32 -27 -15 -11 -12 3 11 13 3 30 25 15 14 29 11 -6 -10 -9 -18 -24 -18 -28 -17 -16 -11 -18 6 12 23 36 30 40 35 40 20
4956 20 26 29 6 0 -7 -14 -29 -16 -37 -43 -16 -27 -17 -9 -5 1 5 23 24 30 25 16 11 11 0 -13 -10 -18 -39 -35 -23 -25 -22 -3 0 4 22 28 28 41 35 30 33 35 10
$$ packed form
4668B4K3j3lJ0j3j3J3k7j4kj2j4KOJj5K8jNK8KLJ0J0j0Jlj4j8Rj8j7J1%j2J6r
4705b6LJ7J0jJ4J7jj1J5lj7Rrplj5j8j6J4j6PLkJ3RJ7OJ5J3j6J6J1j8j8N%k9j
4743a3pk0J6mLJJ5%PJ4JJJ7jmlNj3pqoj7Kj6qK3j5KJ6J1pK1J0oK1lJ3pkpj3Mj6
4786@j5jkj7jNNJJ6J5%J3J4j5J0Pkj4Jj0k4Jj7j8PLoJ5MKRK5J6pK2mj2J5rj9j
4827A2Kj5lnj4kOj1jK8j0mK3%KKJ1Rj4J2rj5lnj4%pj2j5K3nJ5%J3NJ7K0lJ2Oq
4868D3q%k7lkj7j5MlmmJ7qNJ8RoJ8J1kMmoj4Mj9qOj6ljMkJ4QrQK1OPJ0oKKj4k
4914A8Ork0k2J0j6QpNJ2MjJ5QKj0K7nj0jJ5j8j7mJroOj0J1JNpK4OJ1J3oJ0nNk0
4956B0OLk3oppj5J3k1oK7j1J0QMOMJ8JOnrn%j1j3Lqk1MJ2kLJ9LMJ8O%J3onLKk5
$$ plain form
5001 10 18 9 -3 -16 -13 -25 -40 -26 -23 -29 -30 -18 -14 -11 9 12 20 28 29 22 20 20 11 5 -6 -23 -29 -17 -32 -35 -17 -19 -18 3 29 20 20 52 36 33 34 31 15
5044 15 8 -3 -17 -14 -30 -34 -33 -28 -39 -37 -21 -15 -17 1 -6 7 6 24 20 24 22 13 17 10 1 -8 -15 -16 -13 -19 -18 -29 -4 8 2 15 31 29 28 30 43 29 32 20
5088 20 3 4 -8 -16 -30 -26 -25 -44 -34 -37 -32 -24 -17 -2 18 23 15 19 31 20 11 22 12 -3 -7 -2 -22 -14 -13 -18 -12 -6 -2 -2 18 8 24 21 23 10 21 32
5130 32 14 4 7 -12 -9 -20 -36 -32 -30 -37 -26 -21 -26 -33 -8 0 6 10 30 25 22 25 23 12 10 16 -10 -17 -9 -12 -24 -12 -18 -9 1 13 9 22 33 24 23 26 17 21
5174 21 23 -2 -12 -2 -18 -33 -25 -28 -32 -30 -29 -20 -26 -3 -3 -4 21 22 21 26 34 23 22 20 14 2 15 0 -17 -21 -10 -15 -1 3 -14 10 13 22 28 24 35 17
5216 17 27 12 -2 0 -15 -28 -29 -20 -39 -29 -24 -30 -15 -15 -10 -12 6 12 7 21 23 19 31 24 25 10 8 7 -9 -16 -16 -20 -30 -12 -21 -12 2 4 7 26 14 32
5258 32 33 23 25 8 5 -6 -8 -22 -31 -36 -38 -34 -32 -38 -16 -20 -5 10 11 17 23 29 30 29 29 7 10 16 2 -1 2 -12 -21 -11 -22 -21 -5 -2 -8 6 13 9 28 29 18
5303 18 22 12 -2 7 -3 -19 -23 -16 -27 -36 -26 -28 -31 -27 0 3 2 19 29 25 34 36 24 39 26 16 0 8 7 -18 -13 -21 -4 -5 -18 -11 6 7 -9 14
$$ packed form
5001A0Qrj2j3Lj2j5J4LojJ2MLK0LQQJpk%roj1j7oJ2j5lJ8kJK1K6r%L2j6lJlj6
5044A5pj1j4Lj6mJNj1KJ6OkJ8pJ3jJ8mMkrMprrpjLoJj1K5J2oJ3J6kjKJ3j4Lj2
5088B0j7Jj2qj4MJj9J0lNQPJ5K0NqMJ2j1rJ1j0j5mNk0QJnOOM%K0j0J6lKj3J1J1
5130C2j8j0Lj9Lj1j6MKpJ1NnpK5QOMK0nlLkj1kOk6pQlj2J2oRJ0J2mJ3J1rjLrM
5174B1Kk5j0J0j6j5QlmKJRoK3%jK5JjNQj1jkoj2J3j5j7mJ1nJ4Mj7K4LROmJ1j8
5216A7J0j5j4Kj5j3jRj9J0NoJ5%NkJ8OnJ4KmJ2pJj5kjj6p%mj0J8rRJ4KLJ9j2J8
5258C2Jj0Kj7lj1kj4rnkMKoK2mJ5J5JOOOJj%k2LOj4lLj4rJ0j1JJ6LoJ4PmJ9Jj1
5303A8Mj0j4Rj0j6mPj1rJ0klMK7LjJ7J0mRKj2J5j3j0j6Qjk5NqJ7jj3PJ7Jj6K3
$$ plain form
5343 14 25 9 10 20 17 13 17 8 5 -12 -9 -23 -17 -16 -21 -14 -15 -6 -4 4 18 10 28 28 30 36 43 21 21 26 0 -5 -1 -12 -13 -20 -22 -29 -9 1 0 2 9 11 6 17 18
5390 18 7 11 -2 -5 -4 -3 -11 -16 -15 -11 -18 -4 -15 -12 16 6 17 17 19 24 24 31 34 26 33 31 9 1 -1 -10 -19 -21 -21 -16 -12 -21 -3 8 8 8 20 22 12 6 9 10 4 9
5438 9 -12 -15 -13 -15 -22 -9 -14 -9 -6 7 13 16 30 24 22 32 29 41 34 32 24 8 1 -3 -7 -8 -25 -29 -15 -20 -22 -13 -8 6 -2 7 23 7 17 15 19 25 10 10 3 -6 -18
5485 -18 -13 -8 -14 -15 -10 -3 -20 1 14 15 31 31 20 22 26 22 17 18 11 -18 -9 -26 -19 -22 -20 -19 -25 -6 -14 -7 5 8 15 21 8 9 20 23 7 4 2 -1 5 -8 -5 -20
5531 -20 -4 -13 -10 -3 2 -5 6 32 19 27 33 23 26 18 12 8 -4 -7 -23 -29 -34 -28 -21 -16 -10 -21 -6 -5 6 14 9 16 10 15 7 8 22 -1 6 -1 -7 -11 -2 -4 -22 -11
5577 -11 -6 -7 -5 5 6 13 11 22 24 25 17 10 8 8 -11 -7 -18 -25 -32 -28 -33 -32 -1 2 -7 3 11 12 16 16 23 14 9 16 7 3 5 -10 -7 -5 -17 -3 2 -7 -3 8 1 7 27
5626 27 17 12 18 20 9 12 2 -3 5 -5 -16 -19 -24 -20 -21 -33 -18 -26 -4 -3 9 18 16 20 16 27 31 18 16 12 4 0 -1 -12 -7 -9 -7 -8 -2 -2 -3 13 12 6 20 15
5672 15 12 12 14 4 -4 -3 -18 -24 -27 -32 -15 -20 -20 -10 -9 5 1 -1 18 20 7 25 21 17 28 26 20 11 3 -1 -2 2 -4 -9 -9 -11 -14 -1 4 6 13 27 17 16 25 15 19
$$ packed form
5343A4J1j6JJ0lmMrlj7Lj4OJnPjRKQJ4qJ8%KOPk2%Nk6nMj1jpkpK0J0jKPKnJ1J
5390A8j1Mj3lJJqnJMpJ4j1LK8j0J1%KN%PLqPkk2qkrrk%NMrJ8J1%%J2Kj0oLJoN
5438Ik1lKkpJ3nNLJ3OLJ4okJ0lJ2pkqj6pmmjj7mJ4nkRNJ4qRJ6j6J0kMOj5%prj2
5485a8NNojNPj7K1J3JJ6%j1KMmnJpk9Rj7PlKJoJ9qPJ2LPOj3JJ1Lj6lklOj3Lj5
5531b0J6rLPNpJ1K6j3QOj0Lqomj2lj6onOPNOj1J5JJ1QnPoNqJJ4k3PpomRkj8J1
5577a1NjKJ0JPkJ1KJqpk%j9Mj1ppMnJL1LrJ0QJM%PrnPrmKj5LKj2J4NrMJ1pOK0
5626B7j0nOKj1Lj0nQj0j1lnMjj2J5qK2JJ2RkMmJ1Mj3kmqmjj1NkKjO%jJ6joJ4n
5672A5l%Kj0qJj5olnJ7n%J0JJ4mkJ9Kj3J8mmJ1korqmjMon%klJ3NKPJ4j0jRj0M
$$ plain form
5719 19 13 0 -10 -9 -8 -18 -24 -23 -17 -3 -14 -11 2 4 19 16 26 25 27 22 23 15 17 19 17 9 3 -12 -12 -14 -18 -23 -9 -18 -8 -12 10 5 12 20 22 9 14 5 5 5 -11
5766 -11 -24 -25 -20 -18 -26 -19 -17 -11 -1 0 -3 20 18 10 18 23 16 27 22 15 5 10 -4 -4 -6 -2 -14 -21 -2 -19 -5 -9 -4 5 5 5 2 9 6 17 18 11 -5 -8 -8 -12 -19 -25
5814 -25 -17 -17 -4 -1 -3 9 16 15 15 23 22 33 26 18 12 8 10 8 2 6 -15 -19 -15 -14 -13 -7 1 1 -2 1 11 4 12 6 -1 13 -5 0 1 -5 -11 -7 -5 -14 -13 -7 -15 -9 12 5 10 23
5866 23 29 28 17 19 16 -4 20 -3 2 1 -10 -12 -11 -15 -19 -24 -17 -13 -5 4 -7 10 17 17 13 30 10 2 5 -4 -18 -3 -12 -18 -15 -9 2 -5 0 16 16 15 22 15 24 16 14
5913 14 17 16 12 9 4 6 -6 -17 -18 -16 -18 -11 -24 -24 -9 -4 -4 -9 14 8 22 14 19 11 6 4 0 -6 -7 -9 -11 -14 -12 -1 0 -7 8 12 17 8 12 20 8 21 13 12 13 15 4
5962 4 -1 -11 -15 -19 -12 -26 -16 -21 -17 -14 -16 -3 7 7 6 19 10 9 16 10 8 -6 2 -5 -13 -10 -6 -9 -6 -8 7 7 13 22 13 16 14 22 16 23 15 11 -10 0 -13 -13 -9 -18 -13 -24
6012 -24 -21 -27 -16 -14 -8 0 11 13 8 15 17 -1 13 18 10 3 2 -5 -4 -1 -9 5 -2 3 0 -3 -6 13 11 14 11 3 10 12 11 -5 2 -9 -14 -15 -20 -22 -16 -17 -10 -14 -8 -1 7 2 18
6063 18 19 17 20 15 10 5 5 4 0 2 7 -6 -3 -1 7 2 2 3 -4 1 18 18 9 8 7 10 7 -6 3 0 -2 -16 -13 -18 -24 -21 -15 -14 -4 -4 -4 8 21 18 6 23 23 11 15 12
$$ packed form
5719A9oj3j0JJj0oJOJ4j1LJ3KJ5lJ0jKnJqKKkqoj5%kmnJ4rJ0mK2nPQKj3Nr%%j6
5766a1j3jNKqPKOJ0JlK3kqQNpJ1npj0Nj4%kMj2pJ9j7J4mNR%%lPlJ1Jpj6l%mpo
5814b5Q%J3LkJ2Pj%QjJ1pqomKkoMk1mMJJOQ%lLJ0pQopJ4j8NJooMKrJOqOK1pNJ3
5866B3Ojj1Klk0K4k3Njj1kJmmnPMQRj1J7P%mJ7k0qLrj4J5roLOJ1pNJ6%jPpRqk
5913A4LjmlnKj2j1jKkPj3%J5N%nK3oJ4qNqnkmojkklKJ1JpJ5MNrMQj2J3qjJKj1
5962Dnj0mmPj4J0nMLkJ3J0%jJ3rjPokj4QpqLMlLkJ5%ORrLkQoPqmk1J0j3%MrNj1
6012b4LoJ1KOQJ1KnPKj8J4NqpjpJLqJ4pNlllJ9kLlqPKjj6Pj1njnkOjPmOPQnJ6
6063A8JkLnnn%jmKNj3LKQn%JpNJ7%rjjLlj3Rlkj4LnoLOJJ0%%J2J3lj2J7%j2Ml
$$ plain form
6113 12 4 1 -5 1 -6 -5 3 4 -3 12 4 5 4 1 11 12 9 5 7 -1 0 -8 0 -5 -8 -2 -17 -14 -20 -15 -14 0 2 2 9 9 24 17 22 22 17 14 17 14 13 11 -1 -2 -1 -3 2 2 -9
6166 -9 -6 1 -3 5 -3 2 18 10 10 3 11 13 -8 2 -11 -4 -16 -9 -13 -9 -13 -4 -5 -8 7 19 14 25 21 24 37 30 16 10 14 14 7 6 1 6 -13 -1 -8 -4 0 -14 -3
6213 -3 8 -7 4 13 2 11 13 1 -5 -2 -6 -10 -4 -18 -9 -12 -11 -3 -16 -5 -10 7 13 29 17 22 27 21 21 16 12 13 12 -1 -8 11 -5 -12 -6 -5 -11 -2 -9 -5 1 14
6259 14 17 -5 14 3 9 10 3 3 0 0 -6 -17 -9 -6 -13 -7 2 3 1 13 14 17 18 11 23 5 4 -3 11 4 0 -2 -1 -19 -3 -1 -9 -7 -5 -9 2 -3 -8 1 -2 1 4 -6
6307 -6 9 -12 0 12 -11 0 -4 -11 -7 -6 -6 -4 -1 -6 -4 16 19 13 20 12 9 5 15 10 10 -10 2 -12 -16 -5 -12 -14 -12 -14 -12 0 0 0 -10 2 -1 0 0 5 6 4
6353 4 -9 -6 -8 -5 -5 2 -2 -15 0 7 8 4 0 16 10 10 18 27 19 7 9 2 1 4 -14 -7 -12 -16 -17 -17 -23 -13 3 -5 -7 2 5 4 3 9 6 14 10 -3 -2 -4 -5 4 -4 -1 -3 -9
6405 -9 -6 6 3 6 6 19 19 4 14 17 10 1 -1 4 -3 -5 -19 -11 -12 -23 -10 -12 -13 -17 -16 -9 -9 -3 1 8 27 19 14 14 18 10 9 2 7 -12 -4 0 -9 -8 7 3 0 10 4 7
6455 7 13 26 6 4 17 1 0 -8 2 -19 -16 -5 -10 -6 -13 -19 -15 -12 -15 3 -1 -3 -5 4 3 10 11 18 16 15 3 5 -1 -2 2 -7 0 2 7 -8 7 -4 0 16 21 8 5
$$ packed form
6113A2qloOpJQJpJ5qJjlJ0JlmKqJqQnlOj5LoNJJ4K%P%J5pN%nlLljkj2jJkN%j1
6166iLPmQqNJ6q%pQKk1J0j3Pj2PmMmRjlJ5J2nJ1mLJ3pj4oM%pjnNj9J2pMMj4J1
6213cJ1j5J1Rj1RKj2oLmmOj4RlJQj3J1nJ7OJ6j2NNo%nmJjj3pJ9j6pOJoRpMOJ3
6259A4Lk2J9j1OJp%l%oj1QLpORJkJ2JLJpJ2j8jpJ4pmkJj8J6KqKKmJ1nnRlLLj0
6307fJ5k1J2J2k3J1mpMJ%KLnKK0LoPqlmJ0n%k0J2j4mJ1pkKkKJ2%%j0J2lJ%NJk
6353Dj3LkL%Pmj3J5PJmmJ6o%QRqj2KpjLj8Pnmj%oJ0J6qkRLjjOlQmj3JkjRqLko
6405iLJ2lL%J3%j5J0LprkNpkj4Qjj1J3kjmJP%OMPJ9qn%MqjpNj9QMrJJ5mlJ0oL
6455GOJ3k0kJ3j6jqJ0k1LJ1nMpoMLlJ8mkkRjPJPkjj2KojMrPKNj5J5j1MJ6Nj3l
$$ plain form
6502 5 11 2 -2 5 -9 -2 -2 -9 -17 -9 -10 -20 1 -11 -1 3 4 1 4 3 13 21 10 10 13 14 15 8 8 1 -1 0 9 5 2 12 7 5 16 13 1 6 6 9 4 12 -3 -7 -5 -2
6552 -2 -4 0 -14 -7 -10 -16 -5 -4 -10 3 1 1 5 12 10 10 12 14 12 3 3 8 1 -10 -1 -4 -2 5 -4 -10 4 3 5 0 -2 0 0 4 -5 -6 7 -7 -5 -9 -4 -11 -11 -4 -2 -1 -6 -2 1 13
6606 13 -1 12 10 12 19 19 16 18 9 2 -5 5 0 0 -12 -14 -9 -6 -8 -1 -7 -8 4 -4 -2 -1 10 -2 -4 -7 -6 -6 7 -9 -15 -1 0 -3 -8 2 -3 -8 8 -3 12 12
6652 12 20 25 17 18 20 12 6 -4 5 -4 -15 -9 -5 -11 -16 -12 -9 -12 -1 -2 -9 -6 2 3 2 0 -8 8 -4 2 -6 7 -6 -13 -6 -8 -13 -7 3 2 9 8 17 16 24 21 14 12 11 10 14 9
6704 9 4 -8 -8 -16 -16 -1 -8 -9 -7 -8 -8 2 1 3 0 8 6 2 -2 2 3 16 13 2 2 3 -1 0 2 0 -3 8 12 16 16 22 4 8 13 21 13 20 9 7 2 -4 -11 2 -9 -7 -9
6755 -9 -5 -6 -11 -7 -4 -3 2 1 0 -7 12 2 5 8 -3 -2 8 -3 7 8 12 2 2 8 10 8 17 14 26 26 21 18 10 1 13 1 -1 -6 -12 -5 -8 -12 -4 -14 -11 -12 -2 4 6
6804 6 2 -1 2 3 3 2 10 8 13 16 8 7 2 4 14 5 12 10 14 7 8 13 18 15 16 14 11 14 -10 -1 -9 -9 -15 -7 -6 -16 -10 -13 -12 -8 0 -2 6 7 11 2 -1 0 22 22 2 9 14 -7 9
6859 9 10 0 -2 3 -10 2 1 13 8 10 8 17 7 12 10 9 3 -5 1 -7 -13 -19 -13 -16 -17 -13 -16 -12 -3 -3 -5 3 5 8 18 15 15 18 0 14 13 13 10 8 6 2 0 0 11 1 9
$$ packed form
6502EOrmPj4P%pqQjj0K1j2J0MJlLjJ0Qj1%LJJp%pkJRmlJ0nkJ1lj2N%LnQj5mKL
6552bkMj4PloJ1JoJ3k%MPk%KKkr%Npj1RlKProJ4jKnkK%MrjJ3j4KmNp%PKJnMLJ2
6606A3j4J3kKP%lKrppJ0n%j2kNLkPojJ2qKJJ1j2klJ%J3j6oJ4JlnJ0nnJ6j1J5%
6652A2QNqJKqoj0Rrj1OMonMLlJ1jpLQJjkqJ6j2OqJ3j3pPknOJ0jPjRjQlpkjjMn
6704Inj2%q%J5pjKj%J0jKlQkmmMJJ3lj1%JmJKklJ1MM%Oj8MNQqPj1knopJ3j1Kk
6755iMjnMLJNjjpJ9j0LLj1JJ0j1J0JMj0%OKkRlJ2%nlqrJ2j2knoPlmQj0LjJ0OK
6804FmlLJ%jQkNLqjnKJ0rPkMpJNNlJklLk4Rq%oQJj0OlJMQkQJMrlJK2%k0PNk1J6
6859IJj0kNj3J2jJ2nKkRj0NkjoqOqooOljMlMR%kQKLJ0l%Lj8J4j%lkkmk%J1j0Q
$$ plain form
6910 9 7 5 4 5 8 10 5 10 -7 7 -6 -2 -10 -14 0 -8 -12 -12 -18 -7 -3 -1 1 8 6 3 8 10 17 17 17 17 18 18 8 9 10 0 0 -7 7 -8 -6 -6 7 7 4 -5 4 -2 1
6961 1 -1 -4 -3 -15 -7 -8 -11 1 -14 -18 -11 -2 -6 -6 -5 2 3 12 12 14 20 9 16 8 23 8 6 18 3 -5 10 1 -3 -2 1 -8 -4 -3 4 -5 -2 3 -8 9 7 4 3 -7 -11
7010 -11 -9 -1 -9 -10 5 -7 -8 -5 1 -2 3 11 -2 20 13 6 15 19 16 5 8 0 -2 0 -3 5 -1 -8 1 -5 -14 -9 -6 -5 5 2 1 1 -8 0 11 1 0 6 -7 -11 -1 -10 -9 -4
7060 -4 6 11 0 19 7 8 9 8 25 14 27 13 19 12 10 1 4 1 -5 1 -6 -9 4 0 -1 4 10 3 6 9 10 7 -3 3 -6 -6 5 -10 -6 -7 -5 -7 -2 -2 9 11 13 4
7108 4 19 17 5 9 15 24 22 17 27 8 7 9 -10 -3 -10 0 -7 -2 -6 -6 -3 3 6 -11 14 8 12 9 13 -1 1 -1 -6 2 -7 0 7 8 3 6 -10 1 4 -1 2 13 19 11 22
7157 22 27 11 2 16 10 1 -2 -1 -9 -6 -9 -16 -10 -5 -10 -4 -2 -8 -5 7 11 10 16 8 1 -11 12 -2 -9 -2 -2 2 7 6 -5 3 -3 3 6 8 8 3 8 18 12 10 14 13 4 8 0 2
7209 2 0 -12 -9 -15 -6 -14 -8 -5 -5 -6 4 11 5 9 11 3 22 13 6 5 10 2 7 3 7 8 6 4 2 11 16 3 3 20 8 6 8 17 4 1 -4 -5 -12 -12 2 -11 -5 -9 -10 -6 -6 3
7261 3 9 1 9 6 3 9 16 27 8 7 3 9 16 15 1 -1 11 12 -2 17 11 4 5 9 4 13 17 12 4 -1 2 4 -2 -9 -3 -4 -6 -9 -5 -15 7 -1 9 4 8 16 18 23 20 24 7
$$ packed form
6910IkkjJLKnNj7J4j3MqmJ4qm%oJ1MKKPklNKP%%%J%j0JJj0%pJ4j5K%J3%lrRoL
6961AklJj2QjlJ2j5mPRm%JPJR%KOj1PqJ5j5kJ2j5qJ5rmJLrMJPrLNj1J7kljj0m
7010a1KQqjJ5j2jLOlNQj3K2ppRMlj1LqkKlQopRorNLJJ0lj%rQJ1j0jOj3mJ0rJN
7060dJ0Nj1J9j2JJjJ7j1J3j4OpkrLloOplJ3mjNOpLLJlj0Or%J1j5MjKkN%J1KKr
7108DJ5kj2MORknJ0j9jKj9PpJ0pNm%LOLj7K5oMlMj4KknQrPPJnLj6J1LnLJ1OqJ1
7157B2Nj6rJ4orlJqLlpONnOKoLJ2MjOqpj2K3j4pP%MNjj1QoOLK%nNJ0okMjrMqK
7209Bkj2LoRqOL%jJ0PoMKqJ9rpjNqNmMJkkkRNj3%J7j2kKRj3lnjp%J4j3OmjM%R
7261COqQllOPJ1j9jmOPjj4kJ2Jj4J9opJMnRMnqnLKopOjklMj0K2qJ0nMQKNlMj7
$$ plain form
7312 7 19 24 7 10 18 7 15 9 11 -3 8 6 5 9 8 9 9 13 11 20 16 16 2 4 2 -15 0 0 -5 -14 -8 -7 -15 -5 4 1 5 16 21 13 33 19 14 24 18 11 11 5
7360 5 -5 11 10 -6 -5 8 1 3 8 2 -7 9 6 8 10 10 0 -2 10 3 -2 -6 -4 2 -13 -1 -9 -9 -3 6 -2 14 10 16 13 20 27 30 8 20 16 12 16 14 8 0 12 -4
7408 -4 -6 0 -3 -1 -12 13 -2 0 -11 5 10 11 0 9 1 9 2 -9 -4 -6 -7 0 7 -6 9 6 9 13 12 16 15 19 29 17 13 19 18 9 8 13 11 6 0 1 -13 -2 -1 -3
7456 -3 -4 -12 -3 1 4 5 14 3 2 4 4 -3 -5 -7 -5 -14 -7 -7 -3 0 7 7 13 16 17 15 16 8 16 16 12 8 4 11 -1 4 -6 -8 -9 4 -14 -9 -6 0 -9 -2 6 -5 3 4 10 0 2 -4
7510 -4 5 12 4 1 -3 12 -4 5 5 7 12 19 13 27 23 17 16 1 17 10 20 13 4 -4 3 -3 -8 -1 0 0 -2 -12 -14 -4 4 -13 -2 6 17 8 6 7 2 -1 -4 8 1 0 5
7559 5 -1 -1 1 4 11 4 2 13 24 22 24 20 17 19 16 17 17 6 -2 -11 -6 -8 -6 -12 -9 -11 -2 -4 -7 4 -3 2 18 11 11 18 1 8 5 8 9 -2 0 8 -2 -5 2 5 5 6 13 4 7
7612 7 9 10 13 13 9 4 3 7 -2 -5 -9 -6 -16 -4 -13 -13 -14 -14 -8 -6 4 -2 10 13 5 20 17 14 5 14 15 8 15 8 9 4 2 1 14 7 8 12 14 8 17 9 6 5 6 14 -2 -4 -2 -5
7666 -5 -7 -11 -12 -1 -9 -13 1 -1 -4 -7 3 13 13 23 17 9 21 11 10 13 16 15 7 6 -1 11 11 12 9 9 12 4 18 17 18 14 4 4 2 -4 -1 -8 -9 -4 -1 -8 -7 -8 -14 -13 -6
$$ packed form
7312GJ2Nj7LQj1QoKj4J1kjMjJ%MkRm%j4Kkj7J5%nrOJqJ0RlMJ1NqK0j4nJ0op%o
7360Ej0J6jj6JJ3pKNorJ6lKK%j0kJ2pnmKOj5J2q%ORqJ6mOlPPLk2J2mmMkoqJ2j6
7408dkOlKj1K5j5Kj1J6NJj1RqQpj1NkjPPj3J5lLMjMjMJ0j2mOjrjNknoJj4J1Jk
7456cjqRMLJRj1jK%pkkKrP%MLP%OLJkJqQ%mmmPj2Nj0kjJ3j8NLOrPQj1QJOj0Ko
7510dRPqlmJ5j6R%KNPoJ4mojj5J6pJ0prqPonPJ%kj0kJ0Qj7J1QJ1rkJnllJ2pjN
7559Eo%KLPpkJ1J1kKmlKlJ%j1qrNkKoLkRklJ1pNJ6p%Pj7PlLJj1KQj0lPL%JPrL
7612GKJL%mnjMrlmLj0J2r%j%OKJ0oJ2LqJ5llrRJpPpJnkjJ3pJMKoRqljJQj6kKl
7666ekmjJ1qmJ4kllJ0J0%J0oqJ2j0jLLjqjpJ2%Jl%LqJ4jJmj0%koLpjNLpJjoJP
$$ plain form
7717 -6 -12 0 8 1 7 5 5 11 10 6 8 8 20 10 3 9 -1 -3 6 9 -5 9 12 2 11 6 3 11 -3 4 9 -10 1 -1 -7 -5 2 -12 -8 -14 -7 0 3 5 -1 12 -2 17
7765 17 11 13 15 12 20 8 8 10 6 16 3 4 -11 -4 8 -2 1 -3 8 -4 13 10 4 2 6 -6 -8 -16 -12 -2 -9 -4 -10 -9 -4 -5 -6 -6 1 -7 9 12 7 19 15 23 20
7812 20 27 26 15 15 10 8 -3 9 1 -4 0 -4 9 -3 -7 -5 6 -3 3 -1 -7 3 1 4 -7 -2 -2 3 -8 -2 -2 -6 -19 1 1 2 6 6 11 7 24 24 20 22 25 13 17
7859 17 3 -3 7 -2 -5 -3 -9 -6 -8 -4 -5 3 0 3 -6 -2 -1 0 -6 5 -2 1 -1 0 -13 -15 -2 -6 -1 5 -6 0 -3 9 11 11 11 9 18 21 5 19 15 20 12 5 2 -3 -13 -5
7909 -5 -11 -3 -9 -12 -8 0 -18 -15 -4 -14 -11 -8 -11 -11 -10 -7 1 -6 0 2 -5 -4 0 -3 -3 6 3 12 6 15 13 19 13 21 14 5 7 4 1 -2 0 0 -1 -2 -15 -7 -9 -13 -8 8 2 -4 1 -1 -12
7964 -12 6 7 7 -1 -4 -7 0 -9 -7 1 5 3 -1 5 12 8 6 11 17 21 22 20 7 10 8 -2 2 -1 -6 -14 -10 -3 -12 -12 -11 -11 -8 -7 -10 2 6 7 2 0 9 11 10 -3 4 5 9 6 6 3 11
8019 11 5 -4 0 7 14 28 15 10 10 2 20 11 8 7 3 -2 -11 -6 -5 -11 -13 -7 -14 -12 6 1 -14 -5 5 0 3 11 7 7 9 6 13 18 12 6 4 2 -1 6 3 5 9 3 10 10 14 17 12 19
8073 19 16 5 8 -2 -6 2 -7 -9 -1 6 1 -5 -6 -9 -2 -5 6 17 15 6 5 12 6 6 9 13 -2 11 13 9 5 4 17 1 0 10 11 10 10 9 11 8 19 -7 9 2 0 9
$$ packed form
7717foJ2QpOk%OjmK%J2j0pOj0kRLj4J4Lj0RnlQj4PNj9J1koKPj4MoPPLKoJ3j4J9
7765A7oKKlQj2%KmJ0j3Jj5PJ2j0LmJ1j2J7lokMj2kqMJ0pNoJNjj%PqJ6LnJ2mQl
7812B0Pjj1%nkj1J2qnMmJ3j2mKJ1rOmoJ0kLj1N%Nj1O%mj3K0%JM%NmJ7%mKLj2M
7859A7j4oJ0rlKoLkMjQlLrMJJoJ1pLkJj3kJ3mNOj1OlJ2K%%kRLj6J4mNqplnj0Q
7909eoQolMQj8LJ1j0LLl%JLQpOKpJMl%RlRoRkOoQprKlllK%jjj3QkmNJ6ooNkj1
7964a2J8J%qllPrKQMkmOPmkNOMJkj3Lkj0MlnqMPr%J%LJlJ2MJnkRKjj3PJMl%lQ
8019A1orMPPJ4j3n%qJ8rljmnrNJokOpKJ8nj5RJ0nLQm%KlPNookklPlKMoP%MLnP
8073A9lj1Lj0mQrkQPnojlPlJ1J1krjPo%LMj5J3KmmjJ3j6jJ0Jj%jKlJ1k6J6pkR
$$ plain form
8121 9 -5 -4 -9 -6 -2 -7 -20 0 -7 -6 5 -5 -3 13 14 0 6 8 12 9 12 11 12 17 0 -1 4 1 4 -1 1 0 2 11 4 2 7 5 7 18 12 3 -7 2 -1 -5 -3 -3 0 -1 -6
8172 -6 -4 2 5 -3 0 12 9 14 19 18 8 22 18 17 17 12 14 14 5
$$ packed form
8121Ij4JnLMnj3K0pJJ1j0KJ6Jj4OKMlLjJNj7jNlLnKjKRpkNkKJ1orj0RlmK%Ljn
8172fKOLqLJ2lNNjj0J4mj%nK%r
8191E
$$ Imaginary data points
##PAGE= N=2
##DATA TABLE= (X++(I..I)), XYDATA
$$ plain form
0 0 0 0 0 0 0 0 0 0 0 0 0 0 0 0 0 0 0 0 0 0 0 0 0 0 0 -2 8 -8 8 -8 8 -8 8 -10 16 -16 16 -17 24 -24 25 -31 32 -34 40
45 40 -42 48 -53 57 -65 73 -77 86 -96 105 -116 129 -142 162 -181 206 -235 273 -321 392 -491 652
67 652 -961 1750 -8552 -17312 -9626 -11296 -8242 -2569 878 -779 2053 5266 5408 3716 5159 5937
83 5937 4337 1756 1823 1378 -1663 -4208 -2693 -2176 -3921 -2916 809 647 -701 1693 3504 1288 979
100 979 3138 2754 1181 2250 2998 1579 396 81 -853 -2036 -3121 -3699 -3742 -4438 -5409 -4617 -3598 -4184
118 -4184 -3780 -1687 -919 -510 2087 4352 4609 5131 5757 4626 3112 2230 850 -619 -1478 -2531 -3122
135 -3122 -2498 -2292 -2305 -864 353 191 1184 3057 3088 2687 3606 3415 1796 1206 890 -634 -1919 -2436 -3168
154 -3168 -3678 -3761 -3854 -3455 -2844 -2847 -2173 -580 -95 -14 1417 2263 1629 2164 3349 2698 1871 2314 1864 636
$$ packed form
0@%%%%%%%%%%%%%%%%%%%%%%%%%kJ0j6J6j6J6j6J6j8K6l2L2l3M1m8M9n6O3o6P4
45D0q2R0j01J10j22J38j50J63j82K01k21K45k71L04l43L87m41N08n94P13q83J143
67F52j613K711j0302q760P686j670L054N673L447j657K832L213J42j692J443P78
83E937j600k581O7m45l041k545J515N17j745J005L725j62j348K394J811k216l09
100I79K159l84j573J069P48j419j183l15r34j183j085n78m3o96r71P92J019n86
118d184M04K093P68M09K597K265K57N22O26j131j514q82j380j469q59j053n91
135c122O24K06j3J441J217j62R93J873L1m01R19j91j619n90l16j524j285n17p32
154c168n10q3r3L99O11lO74J593M85Q1J431Q46o34N35J185o51q27M43m50j228
$$ plain form
174 636 607 702 -262 -842 -956 -1477 -1594 -1108 -854 -324 580 881 1306 2361 2608 2239 2578 2393 1106 580
194 580 402 -902 -1907 -1998 -2766 -3547 -3155 -2973 -3210 -2521 -1733 -1529 -586 653 965 1450 2384 2383 2128 2575
214 2575 2328 1280 889 469 -662 -1123 -1061 -1596 -1889 -1487 -1360 -1033 22 685 1029 1868 2239 2029 2506
233 2506 2810 2009 1584 1504 301 -821 -860 -1464 -2594 -2608 -2442 -2971 -2723 -1803 -1545 -1205 -282 223 552 1257
253 1257 1533 1438 1681 1518 1006 1079 966 129 -153 -101 -887 -1318 -833 -1031 -1546 -973 -468 -641 62 1132 1227
274 1227 1457 2204 2261 2063 2332 2021 1177 662 -82 -1143 -1541 -1878 -2616 -2720 -2425 -2616 -2269 -1140 -641 -300
294 -300 806 1447 1357 1888 2320 1723 1319 1281 507 -268 -375 -868 -1565 -1523 -1509 -1702 -1192 -612 -560 -81 663 730
316 730 1023 1738 1718 1435 1745 1628 1015 1033 938 57 -410 -556 -1265 -1703 -1515 -1769 -2119 -1714 -1427 -1363 -563 255
$$ packed form
174F36k9R5r64n80j14n21j17M86K54N30R04L01M25J055K47l69L39j85j287n26
194E80j78j304j005r1p68p81L92J82k37O89P88K04R43J239L12M85R34jk55M47
214B575k47j048l91m20j131m61O2n35k93M02J27L27J055O63L44Q39L71k10M77
233B506L04q01m25q0j203j122l9o04j130j4J66n29K48R20K58L40R23N05L29P05
253A257K76r5K43j63n12P3j13q37k82N2p86m31M85j98n15N73N05j73P03J070R5
274A227K30P47N7j98K69l11q44n15p44j061l98l37p38j04K95j91L47J129M99L41
294c00J106O41r0N31M32n97m04l8p74p75j07m93o97M2J4j93N10N80N2M79P44O7
316G30K93P15k0k83L10j17o13J8r5q81m67j46p09m38J88k54l50M05K87O4Q00Q18
$$ plain form
338 255 436 966 1630 1581 1599 1969 1603 961 781 204 -676 -895 -1149 -1835 -1867 -1534 -1633 -1282 -366 -46 195 1055
360 1055 1494 1439 1912 2157 1612 1323 1226 513 -62 -177 -753 -1385 -1407 -1597 -1858 -1482 -1207 -1292 -823 -236 -164 337
382 337 1144 1144 1103 1595 1511 1042 1192 1083 236 -208 -368 -1065 -1480 -1351 -1540 -1712 -1287 -985 -760 -4 558 737
404 737 1297 1760 1606 1715 1916 1309 711 620 16 -799 -885 -1084 -1737 -1745 -1435 -1515 -1213 -530 -320 -80 573 830
426 830 912 1431 1533 1134 1182 1169 530 255 296 -379 -986 -918 -1151 -1546 -1278 -1037 -1186 -885 -383 -166 316 917
448 917 1061 1293 1665 1473 1233 1376 908 61 -94 -361 -1227 -1463 -1190 -1640 -1883 -1259 -902 -841 -147 535 679
469 679 997 1439 1500 1546 1506 1089 782 523 -143 -498 -448 -962 -1496 -1204 -1067 -1459 -1047 -320 -455 -389 456 763
491 763 664 1152 1489 1152 1014 1082 755 455 230 -253 -601 -811 -1280 -1435 -1178 -1325 -1432 -779 -334 -339 301 1051
$$ packed form
338B55J81N30O64m9J8L70l66o42j80n77q80k19k54o86l2L33r9L51R16L20K41Q60
360A055M39n5M73K45n45k89r7p13n75j15n76o32k2j90k61L76K75q5M69N87P2N01
382C37Q07%m1M92q4m69J50j09q47m44j60o97m15J29j89j72M25L02K25P56N62J79
404G37N60M63j54J09K01o07n98r1o04q15q6j99o53qL10q0L02O83K10K40O53K57
426H30Q2N19J02l99M8j3o39k75M1o75o07O8k33l95K68K41j49L01N02K17M82O01
448I17J44K32L72j92k40J43m68q47j55k67q66k36K73m50k43O24L57O1O94O82J44
469F79L18M42O1M6m0m17l07k59o66l55N0n14n34K92J37l92M12P27j35O6Q45L07
491G63r9M88L37l37j38O8l27l00k25m83l48k10m69j55K57j47j07O53M45nO40P50
$$ plain form
513 1051 955 1061 1619 1538 1153 1206 945 214 -144 -401 -934 -1137 -1196 -1499 -1466 -1094 -1021 -733 -6 273 304 875
535 875 1251 1067 1228 1451 1011 636 617 242 -233 -359 -702 -1137 -1152 -1219 -1336 -981 -684 -757 -340 303 333 563
557 563 1271 1338 1038 1317 1415 824 552 464 -136 -717 -828 -1066 -1332 -1267 -1255 -1178 -759 -458 -167 501 870 796 1170
580 1170 1529 1163 979 1204 697 -45 -71 -252 -928 -1080 -936 -1254 -1368 -982 -788 -662 -227 31 192 582
600 582 783 857 1149 1154 788 792 784 231 -48 25 -470 -1013 -874 -927 -1277 -1070 -712 -780 -503 124 373 625 1116 1225
624 1225 1166 1337 1235 869 737 416 -285 -585 -706 -1213 -1376 -1134 -1234 -1279 -750 -348 -225 299 762 770 974
645 974 1270 1103 978 989 563 113 58 -268 -713 -691 -772 -1161 -1046 -721 -810 -653 -118 -10 44 551 825 770 1009
668 1009 1146 877 817 807 426 131 -21 -515 -895 -874 -1087 -1296 -1020 -879 -975 -544 13 109 434 1001 1024 944
$$ packed form
513A051r6J06N58q1l85N3k61p31l58k57n33k03n9l03L3L72P3K88P27K79L1N71
535H75L76j84J61K23m40l75j9l75m75j26l43m35j5o7j17L55K97p3M17O43L0K30
557E63P08O7l00K79R8n91k72q8o00n81j11k38k66O5J2P7M19L01K91O68L69p4L74
580A170L59l66j84K25n07p42k6j81o76j52J44l18j14L86J94J26M35K58J61L90
600E82K01P4K92Nl66Mqn53k79P3m95n43J39n3l50K07L58o8K77O27K49K52M91J09
624A225n9J71j02l66j32l21p01l00j21n07j63K42j00m5N29M02J23N24M63QK04
645I74K96j67j25J1m26m50n5l26m45K2q1l89J15L25q9J57N35J08N4N07K74n5K39
668A009J37k69o0j0l81k95j52m94l80K1k13k09K76J41r6M31N57R6L25N67K3q0
$$ plain form
690 944 1226 1151 743 632 395 -181 -459 -579 -971 -1129 -1013 -1124 -1057 -628 -386 -218 317 602 590 934 1214
711 1214 1010 977 1071 668 280 285 -36 -524 -566 -702 -1079 -1021 -818 -909 -757 -360 -277 -88 407 612 682 990 1037
734 1037 775 800 767 323 91 -22 -515 -858 -791 -979 -1183 -910 -768 -797 -379 87 190 488 889 887 917 1147
756 1147 1006 713 688 402 -101 -225 -353 -756 -863 -768 -983 -972 -603 -514 -428 26 255 276 633 912 778 830
778 830 926 611 380 389 52 -351 -431 -682 -1055 -995 -882 -983 -766 -404 -319 -49 485 680 778 1120 1150 913 967
801 967 882 404 157 -5 -473 -758 -711 -914 -1038 -802 -714 -707 -296 50 103 405 734 641 679 890 712 473 508
824 508 272 -133 -169 -287 -649 -732 -694 -906 -860 -575 -533 -457 -55 91 161 571 837 773 924 1041 757 604 600 230
848 230 -164 -251 -554 -928 -898 -872 -1011 -824 -504 -421 -113 363 528 667 987 966 806 886 752 324 158 -40
$$ packed form
690I44K82p5m08j11k37n76k78j20l92j58J16j11O7M29K42J68N35K85j2L44K80
711A214k04l3R4m03l88Nl21m88m2j36l77N8K03r1J52L97Q3J89M95K05P0L08M7
734A037k62K5l3m44k32j13m93l43O7j88k04K73J42k9M18M66J03K98M01kL0K30
756A147j41k93k5k86n03j24j28m03j07R5k15J1L69Q9Q6M54K29K1L57K79j34N2
778H30R6l15k31Rl37m03q0k51l73O0J13j01K17L62Q5K70N34J95R8L42L0k37N4
801I67q5m78k47j62m68k85M7k03j24K36Q8PM11L46N3L02L29r3L8K11j78k39L5
824E08k36m05l6j18l62q3L8k12M6K85M2P6M02J46P0M10K66o4J51J17k84j53ml70
848B30l94q7l03l74L0K6j39J87L20Q3L08M76J65J39L20k1j60Q0j34m28j66j98
$$ plain form
870 -40 -523 -720 -670 -915 -1012 -742 -679 -681 -273 38 65 351 637 602 703 884 742 585 586 333 34 11 -164 -507
894 -507 -537 -570 -849 -791 -548 -582 -507 -114 3 76 466 686 626 794 892 659 544 532 182 -140 -255 -561 -845
917 -845 -778 -820 -937 -720 -498 -473 -133 296 372 542 873 855 727 856 757 380 250 103 -301 -464 -466 -712 -825
940 -825 -687 -703 -668 -330 -133 -81 266 482 447 642 866 697 610 663 418 106 74 -120 -493 -572 -640 -863 -804 -617
964 -617 -635 -493 -157 -37 127 528 670 624 818 825 558 509 494 110 -155 -202 -500 -746 -660 -686 -813 -611 -412
987 -412 -385 -112 194 262 410 664 630 622 761 638 383 363 201 -183 -246 -279 -600 -723 -598 -711 -742 -456 -301
1010 -301 -268 34 297 361 593 804 726 726 738 489 269 220 -107 -448 -510 -661 -918 -808 -616 -687 -509 -126 -6
1033 -6 145 525 670 634 773 774 558 501 406 65 -130 -213 -486 -618 -519 -614 -691 -464 -368 -407 -121 138 127 277 547
$$ packed form
870d0m83j97N0k45r7K70O3kM08L11K7K86K86l5J01J81j42j57Jk53k99k3j75l43
894e07l0l3k79N8K43l4P5L93J17P3L90K20o0J68R8k33j15j2l50l22j15l06k84
917h45O7m2j17K17K22K5L40M29P6J70L31j8j28J29r9l77j30j47m04j63kk46j13
940h25J38j6L5L38J97N2L47K16l5J95K24j69q7N3k45l12l2j94l73p9o8k23N9J87
964f17j8J42L36J20J64M01J42m6J94Pk67m9j5l84k65m7k98k46Q6k6j27K02J99
987d12K7K73L06O8J48K54l4qJ39j23k55k0j62l84o3l3l21j23J25j13l1K86J55
1010c01L3L02K63O4K32K11p8%J2k49k20m9l27l41o2j51k57J10J92p1J78L83J20
1033fJ51L80J45l6J39Jk16n7r5l41j95q3k73j32R9r5p7K27R6l9K86K59j1J50K70
$$ plain form
1058 547 491 478 658 570 366 362 254 -28 -103 -200 -500 -611 -584 -732 -713 -455 -428 -363 -19 179 245 554 782 680
1082 680 706 781 526 316 262 -30 -369 -447 -603 -807 -728 -619 -667 -457 -157 -60 144 507 564 560 738 710 506 496
1106 496 428 96 -56 -117 -397 -533 -462 -584 -663 -497 -434 -427 -165 8 -4 206 440 408 470 674 544 380 434 284
1130 284 -2 -52 -161 -466 -578 -551 -683 -657 -451 -403 -293 36 188 291 584 724 618 692 720 455 313 278
1152 278 -46 -340 -354 -501 -733 -615 -554 -634 -461 -216 -158 14 295 348 402 599 581 472 538 449 179 104 37 -242
1176 -242 -374 -356 -550 -667 -515 -496 -494 -239 -57 -28 203 458 475 586 752 626 505 505 307 24 -26 -204 -536
1199 -536 -584 -578 -709 -639 -425 -399 -299 9 144 215 468 568 452 520 515 312 233 212 -55 -227 -213 -370 -524 -432
1223 -432 -431 -537 -374 -206 -217 -49 205 214 289 517 547 497 618 556 323 268 183 -121 -250 -302 -559 -671 -582 -610 -605
$$ packed form
1058E47n6j3J80q8k04mj08k82p5r7l00j11K7j48J9K58K7O5L44J98O6L09K28j02
1082F80K6P5k55k10n4k92l39p8j56k04P9J09m8K10L00R7K04L63N7mJ78k8k04j0
1106D96o8l32j52o1k80j36P1j22p9J66O3PK62J73j2K10K34l2O2K04j30j64N4j50
1130B84k86n0j09l05j12K7j32K6K06M8J10L29J52J03K93J40j06P4K8k65j42l5
1152B78l24k94j4j47k32J18O1q0J73K45N8J72K81N3N4J97j8j09O6q9k70p5o7k79
1176b42j32J8j94j17J52J9KK55J82K9K31K55J7J11J66j26j21%j98k83n0j78l32
1199e36m8Oj31P0K14K6J00L08J35P1K53J00j16O8nk03p9k1k67j72J4j57j54R2
1223d32Jj06J63J68j1J68K54RP5K28L0n0J21o2k33n5q5l04j29n2k57j12Q9k8N
$$ plain form
1248 -605 -353 -190 -137 147 387 420 578 700 556 471 465 247 0 -56 -253 -537 -539 -530 -649 -538 -338 -321 -209 72
1272 72 179 238 457 501 431 507 506 330 296 257 13 -96 -97 -278 -417 -343 -417 -559 -420 -308 -347 -190 48 77 178
1297 178 412 450 445 558 508 318 289 157 -104 -211 -319 -574 -629 -544 -612 -559 -278 -155 -101 209 439 424 577 724
1321 724 582 491 499 297 96 4 -178 -386 -416 -453 -556 -472 -360 -415 -271 -38 -22 78 323 341 278 432 461 293
1345 293 304 305 79 -53 -79 -254 -401 -381 -476 -540 -420 -358 -327 -111 77 111 308 540 523 535 668 531 319 307
1369 307 179 -114 -216 -279 -496 -571 -473 -501 -473 -279 -200 -120 114 231 255 411 458 348 363 402 205 76 102 -91
1393 -91 -297 -262 -310 -482 -419 -337 -409 -316 -113 -54 51 282 350 379 546 564 467 505 411 169 64 5 -276 -426 -416
1418 -416 -558 -655 -501 -401 -389 -185 35 92 260 450 436 439 504 375 228 217 40 -167 -194 -288 -471 -445 -343 -420
$$ packed form
1248f05K52J63N3K84K40L3J58J22j44q5ok18k47n6j97k84kRj19J11K00J7J12K81
1272G2J07N9K19M4p0P6jj76l4l9k44j09jj81j39P4p4j42J39J12l9J57K38K9J01
1297A78K34L8nJ13n0j90k9j32k61j07j08k55n5Q5o8N3K81J23N4L10K30j5J53J47
1321G24j42r1Qk02k01r2j82k08l0l7j03Q4J12n5J44K33J6J00K45J8o3J54K9j68
1345B93J1Jk26j32k6j75j47K0r5o4J20O2L1K16J88L4J97K32j7J2J33j37k12j2
1369C07j28k93j02o3k17p5R8k8K8J94P9Q0K34J17K4J56M7j10J5L9j97j29K6j93
1393i1k06L5m8j72O3Q2p2R3K03N9J05K31O8K9J67J8r7L8r4k42j05n9k81j50J0
1418d16j42r7J54J00J2K04K20N7J68J90j4LO5j29j47j1j77k07k7r4j83K6J02p7
$$ plain form
1442 -420 -351 -149 -113 -80 141 256 232 361 460 389 401 431 300 227 196 3 -140 -162 -305 -473 -428 -459 -547 -422 -244
1467 -244 -247 -114 154 219 265 486 517 423 453 397 163 51 -41 -261 -383 -402 -524 -535 -385 -332 -277 -39 114 152 350
1492 350 498 446 465 535 381 256 257 104 -99 -119 -205 -396 -394 -358 -450 -409 -279 -298 -240 -39 21 40 227 303 260 356
1518 356 410 279 224 219 35 -106 -133 -275 -415 -378 -415 -455 -303 -154 -128 46 267 298 396 586 551 436 472 387 153
1543 153 60 -27 -245 -356 -377 -480 -505 -397 -375 -348 -171 -88 -42 124 245 212 304 369 253 227 277 145 -15 8 -93
1568 -93 -276 -275 -260 -396 -365 -253 -259 -192 11 103 182 351 428 410 514 524 361 317 250 5 -130 -175 -368 -509 -465 -497
1594 -497 -541 -389 -243 -218 -66 126 163 249 389 340 299 337 233 80 76 11 -189 -198 -191 -328 -332 -220 -237 -233 -74 4 13
1621 13 177 294 277 371 452 375 383 409 249 121 84 -96 -274 -293 -367 -532 -494 -416 -467 -367 -139 -71 7 224 300 316
$$ packed form
1442d20O9K02L6L3K21J15k4J29R9p1J2L0j31p3l1j93j43k2j43j68M5l1q8J25J78
1467b44lJ33K68O5M6K21L1r4L0n6k34j12r2k20j22j9j22j1J50N3N5K38J53L8J98
1492C50J48n2J9P0j54j25Jj53k03k0q6j91KL6r2M1J30j9N8K01O0J9J87P6m3R6
1518C56N4j31n5nj84j41k7j42j40L7l7m0J52J49K6J74K21L1R8J90l5j15L6q5k34
1543A53r3q7k18j11k1j03k5J08K2K7J77Q3M6J66J21l3R2O5j16k6N0j32j60K3j01
1568i3j83JJ5j36L1J12oO7K03R2P9J69P7j8J04J0j63m4o7k45j35m5j93j41M4l2
1594d97m4J52J46K5J52J92L7Q6J40m9m1L8j04j53mo5k00rPj37mJ12j7MJ59P8R
1621A3J64J17j7R4Q1p7QK6j60j28l7j80j78j9p4j65L8P8n1J00K28O8P8K17P6J6
$$ plain form
1647 316 410 427 291 248 195 -9 -89 -146 -297 -371 -319 -358 -371 -190 -91 -84 90 238 233 307 458 393 344 386 309 167 148
1674 148 56 -123 -160 -213 -349 -370 -313 -403 -398 -244 -239 -216 -19 84 86 226 337 281 309 338 221 108 91 -57 -204 -220
1700 -220 -299 -395 -335 -275 -283 -144 31 71 181 372 393 385 502 470 315 283 224 17 -68 -119 -276 -368 -343 -412 -436 -324
1726 -324 -283 -273 -137 -11 -12 121 249 209 233 326 255 160 203 108 -49 -91 -130 -282 -293 -268 -319 -290 -154 -126 -43 157
1752 157 246 260 416 484 381 401 414 241 112 72 -94 -255 -265 -337 -442 -379 -347 -356 -249 -125 -88 34 169 168 195
1777 195 321 260 171 228 176 20 -2 7 -158 -233 -183 -252 -307 -219 -171 -170 -60 47 93 212 315 322 389 439 354 299 299 136
1805 136 -33 -46 -167 -367 -386 -371 -480 -445 -299 -257 -197 2 107 135 270 332 291 305 288 165 95 55 -94 -182 -177
1830 -177 -264 -329 -242 -207 -237 -102 11 7 97 239 237 250 351 317 263 286 219 89 68 16 -141 -183 -196 -329 -362 -287 -327
$$ packed form
1647C16R4J7j36m3n3k04q0n7j51p4N2l9j3J81R9PJ74J48nP4J51o5m9M2p7j42j9
1674A48r2j79l7n3j36k1N7r0NJ54NK3J97J03KJ40J11n6K8K9j17j13j7j48j47j6
1700b20p9r6O0O0qJ39J75M0J10J91K1qJ17l2j55l2n9k07q5n1j57r2K5o9k4J12
1726c24M1J0J36J26jJ33J28m0K4R3p1r5M3r5j57m2l9j52j1K5n1K9J36K8Q3K00
1752A57Q9J4J56O8j03K0J3j73j29m0j66j61j0p2j05O3L2rJ07J24L7J22J35jK7
1777A95J26o1q9N7n2j56k2Rj65p5N0o9n5Q8M8JJ10J07M6J19J03PO7N0q5n5%j63
1805A36j69j3j21k00j9J5j09L5J46M2O0J99J05K8J35O2m1J4j7j23p0m0j49q8N
1830a77q7o5Q7L5l0J35J13mR0J42kJ3J01l4n4K3o7j30k1n2j57m2j3j33l3P5m0
$$ plain form
1857 -327 -345 -192 -106 -88 47 187 186 256 343 294 243 247 121 5 -40 -164 -287 -264 -303 -366 -285 -177 -178 -74 125 166
1883 166 187 364 402 320 357 352 211 131 113 -43 -151 -185 -266 -339 -311 -320 -338 -231 -172 -180 -37 82 60 142 266 237 198
1910 198 273 226 96 91 44 -105 -166 -162 -251 -289 -232 -243 -222 -87 -20 31 187 266 252 342 391 298 266 262 116 -3 -25 -125
1938 -125 -262 -263 -294 -362 -318 -247 -247 -172 -39 -6 49 187 211 193 282 275 167 164 161 -4 -74 -74 -183 -261 -234 -237 -274 -196 -132 -108
1968 -108 14 123 155 257 343 304 316 351 262 144 140 31 -147 -183 -209 -350 -365 -287 -305 -305 -152 -81 -47 88 172 173 242
1995 242 278 227 221 192 80 24 15 -96 -185 -138 -199 -271 -197 -132 -174 -97 34 37 68 203 231 208 290 291 210 205 179 35 -8 -61
2025 -61 -197 -258 -265 -330 -369 -269 -240 -243 -101 30 42 160 276 259 265 328 247 144 121 29 -108 -133 -192 -302 -272 -238 -269
2052 -269 -209 -68 -37 15 153 211 205 288 327 237 231 215 96 20 9 -94 -174 -167 -228 -278 -226 -211 -244 -163 -79 -78 -5 128 123 147
$$ packed form
1857c27j8J53Q6J8J35J40jP0Q7m9n1Mj26j16m5j24j23K3l9o3Q1J08jJ04J99M1
1883A66K1J77L8q2L7nj41q0j8j56j08l4q1p3K8rj8J07N9qJ43J19k2Q2J24k9l9
1910A98P5m7j30nm7j49o1Mq9l8N7j1K1J35O7N1J56P9j4R0M9r3l2mj46j19k2j00
1938a25j37jl1o8M4P1%P5J33L3N5J38K4j8Q9pj08llj65p0%j09p8K7ll7P8O4K4
1968a08J22J09L2J02Q6l9J2L5q9j18mj09j78l6k6j41j5P8j8%J53P1L4J35Q4JO9
1995B42L6n1ok9j12n6rj11q9M7o1p2P4O5m2P7J31LL1J35K8k3Q2Jq1nk6j44m3n3
2025f1j36o1po5l9J00K9lJ42J31J2J18J16j7OO3q1j03k3r2j37k5n9j10L0L4l1
2052b69O0J41L1N2J38N8oQ3L9r0oj6j19p6j1j03q0Po1n0N2J5l3Q1Q4JP3J33nK4
$$ plain form
2082 147 253 240 182 213 193 77 21 -7 -129 -196 -202 -259 -290 -220 -223 -174 -46 43 66 191 279 254 272 339 247 168 156 61
2110 61 -80 -116 -168 -277 -279 -264 -299 -255 -164 -136 -80 50 89 115 212 230 192 222 229 111 78 73 -41 -124 -111 -184 -251 -208 -198
2139 -198 -207 -129 -46 -49 48 147 164 192 287 257 209 241 186 57 21 -14 -151 -201 -199 -279 -290 -221 -216 -195 -88 -27 10 123 191 185
2169 185 219 259 192 146 153 61 -47 -43 -101 -210 -207 -188 -245 -212 -137 -127 -80 38 83 106 205 231 208 258 249 159 144 110 -16 -98
2199 -98 -95 -191 -286 -226 -243 -277 -182 -104 -97 4 118 138 187 252 247 213 223 151 63 45 -31 -138 -163 -168 -251 -242 -163 -175 -161 -36 14
2230 14 24 120 190 167 194 242 178 153 159 69 -4 -3 -78 -164 -152 -178 -246 -216 -163 -194 -138 -24 -1 42 161 193 180 246 251 181 173
2261 173 129 13 -54 -80 -198 -249 -213 -246 -270 -179 -117 -100 5 123 142 177 276 249 214 230 158 68 45 -23 -124 -150 -165
2288 -165 -225 -222 -171 -194 -149 -57 -36 -9 103 133 121 190 227 158 157 179 101 23 31 -44 -135 -136 -162 -224 -204 -179 -191 -121 -43 -7 50
$$ packed form
2082A47J06j3n8L1k0j16n6k8j22o7on7l1P0lM9J28Q9K3J25Q8k5J8O7r2p9j2r5
2110F1j41l6n2j09kJ5l5M4R1K8N6J30L9K6R7J8l8L0Pj18l3nj14q3J3p3o7M3J0
2139a98rP8Q3lR7R9J7K8R5l0m8L2n5j29l6l5j37n0Kq0j1O9NK1J07O1L7J13O8o
2169A85L4M0o7m6Pr2j08Mn8j09LJ9n7L3P5J0M7J18M5K3R9K6k3N0rr0j5l4j26q2
2199i8Lr6r5O0j7l4R5P8PJ01J14K0M9O5nl4J0p2q8j8p6j07k5nq3RP9j2J4J25N0
2230A4J0R6P0k3K7M8o4k5Or0p3Jp5q6J2k6o8L0N3l1N6J14K3M3J19L2j3O6Np0q
2261A73m4j16o7k6j18n1L6l3k4R1O2J7J05J18J9L5R9k7l5J6p2r0k3o8j01k6j5
2288a65o0LN1k3M5R2K1K7J12L0j2O9L7o9jK2p8p8Qp5r1jk6o2K0K5j2P0P8L6N7
$$ plain form
2319 50 153 172 177 245 247 169 165 139 13 -39 -65 -163 -229 -198 -239 -259 -184 -129 -115 -19 73 85 152 230 195 194 228 162 84 95 22
2350 22 -74 -101 -119 -203 -191 -169 -200 -172 -90 -78 -50 60 106 109 187 211 172 191 205 107 52 48 -51 -133 -144 -166 -238 -201 -184 -193 -128
2381 -128 -31 -9 44 156 164 185 246 221 168 165 126 17 -13 -48 -153 -188 -163 -199 -227 -153 -123 -126 -21 28 43 102 153 147 149 181
2411 181 153 102 113 44 -38 -46 -97 -178 -184 -160 -210 -197 -120 -112 -79 19 87 87 169 222 205 227 213 133 97 63 -35 -112 -123 -182 -242 -202
2443 -202 -192 -202 -115 -35 -19 41 137 146 155 198 195 134 148 94 13 -16 -42 -126 -151 -134 -185 -192 -130 -133 -130 -42 18 0 79 139 123 151 202
2476 202 175 123 141 69 10 -8 -69 -150 -155 -166 -217 -187 -131 -141 -93 20 47 65 170 206 165 210 215 130 81 68 -25 -101 -115 -167
2506 -167 -201 -185 -176 -182 -110 -57 -45 39 113 110 147 206 180 139 169 124 39 33 5 -93 -110 -107 -162 -186 -136 -150 -151 -67 -24 -17 74 121 117 166
2540 166 208 170 144 146 77 14 -3 -63 -143 -156 -179 -225 -204 -147 -145 -97 4 37 69 149 181 168 200 183 120 93 85 -10 -61 -60 -139
$$ packed form
2319E0J03J9NO8Kp8mk6j26n2k6r8o6L1m1k0P5N5J4R6R2J2O7P8l5jL4o6p8J1p3
2350B2r6k7j8q4J2K2l1K8Q2J2K8J10M6LP8K4l9J9J4r8n5mr9q2j1k2p2L7J7rO5
2381a28R7K2N3J12QK1O1k5n3ll9j09l0l5j05l5K5l6k8P4L0lJ05M9J5N9N1oKL2
2411A81k8n1J1o9q2qn1q1oK4n0J3P7QL3R8O8%Q2N3j7K2j4q0l6l4r8p7j1n9o0M0
2443b02J0j0Q7Q0J6O0R6RRM3lo1J4n4q1k9k6q4k5J7n1pO2lLQ8O0j8P9O0j6K8N1
2476B02k7n2J8p2n9j8o1q1nj1n1L0N6j0M8J13K7J8J05L6m1M5Nq5m9j3r3p6j4n2
2506a67l4J6RoP2N3J2Q4P4lL7N9k6m1L0m5q5ok8r8j7Ln5k4N0j4jQ4M3PR1M7mM9
2540A66M2l8k6Ko9o3j7o0q0j3k3m6K1N7KM8J01L3L2Q0L2j3L2j7o3k7qr5n1Jp9
$$ plain form
2571 -139 -164 -130 -152 -172 -119 -67 -72 -12 55 55 93 155 153 150 180 138 79 74 36 -53 -72 -81 -160 -188 -164 -174 -172 -94 -60 -47 57 117 114
2604 114 180 215 182 169 155 87 18 -3 -68 -148 -138 -161 -218 -169 -126 -124 -73 14 26 49 127 140 129 160 144 103 96 79 -2 -34 -40
2635 -40 -104 -132 -109 -139 -173 -114 -90 -100 -42 24 17 66 125 126 134 186 158 99 95 63 -29 -51 -86 -165 -181 -161 -192 -177 -97 -70 -33 57
2667 57 114 109 173 204 161 174 163 92 39 2 -60 -115 -126 -145 -181 -152 -122 -130 -77 -6 -5 35 100 125 100 143 145 101 111 88 19 -8
2699 -8 -21 -88 -127 -109 -149 -167 -134 -124 -120 -47 -2 10 79 146 142 150 208 164 115 113 65 -31 -45 -85 -153 -161 -150 -178 -164 -105 -91 -48 35
2732 35 73 91 148 161 135 134 137 71 26 19 -51 -86 -89 -127 -166 -127 -110 -146 -91 -36 -43 11 81 87 105 161 157 133 151 137 67 45 17 -71
2766 -71 -108 -110 -164 -190 -143 -136 -132 -62 -2 6 77 132 130 158 182 128 91 93 28 -53 -53 -89 -150 -150 -129 -157 -131 -70 -69 -31 30 56 73 124 131
2801 131 98 135 151 86 83 68 4 -35 -30 -85 -136 -121 -124 -166 -123 -64 -80 -30 47 63 97 158 156 143 168 137 73 40 17 -78 -121 -122
$$ packed form
2571a39k5L4k2k0N3N2nO0O7%L8O2klL0m2n9nl8q9j9rp9k8K4j0KP8L4J3J04O0l
2604A14O6L5l3j3j4o8o9k1o5q0J0k3n7M9M3KN1Q7J2K3P8J3j1L1j6m1pj7q1l2o
2635d0o4k8K3l0l4N9K4j0N8O6pM9N9JQN2k8n9ml2r2k2l5p9j6K0l1J5Q0K7L7R0
2667E7N7nO4L1m3J3j1p1n3l7o2n5j1j9l6K9L0qN3P1JM0O5K5k5M3Km4J0k3o9k7
2699hj3o7l9J8m0j8L3J0MP3M5J2O9O7mQN8m4m9km8r6j4m0o8qJ1k8J4N9J4M3Q3
2732C5L8J8N7J3k6jLo6m5pp0l5ll8l9L9J7l6N5N5pN4P0OJ8N6mk4J8j4p0k2k8q8
2766g1l7kn4k6M7PMP0O0QP1N5kK8K4n4l7Ko5q1%l6o1%K1k8K6O1JL8O1K6J7N1P
2801A31l3L7J6o5lj5o4l9Nn5n1J5lm2M3N9j6N0P7J6L4O1kj3K5l1o4l3k3r5m3j
$$ plain form
2833 -122 -175 -202 -136 -135 -124 -45 5 22 100 143 120 154 179 137 97 103 39 -22 -22 -59 -120 -112 -109 -140 -123 -80 -86 -56 5 15 17 82 95
2866 95 92 118 136 80 71 78 10 -8 -22 -88 -126 -115 -141 -166 -121 -78 -78 -19 56 60 106 169 171 156 170 135 71 61 13 -73 -95 -112 -159
2899 -159 -170 -130 -132 -127 -43 -11 3 56 96 82 120 148 106 85 89 43 5 -2 -49 -95 -84 -96 -135 -109 -82 -100 -70 -9 0 35 88 108
2931 108 99 150 153 116 96 90 19 -17 -29 -89 -132 -130 -162 -168 -114 -93 -85 -26 44 40 84 141 128 111 139 104 53 47 9 -61 -64 -81 -127 -119 -98
2966 -98 -113 -107 -41 -38 -22 49 73 72 116 141 105 120 126 74 48 48 -12 -78 -81 -111 -157 -148 -120 -140 -107 -39 -27 13 83 106 105 165 151 111
3000 111 118 87 18 -22 -41 -101 -132 -104 -129 -150 -96 -62 -57 6 48 45 85 132 107 116 131 93 69 64 18 -38 -35 -59 -113 -117 -102 -128 -132 -80
3034 -80 -91 -78 2 23 18 84 116 104 106 125 87 66 60 10 -60 -57 -104 -134 -130 -113 -129 -75 -29 -13 34 109 117 125 166 151 118 116 82 6
3068 6 -25 -42 -104 -116 -111 -150 -145 -101 -88 -82 -27 14 15 57 93 75 83 117 86 62 60 42 -13 -13 -24 -71 -81 -76 -114 -97 -66 -60 -44 23 39
$$ packed form
2833a22n3k7O6JJ1P9N0J7P8M3k3L4K5m2m0Oo4o1%l7o1QLl1J7M3oL0O1J0KO5J3
2866I5lK6J8n6rPo8j8j4o6l8J1k6k5M5M3%N9P5MM6O3Kj5J4l5o4j0m8q6k2j7m7
2899a59j1M0kNQ4L2J4N3M0j4L8K8m2k1Mm6l8pm7m6J1j2l9K6K7j8L0O1RL5N3K0
2931A08rN1Ll7k0op1l6j2o0m3Kl2oN4K1QN9P0mM4N7j3j7K8l5n1ol8p0lj7m6QK1
2966i8j5OO6LJ6P1K4jM4K5l6J5On2k6%o0o6ll0m6RK8k0L3O8J2M0P0K3jO0j4m0
3000A11Pl1o9m0j9o0l1K8k5k1N4L4NO3M2lM0M7k5RJ5l8k4nm6n6Lk4n4mJ5k6mN2
3034h0j1J3Q0K1nO6L2j2KJ9l8k1on0p0Lm7l0MJ7j6N4M6J6M7P5QQM1j5l3kl4p6
3068Fl1j7o2j2Nl9NM4J3ON5M1JM2L6j8QL4l1k4kj8n5%j1m7j0Nl8J7L1OJ6O7J6
$$ plain form
3103 39 57 101 126 119 131 143 92 54 45 -6 -61 -63 -117 -151 -137 -131 -143 -97 -60 -41 0 48 63 73 120 111 79 87 77 26 8 4 -64 -74
3137 -74 -64 -98 -115 -69 -73 -62 -17 9 6 67 94 83 116 136 107 90 92 43 -9 -6 -51 -110 -119 -123 -165 -149 -116 -103 -75 -8 19 26 90 107
3171 107 97 119 113 69 60 39 -18 -45 -46 -95 -108 -82 -77 -103 -53 -20 -19 21 67 70 82 124 120 101 104 87 44 31 12 -44 -65 -68 -121 -131
3205 -131 -103 -135 -130 -70 -53 -49 11 55 59 101 125 103 89 89 52 15 4 -30 -88 -81 -93 -146 -106 -66 -72 -29 29 41 62 129 126 113 133
3238 133 130 70 66 43 -14 -40 -44 -78 -108 -91 -121 -126 -95 -71 -66 -28 3 -1 32 80 64 72 109 68 42 43 20 -29 -42 -49 -93 -88 -72 -94 -88
3273 -88 -48 -27 -18 58 74 94 118 140 129 119 111 72 39 20 -27 -79 -85 -120 -142 -127 -112 -113 -76 -28 -18 9 48 55 58 90 88 47 59 56
3307 56 -1 -13 -21 -62 -89 -75 -80 -95 -53 -43 -37 -2 35 39 77 105 108 112 133 103 84 70 42 -21 -28 -59 -101 -108 -105 -126 -112 -79 -56 -41 3
3342 3 36 36 80 94 70 77 84 41 5 12 -42 -82 -60 -79 -102 -87 -65 -78 -40 -11 3 35 81 77 79 117 116 82 102 92 40 17 10 -51 -69
$$ packed form
3103C9J8M4K5pJ2J2n1l8rn1n5kn4l4J4Oj2M6L7J9M1M8J5J0M7rl2Qj0n1j8mo8j0
3137g4J0l4j7M6mJ1M5K6lO1K7j1L3K0k9j7Km9n2Lm5n9rmm2J6L3J3K8O7K7PO4J7
3171A07j0K2om4rk1n7k7jm9j3K6Nk6N0L3JM0M6LJ2M2mj9Lj7m3j3j9n6k1ln3j0
3205a31K8l2NO0J7MO0M4MM2K4k2j4%l7l7j1l4n8Pj2n3M0M0oM3N8J2K1O7lj3K0
3238A33lo0mk3n7k6ml4l0J7l0nL1K4NL8L1mL3M8j6QL7m1k6Jk3m9j3pm4NJ6k2O
3273h8M0K1RP6J6K0K4K2j1j0ql9l3j9m7n2ol5k2J5J5jL7M8J0K7L9PLL2km1J2l
3307E6n7j2qm1k7J4nj5M2J0OL5L7ML8K8LMK1l0j9j4k8o3pl1m2pLk1J4L3K3J5M4
3342CL3%M4J4k4PPm3l6Pn4m0K2j9k3J5K2j3L8K9J4L2M6mKL8jl4K0j0n2k3po1j8
$$ plain form
3377 -69 -75 -103 -123 -92 -93 -100 -57 -23 -19 28 67 59 73 95 75 51 55 24 -29 -35 -64 -104 -100 -89 -106 -81 -30 -36 -16 40 60 67 104 111 96 105
3413 105 106 66 46 48 -3 -44 -33 -61 -103 -93 -84 -101 -73 -40 -54 -19 22 32 37 86 77 60 75 50 27 14 2 -49 -67 -65 -92 -102 -82
3446 -82 -83 -79 -28 8 4 58 107 99 116 138 117 85 82 49 4 -10 -24 -90 -79 -84 -111 -94 -69 -74 -45 4 10 29 56 63 51 59 80 36 23
3481 23 17 -7 -43 -44 -68 -89 -74 -80 -103 -67 -31 -43 9 47 46 69 110 101 107 113 107 67 52 28 -29 -40 -43 -84 -105 -93 -96 -77 -52 -24 -10
3516 -10 22 55 46 72 91 62 45 56 20 -16 -16 -44 -85 -77 -77 -94 -87 -59 -57 -38 -3 7 34 74 82 76 97 105 70 80 67 25 -4 -12 -48
3551 -48 -75 -58 -76 -102 -79 -62 -57 -24 26 30 49 73 68 66 89 54 15 9 -8 -54 -49 -51 -84 -89 -71 -82 -63 -33 -10 -10 39 64 59 83 89 82
3587 82 80 78 54 30 20 -11 -42 -37 -49 -89 -69 -59 -79 -60 -19 -28 -5 29 45 48 67 78 55 56 43 7 -9 -30 -70 -80 -71 -106 -117 -69
3621 -69 -65 -59 -13 32 40 66 98 91 97 106 92 53 55 31 -19 -25 -36 -68 -68 -61 -79 -62 -39 -23 -14 22 35 23 50 60 49 56 54 25 2 15 -20
$$ packed form
3377f9ok8k0L1jpM3L4MM7L9qJ4K2k0k4Ml1n3ok9m0MJ1j7K5N1oK0N6K0PL7Pj5R
3413A05Jm0k0Kn1m1J1k8m2J0Rj7K8L3j4L5M1J0NM9rj7J5k5k3j3j2n1j8Kk7j0K0
3446h2jMN1L6mN4M9qJ7K2k1l2ll3m5j4j4o6J1nk7J7K5nK9M9OJ9K7Pj2QK1m4j3
3481B3ok4l6jk4k1J5ok3L6L6j2N2L8jK3M1rOOom0j5k4n7j1lm1k1J2lJ9K5K8J4
3516a0L2L3rK6J9k9j7J1l6l6%k8m1Q%j7PK8KJ9L5J0K7M0QoK1Ql5J0j3m2k9ql6
3551d8k7J7j8k6K3J7NL3N0MJ9K4nkK3l5l9oj7m6Nkl3nJ8j1J9L0K3%M9K5nK4Op
3587H2kkk4k4j0l1l1Nj2m0K0J0k0J9M1rK3L4J6LJ9J1k3Jj3l6j6k1m0j0Rl5j1M8
3621f9MOM6M5QK6L2pORj4l9Kk4n0oj1l2%Pj8J7K3J6RL6J3j2K7J0j1Pkk9k3J3l5
$$ plain form
3658 -20 -65 -42 -56 -88 -70 -64 -74 -53 -23 -23 3 53 58 69 106 110 68 85 75 47 9 6 -43 -61 -69 -76 -88 -79 -70 -55 -23 -1 23 36 75
3693 75 56 62 87 49 31 37 12 -29 -26 -39 -83 -77 -58 -80 -67 -25 -37 -22 16 29 29 65 73 67 78 92 39 38 43 4 -35 -31 -48 -89 -65
3728 -65 -51 -77 -59 -28 -15 0 26 34 59 75 63 69 65 43 14 14 -2 -41 -55 -53 -67 -82 -48 -55 -60 -25 -5 10 36 60 57 67 84 53
3762 53 51 55 32 14 -11 -15 -49 -52 -57 -77 -72 -52 -55 -40 0 17 23 51 70 73 83 77 53 49 34 -8 -20 -29 -47 -80 -62 -59 -74 -50 -20 -4 1
3799 1 53 53 65 83 81 61 54 54 23 12 4 -32 -37 -44 -61 -69 -52 -54 -57 -21 -18 -1 21 34 29 54 60 52 61 49 33 13 15 -3 -38 -44 -51 -75 -54 -44
3839 -44 -62 -44 2 7 18 64 65 69 88 87 73 47 42 6 -37 -32 -61 -92 -78 -78 -80 -50 -45 -25 -2 35 30 52 72 61 50 62 38 13 27
3874 27 8 -22 -34 -26 -55 -59 -35 -51 -51 -23 -22 -9 21 23 21 51 73 58 49 57 39 19 13 -10 -42 -56 -67 -85 -77 -65 -66 -57 -22 -4 10 39
3910 39 59 52 82 72 62 56 41 5 -19 -18 -49 -61 -54 -59 -62 -37 -24 -37 -7 24 23 41 62 49 47 70 47 25 33 13 -21 -27 -32 -66 -70 -60
$$ packed form
3658b0m5K3j4l2J8Oj0K1L0%K6N0NJ1L7Mm2J7j0k8l8lm9j8qpj2RRJ5L2K2K4J3L9
3693G5j9OK5l8j8Ok5m1Lj3m4OJ9k2J3M2j2J5L8J3%L6QoJ1J4n3jNl9l9Mj7m1K4
3728f5J4k6J8L1J3J5K6QK5J6j2Omk2k9%j6l9j4Kj4j5L4pnL5K0J5K6K4lJ0J7l1
3762E3kMk3j8k5ml4lnk0NK0lJ5M0J7OK8J9LJ0ok4mj5m2j2rj8l3J8Lj5K4L0J6N
3799AN2%J2J8kk0p%l1j1ql6npj7qJ7klL6LJ7K2J3nK5OqRj2j6k0Kj8l5opk4K1J0
3839d4j8J8M6NJ1M6JMJ9jj4k6nl6m3Nk9l1J4%kL0NK0K3L7nK2K0j1j1J2k4k5J4
3874B7j9l0j2Qk9mK4j6%K8JJ3L0KkL0K2j5rQj8k0ok3l2j4j1j8QJ2jRL5J8J4K9
3910C9K0pL0j0j0oj5l6k4Jl1j2PnlK5J3j3L0L1jJ8K1j3kK3k3k2Qk0l4onl4mJ0
$$ plain form
3946 -60 -67 -70 -39 -31 -30 14 32 29 48 66 50 58 68 35 33 21 -10 -32 -20 -37 -68 -59 -55 -59 -39 -3 -6 13 44 41 57 55 68 52 41 32 2
3983 2 -3 -12 -33 -52 -46 -64 -71 -43 -46 -51 -19 -8 1 21 51 40 51 70 70 44 53 28 3 -8 -14 -46 -53 -45 -72 -70 -43 -31 -35 8 31 30 59 77
4021 77 54 58 58 42 20 4 -21 -48 -40 -54 -61 -61 -40 -53 -25 -4 -4 6 37 36 40 49 53 44 52 42 24 15 7 -17 -21 -24 -42 -63 -48 -37 -41 -29 -1
4060 -1 -9 9 46 41 54 75 58 45 59 27 2 -6 -23 -51 -58 -58 -75 -74 -44 -30 -23 3 21 39 64 65 57 60 64 43 30 23 -2 -24 -22 -40 -60
4097 -60 -43 -41 -42 -34 -15 -12 -5 16 23 29 51 40 36 61 43 27 16 18 -12 -32 -17 -56 -69 -46 -53 -50 -28 -10 -12 18 51 34 59 66 63 49 47 30
4135 30 4 -3 -22 -44 -49 -56 -69 -55 -45 -49 -40 2 14 15 29 46 38 57 58 40 38 15 2 -13 -11 -36 -42 -40 -47 -52 -26 -23 -27 -6 25 31 34 50 60
4174 60 45 67 41 40 29 21 -11 -20 -27 -55 -52 -52 -60 -61 -32 -18 -4 19 27 26 44 56 59 40 41 22 -3 -3 -14 -38 -35 -42 -57 -42 -29 -36 -23 1
4212 1 -11 12 26 41 33 49 43 33 37 42 21 -4 2 -20 -37 -38 -55 -59 -56 -48 -55 -30 11 5 35 55 56 47 59 54 26 32 8 -16 -19 -30 -56 -44 -41
$$ packed form
3946f0plL1QJM4J8lJ9J8j6QJ0l3kj2l1k2J2j7l1RMmK0L6lJ9L1lJ6kJ3j6j1rl0
3983Bnrk1j9Oj8pK8lnL2J1RK0L0j1J1J9%k6Rk5k5j1ol2pQk7KK7J2mM3K3jK9J8
4021G7k3M%j6k2j6k5k7Qj4p%K1j3K8K1%J0L1jMRMrQj0j8rqk4mlj8k1J5J1mJ2K8
4060aqJ8L7nJ3K1j7j3J4l2k5qj7k8p%j7JL0J4PK6J8J8K5JqLMk1j3pk5k2Kj8k0
4097f0J7KjQJ9LPK1POK2j1mK5j8j6j1Kl0k0J5l9j3K3pLK2J8kL0L3j7K5Plj4kj7
4135C0k6pj9k2npj3J4J0mRM2J2JJ4J7qJ9Jj8kk3j3j5Kk5oKpnK6LmK1L1OLJ6J0
4174F0j5K2k6jj1ql2rpk8L%qjK9J4J4K3QjJ8J2Lj9Jj9k5%j1k4Lpj5J5J3pJ3K4
4212Aj2K3J4J5qJ6oj0MNk1k5Ok2j7jj7mLQpK5M1oL0K0JrJ2nk8Ok4k4lj1k6J2L
$$ plain form
4251 -41 -54 -40 -18 -6 2 18 33 30 43 59 48 43 43 30 12 2 -11 -21 -21 -46 -55 -37 -45 -44 -34 -16 -17 -5 20 24 25 46 54 35 39 38 12
4288 12 2 7 -21 -38 -35 -40 -53 -41 -36 -34 -13 13 12 26 51 49 52 59 56 30 29 18 -12 -14 -25 -49 -41 -44 -54 -49 -27 -21 -27 -1 12 13 23 48 37
4327 37 49 51 37 17 26 6 -11 -17 -28 -35 -37 -27 -48 -29 -15 -9 -14 29 26 37 50 57 50 57 50 9 3 1 -32 -51 -44 -49 -66 -54 -52 -46 -11 -8 9 25
4367 25 50 36 41 52 38 37 39 20 -9 -8 -7 -22 -34 -28 -35 -45 -30 -26 -30 2 10 18 33 33 30 33 39 31 23 34 3 -11 -17 -30 -58 -69 -58 -67 -41 -32
4407 -32 -35 -19 12 29 36 50 59 49 53 35 23 18 7 -12 -26 -25 -41 -51 -30 -27 -34 -17 -4 -11 4 25 18 30 44 37 19 32 8 -3 7 -6
4443 -6 -30 -29 -31 -39 -47 -31 -40 -23 -5 -3 1 21 36 40 51 61 44 33 38 15 -6 -6 -25 -43 -38 -47 -50 -38 -26 -20 -10 11 18 24 27 40 30 32 28 4
4483 4 18 -1 -23 -23 -30 -47 -45 -33 -41 -39 -17 -10 -16 9 23 33 36 39 42 36 34 25 18 13 -6 -32 -24 -36 -49 -51 -35 -47 -28 -21 -13 0 24 36 23 36
4523 36 32 30 27 16 -11 -13 -14 -34 -38 -39 -47 -56 -29 -29 -28 -14 23 16 31 42 32 30 41 39 28 13 14 0 -5 -10 -38 -50 -36 -51 -48 -27 -30 -26 -6 4
$$ packed form
4251d1j3J4K2J2QJ6J5lJ3J6j1n%j3j8j0j3j0%k5rJ8qJJ0J8jJ2K5MJK1Qj9Mjk6
4288A2j0Nk8j7Lnj3J2NKK1K6jJ4K5kLPlk6jj1l0kj1k4Qlj0NK2OoK6J3JJ0K5j1
4327C7J2Kj4k0Rk0j7oj1pkJ0k1J9J4OnM3lJ1J3PpPpm1okl3j9Pnj7J2KOL5LJ7J6
4367B5K5j4NJ1j4jKj9k9JJj5j2Opj0J5MmL2QQJ5%lLOqqJ1l1j4oj3k8j1J1rK6R
4407c2lJ6L1J7PJ4Rj0Mj8j2nj1j9j4Jj6j0K1LpJ7J3pJ5K1pJ2J4pj8J3k4j1J0j3
4443fk4JkqqJ6rJ7J8KMK0J5MJ1J0j7j1Nk3k1%j9j8NrlJ2J2OJ0K1POLJ3j0Kmk4
4483DJ4j9k2%pj7KJ2qKK2PoK5J4J0LLLokrpnj9k6Qj2j3kJ6j2J9PQJ3K4J2j3J3
4523C6mklj1k7kjk0mjqrK7%JJ4L7pJ5J1j0kJ1kj1j5Jj4nnk8j2J4j5LK1lMK0J0
$$ plain form
4563 4 14 18 27 20 36 40 18 8 9 -1 -32 -27 -37 -45 -51 -34 -37 -20 -12 4 20 34 39 55 52 58 48 36 42 16 -2 1 -25 -27 -33 -34 -37 -26 -30 -30 -13
4604 -13 -7 -8 4 18 17 28 44 35 25 30 17 12 -5 -5 -26 -41 -41 -42 -43 -24 -27 -13 5 16 28 48 50 34 45 47 38 23 24 2 -20 -14 -29 -50
4642 -50 -42 -43 -44 -30 -16 -10 -4 11 27 18 37 34 21 31 24 11 -2 5 -15 -22 -13 -24 -33 -19 -10 -17 -7 5 18 13 39 42 36 42 35 37 38 13 7 -1 -5 -27
4684 -27 -33 -27 -47 -46 -26 -32 -24 -2 -2 12 11 35 23 23 32 32 15 23 10 -7 -8 -14 -38 -28 -25 -26 -17 -11 -17 -3 22 24 35 38 46 34 30 38 17 13 9 -10 -25
4727 -25 -22 -39 -49 -47 -40 -44 -22 -16 -19 4 26 16 19 35 36 20 23 21 -1 10 4 -26 -24 -22 -34 -34 -17 -18 -20 -2 7 8 25 39 30 32 36 21 18 24 3 -23
4769 -23 -23 -26 -35 -29 -40 -48 -35 -31 -26 -12 -4 -2 10 23 31 29 38 42 30 24 24 -1 -16 -20 -22 -38 -27 -29 -37 -24 -4 -8 15 24 33 32 37 40 38 27 9 2 -8 -12
4813 -12 -22 -28 -45 -43 -48 -29 -27 -32 -3 -4 -5 11 18 24 34 36 28 29 28 7 2 4 -9 -16 -18 -23 -40 -23 -12 -23 -12 13 14 15 30 15 24 32 37 27 14 18
4855 18 -16 -15 -13 -34 -43 -32 -32 -48 -24 -28 -13 0 12 11 27 42 37 32 36 19 9 15 7 -10 -23 -19 -30 -27 -27 -23 -21 -6 7 -5 5 17 12 37 33
$$ packed form
4563DJ0MRpJ6Mk2j0Jj0l1Nj0qoJ7lJ7QJ6J6J4NJ6lOj0j2Ok6j8Lk6kojlJ1m%J7
4604a3OjJ2J4jJ1J6rj0Nj3nj7%k1j5%jjJ9lJ4J8J1J2K0Kj6J1Krj5Jk2k2Oj5k1
4642e0QjjJ4J4OOJ5J6rJ9lj3J0pj3j3Pk0pRj1rJ4RpJ0J2J3nK6LoOpKJk5oqmk2
4684b7oOk0JK0oQK2%J4jK4j2%R%j7Qj3j7jok4J0LjROoJ4K5KJ1LQj2mQk1mmj9j5
4727b5Lj7j0KPmK2OlK3K2j0LJ6Jj6Lkk2J1ol0KKj2%J7jkJ8RJJ7J4rKMj5lOk1k6
4769b3%lrOj1qJ3MNJ4QKJ2J3QkRMj2o%k5j5mkj6J1kqJ3K0mK3RRjNLkj1j8pj0m
4813a2j0oj7KnJ9KnK9jjJ6POJ0KqJjk1nKj3pknj7J7J1j1J1K5JJJ5j5RQNj0j3M
4855A8l4JKk1rJ1%j6K4mJ5J3J2jJ6J5nnMj7j0Oqj7j3Mj1L%MKJ5J3j2J0J2nK5m
$$ plain form
4894 33 10 23 8 1 -6 -11 -8 -28 -28 -29 -23 -31 -42 -33 -15 -15 -4 -5 20 27 29 29 30 23 30 23 -4 -4 7 -13 -25 -24 -34 -33 -20 -17 -15 5 11 11 23 30 31 25
4938 25 34 20 9 5 -2 -24 -14 -31 -36 -33 -37 -34 -20 -13 -6 -4 19 22 17 32 31 27 29 25 14 -1 16 -18 -14 -20 -24 -41 -28 -12 -35 -13 -9 4 14 22 22
4979 22 32 38 25 9 22 13 -10 -6 -8 -29 -32 -30 -27 -41 -18 -13 -15 9 4 12 23 34 33 28 35 33 17 17 7 -5 -4 -19 -24 -19 -29 -38 -30 -13 -14 -17 17 11
5021 11 13 37 40 31 25 33 11 14 5 -10 -19 -17 -28 -46 -30 -17 -22 -10 2 -7 8 21 19 26 46 31 19 34 13 6 -5 -17 -22 -20 -20 -32 -31 -19 -23 -12
5061 -12 -2 1 2 7 10 16 30 29 15 26 31 8 7 -3 -14 -32 -25 -27 -36 -24 -24 -12 -7 -8 1 21 31 37 30 28 30 26 10 -5 0 -28 -19 -29 -44 -35 -33 -29 -22
5104 -22 -19 -9 6 10 16 23 31 12 4 18 15 4 1 -2 -14 -19 -15 -25 -30 -23 -31 -22 -7 -13 -4 10 16 13 20 38 19 21 24 -3 -15 -4 -19 -27 -26 -34 -45 -25 -23
5147 -23 -34 -9 4 10 23 17 24 25 29 24 18 18 17 -3 -2 -3 -19 -39 -22 -15 -21 -16 -6 -8 -3 11 6 14 22 13 14 18 18 10 4 -4 -12 -18 -21 -22 -30 -15 -28 -30 -16 -2
5193 -2 2 9 24 14 30 32 24 29 26 13 2 1 -11 -21 -6 -21 -31 -23 -12 -16 -8 1 1 11 15 25 10 28 27 15 5 0 -18 -11 -28 -27 -35 -23 -19 -28 -27
$$ packed form
4894C3k3J3j5ppnLk0%jOqj1RJ8%J1jK5PK%JpPpk7%J1k0j2Jj0JJ3LKK0O%J2PJo
4938B5Rj4j1mpk2J0j7nLmLJ4PPKK3LnJ5jmKmj1j5J7l4Momj7J3J6k3K2MJ3J0Q%
4979B2J0Oj3j6J3rk3Mkk1lKLj4K3NkK4nQJ1J1jnPkj6%j0j2Jj5nNj0rQJ7jlL4o
5021A1KK4LroQk2Lrj5rKj1j8J6J3nJ2J2rJ5J3kPK0j5j2J5k1pj1j2nK%j2JJ2mJ1
5061a2J0LJNLOJ4jj4J1Nk3jj0j1j8PkrJ2%J2NjRK0J0OpkKmj6j5Nk8Rj0j5RKMP
5104b2LJ0J5MOPQj9qJ4lj1llj2nMj0nPqRJ5oRJ4OlPJ8j9KLk7j2J1j5qJqj1K0K
5147b3j1K5J3OJ3oPJMno%jk0Jjj6k0J7PoNJ0kNJ4nQQrJM%qoqqoljqJ5j3kJ4J4
5193bMPJ5j0J6KqNlj3j1jj2j0J5j5j0QJ1mQR%J0MJ0j5J8jj2j0nj8Pj7JqJ2MrJ
$$ plain form
5234 -27 -10 -11 -12 11 17 19 23 27 38 41 21 21 14 16 -7 -4 -14 -25 -24 -11 -25 -13 -7 0 -3 7 19 26 26 23 29 24 18 3 -4 -6 -17 -24 -29 -23 -30 -22 -22 -23 -10
5279 -10 -2 0 3 22 18 18 28 40 25 18 30 9 1 16 -7 -18 -18 -15 -29 -26 -21 -26 0 5 9 7 14 14 25 20 25 11 21 3 -19 -18 -24 -40 -27 -20 -48
5320 -48 -20 -21 -20 -13 12 14 13 23 31 22 30 23 13 17 7 -10 -9 -5 -29 -29 -23 -23 -22 -15 -12 -18 -20 2 9 9 23 3 10 18 16 8 -5 -4 -20 -13 -22 -29 -25 -14 -11 -14 -4
5367 -4 -9 6 12 20 32 20 26 21 20 14 5 -7 4 -16 -19 -8 -24 -37 -21 -15 -18 -8 -9 -10 6 6 12 5 14 12 9 9 8 -8 -16 -14 -8 -18 -22 -10 -18 -7 -1 4 11
5412 11 14 9 13 20 35 25 26 26 9 14 6 -12 -19 -19 -31 -29 -14 -11 -16 -20 8 0 12 16 23 25 18 22 4 11 2 0 -3 -4 -30 -17 -14 -14 -7 5 -7 -4 7 15 17 24
5458 24 26 14 28 24 11 18 13 -4 -3 -18 -21 -30 -23 -32 -23 -28 -11 -12 -9 -8 2 13 16 18 16 22 9 4 10 -7 -13 -23 -28 -26 -34 -21 -24 -14 1 -4 12 21 19 15 34
5503 34 24 23 19 8 5 1 1 -13 -26 -19 -32 -33 -30 -32 -26 -21 -3 -8 -4 11 15 16 18 13 8 23 8 0 -10 -12 -15 -15 -10 -23 -15 -13 -10 -9 4 5 4 9 16 5 6 14 11
5550 11 9 16 -12 -17 -19 -32 -34 -36 -27 -34 -21 -14 -6 -12 -4 0 -3 2 13 12 19 6 12 3 3 -2 -9 5 -21 -20 -17 -13 -11 -15 -6 -7 2 5 12 19 15 12 15 21 8 -5 -2 1 -20 -27
$$ packed form
5234b7J7jjK3OKMMJ1Lk0%pKk3Lj0j1JJ3j4J2OPlJ0J2P%lOnoj5pkj1pnOpQ%jJ3
5279a0QKLJ9m%J0J2j5pJ2k1qJ5k3j1%Lj4LNnK6NMkP%J1nNj4J0j8k2Joj6J3Pk8
5320d8K8jJPK5KjJ0QrQpj0Mj0j7JMk4%O%JPLokK2P%J4k0PQkqj3Jj6PrpMJ1LlJ0
5367dnJ5OQJ2j2Onjorj2J1k0lJ1j6j3J6OlJ0jjJ6%OpRkl%jj6qKOj0mJ2qJ1ONP
5412A1LnMPJ5j0J%j7Nqj8p%j2KJ5LnmK8qJ2MPKpMj8Prkljk6J3L%PJ2j2LJ1QKP
5458B4Kj2J4mj3Pnj7Jj5lrPrRnJ7jLJJ0J1LKkOj3nOj7oj0nKqJ3lJ0J5nJ6RkmJ9
5503C4j0jmj1lm%j4j3Pj3jLkONJ8nMJ5MJKnnJ5j5qj0kl%Nj3QKLJJ3JjNPj1JQl
5550A1kPk8nkj3kkRpJ3PQoQMlNJ1jPj3Or%npJ4k6JLMKmRjRLPPmlLOj3j3LLk1p
$$ plain form
5600 -27 -41 -30 -32 -26 -21 -10 -22 3 0 -1 13 4 13 13 15 17 5 -3 -6 -4 -9 -3 -11 -9 -13 -9 -3 -3 -2 7 11 -2 5 15 -2 8 11 7 5 5 -3 -10 -21 -27 -21 -27 -33 -20
5648 -20 -8 -21 -11 -10 13 7 14 22 29 16 15 7 0 7 -5 -11 -17 -19 -22 -20 -16 -19 -11 7 2 -4 15 14 5 6 8 9 2 5 -4 -9 -6 -12 -4 -14 -27 -32 -19 -13 -12 -6 8 2
5696 2 21 17 20 13 29 15 13 17 7 2 -3 -7 -18 -18 -16 -13 -17 -16 -6 1 -6 12 15 2 25 8 12 3 8 -1 -8 -5 -12 -16 -19 -18 -25 -21 -23 -15 -6 -8 2 15 19 14 17 22 15
5745 15 26 16 13 17 0 -1 -18 -10 -25 -31 -25 -16 -24 -14 -13 -9 8 0 12 -3 10 6 -7 10 -9 -9 -17 -22 -19 -30 -27 -20 -19 -18 -19 -13 0 5 12 10 29 18 17
5788 17 14 6 5 -2 6 9 -12 -14 -29 -14 -22 -19 -18 -20 -16 -14 -1 1 -6 2 19 11 4 8 6 6 -15 -4 -19 -8 -19 -22 -20 -27 -25 -19 -10 -7 9 15 22 13 21 18 18 14 15 -4
5836 -4 -11 4 -18 -15 -15 -24 -24 0 -9 -14 1 -4 -2 12 10 9 -10 -5 3 3 6 5 -8 -3 -7 -12 -9 0 -20 -16 -4 -6 4 8 8 21 13 19 14 19 14 3 6 -4 -2 -7 -11 -19
5884 -19 -22 -18 -28 -14 -13 -7 -15 -2 7 2 13 9 17 15 4 7 -1 3 -6 -8 -18 -3 -7 -2 -10 0 -3 9 5 15 16 18 16 27 21 22 10 9 -2 -3 3 -17 -14 -22 -16 -20
5930 -20 -22 -13 -11 -4 9 5 4 12 14 9 19 14 18 1 8 0 -1 -4 -15 -11 -7 -11 -8 -15 4 3 18 11 11 17 12 17 5 10 5 0 4 -4 -16 -20 -15 -25 -12 -17 -14 -27 -4 -17
$$ packed form
5600b7j4J1kONJ1j2K5ljJ4rR%KKj2qlKnOqKmMO%JRMj3PJ0j7J0Lmk%qpj1oOooJ3
5648b0J2j3J0JK3oPQPj3jqpPj2ooklKMlQJ8noJ9jrJKJpLrnLoQj0j3nJ3OJOJ4o
5696BJ9mLpJ6j4kMj0nnmj1%KLmJJ0PpJ8Lj3K3j7MrNrpLpmlJpMkQRkJ0J3MnLNp
5745A5J1j0lMj7jj7Qj5oORqJ0JMJ7qJ2j5J3mj3J7j9%qnLj1LPJJjOJ3NPkJ9j1j
5788A7lqjpQLk1kj5J5qLJkMKJ3KpQJ7qpMk%k1J1j5J1j1lKpKORLJ6OPrQl%mJj9
5836dpJ5k2L%r%K4rnJ5nKJ4kjj9NQ%Ljj3NmnLRk0MJ2kJ0M%J3qOnNnj1Lj0Knmq
5884a9lMj0J4JOqJ3RnJ1mQkj1LqMrkj0J5mNqJ0lJ2mJ0JKkJ1oJj2jj1jOk0LqOm
5930b0kRKPJ3mjQKnJ0nMj7Pqjlj1MMmLpJ9jJ5p%OnNj2NnnMqj2mNj0J3nLj3K3j3
$$ plain form
5978 -17 -6 2 4 5 18 18 7 15 18 16 -2 9 -6 -16 -5 -9 -9 -12 -2 -6 1 7 22 15 16 15 7 19 14 6 1 3 -15 -6 -12 -5 -18 -13 -10 -23 -6 2 -6 -8 -3
6023 -3 -5 0 10 19 15 12 25 16 4 14 8 0 -4 -9 -14 -3 -8 -3 -2 0 10 11 17 20 13 18 24 9 0 -2 -13 -5 0 -11 -16 -12 -17 -24 -12 -21 -6 2 -1 4 8 18 9 19
6071 19 12 7 23 12 4 0 7 -7 -3 -2 -8 -4 0 -8 -8 0 12 6 1 10 3 4 6 -1 -1 4 -3 -20 -10 -16 -20 -15 -16 -24 -8 -4 0 6 8 3 8 20 19 4 14 16 10 14 4
6120 4 -1 -5 -9 -10 -7 -12 4 -19 -9 2 0 4 14 6 12 17 14 2 10 -3 -9 -11 -9 -10 -16 -13 -11 -20 -13 -16 2 5 2 9 14 22 13 13 21 19 19 15 8 -10 -8 -7 -14 -16 -11 -6 -19
6171 -19 -9 -12 -8 6 -1 -5 10 8 3 4 5 -3 -7 0 -5 -18 -11 -15 -18 -18 -16 -4 -7 0 -6 7 -4 15 11 12 14 16 13 9 14 2 6 -5 -6 -16 -15 -13 -8 -12 -9 -7 0 -10
6219 -10 8 11 12 3 17 10 3 9 4 -5 4 -8 -7 -5 -7 -6 -12 -3 0 4 -2 13 -5 -1 20 22 10 21 15 8 13 12 6 8 -7 -9 -18 -12 -7 -15 -9 0 -1 2 1 8 11 17 19 9
6269 9 10 2 16 6 -12 -5 -7 -9 -18 -7 0 -14 10 0 -2 9 19 7 5 13 12 11 10 0 3 -1 2 -1 -16 -16 -19 -13 -8 -11 -8 -1 -5 -7 6 -2 -9 8 14 8 -13 11
6315 11 11 6 5 -6 -6 0 -3 -3 -3 5 1 11 8 8 13 11 18 10 10 2 14 14 0 -4 -4 -6 -18 -15 -10 -6 -9 -1 -3 11 -1 4 -3 10 17 13 16 9 -6 0 4 6 3 0 3 -7
$$ packed form
5978a7J1QKJJ3%j1QLkj8J1j5j0J1m%lJ0mPOJ5pJjqJ2nqnKj8RoPj3NLj3J7QqkN
6023ckNJ0RmlJ3rj2J0oqmnnJ1nNJKJ0JOLpNOj5rkj1QNj1nMnpJ2rJ5QlNMJ0rJ0
6071A9pnJ6j1qmPj4MJoMMq%QJ2onRpJKp%Npj7J0omNjqJ6MMOKnNJ2jj5J0KoMj0
6120DnmmjLnJ6k3J0J1kMJ0qONlj2Qj3okKjoLKrPlJ8LlPNQr%Qk%mpj8KJpkNNj3
6171a9J0lMJ4pmJ5knJJqmPnj3Pml%KJ2lPoJ3j1J9mJKKlmNj2Mj1jj0JKNmLKPj0
6219a0J8LJrJ4ppOnrRj2JKkJoRLMoJ5j8MK1Kj2J1opNjoKj5krONqORjLjPLOKj0
6269IJqJ4j0j8PkkrJ1Pj4K4j0kJ1J0j2kQjjjj0LmLlj5%lONlLPmkJ3qpJ7Ook1K4
6315A1%njj1%Ol%%QmJ0l%NkPq%qJ2%j4m%kj2LNMlQkJ4j2NpJ3PmLpj5OMKllLj0
$$ plain form
6365 -7 0 -3 5 4 14 17 13 15 6 15 14 13 14 4 8 1 3 -5 -11 -16 -24 -13 -21 -16 -8 -15 5 4 3 4 6 9 8 2 6 3 12 6 3 -8 5 -2 2 8 -1 -1 -2 0 -5 -3 5 19 12 7
6419 7 6 3 9 4 2 3 -8 -15 -24 -1 -22 -15 -14 -17 -27 6 -6 -8 8 5 3 13 22 7 10 6 5 3 11 5 -2 -2 -2 -7 7 -10 -10 3 -6 -1 3 10 5 10 11 5 6 3 -1
6468 -1 -8 -14 -17 -20 -22 -18 -21 -10 -17 -5 -7 2 6 6 9 16 17 8 17 13 15 16 14 14 5 10 4 7 0 -18 -8 0 -9 4 1 5 11 19 12 9 5 3 -2 -10 -6 -11 -9 -16 -17 -17 -12 -9 -1 -3 -7 -3
6524 -3 7 14 9 17 13 11 0 18 3 11 10 5 -4 9 -8 -10 0 -7 -2 9 1 3 -4 -4 3 1 -4 0 6 0 -2 4 -14 -7 -14 -19 -13 2 -13 -10 3 -3 3 18 8 11 11
6571 11 19 15 8 13 11 4 15 5 -6 8 2 -7 -9 -18 -8 -15 -3 -8 -5 4 1 1 2 6 -6 4 0 1 -11 -8 -15 -9 -11 -9 -17 -5 2 -6 -13 6 10 14 3 7 19 11 11
6618 11 13 15 7 6 3 -5 -6 -2 -10 -9 -6 -3 -4 -12 15 4 6 15 9 6 7 9 5 8 -6 -2 7 0 -14 -12 -18 -6 -3 0 1 4 15 3 8 22 16 24 11 12 10 15 -2 6 -2 -3
6668 -3 -6 -8 -11 -1 -1 -10 -6 -6 -8 -3 4 4 -1 1 14 8 10 3 -1 5 -2 8 -5 -9 -12 3 -1 -7 1 8 4 9 12 10 18 6 9 14 12 4 3 -3 -3 -7 -12 -9 -27 -11 -8 -3 -10 -19 -10
6721 -10 -8 -5 3 9 0 6 -1 -5 10 0 -1 3 3 -12 -10 6 2 -7 -4 -1 8 10 11 10 5 7 8 -3 10 3 -2 0 6 -8 -10 0 -11 -29 -13 -11 -6 -13 -9 -9 -3 1 -8 10
$$ packed form
6365gPlQjJ0LmKrRjjJj0MpKqonqJ1qNQpK0jjJKLjoMlRolj1J3pMOr%jKnKQJ4pn
6419GjlOnkJj1prK3k1PJlj0L3j2kJ6lkJ0Rj5LmjkQop%%nJ4j7%J3rNMPnNJoJlm
6468apollkMlJ1pJ2kRM%LPJrRmKJk%rNoLpj8J0QrJ3lMOQplmknqMnKpj%NLQkmM
6524cJ0PnQmkj1J8j5QjnrJ3j7kJ0pNJ1qKp%PknMOokOj8PpnOJ5j5LJ3oOJ5j0L%
6571A1QmpNkpJ1j0j1J4orkrJ0pJ2nLRl%JMj2J0mJj2LpOkKqJ2PqpJ9MMj1MJ2q%
6618A1KKqjlqjMqJLLjqK7j1KRolJKmLj4MRpj4KoJ2LLJLJ1j2NJ4oQj3JkNj7Qqj
6668clklJ0%rM%kNP%nKJ3oKpmOpJ0j3mlJ5moQPmNLkQj2LNkqjo%mnLj8J6LNprR
6721a0KLQOrOpmJ5j0jM%j5KJ6mrLLRKJjnKJj1J3pnKOj4kJ0j1j8J6KNpM%OMrJ8
$$ plain form
6769 10 12 5 8 9 11 2 -2 -1 -7 -10 -21 -8 2 -1 4 -1 5 11 7 5 7 -7 4 -4 -1 1 -6 2 4 -8 -19 -10 -7 -1 -12 -8 -10 -6 -5 -10 2 -5 8 6 10 0 0 2 4
6818 4 -8 -10 -8 2 -2 -3 -11 -10 1 3 -5 6 -12 2 -3 -5 10 13 10 4 -7 -14 -3 -20 -12 -14 -10 -14 0 -19 -1 3 10 -7 -8 2 7 11 2 2 -4 4 1 -3 8
6863 8 -7 -3 -12 9 6 1 11 -4 -3 -4 6 4 6 12 2 10 11 0 -8 2 4 -9 -13 -9 -14 -22 -10 -21 -13 0 -4 0 18 17 2 1 15 9 10 17 19 11 7 10 9 -5
6909 -5 -4 -6 -1 -2 -6 6 -4 -2 3 4 4 1 3 -1 5 2 0 -1 7 -11 -5 -6 -18 -21 -12 -8 -6 -4 -4 1 -1 10 12 15 9 15 6 5 14 -1 -1 8 3 -5 4 1 -6 -12 -1 -5 2 1 6 1
6963 1 7 -1 2 5 4 -6 -11 -4 -1 -7 -7 5 -5 -2 1 -3 -6 -3 1 5 8 5 17 8 20 5 6 5 2 12 10 -4 10 3 0 -6 -8 0 -13 -13 -9 7 -1 5 -6 -13 4 8
7011 8 6 5 -5 2 -2 5 -4 -7 -5 -2 -2 -2 -3 5 8 11 7 19 24 -6 8 15 6 3 10 12 2 4 2 -11 4 4 -3 -9 1 -10 -4 2 -2 3 1 -5 -1 1 1 -3 11 -7 5
7060 5 -6 -3 -8 1 -8 0 -3 12 -3 4 12 14 20 13 10 19 12 19 10 -1 -10 -1 -3 -7 1 -8 -12 -1 -7 -9 7 -16 -7 -5 7 2 1 5 -1 -2 8 1 -5 0 -7 -3 2 0 -4 3 0 1
7112 1 9 8 17 15 16 19 12 21 3 4 6 -6 -9 0 -16 -18 -16 -10 -21 -16 -13 -12 -3 6 0 1 0 10 19 12 5 13 7 8 3 -10 1 -11 -7 0 0 7 -4 4 4 7 2 -4 18 14 4
$$ packed form
6769A0KpLJKrmJolj1J3J0lNnOOmkKj4J1qLKpQKj2j1RLOj1MkMJnJ2pJ3kMj0%KK
6818Dj2kKJ0mjqJJ1KqJ1j8J4nkJ5Lloj1pJ1j7QkMmJ4j9J8MPj7jJ0NMr%oQlmJ1
6863Hj5MrK1lnJ0j5JjJ0kKOj0QJj1qJ0Kj3mMnqJ2j1QJ3mMJ8jj5jJ4oJPKqmLjj4
6909eJkNjmJ2j0KNJ%lKmOlkjQj8Ojj2lRMKK%NkJ1KLoOrjRj5%RnqRlpoJ1mPjNn
6963AOqLLjj0nPLo%J2j0LLmlLMMLlJ2rJ2j5JjlJ0kj4J4plokQj3%MJ6qOj1pJ7M
7011Hkjj0PmPrlKL%%jQLLmJ2Nl0J4PrlPKj0Kkj3J5%poJ0j1OOmNkoMK%mJ4j8J2
7060Ej1LnRrQlJ5j5PQKOplRpPrj1rRkmQrmJ1okJ6k3RKJ2njMojJ0poNpMNkmPlJ
7112AQjRkJLpRj8JKj2lRj6kKOj1NLJRRoJjJ0RppQoJnj3J1j2MP%Pj1Q%LnoK2mj0
$$ plain form
7163 4 12 5 9 -1 -4 -2 -8 -2 -13 -18 -16 -19 -16 -14 -13 0 -8 -2 8 3 14 11 9 18 6 9 9 15 4 -3 0 -9 -4 0 9 9 8 1 3 -7 11 12 9 3 -1 -1 -1 0 -8 -5 -1 -4
7215 -4 -16 -17 -13 -14 -14 -12 -17 -10 -2 -1 6 1 9 18 20 11 12 10 5 5 3 0 -1 -2 -11 4 -7 7 0 2 5 5 -2 -2 2 -3 -7 -3 -6 -6 -5 0 9 -1 -5 -1 -4 -3 -12 -5 -5 7 -10 -2
7269 -2 9 8 11 10 -2 7 13 0 -4 3 10 -9 -7 -4 -4 0 1 2 -1 5 6 2 15 6 6 -7 2 -1 -15 -1 -15 -3 -6 -5 -12 -2 -6 -5 -3 2 3 2 7 6 12 7 2 9 18 13
7319 13 6 9 -1 3 -3 0 -11 -5 -10 -2 -8 -2 -2 -2 12 6 -1 1 -2 5 3 -2 2 -10 -9 -6 -20 -4 -10 -8 -1 -6 -8 -6 -1 6 6 18 11 5 4 9 8 5 6 -3 2 -17 -1 -12
7369 -12 -3 -11 -6 -4 3 -5 3 -1 -9 -4 3 -1 -6 3 7 -1 -5 0 -4 -2 -2 -16 -4 -9 2 2 -6 3 -3 6 12 13 20 4 10 17 9 17 0 -9 -11 -9 -6 -5 -11 -11 -6 -13 -2 -16 -2 4
7421 4 -3 -2 -9 -6 -12 -4 -2 -12 -1 -3 3 0 -13 -7 -9 -15 -4 0 1 3 2 2 11 3 17 11 14 18 3 7 9 -4 -3 -10 -10 -11 -4 -12 -5 -6 -3 -5 -14 -9 -5 -1 0 -2 -6 -1 9 0 -6
7474 -6 10 2 0 -7 -7 4 -2 -5 4 5 1 7 19 15 8 11 9 9 16 3 4 1 5 -6 -14 1 -2 -5 -11 -7 -1 -1 -6 -8 -3 2 0 -2 0 -6 3 0 2 3 -3 3 -1 -4 -8 2 -1 4 1 1
7528 1 11 17 0 15 18 19 7 1 1 0 2 -2 -14 -5 -7 -8 -18 -11 -5 -2 -8 2 -3 7 -4 4 2 9 1 5 9 -5 10 -4 -8 -2 -10 -7 5 -1 0 2 2 8 3 8 13 9
$$ packed form
7163DQpMj0lKoOj1nKlLKJJ3qOJ0nJ1lkRj2L%Oj1pLrNMR%jpKj0J8Jlom%%JqLMl
7215dj2jMj%KnPQJPnQRKrJkn%kljjrJ5j1J4pKL%p%MnmMl%JNRj0mMlJrP%J2j7Q
7269bJ1jLjj2ROj3mPPj9KL%MJJlOJmJ3r%j3Rlj4J4j4J2lJpJ0mJKNJjNjOnnPRn
7319A3pLj0MoLj1OnQoO%%J4opKlPknMj2JLj4J6oKPnkKNP%J2pojNjlJrNj9J6j1
7369a2RqNKPqQmqNPmnRMqmNmK%j4J2nJ1%qRoROJPj6OPqQj7rkKLJo%NpJ1j4J4O
7421DpJpLoQKj0J1kOlj3OkoJ1MJKj%RqJ4oLMj5MKj3Jp%jPqPjLkrNMMJkmNJ0ro
7474fJ6qkp%J1olRJmOJ2mpLk%Pj3JlMj1qJ5lloMO%nkNNkkKoRlKJoOmlmJ0lNl%
7528AJ0Oj7J5LJj2o%jKmj2Rkjj0POLoJ0nJ0j1QkPqMMj4J5j4mOqLJ2oJK%OnNNm
$$ plain form
7576 9 6 10 15 7 4 6 -6 -8 -4 -17 -9 -9 -13 -14 -13 -11 0 -2 -13 -2 1 4 2 9 5 7 11 9 9 2 1 -8 2 -11 -2 -1 -7 0 3 8 0 7 2 6 19 12 10 -5 7 -15
7626 -15 -3 -5 -14 -13 -11 -21 -9 -13 -7 -2 -10 -11 3 2 3 8 4 13 10 14 11 3 -8 1 -4 7 1 -1 0 -2 -8 2 -2 -10 8 0 2 6 2 7 7 -2 -7 -7 -2 -11 -7 -9 -16 -9 -10 -3
7678 -3 -9 -8 -2 1 4 14 13 14 14 18 18 13 10 7 0 3 2 -1 2 5 -10 -11 13 2 1 -9 2 -3 -4 7 4 -1 -7 -11 0 -9 -9 -7 -12 -9 -2 -8 -5 -6 0 -5 9 1 5 13 12 6
7730 6 -3 11 -1 10 6 9 10 11 -5 -8 1 9 0 -6 -10 -10 -8 8 9 2 6 1 -3 -6 -1 -3 -3 -12 -13 -15 -9 -1 -18 -3 -2 -5 8 2 3 4 6 12 13 5 6 6 13 15 6 2 -1 -2 -7
7783 -7 -2 -12 -13 -10 -2 -9 -5 -7 6 5 1 11 4 -14 -4 -10 -9 -11 -13 -19 -10 -15 -11 -12 2 2 1 7 2 5 15 13 0 11 13 -3 7 7 3 14 -3 -6 -11 -14 -2 -12
7829 -12 -10 -9 -18 -5 -11 -4 -3 -8 -10 6 -3 -1 -1 -9 -2 -7 -5 -10 -6 -10 -5 -7 -6 -2 -6 -1 8 8 5 9 5 9 17 14 3 -3 7 12 2 -3 -2 -8 -9 -7 2 -4 0 -7 -10 1 2 3 11 2
7883 2 -8 4 10 -1 -3 -5 7 -2 -2 -1 -1 -6 8 -8 -1 15 5 10 17 13 9 7 4 6 8 3 -8 7 6 1 -18 -10 -4 -10 -19 -19 -9 -12 -5 1 -1 0 -1 -1 4 0 2 -5 -9
7932 -9 -11 0 1 -13 -7 2 -3 13 -7 2 11 1 -3 7 2 4 9 10 -2 -4 -4 -7 -1 -3 -7 -7 -10 -8 -3 -17 -1 -2 -5 4 1 6 2 12 2 4 8 -1 3 -11 -6 -5 9 3
$$ packed form
7576IlMNqlKj2kMj3Q%mjJKJ1kj1J1LLkPmKMk%pjrJ0j3RJoPLNqPnMJ3pkj5J2k2
7626a5J2krJKj0J2mONqjJ4jJNmRlMlqj1RnJ1okJkoJ0mqJ8qKMmN%rn%NrMkpPjP
7678coJOLLJ0jJ%M%nllpLjlLLj5jK4j1jj0J1njJ1lnomJ1r%KnLPoLjOnJ4qMQjo
7730FrJ4j2J1mLJJj6lRQrom%KJ6JpMnmlNk%rjkOQj7J5JlJ3oJJKOJqJ%PKrmljn
7783gNj0jLQpMkJ3jmJ0pj8J0oJkkoRnMjJ4%jOnLJ0kj3J1Kj6J0%mJ1j7lnlJ2j0
7829a2KJrJ3oPJnkJ6rK%qPnKnMmNkJMmNR%lMmMQlj1oJ0Nj0nJojKRoMplJ1JJQr
7883Bj0J2Oj1kkJ2r%J%nJ4j6PJ6j0NPmmklKKnj1J5jnj9QOor%J0lPOkJj%NmKpm
7932ikJ1Jj4ORnJ6k0RRj0mJ0nKNJj2k%lOkm%lKNj4J6jlRlNmJ0j0KMrMj4NJJ4o
$$ plain form
7980 3 1 -1 5 3 -2 11 0 0 10 7 16 15 8 -1 -7 -8 -9 -6 -4 -8 -11 -14 -20 -17 -15 -15 -8 -3 -2 -1 -1 5 4 10 7 6 -2 -8 -2 5 0 3 -2 7 1 1 0 5 7 1 11 13 0 4 3 6
8036 6 1 2 -8 -11 2 -7 -5 -6 -9 -7 -19 -6 -6 1 -1 2 11 -1 16 5 11 13 16 5 12 -6 -4 -4 -1 8 0 -5 -1 -10 4 -1 -3 3 -6 1 14 0 -1 -9 -1 -2 -5 -3 -2
8085 -2 -11 -8 -14 -24 -4 -14 -13 -10 -3 -7 -4 3 -3 1 1 9 0 4 10 4 5 -7 -11 -4 -1 -6 0 7 -5 -7 -9 -9 -2 -8 0 -2 -2 12 2 2 -8 -3 -2 -8 -1 -13 -14 -16 -14 -10 -9 -5
8137 -5 -2 6 0 7 14 16 8 9 12 7 0 -6 -1 -3 6 -2 0 -3 8 -4 -6 -12 -5 -8 -6 -7 1 -4 -3 -9 -3 -5 6 -4 -8 -14 -12 -15 -15 -9 -19 -3 -10 1 0 5 8 10 -1 0 -11 12
8189 12 7 -2
$$ packed form
7980CkkOknJ3j1%J0lRjprojjLKmlloLK%PNJJ%OjOljqoOPnLnRo%jNKoJ0Kj3MjL
8036FnJj0lJ3rKjlKj2J3%PkLRj2J7j1OKLj1Pj8K%LRqnMrJ4nkOrPJ3j4jqQjlKJ
8085brLoj0K0j0JLPmLPoM%QrMOoJj2mPLnOPj2kk%PoQk%J4j0%j0NJoPj2jkKMJM
8137eLQoPPKqJLnpoNkRqKlJ1j2koPlKjQnJoOkJ1j0moKl%Oj0J6pJ1jNLKj1Jj1K3
8189A2nr
8191b
##END NTUPLES=NMR FID
##END=
