##TITLE=1H_LY-NV1
 aceton-d6
 8 sc, 
 11.02.2022
##JCAMPDX= 6.0         $$ Bruker NMR JCAMP-DX V2.0
##DATA TYPE= NMR FID
##DATA CLASS= NTUPLES
##ORIGIN= UXNMR, Bruker Analytische Messtechnik GmbH
##OWNER= root
$$ XWIN-NMR		Version 3.5
$$ Fri Feb 11 12:02:35 2022 Russian Standard Time (UT+4h)  she@DPX200
##.OBSERVE FREQUENCY= 200.131346
##.OBSERVE NUCLEUS= ^1H
##.DELAY= (6, 6)
##.ACQUISITION MODE= SIMULTANEOUS
##.ACQUISITION SCHEME= undefined
##.AVERAGES= 8
##.DIGITISER RES= 18
##SPECTROMETER/DATA SYSTEM= spect
##.PULSE SEQUENCE= zg30
##.SOLVENT NAME= CD3CN
##.SHIFT REFERENCE= (INTERNAL, CD3CN, 0, 15.7039)
##AUDIT TRAIL= $$ (NUMBER, WHEN, WHO, WHERE, WHAT)
$$ ##TITLE= Audit trail, XWIN-NMR		Version 3.5
$$ ##JCAMPDX= 5.01
$$ ##ORIGIN= Bruker BioSpin GmbH
$$ ##OWNER= she
$$ F:/spectra/data/she/nmr/H-F/1/audita.txt
$$ ##AUDIT TRAIL=  $$ (NUMBER, WHEN, WHO, WHERE, WHAT)
(   1,<2022-02-11 12:01:08.65 +0400>,<she>,<DPX200>,
      <created by zg, POWCHK disabled, PULCHK disabled
       configuration hash MD5:
       00 E9 B6 7A A2 85 ED C7 34 08 36 98 17 FE 4E 26
       data hash MD5: 16K
       3C 1D C8 5C 5F 1A 5A 01 EC 8B 12 AB 30 C6 09 85>)
$$ ##END=
$$ 
$$ hash MD5
$$ D4 C2 F3 00 87 B4 BA 40 01 9B BE 03 85 89 81 9B
##$RELAX= 
##$RELAX= 
##$RELAX= 
##$RELAX= 
##$RELAX= 
##$RELAX= 
$$ Bruker specific parameters
$$ --------------------------
##$DU= <F:/spectra>
##$EXPNO= 1
##$NAME= <H-F>
##$PROCNO= 1
##$TYPE= <nmr>
##$USER= <she>
##$AMP= (0..31)
100 100 100 100 100 100 100 100 100 100 100 100 100 100 100 100 100 100 
100 100 100 100 100 100 100 100 100 100 100 100 100 100 
##$AQSEQ= 0
##$AQ_mod= 1
##$AUNM= <au_zg>
##$AUTOPOS= <>
##$BF1= 200.13
##$BF2= 200.13
##$BF3= 200.13
##$BF4= 200.13
##$BF5= 200.13
##$BF6= 200.13
##$BF7= 200.13
##$BF8= 200.13
##$BYTORDA= 1
##$CFDGTYP= 0
##$CFRGTYP= 5
##$CHEMSTR= <none>
##$CNST= (0..31)
1 1 145 1 1 1 1 1 1 1 1 1 1 1 1 1 1 1 1 1 1 1 1 1 1 1 1 1 1 1 1 1 
##$CPDPRG= <>
##$CPDPRG1= <>
##$CPDPRG2= <>
##$CPDPRG3= <>
##$CPDPRG4= <mlev>
##$CPDPRG5= <mlev>
##$CPDPRG6= <mlev>
##$CPDPRG7= <mlev>
##$CPDPRG8= <mlev>
##$CPDPRGB= <>
##$CPDPRGT= <>
##$D= (0..31)
0 1.2 0 0 0 0 0 0 0 0.06 0 0.03 0 0 0 0 0.0002 0 0 0 0 0 0 0 0 0 0 0 0 
0 0 0 
##$DATE= 1644566468
##$DBL= (0..7)
120 120 120 120 120 120 120 120 
##$DBP= (0..7)
150 150 150 150 150 150 150 150 
##$DBP07= 0
##$DBPNAM0= <>
##$DBPNAM1= <>
##$DBPNAM2= <>
##$DBPNAM3= <>
##$DBPNAM4= <>
##$DBPNAM5= <>
##$DBPNAM6= <>
##$DBPNAM7= <>
##$DBPOAL= (0..7)
0.5 0.5 0.5 0.5 0.5 0.5 0.5 0.5 
##$DBPOFFS= (0..7)
0 0 0 0 0 0 0 0 
##$DE= 6
##$DECBNUC= <off>
##$DECIM= 32
##$DECNUC= <off>
##$DECSTAT= 4
##$DIGMOD= 1
##$DIGTYP= 9
##$DL= (0..7)
0 120 120 120 120 120 120 120 
##$DP= (0..7)
150 150 150 150 150 150 150 150 
##$DP07= 0
##$DPNAME0= <>
##$DPNAME1= <>
##$DPNAME2= <>
##$DPNAME3= <>
##$DPNAME4= <>
##$DPNAME5= <>
##$DPNAME6= <>
##$DPNAME7= <>
##$DPOAL= (0..7)
0.5 0.5 0.5 0.5 0.5 0.5 0.5 0.5 
##$DPOFFS= (0..7)
0 0 0 0 0 0 0 0 
##$DQDMODE= 0
##$DR= 18
##$DS= 0
##$DSLIST= <SSSSSSSSSSSSSSS>
$$ [...]
##$SUBNAM2= <"">
##$SUBNAM3= <"">
##$SUBNAM4= <"">
##$SUBNAM5= <"">
##$SUBNAM6= <"">
##$SUBNAM7= <"">
##$SUBNAM8= <"">
##$SUBNAM9= <"">
##$SW= 18.0517287032376
##$SWIBOX= (0..15)
0 0 2 0 0 0 0 0 0 0 0 0 0 0 0 0 
##$SW_h= 3612.71676300578
##$TD= 16384
##$TD0= 1
##$TE= 0
##$TE2= 300
##$TE3= 300
##$TEG= 300
##$TL= (0..7)
0 120 120 120 120 120 120 120 
##$TP= (0..7)
150 150 150 150 150 150 150 150 
##$TP07= 0
##$TPNAME0= <>
##$TPNAME1= <>
##$TPNAME2= <>
##$TPNAME3= <>
##$TPNAME4= <>
##$TPNAME5= <>
##$TPNAME6= <>
##$TPNAME7= <>
##$TPOAL= (0..7)
0.5 0.5 0.5 0.5 0.5 0.5 0.5 0.5 
##$TPOFFS= (0..7)
0 0 0 0 0 0 0 0 
##$TUNHIN= 0
##$TUNHOUT= 0
##$TUNXOUT= 0
##$USERA1= <user>
##$USERA2= <user>
##$USERA3= <user>
##$USERA4= <user>
##$USERA5= <user>
##$V9= 5
##$VALIST= <valist>
##$VCLIST= <CCCCCCCCCCCCCCC>
##$VD= 0
##$VDLIST= <DDDDDDDDDDDDDDD>
##$VPLIST= <PPPPPPPPPPPPPPP>
##$VTLIST= <TTTTTTTTTTTTTTT>
##$WBST= 1024
##$WBSW= 4
##$XGAIN= (0..3)
0 0 0 0 
##$XL= 0
##$YL= 0
##$YMAX_a= 37747
##$YMIN_a= -53098
##$ZGOPTNS= <>
##$ZL1= 120
##$ZL2= 120
##$ZL3= 120
##$ZL4= 120
##$ABSF1= 10
##$ABSF2= 0
##$ABSG= 5
##$ABSL= 3
##$ALPHA= 0
##$AQORDER= 0
##$ASSFAC= 0
##$ASSFACI= 0
##$ASSFACX= 0
##$ASSWID= 0
##$AUNMP= <proc_1d>
##$AZFE= 0.1
##$AZFW= 0.1
##$BCFW= 1
##$BC_mod= 2
##$BYTORDP= 1
##$COROFFS= 0
##$CY= 11.3945322036743
##$DATMOD= 1
##$DC= 2
##$DFILT= <>
##$DTYPP= 0
##$F1P= 2.36226072786647
##$F2P= -0.459571619588291
##$FCOR= 0.5
##$FTSIZE= 0
##$FT_mod= 4
##$GAMMA= 1
##$GB= 0.15
##$INTBC= 1
##$INTSCL= 1
##$ISEN= 128
##$LB= 0.24
##$LEV0= 0
##$LPBIN= 0
##$MAXI= 10000
##$MC2= 0
##$MEAN= 0
##$ME_mod= 0
##$MI= 1.114404
##$NCOEF= 0
##$NC_proc= 0
##$NLEV= 6
##$NOISF1= 3.799351
##$NOISF2= 2.8
##$NSP= 1
##$NTH_PI= 0
##$NZP= 0
##$OFFSET= 15.70392
##$PC= 1
##$PHC0= -16307.29
##$PHC1= 7.400782
##$PH_mod= 1
##$PKNL= yes
##$PPARMOD= 0
##$PSCAL= 0
##$PSIGN= 0
##$REVERSE= no
##$SF= 200.130013532006
##$SI= 16384
##$SIGF1= 3
##$SIGF2= 2
##$SINO= 400
##$SIOLD= 16384
##$SREGLST= <1H.CDCl3>
##$SSB= 0
##$STSI= 0
##$STSR= 0
##$SW_p= 3612.71676300578
##$SYMM= 0
##$S_DEV= 0
##$TDeff= 0
##$TDoff= 0
##$TI= <>
##$TILT= no
##$TM1= 0
##$TM2= 0
##$TOPLEV= 0
##$USERP1= <user>
##$USERP2= <user>
##$USERP3= <user>
##$USERP4= <user>
##$USERP5= <user>
##$WDW= 1
##$XDIM= 8192
##$YMAX_p= 0
##$YMIN_p= 0
$$ End of Bruker specific parameters
$$ ---------------------------------
##NTUPLES= NMR FID
##VAR_NAME=  TIME,          FID/REAL,        FID/IMAG
##SYMBOL=    X,             R,               I
##VAR_TYPE=  INDEPENDENT,   DEPENDENT,       DEPENDENT
##VAR_FORM=  AFFN,          ASDF,            ASDF
##VAR_DIM=   8192,          8192,            8192
##UNITS=     SECONDS,       ARBITRARY UNITS, ARBITRARY UNITS
##FACTOR=    0.0002768,     1,               1
##FIRST=     0,             0,               0
##LAST=      2.2672688,     0,               0
##MIN=       0,             -53098,          0
##MAX=       2.2672688,     37747,           0
$$ Real data points
##PAGE= N=1
##DATA TABLE= (X++(R..R)), XYDATA
0@%%%%%%%%%%%%%%%%%%%%%%%%%%Kj0J6j6J6j6J6j6J6k1K9l2L2l2L9m7M8n2O0o6
$$ 0 0 0 0 0 0 0 0 0 0 0 0 0 0 0 0 0 0 0 0 0 0 0 0 0 0 0 2 -8 8 -8 8 -8 8 -8 8 -13 16 -16 16 -16 23 -24 24 -28 32 -34
46c4P3p9Q7r7J05j16J28j41J56j74J96k18K43k75L14l65M30n15O38q24J133j744
$$ -34 39 -40 47 -50 55 -61 67 -74 82 -92 104 -114 129 -146 168 -197 233 -282 356 -468 665 -1079
68a079L360j5107m0272M1893M3921l029j8674j9209n337K1226J5761n476j7206
$$ -1079 2281 -12826 -53098 -11205 32716 29687 11013 -8196 -13533 7693 23454 17978 772
81G72j7599N716K4145J571j4732o052m873K494J5569j226j7663m085Q441Q137
$$ 772 -16827 -11111 13034 14605 -127 -6179 -11052 -8558 7011 5785 -11878 -15963 -7522 615
95F15L437q008o765R369J1675k17q765o531P298R765o002q554l08j121O086J1572
$$ 615 4052 -3956 -10721 -1352 10323 10106 1341 -5190 2108 11873 5871 -2683 -2991 -4112 1974 13546
111A3546r043j8148M910J7043M669r727j4431j944J3216P443m301p770r462K400
$$ 13546 4503 -13645 -8735 8308 12977 3250 -11181 -13125 91 7534 3233 -4537 -13999 -11599
125a1599K0563R748j5465j5678J782J4341J1832p495j9015m143J2783J1857K083
$$ -11599 8964 18712 3247 -12431 -10649 3692 15524 8029 -10986 -15129 -2346 9511 11594
138A1594r336j2713J784J6573Q709j1042j5538o47J1455O695l580p539n276K954
$$ 11594 2258 -10455 -8671 7902 16611 5569 -9969 -10616 839 7534 3954 -3585 -8861 -5907
152e907J0534N207p818j0246J093J0423M366p708p302J618M777M113J902n043
$$ -5907 4627 9834 2016 -8230 -7137 3286 7652 -56 -7358 -5740 -963 3150 5052 9
166Io077M807J0220Q08r751q277L654J0861J293j0763o204N647Q088K781l969
$$ 9 -6068 -1261 8959 9767 16 -8261 -4607 6254 7547 -3216 -9420 -3773 4315 7096 3127
181C127p835k490P283P468k871j0062m765O843R593k35q180m138L860O469L567
$$ 3127 -4708 -7198 85 7553 4682 -5380 -10145 -3302 6291 6056 -2124 -6262 -2402 4067 7634
196G634l154q405l514P175P856l006r467l387O349P901L17o671n082J849O499
$$ 7634 4480 -3925 -7439 -264 7592 4586 -4881 -8268 -1919 5982 6299 -372 -5454 -3605 2894
211B894M408m082r802k677R163P821m187q891j572O729O925k53o944n736J624
$$ 2894 7302 3220 -6582 -9259 -96 7725 3538 -5353 -6925 -196 6729 6476 -468 -6204 -4580
226d580P078M464m501q944j078Q957O525l750p350k029M361N998J034o024o448
$$ -4580 2498 6962 2461 -6483 -7561 1396 7921 4171 -3179 -5208 -847 5151 6185 161 -6287
241f287J014P045L922m514p109K49P262M241l151n023j372K902M244M61n152m405
$$ -6287 -5273 1772 5694 1180 -5929 -5680 1582 5823 2672 -2351 -3723 -821 3423 3884 -1268 -5673
257e673K631O279J597m748m266K298N764J562m227m762o66L795M314j121o385
$$ -5673 -3042 3237 4834 86 -4180 -1882 3882 5444 1217 -3545 -4211 -416 3898 2777 -3608
272c608l182N243P067j12o620m491L156O737J913n117o237o25N725N869j385p331
$$ -3608 -6790 -1547 5520 5408 -1212 -5703 -2547 4190 6103 986 -5251 -5876 -151 5718 4333 -2998
288b998l352N460P205J41o506n482J317N843K987l443n679j374M944O013j87o002
$$ -2998 -6350 -890 6315 6456 -50 -5532 -4215 1628 4615 1172 -4507 -5881 -937 5076 4889 -1113
304a113l537L438N185K29m680m062Q84M471K701k100l870m39M081L683j725n252
$$ -1113 -4650 -1212 3973 4202 -478 -4540 -3656 815 3516 1416 -2454 -2893 1188 4871 3146 -2106
320b106j809L588L490j310m290k060K531M587J325l534l808J153M998K386l740
$$ -2106 -3915 -327 3163 1853 -2437 -4497 -1966 2621 3946 412 -3396 -2243 2755 5141 1401
335A401n719p08M811M078j328m634k297L163N473J270m799n103P11N183K902l138
$$ 1401 -4318 -5026 -215 3863 2535 -2099 -4396 -1233 4240 5510 711 -4392 -3681 1502 4404 1266
351A266n373j012M518M689k38m392l157K137M841J219m237m447N98M370K662k155
$$ 1266 -4107 -5119 -601 4088 3850 -542 -3699 -1562 3279 4498 261 -4186 -3588 782 3444 1289
367A289l947o11L617L412q18l962k313K199L718L4m040k869J869M281J686k636
$$ 1289 -2658 -3269 348 3760 2942 -1020 -3333 -1134 2584 2618 -1422 -4291 -2422 1859 3545 909
383I09l384L50L841K518k110m571j627L253M071m22m410k699K413M642J384l339
$$ 909 -2475 -2125 1716 4234 2124 -2447 -4074 -821 3250 2828 -1582 -4281 -1868 2774 4158 819
399H19m080N2M068K969k052m699j631L382M376J27l879k737J888M075J343k857
$$ 819 -3261 -3209 859 3828 1776 -2923 -4554 -1172 3204 3331 -548 -3285 -1397 2678 4021 1164
415A164l791k52L388K486j658l677j093K908L356k84l261j941J725L012L49l048
$$ 1164 -2627 -2879 509 2995 1337 -2340 -3433 -525 2831 2547 -714 -2655 -930 2082 2431 -617
431f17k765R33L464J735k009l098l4L435K741j387l812j594K488L352j91l742
$$ -617 -3382 -2449 1015 2750 741 -2357 -2391 1044 3785 2398 -1414 -3008 -520 2832 2641 -1101
447a101k773J562M175J869k609l707j71L553K876j443m348k097K525L880M59l279
$$ -1101 -3874 -2312 1863 3732 1123 -2584 -2755 798 3674 2231 -2117 -4214 -1689 2191 2650 -629
463f29k761J262L941K019k087l517q12K685K648r77l449j546K234L251N10k539
$$ -629 -3390 -2128 1813 3832 1745 -1772 -2584 101 2749 1772 -1677 -3223 -989 2262 2772 233
479B33k191R65K746Q47k254k798j31K552J838j328k725m81K720K777n02k954j573
$$ 233 -1958 -993 1753 2600 346 -2452 -2583 -31 1807 479 -2246 -2727 -7 2770 2268 -686 -2259
496b259J625K681L10k762k663Q33L519K019j807l205m55K949K622j057l650k160
$$ -2259 -634 2047 2357 -405 -3068 -2235 1284 3303 1496 -1709 -2164 785 3407 2350 -1300 -3460
512c460J642L225P04k688k624Q16L472K180j560l247r03K339K414n77k889j709
$$ -3460 -1818 1407 2111 -577 -3201 -2385 1087 3267 1707 -1540 -2443 -104 2310 1733 -1156 -2865
528b865J589K966Q53k066k191N64K660J309j800k751n05K043J832q29k524q60
$$ -2865 -1276 1690 2543 477 -1714 -1150 1510 2819 1019 -1732 -2237 -194 1638 809 -1715 -2575
544b575K119K668K9k553j863J150K570O05k314k533L25K859J988j203k764p44
$$ -2575 -456 2212 2241 -312 -2175 -1025 1545 2150 -164 -2697 -2372 487 2475 1272 -1492 -2236
560b236K399K753k93l090k199J200K906R23k196k574K00K812K178r61k888j289
$$ -2236 163 2916 2623 -467 -2666 -1466 1440 2363 167 -2407 -2207 605 2783 1822 -1066 -2355
576b355J825K475j46k597j898R48K472R58j483j855J93K197J624q92k329q26J624
$$ -2355 -530 1945 1799 -798 -2696 -1748 724 1682 199 -1656 -1463 734 2358 1466 -863 -1689 -65
593f5J791n06k145j000J455K086K13j852j588O87K129Q34j814k397q6K298J713
$$ -65 1726 1220 -925 -1925 -470 1616 1829 -23 -1611 -924 1205 2039 225 -2172 -2258 40 1753
610A753j060k393n89K112K449j5k380j888Q57K557J046j905k636j52K513K129
$$ 1753 693 -1700 -2289 -177 2272 2257 -123 -2011 -1154 1403 2449 544 -2092 -2244 269 2398
626B398p92k563j098J653K336J87k251k145L47K248J274j244k065j42K094J833
$$ 2398 1606 -957 -2055 -402 1934 2121 -130 -2275 -1928 320 1594 350 -1715 -1857 237 2070
642B070n23k008r50J126J639Oj726j400O39J891P79j263j508L49J845R56j187
$$ 2070 1547 -461 -1411 -285 1354 1360 -366 -1766 -1127 764 1543 280 -1228 -879 966 1922 735
659G35j943m59J404J447m40j868r05J406K207L68j834j641N78K000Q87j465k175
$$ 735 -1208 -1667 -263 1184 744 -1124 -2029 -623 1584 1952 118 -1523 -945 1055 1942 477 -1698
676a698m31J814J962k50k032j111J356K198L51j937j957K05J857J155r72j926
$$ -1698 -2129 -315 1647 1397 -635 -1746 -390 1808 2159 222 -1735 -1530 327 1482 510 -1416
692a416m22J701J864j79j854j108R91J669J29j629j449L55J656R56q08j439p4
$$ -1416 -1838 -137 1727 1548 -306 -1414 -423 1246 1375 -254 -1703 -1348 308 1264 456 -983 -1057
709a057J592J316o74j910p89J173J459j96j632j030Q50J851P34j188j625J4J720
$$ -1057 535 1851 1177 -733 -1522 -349 1110 914 -718 -1748 -898 953 1687 499 -1126 -1112 608
726F08J194r85k098o83J470J735j6j572j090P62J829P51j275j838k03J597J222
$$ 608 1802 817 -1281 -1964 -494 1241 1225 -347 -1437 -675 1154 1905 630 -1208 -1411 186 1408
743A408p77j765n23J291J531L5j285r62N65J393M18j221j429J31J443Q23p81j233
$$ 1408 631 -1134 -1657 -366 1165 1200 -85 -1047 -482 911 1329 108 -1321 -1190 253 1076 295 -938
761i38l1J287J054m20j363o77Q31J270j7j468j134O59J671O61j092j376J07J507
$$ -938 -969 318 1372 952 -411 -1088 -257 1013 996 -472 -1606 -947 724 1385 293 -1083 -976 531
779E31J092o99j761p79J107J627Q9j556j248O44J812Q26j023j601k37J311J223
$$ 531 1623 924 -837 -1616 -509 1118 1207 -349 -1597 -953 859 1685 662 -939 -1176 135 1358
796A358m82j665q77R29J567L18j149j045M08J340O11q06j251k46R54Q73l89j140
$$ 1358 876 -789 -1666 -737 830 1148 -1 -1046 -638 702 1313 507 -744 -990 -36 837 448 -692
814f92l80R16J122o1j016o08N73R42L8j007r77K36J165O67o97j133KJ276J021
$$ -692 -1072 -156 966 905 -111 -719 -146 796 834 -173 -1150 -914 251 918 221 -912 -910 366 1387
833A387n02j420o13Q42J182L0j254j096M31J583Q91q10j424k05J255J072m92j495
$$ 1387 885 -535 -1148 -306 876 906 -348 -1444 -1013 570 1461 651 -773 -978 277 1349 857 -638
851f38q15P39J336L79r84j070K57J361Q27p05j306l30Q95Q48l08j072n51O92J108
$$ -638 -1453 -714 622 1001 17 -1053 -796 565 1392 687 -619 -949 -54 794 486 -586 -1137 -445 663
870F63K71p91p83K74R88L59q20j048k1R45O62m29r48j87R35R68r3j067p58M85
$$ 663 934 143 -640 -366 622 981 161 -887 -908 37 699 270 -678 -865 70 1038 945 -122 -880 -395
890c95J036J86j020r99K55J259P79n33j125k37R16R83k21j211q13N05J138L18
$$ -395 641 827 -193 -1192 -937 322 1101 568 -557 -794 122 1105 884 -327 -1140 -635 503 821
908H21q57r15K12J130P27m94j061l61P29Q03k15r96n71N70J013K51p37p13K82
$$ 821 -36 -951 -739 391 1118 624 -437 -798 -69 734 519 -477 -1048 -478 535 786 49 -664 -382
927c82R37M23o42r79j55Q32O79l74r56l28Q16J002Pr45p24L55R81L45q36j036
$$ -382 555 978 336 -643 -798 34 713 339 -617 -945 -129 873 880 -65 -789 -434 547 892 56 -980
947i80J3J052Q20l87j045l51Q20J004K1r97q35K65R65M14o65r11n0R30P98k64
$$ -980 -967 85 905 518 -527 -878 -58 946 967 -30 -865 -600 365 779 114 -797 -847 83 881 617
967F17q88l86N44P34j5p82o08K59P52L15n09o05J53P79M83m31p77j71N98N19k83
$$ 617 -271 -657 -113 621 606 -176 -784 -525 227 542 33 -572 -419 360 843 412 -365 -536 62 581 298
988B98p79l20N72Q21R7p50o10L39Q99L35p45r51m5Q51O64l25q95l47P15J014J48
$$ 298 -481 -801 -229 592 689 -61 -671 -332 567 902 157 -794 -839 12 676 351 -544 -891 -176 838 986
1009I86q92q46K08R61M33o53r69j09Q30P96j10q09m62M61Q06J73p32p83O3P27
$$ 986 94 -752 -544 417 850 197 -772 -881 -51 745 635 -174 -636 -175 631 804 72 -711 -648 79
1029G9M14l82o49k1O39N97j76o39l27L67N42n8o48m42L30O79K16m86m76J97O90
$$ 79 493 111 -538 -559 80 677 501 -138 -465 -98 444 386 -262 -704 -374 305 521 35 -441 -244 446
1050D46L40n07p56j74N95N63k14p47l26N71Q35J35o91o44J67P55L79n21q53j72
$$ 446 786 279 -477 -651 -56 507 293 -454 -780 -209 626 761 70 -574 -407 348 727 206 -647 -819
1070h19O95P25q6p19l93M54P76J43o58o99L0O49L99l61o80r9O17O23j16o27l34
$$ -819 -124 601 515 -204 -597 -143 633 776 118 -581 -551 98 497 136 -544 -643 -26 597 481 -146 -480
1091d80L71N64On87n20J93O42L21l98n29P0O48M18l19o85k48M49N23q0o12m57
$$ -480 -109 455 461 -126 -646 -453 189 510 112 -417 -347 301 719 400 -285 -533 -84 439 359 -253 -710
1112g10L37P37K67n10n98P8O60L91l79p25k33M87N85K2n60m05L03O98K42m93n93
$$ -710 -373 364 631 121 -477 -399 261 652 273 -452 -685 -198 387 409 -151 -556 -253 445 687 194 -399
1133c99MN40L28l11n59j55M45N01j2m70k91K95N29N9n30m97J53N33K25l64m70
$$ -399 -395 145 473 162 -397 -552 -107 394 382 -88 -379 -84 445 504 -26 -523 -370 163 388 24 -446
1154d46M6N36M41j96n84k45L99N30o3o46m56K70O73K61m00n34K4O00M60k33p01
$$ -446 -400 136 577 381 -203 -448 -49 481 418 -228 -684 -414 259 520 120 -414 -390 210 670 437 -264
1175b64l77M05O04N3n61m67K25O37L56l18n49j32M32M26j55n86l10L28N30J03
$$ -264 -641 -236 368 421 -140 -607 -382 255 611 293 -256 -388 44 470 315 -271 -581 -253 277 380
1195C80l90l20J80M63J77l27m61m2L77K58k37m40n3M24M11o8m15k26K84M19j0
$$ 380 -10 -330 -150 313 490 163 -298 -340 37 295 58 -382 -435 -11 400 332 -83 -309 -25 394 384
1216C84m95m39J59N41K76l28m85K5N33M26j79n88k99K90N02O5m89m86J59O26L70
$$ 384 -111 -550 -391 150 426 98 -387 -362 171 597 418 -170 -469 -179 323 388 -101 -587 -428 198 568
1237E68k83n38j08M28L96j21n28l54K20N12J82l59l94J04M91K77k73m43r3L14
$$ 568 285 -253 -361 67 463 342 -186 -540 -320 192 374 15 -379 -275 216 493 220 -223 -316 -2
1257bK73j28l89j87K82M33R6l52l02J87M04R4l99l82M5L83K39j93l84r4L74M38
$$ -2 271 143 -246 -433 -151 282 378 26 -276 -89 315 409 10 -372 -327 56 295 102 -282 -376 -2 436
1279D36n1m70l03K25M31O1m12l75R3M42L27j76m18j45L71M01o9m70l22K05M23
$$ 436 385 -85 -388 -163 268 329 -83 -458 -365 77 404 228 -190 -335 36 437 368 -102 -424 -219 204
1300B04J01l19l35O8M17K98j90m10j22K88L14j28m04j93K37L74P7k91k58J19L97
$$ 204 305 -14 -349 -281 136 434 244 -166 -288 0 314 186 -218 -411 -174 200 277 -14 -272 -153 244
1321B44J77k79m08m0L51K57j84l79j31L17L96L4l51l03J15M03J49l38m27j1L78
$$ 244 421 142 -266 -306 45 302 118 -261 -392 -75 321 355 4 -299 -184 219 368 30 -397 -408 -30
1342c0L28j27l48j38K70L98N2l44l67Q3L72J55k75l39K2L42K72r7k95j35J81K89
$$ -30 298 171 -177 -315 -45 353 405 61 -306 -223 149 304 29 -310 -288 54 326 229 -66 -201 -20 269
1364B69k5l56k57J44L30Q0k50k18J18L32J81j87l08r0K50K43j00l79j60K66L84
$$ 269 244 -112 -369 -225 105 185 -65 -283 -165 167 348 161 -147 -237 13 256 156 -223 -383 -117 267
1385B67O9l26k46J25L57J47k65m12j09L23L55j00l73k00K81M23O7l22l32M2L08
$$ 267 336 10 -236 -111 246 393 128 -284 -393 -70 285 185 -188 -388 -107 316 383 61 -271 -229 79
1406G9K05j90l78r0L19L48l4l19j62K02K87K7k67k94K7K63J59j64k70K1K97K22
$$ 79 284 94 -284 -374 -55 293 259 -60 -222 -20 267 294 27 -267 -240 23 182 18 -252 -231 66 288
1428B88j07k79q8J82K11m3k83j94J45L30J04k37k30R2L25J41k05l33j09K29K65
$$ 288 181 -98 -186 -4 207 164 -119 -313 -168 162 266 29 -201 -109 216 357 152 -181 -290 -61 204
1449B04m6l14k07J92M04J02k92k97M8L10J66j91l19j07K36L28J1k83j90J78L34
$$ 204 158 -156 -363 -171 233 335 43 -254 -206 104 270 79 -240 -347 -111 217 228 -55 -245 -67 267
1470B67O4k79k73L4K35J26j18k40o1K24K68k5k83j46J83K35j6k58k08Q7K26J43
$$ 267 331 52 -221 -187 48 174 56 -184 -245 -21 247 222 -61 -207 -24 211 195 -63 -271 -184 42 185
1492A85j40k27j8K77K35j18l33j11K00K38k9k66j79J14K96J62j72k73l1K79K16
$$ 185 45 -182 -200 77 312 194 -139 -250 -50 188 159 -107 -286 -172 124 286 114 -159 -190 89 305
1513C05j48l31j27J82K56K8k01j83R4K88J36j87k76k6K31J62j44k31o6J76K07
$$ 305 157 -174 -301 -119 137 165 -36 -219 -125 163 299 112 -164 -190 41 203 59 -172 -238 -62 145
1534A45L0j82j48J01K41N2k36k52N1K38J13j50j82jJ88K31k1k47j79J35K69K4
$$ 145 175 -7 -155 -54 187 239 3 -249 -198 40 153 3 -179 -180 8 239 218 -29 -208 -73 196 220
1556B20k87k34J02K95J32j25k08n9K03K48m6l22k11J51K72M3k35j84Q0K48J47
$$ 220 -67 -301 -199 96 228 103 -105 -164 39 287 241 -81 -292 -141 131 174 -61 -245 -165 83 230
1577B30q9k27r6J48K25n6k68j47J66K45Rj49j11P8J77R1j34k16m8J73J62j00k30
$$ 230 141 -86 -182 -34 191 135 -133 -280 -114 131 140 -9 -120 -42 135 226 92 -124 -172 1 163 63 -167
1600a67m7K34J81l0j88j08P2J83N6k02k47K6K70J75j43k32j1K19J94l4k36j76
$$ -167 -214 20 201 171 -17 -125 -53 130 186 -16 -263 -237 33 208 65 -167 -178 41 235 201 -35 -211
1622b11Q1K23R6j95k32L1K81J59j03k21l9J48J50k7j99j69N9K31J00j70j64P6
$$ -211 -130 93 189 -6 -238 -207 74 233 130 -91 -130 18 168 141 -58 -227 -168 63 163 -7 -171 -95
1644i5K16R1j15j75l9R6J37l3j86j13J19K48M0k04j31J05J81J1j41j74k8J53J54
$$ -95 121 212 97 -78 -117 -21 116 83 -103 -216 -97 151 191 -13 -144 -39 142 153 12 -162 -190 -37 117
1667A17l1k05j05J94K42qk26j43R0J67M9j34j78l4J92K04l9k14r2J66J92l9k08
$$ 117 86 -119 -224 -30 212 204 -22 -165 -75 92 141 7 -171 -205 -13 191 152 -62 -154 12 204 165 -43
1690d3j24N0J42Q3q8j57k4J90J56o7j98o2J46J28o6j63q4P7J62O6q6j59K5K07
$$ -43 -167 -117 25 108 20 -137 -161 29 185 118 -80 -142 4 132 66 -97 -181 -104 58 124 38 -121 -96 111
1714A11J18j44k16l7J80J14p1j49q8J06K13P8j61j94L3K09R3j68k01j6J54J48
$$ 111 229 85 -131 -168 12 126 55 -94 -182 -76 137 215 54 -140 -107 102 195 27 -174 -190 -36 112
1736A12oj45j05Q0K06M5j58j93M1J71O3j09j26kJ13J35J0j33r6O9J58kj87j11
$$ 112 106 -39 -144 -64 142 187 29 -164 -123 48 111 2 -124 -126 -13 122 132 -1 -97 -28 130 128 -59 -170
1760a70R0J45J6r3p8L3J20R9m6j70q9J19J63n8j89q1J29J79K6j20j10kJ42J23
$$ -170 -80 65 81 -12 -90 -57 63 162 116 -54 -143 -24 139 81 -108 -189 -60 119 145 25 -85 -87 55 178
1784A78j04k11q0J65J63k1j72p5J16J58L3r8j50k8J47J08o1j95m6J55J63k4j39
$$ 178 74 -137 -217 -52 111 90 -82 -157 -41 117 150 52 -98 -126 21 129 68 -127 -173 -18 145 121 -18
1807a8m1O6R3L9j07j43k0J37J02r5j42L1J46R4o3j09o7P0J03oj08j25N3J72O4
$$ -18 -59 7 100 139 32 -111 -131 6 108 13 -129 -98 48 142 79 -30 -97 -27 76 70 -38 -163 -110 62 126
1832A26j05j20M5J39P0o7j42q9Q8J42K7j58j06Q8J73N6j15j19qJ03Q2n8j36p5
$$ 126 21 -99 -54 85 155 88 -54 -143 -55 87 114 -44 -150 -62 111 167 52 -67 -75 28 110 52 -84 -159
1856a59Q9J54K8j35p7O0J39L2j01j10j2J01P1m4j21m0J10J41j6j41o8Q0J09j3
$$ -159 -70 84 112 -23 -100 -40 99 131 30 -80 -92 9 80 36 -85 -125 -15 126 110 -31 -99 -19 90 77
1880G7j07r3J1J00R8n1j12j7J37J26o5j41n9P2J07Jr7r6J8J32R6n4j43l8J25P8
$$ 77 -30 -123 -112 -12 86 35 -77 -94 43 169 104 -37 -96 -24 83 84 -13 -109 -91 41 137 83 -60 -98 27 105
1906A05m0j39n2M7R8L6o3p7J8J28O8o9j20qR2N6n1j09j2O6J06J1r1p3O2J08J8
$$ 105 65 -74 -126 -79 19 55 -8 -85 -67 61 129 60 -60 -68 24 80 29 -80 -92 -26 80 91 0 -73 -11 97 115
1933A15j18j02K6R0N8n4r6qR4J08Kj30r6O0J25Nj05j05K6J10Q8k9j10l9R2J20
$$ 115 -3 -105 -79 11 69 15 -81 -89 5 113 115 -15 -111 -51 74 79 -26 -131 -105 5 93 64 -46 -85 7 127
1959A27j6j25r8N5J01K2p4o8J0R1Q3l5j00m8O5Q0k9j12l2N5R5J3m9n3K6O8M1m3
$$ 127 111 -14 -112 -57 44 66 -8 -76 -66 25 108 73 -27 -75 -10 70 41 -71 -103 -48 47 60 11 -42 -16 52 93 50
1987E0j16k7Q7O9n3r5qP6R4qp2n9K6R7K8r4j03RJ01Q2m4q8j7Q0R0Or6q3PJ00L6
$$ 50 -66 -93 -6 63 10 -85 -93 -17 77 69 -3 -62 -36 61 89 -5 -108 -99 2 84 40 -48 -65 15 105 111 15 -68 -61 39 75
2018G5o5j09K0R9P7l5q9l2M6Q4rq6p5J8J03L7p2o0K2P6O1l6p6l5N1P0j7q3m4M7
$$ 75 10 -99 -79 20 97 62 -27 -59 -13 71 62 -24 -99 -81 22 59 -13 -73 -51 25 86 50 -26 -61 -10 60 43 -40 -84 -37
2048c7R7L1p2n4L0P2J9o1q8qN9O6qr7j9N3R4jo4o5J5O4L5n2q6j5Q6P7k2p7k7N7
$$ -37 60 91 19 -35 -5 67 86 25 -63 -71 -12 54 46 -51 -70 -17 77 76 12 -53 -38 26 61 9 -77 -92 -6 71 49 -28 -55 2
2080BO9mp9o7K7N7K8k4p1mO8Q8l6p2k7N7M5j7o6m6L1P1L2m3p3J8Q3M2n5q6k0N0
$$ 2 71 67 -12 -79 -52 5 33 9 -62 -66 2 90 54 -18 -45 12 57 40 -26 -72 -41 30 62 19 -54 -36 47 89 34 -52 -72 -22
2112b2N1lp1m1M1Q1L8n8o7LP1L9m1r2rN6O0Nl6l1K3O1K3o2o6mP0L2m7m2j2O2M4
$$ -22 29 26 -45 -86 -45 36 74 16 -51 -48 23 62 21 -71 -80 -24 36 41 5 -26 -3 58 81 19 -47 -51 19 51 4 -38 -50 12 56
2145E6j0m8k7K7L9Lo8m6L2N3K0m0k4pO4L8j9p5l0L6N7No7m7L1Q7L2m7n8nN9N5
$$ 56 46 -2 -29 -2 37 40 -28 -74 -42 11 31 -9 -33 -40 24 62 43 -32 -62 -26 31 36 -31 -78 -47 40 72 25 -33 -38 21 76
2177G6m0p1l4N1N1Po7j4K8N6L5n6o6pO1K6k5n1j6L4N6On5k5K5M4Pm1m1j0N3L2
$$ 76 36 -35 -69 -18 33 40 -27 -41 -13 43 78 22 -44 -51 10 36 11 -40 -56 -22 34 40 -15 -40 -15 29 36 -5 -46 -56 -3 29
2209B9k8l9kN4M0j3m4k1K0L9pm4m6K7N6K9k5m9KM7L0j7p6j5K3M4Lm1k2J3O2K1
$$ 29 1 -38 -40 14 54 41 -3 -24 -4 35 28 -16 -62 -35 21 50 25 -24 -22 25 55 38 -38 -53 -30 14 17 -24 -46 -33 29 50
2241E0k0n4j1M5L4j9o4rK3N6Nl6l8K4N5J3m6l8%M8K7l5m1j0N2L6nn2j5PM1J8m4
$$ 50 30 -24 -35 10 44 25 -39 -48 -25 31 36 0 -38 -14 41 54 8 -30 -30 18 45 10 -31 -41 11 47 42 -10 -25 -18 23 41 -3
2274cl7JL7L5k8l0j5M4M0qn3k1J2M2Ll2l1MN6L3k5k9j8L3K9nn5j2K2L4Qk7l8J6
$$ -3 -40 -39 -2 33 5 -25 -40 4 44 36 -17 -38 -26 16 19 -13 -44 -40 16 49 24 -5 -23 10 39 34 -21 -33 -11 23 31 4 -34 -18
2308a8L8L1k2n6pL5L4k7l7j4K1M6Pl0l5J8K9K3k3m6j1M2J7kl1oK7L3Kl3l2J7L6
$$ -18 20 51 29 -27 -34 1 35 8 -29 -43 -22 24 31 1 -34 -16 13 36 13 -33 -44 -2 15 13 -18 -24 3 36 38 5 -27 -10 26
2341B6J0k6m3jL0M4j2l2j7J5M0kl6l7OM2Lj8k8MM5R%l4j3K4K2ql7j5J4L6J1k2
$$ 26 36 10 -33 -34 -4 40 28 -4 -21 -6 34 32 -4 -41 -35 7 10 -8 -36 -32 13 22 22 -12 -25 -1 21 13 -24 -39 -25 11 22 0
2375@j4ML0K4l1k2j4K0L1j4k8KK2K9Nl9k3RL1%k4l8jL8K5ql9oK8K9Ll6k5JL9J7
$$ 0 -14 -10 20 44 13 -9 -23 -3 28 14 -14 -12 10 39 44 5 -18 -9 22 22 -2 -40 -41 -3 22 14 -25 -31 -3 26 29 -7 -32 -31 8 25
2411B5l1j5kJ4L2Nk9j8J9K7lk5l6K4J9J1j0j9mJ9K8ol5pOK6j3j7k0K1L2nj5j9
$$ 25 -6 -21 -23 -9 23 28 -1 -19 0 27 24 -1 -37 -13 6 17 7 -12 -16 3 31 25 -10 -17 -11 15 2 -15 -35 -14 18 13 -2 -21
2445b1OK0Rk2l5J3J6J8Ok4j9K4J7K3l3j8J3J8J5k1j7%J8J5Pl0%LJ9%ok6qJ7J0
$$ -21 -15 5 14 -8 -43 -30 -14 4 10 -14 -33 -9 8 31 -2 -20 -7 11 26 5 -12 -12 6 21 28 -2 -2 1 20 20 14 -12 -20 -3 7
2480Gmj6nJ8K0Kk9j4J8J4j3j4j4J1J5J6rl0J0K5K1j6k8lJ0J5Rqk1J5J6Npj6lJ3
$$ 7 3 -13 -18 0 20 22 -7 -21 -3 11 -2 -16 -30 -19 -4 12 3 -27 -17 8 29 13 -15 -18 -8 7 16 8 -13 2 18 23 16 0 -3 10
2516A0Omk6qJ1K5rKk7NK1J2j2k3JJ3Qqj5mJ3J1Qj2nROOj5j9MK1Ppj7%RL1pk5k
$$ 10 16 12 -14 -22 -11 14 5 7 -20 -15 6 18 6 -17 -16 -3 5 -3 -18 -22 -9 2 10 -2 -7 2 8 14 -1 -20 -16 5 12 5 -12 -12 -3 28 21 -4 -6
2557fJK8j3k4pRK4%j6rj2L0Nj6j8j1J5J1J2j6nMK6Ok2r%QJ3pj8J2J4RNj2j1PJ0
$$ -6 -5 23 10 -14 -21 -12 12 12 -4 -13 -25 5 10 -6 -24 -35 -20 -9 3 -13 -18 -14 12 18 -4 -13 -13 -5 8 1 -17 -5 9 18 23 11 0 7 17
2596A7nk3kNPQNj8jNJ1Pk6NpK2j4j5j0J7%J3kj7%K6K0l1nJMJ5%j6OJQJ3j1mj8
$$ 17 12 -11 -13 -8 -1 7 12 -6 -7 -2 9 16 -10 -5 -12 10 -4 -19 -29 -12 -12 1 -1 -18 -18 8 28 -3 -8 -7 -3 12 12 -4 2 3 11 24 13 9 -9
2637iK6lJk0j8K0ONj1noJ9Ppj8%J2Kj3ljJ8Qnj5MQNkrj3LJ1J8Kj8RlNMpj0J3O
$$ -9 17 14 15 -5 -23 -3 3 8 -3 -8 -14 5 12 5 -13 -13 -1 1 -12 -15 -16 2 10 5 -10 -6 2 7 5 -4 -17 -14 -3 15 17 -1 8 5 10 14 7 -3 10 16
2681A6%k1oJ0NjOj4mJ8klj7LkJ0MoqLJ4J3j2LplQnj0NKPl%oOPJ2j9MpMomkQRn
$$ 16 16 -5 -11 -1 4 3 9 -5 -9 9 7 4 -13 -10 -12 -2 2 -4 -12 -9 5 18 6 9 2 -1 7 2 -8 -3 -1 6 3 3 -3 3 10 22 3 7 0 4 -2 -6 -8 0 9 4
2729DQpj6QQrnj2jJ0J2j8lJ0J0PQk7rK1J3jj3nLNPRj4lJ5n%j2rJ0KJ1j1j2QJ0
$$ 4 12 5 -11 -3 5 -4 -9 -21 -22 -12 0 -18 -21 -11 -1 6 14 -13 -22 -1 12 11 -2 -7 -4 1 8 17 3 0 15 10 10 -2 -11 -1 1 12 1 -11 -3 7
2771GnrkOoJOj3LNJ2%j7kJ2Oojj0J0PjoMlRJ1pj6L%J9j4Lj8J2%J0lorJJ4j2op
$$ 7 2 -7 -9 -3 -9 -8 -2 -15 -12 -7 5 5 -12 -14 -2 4 -2 -3 -13 -3 4 3 -3 1 -2 7 18 11 -5 -2 -2 17 3 6 -12 0 0 10 7 1 -8 -7 7 -5 -11 -18
2817a8ONJJppRK2j4pJ3%OqlqPQOj0pJ1J0npl%%Pj0kjJ1K%qmNNj7jKJOQj3qRJ4
$$ -18 -12 -7 -6 -5 -12 -19 -10 12 -2 -9 4 4 10 2 -1 -9 -2 6 12 2 -5 6 16 11 4 1 1 1 8 -2 -4 -5 6 8 8 0 -4 1 6 -11 -12 -10 -9 -3 5 -8 -16 -7 7
2866Gjkj1j3J1OPoj0J1MRj2nJ0O%j3rQMKlJrJ4%KpojlJ0Jj2kOJ6j2qPqJ7jpmN
$$ 7 6 4 -7 -20 -9 -3 4 -2 -12 -1 3 12 0 -5 5 11 11 -2 -11 -3 1 3 0 1 -8 6 6 8 1 -5 -6 -9 1 2 -10 -12 -6 10 -2 -10 -3 -11 6 5 -2 -6 -1
2913apJ4j8kMJ3K0j7njKJ9mj3pJ3j9J0nlJ8qJ3lj6pJ0Nj7%%jJ7orP%J6j3j0Lq
$$ -1 -8 6 -12 -14 -10 3 23 6 1 0 2 21 17 4 -3 10 -9 1 -4 -7 11 3 16 13 -3 -10 0 5 -12 -12 -12 -13 4 -2 -11 -4 -4 12 -1 -11 -8 -16
2955a6OK2rrRMNj1J0j1JPJKj4jJ1kMoj1J1%kj1N%O%okPpRoMkj5J2NoQqJ0mPj5
$$ -16 -10 12 3 -6 3 7 12 1 11 0 1 8 9 11 -3 -4 7 5 9 3 -8 3 3 1 -10 -5 -5 1 1 -5 -7 0 -7 2 -4 0 -2 -17 -5 0 -6 2 -6 4 0 7 -8
3002hMJ4j2LjpQNJkrJ0Rqj6MJNpqQlNKp%Kj%NmnjNQqN%jKmJ2mJ2j4Rj5J2Jj2J0
$$ -8 -4 10 -2 1 0 -7 1 6 7 5 -4 6 15 7 -9 -5 -4 1 -6 -14 -6 -9 -4 -2 -9 -9 -7 -8 -8 -3 -7 -12 -13 -8 0 -8 -3 -3 -4 -2 -6 6 2 14 0 9 -6 6 7 -5 5
3053EOrJNljok%J2j1kkJJ6j0nkOOlj3%JJ3kLj3PJ4Lpj1JJ3j3JmoJ1J1Nj4Kj3J9
$$ 5 11 2 3 8 5 4 -2 -4 -4 8 -3 -5 -7 -6 10 0 -5 -7 -1 5 2 -11 -11 -10 3 1 4 -9 -2 12 15 8 -3 -2 11 -2 -1 -5 -11 0 11 16 2 4 -9 10
3099A0%n%k0O%J1j4mNJ4Rj5o%PmmNLjJNmOqJ8Nk1j7J5PlPmNj4J3jJj0j0QQoj6
$$ 10 10 5 5 -15 -9 -9 2 -12 -16 -11 3 12 -3 -9 -9 -2 -6 -10 -5 -2 -3 -2 3 -1 5 -3 15 20 -1 -18 -3 4 1 8 4 9 -5 8 7 8 -2 -12 -4 4 -2 -18
3145a8J9oMmjnPLklNLjnOnoJ2mNj1J1PjKn%qJ3nq%NjkOoLkMrnLJ7k1Rkj3KJ8n
$$ -18 1 -5 -1 -5 -6 -11 -4 -1 -3 -6 -1 2 1 -4 2 -3 -9 3 -1 4 -7 4 11 10 12 7 7 -1 12 7 -1 -1 4 3 1 7 1 4 2 6 -3 -8 -5 12 -9 0 -2 -15 -13 5 0
3196@nnJ0jJ1j3kPJ2n%Jj0OJkjKMPj1jj2MRlmMj4OkJ0mljjJ2j5NnmJ2krpK2lr
$$ 0 -5 -10 0 -1 10 -3 -5 2 14 9 9 10 0 6 7 5 4 6 10 17 6 5 -7 -3 6 3 -1 3 -11 -5 -7 3 -1 -4 -5 -6 6 -9 -4 -9 -13 -1 -3 -12 -19 3 0 -9
3244iJ0jJnK2j7j1J4%OlooMJ4rKLrMlK%j0J6%j4jqJ5nqJ1j5J2j2J1jnMJ0j1Nj2
$$ -9 1 0 1 -4 18 1 -10 4 4 10 7 1 -5 -1 13 4 6 9 0 4 1 3 3 -7 9 9 -5 -6 -14 1 -4 -12 -1 -16 -4 -16 -5 -6 -11 -7 3 -8 -3 -15
3288a5PJ5%mj0J0J1%%nj2jJ5KqrRRnj8NJ%RlKpojRj4NKmRj4J2pJ9jjo%jkJ1j9
$$ -15 -8 7 7 3 -7 3 14 14 14 9 -3 -4 11 13 5 -4 5 14 9 -9 -4 -3 -3 6 3 5 -2 -8 -9 0 -14 -9 -7 -11 -2 -16 -4 -11 8 7 6 0 0 -1 -3 8 -11
3335a1lK1JjLj5J9kOj4olPlmqPlJ2mpjQPkj4%%j0J7rNNqJ0kpRMl%JknJ8j1jLj
$$ -11 -14 7 8 7 10 -5 14 12 18 4 -2 -5 2 -1 -5 -13 -6 -9 3 -1 -8 -9 -1 6 4 -10 -10 -10 -20 -3 -12 -7 -2 -10 0 -2 -9 0 4 1 1 2 0 -5 13 2 1 4 3
3384CK%rkLQJj9P%MLKj1rJ6oKMk1MJ4%%qLjQmLJnPJ0j0NJlJ0%o%njJ0j5NmMmj3
$$ 3 5 5 -4 -6 -3 5 6 -13 -6 -6 -2 1 3 -8 -17 -1 -7 -5 -1 -22 -18 -4 -4 -4 -12 -9 -10 -2 -6 -3 -2 -7 0 10 0 5 6 3 13 13 7 7 2 1 11 -4 1 -3 1 -3 -16
3435a6J1qK0rjkKqOjMj1LJ0lLj0QlJ4j3kMJQj2JlJ%QJpJ0%Kkpj0J1Lkm%NrNnJ0
$$ -16 -5 -13 7 -2 -3 -5 -3 -11 -5 -6 -2 -13 -10 0 -3 0 -10 -2 -5 9 -4 -6 -2 -1 7 -5 -4 -7 -6 -6 2 3 -4 6 6 8 6 -1 -11 0 3 1 -3 -3 2 -7 -2 -7 3
3484Cj5JKRloO%kmNKoJ3m%JjLNppJ1O%qqJ1KmqlM%Mj4OlPMroJ1jjkJ1j9JJ4j1
$$ 3 -12 -11 -9 0 -3 -9 -3 -3 -5 -9 -4 -2 -8 5 1 1 2 1 4 9 2 -5 6 12 12 4 -4 7 9 5 -3 -6 -2 -2 2 -12 -6 -9 -2 2 -7 -13 -2 -3 -4 -6 5 -14 -13 1 -10
3535a0RpjMJ3k0QNKlJLoJ0J%oj0JJ2krj1jJ8Jj3KJPjpKJjkMlJLJ0Mlk0KRJQKn
$$ -10 -1 -8 -9 -5 8 -12 -4 1 3 0 1 4 -2 8 9 9 3 -7 -6 6 4 -5 -16 -17 1 2 -11 -9 -8 -1 -2 -9 -7 -6 -7 -9 -5 -8 -7 -4 6 10 7 -13 -11 -2 -1 7 9 4
3585DlJ1JknnPrjmPnKJ0j3MLMj7KQj0%J%PKlLqJLJ1J8k1mLkJ0Mj4kmJ0%PqLLq
$$ 4 1 12 13 11 6 1 8 -1 -2 -6 1 -4 -2 8 -5 -1 2 6 -11 -9 -1 -11 -11 -10 -10 -3 -1 -4 -1 -9 -8 -5 6 24 3 -1 2 0 10 14 0 -2 -6 4 4 11 3 6 9 1
3635APj0mlJ3Mj2j2J4%klMj4J2LJpjJkKJ0j4OQMj0jKPNNrj1K0rnKj0PkjKqLJ3
$$ 1 8 -2 -6 -9 4 8 -4 -16 -2 -2 -4 -7 -3 -17 -5 -2 -1 -8 -9 -8 -10 -8 2 -12 -6 2 6 -4 -5 -3 4 9 14 5 -6 14 5 0 2 -8 -1 -3 -4 -2 -10 -7 6
3682FpoqnJ6PJpk4NJ1%J0j1JOjJ2j0oJ1Pnj0LQnJ3j7mRlPK%olKQj0joRoPj2JJ2
$$ 6 -1 -7 -15 -20 -4 3 4 -3 -27 -22 -11 -11 -1 -12 -11 -5 -6 6 -4 -10 1 8 3 -7 -4 4 -1 12 -5 -9 0 -3 4 6 6 0 -3 -1 7 -3 -4 -10 -1 -7 0 -12 -11 1
3730A%j2%LJQjplPOnmkQJPj7L%NJ6j0j0qLJ5Mjj7OOLKj7JPKLj5KJ1ljmqJJ2mk
$$ 1 1 -11 -11 -8 -7 1 0 -7 -10 -3 3 -2 -6 -8 0 1 8 -9 -6 -6 -1 15 5 -5 -13 -10 5 9 8 -9 -3 3 6 8 -9 -8 -1 1 4 -11 -9 2 -1 -2 -6 -14 -13 -1 -5 -7
3780glMPJnjKPjJ0j3pNJ7Mnk2J1LkJ0k1%LPLkpRKjj7lpJ6mOrkJ8rRj0lnMK3j5
$$ -7 -10 -6 1 2 -3 -4 -2 5 4 14 1 -6 -1 16 20 15 -7 4 7 5 15 -6 -6 -3 4 7 5 -2 7 9 8 -9 -12 -19 -3 -7 -1 -10 -12 6 -3 6 -4 -7 -12 -8 15 0
3828@j0NJ4Omj5RPlnmkknJ1j7J0J6%jj6j0PNJ2rj0qK2Oj5KlkROk2RnJRLllOK3
$$ 0 -10 -5 9 15 11 -4 5 12 9 4 0 -2 -4 -9 2 -15 -5 11 11 10 -6 -16 -9 -4 8 -1 -11 -19 3 9 -6 -4 -7 -9 0 6 -16 -7 -12 -11 -2 1 -2 -5 1 24
3874B4j9JJ%J0j5Pk4J6%KonQLPrKj1%J0j1%kLRj%qLQJmj2J4qLK0j8Lj0J1J2lq
$$ 24 5 6 7 7 17 2 9 -15 1 1 3 -3 -8 0 3 10 1 3 -8 -8 2 -9 -9 -11 -8 1 0 0 -8 -5 3 4 0 -12 2 -6 -3 17 -1 2 -8 3 15 12 4
3919DpOJmj1jQMoPj6NJ4Jrj2J0mPrj0J1KJ9j1j7J4J2Qk0oOkMJ2oj1RJ4pKj5mJ1
$$ 4 -3 3 4 0 -11 -12 -4 0 -6 1 -15 -10 4 5 -4 -16 -6 -10 -3 -12 -22 -11 -9 10 -1 -18 -4 8 16 -4 -10 -4 -6 -2 10 4 -7 2 16 9 11 -4 -8 3
3963CJ4oj6oLJ4Pj4nrjJ0LjlLMJ0k0JjQJ2j6kRnmJ2j3QPMpnmRJ3Jj1j2JNJ5lj0
$$ 3 17 11 -5 -11 -8 6 13 -1 -6 -15 -16 -6 -3 -4 -7 -4 0 10 -10 -9 -10 -2 10 -6 -8 1 -4 -8 4 -9 -1 6 10 3 -2 -6 3 16 17 6 -6 -5 0 15 12 2
4009BlkJ2j2qLQLoJj0PJRnj5PkNMnj1J6QmNk3J9kOmknJ1j3Oj2JJ3Nlj0LjJ6j8
$$ 2 -1 -3 9 -3 -11 -8 0 3 -3 -2 -12 -5 -4 5 0 -15 -8 -10 -5 -1 -6 -17 -1 7 3 8 -15 4 2 8 4 2 -3 8 -5 1 -11 -10 3 8 5 -5 -2 -3 13 -5
4055elmjOPoqNjJ7nj0nMJ0Nj0pOQQj0Mn%J2lj3mJ3rPjrJ1J5lj7JOllpJ1j7NRM
$$ -5 -8 -12 -13 -7 0 -6 -14 -9 -10 7 2 -8 -13 -9 1 6 -4 -11 -5 3 11 1 5 0 0 12 9 -4 -8 5 -4 3 2 -7 4 19 16 -1 0 6 3 0 -7 4 -13 -8 1 5
4103Ek0LKJ1Jmpj4K5kkmmJ3PnkjJ0oRj0o%OJ7j5nj0J0MQj6LmJMj0JoRPKpj3J1
$$ 5 -15 -12 -10 1 2 -2 -9 -23 2 0 -2 -6 -10 3 10 5 3 2 12 6 15 5 -1 -1 5 22 7 2 -8 2 6 14 -2 1 -3 -2 2 -8 -7 -13 -4 3 5 -2 -15 -4
4149dOKj9LQMKlmjMJ4Kj0OqRjpKMoJ5l0J1KJ1JrqJ0pPj5LOjOOj1l%KJ1j0j2LJ7
$$ -4 2 4 -15 -12 -4 0 2 -1 -5 -6 -2 12 14 4 10 2 11 10 3 5 9 3 18 -12 -1 1 12 13 4 -4 6 -1 6 -9 -6 0 -1 5 11 0 -3 -3 -1 10 0 -12 -9 8
4197HjjJrMRLj0Nj2J6lQk6NJ6j0jnJmR%j1LJRqoKlJ3olmoJJ6jrj2J9LK3k3%m%
$$ 8 7 6 7 -2 2 11 14 4 9 -3 13 10 18 -8 -3 13 3 2 -3 -2 -6 3 3 -8 -5 -4 5 -3 -9 -7 -10 3 -3 -6 -10 -16 -15 1 0 -9 -21 -2 1 24 1 1 -3 -3
4245cJ4pnlJ0Ojj6LKPMj6klJ8oMk2QPJ1j5j4J5mJ0nnj1LJ1lRpkJ7Jjj8PJJ4j1
$$ -3 11 4 -1 -4 6 12 11 -5 -2 0 7 11 -5 -7 -10 8 2 6 -16 -8 -1 10 -5 -19 -4 -8 2 -3 -8 -19 -16 -5 -8 1 -6 -8 9 10 9 -9 -2 -1 13 2
4289BpoKK5mor%J0NrJqnK3qjj2J4jqlj2J4lRrj4J7J2n%nj1J1Rlj2J4nLpMjLJ2
$$ 2 -5 -11 -9 16 12 6 -3 -3 7 12 3 4 -4 -9 14 6 5 -7 7 6 -2 -5 -17 -3 -6 3 -6 -20 -3 9 4 4 -1 -12 -1 8 5 -7 7 2 5 -2 2 1 4 16
4335A6kjroJ4Kj2j1j0J7NKonpJ8J1j0j7kLJ1nLmL%kJ6mqMRj9kQOJQj0jlJ6j4J
$$ 16 14 13 4 -2 12 14 2 -9 -19 -2 3 5 -1 -6 -13 5 16 6 -11 -13 -10 1 -4 -1 -5 -2 -2 -4 12 8 0 4 13 -6 -8 0 6 7 15 5 4 1 17 3 4
4380DKoLNjj1jkJ6oj2PJ0ljj2mONQj3Kj0K3lOj0j6J3J7qqPojQoPqjQpn%nJ5mr
$$ 4 6 0 3 8 7 -4 -5 -7 9 3 -9 -2 8 5 4 -8 -12 -6 -1 7 -6 -4 -14 9 6 12 2 -14 -1 16 8 0 7 1 0 8 2 9 1 0 8 1 -4 -4 -9 6 2 -7
4428g%%R%j0kQPj7L%LPjRj3oJPKNj4%K1j1MqoK8Nj8%kk%Pjj6jJ6j0jmQrNjJLK
$$ -7 -7 -7 2 2 -8 -10 -2 5 -12 -9 -9 -6 1 0 9 -4 -10 -9 -2 0 5 -9 -9 12 1 5 -3 -9 19 24 6 6 4 2 2 9 8 -8 -9 7 -3 -4 -8 0 -9 -4 -5 -4 -1 1
4478An%qnJ6RRj6kl%J5nj4kQJ5jojkMjnNj0JJ2poNoRj0KjkJ0%roJ%RlQnnNLRj0
$$ 1 -4 -4 -12 -17 -1 8 17 1 -1 -4 -4 11 6 -8 -10 -2 13 12 6 5 3 7 6 1 6 -4 -3 9 2 -4 1 -5 4 -6 -4 -5 -7 3 3 -6 -12 -11 -11 -2 -5 3 -2 -7 -2 1 10 0
4530@JJ0qllLMOlkQj2J1nrMmQj4J0pJ2jNllJkroKOLjkqPLJJ3j4L%nJ7j0rPJJ5
$$ 0 1 11 3 0 -3 0 4 10 7 5 13 1 12 7 -2 2 -2 6 -8 2 -5 7 6 11 8 5 6 4 -5 -11 -9 -3 0 -1 -3 -11 -4 -1 0 13 -1 2 2 -3 14 4 -5 2 3 18
4580A8lj0nrJ8pQkoLmPj1PKl%mp%kOKmJJ0rKj0R%LJ2j5KMJ2j0kLkJ1jjnnMlNj4
$$ 18 15 5 0 -9 9 2 10 8 2 5 1 8 -3 4 6 3 3 -1 -8 -8 -10 -4 -2 -6 -5 5 -4 -2 -12 -3 -3 0 12 -3 -1 3 15 5 3 6 4 15 14 13 8 3 7 4 9 -5
4630eJ4Lk%kj0omK2mj3nPMj1PNj6J7j0NMMqOOqjjJ3Nj4oJ0O%pj3RJPnpJ1Jj2L
$$ -5 9 12 10 10 8 -2 -8 -12 10 6 -7 -12 -5 -1 -12 -5 0 -16 1 -9 -4 0 4 -4 2 8 0 -1 -2 11 16 2 -4 6 12 12 5 -8 1 2 9 4 -3 8 9 -3 0
4677@kj4J5MqnQl%PqMjNmJ1oolJ5npLJ1nrKJJ0j2J0olJKmJ1j3NNj8QPj7J2KmL
$$ 0 -2 -16 -1 3 -5 -10 -2 -5 -5 2 -6 -2 -3 2 -2 9 3 -3 -6 9 4 -3 0 11 6 -3 -1 0 10 -2 8 2 -1 0 2 -2 9 -4 1 6 -12 -4 3 -14 -2 0 -4 -1
4725aqOLOorPQmj3KnLK0Pj4mkJ5Lj3KJj2K6j0Pnj1kNKKKqkMnMj1OKlj3LJJ1Kq
$$ -1 -9 -3 0 6 0 -9 -2 6 2 -11 -9 -14 -11 9 16 2 -2 -4 11 14 1 3 4 -8 18 8 15 10 -1 -3 2 4 6 8 0 -2 2 -3 1 -10 -4 -2 -5 -18 -15 -14 -3 -1 -9
4774iM%jpJ7j2NQoNNnKLj3LL%qPplJ2kKqj0J3JomMJjNj0NoJ7j6J1jmkNKjnMJ0
$$ -9 -5 -5 -6 -13 4 -8 -3 5 -1 4 9 4 6 9 -4 -1 2 2 -6 1 -6 -9 3 1 3 -5 -15 -2 -1 -7 -11 -7 -6 -7 -2 -12 -7 -13 4 -12 -1 -2 -6 -8 -3 -1 -2 -7 -3 7
4824GJmrMJ0lkKjJ%%omMJ3j3M%%qj%N%oLlkj2K5j9K2j8nJ0P%j2PKLJrOlJ2Jj1
$$ 7 8 4 -5 -1 9 6 4 6 5 6 6 6 0 -4 0 13 0 4 4 4 -4 -5 -5 0 0 -6 -3 -6 -8 -20 5 -14 8 -10 -15 -5 2 2 -10 -3 -1 2 3 -6 0 -3 9 10 -1
4873aR%kJ1lj8NNj3QmOnNKjplO%Qj1oQQMj5kkKJ4oLpnJ1Kj3J2%nQrMrQmRj0Rq
$$ -1 8 8 6 17 14 -4 1 6 -7 1 -3 3 -2 3 5 4 -3 -6 0 0 8 -3 -9 -1 7 11 -4 -6 -8 -6 8 2 5 -2 -7 4 6 -7 5 5 0 8 -1 3 -6 2 -2 7 -3 6 -2
4924bJMpj2PQLj1kJ1jj4J3lqO%%rRNRr%J0jlLqmQjmnPRqLojl%J7pqjkNOqolOO
$$ -2 -1 3 -4 -16 -9 -1 2 -9 -11 0 -1 -15 -2 -5 -13 -7 -7 -7 -16 -7 -2 7 -2 -2 8 7 4 7 -1 -5 3 2 -2 -7 0 9 1 4 -2 -3 -6 -6 11 4 -4 -5 -7 -2 4 -4 -10 -13 -7 -1
4978aj3J2qmJ7Jj5PpQJ8j1qMNJlNk2J6lJ3lmj8J3PpoRj1J2Lj0okJ3j1Rj2J7j0
$$ -1 -14 -2 -10 -14 3 4 -11 -4 -11 -3 15 4 -4 0 5 6 3 8 -14 2 -1 12 9 5 -13 0 7 0 -6 3 -8 4 7 -3 -9 -11 2 -9 0 -12 5 -5
5020eJNjj4J3lOpNj3QQklPnQn%jNJj4J7oqKp%KNJ1klj4PLJj4J0MMj0rJ2nkJ1J
$$ -5 -4 1 0 -14 -1 -4 2 -5 0 -13 -5 3 1 -2 5 0 8 3 3 2 7 8 -6 11 5 -3 -1 -8 -8 -6 -1 10 8 5 -9 -2 1 2 -12 -2 2 6 -4 -13 -1 -6 -8 3 4
5069DKj6J5oMoLmJPKJklpLOqJ4j3J5qj3OjRj2J1j9J3jRpj3J2jQmnKQjMol%J0o
$$ 4 6 -10 5 -1 3 -3 0 -4 -3 4 6 7 5 2 -5 -2 4 -4 10 -3 12 4 -9 -3 -4 5 -7 4 -15 -2 -3 6 -1 -14 -2 -3 5 1 -4 -2 6 5 9 3 0 0 10 4
5117DlMnJ0J2j2j2Kk%Mk%pJ6j4RqK%JlLpkOMj4MLMJ3j0jLJRqm%%PLkrJ6KppQl
$$ 4 1 5 0 10 22 10 -2 0 -2 -2 2 0 0 -7 9 -5 4 -4 -2 -2 -1 -4 -1 -8 -10 -4 0 -14 -10 -7 -3 10 0 -1 2 3 12 4 0 0 0 7 10 8 -1 15 17 10 3 11 8
5168HqlMqJ0J0kj2JlOoJlj1J2oLJJ2j2J1m%jMjOlj1RmJ3Rj8NNkQj2J5k5QpQnk
$$ 8 0 -3 1 -7 3 13 11 -1 0 -3 3 -3 -2 -5 -16 -4 -10 -7 -6 6 -6 5 1 1 0 4 3 9 6 -5 4 0 13 22 4 9 14 12 20 8 23 -2 6 -1 7 2 0
5215@LMKPj1j0J8k1KONNj4Mj1PJ2lLmNpRlqQlJ1oj0QmKJ2j6NkKLj2JRj0J3ppO
$$ 0 3 7 9 16 5 -5 13 -8 -6 0 5 10 -4 0 -11 -4 8 5 8 4 9 2 11 8 0 8 5 16 10 0 8 4 6 18 2 7 5 7 10 -2 -1 8 -2 11 4 -3 3
5262Cj7MJ3JNj4RpnKmJ3kkL%jJ3rNopJ3mJ5j6oQlNpnoJ1rKJ7j3mMjj1J6oLKPj9
$$ 3 -14 -10 3 4 9 -5 4 -3 -8 -6 -10 3 1 -1 2 2 1 14 5 10 4 -3 10 6 21 5 -1 7 4 9 2 -3 -9 2 -7 -5 12 -1 -5 -1 -2 -13 3 -3 0 2 9 -10
5310a0J9rRmj0RmMj4pJ6oLJ3omLkJ3j5MQJljjqLJ1j8kPqKLNnJnJ2rjRJ1k5RkK
$$ -10 9 0 9 5 -5 4 0 4 -10 -17 -1 -7 -4 9 3 -1 2 0 13 -2 2 10 11 8 7 6 -2 1 12 -6 -8 -1 -9 -7 -4 1 -4 -3 -8 4 -5 -6 3 14 -11 -2 -4 -2
5358bPkJqjJ5j5NJ1%llJ%lj2RmNjkQpPrpMKjlmmJ1KkmJ1pPpPmqMJ2n%qNJlJ0n
$$ -2 5 3 4 -4 -5 10 -5 0 11 11 8 5 6 6 3 -9 0 -4 1 0 -2 6 -1 6 -3 -10 -6 -4 -5 -8 -12 -16 -5 -3 -5 -9 2 -5 2 -5 2 -2 -10 -6 6 1 1 -7 -2 -1 -4 6 1
5411ARpKj1LMJMj1RljmmOj4KJQroJ1Pj0NlNnRolOjOJnJJ1j8J0lJ2j7POlNrj0J8
$$ 1 10 3 5 -6 -3 1 2 6 -5 4 1 0 -4 -8 -2 -16 -14 -13 -5 -14 -20 -9 -2 -12 -7 -10 -5 -10 -1 -7 -10 -4 -5 1 2 -3 -2 9 -9 1 -2 10 -7 0 6 3 8 -1 -11 7
5461GpOj2nMoJ1oPqJ0moM%Rnj3J3KKjMj5MQjkJoJ2rJ8j3lLqQjj3LPjklKKOoPj4
$$ 7 0 6 -6 -11 -7 -13 -2 -8 -1 -9 1 -3 -9 -5 -5 4 -1 -14 -1 1 3 2 6 -9 -5 3 2 0 1 -5 7 -2 16 3 0 3 -5 3 2 -11 -8 -1 -2 -4 -7 -5 -3 3 -3 4 -10
5512a0MLMoPrMjlJ%J2j6KMMpJ9pkJLKrOkj1K1%j0%nMqlMnOMrMpQq%KKj0J2nKj
$$ -10 -6 -3 1 -5 2 -7 -3 -4 -7 -6 -6 6 -10 -8 -4 0 -7 12 5 3 4 7 9 0 6 4 -7 14 14 4 4 -1 3 -5 -8 -4 -9 -3 1 -8 -4 -11 -3 -11 -11 -9 -7 -17 -5 -10 -8 -9
5564ilMQlNOkMmkOj4JJ3kppNOj0NMkoONj3NqJ0rLjj4J7Jj1PJoJ0qRPp%K%mLjO
$$ -9 -12 -8 0 -3 2 8 6 10 6 4 10 -4 -3 10 8 1 -6 -1 5 -5 0 4 2 -4 2 7 -6 -1 -9 1 -8 -5 -6 -20 -3 -2 -13 -6 -5 -11 -1 -9 0 7 0 0 2 2 -2 1 0 6
5616FLj6jJ8loj%KmKj0jJ7jj7J4rJJknRqNNpoLRPmLJ1j0kjJ1oj0PNmNlOj1ol%
$$ 6 9 -7 -8 10 7 1 0 0 2 -2 0 -10 -11 6 5 -12 2 -7 -6 -5 -7 -12 -3 -11 -6 -1 -8 -14 -11 -2 5 1 4 15 5 3 2 13 7 -3 4 9 5 10 7 13 2 -4 -7 -7
5666gJ0%Oj4J0%qO%%pjNnjoJJ3qlRmOnnJ7qMQj9RpMNj3Rk%LLJpmJ0kqR%mkj4O
$$ -7 3 3 9 -5 5 5 -3 3 3 3 -4 -5 0 -5 -6 -12 -11 2 -6 -9 0 -4 2 -3 -8 9 1 5 13 -6 3 -4 0 5 -8 1 -1 -1 2 5 6 -1 -5 5 3 -5 4 4 0 -2 -16 -10
5718a0KRkQokJjoJ0j5KJ3pjLRj0Rmkj4J7Qj3%jJKMJpMJj1PkPj4J4j2nOJNLoKj1
$$ -10 -8 1 -1 7 1 -1 0 -1 -7 3 -12 -10 3 -4 -5 -2 7 -3 6 2 0 -14 3 11 -2 -2 -3 -2 0 4 5 -2 2 3 -8 -1 -3 4 -10 4 -8 -13 -7 -6 -1 2 -4 -2 -13
5767a3J0NqkjNOq%jlJ4j0J2Lj2PRnKj1MklJ2rnjQMj7J5qjNOj3lpJ5jjmJ1rOJ0
$$ -13 -3 2 -6 -8 -9 -4 2 -6 -6 -7 -10 4 -6 6 9 -3 4 13 8 10 -1 3 1 -2 10 1 -4 -5 3 7 -10 5 -3 -4 1 7 -6 -9 -16 -1 -2 -3 -7 4 -5 1 11
5814A1onJ4k1J1lJPjMqQLqLoMlklP%j1JNj2J1jJ4j5n%pNRlpRNnMKj0KNPj3MQp
$$ 11 5 0 14 -7 4 1 2 9 8 12 4 12 15 7 10 4 8 5 3 0 7 7 -4 -3 2 -10 1 0 14 -1 -6 -6 -13 -8 1 -2 -9 0 5 0 4 6 -4 -2 3 10 -3 1 9 2
5864BJ0j3OmjJjKllMmmMpJ7lJj1OlLkLj1OmPmKLlMQj1lM%J2rL%Mj0O%kOnOj6P
$$ 2 12 -1 5 1 0 1 0 2 -1 -4 0 -4 -8 -4 -11 6 3 4 -7 -1 -4 -1 -3 0 -11 -5 -9 -2 -6 -4 -1 -4 0 8 -3 -6 -2 -2 10 1 4 4 8 -2 4 4 2 8 3 9 -7 0
5916@j1J0oLkKPrLknJ0%J0pqkMLj0J7q%kNpLNmJQ%pqQ%OJrPPj2mM%M%j4NJLj5
$$ 0 -11 -1 -7 -4 -6 -4 3 -6 -3 -5 -10 0 0 10 3 -5 -7 -3 0 -10 7 -1 -1 -3 2 -5 -2 3 -1 0 8 8 1 -7 1 1 7 8 -1 6 13 1 -3 1 1 5 5 -9 -4 -3 0 -15
5968a5J2JklmJMRPj8LKJ6j7J3q%%lQj2jJJ1kj1NoJ1lmMLpJ2Lj6jKMmj1P%NJmJ0
$$ -15 -3 -2 -4 -7 -11 -10 -6 3 10 -8 -5 -3 13 -4 9 1 1 1 -2 6 -6 -7 -6 5 3 -8 -3 -9 2 -1 -5 -1 2 -5 7 10 -6 -7 -5 -1 -5 -16 -9 -9 -4 -3 -7 3
6016CqMkLNoK%JLJMj1J3mjNo%JqJ0j5PlNkN%j%rj0J9%oMj4MKNpJ5JrNqpJ0QNj
$$ 3 -5 -1 -3 0 5 -1 1 1 2 5 6 10 -1 12 8 7 12 6 6 7 -1 9 -6 1 -2 3 1 6 6 5 5 -4 -14 5 5 -1 3 -11 -7 -5 0 -7 8 9 0 5 -3 -10 0 8 13 12
6068A2qMjqPKrJ2JKj5NjoJnKJ0oPrPqJl%Mj3MJ5mMoJ1pNkQj3oJ5q%JJRj1JNnQ
$$ 12 4 8 7 -1 6 8 -1 11 12 14 -1 4 3 -3 -2 -7 -5 5 -1 6 -3 4 -4 -3 -6 -6 -2 -15 -11 4 0 4 -2 9 2 7 5 13 0 -6 9 1 1 2 3 12 1 2 7 2 10
6119A0pqjRj0KJ3oljKk%mL%NqoNM%JNLllRlOj1kNRrklQrMJPlJjkJjlj2J2Jqmj
$$ 10 3 -5 -6 3 -7 -5 8 2 -1 -2 0 -2 -2 -6 -3 -3 2 -6 -12 -7 -3 -3 -2 3 6 3 0 9 6 12 1 -1 4 13 4 2 -1 7 -2 2 3 10 7 8 7 5 6 5 2 -10 2 3 -5 -9 -10
6174a0J3lj0J0oJomJ7lmNMNj3QLnMJ1oj5J3nK%jpmOpJ4qoRpNOj3PLjm%J0pOj0
$$ -10 3 0 -10 0 -6 -5 -11 -15 2 -1 -5 0 4 9 -4 4 7 2 6 17 11 -4 9 4 6 6 5 -2 -6 0 -7 7 -1 -7 2 -5 0 6 -7 0 3 2 -2 -2 8 1 7 -3
6222c%KqOlKLQJ1qj%rJOkPmOj2J6j3KJlK0k0Oj0jljoKkJ0qRj0PJ%kNjnJ1j3J0
$$ -3 -3 -1 -9 -3 -6 -4 -1 7 18 10 9 9 0 1 7 5 12 8 14 2 18 5 7 8 5 25 5 11 1 0 -3 -4 -10 -8 -10 0 -8 1 -9 -2 -1 -1 -3 2 1 -4 7 -6 4
6271DKKnMj1QNKnpMlJPjOj8QNnJpJqNkJ%lOlLJ1j4NJmqMJ4qKkNKLQ%j0MmkoOj0
$$ 4 6 8 3 7 -4 4 9 11 6 -1 3 0 1 8 7 13 -5 3 8 3 4 -3 -2 -10 -5 -7 -6 -6 -9 -3 -6 -3 8 -6 -1 0 -4 -12 -8 6 -2 0 -2 3 5 8 16 16 6 10 6 4 -2 4 -6
6326fRLkjqLPj0JJ1j8OPNj2nPNljLqJOLkmNLj0NjLRojQjj0%nMLjLrlPoLpONln
$$ -6 3 6 4 3 -5 -2 5 -5 -4 7 -11 -5 2 7 -5 -10 -3 2 -1 -2 1 -7 -6 0 3 1 -3 2 5 -5 0 -1 2 11 5 4 12 11 1 1 -4 0 3 2 5 -4 -7 0 -6 -3 -10 -4 1 -2 -7
6381gNLrPo%J1j8J3KMj1KJ5rOj1MJNLnLj5RKL%jj1J9j9lkQLqJ1pMqLmNpLRNj4
$$ -7 -2 1 -8 -1 -7 -7 4 -14 -1 1 5 -6 -4 11 2 8 -3 1 2 7 10 5 8 -7 2 4 7 7 6 -5 14 -5 -8 -10 -2 1 -7 4 -3 1 -7 -4 -8 -3 -10 -7 2 7 -7
6430gK%pJ1Rj1J2pJ4j3KRj3KLlKQlKpjMoJkj6J4%qKkJ0qNOj2qJ0j%%LNj%Qj6J6
$$ -7 -5 -5 -12 -1 8 -3 9 2 16 3 5 14 1 3 6 3 5 13 10 12 5 4 8 2 3 1 -15 -1 -1 -9 -7 -9 1 -7 -2 4 -8 -16 -6 -7 -7 -7 -4 1 0 0 8 -8 8
6479Hj5J0QoJ4k3MQr%k%J2MqnkNj7MKMJ0r%nPPrPkkjjLPj2RJloJ0m%jJL%PnpL
$$ 8 -7 3 11 5 19 -4 0 8 -1 -1 -3 -3 9 13 5 0 -2 3 -14 -10 -8 -4 6 -3 -3 -8 -1 6 -3 4 2 0 -1 -2 1 8 -4 5 6 3 -3 7 3 3 2 3 6 6 13 8 1 4
6531DmjQpmLMmlNmKpmOqOPnJMJLoLLnJ0jo%K%rJ3pJQmnKNj0J1j5%NpQoJ4qloJ3
$$ 4 0 -1 7 0 -4 -1 3 -1 -4 1 -3 -1 -8 -12 -6 -14 -8 -1 -6 -5 -1 0 3 -3 0 3 -2 8 7 1 1 3 3 -6 7 0 1 9 5 0 2 7 -3 8 -7 -7 -2 -9 -1 -7 7 -1 -4 -10 3
6586CLpjkPrO%j2OnJ1k%oRKj5J4KKmkkQMoJj1J2pJJPrjMoPlrmQNj0OmJ1Mn%oJ0
$$ 3 6 -1 -2 -4 3 -6 0 0 -12 -6 -11 0 -2 -2 -8 1 3 -12 2 4 6 2 0 -2 6 10 4 5 -6 6 -1 0 1 8 -1 -2 2 -4 3 0 -9 -13 -5 0 -10 -4 -8 3 7 2 2 -4 6
6639FmlMKpJ0pJ1j3PKLljJ2pkmjOmnmLK%njjMrJ1plmOmJ6nojKjNj1J5oKj0J0J0
$$ 6 2 -1 3 5 -2 8 1 12 -1 6 8 11 8 7 19 12 10 6 5 11 7 2 -2 1 3 3 -2 -3 -4 0 -9 2 -5 -8 -12 -6 -10 6 1 -5 -6 -4 -5 0 -11 4 -2 0 -10 0 10
6690A0oLLoMjnkQlP%j6Jj%L%MqJ0moKLMj1NlJJMnJ1KrQjpOknJ0%kJ0Kj4J1nJ0
$$ 10 4 7 10 4 8 7 2 0 8 5 12 12 -4 -3 -4 -4 -1 -1 3 -5 5 1 -5 -3 0 4 -7 -2 -5 -4 -3 1 -4 7 9 0 8 7 0 6 4 -1 9 9 7 17 19 5 16 11 21
6741B1j0j1qJ6%q%NnLj1J2JnkLl%pOJKoNKMqRJJ3j2mJ2j2jnJ6mnloPQnj0kONj8
$$ 21 11 0 -8 8 8 0 0 5 0 3 -8 4 5 0 -2 1 -2 -2 -9 -3 -2 0 -6 -1 1 5 -3 6 7 20 8 4 16 4 3 -2 14 10 5 2 -4 3 11 6 -4 -6 0 5 -13
6790a3J8oLj0lJ2Kj2J1j1%KmJ1oLm%J5nj1QKj2J8%Mj2LmQlmMj1PkOlq%Pok%mJ2
$$ -13 5 -1 2 -8 -11 1 3 -9 2 -9 -9 -7 -11 0 -6 -3 -7 -7 8 3 -8 0 2 -10 8 8 12 0 3 -1 7 4 0 4 -7 0 -2 4 1 -7 -7 0 -6 -8 -8 -12 0
6837@j0QmlJ6j8J2Nj5J1Qpj4QPjJ0pLm%O%o%joNJkJ1rj%j0J1nmJ2j2mOKKj2K0
$$ 0 -10 -2 -6 -9 7 -11 1 6 -9 2 10 3 -11 -3 4 3 13 6 9 5 5 11 11 5 5 4 -2 3 4 2 13 4 3 3 -7 4 -1 -5 7 -5 -9 -3 -1 1 -11 9
6883IopNj2J1NqKRmJL%LmkkkOLrjlQpOJkkJj0J1rP%jmmOKmmLnKMNj2J3JjpnJ2
$$ 9 3 -4 1 -11 0 5 -3 -1 8 4 5 8 8 11 7 5 3 1 7 10 1 0 -3 5 -2 4 5 3 1 2 -8 3 -6 1 1 0 -4 -8 -2 0 -4 -8 -5 -10 -8 -4 1 -11 2 3 2 -5 -10 2
6937BKLrKPoPmJkmQLj3LL%JkpjNj1Q%JNmnJ1j1PLkJLj0LR%kKkoJ6jrKMmJNmKN
$$ 2 4 7 -2 0 7 1 8 4 5 3 -1 7 10 -3 0 3 3 4 2 -5 -6 -1 -12 -4 -4 -3 2 -2 -7 4 -7 0 3 1 2 5 -5 -2 7 7 5 7 5 -1 15 14 5 7 11 7 8 13 9 11 16
6992A6j6kNmrLJ3rRj2LlRMj0%lRoqJ4pJ4nqPNJnjklPpP%mmPj1J1Lmj0LOlKrJR
$$ 16 0 -2 3 -1 -10 -7 6 -3 6 -6 -3 -6 3 7 -3 -3 -6 3 -3 -11 3 -4 10 5 -3 4 9 10 5 4 2 -1 6 -1 6 6 2 -2 5 -6 5 8 4 -6 -3 3 0 2 -7 -6 3
7043CnpJ4jj1KOJOKj1PJmQrO%JkPoknoOP%nLnOOj4KqRkoJOkRolMj5kJ3Kj3NKR
$$ 3 -2 -9 5 4 -7 -5 1 2 8 10 -1 6 7 3 11 2 8 8 9 7 14 8 6 1 -5 1 8 8 3 6 1 7 13 -1 1 -7 2 0 -6 -5 1 -1 8 2 -1 3 -12 -14 -1 1 -12 -7 -5 4
7097DjKmJ0j7J0kPjnKMlQj7J5rmRnPnmj0NlOMj1lJmJ4m%Jj%Rj3PQrRLppJ1%pM
$$ 4 3 5 1 11 -6 4 2 9 8 3 5 9 6 14 -3 12 3 -1 8 3 10 5 1 -9 -4 -7 -1 3 -8 -11 -10 -14 0 -4 -4 -3 -4 -4 5 -8 -1 7 -2 7 10 3 -4 7 7 0 4
7148DnMoP%KpNNpqJ9j3mPrLkJNj4QnJ2%oj1J4Qj8O%kJ1LpkQjKQpNppmJ3mJ%kK
$$ 4 -1 3 -3 4 4 6 -1 4 9 2 -6 13 0 -4 3 -6 -3 -5 -4 1 -13 -5 -10 2 2 -4 -15 -1 7 -11 -5 -5 -7 4 7 0 -2 6 5 7 15 8 13 6 -1 -5 8 4 5 5 3 5
7200Ej0NlLlNmJJmmJ0j1J2klkMm%NnRrKOkjOKoLOopmJ2pjLMk1J7J3j2j3RJnNJ
$$ 5 -5 0 -3 0 -3 2 -2 -1 0 -4 -8 2 -9 3 1 -2 -4 0 -4 -4 1 -4 5 -4 -2 4 2 1 7 9 3 6 12 6 -1 -5 7 0 -1 2 6 -15 2 15 3 -10 -1 0 -5 0 1
7251Aol%OnnJ2nRqQojQj1OLj6K6rJlPj1RoNqkJ1ooQoMqMQj0PrkJ1Jj0pJ9j3pJ8
$$ 1 -5 -8 -8 -2 -7 -12 0 -5 4 -4 4 -2 -3 5 -6 0 3 -13 13 4 5 2 9 -2 7 1 6 -2 -4 7 1 -5 3 -3 1 -7 -3 5 -5 2 -7 -9 2 3 -7 -14 5 -8 -15 3
7301CLj2J4%j1kK%LkJ0nNmjpQrPkROp%j0qQNlkklOKj3MkKN%rPP%KJrJ0j4%PJ4
$$ 3 6 -6 8 8 -3 -5 -3 -3 0 -2 8 3 8 4 3 -4 4 -5 2 0 9 15 8 8 -2 -10 -2 3 0 -2 -4 -7 -1 1 -12 -8 -10 -8 -3 -3 -12 -5 2 2 4 5 -4 6 -8 -8 -1 13
7353A3mj1J3n%JJnJ3j5Nml%nKQooJ0lOq%pkJKNMrMmK0j1llJ3qOLjJj0Ok%pJ9r
$$ 13 9 -2 11 6 6 7 8 3 16 1 6 2 -1 -1 -6 -4 4 -2 -8 2 -1 5 -3 -3 -10 -12 -11 -9 -4 0 -9 -5 -9 11 0 -3 -6 7 -1 5 8 7 8 -2 4 2 2 -5 14 5
7403EnkLklOkj0QoMOmKjJk%K%KpJLlJOmNllRmm%ONj2OlmMKJJoKjlKKolj%JlmQ
$$ 5 0 -2 1 -1 -4 2 0 -10 -2 -8 -4 2 -2 0 -1 0 -2 -2 0 0 2 -5 -4 -1 -4 -3 3 -1 4 1 -2 7 3 -1 -1 5 10 -2 4 1 -3 1 3 4 5 -1 1 0 -3 -1 1 -5 -8 -9 -9 -8 -11 -15 -7
7462glNkO%%rJ6olK1pj7K0j1qQnM%KjNlmNJ0j2kLjJmJ0j7J3j9J9p%%RrNnjjKn
$$ -7 -10 -5 -7 -1 -1 -1 -10 6 0 -3 18 11 -6 14 3 -5 3 -2 2 2 4 3 8 5 1 6 16 4 2 5 4 5 1 11 -6 7 -12 7 0 0 0 9 0 5 0 -1 -2 0 -5
7511eqMJ4jnJ%Qj4PjOooJ3j5MjMNpJLKlOqj3RMpnNlJ2lpJjOLnmQPmrNjNjjJ5p
$$ -5 -13 -9 5 4 -1 0 0 8 -6 1 0 6 0 -6 7 -8 -4 -5 -1 4 -3 -2 1 3 0 6 -2 -15 -6 -2 -9 -14 -9 -12 0 -3 -10 -9 -10 -4 -1 -6 -10 -2 5 1 -8 -3 -4 1 0 -1 14 7
7565GolOPmlMj1LmJ6rnMj2LJ1mqLj5J6JnQLlJlMJpRoRokknJ5rOKJpMJj0JJ1lj0
$$ 7 1 -2 4 11 7 4 8 -3 0 -4 12 3 -2 2 -10 -7 4 0 -8 -5 -20 -4 -3 -8 0 3 0 1 -2 2 3 -4 5 -1 8 2 0 -2 -7 8 -1 5 7 8 1 5 6 -4 -3 8 5 -5
7617eNoJ8j3mPMjj5J0j4J5qONjKKKKjj7QN%j0J4pNpnOQj2KLRol%q%KOkoRJLj8
$$ -5 0 -6 12 -1 -5 2 6 5 -10 0 -14 1 -7 -1 4 3 5 7 9 11 10 -7 1 6 6 -4 10 3 8 1 -4 2 10 -2 0 3 12 6 3 3 -5 -5 -3 3 1 -5 4 5 8 -10
7667a0J8nJMrj%QnRrRoJ%MKlrJ4j8OJOJkojL%mqPNlOrLJMj2LRrJrjJ1JjQnoJJ3
$$ -10 8 3 4 8 -1 -2 -2 6 1 10 1 10 4 5 5 9 11 8 -1 13 -5 1 2 8 9 7 1 0 3 3 -1 -9 -2 3 0 6 -3 0 1 5 -7 -4 5 -4 -3 -12 -13 -2 -1 -2 6 1 -5 -4 9
7722Ij3J5oNrRn%oPkJOkMqRj2M%KpNj0J4j1J2j4lQj3J7pLjlMJJJKJ0kqlKjJ1p
$$ 9 -4 11 5 10 1 10 5 5 -1 6 4 5 11 9 13 5 14 2 6 6 8 1 6 -4 10 -1 11 -3 -6 2 -11 6 -1 2 1 -2 2 3 4 5 7 17 15 7 4 6 5 16 9
7771IlKoQrO%JlMOj4Pj4J1j0LkLLj0OR%oNLj0jMMplNLPkKlqPoKJLlJJ3j0jjrJ2
$$ 9 6 8 2 10 1 7 7 8 5 9 15 1 8 -6 5 -5 -2 -4 -1 2 -8 -2 7 7 1 6 9 -1 -2 2 6 -1 -4 1 4 11 9 11 8 0 7 1 3 4 7 4 5 18 8 7 6 -3 9
7824IooN%oLkOmjKjJmlJ4knMnOplPJ8j2qpJ9jLj7%RmJLmmJ0j1R%okK%%kKKjKp
$$ 9 3 -3 2 2 -4 -1 -3 3 -1 -2 0 -1 0 -4 -7 7 5 0 4 -1 5 -2 -5 2 20 8 0 -7 12 11 14 -3 -3 6 2 3 6 2 -2 8 -3 6 6 0 -2 0 0 0 -2 0 2 1 3 -4
7878dlOJ3qoQKj2RnKPmLkjkMjKpPMj1MnjMLjpnPNqM%nPJ%rLNlJ0pRrRrlNQMnn
$$ -4 -7 -1 12 4 -2 6 8 -4 5 0 2 9 5 8 6 5 3 7 6 8 1 8 12 1 5 0 -1 3 6 5 -2 -7 0 5 -3 1 1 -4 3 4 4 -5 -2 3 0 10 3 12 3 12 3 0 5 13 17 12 7
7935G%KqQJkJ%qOpjJ5j4lQ%lj2JPMj6NOJQmkjnQmJ1lkJ0Rk1J3j0OOnj3J5rQqJ1
$$ 7 7 9 1 9 10 8 9 9 1 7 0 -1 14 0 -3 5 5 2 -10 -9 -2 2 -14 -9 -3 -2 6 2 0 -1 -6 2 -2 9 6 4 14 23 2 15 5 11 17 12 -1 14 5 13 5 16
7985A6j2%pJ0j4KJ7j1Kj2PlOolPOnjKlkoJ1RkKnjpKN%%NjrRklNPj3llkJ0j1Pl
$$ 16 4 4 -3 7 -7 -5 12 1 3 -9 -2 -5 1 -5 -8 -1 5 0 -1 1 -2 -4 -10 1 10 8 10 5 4 -3 -1 4 4 4 9 8 -1 8 6 3 8 15 2 -1 -4 -6 4 -7 0 -3
8035cOqnJPmLk%LmJlmPL%J1LqlNJ5j1kj%MK%rMkLjmj%mLmlOoQo%LlKqNJ0nKJp
$$ -3 3 -5 -10 -9 -2 -6 -3 -5 -5 -2 -6 -5 -8 -12 -5 -2 -2 9 12 4 1 6 21 10 8 7 7 11 13 13 4 8 6 9 8 4 3 3 -1 2 -2 -5 1 -5 3 -3 -3 0 -3 -1 -9 -4 6 1 3 4 -3
8092c%J0KrJ1j1J0pLMo%o%mJ4mmlJ0loMlj3J6Mj5mQ%kK%KoJ0MlqQmNNrJJ3j7P
$$ -3 -3 7 9 0 11 0 10 3 6 10 4 4 -2 -2 -6 8 4 0 -3 7 4 -2 2 -1 -14 2 6 -9 -13 -5 -5 -7 -5 -5 -3 -9 1 5 2 -6 2 -2 3 8 -1 0 13 -4 3
8141CJ4j2LpOJKrMj1J0nOppJ1nOj4QmPlklNO%mNp%mRkkPmLrJ7j1JJP%j4LMm
$$ 3 17 5 8 1 7 8 10 1 5 -6 4 -1 5 -2 -9 2 -3 3 -11 -3 -7 0 -3 -5 -8 -3 3 3 -1 4 -3 -3 -7 2 0 -2 5 1 4 -5 12 1 2 3 10 10 -4 -1 3 -1
8191a
$$ Imaginary data points
##PAGE= N=2
##DATA TABLE= (X++(I..I)), XYDATA
0@%%%%%%%%%%%%%%%%%%Qj6J6j6J6j6K4l2L2m0M8m9N7o9P7q8J04j13J22j38J54
$$ 0 0 0 0 0 0 0 0 0 0 0 0 0 0 0 0 0 0 0 8 -8 8 -8 8 -8 16 -16 16 -24 24 -25 32 -37 40 -48 56 -57 65 -73 81
39H1j77K00k17K42k73L01l30L66m02M42m90N38n91O52p20P96q81R75j086J214
$$ 81 -96 104 -113 129 -144 157 -173 193 -209 233 -257 281 -310 342 -378 418 -463 512 -574 640
59F40j360J536j748K016k360K815l461M451o182J0065l4376P182N8529k6962k5167
$$ 640 -720 816 -932 1084 -1276 1539 -1922 2529 -3653 6412 -27964 -20782 37747 10785 -14382
74a4382j0964J1393K3154J5929j5935j6119q223J2982K2142m01k1815l285M714
$$ -14382 -25346 -13953 9201 25130 9195 -6924 -15147 -2165 19977 19576 -2239 -5524 -810
87h10N532J0767k184k0043k845J1080M193m645r734o956R475J0142l709q796j292
$$ -810 4722 15489 13305 -6738 -9583 1497 5690 1045 -8689 -15645 -6170 3972 263 -8533 -9825
102i825R666J0347o204r667K874L826K609O114q474j5336Q558J9542L26j3421
$$ -9825 -159 10188 3984 -5683 -2809 1017 3626 9740 1266 -14070 -5512 14030 14356 935
116I35j0067L413J4256M188j1222r816l566N325J6208M014j8983j2649J0290J6777
$$ 935 -9132 -5719 8537 12725 1503 -8313 -11879 -6554 9654 13668 -5315 -17964 -7674 9103
130I103N989j1616j7270J046J6579Q182o214j1852p954O842J6814M656j3843j2370
$$ 9103 15092 3476 -13794 -12748 3831 12013 5799 -6053 -14007 -7165 9649 14305 462 -11908
144a1908N590J4491M016q645q783j912N187Q395J150r617p702N286J1395K145
$$ -11908 -6318 8173 12189 3544 -5239 -7151 -1964 6431 7581 -2036 -9738 -4452 6943 9088
158I088r669o937M022N732O96k216n273l983O039R424j403r587l872P511J0204
$$ 9088 -581 -7518 -3496 2236 2932 716 -4557 -8540 -2501 6923 5520 -4067 -7939 -428 9776
173I776j418j1946m706Q045P187j725o579n593J369Q834N788n316r377j296Q397
$$ 9776 8358 -3588 -8294 -249 6938 5213 -1366 -6959 -5590 3244 9032 3716 -5661 -6957 1440
188A440O976m434j0222k639O485O254N44m547n663O54Q866O129n787r830r45P723
$$ 1440 8416 3982 -6240 -8879 -2394 3860 4404 -143 -5806 -5152 3714 9843 4056 -5774 -6719 1004
204A004N596l372p824k621N287P054J882n432p480O35R608M913p832r555R38Q253
$$ 1004 6600 3228 -4596 -7217 -1930 5124 7006 1574 -5906 -5271 4337 9250 1418 -8137 -7199 1054
220A054M909l221o968k381N291P343J473o621p730J204Q945L671o930p332J274
$$ 1054 5963 2742 -4226 -6607 -1316 6027 7500 879 -6851 -5647 3298 6969 39 -7293 -6019
235f019P035N233j109o147l917L656O802Q86o906o546K046P539K423n108m492
$$ -6019 1016 6249 5140 -1007 -4924 -1268 5534 6420 -486 -7032 -4986 2553 4976 -132 -4624
250d624J410M727L301j354n375l066L641N148r06n932k919M139N973K93m771l070
$$ -4624 -3214 1513 4814 3460 -1915 -4981 -1340 3808 2902 -3030 -5949 -1810 4163 4456 -315 -3385
266c385K108M552K210l344o422j576N875N266k783o967j840N826O561m14o505
$$ -3385 -1277 3275 5485 2141 -4281 -5857 18 5284 2501 -4466 -6306 -480 6081 5667 -838
281h38m716K049O042L037m203p252q76P282O222k297o937k795M316O078O19n566
$$ -838 -5554 -3505 2537 5574 1371 -5881 -6757 525 6747 4450 -2487 -5282 -966 5112 5731 165
297A65n323O28N437L868k644o179j405N504N136j384n286k559K604M225O17l901
$$ 165 -5158 -4530 907 4775 2131 -4048 -5453 51 5187 3803 -1483 -4042 -1438 2787 3404 -497
313d97l674R38M454K633k611m317K99M904K748k892m595r28L214L299q17m325
$$ -497 -4171 -3233 1221 3854 1243 -3074 -2775 2129 4877 1985 -2610 -3538 -324 2975 2158 -2167
329b167k410K966N106J010m489m323J546N424K211l717n093p17M244M399p14n183
$$ -2167 -4577 -1611 3495 4505 16 -4307 -2761 2663 4874 1157 -3936 -4653 -409 3990 3276 -1907
345a907k989L330N751J181m727m871O65M929K815k719m927j358L890M759o5m571
$$ -1907 -4896 -1566 4185 5366 639 -4232 -3567 1362 4177 1458 -3469 -4827 -937 3822 3757 -814
361h14k965K524M544P78l904l933N44L968K336k065l589l94L640L360j205m331
$$ -814 -3779 -1255 3289 4067 163 -3770 -3226 742 3078 1013 -2576 -2970 670 4030 2825 -1506
377a506j943K736L452m17l913k654J848M244J628k806l495M83M255K811k342m981
$$ -1506 -3449 -713 2739 2322 -1591 -4245 -2397 1847 3475 669 -2826 -2343 1912 4723 2381 -2600
393b600j588L407L911m56m143k607K215M711J725l314m371j28L959K871k080m654
$$ -2600 -4188 -781 3130 2674 -1469 -4076 -1861 2850 4575 1261 -3110 -3238 721 3592 1512 -3142
409c142j513L318M094K45l299k481J572L849J260l005l705p8L285K329j603l332
$$ -3142 -4655 -1337 2757 3002 -297 -2778 -1206 2643 3903 898 -2807 -2885 400 2729 1126 -2206
425b206n96K997K930n90l232j866J821K967J1l264k753J113L703J848k199l122
$$ -2206 -2802 195 3125 2535 -697 -2563 -742 2225 2236 -1028 -3781 -2668 1035 2883 684 -2438
441b438K26L573K601j653m148j747K594L582R7l601k778J655M274J885k533l917
$$ -2438 -2212 1361 3962 2309 -1839 -3586 -992 2590 2687 -914 -3692 -2037 2237 4122 1589 -2328
457b328n59L462K896j510m207j895K401L788P11k939k677R11L482J869k106l529
$$ -2328 -2887 575 3471 1961 -2246 -4141 -1740 2048 2759 -180 -2857 -1946 1536 3405 1299 -2230
473b230o08K808K441r25k979j245K186L013K41k487j952R99K590O88k476k760
$$ -2230 -2838 -30 2411 1486 -1493 -2738 -552 2461 2702 215 -1737 -738 1852 2540 64 -2696
489b696K38K850J830j555k831l16K697K397p04l031j795J738L148M88k914k706
$$ -2696 -2458 392 2222 667 -2164 -2480 217 2614 1910 -1121 -2916 -1178 1970 2458 -456 -3162
505c162R84L649J981j863l212n35K755K680q32l563k145J666L222P80k598k715
$$ -3162 -2178 1471 3452 1589 -1623 -2158 597 3277 2445 -1118 -3263 -1597 1625 2405 -193 -2908
521b908N92L234J950j501k972q18K189K297n44k776j577J596K895P29k096j990
$$ -2908 -2316 918 2868 1367 -1605 -2423 -234 2063 1519 -1257 -2834 -1238 1657 2386 290 -1700
537a700P69K513J080j811k642k94K284J810j111k655p71K252K614j64k608j780
$$ -1700 -931 1582 2662 851 -1791 -2085 199 2009 898 -1757 -2528 -276 2338 2174 -434 -2214
553b214J229K646O21k458k695K73K945K127j176k876q14K459K767k58k972k164
$$ -2214 -985 1661 2282 -176 -2871 -2598 347 2474 1298 -1578 -2392 67 2834 2576 -396 -2560
569b560J046K756J052j995k586P1K829K267q96k736j145J652K049k88k390j719
$$ -2560 -1514 1242 2294 299 -2287 -2216 613 2880 1984 -752 -1897 -245 1804 1516 -874 -2593
585b593Q64K297R92j383j847K62K251J424j185k273m65J723J516p12k054p58J622
$$ -2593 -1729 568 1560 177 -1670 -1408 843 2267 1082 -1191 -1656 67 1583 871 -1183 -1941 -319
602c19K260K62k000j734Q01K281O34k147k490R0K408J739r80k360p33J997K540
$$ -319 1941 2203 203 -1531 -730 1551 2185 38 -2452 -2362 46 1785 805 -1555 -2288 -291 2249
619B249J21k498k155P49K623J114j837k464oK504K104n87k387j282J294K164K51
$$ 2249 2370 -128 -2283 -1534 1089 2203 366 -2098 -2104 400 2504 1917 -470 -1752 -458 1706 1957
636A957k143k056M29K192J167j220j841rJ890J528n75j886r34J053J582n3j731
$$ 1957 -186 -2242 -1813 379 1546 326 -1515 -1524 366 1894 1319 -567 -1501 -448 1134 1081 -650
653f50j157R98J991N34j445j445M14J733Q68j230k015m37J654J629n13k011q80
$$ -650 -1807 -809 1182 1716 271 -1174 -760 973 1841 611 -1404 -1841 -187 1442 929 -1082 -1962
670a962J516K145K65j879j743L80J997J117j267k223m36J947J983l56k063j117
$$ -1962 -446 1699 1964 85 -1658 -1278 719 1836 569 -1654 -2090 -143 1840 1484 -579 -1696
686a696J212K020M25j717j875J10J817J220r53j876l35J697J650l60j744r47R16
$$ -1696 -484 1536 1961 244 -1631 -1521 296 1516 563 -1313 -1648 49 1699 1339 -405 -1352 -436
703d36J498J37j477j363M10J723R02j021j532R0J709J180q22j820o53J177J443
$$ -436 1062 1199 -278 -1641 -1231 492 1394 373 -1159 -1069 640 1820 998 -822 -1475 -298 1145
720A145j29j602j183Q33J980P81j373j742J06J795J154r75j962o66J254J665J39
$$ 1145 1016 -586 -1769 -936 1044 1825 452 -1290 -1184 611 1765 790 -1172 -1838 -584 1081 1220
737A220j505j208P45J934P68j367j789o5J469R87p21j496m62J148J459P2j295
$$ 1220 -285 -1493 -748 1186 1954 587 -1202 -1267 202 1189 468 -1028 -1490 -342 1117 1189 -106
754a06r50O71J417K18j344j258L04J328O46p74j118N5J336J116m79j551p25R72
$$ -106 -1056 -385 1032 1250 -94 -1352 -1048 280 926 152 -966 -911 425 1541 1062 -489 -1214 -242
772b42J345j57j573j074P40J713P12j051j444J1J549J185p25j907q74J110J659
$$ -242 1103 946 -627 -1701 -961 752 1464 413 -1031 -1020 529 1714 989 -918 -1792 -682 977
789I77J68j409j159N93J714Q75r80j646l66J236J177m37j531p50R17J421K82j010
$$ 977 1145 -264 -1423 -830 884 1759 779 -867 -1233 3 1180 743 -788 -1538 -621 800 1082 72
807G2q99L45J169M91q57j220j45J029P80m54j029j38R97R47k14j056o04N70R87
$$ 72 -827 -482 687 1178 321 -899 -1044 -15 765 311 -718 -856 141 1088 874 -182 -786 -216 771
826G71P0j135j025L97J368O67q32j178M7J267R58n41j449p50Q18J380K09j261
$$ 771 841 -294 -1319 -922 446 1113 281 -897 -850 417 1375 834 -615 -1365 -547 833 1042 -219
844b19j161M79J581P95q54j389k26J113J038l28j369q55O61J381M14r77j028K77
$$ -219 -1380 -901 680 1475 621 -768 -994 119 1157 829 -540 -1395 -734 647 1061 84 -944 -667
862f67J240O33p10j144k57Q12P99k23j014m89O76J073J66q91p31M17R81K45q75
$$ -667 573 1206 496 -648 -905 -93 706 483 -531 -1020 -344 729 895 4 -727 -310 671 916 41
881D1r73P0R95O82m59j003k29R54J004j64j164p33N70J096J92j020j017K20J205
$$ 41 -932 -862 133 815 356 -647 -876 78 1082 918 -246 -979 -409 687 879 -141 -1158 -938 267
900B67Q00n04j103k84R15R80k02j211p89N08J100L16q01q66J94J062O77m84j025
$$ 267 1067 563 -540 -824 91 1071 869 -342 -1131 -623 477 793 -8 -874 -680 382 1059 575 -450
919d50k83P21P28k54j004n05O11R81K06p34o60L18R57L80p58r85p9Q86O74m11
$$ -450 -733 -12 716 462 -542 -1047 -436 545 751 17 -643 -325 632 1012 254 -731 -810 76 750 339
939C39r85k84Q25J031K9r77p74L71R86L24q75j063RJ075Q46l29r53l80P36R58
$$ 339 -646 -930 -105 926 955 -22 -796 -425 561 885 10 -1053 -1044 31 877 548 -405 -785 -49 909
959I09L7r70q45K29R22M27o11q36K6Q75P05k17q26l66M76O28r7p63n58L63P82
$$ 909 946 -24 -869 -640 282 709 98 -738 -712 163 868 651 -175 -541 -65 563 466 -297 -855 -492 290
980B90K65n29n63K34P65L71n31p80j11O26N31k90q21l06O76R38O7q37o87L51R02
$$ 290 555 26 -537 -303 462 833 302 -478 -589 37 568 278 -543 -849 -173 765 832 -5 -692 -341 561
1001E61K82p58r29p3Q77P91k49r41m31O75J020J34r13q26J95Q84M24n33q56j27
$$ 561 843 85 -844 -917 -40 751 502 -439 -870 -195 825 959 46 -780 -585 299 723 190 -666 -793
1021g93P52Q11p1p89n03L98P50J06o75o64J36O65L59l73n73oO18N10k25o67k81
$$ -793 -41 770 699 -90 -593 -195 555 661 -14 -678 -542 123 482 109 -464 -470 148 658 433 -234 -515
1042e15M43N11j35o44l66M21P18J55n51n24K08P19L54n18p92j46O53N98k23p82
$$ -515 -72 439 304 -340 -706 -285 433 588 37 -487 -279 440 794 276 -516 -662 -9 589 366 -416
1062d16l41N46Q36J55o84o98J19P61M21n02q20j61O64P04p7o89l89M11P43J59
$$ -416 -757 -211 625 780 96 -602 -483 278 699 197 -623 -784 -120 584 507 -182 -571 -160 583 742
1082G42o14o65M1O41L53l77o40m3O07N64j48o09l12L73N31po19m94K49O64K57
$$ 742 128 -537 -496 145 498 121 -519 -562 45 609 461 -148 -460 -87 444 437 -182 -676 -427 237 494
1103D94m39n14J31O53M13l10o85k93M54N59p9o67m36L89P58K42n13n91N6O09L66
$$ 494 55 -459 -328 325 738 428 -257 -550 -96 463 384 -283 -719 -330 428 670 157 -434 -378 231 597
1124E97l31o92k80M57O21L2n55l74L58O49J84m89n62OM74K88k79n20j07M74N20
$$ 597 266 -426 -706 -249 372 404 -151 -525 -167 482 666 177 -385 -379 95 383 104 -416 -523 -49 471
1145D71o1n17k64L48N00k0n71m44J71N41K27l70m54O4N85M57k54o63k72M31N29
$$ 471 410 -107 -371 -23 477 457 -114 -558 -387 154 381 11 -443 -379 206 663 409 -254 -526 -95 434
1166D34o2o11m38K78O73L25l88n77l6N69M92k31p19l61L83N91Q7m86m17J67N96
$$ 434 372 -239 -677 -399 274 599 211 -366 -402 167 659 428 -291 -652 -269 322 409 -77 -494 -327 269
1187B69L34l02n78j38M24L84j71n16k28L36M68P8l55k91J92M26J17l76m53L1M23
$$ 269 603 301 -277 -415 9 393 222 -294 -522 -186 282 360 5 -286 -94 332 449 73 -380 -349 74
1208G4K34k49m24%M28L93j16m78k43L16M57J1n25m40J90N68K75l37m86j0N01M38
$$ 74 308 59 -365 -365 63 456 340 -138 -381 -65 392 403 -122 -562 -372 196 471 134 -352 -362 139 577
1230E77j41o09l62K94N58J02m86m68J47N78L40k47n02j34L66M09q6n16l45K27
$$ 577 436 -173 -535 -241 317 419 -67 -535 -388 190 530 283 -219 -353 13 422 336 -180 -525 -298
1250b98N08J37l57l32J49M33K01k59m08q5L12K84j26m25j70L40M39nl83k30K38
$$ -298 210 347 -10 -342 -193 240 441 182 -226 -311 1 285 159 -266 -436 -96 343 338 -45 -275 -37
1271c7L79M6l64m04J2M04K97j97m29q5M29M36j00m82k79J98M09R0l72m12M6M80
$$ -37 342 388 24 -380 -368 36 333 136 -293 -378 51 487 387 -95 -374 -176 233 323 -49 -461 -415 65
1293F5L60j80m35j16L60L76j00m48k89J68M02J39k89l21O8M35K49k07l91j06L02
$$ 65 425 245 -190 -306 54 430 330 -118 -407 -239 163 302 13 -308 -240 195 444 237 -154 -260 42
1314D2K43j37l86j83K41L94P9k97k83J54M05J38l28l98l0L61K61j30l82j24L00
$$ 42 285 148 -238 -421 -180 214 293 -4 -287 -133 272 410 82 -316 -346 15 276 146 -236 -360 -60
1335f0M33M8l97l31J19M10J14l26l96j6L63L43p2l57j81K55L98K4l84l15J04L41
$$ -60 373 421 24 -307 -188 222 336 10 -386 -402 -39 304 232 -125 -306 -51 347 371 -13 -328 -224 117
1357A17J26k23k83J2L25K73p8l42j45K19K67q4l57j91J95L13O2k38k25R9L36J77
$$ 117 243 20 -263 -251 74 347 269 -73 -218 1 268 184 -173 -364 -169 144 206 -32 -257 -158 178 355
1379C55k11l77p4L08K70j33l64j42K82L95M8k93k96O9L66J97k51m51p9L44L43
$$ 355 144 -233 -307 1 271 138 -226 -368 -86 309 357 64 -232 -163 203 400 149 -302 -381 -37 306
1400C06q5l76j71K16L91Q5k98l62L3L18J95j94l50m0L04L00l6k65j49J52K64L1
$$ 306 221 -155 -326 -110 281 366 68 -294 -261 57 252 58 -292 -332 -28 272 236 -29 -178 -26 238 269
1422B69k67k78R1K64J26k08k28N1K77J87j19k71j11K07K11n1l28j82K01L50Q5
$$ 269 2 -276 -185 79 205 -3 -231 -180 97 284 165 -106 -217 -10 201 150 -178 -360 -159 191 276
1443B76k60k23R1L04J58j72l57j31K51L03n2l65j72K32L61Q9k63k86JK84J83j43
$$ 276 16 -207 -116 188 346 174 -183 -314 -63 240 188 -177 -349 -117 244 333 70 -216 -215 69 252 109
1465A09l61j07K72L21j2k86j51J94K71L3k18k56mK28J59j33k81j8K88K38p8k70
$$ 109 -252 -359 -87 234 222 -64 -215 -21 250 283 65 -191 -195 33 192 59 -222 -240 48 286 208 -62
1487f2j05J67J87j5k43k16O4K90J62j74k54K0L11J91j38l07j27J60K47J2k51k17
$$ -62 -167 0 187 172 -71 -287 -223 67 229 55 -199 -179 132 323 185 -122 -249 -89 158 170 -81 -298
1509b98J23L41J70k16k83jK59J62j27k76j40J62K65M6k17j91J23K84R8k13k31
$$ -298 -175 166 336 120 -163 -164 95 257 130 -146 -286 -124 141 187 -30 -221 -98 186 284 71 -160
1530a60j3J77J34q4k20o5J88K54Pk29j53J41K30Nk47j89M4K12J35j03k26m4K45
$$ -160 -173 4 138 54 -166 -231 -43 211 218 -11 -164 -23 207 212 -35 -224 -180 32 167 64 -162 -206 39
1553C9K57o7l17j52J75K34%k41j74N7K58J88j06k68p8K41K37q3l19j47J42K18
$$ 39 296 229 -88 -240 -65 169 169 -72 -246 -189 69 257 151 -117 -195 46 283 200 -119 -266 -124 94
1575I4N9j62j62J4K51J76j15k71o5J86J72j06k16p1J31J98L5j28j29M8K11R9j85
$$ 94 153 -9 -171 -157 94 270 155 -116 -181 5 177 71 -145 -216 -85 113 148 20 -109 -61 150 249 64
1598F4k34%K25J12j29j82k0J78J89jk05j66Q8K45M4k49k42O4K69J27r9k06m4J86
$$ 64 -170 -170 55 167 38 -144 -164 14 203 202 -3 -169 -81 164 208 -41 -283 -219 50 177 78 -128 -172 14
1622A4K15kk50k20J06K48Q3k14j94P0K26J39q4j77r0J21J94k2k44j64J10K23M8
$$ 14 229 227 -23 -243 -137 111 194 -20 -214 -144 82 221 137 -40 -130 -9 185 163 -81 -245 -135 88 136
1645A36j55j12O3J66Q8p9j93r7J50J78n9k37p1J89J98oj71q6N1J63P1j36k25o0
$$ 136 -19 -131 -68 98 186 107 -86 -183 -33 145 86 -151 -222 -33 165 159 -12 -98 -47 116 187 51 -174 -234
1669b34K17J92q6k28l5J91J84k2j80j51M4J66R9j19k29qK14J85o7j91m2J33J24
$$ -234 -17 175 89 -139 -174 17 201 179 -1 -152 -108 58 157 38 -191 -199 15 200 133 -58 -100 33 157
1692A57k2j51j43J1J81J03j14j63J4K20J08j23j51k3R0J03k5j55j13P1K25P5j58
$$ 157 135 -16 -159 -148 33 136 22 -141 -127 93 201 78 -73 -96 -6 97 72 -83 -196 -125 100 175 17
1715A7j44O8K13L8j30j86k2J17J46lj73j16J09K47M2k02j53N9J53O0j07j71l8
$$ 17 -127 -59 154 192 62 -124 -146 -29 117 114 -59 -175 -66 181 223 21 -132 -73 80 140 33 -138 -176
1738a76J21J88Nj71j18J21J93kj57j46L9J14P5n5j27l5J32J72k9j69o8J13J22
$$ -176 -55 133 138 -33 -151 -30 163 161 4 -142 -103 11 86 31 -96 -131 1 173 144 -25 -93 20 142
1761A42o3j35r1P2J28N6p3j25j0J78J18j03k03l1J44J20o1j54o6R2J67P5j11j78
$$ 142 79 -56 -147 -75 53 109 36 -89 -99 79 197 94 -109 -140 4 124 63 -91 -157 -65 102 177 66 -112
1785a12NJ89J11j33j97l8J40J31j1j28r5P1J71P2j10j85j5J67R2r9j47j2J29J09
$$ -112 -107 82 193 60 -137 -175 -35 96 85 -43 -138 -67 104 176 66 -119 -134 33 125 26 -121 -133 -4 105
1809A05J3r7q3L9J32L7j36j48L9J48L6q7r1K6R8J02k3j44q9Q0J29j8j51j06J01
$$ 105 118 21 -62 -23 109 146 10 -138 -99 49 85 -2 -93 -67 31 133 110 -34 -123 -43 86 68 -83 -189 -88
1834h8J54N9r4j04J5J06J09n1j75q4J12J50j3j46p7Q9J38O3r1j27l5J05R2m9j66
$$ -88 66 125 31 -73 -58 48 157 106 -69 -153 -41 109 96 -50 -127 -38 100 163 72 -55 -90 15 107 58 -108
1859a08n9J06J46Pj17n7N4J18K9p6j30l4J28R9o3j32j6J33J12k9j24o0N4R3J7
$$ -108 -167 -61 85 92 -25 -82 -28 90 119 43 -87 -121 7 106 43 -89 -105 28 140 111 -13 -73 -19 74 91
1884I1j00j22JJ45J01p4j18pJ36R0m7j25o6M0J17L9j00j24M1J42Q0p4j13j5R1
$$ 91 -9 -131 -130 15 116 42 -76 -83 53 143 96 -29 -95 -55 62 101 1 -123 -82 60 140 66 -47 -62 29
1909B9O0m6r5p0L6J22M0q8q3N7J23K2p1j03%Q4N1l7r7l8J02J13jj26n7O8R7Qj03
$$ 29 89 43 -52 -122 -86 36 76 -12 -95 -38 85 107 36 -67 -67 17 68 31 -66 -104 -2 111 110 -16 -73 -5 92 100 -3
1938cr7NJ02Q9n5j19k7J12J19k0j38p2N4J04J0p5j07PJ23R5l1j23l7R7R7k1j04
$$ -3 -100 -95 7 96 41 -78 -105 7 126 106 -32 -104 -50 54 64 -11 -118 -111 12 107 76 -47 -84 13 110 89 -15
1965a5q4N3P9L7n0p6LJ04O7m4j10k8Q1N4n1o7m2O4P2Ql6n8J5J02L3r2r3JR5N2
$$ -15 -99 -46 33 70 20 -56 -53 51 118 74 -36 -64 17 71 20 -47 -89 -25 47 55 19 -39 -24 78 111 19 -74 -73 22 74
1995G4n9p0k1P5R2Mr3p0K3J15L1j10r0QJ13N7k5p4l6O6J03jj02r1L3R2K6o5p4
$$ 74 15 -55 -76 -1 91 95 2 -68 -45 70 101 -9 -99 -91 22 79 54 -20 -56 10 113 112 10 -81 -48 44 70 5 -69
2024f9K0P6Q2k7r1n3N6P9k6r0n6M0R7J7m7o4K4P8N3m1r6k9N7P3k8q0k2N9Q6Rn7
$$ -69 -49 27 109 82 -9 -62 -6 73 47 -43 -99 -59 38 55 8 -56 -32 46 99 58 -38 -67 -10 63 35 -45 -67 -8 78 87 30
2055C0n5OP7M1o6r0k3Q2O4l0o5l4O5Q2np4o8PP2M1n7q7NQ3P9k6p3j1N3M2Jo8o7
$$ 30 -25 -19 58 99 33 -57 -80 2 66 36 -29 -63 2 84 79 5 -63 -56 16 57 0 -87 -82 1 80 54 -19 -30 23 65 66 -2 -69
2088f9QQ0M4n4o6J3Q5M8m3o5k8M0N2j0q0m6M5R7L2n5p1J5O8M6n0p5l4N6N5J4p2
$$ -69 -61 19 63 9 -57 -44 41 89 46 -19 -47 -7 45 35 -45 -91 -46 51 83 28 -43 -28 40 86 36 -39 -73 -17 38 52 -20
2119b0n3M2Q6K5n3o4nO5L5m0o5j8N3O3Mn0l0K4O8J1o2n9J2N3K3l9l8oO0M8j8n8
$$ -20 -73 -31 55 80 27 -37 -42 23 58 18 -47 -65 -12 51 55 5 -25 -1 67 78 16 -43 -31 22 45 6 -32 -38 22 70 52 -6
2151fl0L9L8no5l9K4O3K6l5m8NN4N7m3o9j8L8N5%n5m1K9P0L3m8o4PN9L3l1n5m3
$$ -6 -36 3 41 36 -29 -68 -44 19 45 10 -38 -33 21 78 35 -34 -52 -14 41 41 -14 -55 -26 44 77 29 -35 -28 31 64 33 -22 -65
2184f5N1O0jl9n2K5O6K0l0o6j9M7M0l0m2j8M9M1kk6l3J8L6J2m1m7ON7K9m0l1M
$$ -65 -14 46 45 6 -46 -21 45 65 35 -31 -50 -3 37 7 -35 -53 -4 37 35 9 -24 -6 30 42 1 -46 -40 17 46 6 -25 -21
2216b1M1M0rn4l5K4O3Oo4m5K0O1L2k1n0nM3K9j3n6l3K6M5Ll2m1J7O1K0k0n3j3
$$ -21 20 60 51 -3 -38 -14 49 55 -9 -54 -34 27 59 38 -12 -17 26 55 42 -14 -47 -21 24 27 -5 -46 -29 32 52 32 -21 -34
2248c4L7M2j5n6l2M5N4jk0l0QN4Ol9m1%L1L4k5l9qM0M6qm3l1J3M1Pm0m1RM1L3
$$ -34 3 45 30 -26 -58 -13 41 40 20 -10 -2 52 58 19 -22 -22 9 43 18 -21 -29 11 57 49 6 -25 -12 29 36 -4 -45 -36 5 38
2282C8j9l6kL1K9j0l9l0K1L3Pk9k3J5L9K8k7l7OJ6K4pm0k9K1N3ok7j9ML7L3k5
$$ 38 19 -17 -19 12 41 31 -8 -38 -17 16 23 -6 -29 -14 25 53 26 -11 -5 11 35 28 -12 -41 -20 33 27 0 -19 -15 22 55 30
2315C0o0j2M6K2j3m8nK8M1Ml4k2QN0Om1l9%L9K9rk2k7L4M9ll2l8J1L1J4k1l9j1
$$ 30 -30 -42 4 26 13 -35 -40 -12 29 33 -1 -23 -15 35 41 0 -39 -39 0 29 20 -2 -29 5 54 51 19 -19 -8 23 37 16 -23 -34
2349c4M0K8pk3j3J6K7jm5k2J2K1K1k0k6ML2J9Km3j0K6J1ol2KQK5J3j5k2NL2J9
$$ -34 6 34 27 4 -9 7 34 33 -12 -34 -22 -1 20 0 -26 -22 10 29 31 -12 -22 4 15 9 -23 -21 -13 12 25 10 -12 -7 25 44
2383D4k7m0jK9K0rj9k1K3L5Ok6k7J1K3Ql1k4rL3J5%j5k7K6K7Mk7l4QK9K3k5k9
$$ 44 17 -23 -24 5 25 16 -3 -24 -1 34 40 14 -13 -2 21 29 -2 -26 -35 -2 13 13 -2 -29 -3 24 28 1 -33 -25 4 27 2 -27
2417b7J3K1K5Kk6k1J8K6qql2LK5J3j6j4J2J9J5k0j3k5K1K0j7k2j1J8K6J3k1j6
$$ -27 -14 7 32 34 8 -13 5 31 23 15 -17 -14 11 24 8 -6 6 25 40 20 7 -18 3 23 6 -16 -27 -9 17 30 9 -7
2449goK8Qj9qk3K4J0J1l0PLK0J5k7k1KJ7J6pk0oK3J7j1j4j0RL2j0j5l4%J8J8p
$$ -7 -13 15 23 4 -4 -27 -3 7 18 -12 -5 -2 18 33 6 -15 -13 4 20 13 -7 -13 10 27 16 2 -8 1 33 23 8 -26 -26 -8 10 3
2485Cj9%K1K2j9j5oJ2Rqj1j8NL5Jjl0K1J3J0j1l1J3NJ7lj0k0J2J4K0k4j0JK0L
$$ 3 -16 -16 5 27 8 -7 -13 -1 8 0 -11 -29 -24 11 12 11 -19 2 15 25 14 -17 -4 1 18 15 5 -15 -3 11 31 7 -3 -2 18 21
2521B1j6j3qJ1J6lqj8J5J1Krj8NPRJj0pJ8J8j6mj1RJ6Nj5j6kK3J3j5j8MK1J1j6
$$ 21 5 -8 -16 -5 11 8 0 -18 -3 8 10 1 -17 -12 -5 4 5 -5 -12 6 24 8 4 -7 2 18 23 8 -8 -10 13 26 11 -7 -3 18 29 13
2559A3j0j5J9OLk2qJ4%K9k4j4JK2jnk4%KK2J0k5LJJ0J1j0plJ5J1k0JlmJ3J3j9
$$ 13 3 -12 7 13 16 -6 -14 0 0 29 5 -9 -8 14 13 8 -16 -16 -14 8 18 -7 -4 -3 7 18 8 1 -2 13 24 4 5 2 -2 11 24 5
2597E%jJ7kj3j7JK2J1j4pJnK1jj8jOLqk4RJ7QRj1j4jJ1J2Kk0kRKPj0j0J4LK3j5
$$ 5 5 4 21 19 6 -11 -10 12 23 9 2 3 -2 19 18 0 -1 5 8 0 -24 -15 2 10 19 8 -6 -7 4 16 18 -2 -4 5 7 14 4 -6 8 11 34 19
2639A9j4mJ1Orj1qNJ5j2Jj1J8NKk1kKJRqj0QK0NrrqJ8Pmj4JOJJ7j2Kj1J3QNj4
$$ 19 5 1 12 18 9 -2 -10 -5 10 -2 -1 -12 6 11 13 -8 -10 -8 -7 2 -6 -16 -8 12 17 8 -1 -9 9 16 12 -2 -1 5 6 23 11 13 2 15 23 28 14
2682A4k3J5MjrqjJ4J1k3oJK5Lj8oj2PJ3Mjj8J1J2krOjJ3nnj1jJ9okRpPJ1j2j5
$$ 14 -9 6 10 9 0 -8 -9 5 16 -7 -13 -12 13 16 -2 -8 -20 -13 0 4 3 -15 -4 8 6 -3 3 2 15 10 5 -6 -7 12 6 4 13 6 13 24 12 -3
2724cJ3j3J3Jj3JqK3J0j5j3KoJ0OqqmJ6Pj3nPLJ9j1j2j0NJ1%nkkJ1Rj3jJJ0kn
$$ -3 10 -3 10 11 -2 -1 -9 14 24 9 -4 -2 -8 2 8 0 -8 -12 4 11 -2 -7 0 3 22 11 -1 -11 -6 5 5 0 -2 -4 7 16 3 2 3 13 11 6
2766FjmKQ%j2%J3Mj6Qj2JR%nmmKJ4mnLJJ0Jj3j9K4M%qKQlJ1j0lmJJ2Mj3oMNnn
$$ 6 5 1 3 11 11 -1 -1 12 16 0 8 -4 -3 6 6 1 -3 -7 -5 9 5 0 3 4 14 15 2 -17 7 11 11 3 5 13 10 21 11 8 4 5 17 21 8 2 6 11 6 1
2814Aj0R%J8j5pkJ5Kj2J3k0MOPo%lJ1q%kOOj0J3qmmJ2NqokNM%pJLJ0j0jl%LLr
$$ 1 -9 0 0 18 3 -4 -6 9 11 -1 12 -8 -4 2 9 3 3 0 11 3 3 1 7 13 3 16 8 4 0 12 17 9 3 1 6 10 10 3 4 7 17 7 6 3 3 6 9 0
2862@Kj6J2%jmJ0lJ4j1lmRJ0lrnRJ3Mj4kkMMkj2MJ0m%mKLlJ1k9J1MoPqoM%J0%
$$ 0 2 -14 -2 -2 -3 -7 3 0 14 3 0 -4 5 15 12 3 -2 7 20 24 10 8 6 10 14 12 0 4 14 10 10 6 8 11 8 19 -10 1 5 -1 6 -2 -8 -4 -4 6 6
2909FknqJ5KmnJJ5nLlNN%rjoLLoNpLKLj1J0oPOrj1%KQnj1ROMqJ6j0kJKkkRmkO
$$ 6 4 -1 -9 6 8 4 -1 0 15 10 13 10 15 20 20 11 10 4 7 10 4 9 2 5 7 10 -1 9 3 10 16 7 -4 -4 -2 6 1 -10 -1 5 9 1 17 7 5 6 8 6 4 13 9 7 13
2962A3mjJ2j1Qpn%qQPj2QLnkjNj8K1j0pjJJ0j%j1NJ0Oj3Qn%jLJj6J2OlOknJ3N
$$ 13 9 8 20 9 17 10 5 5 -3 5 12 0 8 11 6 4 3 8 -10 11 1 -6 -7 -6 4 3 3 -8 -3 7 13 0 8 3 3 2 5 6 -10 2 8 5 11 9 4 17 22
3009B2j6j2J0LPJj8NNJ3kj6LoPmpkkJ8kNj6PpK0j4kknJ5lokJ0MkKnkOQqj2KkP
$$ 22 6 -6 4 7 14 15 -3 2 7 20 18 2 5 -1 6 2 -5 -7 -9 9 7 12 -4 3 -4 16 2 0 -2 -7 8 5 -1 -3 7 11 9 11 6 4 10 18 10 -2 0 -2 5
3056EJjkoJ1qJ2k1J2KkJoJmM%jmNpJ4k%njNLqLLKJ0j6jQJMnmLPj1RmjOj1J1j3
$$ 5 6 5 3 -3 8 0 12 -9 3 5 3 4 -2 -1 -5 -1 -1 -2 -6 -1 -8 6 4 4 -1 -2 3 6 -2 1 4 6 16 0 -1 7 8 12 7 3 6 13 2 11 7 6 12 1 12 -1
3106aqJ6oKj1JPPm%jkPKOj4j2J1ROk2KJ2QLrPJ1j3jmpMOpJl%NNj3Kj3J2JKRj7
$$ -1 -9 7 1 3 -8 -7 0 7 3 3 2 0 7 9 15 1 -11 0 9 15 -7 -5 7 15 18 9 16 27 14 13 9 2 6 12 5 6 3 3 8 13 0 2 -11 1 2 4 13 -4
3154dRnMJj3QKlJ9pj1jJ3Njj2MkJ0q%kLpNOpJ4j4Nj9J1pJ0JpoQJjKr%J0Lj0j%
$$ -4 5 0 4 5 -8 0 2 -1 18 11 0 -1 12 17 16 4 8 6 16 8 8 6 9 2 7 13 6 20 6 11 -8 3 -4 6 7 0 -6 2 3 2 4 -5 -5 5 8 -2 -3 -3
3202c%JKnOloJ9Lj3%RJ0npj0QOlj5RKNLj0j0pNK0poj1RLJqPlJ1jrknORr%PQKk
$$ -3 -3 -2 0 -5 1 -2 -8 11 14 1 1 10 20 15 8 -2 6 12 9 -6 3 5 10 13 3 -7 -14 -9 11 4 -2 -13 -4 -1 0 -8 -1 -4 7 6 -3 -5 -10 -4 5 -4 -4 3 11 13 11
3253A1mpPjQojpMPOjrkQJj0mQlKj0rJ5LJqrQJ1nNj1jNrMMj1J2QjNj0lJ6oLnnr
$$ 11 7 0 7 6 14 8 7 0 4 11 17 16 7 5 13 14 4 0 8 5 7 -3 -12 3 6 7 -1 -10 -2 9 4 9 -2 -3 2 -7 -3 1 -10 2 10 9 14 4 1 17 11 14 9 4 -5
3304eK3m%kkjj2J5j5NkMkmL%nJPJKNrMrJ2kjn%NJ0Qkj3mkPNkj1LQLrpKNqKJlM
$$ -5 18 14 14 12 10 9 -3 12 -3 2 0 4 2 -2 1 1 -4 -3 4 5 7 12 3 7 -2 10 8 7 2 2 7 17 25 23 10 6 4 11 16 14 3 6 14 17 8 1 3 8 0 2 3 0 4
3357DJ0poJMOj5Qk4K3qlQMj2RK2j7OlkOoOqQKKj8%KLQkoj3MJ6oqMoJ1qNj2LkJ4
$$ 4 14 7 1 2 6 12 -3 5 -19 4 -4 -7 1 5 -7 2 24 7 13 10 8 14 8 14 6 14 16 18 0 0 2 5 13 11 5 -8 -4 12 6 -2 2 -4 7 -1 4 -8 -5 -7 7
3406GOj8lJ6KKqlnNMLoKnJ4KknMNpmLoJJmKkKj4J1j3J0j1J3jm%LOmKj1PjJJKK
$$ 7 13 -5 -8 8 10 12 4 1 -4 1 5 8 2 4 -1 13 15 13 8 12 17 10 6 9 3 4 5 1 3 1 3 -11 0 -13 -3 -14 -1 -2 -6 -6 -3 3 -1 1 -10 -3 -4 -3 -2 0 2
3457BJPjkj7J0J8j2mJkJ5KrqoJ0kj%MLj3%KLpJ2lkkmJ7j4k%kJ5jNj0j0JJ3pNJ
$$ 2 3 10 9 7 -10 0 18 6 2 3 1 16 18 9 1 -5 5 3 2 2 6 9 -4 -4 -2 1 -6 6 3 1 -1 -5 12 -2 -4 -4 -6 9 8 13 3 -7 -6 7 0 5 6
3504FLKNj5JOqK0jj8%mJ1rKonJ4lrOlJ0qJ6j3rJ5j2Ron%J1KnlJ3j2LJ0rQll%j
$$ 6 9 11 16 1 2 8 0 20 19 1 1 -3 8 -1 1 -5 -10 4 1 -8 -2 -5 5 -3 13 0 -9 6 -6 3 -3 -8 -8 3 5 0 -3 10 -2 1 11 2 10 7 4 4 3
3551CqJ8jj0OqKoJ4pjj0kJ8k2PjJ3mJlmPLkpOpJ6l%j0LJ%J0j0qJ3MLloMmJ1pJ
$$ 3 -5 13 12 2 8 0 2 -4 10 3 2 -8 -10 8 -14 -7 -8 5 1 2 -1 -5 2 5 3 -4 2 -5 11 8 8 -2 1 2 2 12 2 -6 7 11 14 11 5 9 5 16 9 10
3599A0j6K0mlrKk%Oj2kNRjmrK%J1ljkLLkKlNNkK%J%Poj1MnMQlj7J1%RKqj0Q%k
$$ 10 -6 14 10 7 -2 0 -2 -2 4 -8 -10 -5 4 3 -1 -10 -8 -8 3 0 -1 -3 0 3 1 3 0 5 10 8 10 10 11 11 18 12 1 5 0 4 12 9 -8 3 3 12 14 6 -4 4 4 2
3651BoLLj0MMj2J4LPj2%J1Lkkj2MJ4kpmJ0j0J6mj2MpPjjj2RoJ0n%j1J0lJ0oj4
$$ 2 -4 -1 2 -8 -4 0 -12 2 5 12 0 0 11 14 12 10 -2 2 16 14 7 3 13 3 19 15 3 7 0 7 6 5 -7 2 -4 6 1 1 -10 0 -3 7 1 -13
3695a3QKJ2j8J2j0J4Qjj5J2MnNj9pK0kJ2PqqPJj2j1MKQmj0OmJ6j2l%kKjOj6PQ
$$ -13 -5 -3 9 -9 3 -7 7 15 14 -1 11 15 10 15 -4 -11 9 7 19 26 18 10 17 18 6 -5 -1 1 9 5 -5 1 -3 13 1 -2 -2 -4 -2 -3 3 -13 -6 2
3739BLKj4%oJ8JjKJqKlkKNJ2j1lQK%%qNNkqJ0j9OJ0j3kQj6NJ0pKJPLj1kJmRKk
$$ 2 5 7 -7 -7 -13 5 6 5 7 8 0 2 -1 -3 -1 4 16 5 2 10 12 12 12 4 9 14 12 4 14 -5 1 11 -2 -4 4 -12 -7 3 -4 -2 -1 6 9 -2 -4 -3 -7 2 4 2
3789BnnJ2OJpJ%K1j1j7LOLnJ3j9JnK3rj2J1nKMj0j0lJ6NoklJ4Pj9jKJ1lmNpNo
$$ 2 -3 -8 4 10 11 4 5 5 26 15 -2 1 7 10 5 18 -1 0 -5 18 9 -3 8 3 5 9 -1 -11 -14 2 7 1 -1 -4 10 17 -2 -3 -1 10 7 3 8 1 6 0
3835@J1Pj3nJ0MroLJKJ1k2JKPQj0lmMNOk6OQ%PjqJ0j0LjrKPQjoORkMokJNnojR
$$ 0 11 18 5 0 10 14 5 -1 2 3 5 16 -6 -5 -3 4 12 2 -1 -5 -1 4 10 -16 -10 -2 -2 5 4 -4 6 -4 -1 -2 -11 -9 -2 6 5 -1 5 14 12 16 10 8 9 14 9 3 2 11
3887A1%Nk3jJ2Qkpj3%MQllj5J2J3KoKjOjLk2kJ0J5JmnMLLlj2J0j2J1KprQkJ7k1
$$ 11 11 16 -7 -8 4 12 10 3 -10 -10 -6 2 -1 -4 -19 -7 6 8 2 4 3 9 8 11 -11 -13 -3 12 13 9 4 8 11 14 11 -1 9 -3 8 10 3 -6 2 0 17 -4
3933dKmJ1%lk6J3J3jljKKJ0mj4J2pJKpKqK2j3RpLLQLj7mJ0PnqpKJ4Qj8Oj2J2K
$$ -4 -2 -6 5 5 2 -24 -11 2 1 -2 -3 -1 1 11 7 -7 5 -2 -1 1 -6 -4 -12 10 -3 6 -1 2 5 13 16 -1 -5 5 12 7 -1 -8 -6 8 16 -2 4 -8 4 6
3979FlpkmRqJ5j3KJ0ljljjmJ8qj1K4Ppj4NjJ2rKmKJ0prmLmJ2jnJ%lNj4nJ6mjJ0
$$ 6 3 -4 -6 -10 -1 -9 6 -7 -5 5 2 1 -2 -3 -4 -8 10 2 -9 15 22 15 1 6 5 17 8 10 6 8 18 11 2 -2 1 -3 9 8 3 4 4 1 6 -8 -13 3 -1 -2 8
4028HomPNpj8kJ4J6plKNPJrLnlRkknKJ0pnkJLnqmjJ1LMj1%KJ2j1qMLPOpknQNo
$$ 8 2 -2 5 10 3 -15 -17 -3 13 6 3 5 10 17 18 9 12 7 4 13 11 9 4 6 16 9 4 2 3 6 1 -7 -11 -12 -1 2 6 -5 -5 -3 9 -2 -10 -6 -3 4 10 3 1 -4 4 9 3
4081CjJj5J5NpoJK0mjj9J1KJ1j4jLlK%kqRNqqjkJ4j%pMRJmrMKJ5rlN%kLOj7jL
$$ 3 2 3 -12 3 8 1 -5 -4 16 12 11 -8 3 5 16 2 1 4 1 3 3 1 -7 2 7 -1 -9 -10 -12 2 1 1 -6 -2 7 8 4 -5 -1 1 16 7 4 9 9 7 10 16 -1 -2 1
4132AJ0Rj5PKmMj5kJ1Lmj0lLQkjpPjPmp%qR%JKlJ9rlj1jJ7kJj0lK1Plpj6kJ4O
$$ 1 11 20 5 12 14 10 14 -1 -3 8 11 7 -3 -6 -3 5 3 2 -5 2 1 8 4 -3 -3 -11 -2 -2 -1 1 -2 17 8 5 -6 -7 10 8 9 -1 -4 17 24 21 14 -2 -4 10 16
4181A6j4rkORMj7%J2pNlj6RJ5prLMJ1qRj4PpJ7%j8K0k2J1jKqMJ3knpKj0J9j7Q
$$ 16 2 -7 -9 -3 6 10 -7 -7 5 -2 3 0 -16 -7 8 1 -8 -5 -1 10 2 11 -3 4 -3 14 14 -4 16 -6 5 4 6 -2 2 15 13 8 1 3 -7 12 -5 3
4225Cj7KJ7Knj0J3j1PqJkRKNk0J3oQQj5%oJ4QnnkONmpOnPJk0J5jjMj8QNlNpkN
$$ 3 -14 -12 5 7 2 -8 5 -6 1 -7 -6 -8 1 3 8 -12 1 -5 3 11 -4 -4 -10 4 12 7 2 0 6 11 7 0 6 1 8 9 -11 4 3 2 6 -12 -4 1 -2 3 -4 -6 -1
4274amQjpj4J2K2j6%RJmPj1J1k1NQM%rlJ8llj5KJ2ljj6NJ6pPqloJ0oPj0lJ0Kp
$$ -1 -5 3 2 -5 -19 -7 15 -1 -1 8 9 5 12 1 12 -9 -4 4 8 8 -1 -4 14 11 8 -7 -5 7 4 3 -13 -8 8 1 8 0 -3 -9 1 -5 2 -8 -11 -1 1 -6
4320foQ%LJj0NmJ3Nj1rQJ3Joj4QJ5m%llMNj6kmQJ5kpj9J3nLPj8kRmONj0%J7k%
$$ -6 -12 -4 -4 -1 0 -10 -5 -9 4 9 -2 -11 -3 10 11 5 -9 -1 14 10 10 7 4 8 13 -3 -5 -9 -1 14 12 5 -14 -1 -6 -3 4 -14 -16 -7 -11 -5 0 -10 -10 7 5 5
4368EoLjNMj1lJ6lkJj5J2Rmj1mJ0mQk1mLJ2QrolPJ6j2j5J4qJ4J2k0nPJ2oJqLM
$$ 5 -1 2 1 6 10 -1 -4 12 9 7 8 -7 5 14 10 -1 -5 5 1 9 -12 -16 -13 -1 7 -2 -8 -11 -4 12 0 -15 -1 -9 5 17 -3 -8 -1 11 5 6 -2 1 5
4413EOnj2J1mLMMlpOpjqKRj2J0nqLJ5%lj2J%Kj0NjRkjJ1j3PJ0j0Okj4J9kj0JR
$$ 5 11 6 -6 5 1 4 8 12 9 2 8 1 0 -8 -6 3 -9 1 -4 -12 -9 6 6 3 -9 -8 -8 -6 -16 -11 -12 -3 -5 -6 5 -8 -1 9 -1 5 3 -11 8 6 -4 -3 6
4460FoJ1rmLj0QJ5j7loROkj0LRj3Qj3OLmjKRpJNnj2K2qRp%kLJ2kKj3QJ0jj0lJ
$$ 6 0 11 2 -2 1 -9 -1 14 -3 -6 -12 -3 3 1 -9 -6 3 -10 -2 -15 -9 -6 -10 -11 -9 0 -7 -6 -1 -6 -18 4 -4 5 -2 -2 -4 -1 11 9 11 -2 6 16 15 5 2 3
4508CJpJ1qMokJ0jj6pROp%LLLLj5J0kNQqj1J6NpnJLLkJ1j4KNmNoMjMpPqlLJ0j7
$$ 3 4 -3 8 0 4 -2 -4 6 5 -11 -18 -9 -3 -10 -10 -7 -4 -1 2 -13 -3 -5 0 8 0 -11 5 10 3 -2 -1 2 5 3 14 0 2 7 3 8 2 6 5 9 2 9 1 -2 1 11 -6
4559fj0J0lQkpmJ1KNjj6J4j0RlkjJ0J1%j0oKJ1jj1kNNoJ0k0J2pJ2norRNmnnLk
$$ -6 -16 -6 -9 -1 -3 -10 -14 -3 -1 4 3 -13 1 -9 0 -3 -5 -6 4 15 15 5 -1 1 12 11 0 -2 3 8 2 12 -8 4 -3 9 4 -2 -11 -2 3 -1 -6 -11 -8 -10
4605a0J2j3J3rQM%p%KJqjPl%J3lpKLLJrPqLNj0nNJ3Lj1j2PPMj4j1J9lj0PnJ0q
$$ -10 2 -11 2 -7 1 5 5 -2 -2 0 1 -7 -8 -1 -4 -4 9 6 -1 1 4 7 8 -1 6 -2 1 6 -4 -9 -4 9 12 1 -11 -4 3 7 -7 -18 1 -2 -12 -5 -10 0 -8
4652hQjj6J2J3j8J2j2MRMJJ0j9%J1Mmmn%mJ2ollJ1%mj4jPOqrPPlJ1qoLLJOrLJ
$$ -8 0 -1 -17 -5 8 -10 2 -10 -6 3 7 8 18 -1 -1 10 14 10 6 1 1 -3 9 3 0 -3 8 8 4 -10 -11 -4 2 -6 -15 -8 -1 -4 7 -1 -7 -4 -1 0 6 -3 0 1
4700AJ5j1Oj0Qm%nNj2J3jJ2j1nJ2pJj4J3LKj5Rj5J0PnppQ%J0j5QoRMj0oLJJ0J4
$$ 1 16 5 11 1 9 5 5 0 5 -7 6 5 17 6 1 13 6 7 -7 6 9 11 -4 5 -10 0 7 2 -5 -12 -4 -4 6 -9 -1 -7 2 6 -4 -10 -7 -6 4 18
4744A8k3KMOkjmjJ5nKj1J0qQLj6kJ3j9RrLlJ5lmj2J4%PLj2kQoJ3j3LQJn%lPjk
$$ 18 -5 -3 1 7 5 4 0 -1 14 9 11 0 10 2 10 13 -3 -5 8 -11 -2 -11 -8 -11 4 1 -3 -15 -1 -1 6 9 -3 -5 3 -3 10 -3 0 8 9 4 4 1 8 7 5
4791EJ1oppNNPj2J3mrJ1Lj2%okpOJ0j1J2qrJJMpJ0oJ1nOnlnJ7qLpJJ1rJ0pJQj
$$ 5 16 10 3 -4 1 6 13 1 14 10 1 12 15 3 3 -3 -5 -12 -6 4 -7 5 -3 -12 -11 -10 -6 -13 -3 -9 2 -3 3 -2 -5 -10 7 -1 2 -5 -4 7 -2 8 1 2 10 9
4839IkpjKRj3%klLRkj4QJ2qKmoR%onJ3nNpLOkQnRj1M%oJ5j1qLNLj2mMPKj6OmM
$$ 9 7 0 -1 1 10 -3 -3 -5 -8 -5 4 2 -12 -4 8 0 2 -2 -8 1 1 -5 -10 3 -2 3 -4 -1 5 3 11 6 15 4 8 8 2 17 6 -2 1 6 9 -3 -7 -3 4 6 -10 -4 -8 -4
4891dNj1J2KOk2J7kk1J2MJJLj4J4kQrJLoRLj4Pj2J3PqKpJ7j6QqKJqMlKMKmj8J4
$$ -4 1 -10 2 4 10 -12 5 3 -18 -6 -2 -1 0 3 -11 3 1 9 0 1 4 -2 7 10 -4 3 -9 4 11 3 5 -2 15 -1 7 -1 1 2 -6 -2 -5 -3 1 3 -1 -19 -5
4938eOq%MjLlPqNLlPj6J8qKJ0moJMJorJ0qJ5lj1PlLrOJj2RmNj2JKjKRnmMLPnO
$$ -5 1 -7 -7 -3 -4 -1 -4 3 -5 0 3 0 7 -9 9 1 3 13 9 3 4 8 9 3 -6 4 -4 11 8 -3 4 1 4 -5 1 2 -10 -1 -5 0 -12 -11 -9 -10 -8 1 -4 -8 -4 -1 6 1 7
4991G%LMj2kLNMj2NKkJPj6J2qLloKlMKmj2J2Rp%mJPpnJ6rlJ2%J1njkj1POpMkl
$$ 7 7 10 14 2 0 3 8 12 0 5 7 5 6 13 -3 9 1 4 1 -5 -3 -6 -2 0 -4 -16 -4 5 -2 -2 -6 -5 2 -5 -10 6 -3 -6 6 6 17 12 11 9 -2 5 11 4 8 6 3
5042CJ1pMOj0m%jOojrJ1qN%kpKOlkpJ1j0J6j5RmOmLJ0rRK%j4PNjkrMOpPlmMj0
$$ 3 14 7 11 17 7 3 3 2 8 2 1 -8 3 -5 0 0 -2 -9 -7 -1 -4 -6 -13 -2 -12 4 -11 -2 -6 0 -4 -1 9 0 9 11 11 -3 4 9 8 6 -3 1 7 0 7 4 0 4 -6
5093flJ1rJQQj2j1QjN%qnNPOj2J0lnJ7rjKNN%lj0J0LoJlMlPj4lL%POj9QrJ2ml
$$ -6 -9 2 -7 -6 2 10 -2 -13 -5 -6 -1 -1 -9 -14 -9 -2 4 -8 2 -1 -6 11 2 1 3 8 13 13 10 0 10 13 7 8 5 9 6 13 -1 -4 -1 -1 6 12 -7 1 -8 4 0 -3
5143ckj0J5NqlP%mPomQPnLrRJmllRJ0j3JLj2J5ml%nkpMPoOJjpmnMRqKKJRrRpO
$$ -3 -5 -15 0 5 -3 -6 1 1 -3 4 -2 -6 2 9 4 7 -2 7 8 4 1 -2 7 17 4 5 8 -4 11 7 4 4 -1 -3 -10 -6 1 -5 1 2 1 -6 -10 -15 -11 -2 -10 -8 -6 -5 4 -5 4 -3 3
5198CmRnMlLoLRj4J7j2RrRJj7PjoRoLJmMLqJj3NJJ1nNrMKQmj0QoJ8k%j2KkJ9p
$$ 3 -1 8 3 7 4 7 1 4 13 -1 16 4 13 4 13 14 -3 4 3 -3 6 0 3 4 0 4 7 -1 0 -13 -8 -7 4 -1 4 -5 -1 1 9 5 -5 3 -3 15 13 13 1 3 1 20 13
5249A3olmJ1KnrLkLOLj6Oj5J6j0kNKJmpJNJNJ0j5mK0j4J5j9K5k2J0jjJ3pNjrL
$$ 13 7 4 0 11 13 8 -1 2 0 3 9 12 -4 2 -13 3 -7 -9 -4 -2 -1 -5 -12 -11 -6 -5 0 10 -5 -9 11 -3 12 -7 18 -4 6 5 4 17 10 15 14 5 8
5294HJmKj5OOLKpKj0NJ2k4J1JLlnNjMj0J1nMOKj7lRJOKolKPj0%KnJ8qQrpJjop
$$ 8 9 5 7 -8 -2 4 7 9 2 4 -6 -1 11 -13 -2 -1 2 -1 -6 -1 -2 2 -8 3 -2 2 8 10 -7 -10 -1 0 6 8 2 -1 1 8 -2 -2 0 -5 13 5 13 4 -3 -2 -3 -9 -16
5345a6J5%oJ5rj0OPqKljJOJj3J6pRoK%j4J4QoKM%J1j8ljO%Oj0%KJKj5lJ1Mlkl
$$ -16 -1 -1 -7 8 -1 -11 -5 2 -6 -4 -7 -8 -7 -1 0 -13 3 -4 5 -1 1 1 -13 1 9 3 5 9 9 20 2 -1 -2 4 4 10 0 0 2 3 5 -10 -13 -2 2 -1 -3 -6
5393fPj0MQj2J5pkLMo%R%nO%pJ2rnPj1J1oRMj4NQmj0LKL%j6lJ0JRj6nQQNj3oK
$$ -6 1 -9 -5 3 -9 6 -1 -3 0 4 -2 -2 7 7 2 8 8 1 13 4 -1 6 -5 6 0 9 13 -1 4 12 8 -2 1 3 6 6 -10 -13 -3 -2 7 -9 -14 -6 2 7 -6 -12 -10
5442a0%J5j4J0Nj5J0LkJ0qM%oLmJ0m%%lJ7j3nLjOj6OlmMoJ2lrOkLNp%OJJlnM%
$$ -10 -10 5 -9 1 6 -9 1 4 2 12 4 8 8 2 5 1 11 7 7 7 4 21 8 3 6 5 11 -5 1 -2 -6 -2 -8 4 1 -8 -2 -4 -1 4 -3 -3 3 4 5 2 -3 1 1
5491AJ0jjpLQ%orjJ3j%j0NqJ0Jj5OkJ1qmklQmQj0J3Pj4KMjqJ6qKkKjNJ1j1J1n
$$ 1 11 10 9 2 5 13 13 7 -2 -3 10 9 9 -1 4 -4 6 7 -8 -2 -4 7 -1 -5 -7 -10 -2 -6 2 -8 5 12 -2 0 4 3 -5 11 3 5 3 5 4 9 20 9 20 15
5539A5Jj3JMJMKpj0J7p%p%MkNj5KMOk%klPNjj1LKLLqNmMNkmMpJ0kjrjQnojjOJ
$$ 15 16 3 4 8 9 13 15 8 -2 15 8 8 1 1 5 3 8 -7 -5 -1 5 3 3 1 -2 5 10 9 -2 1 3 6 9 1 6 2 6 11 9 5 9 2 12 10 9 0 -1 7 2 -4 -5 -6 0 1
5593Aj4LKJ3klrlJ3lJ%qKQNjnKjJ1lm%K0oj6KLl%RpjpOjMmn%Nlkjm%JmkN%kJP
$$ 1 -13 -10 -8 5 3 0 -9 -12 1 -2 -1 -1 -9 -7 1 6 5 0 2 1 12 9 5 5 25 19 3 5 8 5 5 14 7 6 -1 5 4 8 4 -1 -1 4 1 -1 -2 -6 -6 -5 -9 -11 -6 -6 -8 -7 0
5648@OMLj6jJ4oMjLj7OLkPj2J5j0J1%rO%KoKom%oOpJJ5rJ%%oKJ2ojJkKMJkL%m
$$ 0 6 10 13 -3 -4 10 4 8 7 10 -7 -1 2 0 7 -5 10 0 11 11 2 8 8 10 4 6 0 -4 -4 -10 -4 -11 -10 5 -4 -3 -3 -3 -9 -7 5 -1 -2 -1 -3 -1 3 4 2 5 5 1
5700AjmRkkNmJ0nRk0QklNrnlRJ1jklj0KKmKmKPJ0j6J1j0KJ0lJj1J8Mj1qJ6%Mj5
$$ 1 0 -4 5 3 1 6 2 12 7 16 -4 4 2 -1 4 -5 -10 -13 -4 7 6 4 1 -9 -7 -5 -9 -7 -11 -9 -2 8 -8 3 -7 -5 5 2 3 -8 10 14 3 -5 11 11 15 0
5748@mLnJ8oj3QlKpnJ0pP%NnoJKNjnjPlJ4j0lPOk0J2jMJjMj4NklPKLQKj3j1Rj4
$$ 0 -4 -1 -6 12 6 -7 1 -2 0 -7 -12 -2 -9 -2 -2 3 -2 -8 -7 -5 0 -1 -6 -7 0 -3 11 1 -2 5 11 -9 3 2 6 7 6 10 -4 1 -1 -4 3 5 8 16 18 5 -6 3 -11
5799a1J1lkmJ4nQj4MkMJqkLPM%j3NJ0%Kj1jQLJlLrPMj2J0lKokjojJ9j2%jj3Rq
$$ -11 0 -3 -5 -9 5 0 8 -6 -2 -4 0 1 -7 -9 -6 1 5 5 -8 -3 7 7 9 -2 -3 5 8 9 6 9 0 7 11 -1 9 6 8 2 0 -1 -7 -8 11 -1 -1 -2 -15 -6 -14
5848a4J3m%MjPLmjQn%npRJ%Oj2LkJ0mmQmKqOLk2RjlLJ2j0J0j5Oj5RRj2LJ5rjj
$$ -14 -1 -5 -5 -1 -2 5 8 4 3 11 6 6 1 -6 3 4 4 10 -2 1 -1 9 5 1 9 5 7 -1 5 8 -14 -5 -6 -9 -6 6 -4 6 -9 -3 -18 -9 0 -12 -9 6 -3 -4 -5
5897eNLJok%OmkM%pNJ6j9RRo%Nj0Kj0J3pkNmkJ2rKnmPkmKRj2PPj1OlLQj0RqKk
$$ -5 0 3 4 -2 -4 -4 2 -2 -4 0 0 -7 -2 14 -5 4 13 7 7 12 2 4 -6 7 0 -2 3 -1 -3 9 0 2 -3 -7 0 -2 -6 -4 5 -7 0 7 -4 2 -1 2 10 0 9 1 3 1
5949A%KJ%J1rmNRk0NJmJ1jj7QkLoKknJJ0mj1J6p%nQj0J6pJOJmPLqPolRjqKKj0
$$ 1 1 3 4 4 15 6 2 7 16 -4 1 2 -2 9 8 -9 -1 -3 0 -6 -4 -6 -11 -10 0 -4 -15 1 -6 -6 -11 -3 -13 3 -4 -3 3 4 0 7 10 2 9 3 0 9 8 0 2 4 -6
6000fJ8%pqmQ%rK0j3Mj0O%j3PJNj5JOOPKrnJ1JJmJ4pmkOjpQj2J7k5J0N%J2j6P
$$ -6 12 12 5 -3 -7 1 1 -8 12 -1 3 -7 -1 -1 -14 -7 -6 -1 -16 -15 -9 -3 4 6 -3 -8 3 4 5 1 15 8 4 2 8 7 0 8 -4 13 -12 -2 3 3 15 -1 6
6047Fj2J1lM%j1QLjj1mNPnJ3j4MLnjLJKOkrJ8rkJ3mj1MkJ0qJ2Lk0LkJLoOjj4P
$$ 6 -6 5 2 6 6 -5 3 6 5 -6 -10 -5 2 -3 10 -4 0 3 -2 -3 0 1 3 9 7 -2 16 7 5 18 14 3 7 5 15 7 19 22 2 5 3 4 7 1 7 6 -8 -1
6095ajmKkQLlJloOPll%KKqJ7m%lkkMln%J0j7J8j0QpQlmpKjlOj1J3j2J7mnLOj0
$$ -1 -2 -6 -4 -6 2 5 2 3 0 -6 0 7 4 1 1 3 5 -3 14 10 10 7 5 3 7 4 -1 -1 9 -8 10 0 8 1 9 6 2 -5 -3 -4 -7 -1 -12 1 -11 6 2 -3 0 6 -4
6146dMoNQlJqK0j0RmjljoJ1%oNjj3ONjmkJrOkRqnlJJ0j5NpNK2kj5LJNKjlNmOM
$$ -4 0 -6 -1 7 4 5 -3 17 7 16 12 11 8 7 1 12 12 6 11 10 -3 3 8 7 3 1 2 -7 -1 -3 6 -2 -7 -10 -9 1 -14 -9 -16 -11 11 9 -6 -3 -2 3 5 4 1 6 2 8 12
6199A2nmMJnNOpMJ0j7MqmRNj2pNN%%pJ1qQlkJ1j6J0klLjjQ%j2LKPJNlj0OOnj3
$$ 12 7 3 7 8 3 8 14 7 11 21 4 8 0 -4 5 10 -2 -9 -4 1 1 1 -6 5 -3 5 2 0 11 -5 5 3 0 3 2 1 9 9 -3 0 2 9 10 15 12 2 8 14 9 -4
6249dJ5lnMj3L%MQj5lN%LjnJ0pJ5qj3J6Pj0kRmMJ2j3lPj0N%%qQMmNPj8J5rJ2j7
$$ -4 11 8 3 7 -6 -3 -3 1 9 -6 -9 -4 -4 -1 -2 -7 3 -4 11 3 -10 6 13 3 1 10 6 10 22 9 6 13 3 8 8 8 0 8 12 8 13 20 2 17 8 20 3
6296CoLRjJrlrK0nj0O%l%OQqQKj1MOOmOpPj9J8j2MrJ2j0QpJOolNnlnMjNkqJ5q
$$ 3 -3 0 9 8 9 0 -3 -12 8 3 -7 -1 -1 -4 -4 2 10 2 10 12 1 5 11 17 13 19 12 19 0 18 6 10 1 13 3 11 4 5 11 5 2 7 2 -1 -6 -2 -3 2 0 -8 7 -1
6348alRj2OOj%qkJ7mloJ2%nJOmkOj0RoOloO%Nj0MrLLkMj1kNjlOj6K1qQnoQQj5
$$ -1 -4 5 -7 -1 5 4 4 -4 -6 11 7 4 -2 10 10 5 6 12 8 6 12 2 11 5 11 8 2 8 8 13 3 7 -2 1 4 2 6 -5 -7 -2 -3 -6 0 -16 5 -3 5 0 -6 2 10 -5
6400eJ6qQ%MLmkqLJ4j0JolRj3J7j0KlRj0kn%MkKnQrmPQoOQj2lJ2j3JJ6llj%ML
$$ -5 11 3 11 11 15 18 14 12 4 7 21 11 12 6 3 12 -1 16 6 8 5 14 4 2 -3 -3 1 -1 1 -4 4 -5 -9 -2 6 0 6 14 2 -1 11 -2 -1 15 12 9 8 8 12 15
6450A5NoKqoJJjmJ3q%nJ3j2Pj5R%j3OMNj4J4kKllJrRJ0mPrjNMmMnLojQJj3J2j1
$$ 15 20 14 16 8 2 3 4 3 -1 12 4 4 -1 12 0 7 -8 1 1 -12 -6 -2 3 -11 3 1 3 0 -3 -2 -11 -2 8 4 11 2 1 6 10 6 10 5 8 2 1 9 10 -3 9 -2
6500bJ5rj0LkRMqnJJ0j0Nlj6K4qlj2J5Nj4J1OjNoNojQl%LlMpRlokRoj1MpJ9j4
$$ -2 13 4 -6 -3 -5 4 8 0 -5 -4 6 -4 1 -2 -18 6 -2 -5 -17 -2 3 -11 0 6 5 10 4 9 3 2 10 7 7 10 7 11 4 13 10 4 2 11 5 -6 -2 -9 10 -4
6548dJJ1j6mJ0KKmkkJ1qJ3j7Q%J1j4J2pKjLlMMkQj8LLnJ9pj1rLNjJ%lPnkLj0M
$$ -4 -3 8 -8 -12 -2 0 2 -2 -4 -6 5 -3 10 -7 1 1 12 -2 10 3 5 4 7 4 8 12 10 18 0 3 6 1 20 13 2 -7 -4 1 0 1 1 -2 5 0 -2 1 -9 -5
6596eJ4qkQqkKOMj1PJLmm%J1j5JJQjjMrKkkJ1jj4%kMOj0RmlnLOkjnJ5lk%Nj1P
$$ -5 9 1 -1 7 -1 -3 -1 5 9 -2 5 6 9 5 1 1 12 -3 -2 -1 7 6 5 9 0 2 0 -2 9 8 -6 -6 -8 -4 2 -8 1 -3 -6 -11 -8 -2 -4 -5 -10 5 2 0 0 5 -6 1
6648ALjKmLQJll%PrKLmkmJ2p%kjJ0j4L%MqKMjOnj%mJnJ0lM%oJ1mPoPpQk1J8J0
$$ 1 4 3 5 1 4 12 13 10 7 7 14 5 7 10 6 4 0 12 5 5 3 2 12 -2 1 1 5 -3 -1 3 2 8 3 2 2 -2 -1 -6 4 1 5 5 -1 10 6 13 7 14 7 15 -6 12 22
6701B2o%j7JRoRJ3k1QmJkmjpRkjkj0J6ojMNlQpNn%MLnKj3J7%kJ1j4klJ7j3lkQ
$$ 22 16 16 -1 0 9 3 12 25 4 12 8 9 7 3 2 -5 4 2 1 -1 -11 5 -1 -2 2 7 4 12 5 10 5 5 9 12 7 9 -4 13 13 11 22 8 6 3 20 7 4 2 10
6750A0KJqJmRj5J4j1pJ0o%JRj6J2pLqJ0OJ1j0lJ0k%Jj3MLOqLllPlkRjkMq%j0O
$$ 10 12 13 5 6 2 11 -4 10 -1 -8 2 -4 -4 -3 6 -10 2 -5 -2 -10 0 6 17 7 4 14 12 12 13 0 4 7 13 5 8 5 2 9 6 4 13 12 10 14 6 6 -4 2
6798BK%qNp%J2jj%j5QPnNKj%Kkj0J1mLMKlJ1j1oKJ%Pj1MpLkRj0NllkjkJ2KmLj0
$$ 2 4 4 -4 1 -6 -6 6 5 4 4 -11 -3 4 -1 4 6 5 5 7 5 -5 6 2 5 9 11 8 19 8 2 4 5 5 12 1 5 -2 1 -1 8 -2 3 0 -3 -5 -6 -8 4 6 2 5 -5
6850eOoRlRkj1PQj6J5n%NmLJ%knJ1j1J1Oj0qLjj%o%nPLmnMjmNLkMklNNmLlPj1
$$ -5 1 -5 4 1 10 8 -3 4 12 -4 11 6 6 11 7 10 11 11 9 4 15 4 15 21 11 3 6 5 4 4 -2 -2 -7 0 3 -1 -6 -2 -3 -7 -2 1 -1 3 1 -2 3 8 4 7 4 11 0
6903@MJmJ3j1%%kNllJ2Jj0%kJ1knj1PPJj0J1j6MJ8qoqLRPlkOmkKjKJqkRpJJ0j1
$$ 0 4 5 1 14 3 3 3 1 6 3 0 12 13 3 3 1 12 10 5 -6 1 8 9 -1 10 -6 -2 16 8 2 -6 -3 6 13 10 8 14 10 8 10 9 11 12 4 2 11 4 5 15 4
6953DOqONqOppJ2j8J2NjqkJ1qLqNmQn%PoQpjQJ%nPmJ7k1QMklJpJ0nqR%j1MPj3
$$ 4 10 2 8 13 5 11 4 -3 9 -9 3 8 7 -1 -3 8 0 3 -5 0 -4 4 -1 -1 6 0 8 1 0 8 9 9 4 11 7 24 3 11 15 13 10 11 4 14 9 1 10 10 -1 3 10 -3
7005cNjQj2LKm%nRMNj3MjMMlMrJ1j0J2qJ1Mj0J0j1mQpRj2MkKjRj8OKqOJ0k0oQ
$$ -3 2 1 9 -3 0 2 -2 -2 -7 2 6 11 -2 2 1 5 9 6 10 1 12 2 14 6 17 21 11 21 10 6 14 7 16 4 8 6 8 7 16 -2 4 6 -2 4 14 -6 -12 -4
7053dOMmKlMjJ2j3KLoJ2%JNqlmMNj4J6qLmkrJJQJ%j1%jNj0OMpLjOmKnJ3j1J1o
$$ -4 2 6 2 4 1 5 4 16 3 5 8 2 14 14 15 20 12 9 5 9 14 0 16 8 11 7 5 -4 -3 -2 6 7 7 -4 -4 -5 0 -10 -4 0 -7 -4 -5 1 -3 -1 -6 7 -4 7 1
7104ANnQLj1mkJ1PkqJ0j0KNrLjj0lJ7j3J0oJppOQojQrLKjkLoRPj0LJ%%QmNj0%
$$ 1 6 1 9 12 1 -3 -5 6 13 11 3 13 3 5 10 1 4 3 -7 -10 7 -6 4 -2 -1 -8 -15 -9 -1 -7 -8 0 -9 -6 -4 -5 -7 -4 -10 -1 6 -4 -1 0 0 0 8 4 9 -1 -1
7155aJ0JnjJMNj6KLLpLKnkKRnlnMJmK%mKJ0Oj7oK0oJOj6J4Lj6K0j3NNpkJ0j3J0
$$ -1 9 10 5 4 5 9 14 -2 0 3 6 -1 2 4 -1 -3 -1 8 3 0 -5 -1 0 -4 -2 -2 -6 -4 6 12 -5 -11 9 3 4 10 -6 8 11 -5 15 2 7 12 5 3 13 0 10
7204A0rmNKoMmNmKlLJj%lPrnRMqLj5K1ljJ4nPj4KNPqJpKJ6j9QlRj2LmNj2NRnj
$$ 10 1 -3 2 4 -2 2 -2 3 -1 1 -2 1 2 1 1 -2 5 -4 -9 0 4 -4 -1 -16 5 2 1 15 10 17 3 5 10 17 9 10 3 5 21 2 10 7 16 4 7 3 8 -4 1 10 5 4
7256DJpQnlJ4k0RQooNPkkJqJ4%nokJ4Nj0j2lJ5J%kjKkplR%Lj1%MkoRoJNRpmJp
$$ 4 5 -2 6 1 -2 12 -8 1 9 3 -3 2 9 7 5 6 -2 12 12 7 1 -1 13 18 8 -4 -7 8 9 9 7 6 8 6 -1 -4 5 5 8 -3 -3 1 -1 -7 2 -4 -3 2 11 4 0 1 -6
7309fOlJ3kK%KoLN%%jmLmrQJj2J2Jj1J1mkLMoj0mPrJ0Lj0Rm%kJ1MoPJo%Rnj2J6
$$ -6 0 -3 10 8 10 10 12 6 9 14 14 14 13 9 12 8 -1 7 8 -4 8 9 -2 9 5 3 6 10 4 -6 -10 -3 -12 -2 1 -9 0 -4 -4 -6 5 9 3 10 11 5 5 14 9 -3 13
7360A3%%lJ%j0J0pkJ0j2pJ2lj%Kj1LOkKoOrJ8o%k%qJ5j0QpJ5j0KkmJ1mNmqLJ1
$$ 13 13 13 10 11 11 1 11 4 2 12 0 -7 5 2 1 1 3 -8 -5 1 -1 1 -5 1 -8 10 4 4 2 2 -6 9 -1 7 0 15 5 7 5 1 12 8 13 9 1 4 15
7407A5j0jQj8J0J1j5KMkmlQpLpLQqmJPJ1k3J7m%JoJ4j4J6%jj2RkJKj0J7j1J0j3
$$ 15 5 4 12 -6 4 15 0 2 6 4 0 -3 5 -2 1 -6 -3 5 -3 -7 -6 1 12 -11 6 2 2 3 -3 11 -3 13 13 12 0 9 7 8 10 0 17 6 16 3
7451CLnjPNrPj4KPllMmkLJKKrnPKKJjMkJpJ3j0J3rMMJ%oLqJNj3J4lqJ%lmOLno
$$ 3 6 1 0 7 12 3 10 -4 -2 5 2 -1 3 -1 -3 0 1 3 5 -4 -9 -2 0 2 3 2 6 4 5 -2 11 1 14 5 9 13 14 14 8 11 3 4 9 -4 10 7 -1 0 0 -3 -7 -1 2 -3 -9
7506iJ8j5MOKqJOj0J6rJ7nomQRj4k%NJ1nj0Mkj0KPlKnj1J3j2QQq%J0roJ3JjKj3
$$ -9 9 -6 -2 4 6 -2 -1 5 -5 11 2 19 14 8 4 12 21 7 5 5 10 21 16 6 10 8 -2 0 7 4 6 1 -10 3 -9 -1 7 -1 -1 9 0 -6 7 8 7 9 -4
7553dLmJJ5j1J0j2J4%Pj4QrKPJkkLmjKOj5M%mjNqK%%mPMJj4K1j4RJj1QpK%JRo
$$ -4 -1 -5 -4 11 0 10 -2 12 12 19 5 13 4 6 13 14 12 10 13 9 8 10 16 1 5 5 1 0 5 -3 -1 -1 -1 -5 2 6 7 -7 14 0 9 10 -1 7 0 2 2 3 12 6
7603FPqMkkJ6j6JPlJlPj1Pkj1J2Pj6NpN%nKlJJJKPj5QkMl%kQMKKqrJ3NpJ3mpq
$$ 6 13 5 9 7 5 21 5 6 13 10 11 8 15 4 11 9 -2 10 17 1 6 -1 4 4 -1 1 -2 -1 0 1 3 10 -5 3 1 5 2 2 0 8 12 14 16 8 -1 12 17 10 23 19 12 4
7655DQJlMlj0MmpJ9olPlj3Pj2J2lNj0J2jJnJ1j0jjkRnNNNqNKJJrOmLkqLjnoQQ
$$ 4 12 13 10 14 11 1 5 1 -6 13 7 4 11 8 -5 2 -10 2 -1 4 -6 6 5 6 1 12 2 1 0 -2 7 2 7 12 17 9 14 16 17 18 9 15 11 14 12 4 7 6 1 -5 3 11
7707A1lrJ4qjoLlJLNj4NLNJ0k0J5j4J2j0J6j7LNKkRpl%OpkQJjmjLPj1MKqJJ0k2
$$ 11 8 -1 13 5 4 -2 1 -2 -1 2 7 -7 -2 1 6 16 -4 11 -3 9 -1 15 -2 1 6 8 6 15 8 5 5 11 4 2 10 11 10 6 5 8 15 4 8 10 2 3 13 -9
7755iRKj1QOKjQqoOJMj0OqJ5l%k%J1j7J1pk%NLj5J2Jj2J0nkjMj%Oj2M%pJPRpl
$$ -9 0 2 -9 -1 5 7 6 14 6 0 6 7 11 1 7 -1 14 11 11 9 9 20 3 14 7 5 5 10 13 -2 10 11 -1 9 4 2 1 5 4 4 10 -2 2 2 -5 -4 3 12 5 2
7805BmOJMKqMqMRjkRmkkmmJ2jnmJmPljnljJ5nNoljjKKNj3PJ5rLNojmKQnmJPLj
$$ 2 -2 4 5 9 11 3 7 -1 3 12 11 9 18 14 12 10 6 2 14 13 8 4 5 1 8 5 4 -1 -4 -5 10 5 10 4 1 0 -1 1 3 8 -5 2 17 8 11 16 10 9 5 7 15 10 6 7 14 17 16
7862A6%nRoqNj3PlJOkqmNKJpJ6oNloJmlJ7ljjkJKnJ0kmrRKj0PNrQnPnKnkkLmN
$$ 16 16 11 20 14 6 11 -2 5 2 3 9 7 -1 -5 0 2 3 -4 12 6 11 8 2 3 -1 -4 13 10 9 8 6 7 9 4 14 12 8 -1 8 10 0 7 12 3 11 6 13 8 10 5 3 1 4 0 5
7917Ej0Ol%LnRp%NlMOJjpMJ0p%mjOKKqKjpLJ8j6j0PPllPkj4J0k%jNj0PoqJ0oJ4
$$ 5 -5 1 -2 -2 1 -4 5 -2 -2 3 0 4 10 11 10 3 7 17 10 10 6 5 11 13 15 7 9 8 1 4 22 6 -4 3 10 7 4 11 9 -5 5 3 3 2 7 -3 4 -2 -10 0 -6 8
7969Hn%NokjMPqJ2KpkNKj2MmKQJ%olLKkmMo%kJlJJl%oMQ%j0J5kJl%J%%mJ1jnm
$$ 8 3 3 8 2 0 -1 3 10 2 14 16 9 7 12 14 2 6 2 4 12 13 13 7 4 7 9 7 3 7 1 1 -1 0 -3 -2 -1 -4 -4 -10 -6 2 2 -8 7 5 6 3 3 4 4 4 0 11 10 5 1
8025AN%J0lmmMqPoj5J8jkQj6OjKK%%qJ0j0J0kJkoQQj3LjMLnJ0j1J0mlkRj0LKm
$$ 1 6 6 16 13 9 5 9 1 8 2 -13 5 4 2 10 -6 0 -1 1 3 3 3 -5 5 -5 5 3 4 2 -4 4 12 -1 2 1 5 8 3 13 2 12 8 5 3 12 2 5 7 3
8074CJ0j4Nk%PnoJ3j4QjqKjJJ3%qJlkMmkJ6j2kPNoK%%pQmJ0jlJ0qopj0K2nm%N
$$ 3 13 -1 4 2 2 9 4 -2 11 -3 5 4 -4 -2 -3 -2 11 11 3 4 1 -1 3 -1 -3 13 1 -1 6 11 5 7 7 7 0 8 4 14 13 10 20 12 6 -1 -11 11 6 2 2 7
8124Gj0NNj1PmONqj5OO%N%%PjpMMnkRj4KJ0KlJ%kLmrJ5j1mJ0j0MmLpPnjmOkRn
$$ 7 -3 2 7 -4 3 -1 5 10 2 -13 -7 -1 -1 4 4 4 11 10 3 7 11 6 4 13 -1 1 11 13 10 11 11 9 12 8 -1 14 3 -1 9 -1 3 -1 2 -5 2 -3 -4 -8 -2 -4 5 0
8176@jNRj4NmNnjRONrkK
$$ 0 -1 4 13 -1 4 0 5 0 -1 8 14 19 10 8 10
8191A0
##END NTUPLES=NMR FID
##END=
