##TITLE=1H_LY-Gidro 136_41
 CDCl3
 8 sc, 
 18.11.2021
##JCAMPDX= 6.0         $$ Bruker NMR JCAMP-DX V2.0
##DATA TYPE= NMR FID
##DATA CLASS= NTUPLES
##ORIGIN= UXNMR, Bruker Analytische Messtechnik GmbH
##OWNER= root
$$ XWIN-NMR		Version 3.5
$$ Thu Nov 18 11:57:56 2021 Russian Standard Time (UT+4h)  she@DPX200
##.OBSERVE FREQUENCY= 200.131346
##.OBSERVE NUCLEUS= ^1H
##.DELAY= (6, 6)
##.ACQUISITION MODE= SIMULTANEOUS
##.ACQUISITION SCHEME= undefined
##.AVERAGES= 8
##.DIGITISER RES= 18
##SPECTROMETER/DATA SYSTEM= spect
##.PULSE SEQUENCE= zg30
##.SOLVENT NAME= CDCl3
##.SHIFT REFERENCE= (INTERNAL, CDCl3, 0, 15.7039)
##AUDIT TRAIL= $$ (NUMBER, WHEN, WHO, WHERE, WHAT)
$$ ##TITLE= Audit trail, XWIN-NMR		Version 3.5
$$ ##JCAMPDX= 5.01
$$ ##ORIGIN= Bruker BioSpin GmbH
$$ ##OWNER= she
$$ F:/spectra/data/she/nmr/H-F/1/audita.txt
$$ ##AUDIT TRAIL=  $$ (NUMBER, WHEN, WHO, WHERE, WHAT)
(   1,<2021-11-18 11:55:19.26 +0400>,<she>,<DPX200>,
      <created by zg, POWCHK disabled, PULCHK disabled
       configuration hash MD5:
       00 E9 B6 7A A2 85 ED C7 34 08 36 98 17 FE 4E 26
       data hash MD5: 16K
       0D FA 4E 2E A7 D8 E2 B9 8B 5A F5 A1 0E E6 0A C6>)
$$ ##END=
$$ 
$$ hash MD5
$$ 6F A1 46 66 B4 29 BF 6B 88 2C EB 8A B3 A4 31 3A
##$RELAX= 
##$RELAX= 
##$RELAX= 
##$RELAX= 
##$RELAX= 
##$RELAX= 
$$ Bruker specific parameters
$$ --------------------------
##$DU= <F:/spectra>
##$EXPNO= 1
##$NAME= <H-F>
##$PROCNO= 1
##$TYPE= <nmr>
##$USER= <she>
##$AMP= (0..31)
100 100 100 100 100 100 100 100 100 100 100 100 100 100 100 100 100 100 
100 100 100 100 100 100 100 100 100 100 100 100 100 100 
##$AQSEQ= 0
##$AQ_mod= 1
##$AUNM= <au_zg>
##$AUTOPOS= <>
##$BF1= 200.13
##$BF2= 200.13
##$BF3= 200.13
##$BF4= 200.13
##$BF5= 200.13
##$BF6= 200.13
##$BF7= 200.13
##$BF8= 200.13
##$BYTORDA= 1
##$CFDGTYP= 0
##$CFRGTYP= 5
##$CHEMSTR= <none>
##$CNST= (0..31)
1 1 145 1 1 1 1 1 1 1 1 1 1 1 1 1 1 1 1 1 1 1 1 1 1 1 1 1 1 1 1 1 
##$CPDPRG= <>
##$CPDPRG1= <>
##$CPDPRG2= <>
##$CPDPRG3= <>
##$CPDPRG4= <mlev>
##$CPDPRG5= <mlev>
##$CPDPRG6= <mlev>
##$CPDPRG7= <mlev>
##$CPDPRG8= <mlev>
##$CPDPRGB= <>
##$CPDPRGT= <>
##$D= (0..31)
0 1.2 0 0 0 0 0 0 0 0.06 0 0.03 0 0 0 0 0.0002 0 0 0 0 0 0 0 0 0 0 0 0 
0 0 0 
##$DATE= 1637222118
##$DBL= (0..7)
120 120 120 120 120 120 120 120 
##$DBP= (0..7)
150 150 150 150 150 150 150 150 
##$DBP07= 0
##$DBPNAM0= <>
##$DBPNAM1= <>
##$DBPNAM2= <>
##$DBPNAM3= <>
##$DBPNAM4= <>
##$DBPNAM5= <>
##$DBPNAM6= <>
##$DBPNAM7= <>
##$DBPOAL= (0..7)
0.5 0.5 0.5 0.5 0.5 0.5 0.5 0.5 
##$DBPOFFS= (0..7)
0 0 0 0 0 0 0 0 
##$DE= 6
##$DECBNUC= <off>
##$DECIM= 32
##$DECNUC= <off>
##$DECSTAT= 4
##$DIGMOD= 1
##$DIGTYP= 9
##$DL= (0..7)
0 120 120 120 120 120 120 120 
##$DP= (0..7)
150 150 150 150 150 150 150 150 
##$DP07= 0
##$DPNAME0= <>
##$DPNAME1= <>
##$DPNAME2= <>
##$DPNAME3= <>
##$DPNAME4= <>
##$DPNAME5= <>
##$DPNAME6= <>
##$DPNAME7= <>
##$DPOAL= (0..7)
0.5 0.5 0.5 0.5 0.5 0.5 0.5 0.5 
##$DPOFFS= (0..7)
0 0 0 0 0 0 0 0 
##$DQDMODE= 0
##$DR= 18
##$DS= 0
##$DSLIST= <SSSSSSSSSSSSSSS>
$$ [...]
##$SUBNAM2= <"">
##$SUBNAM3= <"">
##$SUBNAM4= <"">
##$SUBNAM5= <"">
##$SUBNAM6= <"">
##$SUBNAM7= <"">
##$SUBNAM8= <"">
##$SUBNAM9= <"">
##$SW= 18.0517287032376
##$SWIBOX= (0..15)
0 0 2 0 0 0 0 0 0 0 0 0 0 0 0 0 
##$SW_h= 3612.71676300578
##$TD= 16384
##$TD0= 1
##$TE= 0
##$TE2= 300
##$TE3= 300
##$TEG= 300
##$TL= (0..7)
0 120 120 120 120 120 120 120 
##$TP= (0..7)
150 150 150 150 150 150 150 150 
##$TP07= 0
##$TPNAME0= <>
##$TPNAME1= <>
##$TPNAME2= <>
##$TPNAME3= <>
##$TPNAME4= <>
##$TPNAME5= <>
##$TPNAME6= <>
##$TPNAME7= <>
##$TPOAL= (0..7)
0.5 0.5 0.5 0.5 0.5 0.5 0.5 0.5 
##$TPOFFS= (0..7)
0 0 0 0 0 0 0 0 
##$TUNHIN= 0
##$TUNHOUT= 0
##$TUNXOUT= 0
##$USERA1= <user>
##$USERA2= <user>
##$USERA3= <user>
##$USERA4= <user>
##$USERA5= <user>
##$V9= 5
##$VALIST= <valist>
##$VCLIST= <CCCCCCCCCCCCCCC>
##$VD= 0
##$VDLIST= <DDDDDDDDDDDDDDD>
##$VPLIST= <PPPPPPPPPPPPPPP>
##$VTLIST= <TTTTTTTTTTTTTTT>
##$WBST= 1024
##$WBSW= 4
##$XGAIN= (0..3)
0 0 0 0 
##$XL= 0
##$YL= 0
##$YMAX_a= 237253
##$YMIN_a= -226848
##$ZGOPTNS= <>
##$ZL1= 120
##$ZL2= 120
##$ZL3= 120
##$ZL4= 120
##$ABSF1= 10
##$ABSF2= 0
##$ABSG= 5
##$ABSL= 3
##$ALPHA= 0
##$AQORDER= 0
##$ASSFAC= 0
##$ASSFACI= 0
##$ASSFACX= 0
##$ASSWID= 0
##$AUNMP= <proc_1d>
##$AZFE= 0.1
##$AZFW= 0.1
##$BCFW= 1
##$BC_mod= 2
##$BYTORDP= 1
##$COROFFS= 0
##$CY= 11.3945322036743
##$DATMOD= 1
##$DC= 2
##$DFILT= <>
##$DTYPP= 0
##$F1P= 2.36226072786647
##$F2P= -0.459571619588291
##$FCOR= 0.5
##$FTSIZE= 0
##$FT_mod= 4
##$GAMMA= 1
##$GB= 0.15
##$INTBC= 1
##$INTSCL= 1
##$ISEN= 128
##$LB= 0.24
##$LEV0= 0
##$LPBIN= 0
##$MAXI= 10000
##$MC2= 0
##$MEAN= 0
##$ME_mod= 0
##$MI= 1.114404
##$NCOEF= 0
##$NC_proc= 0
##$NLEV= 6
##$NOISF1= 3.799351
##$NOISF2= 2.8
##$NSP= 1
##$NTH_PI= 0
##$NZP= 0
##$OFFSET= 15.70392
##$PC= 1
##$PHC0= -15669.08
##$PHC1= 9.60081
##$PH_mod= 1
##$PKNL= yes
##$PPARMOD= 0
##$PSCAL= 0
##$PSIGN= 0
##$REVERSE= no
##$SF= 200.130013532006
##$SI= 16384
##$SIGF1= 3
##$SIGF2= 2
##$SINO= 400
##$SIOLD= 16384
##$SREGLST= <1H.CDCl3>
##$SSB= 0
##$STSI= 0
##$STSR= 0
##$SW_p= 3612.71676300578
##$SYMM= 0
##$S_DEV= 0
##$TDeff= 0
##$TDoff= 0
##$TI= <>
##$TILT= no
##$TM1= 0
##$TM2= 0
##$TOPLEV= 0
##$USERP1= <user>
##$USERP2= <user>
##$USERP3= <user>
##$USERP4= <user>
##$USERP5= <user>
##$WDW= 1
##$XDIM= 8192
##$YMAX_p= 0
##$YMIN_p= 0
$$ End of Bruker specific parameters
$$ ---------------------------------
##NTUPLES= NMR FID
##VAR_NAME=  TIME,          FID/REAL,        FID/IMAG
##SYMBOL=    X,             R,               I
##VAR_TYPE=  INDEPENDENT,   DEPENDENT,       DEPENDENT
##VAR_FORM=  AFFN,          ASDF,            ASDF
##VAR_DIM=   8192,          8192,            8192
##UNITS=     SECONDS,       ARBITRARY UNITS, ARBITRARY UNITS
##FACTOR=    0.0002768,     1,               1
##FIRST=     0,             0,               0
##LAST=      2.2672688,     0,               0
##MIN=       0,             -226848,         0
##MAX=       2.2672688,     237253,          0
$$ Real data points
##PAGE= N=1
##DATA TABLE= (X++(R..R)), XYDATA
$$ [...]
945c912M077K297n919O099k829j984N805o815K919L873q433P115O94q461R605
960D131k957o448J0199n597l007Q537o793N48M896o191L158O13l535M586l197
975a057o6M243o176L424K427p249O314P1o467P718k230m607P116l722k176N203
991B766l878N07K202k776K147j043p68K738l664J660K336n026L684J208n447M848
1007A494j03m610M941r92l196M106j368j616K316j179j73N71l15P13j143O76J084
1024A206k525J690Q53k908K219O98k796K168M19k419J600N40j764Q82Q66j184
1040d55j31J403q94q97J743o80j171J876n08j184J526k21j006Q11L21q39j8J137
1058H13q47p19J874j197j056K372j408j158K699j712p25K283j834k4J429j401
$$ plain form
945 -3912 165 2462 -3457 2642 -187 -2171 3634 -3181 -262 3611 -4822 2293 2987 -5474 4131
960 4131 1174 -5274 4925 -672 -3679 4858 -1935 -1387 3509 -2682 476 1089 -2446 2140 -1057
975 -1057 -1123 3120 -3056 368 2795 -4454 1860 1931 -4536 3182 952 -3655 3461 -261 -2437 2766
991 2766 -1112 -605 1597 -1179 968 -75 -843 1895 -1769 -109 2227 -2799 885 2093 -3354 1494
1007 1494 1391 -3219 1722 730 -2466 1640 272 -1344 972 -207 -380 191 -124 589 -554 122 1206
1024 1206 -1319 371 1224 -1684 535 1233 -1563 605 1024 -1395 205 745 -1019 -137 729 -455
1040 -455 -586 817 -77 -974 769 89 -1082 794 286 -898 628 407 -599 212 533 -306 -324 813
1058 813 -34 -753 1121 -76 -1132 1240 -168 -1326 1373 -339 -1064 1219 -615 -639 790 -611
1074f11N97J39m78R24j148O72P90k181K006J76k591L041q09k322L590j807j500
1091a512L389k497j36K226k547J033P97j854J791r40n06J985k362J034J304l009
1107a804K623O4k898L522j220k030L682k418n53K865k853R12J395k556K062m21
1123C72j491K573k097OK267l185J663J195l322K940k35k650L473j674j256L081
1139A660k515L64J890k668J673L79k058K479j325o94K369k559Q61J569k946K151
1155F30K70k584K943j157j436K790k153KJ992k524J395N61k019K149q95j012K300
1172A252k005M45J665k580J665M49k332K407p37j383K493j759r3J731k197J105
1188A26N41j776J897q37q77K042j801K89J505k311J444M52k007K143o86j113K058
$$ plain form
1074 -611 -14 125 -353 571 -577 95 885 -1296 710 886 -1705 1336 527 -1795 1795 -12 -1512
1091 -1512 1877 -620 -756 1470 -1077 -44 753 -1101 690 -250 -756 1229 -1133 -99 1205 -1804
1107 -1804 819 883 -2015 1507 287 -1743 1939 -479 -1032 1833 -1020 -108 1287 -1269 793 372
1123 372 -1119 1454 -643 -637 1630 -1555 108 1303 -2019 921 686 -1964 1509 -165 -1421 1660
1139 1660 -855 -491 1399 -1269 404 783 -1275 1204 -121 -815 1554 -1005 -144 1425 -1521 630
1155 630 900 -1684 1259 102 -1334 1456 -697 -695 1297 -1227 168 729 -1290 859 -36 -1048 1252
1172 1252 -753 -308 1357 -1223 442 891 -1441 966 229 -1154 1339 -420 -513 1218 -979 126
1188 126 667 -1109 788 -49 -926 1116 -685 -396 1109 -1202 242 694 -1313 830 144 -969 1089
1205A089j484l2J535k020J197N04j786J887q07q19J933j892L68J533k305J467
1221C68L76j990K077q11j122K249j761J12J588k195J361M02j918K154q73r60K255
1238A312j950K56J693k455J381O72k196K199n96j383K357j717j18J657k191J238
1254A59N56j984K091p58j248K444j891j15K098k624J277J068k485K156l01j711
1270a268K454j462l98K024k254R50R93k322K044l36j755K648j592o58K410k456
1286i78O63J583k647J674L47j978K235r01r28K096j870M38J287k171J596J55j803
1303a202K335j135r18K303k011J23J812k357J234P72k091J804m30j158J781j320
1319d58N3J295j836J098M75j802J883n71j237K204j408l37J822j859N11J048j726
$$ plain form
1205 1089 -395 -427 1108 -912 285 789 -997 890 83 -736 1197 -695 -327 1206 -1099 368
1221 368 744 -1246 831 20 -1102 1147 -614 -502 1086 -1109 252 654 -1264 890 17 -943 1312
1238 1312 -638 -382 1311 -1144 237 909 -1287 912 316 -1067 1290 -427 -545 1112 -1079 159
1254 159 715 -1269 822 64 -1184 1260 -631 -746 1352 -1272 5 1073 -1412 744 443 -1268
1270 -1268 1186 -276 -674 1350 -904 46 1039 -1283 761 425 -1330 1318 -274 -932 1478 -978
1286 -978 -315 1268 -1379 295 642 -1336 899 -2 -930 1166 -704 -266 1021 -1150 446 601 -1202
1303 -1202 1133 -2 -920 1383 -628 -505 1307 -1050 184 956 -1135 669 239 -919 862 -458
1319 -458 -405 890 -946 152 627 -1175 708 137 -1100 1104 -304 -641 1181 -678 -167 881 -845
1336h45J119J23j042J254o83k58R55j244P19K61j138J360m73q25J493j081k69
1353e74J303j327M49O24r83P81j38n24P61o37K07M56q97R52j57q66J276p24n34
1372e52J269r89l9R60j048M00L19p28N66l08mL61o27O67j20p12J133p31l86J317
1392G48j219K06J136j440O65M75j181J021l10n35J114j063L98O59j481J272j42
1409C23j362J858q11q94K024j608j15J584j843P39P72j540J339k94p78J420j321
1426e07L19J001j856J526J48j783K240r75j239K487j909k30K133k359R47J142
1442A085k276J686j13j557K111j340k51J934k292J056J092k631K160j14k111K950
1458A389j384j050K660k284J71J815k475J378O14j989K124r30r58K138k086M14
$$ plain form
1336 -845 274 397 -645 609 -74 -332 623 -621 98 359 -779 581 108 -717 776 -305 -574
1353 -574 729 -598 -149 475 -508 273 135 -389 372 -265 -58 398 -499 453 296 -570 706 -18 -552
1372 -552 717 -272 -311 649 -399 1 320 -408 158 -150 -154 207 -420 247 127 -585 548 -183 -569 748
1392 748 -471 -265 871 -569 96 571 -610 411 101 -434 680 -383 15 674 -807 465 323
1409 323 -1039 819 8 -886 1138 -470 -585 999 -844 -105 667 -873 466 172 -606 814 -507
1426 -507 -188 813 -1043 483 631 -1152 1088 113 -1126 1361 -548 -778 1355 -1004 -57 1085
1442 1085 -1191 495 382 -1175 936 -404 -655 1279 -1013 43 1135 -1496 664 550 -1561 1389
1458 1389 5 -1045 1615 -669 -498 1317 -1158 220 834 -1155 969 39 -919 1219 -867 -453
1474d53J671k648J906M29k551K739q85j767K893j851m28K460k430P71J403k508
1490a249J796r8j671K338j341l98K170k441P81J334k663J921L18k240K524q69
1506B12j374K416j848j51J770k041J009P66j738J728o37j038J860j499M2J677
1522A154k063J168P83k165J746k11j581K069j003n77J703j413J95R28j503Q47
1538G7J77j039J350n70m66J192j147J16Q10j254Q02M72j134J007m3q81Q94m42
1556g9k63O68m37J55L03m55K31j56k39M32m08R6M38l90J60J50n35K32J01k87J94
1577h9K75j51J7J48k90j33K95k04k8M83l14M4K88n14K11K4l77N61k48j41O47p16
1599b12J24M42j040O84K21r26J163l19o73J219r88k73J183j127M33P95j185R03
$$ plain form
1474 -453 1218 -1430 476 905 -1646 1093 208 -1559 1334 -517 -945 1515 -915 -144 1259 -1249
1490 -1249 547 449 -1222 1116 -225 -623 1547 -894 -113 1221 -1442 479 797 -1443 1081 212
1506 212 -1162 1254 -594 -745 1025 -1016 -7 759 -979 749 112 -926 934 -565 -523 1154
1522 1154 -909 259 1042 -1123 623 412 -1169 900 -103 -680 1023 -390 -195 733 -770 77
1538 77 254 -785 565 -5 -471 721 -426 -310 500 -754 48 520 -614 393 350 -531 363 -79
1556 -79 -342 326 -111 44 347 -108 123 -33 -272 160 -248 -152 286 -104 56 206 -329 -97 4 -283 -89
1577 -89 186 35 52 200 -90 -223 72 -132 -160 323 9 53 341 -173 38 62 -315 246 -2 -143 504 -212
1599 -212 -88 354 -686 -2 219 -707 456 137 -536 683 -305 -578 605 -522 -89 706 -479 424
1617D24l5j082J293q41l54J432j331M98R12j837J235J00j634J862o48q43J971
1634A122j496r4J469j970Q55P25j784J764j91j293K052j492l64J788k082R64J148
1651A121k193J770J9j949K182j109r75K331j892L47J708k372J277M78k216K178
1667G05o72j165K505j761j36J902k572J067J038k404K197q8j749K469j403q31
1683h98K212k240N07J554k227J633L35k029K156j038j188K421j903K11J859k331
1699i66J177P32k364K011m03j459K412j268m56K006k200N74J147k195J691P7j529
1716a013K198j066r74J980j824J62J535j984J142P52j946J666l80j338J771r97
1732c16l54J653j477N10Q53j711J100L1j294J668n79n94J552j207j41J038j480
$$ plain form
1617 424 389 -693 600 -241 -595 837 -494 4 916 -921 314 414 -1220 642 -6 -849 1122
1634 1122 -374 -468 1001 -969 -114 611 -1173 591 400 -893 1159 -333 -697 1091 -991 -27 1121
1651 1121 -1072 698 717 -1232 950 -159 -1134 1197 -695 -348 1360 -1012 265 743 -1473 705
1667 705 33 -1132 1373 -388 -524 1378 -1194 -127 911 -1493 704 616 -1133 1336 -67 -898
1683 -898 1314 -926 -419 1135 -1092 541 876 -1153 1003 -35 -1223 1198 -705 -494 1365 -966
1699 -966 211 943 -1421 590 187 -1272 1140 -128 -584 1422 -778 -204 943 -1252 439 516 -1013
1716 -1013 1185 119 -855 1125 -699 -537 998 -986 156 908 -1038 628 248 -1090 681 -316
1732 -316 -670 983 -494 16 869 -842 258 289 -1005 663 84 -510 1042 -165 -306 732 -748
1749g48O18O16j159J166p4r52J131p41m70J058r77L12Q61j087O74K14j174J016
1767B84k94p03J206m81k91R74q62j14P48r82L95M74p27P38%o92O31l93l84O99
1787B26m67JP72p25K29L93j009M90K19p76Q94L3o63R68n51m54Q46q05J10O98p54
1808c25O24K07r49Q18m62o03J185p09r3J160j263L89O64j535R07L25j297J544
1826E87l42p65J381j079l28J168j419P14P44j402J356j06j280J526j017n30J715
1843I23j423K88J356j837Q59M64j775J501l10r81J872j050k34J378j818O23P75
1860F11j806J716q2j352K085j257o66J830j910K99J615k022J322N87j910J667
1876G27o18j263J990j340p1J774j941Q29Q15k160J618j89j452K338j177n05K000
$$ plain form
1749 -748 -130 486 -673 493 419 -533 598 -143 -613 445 -532 -220 641 -446 228 442 -732 284
1767 284 -10 -713 493 12 -279 695 -167 -281 467 -515 -120 354 -373 365 365 -327 304 -89 -473 226
1787 226 -241 -240 532 -193 36 429 -580 -90 129 -647 247 280 -383 585 34 -420 426 -379 -269 429 -325
1808 -325 299 506 -443 375 -87 -690 495 -214 -307 853 -410 -21 643 -892 15 340 -957 587
1826 587 245 -520 861 -218 -546 622 -797 -83 661 -741 615 509 -771 755 -262 -792 923
1843 923 -500 -212 1144 -693 166 630 -1145 356 46 -935 937 -113 -347 1031 -787 -164 611
1860 611 -1195 521 439 -913 1172 -85 -751 1079 -831 -532 1083 -939 383 970 -940 727
1876 727 109 -1154 836 -504 -575 1199 -742 87 902 -1258 360 171 -1281 1057 -120 -625 1375
1893A375j915J30J290k026J229N95j659J918n56j054J713j649J4J439j841J213
1909B16P63j942J813n54j550K068j218m75K026j709M51J193j998J051K16j551
1925a200J809m72p60J778j432J3J141j897R52O61j600J743k29j200J623j150o03
1942h23J498j369M79J017j405J030O7j283J217o74m67J371j001L45R07j475P50
1959A84J98j371J260j30p31J435p33m26R95j100R2O41r10P53L00p55Q54n42n40
1978e26P76o74N9Q52p97M96L22r21M93J7p68Q30q6k40P16m47j60L48o22J63K91
1999A22l50M85M5l14L44l64k96M40m32Q9N42l83J28L13o56J49J52n05N10K37l52
2020i6M26j10m34L37l46j25N32k68K37L31n98L04Lp32O13p0m18R49m99k70P81
$$ plain form
1893 1375 -540 -410 880 -1146 83 678 -981 937 381 -673 1040 -609 -595 844 -997 216
1909 216 979 -963 850 296 -1254 814 -404 -879 1147 -562 -111 1082 -916 135 351 -1200
1925 -1200 609 137 -623 1155 -277 -264 877 -1020 -68 593 -1007 736 507 -693 930 -220 -823
1942 -823 675 -694 -215 802 -603 427 494 -789 428 -246 -713 658 -343 2 909 -566 184
1959 184 382 -989 271 141 -590 845 112 -314 681 -419 -327 314 -596 157 457 -298 556 14 -526
1978 -526 250 -424 -365 487 -310 186 508 -413 80 97 -671 159 73 -167 549 102 -58 290 -332 -169 122
1999 122 -228 257 302 -12 332 -32 -328 112 -320 -231 311 -72 56 369 -287 -138 14 -491 19 256 -96
2020 -96 330 220 -214 123 -223 -348 184 -84 153 484 -114 190 193 -539 74 4 -414 535 36 -234 547
2041E47q55j8O09q58N94M05p40P53k77o47P72o27o1Q42p23M54N02j109P84j96
2061A51q92J109m27l81J229r78J04P91j403O22L24j037J290k40p71J252r84j70
2079d11R17j228O51O46j202J158l3j213J354q08n64J407j154L44J062j466P21
2096A81K87j377J280m00o78J455r49n8J157j583N43N64j445J380J0j080J612q54
2114D5o10J367j441L28J014j392J060K01j170J232o61o91J372j114J72J151j481
2131f18Q40L66j481J232l10r03J554q06k09J234j397L92O37j384J053Q1r46J330
2149F65n66m46J095j205J71Q62j242Q54L77j102J083l87q36J134p74j61J078r94
2167c94M40M88j044O75j21p01R99m62j58R29q58J90M69j010N42J83o52R32k50
$$ plain form
2041 547 -308 -326 283 -575 19 424 -316 437 160 -487 285 -342 -403 439 -284 170 672 -437 347 151
2061 151 -741 368 -59 -440 789 -189 -85 706 -697 -75 249 -788 502 262 -509 743 -241 -411
2079 -411 506 -722 -71 575 -627 531 498 -715 639 -169 -733 674 -480 -136 926 -540 181
2096 181 468 -909 371 -29 -707 748 -201 -259 898 -685 -142 422 -1023 357 367 -713 899 45
2114 45 -565 802 -639 -311 703 -689 371 572 -598 634 -27 -718 654 -460 -288 863 -618
2131 -618 222 588 -893 339 29 -874 680 -126 -335 899 -498 -106 531 -853 200 281 -665 665
2149 665 99 -347 748 -457 -286 576 -666 188 565 -537 546 159 -677 457 -317 -478 600 -394
2167 -394 46 534 -510 165 44 -657 342 -120 -278 651 -207 -17 452 -558 -16 167 -485 447 197
2186A97l88O97o51j04M73o66L84L46n30N74j99m88N39m04j23N63m16J75M46n91
2206a66K51L4m74L54rj72M25j21q0J56k91N5j1q4J41P1k4J00o4k04L2o6n7J74
2230c0R8j7J12p7k22R4n9j42K74p5R1K26k39KO9k63J36K0r6L84j56j06K20m55
2254b11L4K34m34N03J55n32O05k58m62N36m13r3N64m37K10M16p12M55l3n94O39
2275A72k40j14P44o39N7M60q23L56K61p76Q12q4m76P88o46j78O27p37L51M40p34
2296c79P23j53o28Q36o61k56R92q32L61O26j035O60L2r17R28l44l79J022o93k3
2316a20P04j056M05L34r00R14j32n17R54p01k37P83r49M06M81q20O49J39q09R01
2336D29n24l26Q43p59K35O68r28O04R5q63P70l90l56J012o42PP56j034L85K93
$$ plain form
2186 197 -191 506 -145 -249 224 -442 -58 288 -242 332 133 -355 184 -220 -343 220 -196 -21 425 -166
2206 -166 85 119 -355 -1 -10 -182 243 122 42 198 -93 -38 -49 -133 8 79 55 155 91 -113 -81 -147 -204 -30
2230 -30 68 51 163 86 -136 -42 -101 -243 31 -44 47 273 34 36 105 -158 -22 -2 -98 286 130 24 244 -211
2254 -211 -177 57 -377 126 281 -251 354 96 -366 170 -243 -336 228 -209 1 417 -295 160 127 -467 172
2275 172 -68 -182 562 -77 -20 440 -383 -27 234 -542 270 186 -290 498 -148 -326 301 -436 -85 355 -379
2296 -379 344 191 -437 399 -262 -518 474 -358 3 629 -406 254 286 -631 297 -47 -426 596 -97 -120
2316 -120 584 -472 -67 267 -633 281 149 -368 586 -115 -352 431 -518 -112 369 -451 198 337 -472 429
2336 429 -95 -421 422 -337 -102 566 -362 242 337 -526 244 -146 -502 510 -132 -125 631 -403 -18 275
2356B75r45Q54Nn94Q41l89l17O31o99J39N14o50N61J15o69P28l88l75O73n30K2
2377a98O47o37L00J98o33L55q5l28N71k88KM64n41J64J07n14M28J05m20O03k23
2398G7j94M45m89oL22l91K61K43l46K28m8k65K16j07q9K26l4J4J36k82M7L9k19
2421b16J74Q7j02K27m7j76J09j06j45K15m1k2K26r7p5O8j71K0Q5j13K28l2j31
2444c5J75j77j14K22k35j6M06k81O2K11m51K55J7l46M53p0k49N40l61o7K60m60
2466b61K02J79l73N08j20k98N20m21k34N77n90K06M43o12M35M5o26N86k45k77
2486c56O90m93P9M55o21L19J60o99O60j19m29Q08n03j21O69q23J89M33p93P01
2506B06k9n22P06l98l40P39o63N6N74p28N10J51p17P53l45m10Q60n70q2P41p28
$$ plain form
2356 275 -670 184 189 -405 436 47 -270 361 -338 -199 315 -335 226 341 -328 400 12 -363 310 -220 -198
2377 -198 449 -188 112 310 -323 32 -53 -381 190 -98 -96 368 -173 -9 98 -416 12 117 -303 300 77
2398 77 -117 328 -161 -167 155 -236 25 268 -78 150 102 -163 53 -54 -143 83 49 63 199 -83 -36 3 -216
2421 -216 -42 45 -57 170 123 -53 56 -50 -195 20 -21 -43 183 86 11 79 -92 -72 13 -100 128 96 -35
2444 -35 140 -37 -151 71 -164 -180 226 -55 7 218 -233 22 39 -307 146 76 -173 367 6 -61 199 -261
2466 -261 -59 120 -253 255 135 -163 357 -64 -298 279 -311 -105 338 -274 161 206 -420 166 -79 -356
2486 -356 334 -159 -80 375 -246 73 233 -466 194 75 -354 454 -49 -170 499 -324 -135 298 -495 206
2506 206 177 -345 361 -37 -377 362 -301 -245 329 -399 111 262 -455 298 -47 -457 403 -167 -249 492 -236
2527b36K56L27q24O58p1n38Q18m01k31O95p28J71M74q37O04Q0o57Q37l38m69Q13
2548D03o30n9O99p69M11K46o30N58j09m74O22m02o1N81o08K33L70p57N17m4m96
2569c99P19l25k44O43n63K0M64o43L64J37n43N59j18l09N58m32n0M00n13K93K25
2590B43n07M97r6m36N27k92j50M94l70O1K86m90K27R4l06L17j32j35L97k78j0
2611e9K21l83K12Q8k94L11m0j41L17k04j17K92k83M5J21j68J54J7j56P2m2j00
2633a37J76j30N8J00j35R0l1j16Q4J3k2J18o2%O6l2j01O6jl5M4L9J8l0Rj05J5
2660d1m0N5M9n4M2R2k10Q2m9j04K48p6j09L04k63O5J25k87J29J57j89J15oq6J77
2685A26j63n2K06k53J28J72l12K93j09k43L27k05j25L77k84L6L76m85K26P7m27
$$ plain form
2527 -236 20 347 -477 181 110 -428 390 -11 -242 453 -275 -104 370 -467 137 217 -440 397 59 -410 403
2548 403 -227 -286 413 -356 55 301 -329 229 120 -354 268 -134 -195 386 -222 11 381 -376 141 97 -399
2569 -399 320 -5 -249 394 -169 -149 315 -328 36 173 -370 189 71 -238 320 -112 -162 238 -275 18 243
2590 243 -264 233 137 -299 228 -64 -214 280 -90 -29 257 -233 -6 88 -218 99 -33 -168 229 -49 -59
2611 -59 162 -221 -9 79 -215 96 56 -85 232 28 -89 203 -80 -35 86 -82 72 89 -67 5 -37 -137
2633 -137 39 -91 -33 67 -68 22 -9 -125 -41 -28 -50 68 6 6 72 40 -61 5 4 -31 13 52 70 40 49 -56 -41
2660 -41 -81 -26 23 -31 11 103 -107 -25 -74 -178 70 -6 -115 189 -74 -9 116 -171 -42 115 -74 41 35 -51 126
2685 126 -37 -89 117 -136 -8 164 -148 145 36 -207 120 -85 -210 167 -117 -81 295 -190 36 113 -314
2706c14L80k4k40M24k62n9L04m17J80J69m23M55m4l54M80k81j66M34m41P4L98
2727B73n12L07L8l19M40l00j33M23l93J09L46n53M00M3m70N28j71l55O03l35j00
2748a31M70n52J87K62n69M35O5l90M94l06j72M88m92J25L21n21M01Om16N05k17
2769gk63N02l79M4L39l88K00J37m63M43j35k44M72l16l2L75n01K05K28n31M88
2790A74p6l68M97k46k38M91m35L3L65m46L15R6l66L77j92j86M65l53qL08l80K27
2812E4J21l81L41j28k36M44k83lK40l22J58R3l19K91q1j74L34j63o8L06l79J36
2834a9J85m05K97L6k53L26j13j81K48j78PJ53k14K03k6j72J90j64l4K24j69mJ43
2857H0j58N5K7j09J08L9j15J46n7l5J38j13K8k7q4R3L0o7P0p9K0O8r9N2K0n2N2
$$ plain form
2706 -314 66 42 -198 226 -36 -95 209 -208 -28 141 -282 173 129 -225 255 -26 -192 242 -199 -125 273
2727 273 -239 68 106 -213 227 -73 -206 217 -176 -67 279 -274 126 169 -301 227 56 -299 304 -31 -131
2748 -131 339 -213 -26 236 -333 102 167 -223 271 -35 -207 281 -211 -86 235 -286 115 121 -295 210 -7
2769 -7 -270 232 -147 -103 236 -152 48 185 -278 165 30 -214 258 -58 -90 285 -216 -11 217 -314 174
2790 174 98 -270 227 -19 -257 234 -201 -168 197 -249 66 162 -204 173 -19 -205 260 -93 -101 207 -173 54
2812 54 175 -206 135 7 -229 215 -68 -71 169 -153 5 98 -221 70 -11 -185 149 -14 -82 224 -155 -19
2834 -19 166 -239 58 94 -159 167 54 -127 121 -57 -50 103 -111 92 66 -106 84 -80 -114 110 -59 -63 80
2857 80 -78 -23 4 -105 3 42 -73 73 16 -19 119 6 34 7 -77 16 46 -21 49 -30 -10 58 -41 11 31 -21 31
2884C1m0k2M6m4jj0k1Q3o4M6O3j47Q3M8j07J14j5m6P2n9oK8k5Jj3o6J09p0J5R7
2914H0j74J09Qj56J57n1o6J46j06JJ40k07J21L8j15O9J5q2J62j29p7K42k18J19
2938B6J15k26J49K3j66K22j29j29K64k08N5J16k32J54N8j91J72j40k0K08k51R4
2960c6J73k88J87R2k91K58q7j77L04j97n0J93k03J13J45k53J94n5j76K86k37m
2982a09K57l21K08J13l11K53k3j84L00j88q7K96k78Q5R8j94J34M3k39L16j44j13
3004h8K62l01O5J88l00J67J39k96K54o3j42J98k10L4J95k78K16Qj51J72j5j73
3026a19K86k49nK43k35J18O6j97J37Oj13J87k02rK44k36O0P7j94J80k3j04J51
3049F9j04l8J92k64J26J45k67J60K3j20J79j29K4P2j07N8M9j68J25l8J0P8r3j8
$$ plain form
2884 31 -9 -31 15 -29 -30 -40 -61 22 -42 4 67 -80 3 51 -56 58 43 -3 69 10 4 32 7 8 -5 -71 38 -32 -17 80
2914 80 -94 15 23 -133 24 -27 -93 53 -53 -52 88 -119 2 40 -75 -6 9 -73 89 -40 -117 125 -93 26
2938 26 141 -85 64 87 -79 143 14 -115 149 -59 -4 112 -120 34 92 -99 73 -67 -87 121 -130 -36
2960 -36 137 -151 36 128 -163 95 8 -169 135 -62 -112 81 -122 -9 136 -117 77 22 -154 132 -105 -109
2982 -109 148 -173 35 148 -163 90 67 -117 183 -5 -92 204 -74 11 109 -85 49 92 -147 169 25 -88
3004 -88 174 -127 -62 126 -174 -7 132 -164 90 27 -115 83 -127 -93 102 -176 40 48 -103 69 54 -119
3026 -119 167 -82 -87 156 -79 39 105 -92 45 51 -62 125 -77 -86 158 -78 -18 59 -135 45 22 -82 69
3049 69 -35 -73 119 -145 -19 126 -141 19 42 -78 101 -28 -4 68 -39 19 68 -100 25 -13 -3 75 -18 -36
3073c6J05j36M7Q3j07J13j15n8J03p7L8J23j89J52Mo5O9j15kJ68j34RQ5j78J44
3098C1J9j32R6j01M4J04j61R6K1p8Q2M7j92K51k18O2J69k04O5J16j83J42m3n4
3122b1J05r1%J00j59O1Q4k28K38j01j03K97k28lJ98k74Q4J41k72K06k3j44K13
3145H0j03o9J83r9M0P7k31K02j5j36J57j45m0K81k62J02Q7k61J61P5k20K30r8
3168dj06K58k30N5J52k52J21M8j47K50j65j15K76j71m5K31k49Q6J58k93K27j7
3190F8j42J75j71O0J19k67K43q6j12J85p1j42K33j32m3K06k61J27J15j98R9J0
3212A5j28K16j75K9J63j88J9J19j91K00k1j64J82j28J0J81k12J3J48j97J36N1
3234G8j55J40r3j4J67j93J33M4j82J23Kj15K07j61n5K10k04P4Q6k00J39k3q8J51
$$ plain form
3073 -36 69 -67 -20 63 -44 69 -46 -104 -1 -78 -40 83 -106 46 50 -15 54 -61 -63 105 -29 -20 65 -113 31
3098 31 50 -82 14 -87 -43 61 -100 -4 17 -61 21 68 -124 127 -91 -29 140 -64 1 117 -66 76 33 -21
3122 -21 84 -7 -7 93 -66 -5 79 -149 89 -12 -115 182 -46 -49 149 -125 -41 100 -172 34 11 -133 80
3145 80 -23 -92 91 -8 32 109 -122 80 65 -71 86 -59 -99 182 -80 22 109 -152 9 84 -136 94 -4
3168 -4 -110 148 -82 -27 125 -127 -6 42 -105 145 -20 -135 141 -30 -75 156 -93 -7 151 -142 85 68
3190 68 -74 101 -70 -10 109 -158 85 -1 -113 72 1 -141 92 -40 -83 123 -138 -11 104 -94 5 15
3212 15 -113 103 -72 -43 120 -68 -49 70 -121 79 58 -106 76 -52 -42 139 -73 -60 88 -109 27 78
3234 78 -77 63 -30 -44 123 -70 63 107 -75 48 50 -65 142 -19 -74 136 -68 6 92 -108 31 8 -80 71
3258G1j28J3J23j72P6J02j63P4L8j38J66r2JJ51j49nJ01j12P1R1j42N6q5M5Q2
3283G5j07O9K2j54J10J4j09J71j18kQ3j42P8R3j89R8L1j01J19o2k1J16j23N0O0
3308F1j32M7Q4j22J42j36j4J64j19P6Q1k26J34j7r1J20m2n2J60k07P5N6j23R4
3332A3jj30K00j40K0J12j39M5P6j64J16M6j65J77j23mJ78j73N5L2r4K4O1j51J27
3357bJ2r0J36j77J20R4j81R1kk2J27j32j1J40j04J7N1j85J69L4j23J55q3p9J39
3382I4j80Q0N8j32R3or1J12o9k3J42r3L4N5j70J24K0j30J41j5q6R0n7l0J32j51
3408e8P4L9j21Q6n6oJ19j04j7R5j60J23j6j07J89n7j29J64r7j0Q8p9M8J8p6Q9
3434C9j9m6R5j39R9L9j32J38qq8R9q6m3J24o6j4L3J1MJ3j25J22l3j29J35r3Q7
$$ plain form
3258 71 -57 -44 79 -93 -17 85 -78 -4 34 -104 62 -30 -29 122 -27 -32 69 -43 28 119 -23 33 -52 -7 75
3283 75 -32 37 59 -95 15 29 -80 91 -27 -29 54 -88 -10 83 -106 -8 23 -78 41 -21 -42 74 -49 1 61
3308 61 -71 -24 60 -62 80 -56 -70 94 -25 51 132 -94 40 23 -68 52 10 -42 118 -89 -14 42 -81 13
3332 13 12 -118 82 -58 -38 74 -65 -20 56 -108 8 54 -111 66 -57 -61 117 -56 -1 31 -63 -39 22 -129 -2
3357 -2 10 -80 56 -121 -1 93 -88 3 1 -21 106 -26 -37 103 -1 16 67 -118 51 85 -38 117 34 -45 94
3382 94 -86 -6 52 -80 13 7 -84 28 -41 -64 78 -15 19 74 -96 28 48 -82 59 44 -42 48 -9 -39 93 -58
3408 -58 16 55 -66 20 -36 -42 77 -27 -44 51 -109 14 -2 -109 80 23 -106 58 -39 -49 39 -40 8 26 -50 39
3434 39 20 -26 69 -70 29 68 -64 74 66 -22 77 -9 -52 72 6 -8 25 36 40 53 -72 50 17 -112 23 -70 17
3461A7O1j36R7K8r9Q4n5o5J91j55lJ16j74P3K8p8O1RJ7K8q1j0P7j23J06J8p9J20
3489G3o1o2P6j03O7M2p4O1N2j00K3K7l9J23j17k3O3q2L0O4j20J21p8p3J66j19
3515f3L0R1r2O4Qr6J55j16nQ0j00RM9o8P4J06k18J69lj01J06j41j2J17j24P8J05
3542A02j59L1K3oL2l6n6J56j91J04O9j53P4J7j05J01pn5Q8o0M4O0j34J15m3o7
3568e6J50j25l5J58n4m1P8j67J12Pj15J39n7l2P9o6J1R2q6L7Kr5P3Pl7Q4j43O4
3596a6O5j39R7L1o3L3K2p8R0j17J02L1p3J2k3nQ9q9K2lj5NN1m6M3N9j35J29j21
3625d2J3P0q7O7Rj25J09L2n7M8m7r0J50j08J8O9l3L8J0q4R5p5o4J24m2pP4r2Q5
3654E8Mo5L9l3n1J06r5K2N4l5nlj3K9n4oM1p4R8Np2M8Ln6J06r2M2R5j18N0K1o0
$$ plain form
3461 17 78 -58 39 67 -32 52 -3 -68 123 -32 -35 81 -93 -20 8 -70 -9 0 17 45 -36 -46 31 -92 14 32 -47 73
3489 73 12 -50 26 -77 -10 32 -42 19 71 -29 -6 21 -18 105 -12 -35 28 -54 -24 40 -80 41 -37 -110 56 -63
3515 -63 -33 58 -34 30 38 -58 97 -19 -24 56 -44 -35 14 -54 20 126 -92 77 74 -27 79 -62 -74 43 -81 -3 102
3542 102 -57 -26 -3 -9 23 -13 -69 87 -104 0 69 -84 -10 7 -98 3 -4 -59 29 -31 13 73 -61 54 11 -56
3568 -56 94 -31 -66 92 38 -3 75 -92 20 27 -88 51 -6 -38 41 -25 -14 78 -8 29 31 -64 9 16 -21 63 -80 -16
3596 -16 49 -90 7 38 -25 8 30 -48 42 -75 27 58 -15 -3 -26 -31 58 -31 -9 -12 -27 -22 29 -17 26 85 -50 79 -42
3625 -42 -29 41 -46 21 30 -95 14 46 -11 37 -10 -100 50 -58 -40 29 -4 34 44 -40 55 -20 -84 40 -2 -9 65 -27 58
3654 58 62 -3 36 3 -48 58 -37 -15 39 4 -1 -4 -17 12 -42 -48 -7 -81 17 22 -50 -2 1 -55 51 -41 1 96 -22 28 49 -11
3686a1Qk1%P0l6q0J51j37K5P5p6Q3m6o4J11n7o3R7q8KP6q1N9J6J7O%r3R0o0N9
3717C2J4p8O7qo7O7l8p0J53j62R5Qm8L0K4j06J36k7j29K18j87J0J75j57O2O7j27
3744d6O6Pj03J22q3ON0o1L7O2r2J00j19L0J7nMK2j6L5Kj01J11nr0Q9m9l4O8q9
3774f5R8k0n7J56q9m8N7k6k4J13j05j7P7j07Q4J5j13O7j2p2J52j09N4K8p8Q5m0
3801Dq7J00n3J2J26j38P0J5n0N7o9j2J08r7mJ01q5j2N7n1O8l8n4O5n1j2O5o5J7
3830a3J1k4N3k7m1N5o8KO5j02P2M6q8J16m6o1P6Lo5K9pk2R7j15Q9K0r5Q5n1j5
3860b1M1l1j9J7j3O6K7q0N2n3K0RJQRo1O1p7jJ11o7l3J31j77P9K7o0M2J9o1M7
3891A3k2K8P2j33M7k0K6Km1K0Q7j25J1R0r1P3Kj07J45p9k9J12j03m4J72j74J00
$$ plain form
3686 -11 -3 -24 -24 46 10 -70 81 -56 -31 44 -32 51 5 -59 52 -5 -68 29 -59 -57 19 -62 -3 13 30 36 36 -57 33 -27 32
3717 32 46 -32 35 27 -40 27 -11 -81 72 -90 5 13 -35 -5 19 -87 49 22 -107 111 -76 -66 109 -48 14 81 -46
3744 -46 20 27 -76 46 -37 -31 19 -42 -5 57 -35 65 -54 -24 -7 -12 -8 14 -2 33 35 -66 45 40 -50 39 -10 -44 24 -65
3774 -65 33 13 -44 112 23 -25 32 6 -18 95 -10 -27 50 -57 27 42 -71 -4 -16 -88 64 -45 9 37 -41 44 4
3801 4 -83 17 -36 -24 102 -36 34 49 -1 56 -13 -25 83 -14 -18 83 -2 -14 43 -8 60 22 -32 33 -18 -30 35 -30 -13
3830 -13 -2 -26 27 0 -41 14 -54 -52 13 -89 -17 29 -59 57 11 -50 26 29 -36 -7 -14 -36 61 -54 35 55 -40 45 -6 -21
3860 -21 20 -11 -30 -13 -26 40 67 -13 39 -14 6 15 16 24 33 -28 33 -44 -45 66 -1 -34 97 -80 -1 26 -34 8 27 -34 13
3891 13 -9 19 91 -42 5 -15 11 13 -28 -8 79 -46 -35 55 -36 37 39 -68 77 -2 -31 81 -22 -66 106 -68 32
3918C2l3o6Q0o9j2J23q1PR3p9J5L2r1P9L2j21Q2j5l3O9n3m4R4p6L4J7l7K5k8N
3948a9Q1j02J5oK3kJ1l1R2p2n9R9j03J11J9r8N3no7J06m1l9O6m1K1rm6M8M7j28
3978g6Q5J0n5N3j2J3Qo8M4J8p9Q9l9L7M4p2j9N4r2O7N3j55J02Ok5K1j7K2kj8L5
4009C2n5n0J08n3p2J15p7J9Q5q3J3M7o1K8pJ1M8p2M3K5k3oN3q4L0k4k8Q7o5%J9
4040Co6M0K5j3M0m2n4R4r2R6J0o6m8k8R9j3j3J1O4j09R0L0m6Jl1rO7o5MR0j22
4071e3M7J5LN7j08k7M9j0%L6%l6L8l5M8l9M8j2n2K6K3n3N4j8l4N6lo6J09o7k3
4102b7P5p7K4J07j62Q0Rn6M6l4kO8o6J5l4M0mn7J6O1L2q0M9n6L9l9N5j7j9j8j3
4133d5J2m2J03q6M8L2j02R5jp1J41p4rJ0j9M9k1l4K5K4q0M1Nj3L4PJ0K2o7L4k7
$$ plain form
3918 32 -1 -67 13 -56 -68 55 -26 -19 74 -5 10 42 -49 30 62 -59 23 8 -25 44 -9 -53 41 -35 -1 16 -21 4 -24 -19
3948 -19 62 -40 -25 -31 -8 -10 1 -30 62 -10 -69 30 -73 38 57 -41 12 7 -60 46 5 -34 32 -9 12 3 -43 5 52 -76
3978 -76 9 19 -36 17 5 18 26 -42 2 20 -59 30 -9 28 72 0 -19 35 -57 10 63 -92 10 16 -9 12 -5 17 15 -3 32
4009 32 -23 -73 35 -18 -90 25 -52 -33 52 -31 -18 29 -32 -4 -11 0 48 -24 19 44 21 15 68 -16 14 -10 -38 49 -16 -16 3
4040 3 -63 -23 2 -11 29 -13 -67 27 -65 31 41 -25 -73 -101 -2 -15 -28 -17 47 -62 28 58 12 13 -18 -27 40 -25 -21 69 -53
4071 -53 -6 9 12 69 -39 -66 -17 -27 -27 9 9 -27 11 -24 24 -15 33 21 -31 -5 18 -35 19 1 -33 23 20 -46 63 -4 -27
4102 -27 48 -29 -5 102 -60 20 29 -27 19 -15 -17 51 -15 0 -34 6 2 -55 -39 22 54 -26 23 -33 6 -33 22 5 -14 -32 -45
4133 -45 -33 -75 28 -58 -10 22 -80 15 14 -57 84 10 1 11 -8 41 20 -14 11 35 -45 -4 1 -12 22 29 39 61 -6 28 1
4164Aj3L0jo9J11j03M1L1pL1n3n4Q0l5oL6j1l5L8o8Q2M6r8O2k5qK2k3k5J19j18
4195b2M8L5j04M7J1k4L5j1m0M1p1M7L4l3L4k8n7R5q4ML5L1Rl4l5O1Mo5K2M0n2
4226b7J2J3M2m4JJ4o1J9J13p6K5Qpj9LqP9n0p4Q2n6J8M3q2L8J1k4J4Oo2N4Nk8
4259a8Jm2P5m1J4L1j6j%kK0K9l3k8L8n1L6Rp8J54n2l1N0l4l2L2m9R0m6om5L6m2
4292c2K4kkK2q9P9k5K9j2Ko9R8p6L0M7q8J30l3k7J5k9m8Q2l5qL2m0M4M1q2K7P
4324A2Kj6l7RJ1J6k9M1k8K1k2P1j7q2Q0j7k3k9P7q1L8M5j49J58m2o6R8o6K2rK9
4355A7K4n0J1L5n8RM2q8L4N7o0K8L8q5M7M3k8k8j4j3MM1knK9J8n4lL8p3RJL7j6
4389a5K3n4L9J3n0M7m8RJ4j9N0l3M8K3o3N5lj9Ml5j1K8k8k2O8l3pjN0J6m0L3m9
$$ plain form
4164 1 -12 18 17 -52 59 -44 -3 28 21 52 -1 -55 25 -10 -16 20 9 -26 12 -56 26 72 -26 36 11 3 25 2 -23 96 -22
4195 -22 26 61 -43 4 15 -9 26 15 -25 16 -55 -8 26 -7 27 -1 -58 37 -47 -43 -8 23 32 -2 -37 24 28 -37 -15 25 -27
4226 -27 -15 -2 40 -4 -3 11 -50 -31 82 6 31 39 32 13 16 8 87 37 -37 45 -11 7 50 -32 6 17 -7 7 13 -49 5 10 -18
4259 -18 -17 -59 16 -25 -11 20 4 3 3 1 21 50 17 -11 27 -24 12 21 -57 97 45 14 64 30 -2 30 -19 71 25 19 -26 10 -32
4292 -32 -8 -10 -12 10 -79 0 -25 4 -8 -6 -75 23 -53 -23 24 -64 66 33 6 21 -8 -56 26 -9 -17 15 -25 19 60 -22 5 12
4324 12 14 -2 -39 -30 -19 -3 -32 9 -19 2 -20 51 34 -48 32 15 -8 -37 40 -41 -3 42 -107 51 9 -57 41 -25 -3 -12 17
4355 17 41 -9 2 37 -21 -12 30 -58 -24 33 -27 1 39 -46 1 44 16 -12 -26 -39 -35 6 4 -1 28 46 -8 -11 27 -46 -37 -36 1 -15
4389 -15 8 -46 -7 6 -44 3 -45 -36 -22 -41 9 -24 24 47 -16 39 36 17 21 -14 -25 3 -25 -47 21 -12 -19 -20 30 46 6 39 -10
4422a0L6Jrm2J4O3o6K7k4k6J06p1p0Q6Kk8M1L1m0N6j00M1m9L4Om5O9K2m2Pj8K
4454DJ9j5%j3K5K6l8oo5J27o3j3N6r1O9mj4j8N4m2L5j6l9N4n2L9n1K8N1o1K5q
4486CqJ5m1kR2n3QL7m9K3Mk1J6Pp1P3k3k7l%J5N2q2J2P4j01L9J2K2k3lj2N3o3
4520b5J8RL5L2m8j2rk2L5j7M1k2K8o7N6o0K1n1M7lL3Kj9jl3L3J1n5K5RoK9l5k3
4554d4K2j3P3l7k8J0N4k7l0N5o6J8j8M3p5O5L8o3K1J5k5N0m9k3O5m3j4K7L8m2
4584ck5JlN6k3k6l3L8J1l1L8Qk3R%L7ol3Mm6O9l8O3l0k6k6K8l4P9k7O0o6P7m2
4618C7j3M2n1l4J03q5l6J05o7J8j4j7L6Kk8On4nO0j5J7ml3LN9mj4pl2qL8K1o3
4651c7M3l0P9m8j7M1k1J8j4O1k5l2ll9k0J7o9J23l1k4P1o1nj3L7o3J25n6j4K4
$$ plain form
4422 -10 26 27 18 -24 -10 53 -13 14 -10 -36 70 -1 -71 15 17 -11 30 61 21 77 -23 18 -31 3 9 -36 33 55 13 20 2 4
4454 4 23 8 8 -5 20 46 8 2 -63 64 1 -12 44 -47 22 18 4 -14 40 -2 33 17 -22 32 -20 19 -32 -4 47 -14 11 3
4486 3 -5 10 -31 -33 59 6 14 51 2 25 29 8 24 31 -40 33 10 -17 -20 -20 -5 47 -35 -23 51 -50 -11 1 23 0 -3 -15 38 -25
4520 -25 -7 2 37 69 21 9 0 -22 13 -4 37 15 43 -24 32 -28 -7 -58 -11 -14 19 21 2 1 -32 1 12 -43 -18 -9 -15 14 -21 -44
4554 -44 -22 -35 38 1 -27 -17 37 10 -20 35 -31 -13 -31 12 -63 2 40 -23 -2 13 -12 38 -11 -34 31 -12 -26 1 39 -3
4584 -3 -28 -27 -30 26 3 -23 -56 -18 -7 -38 0 8 -15 -6 -6 31 25 -8 -4 -50 19 -19 44 14 -12 -38 -10 -44 35 8 68 2 79 37
4618 37 24 66 15 -19 84 -1 -37 68 1 19 5 -12 24 26 -2 4 -50 -55 5 -10 7 3 -30 -27 32 28 14 7 -25 -33 5 26 -37
4651 -37 6 -24 55 7 -10 31 10 28 14 75 50 18 15 -24 -44 -27 -96 27 -4 -28 43 -18 -23 -36 1 -62 63 7 -7 17
4681A7j13P1K8j2k5R3o5m2J01n4L2m8K7k9J0M4n2K6K4j9o3L5Mj5M8lOPJ6l7j9
4712gj3K5J1l9K6QM0k1p6O3l9m4N6k0rP6m4k8M4qN3m7J2J5m7rk3J9P4k4n7J1l0
4745e2O2K2n3J9L0l0L8k3k1M2n7j7K3rLj1M9m1ol0O7Ok4K6k1k5P4n3j1N6l8N7
4777E2o0RL8m2L1l6k2L6k2M9j7K1n3N8l8l1J3J0M3q2O3k5j8K1pkQl9J8L5ol7M9
4810A7k3L8l1oK6L3m1k6O3m7j7jM6j8Nj6K9J4l9nj5k9O4o3M5k4L2K1p9N9jq2J32
4843F1p7k6J7LJ9j1J0J8nn7N2K8j5J3M7o8K0m0M8J0p2M2l2K1M0m3J5No5R4k8J5
4875C9p0M5k0k1L6l1L4J9j9k3Roo5O8L0ll0J7L8k2Ml7P3o5J0J4p8Q5j6J8o4P9
4907D8m2O3l5m9K3rk9L7kJ2l4QN0m1j8J9k2J5QK2j2LJl3j5J7%K8RPJ6q8P2o6P6
$$ plain form
4681 17 -96 -25 3 -9 -34 59 -6 -48 53 -1 31 -17 10 -19 -9 35 -17 9 33 14 -49 -14 -10 -25 23 20 26 33 49 12 -7
4712 -7 -20 5 16 -23 3 11 51 30 -46 17 -22 -66 -10 -30 -39 37 -7 -35 9 1 54 7 19 34 -13 -22 -45 -26 48 24 -33 -22 -52
4745 -52 10 32 -21 -2 28 -2 36 13 -8 34 -23 -40 -17 -26 -23 -34 15 -26 -32 -62 5 11 -13 13 -8 -33 41 -12 -23 33 -5 52
4777 52 -8 1 39 -3 28 -8 -30 6 -16 33 16 37 -16 42 4 -27 -14 -4 39 -43 20 -5 -23 -2 -9 -11 -3 -42 -24 11 5 -32 17
4810 17 -6 32 1 -5 21 54 13 -13 50 3 -14 -15 31 13 18 2 31 45 6 1 -14 -43 21 -42 3 -21 11 32 -47 12 11 -71 61
4843 61 -16 -42 -25 -22 -3 -14 -4 14 9 -48 4 32 17 30 77 9 29 -11 37 47 -25 17 -15 6 46 3 18 23 -42 52 24 39
4875 39 -31 14 -6 -27 9 -22 12 31 12 -11 -2 -8 -73 -5 25 22 -8 9 47 25 29 -8 65 0 10 24 -54 31 15 33 -31 48
4907 48 6 69 34 -15 8 -1 -30 7 5 17 -17 -9 41 0 -18 1 -21 -6 2 24 12 15 16 -17 -32 -15 -15 13 22 29 45 -43 29 -37 39
4942C9o9Q2ln9M9l5Kj0Nm7Q3o5K7kL9k5J3m2L7j3Jj1l9N0k2j6O0jp2R4n9rpJ4
4976a1QL0Rq3K5lN3Mn5L5K3k7j0K8n0j2J2P9m8J3k0j0J0M2m5n0N3k7k5P4m4OJ7
5009Al0J22j33J5J5RQK3J5npo9R0o0l8N6k0J2M4k4Ooo7N2QK0j6l9M5k9o0P9L7
5042E4l0m4j5PK1LJ7k3k9N9l9J4j2N2o1R8q5J3OrK4m8M9J8km5L3l5J4l5LM8l5
5075a4O4l0m2J8MLk3J4j6Q4p5M2o4k5P2l4%L0mk4J4L0m2L2j4PN0m4J8m4k5kN0
5108A0j9L0K5K8p8rL4l1R%j8O3j9o8K4O8n1Ol1N9n1N5j9J3k9qN%LK1l1kP2m1J5
5143C5j0o4O0k4m2L9N0n9N6m3J4nk3N9k9k8K8om6K8n2J3L6N6m8J3j7k0k7R2m3
5174gj7L9k5j4Pl7N4K4rk3nQK1J1J9j3ml9RJ2N9j01QN7l1pJ0pNj3k2j5N1K1k5
$$ plain form
4942 39 -30 52 49 -10 39 4 6 -4 1 -46 37 -28 -1 -3 36 11 24 -18 19 6 7 -4 -43 7 -15 -31 29 28 -44 50 -9 -18 -25 -11
4976 -11 -3 27 36 -47 -22 -25 28 32 -23 12 35 8 -2 26 -24 -36 -24 55 7 20 0 -10 0 42 -3 -53 0 -27 -52 22 -22 -16 1
5009 1 -29 93 -40 -25 -10 -1 7 30 45 40 33 -36 54 -6 -44 12 -8 4 48 24 30 24 -43 9 17 37 21 -18 27 -2 -62 17 54
5042 54 24 -20 -35 -28 -7 -4 13 -10 -39 20 -19 -5 -17 35 -26 72 -13 0 6 -3 21 -27 22 40 38 -7 26 -9 5 -30 -27 21 -14
5075 -14 50 20 -22 -4 0 3 -20 -6 -22 62 -13 29 -35 -60 12 -22 -22 8 4 -20 -6 24 -18 14 0 7 57 13 31 -13 -38 -40 10
5108 10 -9 21 46 74 -4 -13 21 -10 -1 -1 -19 44 25 -43 -19 49 -2 4 -27 32 -19 36 17 30 1 -7 -2 -2 1 22 -9 -11 61 20 35
5143 35 25 -39 21 -3 -45 -6 44 -15 41 -2 12 7 -16 43 14 -14 14 8 -38 -10 -62 -49 -13 43 -5 8 -9 -29 -56 36 -7
5174 -7 -24 15 -10 -24 -17 -54 0 24 15 -8 -13 -5 16 27 46 33 29 -10 -1 11 70 -31 -23 34 3 -4 6 -1 4 -9 -31 -46 5 26 1
5209AqJ7n6K3L2J7j7J0J6r7R0j2l3PK9K2p1O2m0%Qn1O0J9j7Ml5P7q%m3k7K4n1
5243d8Q0Pqn7J4oj4J04n3Ql0K0l6lM8K8q0M2k2PPk3k1O7j9o0Q6l6j7J9J7kqK2
5277C3J6o0J4Ok9N5n2PrL6j6J8l0l8L1j2j5P7n7OJ5L0o3N0M2m4NK%n0K9J2l9N7
5311B7l6K4Nm9L6j1J0P6n7n1K9L1l4K2p1N3Nj4kK3m5K0l6M1j0j0L7n7K2K4MMl0
5344b0J2j3L2J4k3Kj9L4l5J5n1P5l8O0q3J2J01r8L1K1j9J2J5o9K9m0M0J5Nn9k0
5375f2K4M9l9j4M0k3L2Ok2J2pj1M6l6o5N0k9N4j4n9Q9n3N0n1P1p0M5%j7l5K7K8
5407A6M6l1Ll0rJ5l7M0jjm3Ol1L0K0MJ0J4j07P6K4l2k6m0P8lK3lOJ2k9l4R7n1
5441A2m1L7J2q0J05j2l2K9j18O0M9m9k8M2J2J7l1M4l5m1MN8ll4M2m6K8k1JJ0J0
$$ plain form
5209 1 -7 10 -46 -23 9 26 9 19 35 -62 28 16 -17 -10 19 41 -30 32 -8 -8 0 -51 9 28 11 15 -20 57 49 49 6 -21 3 -48
5243 -48 32 39 31 -26 -12 -18 -32 72 19 27 -3 17 -19 -22 26 54 -26 16 -6 1 8 -15 -36 31 12 -48 38 2 -15 4 21 19 11 33
5277 33 49 -11 3 9 -20 35 -17 -10 -19 17 1 19 -11 -49 -18 -30 -45 32 -25 -19 -4 26 -37 13 55 11 16 18 18 -32 -3 9 -30 27
5311 27 -9 15 20 -29 7 -4 6 82 25 -26 3 34 0 22 -49 4 9 -5 -7 16 -29 -9 -45 -4 -14 -24 13 -44 -22 2 6 10 -20
5344 -20 -8 -21 11 25 2 4 -15 19 -16 -1 -52 23 -15 45 -38 -26 75 -23 8 29 10 22 37 -32 -3 -43 -3 12 17 -42 -62
5375 -62 -38 11 -28 -42 -2 -25 7 13 -9 3 -4 -15 31 -5 -70 -20 -49 5 -9 -68 21 -32 18 -33 38 -32 13 13 -4 -39 -12 16
5407 16 62 31 34 4 -5 10 -27 13 12 11 -32 -26 -57 -27 -7 -3 7 21 -86 -10 14 -18 -44 -84 -6 -9 14 11 17 29 0 -34 63 12
5441 12 -29 8 20 -60 45 33 1 30 -88 -28 21 -28 -56 -14 -2 15 -16 28 -7 -48 -44 14 11 -23 19 -27 1 -20 -19 -9 1
5472Aj5K3jj8N1l6lK6m4N4o9O2mq3L4l9M7K1Lm4M0Qj5m4N1J1k2m1L5Mk3M4j5j
5506bpj7J6j6nO0J6n5N1p4M9k7NLj8K2M1m8L8m1k6M7qJ2kk6k1M8K2k1lj3m5L0
5540a5N5K9n3l9K4L9n2j3M9l8PMk4JK3K3rj6Rj7k2PK8jj0J0L7km9L5J8Qqp1N3
5575B0Nk1l5N1m7j9Q0m8OJL3j2L2m3q2K6N2l2M1mk6%N9l6K5o7J1L9l1Q6l9p6M4
5608gKk2O4k1Ok7p7Q6K1J3J2r6O5j1J6K7Qp1K0J8n0L2l7K3J1Nk4J6MrQ1q0oK2
5642A4l8Q5q0k8Q8o4J8j4rL7OmK4m9Qj0jL0k3On1M1k6P7o9qjM7J2j8L8o5L3Ll5
5677b6MK9Q2o8J2no6N0m1oN9n8L3J1M4n9P9o0qm6NL2pJ3J7l7jN8o9J8K6p1L9l1
5711d8J5J07j15R8k2p3P5o1K3Qo6L5N7l7K8l1J0K5J5l6L5l3M9l2l4K2k7l0P8m2
$$ plain form
5472 1 -14 9 8 -10 41 5 2 28 -16 38 -31 31 27 -56 -22 -61 -14 7 10 -34 6 14 -1 -45 6 17 -5 -46 -11 -7 -30 14 -1 -2
5506 -2 -9 -26 -10 -26 -31 29 45 -10 41 -33 16 -11 -6 -3 -21 1 42 -6 32 -9 -35 12 4 16 14 -12 -33 15 37 16 13 0 -45 -15
5540 -15 40 69 16 -23 1 40 -12 -25 24 -14 -7 -3 -27 -26 -3 20 11 -5 4 -13 -35 -28 0 -1 -11 -1 36 34 -15 20 38 46 38 -33 20
5575 20 25 4 -31 20 -27 -46 34 -14 -8 -7 26 14 46 3 -79 -53 -1 -33 8 4 -22 -22 37 1 26 -41 -30 9 -22 64 25 -51 -7
5608 -7 -5 -27 37 16 22 -5 -82 4 25 38 50 -46 19 8 24 51 59 -12 8 26 -24 8 -29 -6 5 10 -14 2 6 -3 78 -2 -8 14
5642 14 -24 61 -19 -47 41 -23 -5 -19 -28 9 15 11 35 -14 -6 -16 -17 13 -10 -4 -55 -14 -40 37 -32 -40 -41 6 18 0 38 -27 6 9 -26
5677 -26 -22 7 89 21 33 28 -38 12 -29 -35 24 -34 -1 10 54 -5 74 14 6 -40 -35 -3 -10 3 20 -17 -18 40 -29 -11 15 -56 -17 -48
5711 -48 -33 74 -41 57 35 -38 37 -24 -1 7 -59 -24 33 -4 24 -7 3 28 43 7 42 9 58 26 -8 14 -13 -43 35 -7
5741gKK2l5K6n9P0ol6nN0m5M3k5L3k6J3m7K6L3n5O0j9mo3J5M1K3l7l6Q5Mm9qk8
5775d4O2RL4j2rr1M3L0MPj04R9n4M9l5J8k3k4L7n9M1L4K0k6MNo1K6jK2lJ7j3L8
5809D0l5QjmoqK5Nj8l2L5j5k6Q2n5J7kj7M3n0k4N0m0L4L6m5j2M0m0l5M1K2RJ6
5843C8m9M4rn2k2N5j0RN2m4L3m8K6l4J0J0Qk4K5l8J4lJ3L3r7N6lM0k3J6k9j9%
5876b2L9qn7M6j2QOqj4O4o4L1ln3M5Nl0JK9j0K7l2j3L8L3j1J7n9K9k6k0O4%l2
5910Hk9M8n7RM5qo9K9K4Qp5O7n9M2M9l0M4m5j2J5lK2Kk3n7L4J9l1L0j9O3m4J8
5943A5M6m8l4O5p6K6L2m0K2J7m9j9N1J5K4p8L6m5N1l1NlK8l8L3K7l6ML8ll4k5
5975b4%J3J2K3Jm5M6Om5K1MrjnQj1n1J5K8K5Ql5JK3N6l9k9k7NP9j8m4Rj9J9r7
$$ plain form
5741 -7 -5 17 -18 8 -51 19 13 -23 -28 22 -23 20 -5 28 2 15 -32 -6 27 -28 32 13 9 -54 -39 2 25 -12 -48 37 41 -8 -16 -44
5775 -44 18 27 61 49 40 -51 -8 22 26 33 -71 28 -26 23 -12 6 -17 -41 -4 -63 -22 12 32 6 10 15 -46 -20 -21 1 -2 15 2 40
5809 40 5 13 12 8 2 -6 19 24 6 -26 9 -6 -32 50 -5 12 10 -7 36 -14 -38 12 -28 6 42 -3 -15 25 -15 -50 -9 13 22 38
5843 38 -11 33 24 -28 -50 5 -5 4 56 12 45 -3 23 -11 -1 9 17 -7 18 -20 -6 -9 4 37 -60 -4 -7 33 10 26 -3 -22 -22
5876 -22 17 9 -48 -2 -14 -6 0 -8 -22 42 -22 9 6 -47 -2 3 -27 -26 3 -7 20 -12 -25 13 46 35 52 -7 22 -4 -24 40 40 8
5910 8 -21 27 -30 -21 24 16 -53 -24 0 8 -67 0 -59 -17 32 2 46 1 -11 4 1 23 25 2 -55 -21 -2 -33 -3 -22 41 -3 15
5943 15 61 13 -21 44 -32 -6 26 -14 8 25 -24 -43 8 23 47 -31 5 -40 11 -20 -15 -18 10 -28 5 32 -4 0 38 35 1 -24
5975 -24 -24 -11 1 24 25 -20 26 32 -13 8 12 3 2 -3 5 -6 -57 -42 -14 11 19 -16 -15 8 64 25 -4 -31 -26 53 35 -9 0 -19 0 -97
6011i7R8LK1m1LQ2m3L2l6k1k2J4N5n6M6m3n4J11m2k4M4J2o2j7L9J9J1Lk7m1qP5
6043C4n2L0N1j04KR6l9lJ9Lj4k2o0J04n5PJ1J6l6Qj2NKM3rn6L8m1N9m6N3p3Q8
6076D7n9KMk5M2j0J1n1K7j6O5m8k6L0J2nKOL8k7j9J3l0RM4Nj2l8L4lm0J5K6ml1
6111a2%PK0j7J0q2Q9MRj0k1j2J5k4L1Rn4N8J1%l1j5J7k8J0L6n0L8oPrn3P1o1O4
6146B1jj5M1n0ml6R1p4N0j4M2l7k9K1Lj8Nk1K4m7M1j2jk5J6N2m9N9j1m3K3LkJ9
6180B2j3J4Nk6m0N3L1l7j8l9M9P9n8k7O8q2M8o6M2j2%KK0l3M9l7J0j4%Oj0j2J
6213b5K5m1O5p9J00m8%o8N4P0p3P5p4M7m0j4Q4k8j1q%nrl4O4rl4M2Mo8K4lN9k7
6247A5k5O2o6K3l7M7jj1K6l1Mk9LROL0n6J3j7P1Kn4O0m5Nl4P6j7j7l2L4K6ll2
$$ plain form
6011 -97 1 4 25 -16 -13 69 26 58 22 1 -21 -7 48 -8 38 -5 -59 52 10 -14 30 42 -20 -37 2 21 32 35 8 -33 -41 34
6043 34 -18 12 63 -41 -39 57 18 15 34 37 23 1 -59 45 -10 -3 8 24 -12 -4 -16 -11 -9 34 25 -31 7 -34 25 -21 32 -41 47
6076 47 -12 -10 -6 -31 11 1 12 -39 -12 -28 37 -11 -37 -7 5 0 2 8 46 19 0 13 -17 -8 36 41 29 -9 25 22 -18 -3 23 19 -12
6111 -12 -12 -5 15 -2 8 -74 15 19 28 18 -3 -15 0 -24 7 16 -38 20 31 31 0 -15 2 -26 -16 20 -30 8 2 9 0 -53 18 -43 21
6146 21 20 5 46 -4 -8 -44 47 -27 23 9 51 14 -15 6 9 -9 -4 -25 -1 -48 -7 -19 -20 -45 -29 23 -26 33 22 -21 2 5 3 22
6180 22 9 23 28 2 -38 15 46 9 -9 -48 1 80 22 -5 63 -19 29 -37 5 -7 -7 -5 15 -18 31 -6 4 -10 -10 -4 -14 -26 -25
6213 -25 0 -41 24 -55 45 -3 -3 -71 -17 53 -20 55 -19 28 -12 -26 58 30 19 11 11 6 -3 -37 27 18 -16 26 30 -38 -14 -17 42 15
6247 15 -10 52 -14 9 -28 19 18 7 33 2 6 -23 -20 -11 -5 25 -31 -18 -35 36 38 -16 44 -1 4 -30 46 29 12 -20 14 40 37 5
6281EO0j12N2M8o6K2J1L5q3Ok9j4L5pQL1mn5M5j5L7m5N4J7l9L9l1oJK1l6%K9k8
6315a4l8Q2k8orL8j7nJ7l3RL6l8K8o0M8pk9L1J9o1M1Rl1J6l5L1rk4L5L8n8OP6
6349E8l2m7L5L1j6k6K1jL0p4LL2K0k5m1K4Ql0PK1m2M8K5n2M3j0k1L7o0nO9o0L4
6382DJ2k6K9l3M3r7R4mm2K1Pk6L6OL1m2jJQn3P0o1RJ6k0K1M1j3L1m7j9QllJ4k6
6418a4j9O4n6M8k8LNO6r8J0J4m0J8J0M8oJ1pnqm3N7J3np9P1jJ2n3L8o1Q1n4mj1
6453b3L2NL4l5lk1o1O1kJ3k4M0K5l5l0N9m3M9j6j1l3N5M2p5K3j4M0n9m3L7M1n7
6485b9M4l1L3n4L5J7J4j3m8Pm6N3J2LPmJ0l9Qj0O8l5pK6j0%m6L1%K9j9j0l7Q8
6519D7n0M1k2QPpn1J4l9N7lkOk9l9M2O9k8l3L9m8L2J0o3M3l3O2l4Rm1M9l4K1N
$$ plain form
6281 5 65 -47 5 53 -13 9 20 55 -28 -22 -51 -65 -30 -37 -29 2 -2 -57 -12 -27 10 -35 19 36 -3 36 5 -1 0 21 -15 -15 14 -14
6315 -14 -52 30 2 -4 -13 25 8 3 20 -13 -4 32 -6 22 -38 10 3 -26 5 24 -37 4 13 -18 -2 -37 -6 -15 -39 -4 34 -24 -18 58
6349 58 26 -21 14 45 29 3 24 23 53 -21 -18 14 34 9 -32 -8 0 -30 -23 -2 -44 4 29 -23 20 10 -11 26 -34 -39 30 -30 4
6382 4 16 -10 19 -14 29 -68 26 22 -20 1 8 -18 18 24 55 13 12 13 21 -32 38 -23 -14 2 -18 3 44 31 62 15 -4 4 1 -2 12 -14
6418 -14 -33 31 -25 23 -5 -2 3 69 -29 -19 -5 -45 -27 -17 31 25 36 29 24 16 -27 30 43 38 -41 30 29 41 -12 26 -35 46 -8 -12 -23
6453 -23 9 14 48 13 10 -11 -72 -11 -13 0 -24 16 41 6 -24 35 -8 41 25 14 -19 36 78 3 26 12 52 -7 -50 -13 28 -29
6485 -29 15 -16 17 -37 -2 15 29 16 -32 -25 -71 -18 -6 -3 4 0 10 -29 -21 -31 37 2 -5 21 11 11 -35 -4 -4 25 6 -4 -41 47
6519 47 -3 38 16 24 31 24 -27 -13 -52 5 2 0 6 -23 -62 -20 49 21 -12 27 -21 11 21 -42 1 -32 30 -4 5 -36 13 -21 0 5
6553EJ6k6K2k4M9jn0M2n2K7NqJ5ml5J0L2Ok3J5n0Rn7J11o5P1p5J6Pk0KK2ok4M4
6588Fj7J4k2K1k5L0K2k2k4L2Km5M5k7M0l8M0k3k5K6k4J9K3J6l0k7j3PjK5%Kk5
6621a8K3kLK3n2RJm0P0j0K6k9j8k1OM7o7J6J0J4KM6q2Q3po2O2k0K1j3k2K0l5M3
6655B7m1J04j14L5qO4p0j7J8JJ0l2J0jjL0n5O8l4L0o1M8j9L1l3J0%nnL3L6n3K0
6688B6n2N4J7m8Mj5K6m3P3m5Pl4K2m5M5J0j2K6k4J6MRj5j1K2m6K4L4k0K0l1L2
6720C0K9m5N9p8j8K5L4n5K1K1%p0O0m3N0J3l4l9O3k4J7Mm5k0RK8l0Q4k6j7Jj5
6752a1rRL8m0O0q0J9M3l9n7P0M4Rq4L8L6k5kJ8L4q6M1n4rJ9J4O9j11P2Qnj7ok0
6786a4j3J5L9K2p1K5p6K2Q9n4rN4m8J7jmM5j3L1q9J5RK6j1J8PLNl7N5j5J6r8%
$$ plain form
6553 5 21 -5 17 -7 42 41 -9 33 -19 8 13 5 20 16 -19 -9 23 29 6 21 -29 -20 -77 34 -31 40 -35 -19 -12 -32 -30 -8 -14 -38 6
6588 6 -11 3 -19 2 -23 7 29 7 -17 15 17 -28 17 -10 30 -8 32 9 -16 10 -14 5 28 44 14 -13 -26 -19 -20 5 5 7 -18
6621 -18 5 3 6 29 -23 -14 -13 -53 17 7 33 4 -14 -35 -29 18 -49 -33 -23 -9 -7 39 -43 40 33 -29 33 13 34 21 -1 19 -16 27
6655 27 -14 90 -24 11 3 67 -3 -20 -2 -1 9 -23 -13 -14 -15 15 -40 28 -6 24 -37 11 -8 23 -10 0 0 -5 -10 23 59 6 26
6688 26 -26 28 45 -3 1 -14 12 -31 42 -3 4 -30 -8 -53 -8 2 -10 16 -8 8 12 21 6 -5 17 -29 -5 29 9 29 -2 30
6720 30 59 14 73 -5 -23 2 36 -19 2 23 23 -47 13 -30 20 33 -1 -40 23 -1 16 20 -25 -45 -36 -8 -38 46 20 3 4 -11
6752 -11 -20 -11 27 -13 47 -33 -14 29 -10 -67 3 47 56 -28 10 46 21 19 37 71 -15 26 -28 -37 -18 -4 65 -46 26 34 29 12 6 -14
6786 -14 -27 -12 27 49 -22 3 -73 -51 38 -16 -25 29 -19 -2 -3 -7 38 25 56 -33 -18 -9 17 6 24 31 34 39 2 57 42 58 -40 -40
6820d0M1K4p6J5M5J3l3Nk0L4j8K5J9m2LoKK1k0nN3q2O3K4l4MMk7QJ3l9K6j4RM5
6855D0Ol1J0n4O5p1N5m4M4m8J1k6L0J6l5M1pk3QQOm8N8k0Pj1%NNKk0M5l6OpN0
6891C7j1rK8om9m7M5j7Q8Qp6j2P1l4k5P9r0P2j01L9j2K2%j5K7%lRk6KK2m7K6m4
6925d9PO3J9k2l1K5K0J2p5k5N9L7jm3j7N1j7Rn0O1l0n0N7K4n3%M3n7LN2q6N6j4
6958b2M2l1k9O8l5j1N8n2Rj7qL1k0O5r0K7N0n6N0Nj7J4l5kj0kJ8j2L1J6n3M0j7
6991Ep4R4k0L7m1lO6p6Ol7k1O0rk4N5m3J0R6q4j4k5P2l3K1OK6o5J2J9j6K9k1N
7024A3K6l4J8j1j9O2r8R6q1P3Rl6k7l8P1k5m3L7oLk5K3N3j0k4rk1L1L7n1Mk1L2
7057Il8J9K5L5l6m1%P4m2J1j8J8k2K2m3N1k5k2Q0l8k5j6K6LkKL0jl1k2M9m8NK7
$$ plain form
6820 -40 1 25 -51 -36 9 22 -11 -6 -26 8 -10 15 34 -8 -5 -11 -9 12 -8 -13 40 -42 21 45 11 15 19 -8 0 13 -26 0 -14 -5 40
6855 40 46 15 25 -29 36 -35 20 -24 20 -28 -17 -43 -13 3 -32 9 2 -21 -13 -5 1 -47 11 -9 -2 -13 -13 -8 -3 -1 -21 24 -12 -6 -13 37
6891 37 26 17 45 39 -10 -57 -12 -29 59 67 -9 -21 50 16 -9 70 -20 52 -49 -10 -22 0 0 -15 12 12 9 18 -8 -6 16 -31 -5 -49
6925 -49 -42 21 40 18 -13 12 32 44 -31 -56 3 40 39 -4 -21 30 13 22 -28 33 3 -47 10 34 -19 -19 24 -33 -30 22 -64 -8 -22
6958 -22 20 -11 -40 28 -7 -18 40 -12 -3 -20 -28 3 -17 48 -42 -15 35 -21 29 34 17 31 -4 -6 -16 -18 0 -12 19 35 -18 22 5
6991 5 -69 25 5 42 1 -2 64 -12 -6 -43 -64 -4 -13 -37 18 -25 -15 81 -3 -17 -42 30 -3 18 24 50 -15 -3 16 0 29 8 13
7024 13 39 5 23 12 -7 55 -43 53 -28 45 54 18 -9 -47 24 -1 -44 -7 -13 -10 -35 -12 41 31 7 -2 -23 8 45 -6 -2 -23 9
7057 9 -29 -10 15 50 14 -27 -27 47 5 16 -2 16 -6 16 -27 24 -1 -23 57 19 -6 -22 4 7 5 7 37 36 5 -17 32 -16 -11 16
7091A6pk0kJ7l8K2K4kk0M2l6k5P8m7lJ1PM2j36O2m7O6j9K1j1j8RQK5L5m0j6L1
7124B9j2l1PNO3o3K1mj6j4l6L9NJM5l7J8J0J0k1n8j5O3J5Ql3J5qq6Q9l9J5K4j
7158HJ9n4M8qK6J1n3K6J7k3lj9j8L5l3M4n0N6l8N1n1PM1qL3m0m7N3lrk3K8Nj3
7192A5l2M7k0m9J4K3j2L1Jk0J4L2o1L9m5K7m0QL4L1j2n1J2J9M2l7J2o0L3J7j8
7223fm3N8K0p8N9k7J5RLon%K4Mn2L0k9L8K4l6oN3o0RM8m4Oj1K5j6j4j0M7k3k1
7258a5L9j8K2k6rK8L5o7M0m1O7k6m0J9M5k5l0OjL8l5J6k4KK7J6n8qP0m7ml1m3
7291g8P2l5jJ1K8Nl9J8L5L8q5M7kM0p0N0J3m6J7j7J8K7m3n6P1J4l4j4J3k6K3M8
7323D2p2Q8k7k3n3L4j4rP7o0l1L2O9n9j6j9%O3l6J5JL8rk8J5k6L1n4O4%n7J2j0
$$ plain form
7091 16 9 -11 -13 4 -34 -12 12 10 -10 32 -4 -29 49 2 -1 10 17 59 -77 -15 -62 4 -15 6 -5 -23 -14 -6 19 54 14 -2 29
7124 29 17 -14 -7 -2 61 -2 19 15 -1 -15 -51 -12 -7 -6 39 2 20 30 40 19 -39 -54 9 24 32 -1 14 6 -80 9 -30 -15 9 8
7158 8 27 -27 21 13 39 50 -3 23 40 17 14 -5 -23 12 -21 23 -27 29 -9 42 -9 -2 39 31 64 24 -23 30 27 18 -5 23 28 15
7192 15 -17 30 10 -39 -25 -2 -14 17 18 -2 12 44 -17 22 -23 4 -36 -28 6 37 25 -26 -14 5 47 10 22 -38 -5 12 -6
7223 -6 -49 9 29 -49 10 -17 -2 7 10 4 -1 -1 23 27 -25 5 -24 14 38 2 -4 49 -11 -2 46 2 8 -3 22 6 -8 -18 29 6 -15
7258 -15 24 6 28 2 -7 21 56 -11 29 -12 55 29 -11 8 53 28 -2 4 3 41 6 22 -2 0 27 43 -15 -23 47 0 -4 -35 -78
7291 -78 -6 -41 -42 -31 -3 2 -37 -19 16 54 -31 16 14 54 -16 34 47 1 18 1 19 46 3 -53 18 32 -2 -16 -3 -29 -6 42
7323 42 -30 58 31 8 -45 -11 -25 -34 43 -17 -48 -16 53 -6 -22 -41 -41 22 -14 1 2 40 31 3 18 -8 23 -31 33 33 -24 -12 -22
7356b2Q8p7o2Q2L3jrn2J8j5Lk3J8NPM6m6k0L8l6J9k3J6P1o3L3n9P5lj7Ol0j9K6
7390GMK6Om9L6n2K1jJ1M1l9n5P2J6pm1RJ7j6jk4N6m6l2L5LjL6lkjkpj7JM2n5L0
7428A8J1l3j1K4L2Nj3n4j2M6k5RJ5L3pm6L5m7O3m0L9l8N2n0J4j7k9O0K7j9kk4
7460A6j5M1oq9R6m7N9r1mO7k4m9Q8j7k8J9J9m7R5q0J2J3nl8K8K0p3K1L5J4j5j3
7492Bk8O5n5K9o1M2lL1l0l4L2J9j6K3j5J8oQp6L9k3N4J9kj0Ml7N7q5K1L8k5J0
7525EL3j8k3O2n6J1L3l4o1O3n4N5l1NJ2j5M3l1n3L6K9l3kL3J2J5kq0K6M1m5kM2
7558A6Nl6K1L4m5POK9Jl1j1K2m1O6l4n3L6j1RN1m0N8q0M9j7k9K3k0K3o0O5M1m4
7591A0m2M8o5N1%k7kJ9J9J3K0k3j1j3L7p8O5m7MO9k4k3kL3%m2joL9Mq4mM2K4o0
$$ plain form
7356 -22 66 -11 -73 9 42 41 32 -20 -2 -17 -14 -37 -19 -14 -7 39 -7 -27 11 -25 -6 -29 -13 58 -5 28 -31 44 41 24 30 0 -19 7
7390 7 11 37 43 -6 30 -22 -1 -2 9 50 11 -44 28 44 37 -4 5 22 6 5 -19 37 -9 -41 -6 -3 -4 32 29 27 26 24 17 0 1 43 -12 18
7428 18 29 -4 -15 9 41 46 33 -21 -33 13 -12 -3 12 45 38 -8 27 -20 43 3 42 4 56 6 20 3 -26 34 61 42 40 16
7460 16 1 42 36 -53 43 -4 55 -36 -40 27 3 -46 42 25 -3 16 35 -12 83 3 15 28 23 -15 13 33 -40 -19 16 30 15 2
7492 2 -26 39 -16 13 -48 -6 -9 22 -8 -42 -10 9 -7 16 1 19 13 21 -55 -16 -39 15 34 32 22 26 -11 46 -39 -18 20 -5 5
7525 5 38 20 -3 59 3 14 47 13 -48 15 -39 16 -15 -10 2 -13 30 -1 -54 -18 11 -22 -24 9 21 36 34 -46 -20 21 -24 -26 16
7558 16 21 -15 6 40 -5 2 8 37 38 7 -4 18 -23 43 9 -44 -8 -19 -10 41 1 59 -21 28 11 -18 5 -15 8 -52 13 54 10
7591 10 -32 16 -49 2 2 -25 -27 -8 11 24 44 21 10 -3 34 -44 21 -26 -22 47 23 0 -2 31 31 -11 -12 -18 21 25 -59 -63 -21 3 -57
7626e7M3N1k7kqJ0k8J4L2j0%Jm7j0J6J1m6R1j5J9l0J1n5J5M8J1J2m3J5l7k7K6
7658a6LK3j4M0lo9J6M7m1K6m4M2j7pPL0l0J8k6L7M0r2L7qJ2K8l8j5ROJ2m8M6l0
7692a9L5L2N1q7k8O2o3K7km2R6r1J4OL3Kr1j2N0KJ0NJj1K3M2j9K6l4kl1J2QL6
7726D1m7j1L4j9K5o0K4M1l1j9M7nl0J3J1L0p2N6l0n6N0M0j3%oJ4n6NK2K7l4J2
7758Cj9L0k8L4k8OL1nj1K2o1O0p1M5j7l1M3k6P9m9k8Q5jl2l0J0o1O9Pl2oL3m0
7791a9l0M1ml4M0Q9m2n5J4k5M3j8J0O0q7M5M3q7M2q5O9L9m2o7N1M5n1L1pj2jJ9
7823A5j8N7p9N4J6r2N7K0j4J5l4m4kN4K8m6lO4p4L9QKj8Pk0j4M4K5o7O6J7k5M
7856D2J7k8j1n6L5k8N2l1K7j1j1j5k7M1KM2l8k0K5j5jj6K8Lm1O1q0P1Pj2J3l7
$$ plain form
7626 -57 -14 37 10 8 0 10 -18 -4 28 18 18 19 -28 -38 -22 -11 -57 34 19 38 8 19 -36 -21 27 38 50 7 22 -15 -42 -16
7658 -16 -13 10 -4 36 33 -36 -20 27 -14 12 -32 10 -7 -14 -7 23 -7 11 -15 22 62 -30 7 -1 11 39 1 -14 -5 1 13 -35 11 -19
7692 -19 16 48 99 12 -16 46 -17 10 8 -34 62 -29 -15 -9 24 26 -65 -77 -27 -25 -15 -10 -9 -20 3 45 26 52 18 16 -15 -3 5 41
7726 41 -6 -17 17 -2 23 -37 -13 28 -3 -22 25 20 -10 3 14 44 -28 28 -2 -58 -8 32 19 19 13 27 -29 -24 -2 25 -9 3
7758 3 -16 14 -14 20 -8 -2 29 24 13 35 -26 34 -37 8 -9 -40 3 -23 56 7 -21 64 63 31 1 11 -50 19 26 -6 -12 21 -19
7791 -19 -49 -8 -12 -46 -6 83 41 -14 0 -25 18 0 10 70 -17 28 71 -16 26 -59 10 49 7 -60 -9 36 -15 16 9 -3 -4 15
7823 15 -3 54 -25 29 45 -47 10 30 16 31 -3 -47 -49 5 33 -13 -16 48 -26 13 21 23 5 12 -8 -22 22 47 -20 46 63 38 42
7856 42 59 31 20 -36 -1 -29 23 -8 19 8 -3 -18 -45 -4 -2 40 2 -18 7 -8 -9 -25 3 6 -35 26 -54 17 24 12 25 -12
7888a2K7KKj3J4k6J1J4n3J9l3J0Q8m4J6m7J4K5q7O6L2k5k0K8J2j4j1j0MJ9k1n8
7920g1Q0Mm3P2Ll8nKqJK4lPj4L3m8k5N2Jj5qnJ7M3m8M3l7L2o0K0j3L1m3M9o5L6
7956AOL1m0k4M8n7O3m4K6Qjl4J2J2m4N7m0L8l5K7J6j9J1J3k9K0k3lJ8Jm6J6K9
7989A4L4j4k7J5L2n2J3j4%J0K0k3m5K2L0m5M1j4Qj8m1oL1M2k9L6J9l6J2%Nm2j0
8022c2k4P1l8K1J3M0n5mL2l4K2k3L8m2rMJ3Oj9L8Ol6j4N7m7jM1loK7l4MJ9mo5
8057c8N9l3J7k4NK3k0L1J3j0pJ4l5Ok3Pl4L6l0O7J1m5k9M2Rj0N9n8NM2l8kJ6k9
8091cj0RL9K4l1j7J9l1o1N6K1K9j8QMl1m6Q0m0L3n5J6J9j7l7K5K3m8P3o7K3J5
8123DrP%MK5lm1L5l7k1M6l5N8l9k8O5RJ4m7KK4j2J5l5J2k1N5m6mN3j1j7Rm6R6
$$ plain form
7888 -12 15 17 19 6 20 -6 5 19 -34 -15 -48 -38 50 6 22 -25 -11 14 -73 -7 25 0 -20 8 20 6 -5 -15 -11 8 -13 -71
7920 -71 9 13 -30 42 45 7 2 4 -4 -3 21 18 25 11 44 -4 -29 23 24 9 1 -4 13 56 8 51 14 46 -14 6 -7 24 -19 30 -35 1
7956 1 7 38 -2 -26 22 -35 28 -16 10 18 17 -17 -5 7 -37 20 -20 18 -17 10 26 7 18 31 2 22 -1 -4 14 15 -31 -15 14
7989 14 48 34 7 22 54 2 15 1 1 11 31 8 -37 -15 15 -30 11 -3 5 -13 -54 -60 -29 13 -16 20 39 3 15 15 20 -22 -32
8022 -32 -56 15 -23 -2 11 51 -4 -8 24 -10 12 -11 27 -15 -24 -20 -7 -1 -20 18 24 -12 -26 31 -16 -17 24 21 15 42 8 12 31 27 -38
8057 -38 21 -12 5 -19 -14 9 -11 20 33 23 16 30 -5 1 -22 -15 -49 -13 -43 24 35 -10 -39 3 12 2 61 3 8 50 12 10 26 -3
8091 -3 -13 -4 35 59 28 11 30 -1 -62 -6 15 44 26 34 38 7 -39 41 1 34 -21 -5 14 -3 -40 -15 8 -40 33 -34 -11 4
8123 4 -5 2 2 6 31 28 -13 22 -15 -36 10 -25 33 -6 -34 31 40 54 7 9 33 21 36 1 13 -8 47 1 -3 50 39 22 31 -15 81
8158H1p6Om7M9oL3m1Mp5R0J8o2P5l9%l2J4n5M8Qk7j0O6qO4m0L8j02Q8p3N4n8L4
$$ plain form
8158 81 5 11 -36 13 7 40 -1 3 -72 18 36 -26 49 10 10 -22 -8 -63 -15 -7 -34 -44 22 14 78 38 76 -26 62 -11 43 -15 19
8191A9
$$ Imaginary data points
##PAGE= N=2
##DATA TABLE= (X++(I..I)), XYDATA
0@%%%%%%%%%%%%%%%%%%%%nJ3j6J6j6J6j6J6j6J8k1K3k4K4k6K8l1L4l4L5l6L9m2
43b1M2m3M7n0N0n6O4p0P9q8R8j15J37j66K03k48L14m10N47p50J057j546K374l912
67b463P191j6186P3275J53868l75280K67422M2347l77022L18931j09710j76471
78a94098L48572j87161N66K26323k96219J15273N1656k64452K66684n4762j35589
89a23207L24898k12135n5142K39893l22843P5087J79852k74317K24877O8868k22009
100i6178K27434j17509j39680K07130j90908N3575J79116k15386J77214K4821
110A09629k49745K35537j15573j60229L15333j83122k9495K89335k80024L7932
120c0422J70154l06344J44070R4821k10791K31492j8987j42071J90808j60403
$$ plain form
0 0 0 0 0 0 0 0 0 0 0 0 0 0 0 0 0 0 0 0 0 0 -5 8 -8 8 -8 8 -8 8 -8 10 -11 12 -12 12 -14 14 -17 17 -17 18 -18 21 -21
43 -21 21 -22 25 -25 25 -31 33 -37 42 -46 52 -63 74 -92 111 -137 177 -233 314 -436 621 -925 1449 -2463
67 -2463 4728 -11458 61817 215685 -159595 107827 150174 -226848 92083 -17627 -194098
78 -194098 154474 -32687 -32121 194202 -102017 13256 64912 -199540 67144 12382 -123207
89 -123207 201691 -10444 -65586 174307 -148536 -73449 106403 -167914 56963 125831 -96178
100 -96178 131256 13747 -125933 81197 -109711 -56136 122980 -92406 84808 109629
110 109629 -140116 95421 -20152 -180381 134952 -48170 -77665 211670 -68354 -30422
120 -30422 139732 -166612 -22542 72279 -138512 92980 73993 -68078 122730 -37673
130c7673m8993J53258j81903J08188J06573j78534J73101k9443j79686J89857
140G4745j15038q0929K21278j38994J7472J57448j88451N5691M8261j68302J28318
151A1499n448p2511J65965r0019k2657J06318j74361M9426P2359j55547J56293
162D1317K8123j38322J71881p8053j22943J64905j21272k8030J70669j26425M3751
173E601R5772j57369O9945P512j22618J28420l0162m2807J42451r9886q507Q5255
185G3607j54034N3862O1218j23903J31550J8097j08469J26610o9221q4183J16904
196D2038r3029M872J12737r7439N7821L9060j20370P8033k7900p8947J24133n5153
208a4144j2532J19375j12788J4602O3743j42687P2136M0950j04073J28555p603
$$ plain form
130 -37673 -86666 66592 -115311 -7123 99450 -79084 94017 64574 -115112 74745
140 74745 -40293 -121222 100056 -38938 -21466 135982 -52469 3222 51483 -116819 11499
151 11499 6051 -66460 99505 9486 -13171 93147 -81214 -31788 40571 -114976 41317
162 41317 69440 -68882 102999 24946 -97997 66908 -54364 -82394 88275 -38150 5601
173 5601 101373 -55996 13949 21461 -101157 27263 -2899 -45706 96745 -3141 -11648 73607
185 73607 -80427 -26565 34653 -89250 42300 60397 -48072 78538 9317 -74866 42038
196 42038 -50991 -46119 66618 -30821 27000 66060 -54310 23723 -4177 -83124 41009 -14144
208 -14144 -26676 92699 -20089 -5487 58256 -84431 -12295 28655 -75418 53137 45534
219D5534q5447J12152q4118m9566J01562r7832L5333Q7297j02191P5903J2452
230E1079j13525R3171m4442o1207J26947p0784J774J05116j20586L1411M6580
241D5534j30675Q8065J7188q3406J28009l9547n6613J01642j05760q702Q4127
252C9862j06844P0732N4257j01500R7054k4468r2515J04340p1951k6464J17415
263E9918r1030L3321P4267j23009O0437J1063j07322J06108k1212m9537J21452
274G4456p4348j7362P9734j17789L3013N2764r7791R5743J2012p8716J00800o0552
286A964n3177R3530q9725J6275Q6777r4486O3317L0049j05590P9462k8375o9567
298f9546J07597n3781r385R8367r3465K0358M5593j10620O4422J4753p2815J05166
$$ plain form
219 45534 -39913 72239 -11879 -61445 40117 -57715 -22382 64915 -37276 38627 51079
230 51079 -62446 30725 -13717 -74924 52023 -18761 -16987 88129 -32457 -1046 45534
241 45534 -85141 2924 20112 -63294 64715 25168 -31445 70197 -35563 -44265 39862
252 39862 -66982 3750 58007 -43493 53561 29093 -63422 40918 -31033 -57497 59918
263 59918 -31112 2209 76476 -46533 13904 24967 -82355 23753 2541 -46996 74456
274 74456 108 -17254 62480 -55309 -22296 30468 -67323 28420 40432 -38284 62516 1964
286 1964 -51213 42317 -47408 -31133 55644 -38842 24475 54524 -51066 28396 21 -69546
298 -69546 38051 -15730 -25115 73252 -20213 145 45738 -64882 -460 14293 -58522 46644
310D6644k7252m5579Q8906q3881j2521O8733r0321M9923M7968p9572P7435j1252
322B9231p3803P8471n4877k7867Q8585o5804K3794O1829q7967M2192R418q3430
334f0228P2431j3653l8733R0385m5850j4599N9556q1241J4813L6417o8918O2063
346A2443J3799n1813P0359l6657m0457O1794o1715L745O2631o1277M0504L0494
358D3850p2772M7357j2071n7066O6876k4665j4779O9027m8336K737L3450o8549
370c4941K7956J4402m7748O2578o232l2187N8446m6238k0678M7604n6665J7724
382a5979M4963n0609L9937J3376n6159L9016j7819l4789N1667k3167J447M4880
394C6764m2748J2980J1987n3998L5460n32l2092O0793j8869k1622N0982n0713
$$ plain form
310 46644 19392 -26187 62719 -21162 -33683 35050 -55271 -5348 42620 -36952 40483 29231
322 29231 -44572 33899 -20978 -48845 39740 -26064 -2270 59559 -28408 13784 23202 -60228
334 -60228 12203 -1450 -40183 50202 4352 -10247 49309 -31932 -17119 19298 -49620 12443
346 12443 26242 -25571 44788 8131 -32326 29468 -32247 -28502 34129 -27148 13356 43850
358 43850 -28922 18435 6364 -50702 16174 -8491 -23270 45757 -2579 158 33608 -34941
370 -34941 -6985 7417 -40331 22247 16015 -16172 42274 -3964 -24642 22962 -33703 -15979
382 -15979 28984 -21625 18312 31688 -24471 14545 -3274 -38063 13604 -9563 -8116 36764
394 36764 -5984 6996 18983 -35015 445 -87 -32179 28614 9745 -11877 39105 -11608
406a1608j0316M2301n2790K3197L7607m6515L6864N907m8276L5372j9445k2871
418c0573M6213k5760R102L5188m6000J9702O322n2222M2647l302l0572O0723k2386
431I082k1875M6814m7860p176L7404m3298K3828K6071l5046L2052q106l0132L0507
444A2265l0017q6L6827l6466K7961J9838n2598L7098p324m8919N6178j6647k4179
457b6069O3227l5639j2641M2434n2695P061K8213m1142L5225R000k9808L8898
469B6064k6068j8098L6348m3124J3391L6798m7151L5581J4848n5450M0990r615
481D514m1603N2549j7433j4440M7028l2621r31K0187l8985J9711K632k0585M0007
494B0030j9124o492L5427m7028Q764K7520n2364L5908J9612m7272M7493n321m3486
$$ plain form
406 -11608 -21924 20377 -32413 -9216 28391 -18124 18740 24647 -23629 11743 -7702 -30573
418 -30573 15640 -10120 -1018 34170 -11830 7872 14194 -38028 4619 1317 -29255 31468 9082
431 9082 -12793 34021 -13839 -21015 16389 -26909 -3081 22990 -12056 19996 11890 -18242 12265
444 12265 -17752 -17838 18989 -17477 10484 30322 -22276 14822 7498 -41421 14757 -1890 -26069
457 -26069 37158 1519 -11122 31312 -21383 -14322 13891 -27251 7974 16974 -12834 26064
469 26064 -4 -18102 18246 -24878 -11487 25311 -21840 13741 28589 -26861 14129 4514
481 4514 -37089 15460 -1973 -16413 30615 -2006 -2937 17250 -21735 -2024 608 -19977 20030
494 20030 906 -5586 29841 -17187 -8423 19097 -33267 2641 22253 -25019 22474 17153 -26333
507b6333M4713k4523k0510M4996k7924O496K8361l6191J8390j66l2472L4745j5499
520e917j1617M4681l2827Q71L3267m9026J3741K2939m3623L2099J2564l2980L3069
533A7241q736k3484K4534j9552k90J9129j8284J9649N28k1036K5221k1126j2811
546a9017L3941k8542N510L3773l6970J3009J8109m1087K1104P619k7898L0117
558I668k338j5036K3675j7940m417J3440k1798J4422P289j8021K5783p812j8732
571a1817K5821k0470j0346K9339k0906K285K5086k4144M608J1551k3250R157N250
584B164j0987J3969j707k825P551j2519L765J945j3535J6074j29j1263K0770r462
598C811j2940J8773j5385o422K0924j3562J987J6172j6334K932N673j5296Q262
$$ plain form
507 -26333 18380 -6143 -26653 18343 -9581 -3085 25276 -10915 7475 7309 -25163 9582 -5917
520 -5917 -17534 27147 -5680 -4809 28458 -20568 -6827 16112 -27511 4588 17152 -15828 17241
533 17241 8505 -14979 9555 -9997 -10287 8842 -9442 10207 10735 -10301 14920 -6206 -19017
546 -19017 14924 -13618 -8108 25665 -11305 1704 19813 -21274 -170 7449 -20449 9668
558 9668 7330 -7706 15969 -1971 -6388 7052 -14746 -324 6965 -11056 14727 6915 -11817
571 -11817 14004 -6466 -16812 12527 -8379 -6094 18992 -5152 -544 11007 -12243 -3086 2164
584 2164 -8823 5146 3439 614 8165 -4354 -589 1356 -12179 3895 3766 -7497 13273 3811
598 3811 -9129 9644 -5741 -12163 8761 -4801 -2814 13358 -2976 -44 5629 -9667 -1405
611a405J398o207J3072n677j597R414j5285L453P663j6602J3537O614j6450J6939
625H867j711j7958J6832p258j0983J9771q342k807J5130j3646P51N868j3742Q940
639b88R70p097J5001q085l358J2970j7740L238J1592j9060J3733P778j8814J7772
653H612k966j7130J8794j0415o824J9899j4008L523J2313j9228J0081J165j6905
666a3089J9031o611q013K2491j6976j056J7233k4627Q979J1321k2769J9643K295
679G852j8498K2186j0747j1364K0693j7955K435J6750k0042J3332M898k0790J9021
692G771p728j3127K3942j5600j161K1187k3320P746J1053k5209J7466J627j8202
705a3555K4131r023r686K1630j9704P32J5407k2299J3983O983j9626K1176o440
$$ plain form
611 -1405 -7 -6214 6858 1181 -416 8998 -6287 -2834 4829 -11773 1764 8378 -8072 8867
625 8867 7156 -10802 6030 -1228 -12211 7560 -782 -3589 11541 -2105 -1354 4514 -9228 -288
639 -288 682 -6415 8586 501 -2857 10113 -7627 -4389 7203 -11857 1876 9654 -9160 8612
653 8612 5646 -11484 7310 -3105 -9929 9970 -4038 -515 11798 -7430 2651 3816 -13089
666 -13089 5942 -669 -8682 13809 -3167 -4223 13010 -11617 -2638 8683 -14086 5557 7852
679 7852 -10646 11540 793 -10571 10122 -7833 -5398 11352 -8690 4642 9540 -11250 7771
692 7771 43 -13084 10858 -4742 -5903 15284 -8036 -290 10763 -14446 3020 4647 -13555
705 -13555 10576 1553 -8133 13497 -6207 -5475 9932 -12367 1616 8599 -11027 10149 3709
718C709j4627K2227j6893l065K0760k1048R172J2121k3191J6345m82j8730K1860
731H158r697p723K2080j7724K335J4127k2488J1928M883j8799K0302m543j1647
744h808K1144j5042l555J6564j9801P570J0626j8498J5606L90j5414J7626r753
757a345p477J7554j4561K996J2824j7266R902L537j6397J4911m118r486J7346
770H420j0153k089J3432j5318M450P140j4790J1378J213j0503J4274o490o058
783e094J2373j1915J074R761j2548P816M454j2048J0514k503q938J1640o508k708
797d630J0850q990K258N925j0374N799J121p818R079k477l999R003o825j043O688
812D567q865L151M896p974O124J751p266O352j952m975O558l415j233N693m613
$$ plain form
718 3709 -10918 11309 -5584 -8649 12111 -8937 235 12356 -10835 5510 5028 -13702 8158
731 8158 -1539 -9262 12818 -4906 -2571 11556 -10932 996 5879 -12920 7382 2839 -8808
744 -8808 12336 -2706 -6261 10303 -9498 -1928 8698 -9800 5806 6196 -9218 8408 -1345
757 -1345 -8822 8732 -5829 -2833 9991 -7275 2627 6164 -10233 4678 560 -8926 8420
770 8420 -1733 -3822 9610 -5708 -1258 5882 -8908 2470 3683 -6820 7454 964 -5094
783 -5094 7279 -4636 -3562 6199 -6349 1467 5921 -6127 4387 1884 -7054 4586 -1922 -4630
797 -4630 6220 -2770 -512 5413 -4961 838 1959 -5859 3220 743 -3256 5747 -1078 -2121 4567
812 4567 -4298 -1147 3749 -4225 1899 3650 -3616 2736 784 -4191 2367 -1048 -2281 3412 -1201
827a201J193K697n702L406K05m309O041j850k777O497m919j674N968o500J069
842a856N645o574L272L418o859M062M84n272N264j600k037N244m240O56L164o285
858c514M013J040o073P481j769n158Q722n310l457Q728p446N2P678p992L054M073
874D122p637M974k25m852O382l787m99N800p300L580K838q923P775m34p741J0744
890D817m255n453J0723p654j862Q724q813K813N058p880N933m42n225P242n556
905a830m28P003r024N001M169j0887R072j36r951J1807m188o432J1888p345k164
920c445Q861q836K368M225p435O269j161m091P664o567L97O648r921N515M097
935D588j0615R212J24r392J0670l848n881R972o149j240O826o916K878J972n686
$$ plain form
827 -1201 -8 2689 -3013 393 598 -3711 2330 480 -2297 4200 -719 -2393 3575 -2925 -1856
842 -1856 3789 -2785 487 3905 -2954 1108 1592 -3680 1584 -16 -2053 3191 -1049 -393 2771 -3514
858 -3514 499 1539 -4534 2947 1178 -3980 4742 -568 -4025 4703 -2743 -2691 4987 -3005 49 4122
874 4122 -3515 1459 1234 -3618 2764 -1023 -1522 4278 -3022 558 3396 -5527 2248 1814 -5927 4817
890 4817 562 -4891 5832 -1822 -3684 5040 -3773 -960 4098 -3782 2151 1709 -3516 3726 -1830
905 -1830 -2258 4745 -4279 722 4891 -5996 3076 2940 -7011 4796 608 -5824 6064 -1281 -3445
920 -3445 5416 -3420 -1052 3173 -4262 2007 846 -3245 4419 -2148 -1751 4897 -5024 491 4588
935 4588 -6027 3185 3309 -6083 4587 739 -5142 4830 -1319 -2559 4267 -2649 229 2201 -3485
950c485N939l035k331P201p206J821O050r905N495L498r974Q301L84p959Q979
965C773k753m808P481m689o66M400m817K939L14l445N084l915q21N645o739K273
981g44M717q005M705K532p557N930K03n479N682j469k563L995k590L34J236k293
997a366K689j597j060M047m124N21M035n617K072L285n757L138K023m868L294
1012G15O45l334K540j33j422J258l58K71l11l22J504j876K33K121k626P20K146
1029A771k985R61J887k705P89J473j824K16J329j036n54J288l03j310J346K08
1045E51j732J495L98j795J205M77j448O97O93q12j70J017l09j117J443M0j847
1062a214J998m6k182K463l63k058K456q39j326K008j084k96J002j031P36l03m80
$$ plain form
950 -3485 2454 -581 -2912 4289 -2917 -1096 4954 -4951 544 4042 -5932 2369 2753 -5206 3773
965 3773 1020 -3788 3693 -996 -1662 2738 -2079 860 1174 -2271 2813 -1102 -1923 3722 -3017 -744
981 -744 3973 -4032 673 3205 -4352 1578 1781 -3698 1984 515 -2048 1947 -643 -309 927 -1366
997 -1366 1323 -274 -1334 2713 -1411 -890 3145 -2472 -400 2885 -2872 266 2289 -2579 715
1012 715 1360 -1974 566 433 -989 269 -89 182 -129 -451 1053 -823 -590 1531 -1095 -375 1771
1029 1771 -1214 -253 1634 -1071 -282 1191 -633 -417 912 -124 -678 610 307 -1003 343 551
1045 551 -1181 314 712 -1083 122 599 -849 -152 541 -271 -441 576 267 -850 593 633 -1214
1062 -1214 784 738 -1444 1019 656 -1402 1054 215 -1111 897 -187 -483 519 -512 224 -79 -559
1079e59J432j749N68J608k834J691J236l304K667L10l051L296p61k078L049j644
1095a23o96K137k051Q53N95j708J981j205p66K493k598O49K107l487K084J111
1111A376l541L121k38k612L327j570j098K775k350N00J512k507K103l17j754K847
1127A574k040m15K801l218J041J941l458K366N42l096L099q60j838K962k043r2
1143g34K016k442J415M49k178K551j138j094K742k435L67K088k977J671R11k857
1159a645K617n29j768K722j726m10K024k348J031Q30k155K215p36j299K409j877
1175f45l0K035k566J216J002k395K210l20j644K247j321m07J852j970Q90O79j896
1192a063J881o27j189K175j661j68J827k171J041Q40k177J851l34j365K097j315
$$ plain form
1079 -559 873 -876 -308 1300 -1534 157 1393 -1911 756 1066 -1985 1311 550 -1528 1521 -123
1095 -123 -819 1318 -733 120 715 -993 988 -217 -983 1510 -1088 -439 1668 -1819 265 1376
1111 1376 -2165 956 718 -1894 1433 -137 -1235 1540 -810 -310 1202 -1305 798 481 -1273 1574
1127 1574 -466 -881 1920 -1298 -257 1684 -1774 592 1134 -1962 1137 277 -1561 1401 -642 -734
1143 -734 1282 -1160 255 704 -1474 1077 -61 -1155 1587 -848 -481 1607 -1370 301 1212 -1645
1159 -1645 972 443 -1325 1397 -329 -739 1285 -1063 -32 798 -1357 858 122 -1177 1232 -645
1175 -645 -675 1360 -1206 10 1012 -1383 827 507 -1137 1110 -211 -618 1234 -736 154 833 -1063
1192 -1063 818 191 -998 1177 -484 -652 1175 -996 45 885 -1292 559 225 -1140 957 -358
1208c58k56J643j903R10P39j869J878n41j175K160j632p7J746k224J040Q12k158
1225a265K028m72j323K154j530j65J650k122J090O90k054K115o28j372K421j798
1241e81j29K012k355J078J038k240J880k38j637K308j454k99J881k142J026Q56
1257A004k249J982l80j681K586j665m44K318k436P05J429k531J777J06j786K378
1273A113j273p10K243k263O79J431k552K024Kk053K612j223j150K522k114J39
1289e73J899k438J286O70k046J918o55j097K113j734K47J485k247J437N11k151
1305a375K239o31j411K466j618l52K061k108O55R84j881J518j89j214J790j278
1321c44q5J458j972J003P18j977J781k00j543K071j029p90J893j492J32J228j484
$$ plain form
1208 -358 -614 1029 -874 36 775 -1094 784 243 -932 1228 -404 -481 1265 -959 81 893 -1265
1225 -1265 763 291 -1032 1122 -408 -573 1077 -1045 45 735 -1319 796 168 -1204 1217 -581
1241 -581 -710 1302 -1053 25 1063 -1177 703 465 -1172 1136 -318 -617 1264 -878 148 1004
1257 1004 -1245 737 357 -1324 1262 -403 -847 1471 -965 -260 1169 -1362 415 521 -1265 1113
1273 1113 -160 -870 1373 -890 -211 1220 -1332 692 694 -1359 1253 30 -1120 1402 -712 -573
1289 -573 1326 -1112 174 844 -1202 716 61 -1036 1077 -657 -410 1075 -1172 265 776 -1375
1305 -1375 864 233 -1178 1288 -330 -682 1379 -729 -74 910 -971 547 358 -856 934 -344
1321 -344 -429 1029 -943 60 778 -1199 582 382 -1161 910 -119 -909 984 -508 -376 852 -632
1338f32Q43J63r86J146p44q1J037j275O63M99j401J233j88j030J460p45n38J311
1356G35j090J67N59q78O38j54l38P89p66K76N87j136Q02J80j103J254l40p68J257
1375F71o95k94Q14p52K66J87l84N33m97J47M26j058Q19N9j042J373m97p71J435
1394G40r76l17J226j187M10N82j052J033l84n15J184j249L26J010j727J244L28
1411F76j696J804n13j325J894j116m14J647j581M66Q06j501J228l64p93J619j370
1428e33K25J338k066J272O04k270K246m23j724K690j462p96K335k184M51J406
1444A109k266J628Q1j653K224j366o31K173k382P34J605k775J967N18k589K665
1460A042q43j649K767j834j48K048k278J030P36k072K022o99j219K468j928J05
$$ plain form
1338 -632 211 374 -612 534 -210 -291 746 -529 134 633 -768 465 277 -753 707 -38 -576 735
1356 735 -355 -188 371 -507 131 -23 -361 428 -338 -62 525 -611 191 371 -732 522 182 -586 671
1375 671 -24 -318 496 -256 10 197 -187 346 -151 -4 422 -636 183 242 -800 573 76 -695 740
1394 740 -236 -553 673 -514 -104 478 -574 459 75 -440 744 -505 -179 831 -896 348 676
1411 676 -1020 784 271 -1054 840 -276 -690 957 -624 -158 648 -853 375 11 -782 837 -533
1428 -533 -308 1030 -1036 236 840 -1430 816 393 -1331 1359 -103 -899 1436 -748 -297 1109
1444 1109 -1157 471 552 -1101 1123 -243 -874 1299 -1083 -349 1256 -1519 448 966 -1623 1042
1460 1042 199 -1450 1317 -517 -665 1383 -895 135 871 -1201 821 122 -1097 1371 -557 -452
1476d52K047k851J311J091k890K456p6k133K845j435r98K462k268M23J526k297
1492a239J663K51j919K363j267r45K434k166M00J920k637J438Q16k460K051l52
1508C51j626K329j250l91J736j792N92P38j887J690l15j137K037j392k88J792
1524A187k030N96J203k074J451M14j649J655m89j018J519j101j0J098j323P94
1540B23K55j095J157n83o81J307r31n2J187j246L46O51j213O69J63o80Q03j10
1558A70l46N85m70P3P8l62L63j9j35M41l19k61M36m71qL88k64R0K97k02j97J64
1580C1j70k38M23q9j47M25j46k60L95l82q8L98l70M08J16m52N29m00l74P83p07
1601c15R2Q79j063O01L65j273R52j06j076J454n37m87J355j230J83P87j425R74
$$ plain form
1476 -452 1595 -1256 55 1146 -1744 712 636 -1497 1348 -87 -1085 1377 -891 -468 1058 -1239
1492 -1239 424 675 -1244 1119 -148 -1093 1341 -825 -425 1495 -1142 296 1112 -1348 703 351
1508 351 -1275 1054 -196 -587 1149 -643 -51 687 -1200 490 175 -962 1075 -317 -605 1187
1524 1187 -843 -247 956 -1118 333 747 -902 753 264 -754 765 -336 -346 752 -571 223
1540 223 478 -617 540 -43 -724 583 -348 -400 787 -459 -113 538 -675 -6 157 -523 280 170
1558 170 -176 409 -61 12 90 -272 91 72 -63 378 59 -202 234 -237 -245 143 -121 -31 266 64 -133 31
1580 31 -139 -377 46 -43 -190 235 89 -171 224 -158 -246 152 -218 190 306 -146 383 -17 -391 392 -315
1601 -315 -223 656 -407 194 559 -714 238 132 -944 510 -27 -514 841 -389 -206 581 -844 130
1619A30J52j048J512o69o13J519j493J06J253j769J064P28j718J584l47j381J838
1636H48j214l58J809j816P95R59k064J473j22j596K130j049n28K105j960L41J430
1653A183k419J430N08k015K263o10j289K335j844j44J790k328J070J069k194K122
1669I27m11j773K372j576o33K364k208P51J547k577J688J79k188K338q15j071
1685a086K512j888J20J694k473J226O67k186K246m42j443K488j699n55K059k410
1701a170Q51J293k220J841J06j818K084j177q94K170j818M52J493k116J307L94
1717G78k036J913n50j152K225j364k16J677j995N04R57j832J373J67j340J827
1733I36q89o93J497j468J77J127j541J046M59j414J393m29j133J542q81k86J409
$$ plain form
1619 130 282 -766 746 77 -536 983 -510 -404 849 -920 144 872 -846 738 391 -990 848
1636 848 -366 -724 1085 -731 64 1023 -1041 432 310 -1286 844 -205 -733 1372 -588 -247 1183
1653 1183 -1236 194 702 -1313 950 340 -949 1386 -458 -602 1188 -1140 -70 999 -1195 927
1669 927 516 -1257 1115 -461 -1094 1270 -938 -187 1360 -1217 471 650 -1538 800 -15 -1086
1685 -1086 1426 -462 -342 1352 -1121 105 772 -1414 832 390 -1053 1435 -264 -819 1240 -1170
1701 -1170 -319 974 -1246 595 701 -1117 967 -210 -1104 1066 -752 -300 1193 -923 384 778
1717 778 -1258 655 105 -1047 1178 -186 -402 1275 -720 -216 741 -1091 282 449 -891 936
1733 936 47 -646 851 -617 -440 687 -854 192 651 -763 630 201 -932 610 -271 -557 852
1750H52j133L40P12j370P35J57j103J250l74m38J170r60j07P76j166N45M98r81
1768e97Q64K03r31Q96m15p17R96m97k22J024o49j4N65r09L87J41o30P55l8m47
1788b35Q23n31l64O89p52J0P51p78M56N39j033O00k6q77Q86j99l70R47n54p3O59
1809E68j021L78L24r07J043pq29J202p45n35J158j187J00J219j368Q47N10j493
1827g43J094k16j134J445o21l27J433j318L15Q15j707J088K20j387J805m63r52
1844f53J813j423l15J418j762P70R54j533J313k8j381J579j076n15J643j541O30
1861a07J135j869J261J23j876J922o59r59K240j513o4J642k144P45Q29j964J789
1878E31l0j366K046j221n93J692j936N02J289k011J600L37j901J986r20j192K058
$$ plain form
1750 852 -281 59 771 -599 136 293 -810 440 66 -372 798 -162 -269 507 -659 -114 384 -597
1768 -597 267 470 -461 435 20 -697 299 -198 -420 604 -45 -59 506 -403 -16 125 -505 250 212 -235
1788 -235 588 57 -307 382 -370 -360 391 -387 69 608 -425 175 149 -728 158 -41 -411 536 -18 -91 568
1809 568 -453 -75 249 -658 385 378 -451 751 6 -529 629 -558 -458 761 -607 240 750 -743
1827 -743 351 135 -999 446 -175 -502 931 -387 -72 743 -964 124 344 -1043 762 299 -653
1844 -653 1160 -263 -578 840 -922 -152 802 -731 582 554 -827 752 -324 -839 804 -737 -107
1861 -107 1028 -841 420 543 -1333 589 -70 -1029 1211 -302 -366 1276 -868 -123 706 -1258 531
1878 531 501 -865 1181 -40 -633 1059 -877 -375 914 -1097 503 840 -1061 925 5 -1187 871
1895H71j450K1J731j886Q85P10k009J502l00j133K033j115k30J660j996O47R33
1912H74k171J637J98j607K150q03j041J764j578p3J466j775J068P14j669J506
1928F60m61j206J691j166j43J659j631P44Q41j857J167j1j358J698n24o40J568
1945A031j286L8Q73j485P25M03j082J426m27p31J327j212k12J172j332P04Q20
1962G52j336J052J3j241J095m56n60J212o93J69P99j084L69J74r26P98j12l91
1980c66R56n40k42O94r49J36N49p87O26L80o48N10j79o22M74j51j49N87l24K48
2000B03K06n36J73n2m31M74K1j84N92l19l21M50n44j09N19l50J99M64m70J11Q3
2021A79n89K72P3k68N54m0k38N22n97j02L89n76L63M18n97O04j1p50O35l65m59
$$ plain form
1895 871 -579 -558 1173 -713 172 882 -1127 375 75 -1058 975 -140 -370 1290 -706 -59 874
1912 874 -1297 340 538 -1069 1081 278 -763 1001 -577 -650 816 -959 109 823 -846 660
1928 660 199 -1007 684 -482 -625 1034 -597 147 988 -869 298 287 -1071 627 103 -537 1031
1945 1031 -255 -217 656 -829 -104 299 -783 643 216 -515 812 -400 -612 560 -772 -68 752
1962 752 -584 468 481 -760 335 -121 -681 531 -162 7 806 -278 91 265 -661 137 25 -366
1980 -366 590 50 -192 502 -447 -311 238 -549 77 457 -191 319 140 -482 -8 -159 -308 279 -45 203
2000 203 409 -127 46 -6 -437 37 58 -126 466 147 -174 276 -268 -377 142 -208 -9 455 -15 96 179
2021 179 -410 -138 -65 -333 221 181 -57 465 -132 -234 155 -421 -58 360 -237 367 356 -394 241 -124 -583
2042e83R79n44K3P95q83K19K67r43O59J5n23J066m91j86P24j034J22O73j055Q34
2062A34L51r61J117m08q18J099q79j37J127j028N31N73j278R25k02r95J288o92
2080b53k22J366j217K73P26j552R34K64j234J488l14p76J428j129j59J042j407
2097g42O95O92j302J230j87r99J285r87l45J425j384N51R68j641J064M9j394J446
2115D24n20o66J617j126N4J074j488O23M08j371J452k87p64J507j029l33J169
2132G44j480N39Q01j372J237N7j138J263p58o21J301j115K79J016j260Q28J65
2149D86j266J169m99o28J400r37Q3R97j305N20M27j197R29Q8q59J251n88l57Q79
2168E93r67J18N65q87P58J78p84R27n02m83Q85q02O7P78p52M65L21r02O79j94
$$ plain form
2042 -583 396 -148 -125 670 -213 6 273 -670 -11 4 -519 547 56 -130 594 -440 -318 355 -700 134
2062 134 485 -476 641 233 -585 514 -365 -502 625 -403 128 701 -577 348 146 -849 439 -253
2080 -253 -475 891 -326 -53 673 -879 55 319 -915 573 259 -517 911 -218 -377 665 -742
2097 -742 -47 645 -657 573 386 -613 672 -315 -660 765 -619 -68 900 -741 323 372 -1022 424
2115 424 -96 -762 855 -271 -217 857 -631 -8 400 -971 481 194 -570 937 -92 -425 744
2132 744 -736 -197 604 -768 469 526 -612 651 -107 -728 573 -542 -263 753 -507 321 486
2149 486 -780 389 -110 -738 662 -275 -192 805 -500 20 447 -750 179 267 -592 659 71 -286 593
2168 593 -374 -256 309 -578 180 358 -426 501 -1 -484 401 -401 -334 444 -308 157 478 -424 255 61
2188F1n71P77l73l8O40n98J73K39p25M65L5m02O38k91j90N12n00q4L68m74K34
2209a04K79l04L03L5l40J83j76j02K38l3J66J28j85om9j78Q5J7qK11L0j42j1k
2233C5k29N6Q8j03K26M2j70K04j85j86K63k54J42K08j90K17m6k70K37j93j49M17
2255A60l07J54M43o06J99J43o32M66J2l51O65k46l25N83o07NM32n87M68K76o38
2276b93O78l58l57O19n88LP20p07M18L79q40N43j35o36Q68m62q9Q51p83J57L62
2297C50r17O14L5o67J019l77l51R60r09k2O82j028N81M31q75R21j95o71Q66o40
2317a93k21Q81q21M31N05j013P01n1q66J000n03k76J013p78P7N42r81N77J88q47
2337f35R19k21l55Q87o97j0N31r34N27L22p64R03j57p15Q85o33k59Q05p69K92
$$ plain form
2188 61 -510 267 -106 -144 496 -102 71 310 -415 50 85 -317 321 30 -160 352 -148 -232 136 -338 -104
2209 -104 175 -129 174 209 -131 52 -124 -226 12 -21 145 273 88 82 33 -145 -60 -43 -51 160 190 48 37 35
2233 35 -194 -138 -50 -153 73 115 -55 149 -36 -222 41 -213 -71 137 -53 164 118 -152 85 -108 -257 160
2255 160 -147 7 450 -156 43 186 -446 20 32 -319 346 100 -225 358 -249 -244 188 -399 69 345 -293
2276 -293 385 27 -330 289 -299 -296 424 -283 135 514 -326 217 82 -554 314 -148 -237 614 -169 -12 350
2297 350 -567 47 82 -585 434 57 -294 666 -243 -265 417 -611 -30 401 -474 447 252 -419 447 -193
2317 -193 -414 467 -354 77 582 -431 270 219 -647 353 -150 -426 587 -191 -114 428 -553 24 212 -635
2337 -635 284 63 -292 595 -102 -112 419 -515 12 334 -430 473 316 -399 486 -147 -406 399 -370 -78
2357g8N94q74N83j3p30P33l55k81Q37n71J20M45p58M37N4o72P42j10l90P44m36
2378B1j85N46p09J80M01n43M40J04m08M64l36k30M66m85J98L98n09L19O3m83L73
2399H5r8l08N03k22n1M12l89K1K03l76J63J52j86K33Jj79K15k76q2K71k12Q3J88
2422A51j69R7O9l57J31Lj09J78J07j24J63n1k75K01j02l2J99j38J24J44k68J07
2444D9j0k73K33Lj55L79k42q6L11m20JL45l63K35K35m18L54j20l46M53k65n9M22
2467B63l69J48K60o00M50o0m58N66j97k06O25n11k2M29o88K85K79n75N75r7l28
2488b31N40m46j06M73o21L45L54o67O21n6o35P80m36k76P40n82J40N60q06M21
2508A12J59o84P00k49m20Q10m85p0O43r10M08K29p58P80q0n82Q56m73l34P19o61
$$ plain form
2357 -78 516 -358 225 212 -518 215 -140 -421 416 -155 -35 410 -348 89 143 -529 213 103 -287 457 21
2378 21 -164 382 -327 -147 254 -289 151 255 -153 311 -25 -255 211 -274 -76 322 -187 132 195 -288 85
2399 85 -13 -321 182 -40 -91 321 -68 -47 156 -220 -57 95 -91 142 143 -36 179 -97 -179 92 -120 -37 151
2422 151 -18 79 148 -209 -78 -75 -184 -6 101 -23 140 89 -186 15 -87 -119 80 -58 66 210 -58 49
2444 49 39 -234 -1 2 -153 226 -16 -102 209 -211 -210 135 -228 7 242 -176 178 58 -288 165 -100 -159 263
2467 263 -106 42 302 -298 152 92 -366 200 3 -203 422 -89 -111 318 -370 -85 194 -381 194 97 -231
2488 -231 309 -137 -243 230 -391 -46 308 -359 262 206 -429 351 -85 -361 379 -203 -63 497 -309 112
2508 112 271 -413 287 38 -382 428 -57 -127 516 -394 14 243 -515 265 185 -397 459 -14 -348 371 -290
2529b90J45N57p62M85J65o53O00k09l75P67o37P0O28q32M27J80p32O63j32m89
2549d24Q27m97j39O79o84J48L76p63O10O7n49P30l51k49N79n89J00M58o82M84
2569A31J65o55O89k82m16O78m76n7N69n52J94K81n56L66n2l79N54k72q1N15n29
2590a65J38K76n52M08L5m45N57j47k80M44l16l8L00m25K05J39l21M03j58k46L77
2611A89k93r8M09l57J19J83k67J58Kk77K88q2p7K64j29m2R3j73N5Q0j35J60Pp4
2635CJ34j63k3Q2j37P1J02j54J04R2j35qK4o5J1N7k5O4J7p9j4P1j38J30l8OQ4
2662G3j4m9O5j34N8N8j22J10k3j39K19n1j84K20j79l2K70k30K7K02j95J03Rj69
2686a07J53q6qK50l01P1J65l53L00Mk97L95j41k10L91l06j18L57l75J83K31m18
$$ plain form
2529 -290 -145 412 -350 135 300 -353 247 38 -337 430 -207 -137 491 -341 86 266 -466 197 65 -424
2549 -424 403 -94 -233 446 -238 -90 286 -477 133 200 -349 381 30 -219 360 -229 -129 329 -353 131
2569 131 296 -359 330 48 -368 310 -166 -223 346 -206 -12 269 -287 79 27 -352 202 -70 -151 364 -165
2590 -165 -27 249 -303 105 140 -305 252 105 -175 269 -47 -85 215 -210 -5 134 -187 216 58 -188 189
2611 189 -104 -202 207 -150 -31 152 -115 43 45 -232 56 -26 -103 161 32 -10 83 -90 -35 45 -90 70 77 3
2635 3 137 -26 -49 33 -104 -33 69 -85 19 111 -24 -32 -8 -73 -62 -5 -30 34 51 -28 -42 29 -109 21 -17 -11 73
2662 73 59 10 75 -59 -1 57 -65 45 22 -117 102 51 -133 87 -92 -124 146 -84 -57 145 -50 53 62 -107
2686 -107 46 -40 -48 202 -99 -28 137 -216 84 88 -209 186 45 -165 226 -80 -198 159 -216 -33 198 -220
2708b20L36n8l13M14l10p3M46l66J51K50n00L53L8m42M78j44k60M96l46k3L81
2729B88m83K04J75m34M04q7k91N14m32m8M27n37K75K77n18M04l6m07N64l19j59
2750b19N16m73P7L84n35L02N6l75M58k38j75N80m90K9M52o04K96J39n79N55Pm34
2772b71N93m19n6L65m59J91K93n01M40o5l22N15l70j08M97m85J00L54n32L09O2
2793A31l59L73j52k57N10l08rK77m32K08J33m07M64j53j61L66l14n1L65m21J85
2814a2K00m18L92o0k45L12k03j20L05k75J27J11k67J95J1k80L84j61j80L31k56
2835a09O8J87k71J08P5k57K84k5j93K86j55J9J59k89J09O1j97K74j25r7K83k35
2857d0N2P9j82P4O0j57J06K7j31J27l9l3J08j33J58qj53J76j45l0J56q2n3J26
$$ plain form
2708 -220 116 58 -255 159 -151 -224 222 -144 7 257 -243 110 148 -294 184 40 -220 276 -70 -93 288
2729 288 -195 9 184 -250 154 67 -224 290 -142 -190 237 -300 -25 252 -266 138 102 -305 259 -60 -219
2750 -219 297 -176 -99 285 -250 52 108 -267 191 -47 -222 358 -132 -103 349 -255 41 180 -399 156 163 -271
2772 -271 322 -97 -153 212 -247 -56 237 -264 176 111 -211 304 -66 -174 323 -162 -62 292 -240 69 131
2793 131 -228 145 -7 -264 246 -62 -71 206 -226 -18 115 -292 172 19 -142 224 -90 -141 224 -197 -12
2814 -12 188 -230 162 102 -143 169 -34 -154 151 -124 3 114 -153 42 53 -227 157 -4 -184 147 -109
2835 -109 -41 146 -125 -17 58 -199 85 60 -133 153 -2 17 176 -113 -4 57 -140 134 9 -88 195 -40
2857 -40 12 91 -91 -17 43 -114 -8 19 -112 15 -24 -57 51 -82 76 68 -85 91 -54 -84 72 -10 -63 63
2881F3o8M7j1j22O8J8n4J09n3P1n0r9J05q8J7O0q2N8J0q9J15m5k8N1l2l0J19r4
2909c4P5M1j40J29r3J0O0j03nJ42j25Q1L2j75J71n3j67K39j70R9N5k29K07qj42
2934a03J69p3o1J93j39k5J48k48J94L1k13J96j02r5K42k05K5K02k42J10Q6k78
2956a88K37o1j46K44j29o6K79l34J29K14l16K13k0j54K38j79m0K30k77J85O4k43
2978a20J85p9j29L16k80MK80l03P2J74k68J71J0j77K18j01j10K92k60M7K07k94
3000a45J48J24k83K77j67p4K39j66k6K77l22J26J05k93K36j7k07L34k12lJ43k25
3022a31J21P3j77J24l8j27K41j18j5J72k47R0J22k70K17l5k7J61j26rJ62k50M7
3045d0J18j65J23Jj55K74k09p4K60k30K4J62k17J67Mj75K15j11jJ52j70P1Rj43
$$ plain form
2881 63 -5 42 31 -91 -23 -5 -59 50 -3 68 18 -81 24 -64 -47 13 -69 -11 -1 -90 25 -20 -48 3 -29 -59 60 -34
2909 -34 41 82 -58 71 -22 -12 48 -55 -60 82 -43 38 70 -105 66 13 -154 85 -85 14 69 -160 47 39 -103
2934 -103 66 -7 -68 125 -14 -39 109 -139 55 86 -127 69 -33 -128 114 -91 -66 136 -106 4 90 -188
2956 -188 49 -12 -158 86 -43 -109 170 -164 -35 179 -137 76 56 -98 140 -39 -79 151 -126 59 123 -120
2978 -120 65 -14 -143 173 -107 -103 177 -126 -54 120 -148 23 33 -144 74 -27 -137 155 -105 -58 149 -145
3000 -145 3 127 -156 121 -46 -120 119 -47 -73 204 -118 8 113 -180 56 39 -168 166 -46 -49 94 -131
3022 -131 -10 63 -114 10 -28 -155 86 -32 -47 125 -122 -32 90 -180 37 2 -25 136 10 1 163 -87 -40
3045 -40 78 -87 36 37 -118 156 -53 -127 133 -97 -73 89 -128 39 43 -132 83 -28 -29 123 -47 24 33 -110
3069a10J47J2j05J48q9l4J17j75Q4L2r9P6j6m9J17j00N2P7j86J42J3j24K01j26
3093En8J78j78lJ56j91R0P8j82J61p0j8J17j50N5N4j45J07P9j72J58j16lJ28j67
3118h7N5M0j29J39N7j63J59j17j0J83k45J68N0k39K36q1q4K25j49r6J87j80N8
3141b3J69k58J37M4k17K54j43m1J86k17L3J58k40J97J0j84K52q3j47K58k05M6
3163a4J34k45J63J3j99K20l9j40K22j85L0J53k65K09P6l04L01r2j72K53j33j5
3185b9K13l03M7J84k38J97J1j89K16q7r0J77k03J15N6k48K33p7p8J72j70LJ62
3208G4j40J1J32j82J52L0j90K04j31l7J83j94N3P7j43J79J8k07J93o3j21K02j26
3231b6n7J85k20J31j5j41K22r5rM6j07P6P3j39N5J7r8J73j25j4J51j49L9J37j68
$$ plain form
3069 -110 37 49 -56 92 3 -31 86 -89 -5 27 -72 4 -12 -61 56 -44 8 85 -101 41 54 -70 131 5
3093 5 -53 125 -53 -56 100 -91 -1 77 -105 56 -14 -32 85 -65 -10 44 -101 6 85 -87 71 -45 -48 80 -87
3118 -87 -32 8 -121 18 75 -88 71 -46 -56 127 -118 50 100 -139 97 16 -68 157 8 -88 99 -81 -23
3141 -23 146 -112 25 69 -148 106 -37 -78 108 -109 -76 82 -158 39 49 -135 117 34 -113 145 -60 -14
3163 -14 120 -125 38 51 -148 72 33 -107 115 -70 -40 113 -152 57 133 -171 130 38 -134 119 -14 -29
3185 -29 184 -119 -72 112 -126 71 82 -107 109 22 -68 109 -94 21 77 -171 62 -15 -93 79 -91 -88 74
3208 74 -66 -55 77 -105 47 77 -113 91 -40 -77 106 -88 -35 42 -101 78 96 -111 82 19 -102 100 -26
3231 -26 -83 102 -118 13 -2 -143 79 -16 -25 21 -86 -10 63 -76 -21 -4 -102 71 -54 -68 83 -66 -27 110 -58
3256e8J02L4j62J61r2n5J26r6K9J24j90Q5K2j06P5Oq0J02r7L3J12j81J35J1j25
3281h5J44q2m2J59j59L7J73j96J20j7j91J85p1k8J41j28jJ06k35J70pq6J46j16
3305f3n3J67r4J1J29j66R7L4j18J04rm7N8n3RL4p4J6O2j05J27n9m2J06j09KQ2
3332D6j50J49M3j49J16p6k7J27j27K4J22j84J32Nj06J41Kj59J86j41j8J46j63
3355f1N5N2j53J80o4m8J25j48N2Nq9J25k7r8P1J8pQ6j30L4J31j65J17Oj29J56
3381I4j28k0J66j26m4J38j16N8K2r2J06n0l0O8n9jJ14j99O9N6j51K15q4q6J41
3406F1n0o1J00j19K3Q5o3P1l1k6O7p0m5J16j40O6R1j79J22L7j06O1j4m0R2j35
3432h7N3O5q6K6K2kJ08j06j9J01r9M6K7j34R2ro7J19p1m7J78j70P7K4j14Q6j4
$$ plain form
3256 -58 44 78 -84 77 -15 -70 56 -40 -11 113 -77 8 30 -76 -1 5 -75 27 -70 -37 75 -106 29 40 -85
3281 -85 59 -23 -65 94 -65 -28 145 -51 69 52 -139 46 -25 -53 88 -40 -41 65 -170 0 -7 -93 53 -63
3305 -63 -116 51 -43 -32 97 -69 28 62 -56 48 39 -8 50 -3 6 40 -34 -18 44 -61 66 7 -35 71 -38 -36 46
3332 46 -104 45 88 -61 55 -21 -48 79 -48 -24 98 -86 46 51 -55 86 88 -71 115 -26 -44 102 -61
3355 -61 -6 46 -107 73 9 -39 86 -62 -10 -5 -94 31 4 -94 -23 -5 -12 74 -56 -22 109 -56 61 67 -62 94
3381 94 -34 -54 112 -14 -58 80 -36 22 44 -48 58 8 -22 46 -13 -14 100 -99 -30 26 -125 90 6 -80 61
3406 61 11 -50 50 -69 -46 39 -24 47 16 -10 57 -13 -58 58 -82 -16 75 -104 18 55 -51 10 -4 -44 48 -87
3432 -87 -34 31 -55 -29 -7 -9 99 -7 -26 75 -24 22 49 -85 7 -2 -69 50 -21 -68 110 -60 17 41 -73 13 -1
3459ao9J01j05K7J23r2J6P8j78K08o3j21J13o9J8M5p1M1M1j20J05Pp4J07r6l0
3485e9J27j32M6Q9j70O3K4n1J48o8n1P0j09L1L5k9O2j0j30K07j07KJ16j60Q3K4
3511E1o2P0Kj51J56o8p4J17j03M2M1p4M7j8o7J06q3L2R7j15J5J20j82P5M3p7J74
3538A14j39p5J30o4pN6m1O0mj13J08n4L3Q4j48K1J36j63M1L7j37J94l7r2J43r7
3564a4l6R3q0N3j1m1Q2m1n0Q9p7O9K5j10L7Mo0R6p3K3P5j14M7Om5R2J9p6K7qM
3595EO3n9n7J43j32L7M2p1Q5j4r9J01j08J01j4o2R0m1p2J01j3q1P1l7j5M8o9Q6
3623B9Rn4L5Kn9P6K3l3K3p1M8J0q2J03r3m6J20j07j5J36j27P6J4q3J04n0JK1l5
3652b5K9np1J23q5j2N0j7j0Q1o5m4J19j66R0N0p5M2o8J7J03j12N6M2n2N0oj17
$$ plain form
3459 -1 -70 31 -74 -47 76 -16 0 78 -100 108 45 -76 37 -32 -14 31 -40 1 42 -78 27 34 -40 67 -29 -59
3485 -59 68 -64 -18 71 -99 -36 -12 -63 85 17 -34 36 -73 -42 -7 -36 26 16 -114 93 -14 -12 104 -56 27 51
3511 51 -11 59 61 -90 66 -2 -76 41 -62 -20 21 -53 -6 -24 -91 15 -68 -36 61 -54 -39 81 -101 -26 17 -60 114
3538 114 -25 -100 30 -34 -41 15 -26 34 30 -83 25 -29 4 88 -60 -39 97 -66 -25 12 -125 69 32 -60 83 -14
3564 -14 -50 43 -37 16 5 -36 46 5 -45 44 -33 36 61 -49 -12 -8 -68 28 -45 -22 53 -61 -14 -8 -53 39 58 -18 9 1 5
3595 5 68 9 -48 95 -37 0 42 -29 56 42 -57 44 -64 37 23 -39 51 10 -62 39 26 -55 16 -21 -36 12 -57 29
3623 29 38 -16 19 21 -38 38 61 28 51 -20 28 38 -44 59 -34 -80 40 -67 -82 54 -73 3 17 -66 38 -12 -11 10 -25
3652 -25 4 -1 -72 51 -34 -46 4 -13 -23 58 -7 -51 68 -98 -8 42 -33 9 -59 -42 61 -51 5 47 -5 45 39 -78
3680g8Q3Ln7P2q5P3N9j30J12m0j02J46n6r6J45p2L5J3n0O4N8j70R1q9J9R7p8J7
3708a6qJ3L0k0l7M7ll3N4p0M8L9j03J08k1p1R7n4p0P2m9J5P6n0K6Qj12J03nq3
3738f9O2j4MP9j10M6L1r3J03Lp5J04o4n3N6m5J3K4m6J06m6m1N7q7J6O1o8K7R2
3767G3j49J05m6KrJ1p2J70j14J3R2j34J23k9r9P7k8j0L6o4P9J7r4L4M9p0J23j18
3795c2K6J20j52M2J6p6N1k1l1R1l3n8P0k5PO5j63J03M6p7J43r3r8J26l3qL9r5
3823e0P8K4q6K4L3n8Jk8Q6Lm9pP2m4N7n2pM6p9PN4J2n5N4p5P6n0M5j0n6L7K5o9
3856d1P1Lk8P6p5j2Pj9n5P9p6R6N0j14J03j10M4J6o4O8k6k3Q5l9k7Q1r9K5M4k0
3886B0n6M2j4P7q5lK9nk6J8k6L9ol2N9l5L6j5o3nJ11j34R3L9j01R7m4k2L8q0O1
$$ plain form
3680 -78 5 8 -49 23 -62 11 70 -60 52 12 -90 56 0 -96 49 -23 12 25 -25 39 97 -73 18 -71 -52 45 -33 -16
3708 -16 -24 -11 19 -1 -38 9 6 -27 27 -43 5 44 -59 49 28 -43 54 0 -70 2 -47 -32 44 -6 20 28 -84 19 14 -69
3738 -69 -7 -21 -17 62 -48 -2 29 -64 39 42 -33 71 7 -46 10 -35 -22 2 -44 62 16 -25 32 -55 -39 22 -46 -19 73
3767 73 -76 29 -17 -15 -24 -13 -85 85 -29 -16 76 -58 65 36 -63 14 -14 -24 12 -52 27 44 -50 -16 33 -37 86 -32
3795 -32 -6 114 -38 4 20 -56 -5 -26 -57 34 1 -57 13 -12 -5 60 -103 0 46 -31 112 19 -79 47 14 6 45 -50
3823 -50 28 52 -34 -10 23 -35 -34 -62 24 27 -22 -29 43 -1 56 4 -3 43 -36 -29 25 37 -18 36 -39 37 -13 32 22 -34 3 28 -41
3856 -41 30 33 5 81 6 -6 1 -18 -73 6 -70 26 76 -38 65 -45 -1 15 -49 19 -7 -30 55 16 -11 70 -29 -4 40 20
3886 20 -36 6 -8 69 -16 -19 10 5 -21 -3 -29 10 4 -28 31 -4 32 17 -46 -51 60 -74 19 58 -43 54 10 -12 26 -54 7
3917GJ7k1J7k5n9P7l9j2N7p7nJ40j10MO3n6%K2p2M7N5m1K7n3L5J5r1P4jm2J23
3948G6j43L5R4q5K8J0k8O7j7j03L4O4m6k4MLM1n8N6N9j24Q4j5m4J10q7J9np6R9
3978B8j0Jk2M0m1K2m6k1J02j23ON1k7Q4r8K7M3K0q2N9n0K0Rj0K7Kk1L6k0J9Ll4
4010fN2n9j3N5k4JPJ4m8M5k6Oj5rK3j0n7Q3k4j9Rm2P7k5q3J30k5m1R0p0K0M1r4
4043c7N3l0k5P4m5n5Q3m3O6lo7n3P2j8O5q3K6L4l0j9O6n3rN2j22J12j5l2O5k3
4073Fl9O5k1mk0QR8j08n3O2n3N9J5k7R1n8r9Q1n5oQ8l8J1O4j02Q0k6o9J01m3l2
4104b4K2n2M4N0n6j2N4n9J5K0q2N4LN1j2n0K3Qn3P6k2j6N5o8rN3o1N1L7k6j4k7
4136b7k2P6j9l3Q1j38P0J9o6J13o7jJ03j11pJ7m6Q6po3K3L2p8J00j4m3N4p3K8
$$ plain form
3917 7 24 3 20 -5 -64 13 -26 -38 19 -58 -63 77 -33 -29 34 -22 -22 0 -72 -25 30 -11 16 -37 -2 13 -78 -4 -5 -47 76
3948 76 -67 -32 62 -23 5 15 -13 54 37 -66 -32 32 -14 -38 -34 -31 10 -48 8 67 -57 27 12 -32 78 -9 10 5 -71 28
3978 28 18 19 -3 37 -4 18 -28 -49 53 -70 -64 -13 -40 44 -54 -27 16 36 -46 13 -37 -17 -8 -18 9 11 -10 26 6 25 28 -6
4010 -6 46 -13 -26 29 5 6 13 27 -21 24 -2 4 -11 -20 3 -7 -64 19 -5 -24 -15 -57 20 -5 -88 42 17 -24 66 -4 16 57 -37
4043 -37 16 -14 -39 35 -10 -65 18 -25 41 38 -29 -82 -10 -28 37 -46 -20 14 -16 -35 31 -22 -31 21 -101 11 -4 -36 29 6
4073 6 -33 32 11 7 -13 -5 93 -15 -68 -6 -59 0 15 -12 79 21 -78 3 -52 -58 30 -8 3 67 -35 45 19 -50 51 8 -24
4104 -24 -2 -54 -10 40 -16 -28 26 -33 -18 2 -80 -26 -23 28 16 -34 -11 -3 -56 20 -2 -18 37 -31 -40 13 -48 3 40 14 0 -27
4136 -27 -49 27 8 -25 56 -82 -12 7 -59 54 -13 -14 89 -22 -29 -12 -58 28 21 -42 -19 13 -65 35 21 -22 32 -41 -13
4165a3O0n1nL3k3P5o9n8R3n9k1P5rJ5m4j10J07Mk6Q5k9l9N7p2L2rk9P2l4o0N7
4196EM7j03R9n7j8J8L2K1p8J3OO6o8J8o3N0rQMKK6j6K4m6J3k8O7k1k1L1k9k5J9
4229a3K5l6N7k7kqqP9j26O3L8m8J5K3p2K9knJ8l2L3M8r3K1J14p4K3k5l7O6n3O
4261cK4j7l4j8O7p0N3k6J7nL5Kqk1N9j01Q5mq0P2k6j8N3m8L6J1p2QK2o8J24l7
4293A2n1P7r0N8pl7L7k8oJ08n6q4O7j9L7l2n4J03n0j1L6m5J5L4n4pK4L9j2K2q4
4324e8N6L4n7N7Ll0Kj4K8L2j18J06o2m2P1K2k9Jk1pJ8k6K9Nn3P0n5lM4jl9L2M1
4357C6m2j3k5P1j8m9N4k4M4n3J1l1M2n1P9l5q0J15j7J5l2m3M7Nl3L5pK3o0O0k4
4388@L9q3O8L0j4k1l3mNn1M8K7k7l9K8M0n4L7M2l2j8N0m4O4k7k1pJ4J6l6K3q2
$$ plain form
4165 -13 47 -4 -9 24 1 76 7 -51 42 -17 -38 37 28 43 -1 -111 -4 0 -26 59 30 -9 48 -24 8 -1 -30 42 8 -52 5
4196 5 52 -51 48 -9 -27 -9 23 44 -34 -21 -15 51 -17 1 -62 -12 -21 -13 -9 -7 19 3 27 -19 -6 -34 33 12 -9 22 -7 -32 -13
4229 -13 12 -24 33 6 4 -4 -12 67 -59 4 42 -6 9 32 -40 -11 -13 -18 0 -32 1 49 -44 -23 91 17 40 15 -22 44 -9 -3
4261 -3 21 4 -30 -48 19 -51 2 -24 -7 -12 23 25 17 -4 55 -46 39 35 -45 27 1 -17 36 -12 24 35 -37 -29 -7 -75 49 12
4293 12 -39 38 -52 6 -1 -38 -1 -29 -35 73 17 -67 0 -19 18 -14 -68 35 -15 -26 10 -35 -20 14 -40 -47 -23 16 4 26 -58
4324 -58 -2 32 -25 32 35 5 7 -7 21 53 -65 41 -21 -63 8 30 1 2 -19 -26 -8 -34 -5 0 -53 17 -38 -41 3 2 -37 -5 36
4357 36 -6 -19 -44 27 9 -40 14 -10 34 -19 -8 -39 3 -48 31 -4 -84 31 14 29 -3 -46 1 6 -27 8 1 24 -36 24 0
4388 0 39 -44 24 54 40 19 -14 -18 -13 -64 -16 11 -16 -55 -27 13 -41 -4 38 6 -12 38 -6 58 31 10 3 17 33 -3 20 -62
4420f2J02k3o4Q3q6oMM5J1n2LM3Nl3L1L3n3J7m4J5K5k0j7Q0o0K5nLJ0n9J11o8
4452fl9O8j2p2N4L3m0K5mK1m1l1L7k7Kj0N9n3P0q8M4O0k5k3rM1ql5lM7pq6P3p1
4486e6N1K5Jqk6j1M3o6K9M0o7N9J2o3MN5l3mKON3n0Kk2nK6j6MN7m1o6O7p6M7n
4521c2J0%lj5K7J4l6M2J7j3K4n5L0mlN3k1l6J3l2K2k3JM3Po7N0m8j3K8mN6p6L
4555d1R4p5jN3n2M2k3o2J38j02K0j4J7j4K3rj6L1k3m2P1oKnK9k7Lj6K2j3j5K7
4587A6n9N4j8n5M5Pm1N8Lk8ll1N5ln3K6L2n9P6j2j7mj0L9Mrn9K9M7p1J2MJ3l4
4621d6L8Jm3O3K2o2K7J1l6K5poKM6k0n9J1M8l5K9Qn5L4pM2m3K7no9N6m1J11l8
4654B9l7l1K5kj2j9N3k5J4lL9Pj4k9P4m2m6O9r5P2Qo4j0N1j7L1k1l3M3k3k4K9
$$ plain form
4420 -62 40 17 -47 36 -50 -56 -52 -7 4 -48 -45 -2 3 -30 1 34 -19 -2 -46 -31 -6 -26 -43 37 -23 2 -3 0 10 -49 62 -6
4452 -6 -45 23 11 -61 -7 26 -14 11 7 28 -13 -44 -7 -34 -32 -42 17 -36 34 -54 -10 50 25 2 -7 34 26 -9 -12 35 28 -58 15 -56
4486 -56 -5 20 21 13 -13 -24 19 -47 -18 22 -45 14 26 -37 -33 22 -11 -15 -13 -7 46 -4 -2 -24 -29 -3 -19 -15 42 1 -65 2 -74 -27 -32
4521 -32 -22 -22 -25 -40 -13 1 -35 7 24 11 35 -20 10 6 3 56 35 -1 12 -20 2 -21 -20 23 30 -37 13 -35 -48 -20 -24 32 -44 -41
4555 -41 53 -22 -23 30 -22 20 -3 -65 73 -29 -9 -23 -6 -20 3 -6 -22 9 -14 -56 15 9 11 6 35 8 11 -5 17 4 -11 16
4587 16 -43 11 -7 -62 -17 -10 -51 7 10 -18 -21 -52 3 0 -53 -27 5 -54 22 10 -7 -11 -21 18 22 13 -46 -17 30 -41 -29 -25 -12 -46
4621 -46 -8 -7 -50 13 35 -27 0 11 -25 0 -7 -13 -11 35 15 -44 -33 15 -20 9 17 -38 -4 -11 31 -12 15 10 -59 -3 -44 67 29
4654 29 -8 -39 -14 -16 -28 -47 6 -19 -5 -8 31 38 24 -5 69 27 -19 50 -45 27 35 -29 -39 12 -5 26 5 -28 15 -8 -32 -3
4686cn2P9q9L8L8l8QM6l1m7j2L3N7m4M2J9n5m6N9K2lJ4m3M1m0rJ4k9k6P1l1l1
4718d8N3k5j7J04j14P0J0k6l8K1n4M3O3j2on1K4Mk4J6l5L8j2j4mjnN2l8MJ7m7
4750e2Q1Kj15P8j9j0N0n2N6Ln9NR2q3L8j3o2P7k8n7J17l2k9M6p5J0N6q9N6j1%
4781a9K7k7L0O5m0K4m2k7pO6m6Om5J2M1n9O5%k6Jnj4Q4o7j2K2m7J2L9k5K0J0k9
4814a3L9k9o4Q9q3Q0nj4J8j3o2Q1l1p0P5j3j7k3J03k1k4J6l0k3K9Oj2K1k3j2M3
4845A8%p0O3j5Lk4J2M2o5L2K1k6k2K5Jl0O3r3L0N9m4M5m4%L7J5o2M3K4n7L4p7
4877f2N0J2k0K6k7M2Mo7M0jk7L1L4n9OQJ0M7n2l6M6k2j0l4O6k5NJ5K7p6rQ4k3
4910CK3k6j5LN0l9LJ9m1K8j5j8QM2k7K1j7K4n2qM9kPk6M4m4m1j4QJ9oM5ml1pK5
$$ plain form
4686 -3 -55 24 -65 -27 11 -27 -19 27 -4 -51 -63 -30 27 -17 25 44 -11 -57 2 24 21 35 -8 33 -7 -16 -2 -31 -57 14 -17 -48
4718 -48 5 -20 -37 67 -47 23 33 7 -31 -10 -64 -21 42 30 24 -27 -3 1 -23 -7 -42 -4 -16 -30 -34 -35 -40 12 -26 -22 -5 -52
4750 -52 29 31 -84 -6 -25 -35 15 -37 19 22 -37 -32 60 -23 15 2 -60 17 -11 -68 49 17 -12 34 -41 -31 25 -64 -8 -19 -19
4781 -19 8 -19 11 76 36 60 18 -9 -16 50 4 10 -35 -23 18 -41 24 24 -2 -1 -6 -20 64 -3 -15 7 -40 -28 11 -14 6 16 -13
4814 -13 26 -3 -67 22 -61 19 14 0 18 5 -57 24 -7 -77 -2 -15 -32 -55 48 27 3 19 -11 -34 -5 1 -11 10 -13 -25 18
4845 18 18 -52 11 -4 -1 -25 -13 29 -36 -4 17 -9 -31 -6 -5 -35 28 -65 -35 24 -20 25 -19 -19 18 33 -29 14 38 -19 15 -62
4877 -62 -12 0 -20 6 -21 21 25 -42 -2 -3 -30 1 35 -24 -18 -10 0 47 -5 -41 5 -17 -27 -61 5 -20 -15 0 27 -49 -58 26 3
4910 3 26 0 -15 -12 38 -1 2 21 -20 8 -7 -25 -17 25 -2 19 2 26 -26 -34 15 13 20 -6 38 -6 -47 -61 -53 -34 -40 5 1 -30 -37 -12
4946a2Qk2L4pl5L9L5r6QL5kK7o6M3L9n7M0k3rkNNK6l5J1K6K7o9M6j0Pl1J4N3j12
4981f0N6L5p1J8L7r3J15m6k1M9q7M1%J2j2K5k1LL8k5P8p9KM5j3m2J2m9K7M0ml
5013Gl0j7R2j0p4M6o0O4Ml6N7j3p4L0K2%Ol8L7J3n2L4Pk4O4n2l5L7kL9n4J4NN0
5047E7j19N9PJ5j4m8N7lk2K0j0n7Q6j7Mj7oNn%K4m2oN4o4L7K0o3O8l7L6l6L3j3
5081Ck1Rm7K8j2M8J8n5%J1K6J1nm6M9n6N6j7JK9o2KM8l6J6K4k0m8LN4l0Rj0M4
5115B4k0kKo3K5J9J7m2L0m4N3m6M1L1q7M7M3k4M1l3j7M5k2l6J1J1M0j0l1Rk1J8
5147INrL3l0m9M2m9L2M8p7K3L9m8Q2n7m1K5K4k5M6m0L4l0nJ9K8m1l1M8j0rJ7l1
5180b8P4j06M5J0lM1j6o3J4M0n8R1o0pj5N3J0m6nj3O0K9m4J2l1J18j22K3l5L3
$$ plain form
4946 -12 -4 -26 8 1 -34 5 40 -56 -48 -13 -15 12 -54 -11 28 -29 11 -12 -21 -23 -18 -13 13 -22 -11 15 42 -27 19 9 16 -15 -1 52 -60
4981 -60 -4 31 -40 -22 15 -78 37 -9 -30 19 -68 -27 -27 -15 -27 -2 -23 -20 18 -7 71 -8 -6 39 26 -16 -4 -53 -26 14 10 7
5013 7 -23 -40 52 42 -32 14 -46 18 22 -14 43 30 -44 -14 8 8 14 -24 13 26 -26 8 15 -9 55 3 -32 5 3 42 -12 2 7 57
5047 57 -62 -3 4 19 5 -43 14 11 -11 9 -1 -58 28 11 15 -2 -8 -3 -8 -8 16 -26 -32 22 -42 -5 15 -48 20 -17 19 -17 16 3
5081 3 -18 -9 -56 -28 -40 8 26 -29 -29 -18 8 19 14 -32 17 -39 17 0 1 30 -32 -30 18 -18 -2 22 2 -46 -43 11 -19 -10 -20 24
5115 24 4 2 4 -59 -34 -15 2 -40 -10 -54 -1 -47 -6 25 -62 -15 28 4 45 12 -5 40 18 -18 -7 4 44 34 3 12 -9 9
5147 9 14 5 38 8 -41 1 -48 -16 32 -45 -22 17 -31 51 -6 -47 -22 2 -23 23 -17 17 -13 -18 1 29 -12 -43 5 -5 -14 3 -28
5180 -28 46 -60 -15 -5 -8 33 17 -46 -32 8 -50 41 -19 -26 -41 12 22 -24 -29 -42 18 47 3 15 -16 102 -20 3 -32 1
5210AOL0Jn1k5P1k4n8j3P3m1K2Ll9M0K7m0o4M2P9q0K1OKj7N1j1M2n5rpN2k9qm7
5245d9j0Q6n8P1m3Km3P4Lm8K7J1J3rj9jj0N0n9L5k5j7oO4l0j0k5L6n1lL4j2K3
5278Aj6K7j9j6MJK2NMKj0k1k6kL2RL9n6Rk5K8j4L6p7M0L5J3ol1K1j4k6L7kJ1n9
5314d4J7Q7l7L0q7P0o8j8M4JoJ5K1nj8kL0l1k1K5ol0K4L1Jl4N4m2J6l1qLj9O2
5348B4Kn6M7m4K9K6l7qRk0K1L4m7K3J9r4K8K3M0m8M3k2K6j8K7j1o3M7rl3N3jj
5381IK3p0P6j0l5n5M4j0N0p3L8M7l4mk3K0J8n3RK8k9j5N8m6P1j3k1Oj5j3L3p5
5413f4M3kL2j6j2NK4Po2M6L9m5PN5j5Ll3Qm6j6J0L2j2nK6o2k5N5lK7RPnm7L7L8
5449D0m9nJ0J0L0n2L1kk1K9q9N8Rl8N7j4j3qO8o6L2k0J7J4l5OqK5j3k4j3KM0l3
$$ plain form
5210 1 7 37 38 -13 -38 33 9 -49 -62 11 -30 -8 -5 -44 -4 23 -17 -81 -39 40 -40 -19 -13 -11 -28 23 12 54 -1 -10 -17 35 6 -2 -49
5245 -49 -59 27 -31 40 -3 -1 -44 30 33 -15 12 23 36 27 8 7 -3 47 -12 23 -2 -19 -25 39 9 -1 -26 10 -41 -44 -10 -22 1
5278 1 -15 12 -7 -23 -19 -18 4 9 13 15 5 -16 -42 -44 -12 -3 36 -20 -11 -36 -8 -22 14 -63 -23 12 25 19 -12 9 -5 -31 6 4 15 -44
5314 -44 -27 60 23 53 -34 36 -32 -50 -6 -5 -11 4 25 20 2 0 30 -1 -22 3 -3 -33 -9 22 23 -11 43 1 17 -14 -22 -19 -38 24
5348 24 26 -30 17 -27 2 28 -9 -17 -8 -28 -7 27 -20 3 22 -72 -44 -21 19 -29 14 -8 18 0 27 16 -47 0 -9 -42 11 10 9
5381 9 32 -38 38 28 -7 -62 -18 -28 22 -51 -13 34 0 -4 -27 -7 11 -42 -33 -5 -34 -49 9 -37 34 21 0 6 -9 -22 11 -64
5413 -64 -21 -23 9 -7 -19 -14 10 17 -45 1 40 -5 2 57 42 45 12 20 -26 -42 -32 0 -12 -17 9 -53 -78 -23 -26 1 10 17 12 -35 2 40
5449 40 -9 -14 -4 6 36 -16 15 13 -8 21 -68 -10 -1 -39 18 4 -9 -17 51 -15 17 -3 14 28 -7 -1 -9 16 3 -21 -34 -32 8 -25
5483b5O1l3j5L5n4J9mJ3K9n0nM7o0mL3QL8p1O2Nn8N1l9l4M2KJ4L5m3m8O7m6kN0
5517B0l4RJ1%N1n1Onn5L6J7nn5M6J9J7ql2L0K3m0k2O0n7K0k1Om5N8J5nJ2qK0m8
5552a5Nk5J8L2j2nj3K2n8QRnJ3l1M0K9K0m8N7l3m5L0rJ2Oj9N8p8K6j4M2j8kKm7
5587d8M0K5M7o5pL9l8L8p7M1k1M2j4o6J23p5rK9J7L9p4M1r1M5L6J9poK5l7k5L9
5619B5o0K5j4J9K3J0J6j5k8rK1k6L6J1n3N0j7j2L6n4L4J4q5R2k6Pk6l3M5kp4M2
5651b8j0k4Q2m6Nm6K3j7R0j3j5J8Mk3q0N8N7j4o1N8o1M3L4n6J0J6m5L1o1J04k4
5682IJrKk5M5J2n1P7k4Mn8L0j1Lk9N6k3lqj9M6mQn2L9n8K7J4L3m2o1M9P8n0p2
5717f6O2m4Q5p1k2L9ml3L4lMJ2k4nK2L3q6M6NK5j1Jj4J0jl3O4J0l5J0j5l4M1M5
$$ plain form
5483 -25 36 3 -12 23 -31 -12 -16 -3 26 -24 -29 18 -42 -46 -13 -5 33 -38 24 29 -29 22 -17 -51 -9 -7 7 42 -1 -49 18 -28 -30 20
5517 20 -14 -5 6 6 57 6 12 7 -48 -12 5 0 -55 -9 10 27 19 -13 17 40 0 -22 38 -19 1 -20 -14 -59 -1 14 9 21 13 33 -15
5552 -15 -10 -35 -17 15 3 -2 -15 7 -51 -43 -34 -39 -26 -57 -17 12 32 -16 41 8 -37 -7 -16 -4 2 -17 41 -37 -11 -25 17 -1 -3 -1 -48
5587 -48 -8 17 64 -1 -8 31 -7 31 -46 -5 -26 16 2 -64 59 -16 -25 4 21 60 -14 27 -64 -19 17 36 29 23 48 11 -14 25
5619 25 -35 -10 -24 -5 18 28 44 29 1 -8 13 -13 23 34 -19 31 14 2 38 -16 18 32 -53 39 13 20 -6 -39 6 4 -70 -28
5651 -28 -38 -62 20 -26 -21 -67 -44 -61 29 16 1 19 23 0 -80 -22 35 21 -40 18 -43 0 34 -22 -12 4 -41 -10 -71 33 9
5682 9 10 1 3 -22 23 35 -16 61 37 41 -17 13 2 5 -24 32 9 6 -2 -21 25 21 29 -23 16 -42 -15 -1 32 -10 -71 -22 56 6 -66
5717 -66 -4 -48 37 -34 -56 -17 -21 -54 -20 -23 -19 -7 -31 -36 -14 19 -67 -21 -16 9 -2 -1 -15 -5 -6 -39 25 35 0 10 -5 -39 2 47
5751D7k8Jm2m7K9N8o6%kJ00o0m7J40q3Lj2oK8jn6M4k8j9N6Ql6M6k7k2M2p1K9M4
5784B2l4KJ6J6k1J5m9LL1j6L1l6J9j7K2ok3J5J7J7j3Pl6O0m0o1P7J3n0J5LrPj5
5818a8N6lj02P6n1K7J5KJ0m6RL2j8mL2p9M8J0Nj2L6mj2k6J5J6k6l9O4o5P5m9J
5851b5LJ0rQ3m4m8K9k0RN5l5K2J3jn9l1P2k8l1N0K2q6O6l3L6rk1j5P8j9k7K0m4
5884a7l2K2K0L2p0L4Ljk4O6j1k7%Pj7Ok5j2NK0j3M3k8M8m0l7N7j5Km0M5j0Ql4
5918c5L0l0O9k4l5L1lj3jk1L3m7KK4J7K3J1o2J4oK1K6l0k7K3K8m2M4l7L2L1j03
5950e7M5K9o0L8L2j2J6k4m6K6m3L0J8l6K6K1j0KK3l9L8m9N6m0K8n5L4j4Q3r8n
5981d3J01r2mN7k3j9L6m1J9m6M8Rk7KK0Ooo0M5J5k1K2Qj2l3mj2M5J8j9k3P0j8
$$ plain form
5751 47 19 20 -22 -69 -40 18 -48 -48 -50 50 -10 -57 83 0 3 -9 -15 13 12 -44 0 -28 -47 9 17 -19 27 0 -22 20 -51 -22 22
5784 22 -12 -10 6 22 1 16 -33 -30 1 -15 16 -20 -1 -18 4 -2 -25 -10 7 24 11 18 -18 42 2 -59 18 31 -19 -4 -1 -10 -3 -18
5818 -18 38 35 -67 9 -42 -15 0 2 12 -34 -25 7 -11 -15 17 -62 -14 -4 1 -11 25 21 9 -17 -2 14 -12 -51 13 -52 23 -26 -25
5851 -25 -22 -12 -21 62 18 -30 -1 -21 -12 43 8 30 43 42 -17 -48 24 -4 -35 15 37 -49 17 -16 20 11 -10 -25 53 34 7 27 -17
5884 -17 -49 -27 -7 25 -45 -11 -8 -9 -33 33 22 -5 -5 2 -15 -9 -34 -46 -41 -21 -34 9 -19 29 -11 -48 9 -6 -4 -44 1 -9 -1 -35
5918 -35 -5 -35 34 10 -25 6 3 -10 -11 -32 1 -46 -44 -20 -3 20 31 -31 -17 -23 -2 24 -6 -33 -10 18 -24 20 -17 15 46 -57
5950 -57 -12 17 -43 -5 27 15 31 7 -39 -13 -56 -26 -8 -44 -18 3 -7 -5 18 -21 17 -32 24 -16 12 -43 -9 -23 60 -38 -43
5981 -43 58 -34 -38 19 -4 -23 13 -28 -9 -55 -7 2 -25 -23 -3 3 -3 -63 -18 -3 -24 -2 6 -6 -39 -43 -55 -10 8 -11 -34 36 18
6014A8kN1p1j0k6OM0%Oo3P9l6J6j9j8M3jJl9j9M6J2km2J0J1j2J5J8k3l0K6kk7
6048d4pJ11l8On5k4k7P2M8o9K4j6K7k4J0J4O1j10J0j9K1Nj9P9po3JM0j6PrQ3l1
6081D1r6R1Mn2J5J1K3o3L0%Qj0Qm5K6l2L0OM8j01N4j3j2K0k3lJ1L8l8L7k9j5O8
6114C7j8p9P5%j8l8M0%kMJ0j9K2k5k6kNk3O8jJj3k4l8M6k8j3N6l1N7pj4j3nJ4
$$ plain form
6014 18 16 67 -4 -14 -40 -34 6 6 12 -51 28 -8 8 -11 -29 14 13 14 -25 -44 2 14 12 -30 -20 -9 -21 -6 12 -11 -41 -15 -17 -44
6048 -44 -51 60 22 28 -27 -51 -78 -6 42 -27 -3 -19 8 -16 -6 8 69 -41 -31 -50 -29 -24 -43 36 29 -34 -33 7 -9 -2 -11 72 41
6081 41 -55 36 40 -12 3 14 37 -26 4 4 12 2 10 -35 -9 -41 -11 -5 43 -58 -4 -17 -29 -9 -32 -35 -24 14 -24 13 -16 -31 37
6114 37 19 -60 15 15 -3 -41 -1 -1 -3 1 11 -8 14 -11 -37 -39 -34 -57 11 10 11 -2 -26 -64 -18 -46 -59 -3 -34 23 16 2 -11 -16 -2
$$ [...]
8191c1
##END NTUPLES=NMR FID
##END=
