##TITLE=1H_LY-Dixlofos.P.3
 CDCl3, 8 sc, 
 28.10.2020
##JCAMPDX= 6.0         $$ Bruker NMR JCAMP-DX V2.0
##DATA TYPE= NMR FID
##DATA CLASS= NTUPLES
##ORIGIN= UXNMR, Bruker Analytische Messtechnik GmbH
##OWNER= root
$$ XWIN-NMR		Version 3.5
$$ Wed Oct 28 12:52:27 2020 Russian Standard Time (UT+4h)  she@DPX200
##.OBSERVE FREQUENCY= 200.1315066352
##.OBSERVE NUCLEUS= ^1H
##.DELAY= (6, 6)
##.ACQUISITION MODE= SIMULTANEOUS
##.ACQUISITION SCHEME= undefined
##.AVERAGES= 8
##.DIGITISER RES= 18
##SPECTROMETER/DATA SYSTEM= spect
##.PULSE SEQUENCE= zg30
##.SOLVENT NAME= CDCl3
##.SHIFT REFERENCE= (INTERNAL, CDCl3, 0, 15.7039)
##AUDIT TRAIL= $$ (NUMBER, WHEN, WHO, WHERE, WHAT)
$$ ##TITLE= Audit trail, XWIN-NMR		Version 3.5
$$ ##JCAMPDX= 5.01
$$ ##ORIGIN= Bruker BioSpin GmbH
$$ ##OWNER= she
$$ F:/spectra/data/she/nmr/H-F/1/audita.txt
$$ ##AUDIT TRAIL=  $$ (NUMBER, WHEN, WHO, WHERE, WHAT)
(   1,<2020-10-28 12:51:23.62 +0400>,<she>,<DPX200>,
      <created by zg, POWCHK disabled, PULCHK disabled
       configuration hash MD5:
       00 E9 B6 7A A2 85 ED C7 34 08 36 98 17 FE 4E 26
       data hash MD5: 16K
       C8 2C CD 41 20 B8 18 51 4F AA 94 6D DD 70 EF 11>)
$$ ##END=
$$ 
$$ hash MD5
$$ 83 D9 5D 7E BB 31 ED D8 93 A4 91 BC 3C E7 BF 3F
##$RELAX= 
##$RELAX= 
##$RELAX= 
##$RELAX= 
##$RELAX= 
##$RELAX= 
$$ Bruker specific parameters
$$ --------------------------
##$DU= <F:/spectra>
##$EXPNO= 1
##$NAME= <H-F>
##$PROCNO= 1
##$TYPE= <nmr>
##$USER= <she>
##$AMP= (0..31)
100 100 100 100 100 100 100 100 100 100 100 100 100 100 100 100 100 100 
100 100 100 100 100 100 100 100 100 100 100 100 100 100 
##$AQSEQ= 0
##$AQ_mod= 1
##$AUNM= <au_zg>
##$AUTOPOS= <>
##$BF1= 200.13
##$BF2= 200.13
##$BF3= 200.13
##$BF4= 200.13
##$BF5= 200.13
##$BF6= 200.13
##$BF7= 200.13
##$BF8= 200.13
##$BYTORDA= 1
##$CFDGTYP= 0
##$CFRGTYP= 5
##$CHEMSTR= <none>
##$CNST= (0..31)
1 1 145 1 1 1 1 1 1 1 1 1 1 1 1 1 1 1 1 1 1 1 1 1 1 1 1 1 1 1 1 1 
##$CPDPRG= <>
##$CPDPRG1= <>
##$CPDPRG2= <>
##$CPDPRG3= <>
##$CPDPRG4= <mlev>
##$CPDPRG5= <mlev>
##$CPDPRG6= <mlev>
##$CPDPRG7= <mlev>
##$CPDPRG8= <mlev>
##$CPDPRGB= <>
##$CPDPRGT= <>
##$D= (0..31)
0 1.2 0 0 0 0 0 0 0 0.06 0 0.03 0 0 0 0 0.0002 0 0 0 0 0 0 0 0 0 0 0 0 
0 0 0 
##$DATE= 1603875083
##$DBL= (0..7)
120 120 120 120 120 120 120 120 
##$DBP= (0..7)
150 150 150 150 150 150 150 150 
##$DBP07= 0
##$DBPNAM0= <>
##$DBPNAM1= <>
##$DBPNAM2= <>
##$DBPNAM3= <>
##$DBPNAM4= <>
##$DBPNAM5= <>
##$DBPNAM6= <>
##$DBPNAM7= <>
##$DBPOAL= (0..7)
0.5 0.5 0.5 0.5 0.5 0.5 0.5 0.5 
##$DBPOFFS= (0..7)
0 0 0 0 0 0 0 0 
##$DE= 6
##$DECBNUC= <off>
##$DECIM= 32
##$DECNUC= <off>
##$DECSTAT= 4
##$DIGMOD= 1
##$DIGTYP= 9
##$DL= (0..7)
0 120 120 120 120 120 120 120 
##$DP= (0..7)
150 150 150 150 150 150 150 150 
##$DP07= 0
##$DPNAME0= <>
##$DPNAME1= <>
##$DPNAME2= <>
##$DPNAME3= <>
##$DPNAME4= <>
##$DPNAME5= <>
##$DPNAME6= <>
##$DPNAME7= <>
##$DPOAL= (0..7)
0.5 0.5 0.5 0.5 0.5 0.5 0.5 0.5 
##$DPOFFS= (0..7)
0 0 0 0 0 0 0 0 
##$DQDMODE= 0
##$DR= 18
##$DS= 0
$$ [...]
##$SUBNAM2= <"">
##$SUBNAM3= <"">
##$SUBNAM4= <"">
##$SUBNAM5= <"">
##$SUBNAM6= <"">
##$SUBNAM7= <"">
##$SUBNAM8= <"">
##$SUBNAM9= <"">
##$SW= 16.880792210976
##$SWIBOX= (0..15)
0 0 2 0 0 0 0 0 0 0 0 0 0 0 0 0 
##$SW_h= 3378.37837837838
##$TD= 16384
##$TD0= 1
##$TE= 0
##$TE2= 300
##$TE3= 300
##$TEG= 300
##$TL= (0..7)
0 120 120 120 120 120 120 120 
##$TP= (0..7)
150 150 150 150 150 150 150 150 
##$TP07= 0
##$TPNAME0= <>
##$TPNAME1= <>
##$TPNAME2= <>
##$TPNAME3= <>
##$TPNAME4= <>
##$TPNAME5= <>
##$TPNAME6= <>
##$TPNAME7= <>
##$TPOAL= (0..7)
0.5 0.5 0.5 0.5 0.5 0.5 0.5 0.5 
##$TPOFFS= (0..7)
0 0 0 0 0 0 0 0 
##$TUNHIN= 0
##$TUNHOUT= 0
##$TUNXOUT= 0
##$USERA1= <user>
##$USERA2= <user>
##$USERA3= <user>
##$USERA4= <user>
##$USERA5= <user>
##$V9= 5
##$VALIST= <valist>
##$VCLIST= <CCCCCCCCCCCCCCC>
##$VD= 0
##$VDLIST= <DDDDDDDDDDDDDDD>
##$VPLIST= <PPPPPPPPPPPPPPP>
##$VTLIST= <TTTTTTTTTTTTTTT>
##$WBST= 1024
##$WBSW= 4
##$XGAIN= (0..3)
0 0 0 0 
##$XL= 0
##$YL= 0
##$YMAX_a= 857917
##$YMIN_a= -742337
##$ZGOPTNS= <>
##$ZL1= 120
##$ZL2= 120
##$ZL3= 120
##$ZL4= 120
##$ABSF1= 10
##$ABSF2= 0
##$ABSG= 5
##$ABSL= 3
##$ALPHA= 0
##$AQORDER= 0
##$ASSFAC= 0
##$ASSFACI= 0
##$ASSFACX= 0
##$ASSWID= 0
##$AUNMP= <proc_1d>
##$AZFE= 0.1
##$AZFW= 0.1
##$BCFW= 1
##$BC_mod= 2
##$BYTORDP= 1
##$COROFFS= 0
##$CY= 11.3945322036743
##$DATMOD= 1
##$DC= 2
##$DFILT= <>
##$DTYPP= 0
##$F1P= 15.9154993809931
##$F2P= -4.1035820241983
##$FCOR= 0.5
##$FTSIZE= 0
##$FT_mod= 4
##$GAMMA= 1
##$GB= 0.15
##$INTBC= 1
##$INTSCL= 1
##$ISEN= 128
##$LB= 0.24
##$LEV0= 0
##$LPBIN= 0
##$MAXI= 10000
##$MC2= 0
##$MEAN= 0
##$ME_mod= 0
##$MI= 1.114404
##$NCOEF= 0
##$NC_proc= 0
##$NLEV= 6
##$NOISF1= 3.799351
##$NOISF2= 2.8
##$NSP= 1
##$NTH_PI= 0
##$NZP= 0
##$OFFSET= 15.70392
##$PC= 1
##$PHC0= -10689.04
##$PHC1= 11.20088
##$PH_mod= 1
##$PKNL= yes
##$PPARMOD= 0
##$PSCAL= 0
##$PSIGN= 0
##$REVERSE= no
##$SF= 200.130013532006
##$SI= 16384
##$SIGF1= 3
##$SIGF2= 2
##$SINO= 400
##$SIOLD= 16384
##$SREGLST= <1H.CDCl3>
##$SSB= 0
##$STSI= 0
##$STSR= 0
##$SW_p= 3612.71676300578
##$SYMM= 0
##$S_DEV= 0
##$TDeff= 0
##$TDoff= 0
##$TI= <>
##$TILT= no
##$TM1= 0
##$TM2= 0
##$TOPLEV= 0
##$USERP1= <user>
##$USERP2= <user>
##$USERP3= <user>
##$USERP4= <user>
##$USERP5= <user>
##$WDW= 1
##$XDIM= 8192
##$YMAX_p= 0
##$YMIN_p= 0
$$ End of Bruker specific parameters
$$ ---------------------------------
##NTUPLES= NMR FID
##VAR_NAME=  TIME,          FID/REAL,        FID/IMAG
##SYMBOL=    X,             R,               I
##VAR_TYPE=  INDEPENDENT,   DEPENDENT,       DEPENDENT
##VAR_FORM=  AFFN,          ASDF,            ASDF
##VAR_DIM=   8192,          8192,            8192
##UNITS=     SECONDS,       ARBITRARY UNITS, ARBITRARY UNITS
##FACTOR=    0.000296,      1,               1
##FIRST=     0,             0,               0
##LAST=      2.424536,      0,               0
##MIN=       0,             -742337,         0
##MAX=       2.424536,      857917,          0
$$ Real data points
##PAGE= N=1
##DATA TABLE= (X++(R..R)), XYDATA
$$ [...]
3676b711j1345J1966J6277n110j7575j314J6659P961j3145j2767P566J5064j983
$$ -2711 -14056 -2090 14187 9077 -8498 -9812 6847 14808 1663 -11104 -3538 11526 9543
3689I543j5796m837J3183Q853r889j2957M251J3900Q90j3026o244J0670J0504
$$ 9543 -6253 -11090 2093 10946 1057 -11900 -7649 6251 7141 -5885 -12129 -1459 9045
3702I045o398j1494J774J2657L667j0267p149P714J0378l276j0919q86R659M948
$$ 9045 2647 -8847 -7073 5584 9251 -1016 -8165 -451 9927 6651 -4268 -5154 4505 9453
3716I453q341p720M059Q660j354r251l270P106N309n069p430K025P248J494o461
$$ 9453 1112 -6608 -2549 6111 4757 -4494 -7764 -658 4651 -418 -7848 -5823 1425 2919 -3542
3731c542l384N184O117k185n587O46O117K658m362l619K837M872q48m699j619
$$ -3542 -6926 -1742 4375 2190 -3397 -2751 3366 6024 1662 -1957 880 5752 4904 205 -1414
3746a414L670K004l127l751N53K747r3k978j883J501K148p24j822j99J670J511
$$ -1414 2256 4260 1133 -2618 -2065 682 589 -2389 -4272 -2771 -623 -1347 -3169 -3368 -1698 -187
3762a87Np08M78J262J385K31q88J69P12J341o7j902j344J529J090j378l234q14
$$ -187 -182 -890 -412 850 2235 2466 1578 1747 2459 3800 3733 1831 487 2016 3106 1728 -1506 -2320
3780b320K516J198l436l239J137M051j48m521j436M351M323k545m803J848O739
$$ -2320 196 1394 -2042 -5281 -4144 -93 -241 -4762 -6198 -1847 2476 -69 -4872 -3024 3715
3795C715K189n859l705N744O641k755q216n2Q154L076p777p291M398Q733k872
$$ 3715 5904 45 -3660 2084 8725 5970 -2246 -2298 5856 8932 1155 -6136 -1738 6995 4123
3810D123j0869k635R540N582q282r206M412J1913J6j1378m242J1762R273p161
$$ 4123 -6746 -9381 159 5741 -2541 -11747 -7335 4578 4594 -6784 -11026 736 10009 2848
3824B848j1342L931J4071K640j3144o924J1011J1625o932j5285J366J4684L920
$$ 2848 -8494 -4563 9508 12148 -996 -7920 3091 14716 7784 -7501 -6135 8549 12469
3837A2469j4670j0922R818J4029o114j6990j327J6594P626j4289j3139R622J7668
$$ 12469 -2201 -13123 -3305 10724 4610 -12380 -13707 2887 10513 -3776 -16915 -7293 10375
3850A0375k573j7760l252J7752J1530j2951j5052P540J9287k32j9050p159J6167
$$ 10375 7802 -9958 -13210 4542 16072 3121 -11931 -4391 14896 14664 -4386 -11545 4622
3863D622J3201j2010j8407L504J9356K412j9736j0679J4499J5587r041j9684J412
$$ 4622 17823 5813 -12594 -9090 10266 12678 -7058 -17737 -3238 12349 3308 -16376 -14964
3876a4964K0518O768j7903j2655J3859J9102n522k0273r62K0855R894j6588j5384
$$ -14964 5554 12322 -5581 -18236 -4377 14725 9203 -11070 -12032 8823 18717 2129 -13255
3889a3255J0931J9974l220k1960n339J8917J1751j5069j9063O658K0607l6k1113
$$ -13255 -2324 17650 14430 -7530 -12869 6048 17799 2730 -16333 -9675 10932 10896 -10217
3902a0217q893J7350J5085j1533j9136L859K1703N203j8659j1143J5491J7817
$$ -10217 -19110 -1760 13325 1792 -17344 -13485 8218 13421 -5238 -16381 -890 16927
3914A6927p639j9619O18K0487Q066j7394j4340J1154J8553m816k1373m333J8597
$$ 16927 9288 -10331 -9713 10774 18840 1446 -12894 -1740 16813 11997 -9376 -13709 4888
3927D888J0239j5444j7381Q271J9402j464k0363o396J7603J3692j1778j7557N862
$$ 4888 15127 -317 -17698 -9427 9975 8511 -11852 -18248 -645 13047 1269 -16288 -10426
3940a0426K0726L219j8507r071J5663J6045q671j8621J936J9485N277j7485j2590
$$ -10426 10300 13519 -4988 -14059 1604 17649 8978 -9643 -7707 11778 17055 -430 -13020
3953a3020J2036J5758o356j9342k343J7588P511j5003j3890Q948J7136k543j7681
$$ -13020 -984 14774 8418 -10924 -13267 4321 11832 -3171 -17061 -8113 9023 6480 -11201
3966a1201l736J6495J0583j0980j4105O959J7417Q97j6393n872J4205J1634r525
$$ -11201 -14937 1558 12141 1161 -12944 -5985 11432 12329 -4064 -9936 4269 15903 6378
3979F378j4773L750J5474J704j5504q105J0935J1274p601j4817R14J3840M051
$$ 6378 -8395 -4645 10829 12533 -2971 -11076 -141 11133 3532 -11285 -10371 3469 7520
3992G520j2917q551R305J2117m205j2179k03J3080N514r246q216P100J0843k123
$$ 7520 -5397 -13948 -4643 7474 3269 -8910 -9113 3967 9481 235 -7981 -881 9962 7839
4006G839j0325k294J0120N395q118q233L715Q772j275r871l025P076M894n654
$$ 7839 -2486 -4780 5340 10735 2617 -5616 -1901 6871 5596 -4275 -7300 -224 4670 -984
4020i84p125K546P086K14o776k120N933M597l219m461K186N772J099m047k057
$$ -984 -8109 -5563 1523 1737 -5039 -7159 -1226 3371 152 -4309 -2123 3649 4748 701 -1356
4035a356M100K987k291l414R72K785l02l265j348J468M71j700j398L88N31o28
$$ -1356 2744 5731 3440 26 998 3783 3481 216 -1132 336 807 -893 -2291 -1903 -1372 -2000
4051b000j107Q30Q79n94n69J173J635l23j167J024K626O57k169p93K871K189k390
$$ -2000 -3107 -2277 -1398 -1992 -2561 -1388 247 -76 -1243 -219 2407 3064 895 102 2973 5162 2772
4068B772l059Q19L566p4m581k804L613L250l465n323N80N812R25n813l151M721
$$ 2772 -287 532 4098 4024 -557 -3361 252 3502 37 -5286 -4706 1106 2031 -3782 -6933 -2212
4084b212N615k689o366Q98P758K730o331m621N225P695k447q428l92Q212M047
$$ -2212 3403 714 -5652 -4754 3004 5734 -597 -5218 7 7702 5255 -3173 -3565 4647 8694
4099H694p503p083M121Q323j575r871k687Q273O001p185q972L474J0559M45j0413
$$ 8694 1191 -5892 -1771 6552 4977 -4894 -7581 692 6693 -492 -9464 -5990 4569 5014 -5399
4114e399m477R656Q619o099j0195K618J2032K498j0718o391Q372J0336m532j2642
$$ -5399 -9876 -220 8399 2300 -7895 -5277 6755 9253 -1465 -7856 516 10852 6320 -6322
4128f322j93J2306N034j1444r399P148J1828k823j3776k987J2448P533r590j1725
$$ -6322 -6515 5791 10825 -619 -10018 -2870 8958 6135 -7641 -10628 1820 9353 -237 -11962
4142a1962N810J3964j54j3696n243J2403J0725q309j3695L674J4991L129j4312
$$ -11962 -6152 7812 7658 -6038 -11281 1122 11847 3538 -10157 -6483 8508 11637 -2675
4155b675q468J1670J2504o933j5789Q92J5851M780j4307j0974R964J4597m480
$$ -2675 -11143 527 13031 6098 -9691 -8799 7052 11832 -2475 -13449 -3485 11112 6632
4168F632j6831k007J6154Q448j3127j3320Q308J6456j519j6915m799J5933J0768
$$ 6632 -10199 -12206 3948 12396 -731 -14051 -5743 10713 9194 -7721 -12520 3413 14181
4181A4181j1117j5387N343J7592J508j6783q464J4402J2674q930j7082K812J7695
$$ 14181 3064 -12323 -6980 10612 12120 -4663 -13127 1275 13949 5019 -12063 -9251 8444
4194H444L913j6657j0289J2480J5228o904j7804K16J7743P088j5554j2302J0718
$$ 8444 12357 -4300 -14589 -2109 13119 6215 -11589 -11373 6370 13458 -2096 -14398 -3680
4207c680J6825m256j8136k538J6983R232j3620j4223P847J7402j410j7928n346
$$ -3680 13145 8889 -9247 -11785 5198 14430 810 -13413 -5566 11836 10426 -7502 -12848
4220a2848J5456J1057j0968j5539N153J7204J510j6205p912J3173J2861q352j5832
$$ -12848 2608 13665 2697 -12842 -7689 9515 11025 -5180 -13092 81 12942 4590 -11242
4233a1242K272J6206M319j4515r712J0524J4131n597j5777n66J5238O487j2641
$$ -11242 -8970 7236 11555 -2960 -12672 -2148 11983 6386 -9391 -9957 5281 11768 -873
4246h73j1326Q444J4114l092j4700k962J3813Q208j0517j1759N851J3709j98j3475
$$ -873 -12199 -3755 10359 7267 -7433 -10395 3418 11626 1109 -10650 -4799 8910 8712 -4763
4260d763n476J1387R700p749j2160K667J2942K303j2084o720Q850J0277n104j1874
$$ -4763 -10239 1148 10848 3099 -9061 -6394 6548 8851 -3233 -9953 -1103 9174 4070 -7804
4274g804O8J1680M520r843p512O528J0144k452j0465j997J0330N757p887q198
$$ -7804 -7736 3944 8464 -1379 -8891 -2363 7781 5329 -5136 -7133 3197 8954 1067 -7131
4288g131M240R685j74r911l567Q192O474n968q161J573R011J081q369m543O533
$$ -7131 -2891 6794 6620 -3291 -6858 1334 7808 1840 -6321 -4748 4263 5344 -3025 -7568 -1035
4303a035O546l497p740L75Q209K641o369m825M324O948j841o761o35O268L288
$$ -1035 5511 2014 -5726 -5351 2858 5499 -870 -5695 -1371 5577 3736 -3025 -3660 2608 5896
4318E896m762m991K684N633n39o086k021M529L343l500m468J256M351N21m285
$$ 5896 1134 -3857 -1173 4460 3921 -2165 -4186 343 3686 186 -4282 -3026 1325 1846 -2439
4333b439j788L188L233j971l261P67L668J144k388j676K241K269p25k364O85J567
$$ -2439 -4227 -1039 2194 223 -3038 -2271 1397 2541 153 -1523 718 2987 2262 -102 583 2150
4349B150L43j595j082L33O88l65q26k81n3k06n26J34M43r96j95R52J163o53j366
$$ 2150 2493 898 -184 149 837 472 -354 -635 -688 -894 -1420 -1286 -843 -1839 -2034 -1082 81 -572 -1938
4368a938R49K473K43j922p47K390K305j755k845M96L859K71m262k082L343L079
$$ -1938 -989 1484 1727 -195 -942 1448 3753 1998 -847 -351 3508 3779 -483 -2565 778 3857
4384C857l001m952N12N243P60n802l119M680N185k981o331Q45P638K342o620m119
$$ 3857 856 -4096 -3584 1659 2419 -3383 -6502 -1822 3363 382 -5949 -5104 2534 4876 -1744 -5863
4400e863N503P497k578q056n04Q808L697p421o624M666Q339j758j0270k224Q918
$$ -5863 -360 7137 4559 -3497 -4001 4807 8504 1083 -5541 -875 7464 5706 -4564 -6788 2130
4415B130M954p693q721M063J0310n45j0922l331R612P953p057r877L774J2562
$$ 2130 7084 -609 -9330 -5267 5043 4498 -6424 -9755 -143 7810 753 -9124 -5350 7212
4429G212R92j1090n281J0373R314o539j1325J622J2555K754j1886p758Q699J0640
$$ 7212 8204 -2886 -8167 2206 11520 4981 -6344 -4722 7833 10587 -1299 -9057 -358 10282
4443A0282n485j3703M7J2479M781j1881r362P907J2554k918j3517k050J3456P836
$$ 10282 4797 -8906 -8859 3620 8401 -3480 -12842 -4935 7619 4701 -8816 -10866 2590 10426
4457A0426j0255j0675O375J4251n13j3560m562J2816R064q918j3016L807J4110
$$ 10426 171 -10504 -4129 10122 9609 -3951 -8513 4303 13367 4449 -8567 -4760 9350
4470I350Q88j4442p399J1061J0943p585j4476J613J4871L298j3367q538J0297
$$ 9350 10238 -4204 -11603 -542 10401 2816 -11660 -10047 4824 8122 -5245 -13783 -3486
4483c486J3195n150j4134l3J5226O072j1479j0392Q119J4470k604j4810k963J3367
$$ -3486 9709 4559 -9575 -9608 5618 11690 211 -10181 -2062 12408 9804 -5006 -7969 5398
4497E398Q024j0490j2756N141J3804l15j4757o306J1918R930q282j3731L109J4515
$$ 5398 13422 2932 -9824 -4683 9121 8806 -5951 -12257 -339 9591 1309 -12422 -9313 5202
4511E202K750j3220p604J1261J2126n478j3728J187J4774N101j2195r366Q701
$$ 5202 7952 -5268 -12872 -1611 10515 5037 -8691 -7504 7270 12371 176 -9190 -489
4524d89J3138m018j4425j744J3151O509j1528j1522O398J2726j883j4395l858
$$ -489 12649 8631 -5794 -7538 5613 12122 594 -10928 -4530 8196 6313 -8082 -11940
4537a1940J2059Q167q873j1681M370J3745J307j2302n204J0622J0562o573j1642
$$ -11940 119 8286 -587 -12268 -7898 5847 7154 -5148 -10352 270 10832 4259 -7383
4550g383K407J3014K941j1425p044Q548J0284n473j1837m10J1205L849j0674q285
$$ -7383 -4976 8038 10979 -446 -7490 1058 11342 5869 -5968 -6378 4827 8676 -1998 -10283
4564a0283O655R895l292j1333j301J0909N330q132p850N388J0404p15r844k034
$$ -10283 -3628 6267 2975 -8358 -9659 1250 6580 -1552 -9402 -4014 6390 5675 -4169 -6203
4578f203R250O246o023p939L224R147J6q751m142P044N774m986q210J241P450
$$ -6203 3047 9293 3270 -4669 -1445 7702 7718 -1033 -5175 1869 7643 2657 -5553 -4312 3138
4593C138R16p135m471M652N903l026o323M33O780K562m881l473L985N396p75n035
$$ 3138 4054 -3081 -7552 -2900 3003 -23 -6346 -5913 867 3429 -1452 -4925 -940 4456 3681 -1354
4609a354m57N082K340l409l436J657L875m03m646j316K929J529k500l236L21K678
$$ -1354 -1811 3271 5611 2202 -1234 423 4298 3895 -751 -2067 862 2391 -109 -3345 -3024 -346
4625c46K4k603j069J917J463m59j458M66J953J090m87m31R31P70O61p27J73n4
$$ -346 -322 -2925 -3994 -2077 -614 -1073 -2531 -2065 -112 978 491 60 991 1761 2422 1695 1868 1814
4643A814L21j34j57p77q29K04K56p19j730k56R56N98j325j589O07K218L68j893
$$ 1814 2135 2001 1844 1067 238 442 698 -21 -1751 -2007 -1051 -453 -1778 -3367 -2760 -542 -174 -2067
4661b067q86K320K625q82k317N98L303J052k624k134K298L234j316l768q47L341
$$ -2067 -2953 -633 1992 1110 -1207 -609 2694 3746 1122 -1012 1286 4520 3204 -564 -1411 1930
4677A930J888l327m151J273M302k97m847k357M132L736k781n301J468O083J427
$$ 1930 3818 491 -3660 -2387 1915 1618 -3229 -5586 -1454 2282 -499 -5800 -4332 1751 3178
4692C178n304k614M437N603k133n947K96O435K833n647m777L583O264j740p472
$$ 3178 -2126 -4740 -303 5300 3167 -2780 -2484 3951 6784 1137 -3640 -57 6207 4467 -3005
4707c005j912O789L569n568o951K864P758j49q061l232P176N986m267q051K234
$$ -3005 -4917 1872 5441 -127 -7078 -4214 3544 3395 -4666 -7898 -722 5264 997 -7054 -4820
4722d820R246J980q162m850O802Q124l484r138k72R511L769q303p478N611R111
$$ -4820 4426 6406 -1756 -6606 196 8320 4836 -4302 -4574 4937 8706 403 -7075 -1464 7647
4737G647k517j0595k137R695N198p885q994M472J0821m94j1105l451J0010P720
$$ 7647 5130 -5465 -7602 2093 7291 -594 -9588 -5116 5705 5211 -5894 -9345 665 8385
4751H385o850r846L430J2015J177j1173n429R214R410n465j2049J430J1923L586
$$ 8385 1535 -8311 -4881 7134 8311 -2862 -8291 923 10333 4868 -7181 -5751 6172 9758
4765I758j1276q062P648J0882m225j2796j131J2403N330j0129r741P016J2147
$$ 9758 -1518 -9580 -1932 8950 4725 -8071 -9202 3201 8531 -1598 -11339 -4323 7824
4778G824j884j2818k538J1946P705q878j0813N505J2600L5j3044m588J1431Q556
$$ 7824 5940 -6878 -9416 2530 10235 1357 -9456 -3951 8649 8684 -4360 -8948 2483 11039
4792A1039p766j1963L327J2535J685j2442o908R968R941n783j2831J376J2824
$$ 11039 3273 -8690 -5363 7172 8857 -3585 -10493 -525 9416 3633 -9198 -7822 5002
4805E002L528j1094q004Q495J1120l519j2609j184J2719N515r667r285O244J1468
$$ 5002 8530 -2564 -10568 -2073 9047 5528 -7081 -8265 4454 9969 302 -8983 -2739 8729
4819H729j549j2307l017J0894P044q180j0462M395J1360L06j1811m567R368Q146
$$ 8729 7180 -5127 -8144 2750 9794 1614 -8848 -4453 6907 7213 -4598 -9165 203 8349
4833H349o321j0304K020J1425J990j0185n906Q299Q922m442j0648P41J0483L829
$$ 8349 2028 -8276 -6256 5169 7159 -3026 -8932 -633 8289 3847 -6801 -6060 4423 8252
4847H252r318o861O447R025k715j0103j300R400M967p633p707M036R434p86r057
$$ 8252 -1066 -7927 -1480 7545 4830 -5273 -6573 2827 7794 161 -7546 -3510 5924 5138 -3919
4862c919l278Q242O239n813q163K811Q728P96q267l879O734O432m031p926Q25
$$ -3919 -7197 1045 7284 1471 -6692 -3881 4847 5643 -2624 -6503 231 6663 2632 -5294 -4469
4877d469Q272K107p360m803N403O437k599p377k43P424K696n776m995L897O149
$$ -4469 3803 5910 -1450 -6253 -850 5587 2988 -4389 -4632 2792 5488 -288 -5283 -1386 4763
4892D763j339o748q54N773L184m250n071K377N605k30n540j935M491L677l379
$$ 4763 3424 -3324 -4178 1595 4779 529 -4542 -2165 3440 3210 -2330 -4265 226 3903 524
4907E24m460J253M690O84m339j885L602L361k468l708Q89L718J232l659j505K358
$$ 524 -3936 -2683 2007 2691 -1648 -3533 69 3430 962 -2746 -1857 1861 3093 -566 -2071 287
4923B87K218j384k639J26K640K94k075j102J405J326q05j728K35J524N1j257l67
$$ 287 2505 1121 -1518 -1392 1248 1542 -533 -1635 -230 1096 291 -1437 -1202 322 373 -884 -1251
4940a251J109M80r21R8O52P66p16k88J036N22p75j217R52J543q05j706k65J919
$$ -1251 -142 338 -583 -485 167 933 217 -71 965 1487 712 -505 447 1990 1185 -521 -786 1133
4958A133O25k127j706J462K245j446k734NK916J225k924k269K550L453r87m077
$$ 1133 1758 -369 -2075 -613 1632 186 -2548 -2543 373 1598 -1326 -3595 -1045 2408 1421 -2656
4974b656J11M401K199m041l067K763M673j021n248r04M882K602m435m894K870
$$ -2656 -2545 1856 4055 14 -3053 -290 4383 3362 -1886 -2790 2092 4694 259 -4635 -1765
4989a765N562p33o533j946N323M461m672n859K541O863N28o973k927O361N796
$$ -1765 3797 3064 -3469 -5415 -92 4369 -303 -6162 -3621 3242 3770 -3203 -6130 231 6027
5004F027l999p022J892P822J614p135m393N785O598l700q168M94Q076K469p731
$$ 6027 2028 -4994 -3102 4720 6334 -801 -5194 591 7189 3489 -4679 -4185 3891 6360 -1371
5019a371n804N246P815l169q690j308R181M001p127o730M886Q709p73r427k227
$$ -1371 -7175 -1929 5886 2717 -5973 -7281 1900 5901 -1226 -7956 -3070 5639 4866 -4561 -6788
5034f788R168N918o311q205L272J0172J11r608m197P926P232n594r575J224R982
$$ -6788 2380 8298 1987 -6218 -2946 7226 7337 -2271 -6468 1458 8690 3096 -6479 -5255 4727
5049D727J816r602o281P229Q600m043j0331L44J0255L945q236p112O467R619k120
$$ 4727 6543 -3059 -9340 -2111 6489 2446 -7885 -7541 2714 6659 -1577 -8689 -2222 7397 5277
5064E277j0086j255R834N229p290q566M721J0332j029j0537m085R426O715o961
$$ 5277 -4809 -6064 3770 8999 1709 -6857 -2136 8196 7167 -3370 -7455 1971 8686 1725
5078A725r914K528J0545R62j0399n419Q095Q550m532j0099P66J0984M083r295
$$ 1725 -8189 -5661 4884 5846 -4553 -9972 -1877 6673 2141 -7958 -7192 3792 7875 -1420
5092a420o821O986R821k527j0695q38J0168N343q467q399M826J0153j589j0850
$$ -1420 -8241 -1255 8566 6039 -4656 -5494 4674 10017 1550 -6849 -2023 8130 6541 -4309
5106d309l310R355O203p459r542L258J0605L46j0739l755Q463P734n308r400K463
$$ -4309 -7619 1736 7939 480 -9062 -5804 4801 5147 -5592 -9347 -884 6850 1542 -7858 -5395
5121e395J0547K376r473n181P277Q768l494r735k2R465L570q460p102N282Q560
$$ -5395 5152 7528 -1945 -7126 151 8919 5425 -4310 -4332 5133 8703 243 -6859 -1577 6983
5136F983k415r829j963Q514M651p197p436L786R159p83q601k438P856O044n302
$$ 6983 4568 -5261 -7224 1290 5941 -1256 -8692 -4906 4253 3470 -5131 -7569 287 6331 1029
5151A029p043K993Q737R39p859l236O226N868l775p517J032P080J827p130m793
$$ 1029 -6014 -3021 5716 6655 -1204 -4440 1786 7654 3879 -3638 -2606 4474 6301 -829 -5622
5166e622M627N844k973o875n89O395K410n291m572L593O233r35n830p99N697L602
$$ -5622 -995 4849 1876 -4999 -5588 807 3217 -2074 -6646 -3053 3180 2245 -3585 -4384 1313 4915
5182D915l372m470K498N367j63m936k013L951L438k857m558M90L972O79m376k589
$$ 4915 1543 -2927 -429 4938 4775 -161 -2174 1777 5215 2358 -2200 -1710 2262 2941 -1435 -4024
5198d024K512K947j603l805l4L366J634k443k216J831L369j8k426o94L107J600
$$ -4024 -1512 1435 -168 -3973 -4007 -641 993 -1450 -3666 -1835 1534 1516 -910 -1604 1503 3103
5214C103j293k039R74K085K44j978j031R58Q13p57k061l19J252L46j570r34K00
$$ 3103 1810 -229 745 2830 3074 1096 65 1023 1836 1079 -982 -1301 -49 297 -1273 -2207 -2007
5231b007R11K6p65m02O44J402k73mj4O64J051P3k80j56M20P71K4q25n94M96L20
$$ -2007 -1096 -1070 -1835 -2237 -1593 -191 -464 -468 -482 182 1233 1306 1026 870 1290 2061 2085 1260 666 1162 1482
5252A482n27j373n13R30L90r40j865L70J474M4j636q14J619J825n83j814K44K894
$$ 1482 955 -418 -931 -1 389 -551 -2416 -2046 -572 -528 -2164 -2978 -1359 466 -117 -1931 -1687 1207
5270A207J307j671j797J534K623M1l054j085K857J845k217l854R08L509j4m010
$$ 1207 2514 843 -954 580 3203 3244 190 -895 1962 3807 1590 -2264 -1356 2153 2139 -1871
5286a871k296K906L269k219m321M63M475K013m305l008L559M886j328n221Q8N545
$$ -1871 -4167 -1261 2008 -211 -4532 -4069 406 2419 -1886 -4894 -1335 3551 2223 -2998 -2910 2635
5302B635K984m637m456L270N838p21o798j586N447L870m997o106K290O475L12
$$ 2635 5619 982 -3474 -204 5634 4913 -1885 -3471 1976 5846 849 -5257 -2967 3508 3820
5317C820p241l384N897N492m055o924J566Q045J709p296l963O308O520k969p950
$$ 3820 -3421 -6805 -908 4584 529 -6395 -4829 3216 4925 -2371 -6334 -26 6494 3525 -4425
5332d425N68Q661L134p827n373M998Q091l090r267j017Q166M206p462p082M265
$$ -4425 -3857 4804 7938 111 -5262 -264 7827 4737 -4530 -5547 2619 6825 -637 -7719 -3454
5347c454Q706j394r489k218Q447N999o512q074L506R942P12r651l540Q109P536
$$ -3454 5252 3858 -5631 -7849 598 6597 85 -7989 -4483 5459 6171 -3480 -7020 1089 8625
5362H625n422r117K048R928K029r752n491O981Q012m315r804K79R683K858q670
$$ 8625 3203 -5914 -3866 6062 8091 -1661 -7152 -171 7841 3526 -6278 -5999 3684 6542 -2128
5377b128o476N864Q878k707r971m93R463M803p586p246N079R391j416r052k879
$$ -2128 -8604 -2740 6138 3431 -6540 -7033 2430 7233 -353 -7599 -2520 6871 5455 -3597 -6476
5392f476R288N548o231q274K894R739or237m237P288O964n113r103J540R092K109
$$ -6476 2812 8360 2129 -6145 -3251 6488 6482 -2755 -6992 296 7260 2147 -6956 -5416 3676 5785
5408E785q573n484O591Q004l477q841J03R355L363p608n987N281Q280j944q835
$$ 5785 -2788 -8272 -1681 6323 2846 -5995 -5892 3463 6826 -782 -6769 -1488 6792 4848 -3987
5423c987j291Q434M071o394o924L599Q128p84q514k925P631N083n619p155K388
$$ -3987 -5278 3156 7227 833 -6091 -2492 5636 4852 -3662 -6587 1044 6127 508 -6647 -4259
5438d259Q055Q10p569l773O316O393l922p003P40P928K010o562m515M771O335
$$ -4259 3796 4606 -2963 -6736 -420 5973 2051 -4952 -4212 3716 5726 -836 -5351 -580 5755
5453E755k322p130l54O731K908n534n193L432O252j333o699j260N950L398m500
$$ 5755 3433 -3697 -4051 2680 5588 54 -5139 -1707 4545 3212 -3487 -4747 1203 4601 101
5468A01n222K609N847K6n883k010N201L397l001m839J631N317L70m830k216L974
$$ 101 -5121 -2512 3335 3361 -2522 -4532 669 4066 1065 -3774 -2143 3174 3544 -1286 -3502 472
5484D72L488k187m401L40M630M53l768k615L001L607j877l600M5L519J369l145
$$ 472 3960 1773 -2628 -2288 2342 2795 -973 -3588 -587 3020 1143 -2457 -2412 1107 2476 -669
5500f69k045J836K675p26k914k11K836J058k219j212J096K316q48j989n2J657
$$ -669 -2714 -878 1797 1071 -1843 -2054 782 1840 -379 -1591 -495 1821 973 -1016 -1068 589
5516E89M87j160r64R14R49n23p53k56R58L98p74l50O55K95n49k11M90M01o65m97
$$ 589 1076 -84 -1048 -134 815 292 -461 -717 241 639 -135 -485 170 465 -84 -295 195 596 -69 -566
5536e66M92R81q72j299R30J354l56j439n63J833J015j506j551J163J938k51k359
$$ -566 -74 907 35 -1264 -334 1020 664 -775 -1338 495 1510 4 -1547 -384 1554 1303 -1056
5553a056k22K582J021k150k130J551K532k55l441n41K846J884k379l324J646L218
$$ -1056 -1278 1304 2325 175 -1955 -404 2128 1873 -1568 -2109 737 2621 242 -3082 -1436 1782
5569A782n0l671j391L321L104k674l707J246M360Q15m209k220L445M046k446m568
$$ 1782 1732 -1939 -3330 -9 3095 421 -3286 -2040 2320 3135 -1074 -3294 151 4197 1751 -2817
5585b817J92N294J482m754l350L438M730j971n444n52N169K575m628m424L154
$$ -2817 -2625 2669 4151 -603 -3953 -515 4215 2244 -3200 -3752 1417 3992 -636 -5060 -1906
5600a906N335p05n854j705N706L724m251n164K779O021J23o022k219N341M404
$$ -1906 3429 2724 -3130 -4835 871 4595 344 -4820 -2041 3980 4103 -1919 -4138 1203 5607
5615E607l583n767J328O425R53o210l639M677N001k590o373j84O641K367o021
$$ 5607 2024 -3743 -2415 4010 4963 -1247 -4886 -209 4792 2202 -4171 -4355 2286 4653 -1368
5630a368m550L993O364j723o831j006O583M224n286n875L197P518k40p385k409
$$ -1368 -5918 -1925 4439 2716 -4115 -5121 1462 5686 400 -5475 -2278 5240 5000 -2385 -4794
5645d794O327N226m724o738J620P212J004p263m273N830N692l367p259J10P800
$$ -4794 1533 6759 2035 -4703 -3083 4129 5133 -2130 -6403 -573 5119 1752 -5507 -5397 2403
5660B403K351o737n116N081P336j906q129l81P612M182n992o292L883P889l81
$$ 2403 4754 -1983 -7099 -2018 5318 3412 -4717 -5098 2514 6696 704 -5588 -1705 6184 5803
5675E803q388k319P011N159n265p915K431Q033M26q112m103O719O145m470p761
$$ 5803 -2585 -4904 2107 7266 2001 -5914 -3483 4550 4976 -3136 -7239 -520 5625 1155 -6606
5690f606J334Q593J752p233m860N997P086k667p836j20Q289L414o948n296M436
$$ -6606 -5272 3321 5073 -2160 -7020 -1023 6063 3396 -4440 -4560 3729 7143 195 -5101 -665
5705f65P537j942q293j409P231M047o161o729L144P429o77p717k755P115M891
$$ -665 6872 4930 -3363 -4772 2459 6506 345 -6384 -3240 4189 3512 -4205 -6960 155 5046
5720E046m722o810K074P736J353p009l289N835O095l557o873J119P219K171o588
$$ 5046 324 -6486 -4412 3324 4677 -2332 -5621 214 6309 2752 -4121 -3002 4217 6388 -200
5735b00m448M560N825k476o703m93N883K522n324n036L492N415j130n985j267
$$ -200 -4648 -88 5737 3261 -3442 -3935 1948 4470 -854 -5890 -2398 3017 1887 -4098 -5365
5750e365N859L343m227m460K592N948j43n158j783M766M042l075m709J064M936
$$ -5365 494 3837 -390 -4850 -2258 3690 3547 -1611 -3394 1372 5414 2339 -2370 -1306 3630
5765C630J041m994k856L324L845k351m793k04M328J465m051k847K361L949r77
$$ 3630 4671 -323 -3179 145 3990 1639 -3154 -3358 970 2435 -1616 -4463 -2102 1847 870
5780H70l772o57M051K314k627k793J635L926K15l131j275K682K283k010k566J32
$$ 870 -2902 -3559 492 2806 179 -2614 -979 2947 3162 31 -1244 1438 3721 1711 -855 -723
5796g23L138j0k740j625J681J620j043k641l29K247P70j848j387J218K334n47
$$ -723 2415 2405 -335 -1960 -279 1341 298 -2343 -2672 -425 345 -1503 -2890 -1672 662 115
5812A15j501j08J786J405r07j310Q27J588j47p24k24O72L46n88r97j86O23l68
$$ 115 -1386 -1494 292 1697 790 -520 307 1895 1748 1024 800 1472 1818 1230 233 47 670 302
5830C02o09n51K6p3j44l79K25m24L83K31N96k26l15Q50P95K94n40j79P30J011
$$ 302 -307 -858 -832 -905 -1049 -1428 -1203 -1627 -1244 -1013 -417 -643 -958 -108 687 981 441 262 992 2003
5850B003l60j147J73J274L55j961j104J043J546j117k648l69K164R48j929k393
$$ 2003 1643 496 669 1943 2298 337 -767 276 1822 705 -1943 -2312 -148 800 -1129 -3522
5866c522J766K690q22k913kL187J691j982k596J813L858l28l354j271L719K494
$$ -3522 -1756 934 112 -2801 -2803 384 2075 93 -2503 -690 3168 2840 -514 -1785 1934 4428
5882D428k892l477J053M223j20m717k216L660L435k740n185J030M841J024m814
$$ 4428 1536 -1941 -888 3335 3215 -1502 -3718 -58 3377 637 -4548 -3518 1323 2347 -2467
5897b467k831M159M650k323n351Q23O121K042n201l587M072N746j825o327n95
$$ -2467 -5298 -1139 3511 1188 -4163 -3340 2781 4823 -378 -3965 107 5853 4028 -2299 -2894
5912b894N963L037n440n094K935O107j208o983k008O289L642m840n967K788O952
$$ -2894 3069 6106 666 -4428 -1493 4614 3406 -3577 -5585 704 4346 -494 -6461 -3673 3279
5927C279p3o855k263O188N179l990o309J922P575R03p018l116N812N890l654p537
$$ 3279 3206 -3649 -5912 276 5455 1465 -4844 -2922 4653 5556 -1462 -4578 1234 7124 3470 -4067
5943d067Q48P171J699o395n476M880O373k450p975p10P485L218n912n917M535
$$ -4067 -3219 3952 5651 -744 -6220 -1340 5033 2583 -5392 -6102 1383 4601 -1311 -7228 -2693
5958b693P028q45p738j188P342M698n643o035L137P652k87p254k811O237N188
$$ -2693 4335 3490 -4248 -5436 1906 6604 961 -5074 -1937 5715 5428 -1826 -4637 1600 6788
5973F788m877o794J853O991P46p140l828N482N505l229p532P06P463K471o288
$$ 6788 1911 -4883 -3030 3961 4707 -2433 -6261 -779 4726 1497 -6035 -5329 2134 4605 -1683
5988a683m692M741P105k311p242l64P226L481n643n506L505P284j044p544j751
$$ -1683 -6375 -1634 5471 3160 -4082 -4446 2780 6261 618 -4888 -1383 5901 4857 -2687 -4438
6003d438O160M212m581o576K205O571M30p050l044N547M863l345o378J287O647
$$ -4438 1722 5934 1353 -5223 -3018 3553 3983 -3067 -6111 -564 4299 954 -5424 -4137 2510
6018B510J765n826l626M463N648j975n847l64O159K442n218m221L484N292j247
$$ 2510 4275 -1551 -5177 -714 4934 2959 -2888 -3252 2907 5349 131 -4090 -606 4686 3439
6033C439o071j362N480L279m867m791K217N729l37n873j470M682L780l063n246
$$ 3439 -2632 -3994 1486 4765 -102 -4893 -2676 3053 2716 -3157 -4627 55 3835 772 -4474
6048d474J944N299O92m944k304M259M082k555m707P86M607J284m331l003L105
$$ -4474 -2530 2769 3461 -1483 -3787 472 4554 1999 -2708 -1922 2685 3969 -362 -3365 -260
6063b60L812j796m382m2M096J407l733k787K383L589j051l601o85L675J870k472
$$ -260 3552 1756 -2626 -2668 1428 2835 -898 -3685 -1302 2287 1236 -2365 -3050 625 2495 23
6079B3k644J664L011nk986r87K627J930j644k466J014J994K03k298j242J759J535
$$ 23 -2621 -957 2054 2049 -937 -1924 703 2633 989 -1477 -463 1531 1734 -564 -1806 -47 1488
6096A488j093j959L64J592M60j699o36J029R65m22j161M35Q92K10m29n18N59O11
$$ 1488 395 -1564 -1200 392 852 -847 -1483 -454 511 89 -1072 -637 255 465 36 -482 77 688
6114F88k11m74K79O2L4q9j77j31J84k18L35m9m85l87M38R97l31j124j76J000N29
$$ 688 477 3 282 344 378 289 112 -19 165 -53 282 233 -252 -639 -201 796 465 -659 -835 165 694
6135F94o97j249R72J088N3j525n15J482J122j324j262O22K052q8k175p35J815
$$ 694 -3 -1252 -280 808 861 -664 -1179 303 1425 101 -1161 -539 1513 1425 -750 -1485 330
6152C30J724j623k037L66K573M99k355j581J817K480r12l175L70K733J138k697
$$ 330 2054 431 -1606 -1240 1333 1832 -523 -2104 -287 2193 1281 -1894 -1524 1209 2347 -350
6168c50k109J616K954o01l354o53L317J789k627k815J403L733l1l706j498L175
$$ -350 -2459 -843 2111 1510 -1844 -2497 820 2609 -18 -2833 -1430 2303 2272 -1434 -2932 243
6184B43L023k389l528Q28M050P81l743k396K694L916j725m433PM474J703m145
$$ 243 3266 877 -2651 -1823 2227 3008 -735 -3131 -437 3479 1754 -2679 -2672 1802 3505 -640
6200f40l387K830M153r34m757p55M428K663l443l870J860N024k05m799k103M515
$$ -640 -4027 -1197 2956 2022 -2735 -3490 938 3601 158 -3712 -1852 3172 2967 -1832 -3935 580
6216E80L713k662m970Q66N724Q09n100l103L891M631k168o015J49N992J829m861
$$ 580 4293 1631 -3339 -2473 3251 4060 -1040 -4143 -252 4379 2211 -3804 -3655 2337 4166 -695
6232f95m616L759N494j400o099q38N667L412m488n072K758O548l64o592j644N405
$$ -695 -5311 -1552 3942 2542 -3557 -4395 1272 4684 196 -4876 -2118 4430 4066 -2526 -4170 1235
6248A235M103l751n854J802O605M93o720k844N131M766l071o735Q46O642J610
$$ 1235 5338 1587 -4267 -2465 4140 4633 -2087 -4931 200 4966 1895 -4840 -3994 2648 4258
6263D258o122m217M764O144k337o892k11P001K993n636n233M139O668j249o796
$$ 4258 -1864 -6081 -1317 4827 2490 -4402 -4613 2388 5381 -255 -5488 -1349 5319 4070 -2726
6278b726j471O543L887n387n668K894O379k27p182k081N603M314m328o406K183
$$ -2726 -4197 2346 6233 846 -4822 -1928 4451 4224 -2958 -5039 564 4878 550 -5856 -3673
6293c673O664J095p016k757N110N493l365o137R68O584K022n566l959M512N586
$$ -3673 2991 4086 -2930 -5687 -577 4916 1551 -4586 -3618 2966 4988 -578 -4537 -25 5561
6308E561k107o465j75N846K748n372m845L436N483j162o347j413N613L223m359
$$ 5561 3454 -3011 -3186 2660 5408 36 -4809 -1373 4110 2948 -3399 -4812 801 4024 -335
6323c35m853K178N869j67n402j971N113L677k951m488J288N276J044m930k304
$$ -335 -5188 -3010 2859 2692 -2710 -4681 432 4109 1158 -3330 -2042 3234 4278 -652 -2956
6338b956L550M014k219m894K45M597J385m479l174K813L911j564m713k29L980
$$ -2956 594 4608 2389 -2505 -2260 2337 3722 -757 -3931 -1118 2793 1229 -3484 -3713 267
6353B67K171l360l013K055M302l73l746r73L748K651k463l150J447L339N04l768
$$ 267 2438 -922 -3935 -1880 2422 2049 -1697 -2670 1078 3729 1266 -1884 -437 2902 3406 -362
6369c62j273K647K093j781l250K42L202M11k965k035J785K392q17k971K03K313
$$ -362 -1635 1012 3105 1324 -1926 -1684 1518 1929 -1036 -3071 -1286 1106 289 -2682 -2479 -166
6385a66J461k083j274J383K136k54k150k67K497J288j549j497R35J737j04j983
$$ -166 1295 -788 -2062 -679 1457 1203 -947 -1214 1283 2571 1022 -475 460 2197 2093 110
6401A10o72J322M43q74j521J89R49j83q74p42Q12Q26p96m7K9O94J34j32J35P58
$$ 110 -562 760 1203 329 -1192 -1003 -54 -237 -1111 -1853 -1041 -215 -1011 -1058 -1029 -335 -201 -333 -198 560
6421E60K48k39L03K76j0l15nL51Ro56n13M21L70q43q69J41N93K23j751n7Q61J050
$$ 560 808 569 872 1148 1138 823 818 1169 1178 522 9 430 800 -43 -912 -771 -178 45 -1706 -1763 -902 148
6443A48j207j230Q05K057K04j476p37K071J765j239j947O67K752K05k615j439
$$ 148 -1059 -2289 -1484 573 777 -699 -1436 635 2400 1161 -786 -119 2633 2838 223 -1216
6459a216J782K561j840l028P4L044L80l375j789K404K674j661l303j06M073J384
$$ -1216 566 3127 1287 -1741 -1667 1377 1757 -1618 -3407 -1003 1671 10 -3293 -3399 674 2058
6475B058l155k758K919L965r07m029j87M219J970l422l170K634M263j100m846
$$ 2058 -1097 -3855 -936 3029 2122 -1907 -2094 2125 4095 673 -2497 137 4400 3300 -1546
6490a546j401M397K588l770m376J521M896r4n085k193M809L458l304m501J571
$$ -1546 -2947 1450 4038 268 -4108 -2587 2309 2215 -2870 -5063 -254 3204 -100 -4601 -3030
6505c030N536Q12m938k127M312L940j983n233N29N793J328m967l010L081M830
$$ -3030 2506 3318 -1620 -3747 565 4505 2522 -2711 -2182 3611 4939 -28 -3038 43 4873
6520D873k003o257k78N396K021m899m459L029N745j183n747r87N209L647m373
$$ 4873 2870 -3387 -3665 1731 3752 -1147 -5606 -2577 3168 1985 -3762 -4749 460 4107 -266
6535b66m557K639N856K79n828k075N352M478l673n320J107O219O12n792l041M286
$$ -266 -4823 -2184 3672 3951 -1877 -3952 1400 5878 2205 -3115 -2008 4211 4823 -969 -4010 276
6551B76M448k853o018L58N578J716n182l708L310N443j545n828o01N684L381m458
$$ 276 4724 1871 -4147 -3789 1789 3505 -1677 -5385 -2075 3368 1823 -4005 -4606 1078 4459 1
6567Am403K943N991m76n718j809N260L741l659n090J411N588N84n948l032M484
$$ 1 -4402 -1459 4532 4056 -1662 -3471 1789 5530 1871 -3219 -1808 3780 4364 -1584 -4616 -132
6583a32M209k867n629M61N736J439m963l523L482N256j677n543J50N525K460m229
$$ -132 4077 1210 -4419 -3958 1778 3217 -1746 -5269 -1787 3469 1792 -3751 -3601 1924 4384 155
6599A55m005L079N177p50n199j518M908L254l942m412J568M845q3n435j981M069
$$ 155 -3850 -771 4406 3656 -1543 -3061 1847 5101 1159 -3253 -1685 3160 3077 -2358 -4339 -270
6615b70L565k624n116J143M979R10m555k538L785M052j721m484L32M999J688l966
$$ -270 3295 671 -4445 -3302 1677 2587 -1968 -4506 -721 3331 1610 -2874 -2542 2457 4145 179
6631A79l141K805M128q67m789q25L804K553l485l714J789L853k96m231j306L468
$$ 179 -2962 -157 3971 3104 -1685 -2510 1294 3847 362 -3352 -1563 2290 1994 -2237 -3543 -75
6647g5K358k442l156J156L562O13l364j628L100K744j703k877M82L427P06k859
$$ -75 2283 -159 -3315 -2159 1403 2016 -1348 -2976 124 2868 1165 -1712 -1230 2197 2903 44
6663D4j481J751K359j165k701n36K627J008k148j934J317K283p94k142p85K115
$$ 44 -1437 314 2673 1508 -1193 -1729 898 1906 -242 -2176 -859 1424 630 -1512 -2297 -182
6679a82J204j479j392R29J876M6j725n16J604J243q24j378N66J032L32j039q45
$$ -182 1022 -457 -1849 -920 956 1002 -723 -1239 365 1608 784 -594 -28 1004 1336 297 -548
6696e48P04Q02m20q48k89M11J27k36p94L22L76O9l71RJ47M81m5M1j34J85K85J58
$$ -548 156 958 538 -310 -599 -188 -61 -297 -1091 -769 -393 -324 -695 -686 -539 -58 -103 -62 -196 -11 274 432
6718D32J08n53O9P33J74n27o03J28O80P8q76n54N93O93k33j167j27J218K34r42
$$ 432 540 -13 56 789 963 436 -167 -39 641 719 -157 -711 -118 575 342 -825 -952 266 500 -442
6738d42r03R57J230k1j711j34J388R82j202j047O96J343M51k321o38J504J591
$$ -442 -1345 -388 842 821 -890 -1024 364 1346 144 -903 -207 1136 1587 -734 -1372 132 1723
6755A723j040j953J50K145N94k105j638J531K581j026k625q9K322J424k140j928
$$ 1723 683 -1270 -1120 1025 1619 -486 -2124 -593 1988 962 -1663 -1752 570 1994 -146 -2074
6771b074J213K592n6k992j037L011J896j973k808Q12L203M76l231j786L069K512
$$ -2074 -861 1731 1675 -1317 -2354 657 2553 580 -2228 -1416 1787 2263 -968 -2754 315 2827
6787B827j675l487K99L675J134l370k604K495L807j394m072l58L980J995l470
$$ 2827 1152 -2335 -2036 1639 2773 -597 -3201 -706 3101 1707 -2365 -2723 1257 3252 -218
6802b18k957J972M191o83m545j095M166K680k910m329J730M824K35m655k091L948
$$ -218 -3175 -1203 2988 2305 -2240 -3335 831 3511 601 -3728 -1998 2826 3061 -1594 -3685 263
6818B63L657k881m304N95N388Q65m676l081L863M275j941n119j02N514J778m653
$$ 263 3920 1039 -3265 -2670 2718 3583 -1093 -4174 -311 3964 2023 -3096 -3198 2316 4094 -559
6834e59l654L100M669r83n537q02N209K565m141m354K805N142l92n741j364N082
$$ -559 -4213 -1113 3556 2573 -2964 -3766 1443 4008 -133 -4487 -1682 3460 3068 -2673 -4037 1045
6850A045L615l893m856K050N605L49n872k278M751M159l238n406R58N824J293
$$ 1045 4660 767 -4089 -2039 3566 3915 -1957 -4235 516 4675 1437 -3969 -3011 2813 4106
6865D106n618l318M158M577k144n662J89N563K001m671l741L550N147j614n270
$$ 4106 -1512 -4830 -672 3905 1761 -3901 -3712 1851 3852 -819 -4560 -1010 4137 2523 -2747
6880b747q42N366K987m341m004K230N234p11n391j526M704L240l458m627J567
$$ -2747 -3589 1777 4764 423 -3581 -1351 3883 3172 -2219 -3745 959 4199 741 -3886 -2319
6895b319N048M2m818k066L988L650k604m884J090N173J097m566k544L650M137
$$ -2319 2729 2771 -2047 -4113 -125 3525 921 -3963 -2873 2300 3397 -1169 -3713 -63 4074
6910D074k032m388k8M588J694l926k983K144M190j268m282q24M029K170l325l375
$$ 4074 2042 -2346 -2374 2214 3908 -18 -3001 -857 3333 2065 -2217 -3041 988 3158 -167 -3542
6926c542J486L964q2l653j573L580K898k635l146P76L936P05l469j901L148K819
$$ -3542 -2056 1908 1826 -1827 -3400 180 3078 443 -2703 -1927 2009 2714 -755 -2656 492 3311
6942C311j704l359J70L585R46l179k146K075K841j474l220l02K966J289k305k369
$$ 3311 1607 -1752 -1582 2003 2949 -230 -2376 -301 2540 1066 -2154 -2456 510 1799 -506 -2875
6958b875J604K371k79k201r02K706J866k047j934J020K514K3k073p94J957J426
$$ -2875 -1271 1100 821 -1380 -2282 424 2290 243 -1691 -671 1843 1866 -207 -1001 956 2382
6974B382j232k002K66J791K09j759j224J287J259j080j510N0J592L69j337r22
$$ 2382 1150 -852 -586 1205 1414 -345 -1569 -282 977 -103 -1613 -1563 29 398 -939 -1861
6990a861J035J327n76o04r2J364M18p79j43L87O12m19m37L73L48qo22l22K60k79
$$ -1861 -826 501 -75 -679 -771 593 1011 232 89 476 1088 669 232 605 953 945 323 1 261 -18
7010a8l09J18j07k2o01qK38K17l65k77O60O68l02m87J23Q51Q30j097l90J045J032
$$ -18 -327 -209 -316 -338 -939 -947 -709 -492 -857 -1134 -474 194 -108 -595 -472 379 1209 112 -278 767 1799
7031A799o28j521L55J561p4j435j128P08J562q38j865r4J841N64j805j373J085
$$ 1799 1171 -350 5 1566 1492 57 -1071 -363 1199 361 -1504 -1598 243 807 -998 -2371 -1286
7048a286J965l14k154m40K565J311j475j980J421K789k41k603p26K681J504k005
$$ -1286 679 365 -1789 -2229 336 1647 172 -1808 -387 2402 2161 -442 -1168 1513 3017 1012
7064A012k535M97L375k24l101j783K322K395j906l308N55L757N24l144k061K550
$$ 1012 -1523 -1026 2349 2125 -976 -2759 -437 1958 52 -3256 -2701 1056 1580 -1564 -3625 -1075
7080a075L219j133l528L65L748J596l083k570K449L758j466l412m98L329K009
$$ -1075 2144 1011 -2517 -2152 1596 3192 109 -2461 -12 3746 2280 -1132 -1630 1699 3708
7095C708l034l517J823L658m65m283j396L463K520k769l605R97M448K85l688j758
$$ 3708 674 -2843 -1020 2638 2173 -2110 -3506 -43 2477 -292 -3897 -2900 1548 1833 -1855 -3613
7111c613L286L169j470l896N16M629J301l835k553K382L984j310m325m62M001
$$ -3613 -327 2842 1372 -2524 -2008 2621 3922 87 -2466 -84 3900 2590 -1735 -2197 1804
7126A804J835l768l720K264M157q62m532j155L856K585k604m015J700M552K27
$$ 1804 3639 -129 -3849 -1585 2572 1710 -2822 -3977 -121 2464 -140 -4155 -2455 2097 2324
7141B324m036j825L772L716k210m026K36N048J117m125k831L102L736j702m566
$$ 2324 -1712 -3537 235 3951 1741 -2285 -2049 2999 4116 -9 -2840 262 3998 2296 -2270
7156b270n84M382J677l676l735K424M212r82m808q36M393K783l231l851K013M888
$$ -2270 -2854 1528 3205 -471 -4206 -1782 2430 1448 -3360 -4196 197 2980 -251 -4102 -2089 2799
7172B799K37m365j639M116L423k829m043P95M740Q54m714k454L263L452k187m407
$$ 2799 3036 -1329 -2968 1148 4571 1742 -2301 -1506 3234 4088 -626 -3080 183 3635 1448 -2959
7188b959K32M275J214l988l168K634M263j251m225q01M643K165l145l346K430
$$ -2959 -2727 1548 2762 -1226 -4394 -1760 2503 1252 -2973 -3774 869 3034 -111 -3457 -1027
7203a027M401m08m158j161L642K617k400l707J183L830L73m171j906L252K531
$$ -1027 3374 2966 -1192 -2353 1289 3906 1506 -2201 -1018 2812 3185 -986 -2892 360 2891
7218B891j974m171R45L635L33l195k220K824K782j067l394L77L648J180k664k197
$$ 2891 917 -3254 -2309 1326 1659 -1536 -3756 -932 1850 783 -2611 -2234 1414 2594 -70 -2267
7234b267K186K886n28l255m57K905J448k168k327J056K529m18k710r16K040J538
$$ -2267 -81 2805 2277 -978 -1435 1470 2918 750 -1577 -521 2008 1590 -1120 -2036 4 1542
7250A542j817k272P40K574L37k135j375K099J977j430j639L87K223O93j791r97
$$ 1542 -275 -2547 -1807 767 1104 -1031 -2406 -307 1670 240 -1399 -1012 1211 1904 113 -884
7266h84J135J647o20j558k25J575N68j388j332R41R11l69j390k97J120N40j046
$$ -884 251 1898 1278 -280 -505 1070 1638 250 -1082 -141 770 401 -989 -1286 -166 374 -672
7283f72o29L17J100j75o31n9O29Q59l26o75Q6P54M13n70k88L30K91k88l23J21
$$ -672 -1301 -984 116 -59 -690 -749 -120 739 413 -262 -176 578 991 421 133 463 754 466 143 264
7303B64k05J3k03l08J13P6k22K42j76k04O7K80j06K80m45o2Q63K75m95k86M53
$$ 264 59 72 -131 -439 -326 -250 -472 -230 -406 -610 -543 -263 -369 -89 -534 -596 267 542 47 -239 214
7324B14Q19l95o49k18J298j7p51q46M09Q29j70j134n00J099Q83j144j055M27J160
$$ 214 1033 638 -11 -229 1069 1052 301 -545 -136 693 523 -611 -1111 -12 871 -273 -1328 -901 259
7343B59L55j731l07J297J231q73j295L34J729N07j501j365J148K219q71k292p7
$$ 259 614 -1117 -1424 -127 1104 231 -1064 -730 999 1506 5 -1360 -212 2007 1136 -1156 -1233
7360a233K215R62j991j934J270K247l38k439q67K257J880j804k535Q76L008K64
$$ -1233 982 1944 -47 -1981 -711 1536 1198 -1241 -2108 149 2029 225 -2310 -1434 1574 1838
7376A838l462q61K389K743j891k836P55L264P88l395j616K509K575j487l580K62
$$ 1838 -1624 -2485 -96 2647 756 -2080 -1325 1939 2727 -668 -2284 225 2800 1313 -2267 -2005
7392b005L601J090l307j980J970L243j210l689j45L408K023l281k947K101L603
$$ -2005 1596 2686 -621 -2601 -631 2612 1402 -2287 -2432 976 2999 -282 -3229 -1128 2475
7407B475j60m259j063L864K697k976l490J526M227p8m155j654L620K795k208m122
$$ 2475 2315 -1944 -3007 857 3554 578 -2912 -1386 2841 2763 -1392 -3046 574 3369 1161 -2961
7423b961P63M373Q42m200k324L160L718j990m370M05M193J618l842k840K626L958
$$ -2961 -2198 2175 3017 -1183 -3507 -347 3371 1381 -2989 -2584 1609 3227 -615 -3455 -829 3129
7439C129j056m621m36M262K127l413l365K249M087o85m459q91L885K603l016l714
$$ 3129 2073 -2548 -2984 1278 3405 -8 -3373 -1124 2963 2278 -2181 -3072 813 3416 400 -3314
7455c314J981M015k18l582k046L324L170k256m061R37M169O88l728k386K783L610
$$ -3314 -1333 2682 2464 -1118 -3164 160 3330 1074 -2987 -2050 2119 2807 -921 -3307 -524 3086
7471C086j776l944Q0M101J564l602k726K595L443r49l953n71L569K190k747k977
$$ 3086 1310 -2634 -2554 1547 3111 -491 -3217 -622 2821 1872 -2081 -2652 917 3107 360 -2617
7487b617J453L627l04l466j074L097K335k316l352R00L427L87l431j538K789K598
$$ -2617 -1164 2463 2159 -1307 -2381 716 3051 735 -2617 -1717 1710 2097 -1334 -2872 -83 2515
7503B515j648l291J96L395R83k871j971J983K934p80l244n13L583J302k125k407
$$ 2515 867 -2424 -2228 1167 2150 -721 -2692 -709 2225 1445 -1799 -2312 1271 2573 448 -1959
7519a959J140L083m19l289o70K792J560j793k636J025K479L68k777j215K084J979
$$ -1959 -819 2264 1845 -1444 -2114 678 2238 445 -2191 -1166 1313 1681 -1096 -2311 -227 1752
7535A752j359k249K09K519O55j948j544J701K002p36k194J23K450P68j832j546
$$ 1752 393 -1856 -1647 872 1527 -421 -1965 -264 1738 1002 -1192 -1069 1381 2149 317 -1229
7551a229J106J710n36j875m93J834P95j604j311M20J885R6j712p78J597J160j066
$$ -1229 -123 1587 1051 -824 -1317 517 1312 -292 -1603 -1183 702 798 -914 -1692 -95 1065 -1
7568aj017K98J475O0r67n58R41R66l48j345K98R63J25q26m80K89N78K5r97QL14
$$ -1 -1018 -720 755 815 -152 -710 231 1197 849 -496 -198 765 890 64 -416 -127 451 476 -521 -513 -199
7589a99K02p69R5r7M13j4j16%J03N30M3k09K86L5j15L02K66j34k67N4M51j25o37
$$ -199 3 -766 -671 -768 -355 -369 -485 -485 -382 148 191 -18 268 303 188 490 756 622 355 409 860 735 98
7612I8j3K50K10l33p21K3O87k9j121m10J197N03n74j087O27J068J69j131l46J282
$$ 98 85 335 545 212 -509 -486 201 172 -949 -1359 -162 341 -233 -1320 -693 375 544 -587 -933 349
7632C49J205r22j147N32J314K95j561r28J243J266q54j843k58J654O56j676j516
$$ 349 1554 632 -515 17 1331 1626 65 -863 380 1646 792 -1051 -1309 345 1001 -675 -2191
7649b191J275J784o88j847l8J947Q57j382j630J214J994K65k348m91K207J633
$$ -2191 -916 868 180 -1667 -1705 242 1099 -283 -1913 -699 1295 1560 -788 -1279 928 2561
7665B561j570k214O74K625j4k701r60J723J715j265k256J30K581K96k390j772
$$ 2561 991 -1223 -549 2076 2062 -639 -1599 124 1839 574 -1682 -1552 1029 1325 -1065 -2837
7681b837J950K539j035k872L78K523J260j920k044J287L132l54k819n51K555J729
$$ -2837 -887 1652 617 -2255 -1877 646 1906 -14 -2058 -771 2361 2007 -812 -1363 1192 2921
7697B921k151k230Q11K844j1k765j731K293K327j994l023O80K963O95k909j865
$$ 2921 770 -1460 -649 2195 2184 -581 -2312 -19 2308 314 -2709 -2029 934 1629 -1280 -3145
7713c145K007K983r72l310K32L391J736k736k502J910L241m89l295q24L096J995
$$ -3145 -1138 1845 873 -2437 -2205 1186 2922 186 -2316 -406 2835 2346 -949 -1773 1323 3318
7729C318k545l082J309L593k61l969j707L246K431k135l395M03L823P08l117j874
$$ 3318 773 -2309 -1000 2593 2332 -1637 -3344 -98 2333 198 -3197 -2794 1029 1737 -1380 -3254
7745c254K745L182j415l329J75L425J614k886k594K310L418q87m244j65L240J546
$$ -3254 -509 2673 1258 -2071 -1896 1529 3143 257 -2337 -27 3391 2504 -1740 -1905 1335 2881
7761B881k426l315J565L186j20l791j257L203K364k526l371J289M110J74l383
$$ 2881 455 -2860 -1295 1891 1771 -2020 -3277 -74 2290 -236 -3607 -2318 1792 1966 -1417
7776a417j808L604K811j959l283N45L801Q60l264k143K795K631j570l558K70L184
$$ -1417 -3225 379 3190 1231 -2052 -1507 2294 3154 -110 -2253 542 3173 1603 -1955 -1685 1499
7792A499P71k840k330J733L059q98l396n94L547J365k513k102J522L051m20k862
$$ 1499 2270 -570 -2900 -1167 1892 994 -2402 -2996 551 1916 -597 -2699 -1177 1874 1454 -1408
7808a408l30K450J865j690k638J147K812lk702j165K193J897j700k531M98K341
$$ -1408 -1738 712 2577 887 -1751 -604 2208 2205 -497 -1662 531 2428 728 -1803 -1305 1036
7824A036L48k472j431J740K142j259k134O1K212J113k040j219J345J966p2j978
$$ 1036 1384 -1088 -2519 -779 1363 104 -2030 -1969 243 1356 -684 -1903 -558 1408 1336 -642
7840f42k9J607J179j199j639M52J861l60j572n82J210R22p18j873L59J305J19
$$ -642 -671 936 2115 916 -723 -271 1590 1230 -342 -924 286 1208 490 -1383 -1024 281 400
7857D00j456o53J065J145p76q00J48J493J78q13m52P18R22k55r48l6J241L01p68
$$ 400 -1056 -1709 -644 501 -275 -1075 -927 566 744 -69 -521 197 1119 864 -84 -120 1121 1422 654
7876F54n39O8O28j95j062j3K54L48m31m40J01K13O4l09l2J12P20l24m0J58K51
$$ 654 115 183 811 616 -446 -459 -205 143 -288 -728 -627 -414 -350 -659 -691 -579 141 -183 -223 -65 186
7897A86J24L9p6K48J08l8J74k2m38j37J73K1j09r05J87L18K71m93m95K89N33o5
$$ 186 310 349 273 521 629 591 765 743 305 168 341 362 253 -652 -465 -147 124 -369 -864 -575 -42 -107
7919a07q36l5J019L96n97p36N66J126K3j166K23N73J252j148j142O00J235j17
$$ -107 -943 -978 41 437 -160 -896 -330 796 819 -347 -124 449 1701 553 -589 11 1246 1129
7937A129j622o43J175J180j069j466M88J561Q0j710r18J277J335p00j696L55K245
$$ 1129 -493 -1136 39 1219 150 -1316 -828 733 813 -897 -1815 -538 797 97 -1599 -1244 1001
7954A001L80j732j137J667J808q27k159q1K285R42j846j953J228K359n21k757
$$ 1001 1381 -351 -1488 179 1987 1160 -999 -1080 1205 2147 301 -1652 -424 1935 1414 -1343
7970a343m36K189J434k183k169J292K509j42k726q03K540J635j401k738J097L077
$$ -1343 -1779 410 1844 -339 -2508 -1216 1293 1151 -1575 -2378 162 1797 396 -2342 -1245 1832
7986A832Q9k889r82K251K237j493k789N91L216J49k671j995K289K890j927k986
$$ 1832 1921 -968 -1950 301 2538 1045 -1744 -1153 2063 2212 -459 -2454 -165 2725 798 -2188
8002b188K64K722J378k725k170K099K593o05l211o87L346J780k317k778J566L189
$$ -2188 -1924 798 2176 -549 -2719 -620 1973 1368 -1843 -2530 816 2596 279 -2499 -933 2256
8018B256l8l549j059L157J793j946k847J110K989L4l005j423K726K117j325l041
$$ 2256 2218 -1331 -2390 767 2560 614 -2233 -1123 1866 1900 -1105 -2528 198 2315 990 -2051
8034b051K02L129P71k905j862K108K795j060l133j52L187J552k819j920J702K706
$$ -2051 -1849 1280 2051 -854 -2716 -608 2187 1127 -2006 -2158 1029 2581 -238 -2158 -456 2250
8050B250n40l206o64K870J598k032k579Q48L457j19l168j016K526K072j602k718
$$ 2250 1710 -1496 -2160 710 2308 276 -2303 -1455 2002 1883 -1285 -2301 225 2297 695 -2023
8066b023J44L106P65k958j522K147K813j307k908j75K884J087k331k000J635K593
$$ -2023 -1879 1227 1992 -966 -2488 -341 2472 1165 -1743 -1918 966 2053 -278 -2278 -643 1950
8082A950n20k777m10K527J497k231j967J014K527J13k864r71K513J675j330k606
$$ 1950 1430 -1347 -1757 770 2267 36 -1931 -917 1610 1723 -1141 -2112 401 2076 746 -1860
8098a860N33K725M84k658j159J796K097j053k459l9K435R64k180j643J369K226
$$ -1860 -1327 1398 1882 -776 -1935 -139 1958 905 -1554 -1593 842 1806 -374 -2017 -648 1578
8114A578o75k123K1J917J005j672j779Q65K593o53k063o16J987J417j482j712
$$ 1578 903 -1220 -1199 718 1723 51 -1728 -863 1730 1077 -986 -1602 385 1802 320 -1392
8130a392M54K091O2k015p68J621J183q00k101N46J653O24j668j202J635J438m23
$$ -1392 -938 1153 1215 -800 -1568 53 1236 436 -1665 -1119 534 1158 -510 -1712 -77 1361 938
8147I38k153K01J726O80j484p18O32J744p74j504l8J106P27j216p71N64R96m0
$$ 938 -1215 -1014 712 1392 -92 -810 -178 1566 792 -712 -750 356 1083 -133 -904 -340 656 616
8165F16j077k94P28Q35p93q30L91O08K80o22o7K28L62k22m27K56L54L36n80p2
$$ 616 -461 -755 -27 808 15 -815 -424 184 464 -158 -225 3 365 143 -284 -28 326 662 82 10
8185A0J98n3K30j87k15k3
$$ 10 208 155 385 198 -17 -40
8191d0
$$ Imaginary data points
##PAGE= N=2
##DATA TABLE= (X++(I..I)), XYDATA
0@%%%%%%qQ%Qj6J6k4M0m8N3o9Q8j04J21j47J80k11K48k95L46l98M61n35O12o99
$$ 0 0 0 0 0 0 0 -8 0 0 8 -8 8 -16 24 -24 29 -40 48 -56 65 -82 98 -113 135 -160 186 -212 249 -286 326 -373
31c73Q01r11J027j161J313j474J650j849K063k294K551k834L140l471L838m240
$$ -373 428 -483 544 -617 696 -778 872 -977 1086 -1208 1343 -1491 1649 -1822 2016 -2224
47b224M674n151N677o253O886p591Q378r251J0236j1359J2643j4128J5877j7971
$$ -2224 2450 -2701 2976 -3277 3609 -3982 4396 -4855 5381 -5978 6665 -7463 8414 -9557
61i557K0520k3714K7857l3465M1514n4124P6829j30264M84159L10792j075825
$$ -9557 10963 -12751 15106 -18359 23155 -30969 45860 -84404 399755 710547 -365278
72c65278j78843Q03515N98523o78565p99345K81163R13697r811r00435m06958
$$ -365278 -544121 259394 857917 179352 -619993 -338830 574867 565056 -335379 -742337
82g42337P41312O21049m99295q36391J83618Q66156J68229p95485m34945O26012
$$ -742337 -1025 620024 120729 -715662 -532044 334112 502341 -293144 -728089 -102077
92a02077P02290l27566p73699N1852Q23792K81714o71142n16225M81769O94660
$$ -102077 600213 272647 -501052 -449200 374592 656306 -14836 -531061 -49292 645368
102F45368k03505p67281r6259O96651L40629n82119n83743L18245O62069r1807
$$ 645368 441863 -325418 -421677 274974 615603 33484 -550259 -232014 430055 338248
112C38248p07409k03933N99330M11426m34844n66339K12331O44007N4725n87609
$$ 338248 -369161 -573094 26236 437662 2818 -563521 -351190 292817 347542 -240067
122b40067k50097M99101M59882k80988n30535R6803N72168J40293m85351l15588
$$ -240067 -490164 8937 468819 187831 -342704 -245901 326267 466560 -18791 -334379
132c34379L51996M36767j86819n08757l2389M57242J83153l99494l56809K29948
$$ -334379 17617 454384 267565 -241192 -273581 183661 366814 -32680 -389489 -159541
142a59541M11099q3931m44767j01686L88893K47946k77961l33868J54629M01081
$$ -159541 251558 167627 -277140 -378826 10067 258013 -19948 -353816 -199187 201894
152B01894K6113l57248j37120L17493K74984j78963l18198O2662L39298O9986
$$ 201894 228007 -129241 -266361 51132 326116 147153 -171045 -108383 230915 300901
162C00901k99868j88177K04673K45331j21570l00663j8641K55916R4918k29476
$$ 300901 1033 -187144 17529 262860 141290 -159373 -178014 77902 172820 -56656
172e6656j96781J29909K24263m4118k30158m4788K09172J31923j35413j57837
$$ -56656 -253437 -123528 100735 56617 -173541 -218329 -9157 122766 -12647 -170484
182a70484Q6263K00261J5563j65640n9062J48471J21382q2963j39494K5918J38561
$$ -170484 -84221 116040 131603 -34037 -93099 55372 176754 93791 -45703 -19785 118776
193A18776J9058j29788p7739P2655Q2031n4726j12096p006Q1513K2918p1967n3261
$$ 118776 137834 8046 -69693 2962 84993 30267 -81829 -88835 -7322 15596 -56371 -109632
205a09632M0307N8747r761m3223L231M6540K6852j0956o157J8840J8038N858O897
$$ -109632 -69325 -10578 -20339 -63562 -60331 -13791 13061 2105 -4052 14788 32826 38684 45581
218D5581Q070p963j3828J1306K3046j4312m8106j6028L9789J9823n6381o2633
$$ 45581 53651 45688 31860 43166 66212 51900 3794 -12234 27555 47378 -9003 -71636
230g1636K4474O8652j2341r3515k8475R0690O8296o7631r7473M5717J36463J5497
$$ -71636 -47162 21490 9149 -84366 -112841 -22151 46145 -21486 -118959 -73242 63221 78718
242G8718j25688n2741J28276J21269p9916j51197L3332J75246L5706j73833j11777
$$ 78718 -46970 -99711 28565 149834 69918 -81279 -47947 127299 163005 -10828 -122605
253a22605J34034J59489q9037k10138l371K05717P2436j98661j59884J36413K10413
$$ -122605 11429 170918 81881 -128257 -131628 74089 146525 -52136 -212020 -75607 134806
264A34806n9803k42895l0503K43574J30458j90747j97437J28997K65406j9423
$$ 134806 75003 -167892 -198395 45179 175637 -15110 -212547 -83550 181856 162433
274A62433k70770p3962K55523J81148j86266k56435R2939K96633J5507l02144
$$ 162433 -108337 -182299 73224 254372 68106 -188329 -95390 201243 216750 -85394
284h5394j39571K45362K28674j72695l08018M8287L24543P0072l07991j92119
$$ -85394 -224965 20397 249071 76376 -231642 -183355 141188 211260 -96731 -288850
294b88850K37430K86832j27084l35741N219L46948J35192k89597k40813K06295
$$ -288850 -51420 235412 108328 -227413 -222194 124754 259946 -29651 -270464 -64169
304f4169L29657p5017l53718n7274L34886J87965k65610k94450J49906L46534
$$ -64169 265488 190471 -163247 -220521 114365 302330 36720 -257730 -107824 238710
314B38710k1369l61388j25234L09166K38622k24592l29909R3107L64574M6582
$$ 238710 217341 -144047 -269281 39885 278507 53915 -275994 -182887 181687 228269
324B28269l51015j80961K84191K93562j66050l56051L4121L76739J15833l27898
$$ 228269 -122746 -303707 -19516 274046 107996 -248055 -213934 162805 278638 -49260
334d9260k38930K39031L35691j08838l77903l7085L61719J76481k94913k94701
$$ -49260 -288190 -49159 286532 177694 -200209 -237294 124425 300906 5993 -288708
344b88708J78636L58871m3580l77753j07886L33116K34047k42492l28426J14014
$$ -288708 -110072 248799 205219 -172534 -280420 52696 286743 44251 -284175 -170161
354a70161L72056L3223l56548j69491K92268K84238j77885l50409M3378L69415
$$ -170161 201895 235118 -121430 -290921 1347 285585 107700 -242709 -199331 170084
364A70084J01317l27735k26805K39979L20726j15788l66471k6679L54194J62062
$$ 170084 271401 -56334 -283139 -43160 277566 161778 -204693 -231372 122822 284884
374B84884k93475k77769J84955L48684n1523l67777r1612L32466K20982k47404
$$ 284884 -8591 -286360 -101405 247279 195756 -172021 -263633 68833 289815 42411
384D2411l15433J25457L61941J5618l53793j52194K93971K64082j90604l35269
$$ 42411 -273022 -147565 214376 229994 -123799 -275993 17978 282060 91456 -243813
394b43813N9143L54725P6903l24176k00940K42854K92003j28065l38032j434L35016
$$ -243813 -184670 170055 246958 -77218 -278158 -35304 256699 128634 -209398 -210832 124184
405A24184J31106k80792k35316J89072L06710p0164l29669n6214L06216J72040
$$ 124184 255290 -25502 -260818 -71746 234964 164800 -164869 -221083 85133 257173
415B57173k38088k60876J35075L07983j9047l14534j01760K69772K00210j92638
$$ 257173 19085 -241791 -106716 201267 182220 -132314 -234074 35698 235908 43270
425D3270k72429Q6677L01372K7791k84631j33552K30089K20954j41157k66634
$$ 43270 -229159 -142482 158890 186681 -97950 -231502 -1413 219541 78384 -188250
435a88250M1895K78970O7871k43243j55533J82082K21838r3865k49190m233K38767
$$ -188250 -146355 132615 200486 -42757 -198290 -16208 205630 111765 -137425 -141658 97109
446I7109R1359k01460j67278J29964K04859n1546k22253l7004J99442J06882j54583
$$ 97109 188468 -12992 -180270 -50306 154553 103007 -119246 -156250 43192 150074 -4509
457d509j60691Q7688J89841j2493j85311n1994J62666J14931j07853j46301N4344
$$ -4509 -165200 -77512 112329 99836 -85475 -137469 25197 140128 32275 -114026 -59682
468e9682J64549J1418j49513o5113J18843J05252p5612j30628K0332J24790K2122
$$ -59682 104867 116285 -33228 -98341 20502 125754 50142 -80486 -60154 64636 86758
479H6758j15374o8816P6140Q6687m4237j01011J869R1301L1578p0365n2553M8833
$$ 86758 -28616 -97432 -21292 65395 21158 -79853 -77984 13317 44895 -25470 -78023 -29190
491b9190O9765j3732o0540l009N9477L0003l6106l3397K3709L8637n281l3179
$$ -29190 40575 26843 -33697 -36706 22771 52774 16668 -16729 6980 45617 40336 7157
503G157q438K0973Q156j8779j5266K122K001p735o538J697l577j2217J539J7018
$$ 7157 -1281 19692 27848 9069 -6197 -4075 -2074 -9809 -16347 -14650 -18227 -30444 -28905 -11887
517a1887L732j9320r269K7566K9665j4524l1289J2884M9835J3817m3798k6650
$$ -11887 -8155 -27475 -36744 -9178 20487 5963 -25326 -12442 37393 51210 7412 -19238
529a9238M3942M9496k6864o5943k35O7579K0571p2272n9567M3819P2475k7650
$$ -19238 24704 74200 47336 -18607 -18842 48737 69308 -2964 -62531 -18712 53763 26113
541B6113r6108j6478Q9008M8364p7749q2483N0476J10631m648j10756l1359J12755
$$ 26113 -69995 -86473 2535 50899 -26850 -109333 -58857 51774 47126 -63630 -94989 17766
553A7766Q6586p4716j10494M3125J39158J6131j35136o7720J14536J12514p8338
$$ 17766 104352 29636 -80858 -37733 101425 117556 -17580 -85300 29236 141750 63412
564F3412j53014J3075J55617L7810j55792j09641J07130J46591o0386j79714j2204
$$ 63412 -89602 -76527 79090 116900 -38892 -148533 -41403 105188 44802 -134912 -147116
575a47116J78241Q2633j47350j37390J04611J89538k3182j92372m1069J91149
$$ -147116 31125 113758 -33592 -170982 -66371 123167 99985 -92387 -133456 57693
585E7693J25827j38348j74577P8209K12111L409k16067r0390J80742J55461j32983
$$ 57693 183520 45172 -129405 -51196 160915 164324 -51743 -142133 38609 194070 61087
596F1087k19421M0506K28375L6314k28007j33094J74378J97534j05171k41841
$$ 61087 -158334 -117828 110547 146861 -81146 -214240 -39862 157672 52501 -189340
606a89340J6170K55074Q7375k17843j63776J68386K40402o7494k58009k1789K61182
$$ -189340 -173170 81904 169279 -48564 -212340 -43954 196448 128954 -129055 -150844 110338
617A10338J28783k09462k07120J31368K56249l7548k79360p7356K41564J58610
$$ 110338 239121 29659 -177461 -46093 210156 172608 -106752 -184108 57456 216066
627B16066j91638k43522Q8176K69075N522k74911j14151K28819K02304j49757
$$ 216066 24428 -219094 -130918 138157 143679 -131232 -245383 -16564 185740 35983
637C5983k55688O0269K88690N9067k54855j45338K11583K37688j13678k72609
$$ 35983 -219705 -159436 129254 188321 -66534 -211872 -289 237399 123721 -148888
647a48888J6176K81685R2969k47914j90745J71391K47195q5878k88966l5454K63474
$$ -148888 -132712 148973 241942 -5972 -196717 -25326 221869 135991 -152975 -188429 75045
658G5045J24408k25831k17883J34275K62255l6422k74583o6666K51166J68136
$$ 75045 199453 -26378 -244261 -109986 152269 115847 -158736 -225402 25764 193900
668A93900j77022k24198R9845K70655J6521k51114j01421K17817J89918j37887
$$ 193900 16878 -207320 -107475 163180 179701 -71413 -172834 44983 234901 97014
678I7014k38122M5249K50889M5608k37687j44064J70042J96390j04114k44775
$$ 97014 -141108 -95859 155030 200638 -37049 -181113 -11071 185319 81205 -163570
688a63570k60K33882Q0260k05947j62384J39381K14611n4155k28438k6726K22756
$$ -163570 -163830 70052 150312 -55635 -218019 -78638 135973 81818 -146620 -173346 49410
699D9410J21286j62721j71454J06031K18659j1667k11166o4315J86565J36702
$$ 49410 170696 7975 -163479 -57448 161211 149544 -61622 -125937 60628 197330
709A97330j32699j87791N2523J96619J5963j96152j02300J43150J44039r4015
$$ 197330 64631 -123160 -70637 125982 141945 -54207 -156507 -13357 130682 36667
719C6667j85458J2964J82068N4419j58649j11712J15486J60139m3825j65297j0673
$$ 36667 -148791 -135827 46241 100660 -57989 -169701 -54215 105924 62099 -103198 -113871
730a13871J68311Q5089j21970j20847Q1544J56012j5348j56055m3903J34185R0264
$$ -113871 54440 139529 17559 -103288 -21744 134268 118920 -37135 -81038 53147 143411
741A43411j02473j35448L9744J37008L769j42871o7392J04218R7827o8876j25343
$$ 143411 40938 -94510 -54766 82242 86011 -56860 -124252 -20034 77793 8917 -116426
752a16426J7424J28606L4853j07476o8174Q4568J07046l0814j05786k04J09912
$$ -116426 -99002 29604 64457 -43019 -111193 -26625 80421 49607 -56179 -56383 53529
763E3529N0161p9437p3715N2181R1184j6178r6239k6063P5405M5537o3192p6466
$$ 53529 103690 24253 -49462 2719 93903 77725 -18514 -44577 30828 76365 13173 -63293
775f3293K2310P1527l302p6097l1320N5720M7330l6002n6306J5905O3024J4680
$$ -63293 -40983 30544 27242 -48855 -80175 -24455 22875 -13127 -69433 -53528 9496 24176
787B4176m5104k1432M1472M3691j4416l6155O499L9575J2469k7943k0287J5850
$$ 24176 -20928 -42360 -888 42803 28387 -7768 -1269 38306 50775 22832 2545 18395
799A8395J8892j1462k3946o055Q863q73j4230r186k63j678l897J194L200m007
$$ 18395 37287 25825 1879 -4176 4687 3814 -10416 -19602 -19865 -21543 -25440 -24246 -21046 -25053
813b5053n340R675J8312Q38j4582J948K8626J8493j8311k1620J9883L7073m059
$$ -25053 -30393 -20718 -2406 -1568 -16150 -14202 14424 32917 14606 -7014 12869 49942 45883
826D5883m1892j2795M0027K6168l9146n0224J5515N2442l851o7162k9270N3471
$$ 45883 3991 -8804 31223 57391 18245 -31979 -16464 35978 32127 -35035 -64305 -10834
838a0834M5991m2993o8686J7550Q0276J4598p4755l9467O9146P5629l5176q5415
$$ -10834 35157 -7836 -76522 -58972 21304 35902 -38853 -78320 -9174 66455 31279 -54136
850e4136J0521R9605L3871q5029o4986O4779R2777l2132j10717j3894J03485M8687
$$ -54136 -43615 55990 89861 4832 -60154 4625 97402 65270 -45447 -59341 44144 92831
862I2831r4505r3872N4132J10720j8156j25963l3877J12824P7078q6407j10960
$$ 92831 -1674 -95546 -41414 69306 51150 -74813 -108690 4134 81212 -5195 -116155
873a16155M8961J36003P489j29991n2620J19350J06504p5116j31127K9706J48241
$$ -116155 -67194 68809 76298 -53693 -106313 13037 119541 44425 -86702 -56996 91245
884I1245L0135j38518q3961J06217J23306o2789j53850j251J50204N3683j36009
$$ 91245 121380 -17138 -101099 5118 128424 65635 -88215 -89466 60738 114421 -21588
895b1588j12427Q8615J44066l5372j61975k7533J52831Q9326j16911j32443P0478
$$ -21588 -134015 -45400 98666 63294 -98681 -126214 26617 115943 -968 -133411 -62933
906f2933J65717j466j62981n6988J46559J18604r8794j55837M0945J73023K5443
$$ -62933 102784 101318 -61663 -118651 27908 146512 47718 -108119 -67174 105849 131292
917A31292j66795r2510J29345J39393q0864j76866Q950J77151N6059j60605j21535
$$ 131292 -35503 -128013 1332 140725 59861 -117005 -108055 69096 125155 -35450 -156985
928a56985J12358J64664m9471j84028k0263J79330R2947j40430j44139Q8903J83666
$$ -156985 -44627 120037 70566 -113462 -133725 45605 138552 -1878 -146017 -57114 126552
939A26552j3895j86225n5461J67231J21742j19748j68226N3333J87913J6788j84402
$$ 126552 112657 -73568 -129029 38202 159944 40196 -128030 -74697 113216 130004 -54398
950e4398r1772J46957J44725r4406j84508K1261J91140N0478j72995j16989J29728
$$ -54398 -146170 787 145512 51106 -133402 -112141 78999 129477 -43518 -160507 -30779
961c0779J67481o4474j90416n462J91290Q1144j58115j38300J07298J81252l6937
$$ -30779 136702 72228 -118188 -123650 67640 148784 -9331 -147631 -40333 140919 103982
972A03982j93794l6226J79517J04240j40455j57998P7150J85240q066j89619o5940
$$ 103982 -89812 -126038 53479 157719 17264 -140734 -63584 121656 113590 -76029 -141969
983a41969J60609J25046j12569j68404M6874J84607K3688j73577q8304J38192
$$ -141969 18640 143686 31117 -137287 -90413 94194 117882 -55695 -143999 -5807
993e807J41547q2103j69806J8204J76018M9768j53829j07011J12498J48396n5152
$$ -5807 135740 53637 -116169 -97965 78053 127821 -26008 -133019 -20521 127875 72723
1004G2723j67415q788J60933O9413j33959j19748Q7022J48802l0048j58305l1039
$$ 72723 -94692 -103480 57453 126866 -7093 -126841 -39819 108983 78935 -79370 -110409
1015a10409J44172Q3911j10260j23127O1085J43928n177j42963m7567J21923R2971
$$ -110409 33763 117674 7414 -115713 -54628 89300 84123 -58840 -106407 15516 108487
1026A08487q3164j21478L5343J31594J5588j21864o0952R4974R4920n6392j13759
$$ 108487 25323 -96155 -60812 70782 86370 -35494 -96446 -1472 93448 37056 -76703
1037g6703J1841J14466L1699r8220o7710O9763R2091l2266j00494n251R4745M0977
$$ -76703 -64862 49604 81303 -16917 -84627 -14864 77227 44961 -55533 -60784 33961 74938
1049G4938p5354o8159M7120Q3131j5156q5818j8152P3789M4065n5111o3508K8294
$$ 74938 -416 -68575 -21455 61676 46520 -39298 -57450 16339 60404 5293 -58215 -29921
1061b9921O9693j564o6512k3755N4191M3465l4774n1925J3746N4995R606m6947
$$ -29921 39772 38208 -28304 -52059 2132 45597 10823 -41102 -27356 27639 37245 -9702
1073i702k4483L5302L6531j7880l9493J035L6850J1414k9707k2179J6527K4091
$$ -9702 -34185 1117 37648 19768 -19725 -18690 18160 29574 -133 -22312 -5785 18306
1085A8306p240k6490m299J9031Q728j3391j3079O113J2777m01q278j351O712M063
$$ 18306 11066 -15424 -19723 -692 8036 -5355 -18434 -12321 456 55 -8223 -9574 -2862 1201
1099A201k8O61J446q74P09O589M237o731q419N447J2704k459j8570p151J6483
$$ 1201 1173 1834 3280 2406 3115 9704 13941 7210 -1209 4238 16942 14483 -4087 -11238 5245
1114E245J2338j6979k4408O445K7572J749l0956j6360K7541K8808j6907l6204
$$ 5245 17583 604 -23804 -17359 10213 11962 -18994 -35354 -7813 20995 4088 -32116
1126c2116N413M4276J4381l8165k7664L3124M6290j4660n2308l611N4829K6207
$$ -32116 -26703 17573 31954 -6211 -33875 -751 45539 30879 -21429 -25040 29789 55996
1138E5996m7831m7771K9133N9375j1082p0075k0007O1519M1173n1700o6021K5277
$$ 55996 8165 -39606 -10473 48902 37820 -32255 -52262 9257 50430 -1270 -67291 -42014
1150d2014P6819K884p9097l2663P0857O3672m5180q0262J9450R4341K0983q4864
$$ -42014 34805 37689 -41408 -74071 -3214 60458 15278 -64984 -45534 48807 69790 -15074
1162a5074n1397P0010Q2975l8280r8975N86J00518L7074r1029p6713N9342R7512
$$ -15074 -66471 3539 86514 48234 -50741 -50155 50363 87437 -3592 -80305 -20963 76549
1174G6549k7689j14397k0709J05011N9004q7343r4589N1454J16994n829j19371
$$ 76549 48860 -65537 -86246 18765 77769 -9574 -104163 -52709 64285 58456 -60915
1185f0915l6481J11692Q3820p6822j09215M0338J31588J3362j25764n8706J06177
$$ -60915 -97396 14296 98116 21294 -87921 -47583 84005 97367 -28397 -87103 19074
1196A9074J00343o9181j29982J8191J34412K8820j29437q3110R2944J15275n4495
$$ 19074 119417 50236 -79746 -61555 72857 101677 -27760 -110870 -17926 97349 42854
1207D2854j40928k430J38070N4384j18047r9508Q2457J34527k7452j40870k1683
$$ 42854 -98074 -100504 37566 91950 -26097 -125605 -43148 91379 63927 -76943 -98626
1218i8626J38376Q0468j02912j15808O2729J42774o390j43901m9379J24367R4454
$$ -98626 39750 120218 17306 -98502 -35773 107001 100611 -43290 -92669 31698 126152
1229A26152r2074j33696L6484J42209J2028j43214p2063J11804J09662p2182j39150
$$ 126152 34078 -99618 -63134 79075 91103 -52111 -124174 -12370 97292 25110 -114040
1240a14040J7969J46533L9525j28364q4380J00289J27466m4896j38610l158J42078
$$ -114040 -96071 50462 89987 -38377 -122757 -22468 104998 60102 -78508 -81666 60412
1251F0412O2016j13216j02284P4010J31177k3688j41257l3782J23047P6512r7155
$$ 60412 122428 9212 -93072 -19062 112115 88427 -52830 -86612 36435 112947 15792
1262A5792j19882M4659J30827O73j33142n6231J07738R6478p0316j21969K5409
$$ 15792 -104090 -59431 71396 72069 -61073 -117304 -9566 86912 16596 -105373 -79964
1273g9964J33344L0477j15497o9326R4370J10723m5339j22224K880J25609M7949
$$ -79964 53380 83857 -31640 -100966 -6596 104127 58788 -63436 -60556 65053 113002
1284A13002j05647q7557O8727J10552k9026j25746k4755J09247O0532r0164j00733
$$ 113002 7355 -80202 -11475 99077 70051 -55695 -80450 28797 89329 -835 -101568
1295a01568M5525J12550m018j15405m1572R7998Q0491o2349j00495K7718J15346
$$ -101568 -56043 56507 52489 -62916 -104488 -6490 74001 11652 -88843 -61125 54221
1306E4221K3250r9252n5136Q1507R1126m1493j02597K711J03306L5869q9516p3127
$$ 54221 77471 -21781 -76917 4590 95716 54223 -48374 -45663 57643 93512 3996 -69131
1318f9131N6985Q8420k8252j03318j7843Q9249M6237p4893p7595M1942R0254p184
$$ -69131 -12146 76274 48022 -55296 -73139 16110 62347 -12546 -90141 -48199 42055 34871
1330C4871r0235k4881Q2686N9924n3322p3180L0615Q8731R657p7708l4367O6551
$$ 34871 -55364 -80245 2441 62365 9043 -64137 -33522 55209 64866 -12842 -47209 19342
1342A9342O1012m0252p4523R710P3576J4213o9906m5688M4821N5272k8386o9854
$$ 19342 80354 40102 -34421 -24711 48865 63078 -6828 -52516 -7695 47577 19191 -50663
1354e0663l292O1345K3188n2485m3150L5403N5055j0470n2516n117N3676L0032
$$ -50663 -53955 7390 30578 -21907 -65057 -29654 25401 14931 -37585 -42702 10974 41006
1366D1006l4424l4907K5042M6488k284m2400j0989L5801K2632k7658l3080R414
$$ 41006 6582 -28325 -3283 43205 40921 -1479 -12468 23333 45965 18307 -14773 -5359
1378e359K9214l643l4050j3821K0303J4124j6878k2474N341K0044J732j5114m041
$$ -5359 23855 20212 -13838 -27659 -7356 6768 -10110 -32584 -27243 -7199 -5467 -20581 -24622
1391b4622J4277J2146m030n219P239J0278J440j859L430M651j622l054L504L566
$$ -24622 -10345 1801 -2229 -7448 -209 10069 11509 9650 13080 17731 16109 13055 16559 20125
1405B0125p081j0717J624Q153n227j8187o586J3306P135j7248j8014J0430K3015
$$ 20125 13044 2327 3951 12104 6877 -11310 -17896 -4590 2545 -14703 -32717 -22287 728
1418G28j782k5381m648K9955K0471j9262k4170J6797L8217K032l5926j2052L5876
$$ 728 -1054 -26435 -31083 -1128 19343 81 -24089 -7292 30925 32957 -2969 -15021 20855
1431B0855K8726k6064m1062R596M4295L459m8996k7794L5310L7326k7430n4098
$$ 20855 49581 23517 -17545 -7949 36346 39805 -9191 -36985 -1675 35651 8221 -45877
1443d5877K729N4013J5554n1347l6945L9963N5337j6905o0031j866O5729L2701
$$ -45877 -43148 10865 26419 -24928 -61873 -21910 33427 16522 -43509 -45375 20354 53055
1455E3055n0366m7764L6658O7341q734p0707j6727O5674M1658n2688o6216K4745
$$ 53055 2689 -45075 -8417 58924 50190 -20517 -37244 28430 70088 17400 -48816 -24071
1467b4071P3464j488p9912l4048O4008N5674m6745p8042J5856Q4449J7269p8134
$$ -24071 49393 47905 -32007 -66055 -2047 53627 6882 -71160 -55304 29145 46414 -31720
1479c1720m5948O4200P5485l1577q4338K647R1877L6839p5153o3679N3695Q7024
$$ -31720 -77668 -13468 62017 30440 -53898 -51251 40626 77465 2312 -61367 -7672 79352
1491G9352j9708r6323j8936Q8413N0517p2837q3290L7224R5199n722j01856l7088
$$ 79352 59644 -36679 -55615 32798 83315 10478 -72812 -35588 59611 53889 -47967 -85055
1503h5055Q6117O9061o2358r3694K7107J06675J5497r9242n0345Q4241Q7130m8046
$$ -85055 1062 70123 7765 -85929 -58822 47853 63350 -35892 -86237 -1996 85134 37088
1515C7088j02009J2137J10557L3055r7689o9814P0865R7178l5589j13984j0589
$$ 37088 -64921 -52784 57773 90828 -6861 -76675 -5810 91368 55779 -58205 -68794
1526f8794J06797M9199r2164q8304N4955J07419j6452j16026k9390J04537O9820
$$ -68794 38003 87202 -4962 -93266 -38311 69108 52656 -63370 -92760 11777 81597
1537H1597p7470r8329M1991J17036N869j11700m5355R8168Q5017o2933j07220
$$ 81597 4127 -94202 -52211 64825 70694 -41006 -86361 11807 96824 33891 -73329
1548g3329K3971J17380K0678j10048o2385Q4173R2563n1043j14409N139J13018
$$ -73329 -49358 68022 88700 -21348 -83733 440 93003 41960 -72449 -67310 45708
1559D5708L4890j01583p5428P1468J00627l3310j12822r350J09536N1778q6759
$$ 45708 80598 -20985 -96413 -24945 75682 42372 -70450 -79800 29736 81514 -5245
1570e245q2905N6989J05831j3941j07580k5676R9200O4322p2550r0274L7297J02806
$$ -5245 -88150 -31161 74670 60729 -46851 -72527 26673 90995 18445 -71829 -34532 68274
1582F8274J616j02241m2285Q3336P0951n7444r3569J9311R7475J6989r1611n1429
$$ 68274 69890 -32351 -74636 8700 79651 22207 -71362 -52051 45424 62413 -29198 -80627
1594h0627O9907P6656l9070q9750O101R1629K9763p6805n5995N5420P7891k3919
$$ -80627 -10720 65936 26866 -62884 -56783 34846 64609 -12196 -68191 -12771 65120 41201
1606D1201q3912p776P9632L7464o3375o1219L7765P3536j0350p6529k0456O4952
$$ 41201 -42711 -50487 29145 66609 3234 -57985 -20220 53316 42966 -33563 -54019 10933
1618A0933M3599m7753o1940K2245O7861M244o3872k8681N1935M8210l0902n7495
$$ 10933 54532 6779 -55161 -32916 34945 39189 -24683 -53364 -1429 46781 15879 -41616
1630d1616R193N9658J5216n1082l3254L8001M6004j7842n1479k106M8563K0035
$$ -41616 -32423 27235 42451 -8631 -41885 -3884 42120 24278 -27201 -29307 19256 39291
1642C9291l9708l4764K4234M1357p996m3330r117L7668K2731k7151l2376J3151
$$ 39291 -417 -35181 -10947 30410 22414 -20916 -30033 7635 30366 3215 -29161 -16010
1654a6010L6209J132l3323j3398K6512K2914j5742k7311M227K7696O538k3206
$$ -16010 20199 21331 -11992 -25390 1122 24036 8294 -19017 -14790 12906 19444 -3762
1666c762j5125J5618K0068o869k1402k261J8513R211j3382j3171O823J4691m53
$$ -3762 -18887 -3269 16799 9930 -11472 -13733 4780 13991 609 -12562 -5739 8952 8499
1679H499j3044m287R234P714m903q263O52O764K307m271l677P47K941Q61j333
$$ 8499 -4545 -8832 402 8116 3213 -5050 -4398 2366 4673 402 -3275 -2528 413 1274 -59
1694e9k554k052J920M191L52n517l803N853P881k860r903j055J2174P773j0462
$$ -59 -2613 -4665 -2745 1446 1798 -3719 -7522 -1669 6212 3352 -6551 -7606 4568 12341 1879
1709A879j2069O854J7350J90j9264p881J7253J5659j3221k3032L750K5708N219
$$ 1879 -10190 -3336 14014 14204 -5060 -12941 4312 19971 6750 -16282 -12532 13176 18395
1722A8395k6300j7496K0391K6077j2187l2665j3L4575J4102l0156k5896K2356
$$ 18395 -7905 -25401 -5010 21067 8880 -23785 -23798 10777 24879 -5277 -31173 -8817
1734h817L7538p854m1145o540M1493K4327l3246l7427K0199M7064l220n0302j7496
$$ -8817 28721 20867 -20278 -26818 14675 39002 5756 -31671 -11472 35592 32372 -17930 -35426
1747c5426M3890L3934l3755n0089J3862N5183O142n6085k8815M5659M7168k8655
$$ -35426 8464 42398 8643 -41446 -27584 27599 33741 -22344 -51159 -5500 41668 13013
1759A3013n9076P048O4766J9212n6860l9966M4319O0248k0551o7631l540O8164
$$ 13013 -46063 -39015 25751 44963 -11897 -51863 -7544 52704 32153 -35478 -39018 29146
1771B9146L0827n7546n3591L7718O7778j3794p5428j7092O8450M0983n5775o4688
$$ 29146 59973 2427 -51164 -13446 54332 40538 -34890 -51982 16468 57451 1676 -63012
1783f3012K9707P5504k347p7472k7685O8569N5012m7051p1468K1866Q2376J2313
$$ -63012 -33305 42199 39852 -37620 -65305 3264 58276 11225 -60243 -38377 43999 56312
1795E6312p6161l9695O3620O6282l6877p9375O087Q3000K5052p4640n5525N1762
$$ 56312 -19849 -59544 4076 70358 33481 -45894 -39807 43193 68245 -6395 -61920 -10158
1807a0158P3104k5836q6490r683P9912L8452o7308o5773M0906Q1581r649q4832
$$ -10158 62946 37110 -49380 -59063 20849 59301 -8007 -73780 -32874 48707 39058 -45774
1819d5774k1797P8577N3449n5172p2162L0514Q6455N415q2140l4650P0225O1925
$$ -45774 -67571 11006 64455 9283 -62879 -32365 54090 59505 -22635 -57285 12940 74865
1831G4865m5492q0043J3702Q3736J6874p9869n0088N6991O9396l2811q4852k456
$$ 74865 29373 -50670 -36968 46768 63642 -16227 -66315 -9324 60072 27261 -57591 -60047
1843f0047Q1441L3108o9363o0528M6142P9748j3160q2349j5875P8908N0156n6496
$$ -60047 21394 54502 -14861 -75389 -29247 50501 37341 -45008 -60883 18025 68181 11685
1855A1685o8497L2546Q3110J765q0909l2460O8201N8220m7300p8041J4791Q0273
$$ 11685 -56812 -24266 58844 60609 -20300 -52760 15441 73661 26361 -51680 -36889 43384
1867D3384J2573p7694m5681N6413O4411l4458p8661K640P9204K7882o6973n1885
$$ 43384 55957 -21737 -67418 -11005 53406 18948 -59713 -57073 22131 50013 -16960 -68845
1879f8845M8752P3004j7325p6048q525P5260M0697n6264n9730L4636P4065n929
$$ -68845 -20093 52911 35586 -40462 -48987 26273 66970 10706 -49024 -14388 59677 53748
1891E3748p6118k4511O3643M6716m8290o8161J8651P0522N816p1401l4881N4743
$$ 53748 -22370 -46881 16762 63478 15188 -52973 -34322 36200 42016 -29385 -64266 -9523
1903i523N3889l5177o6393R501P0517J8473n9431l7758M7815N8816k1459o2026
$$ -9523 44366 9189 -57204 -47703 22814 41287 -18144 -55902 -8087 50729 29270 -32756
1915c2756J373O3783K4777n1799m2729L5057N4059j5744o0474r959N1790K5882
$$ -32756 -31383 32400 57177 5378 -37351 -2294 51765 36021 -24453 -34412 17378 43260
1927D3260m4795m5483K3300M9654o751n3045j4555M5504L1176l1168l9850J7620
$$ 43260 -1535 -47018 -23718 25936 19185 -33860 -48415 -2911 28265 -2903 -42753 -25133
1939b5133M7962M512m1135j5779L7510L2225k0936l5834Q733L8750O046l4811
$$ -25133 22829 27341 -13794 -29573 7937 40162 19226 -16608 -7875 30875 36921 2110
1951B110j9737K3714K4940j6937l3074K84K7143N830k6724j7759J6489K0603q754
$$ 2110 -17627 6087 31027 14090 -18984 -18700 8443 14273 -12451 -30210 -13721 6882 -1872
1964a872k2448J157K1898Q689j4371r574J2816J6771k751j1366J571J3163M940
$$ -1872 -24320 -23163 -1265 7424 -6947 -16521 -3705 13066 10315 -1051 520 13683 18623
1977A8623q798n970N506N560m765p752p22K745l139o194j332J497l308n253N48
$$ 18623 9825 3855 9361 14921 10156 2404 1682 4427 1288 -4906 -6238 -4741 -8049 -13302 -12754
1992a2754N269q78o429N15R831N348o807m723R945J3508k227j2440J395J6824
$$ -12754 -7485 -8363 -14792 -14277 -4446 902 -5905 -10628 -683 12825 10598 -1842 -447 16377
2006A6377P096j4202j2648J0490J6894p265k2722m546J9270Q602k1183k1241J1279
$$ 16377 23473 9271 -3377 7113 24007 16742 -5980 -10526 8744 17346 -3837 -25078 -13799
2019a3799K3007n023k8250o891K7132J7858j9824k4439J3484L4250K630l0879
$$ -13799 9208 4185 -24065 -30956 -3824 14034 -5790 -30229 -16745 17505 20135 -10744
2031a0744j1106L0913K7318j9013l2993Q070L8166O347l7466k2585K7330L1525
$$ -10744 -21850 9063 36381 17368 -15625 -7555 30611 36958 -508 -23093 4237 35762
2043C5762j9125m3520q08M0964J2862l9612l1435K6727M0638j2037m5988m832
$$ 35762 16637 -26883 -27691 13273 26135 -13477 -44912 -18185 22453 10416 -35572 -40404
2055d0404M6595K5571l5165l6775K5177N0485k235m9460j4252M7357L4923l3786
$$ -40404 6191 31762 -3403 -40178 -15001 35484 33249 -16211 -30463 16894 51817 18031
2067A8031m7727J4933N3559M298n5397k8421M2167M2597k9857n8131M270N8379
$$ 18031 -29696 -14763 38796 43094 -12303 -40724 1443 44040 14183 -43948 -39678 18701
2079A8701J6054n4106l8468M0059N4938j8446o0989k391O3176L0378m9442m6506
$$ 18701 34755 -19351 -57819 -17760 37178 18732 -42257 -44648 18528 48906 -536 -47042
2091d7042L5136O3430q910o5224j4722O0763L8330m7371n8103K3680O5761j907
$$ -47042 -11906 51524 42614 -22610 -37332 23431 61761 14390 -43713 -20033 45728 43821
2103D3821o9610k7568N6055M6861m1301o5318J4578P0244J2027o6275l6517N3583
$$ 43821 -25789 -53357 2698 49559 8258 -57060 -42482 27762 39789 -26486 -63003 -9420
2115i420N9063k8551o8266M991P3929K5588o1374m7323M5862O6264j9392p3841
$$ -9420 49643 21092 -47174 -42183 31746 57334 -4040 -51363 -5501 60763 41371 -32470
2127c2470q978O9916L3584n8579n8191L3994O8151j0386p4733k0119O5065M3035
$$ -32470 -41448 28468 62052 3473 -54718 -20724 47427 37041 -37692 -57811 7254 50289
2139E0289m9841o2365K6164P2036J900o9517k6681O0964N2065l8517o3655J6379
$$ 50289 448 -61917 -35753 36283 38183 -31334 -58015 2949 55014 16497 -47158 -30779
2151c0779P1877J2905o4924l6094N0927N5078k9692o7060K716O5954K0670n9521
$$ -30779 41098 54003 -10921 -47015 3912 58990 29298 -37762 -35046 30908 51578 -7943
2163g943m5588L9590N7672j8710o5856q378O1663L0739m8653m8455L0497O1041
$$ -7943 -53531 -13941 43731 25021 -40835 -49213 12450 43189 -5464 -53919 -23422 37619
2175C7619n654o0124j5490N4954L8392l7507n0521J9211N7999L409n4991k4394
$$ 37619 31965 -28159 -43649 11305 49697 12190 -38331 -19120 38879 42288 -12703 -37097
2187c7097M3634M0431k9817n1716P433N1713J0284m8308l0280L4034M1650j8107
$$ -37097 6537 46968 17151 -34565 -27132 24581 34865 -13443 -43723 -9689 31961 13854
2199A3854m8066r90M7028J9693l7471l2872K5296M3467o384m2871r478M0124K5974
$$ 13854 -34212 -35202 11826 31519 -5952 -38824 -13528 29939 23555 -19316 -28794 11330 37304
2212C7304k8181l5600J3977M0540J857m0087j7704L0770K7773k0169l6548M799
$$ 37304 9123 -26477 -12500 28040 29897 -10190 -27894 2876 30649 10480 -26068 -21269
2224b1269L5804Q122l2396k1173K2931K9193j0999l2178j251L1810J3672k3364
$$ -21269 14535 22657 -9739 -30912 -7981 21212 10213 -21965 -23216 8594 22266 -1098
2236a098k1713J5561K8322l432k7462o600K4555J6263j7438k2483P872K4171J254
$$ -1098 -22811 -7250 21072 17640 -9822 -16422 8133 24396 6958 -15525 -7653 16518 17772
2249A7772k3733j1341J7528J6618j1525k1149J973K0140N611j7235j1794J2379
$$ 17772 -5961 -17302 226 16844 5319 -15830 -13857 6283 11894 -5341 -17135 -4756
2261d756J5767m921j6473p16J5196P581j1129j0217O605J2538j233j1109l198
$$ -4756 11011 6090 -10383 -11099 4097 11678 549 -9668 -3063 9475 8242 -2867 -6065
2274f065Q952N658n858p607J846O945K06n946k558K971L004j362k460k91R21P25
$$ -6065 2887 8545 2687 -4920 -3074 3871 4077 -1869 -4427 -1456 1548 186 -2274 -2565 -1644 -919
2290i19N09m5j193j188K066L927p96m954j417O045M378n275p468L145R822O81
$$ -919 -410 -455 -1648 -2836 -770 3157 2361 -2593 -4010 2035 6413 1138 -6330 -3185 6637 7318
2306G318j1272n391J0477J0178p671j4344K937J6544L679j6479j0828J3986J6619
$$ 7318 -3954 -9345 1132 11310 3639 -10705 -7768 8776 12455 -4024 -14852 -866 15753
2319A5753p852k1208P56K2281Q152k0560j6837J5169K3062o996k7472l195K7150
$$ 15753 7901 -13307 -12551 9730 17882 -2678 -19515 -4346 18716 11720 -15752 -18947 8203
2332H203J3908k2873k3896J4787L0454l597l2537q367L0522K1273k3022l1205
$$ 8203 22111 -762 -24658 -9871 20583 16986 -15551 -23918 6604 27877 4855 -26350
2344b6350J2343L7189J734l7131j6287L2230K8742k2059l8567P537M1403Q424
$$ -26350 -14007 23182 24916 -12215 -28502 3728 32470 10411 -28156 -20619 20784 29208
2356B9208m0245k4534L1291L6350j8363m4290J346M5445J6228l9604l1375K9052
$$ 29208 -11037 -35571 -4280 32070 13707 -30583 -29237 16208 32436 -7168 -38543 -9491
2368i491M3044j1911m7593n312M7335K4168l7849l8209K3770M7599n379n1005
$$ -9491 33553 21642 -25951 -31263 16072 40240 2391 -35818 -12048 35551 30172 -20833
2380b0833j4177M5738L0822l4276m5885J6358N1658K822n2067k3874M2714M0252
$$ -20833 -35010 10728 41550 7274 -38611 -22253 29405 32227 -19840 -43714 -1000 39252
2392C9252k7488n1670Q610N5498J3671m9556l2284L8906M8605j9339n5195p87
$$ 39252 11764 -39906 -31296 24202 37873 -11683 -43967 -5061 43544 24205 -30990 -31777
2404c1777N5631K2528m6108m0874L0984N2081j1801n7140j1652N1597L0402m1800
$$ -31777 23854 46382 274 -40600 -9616 42465 30664 -26476 -38128 13469 43871 2071
2416B071m7559K2368N4725k207n6302j9987M8551L9368l3213n1032J4693N7794
$$ 2071 -45488 -23120 31605 29398 -26904 -46891 1660 41028 7815 -43217 -28524 29270
2428B9270R373n3200k8749M4001M6820k4426n5532L369N7646J8740n0806l9151
$$ 29270 38643 -14557 -43306 695 47515 23089 -32443 -29074 28572 47312 -3494 -42645
2440d2645L4897N0871j6217n9214p951N4729K6950m5014m6040K6952N5123n497
$$ -42645 -7748 43123 26906 -32308 -40259 14470 41420 -3594 -49634 -22682 32441 26944
2452B6944n7190j5520N1957L6253l6165m8418J9465N7225M603n3632k3268M5395
$$ 26944 -30246 -45766 6191 42444 6279 -42139 -22674 34551 39154 -14478 -37746 7649
2464G649M1004k8790n2022Q840N4203J0985n0782l1699L6528M3676k1770n3113
$$ 7649 48653 19863 -32159 -23319 30884 41869 -8913 -40612 -4084 39592 17822 -35291
2476c5291p11N1104J9113m4947l6013L0461M7780j1019n0872o539M9001K6811
$$ -35291 -36002 15102 34215 -10732 -46745 -16284 31496 20477 -30395 -36934 12067 38878
2488C8878l5861l8523K2883M8688l106m7613j3923M1916K9203l0554m1019J3254
$$ 38878 3017 -35506 -12623 36065 32959 -14654 -28577 13339 42542 11988 -29031 -15777
2500a5777M3633J009m4217j9428L3509K9704k3838l8991P079M0754P279l6264
$$ -15777 27856 28865 -15352 -34780 -1271 28433 4595 -34396 -27317 13437 20716 -15548
2512a5548k0179K8736L1614j4299l4180L840L6389J2369k8396k1158K1556K9382
$$ -15548 -35727 -6991 24623 10324 -23856 -20016 16373 28742 346 -20812 744 30126
2524C0126r205l1631l113K8464J2233k4414k2682J3259K4117n692k7207o829K1818
$$ 30126 20921 -10710 -13823 14641 26874 2460 -20222 -6963 17154 11462 -15745 -22574 -756
2537g56J2780j6987j8894R174K1721j44j8769m867J7392J3577r320j3092N725
$$ -756 12024 -4963 -23857 -14683 7038 6894 -11875 -16742 650 14227 4907 -8185 -2460
2550b460J6398J588j2638n602J0519Q113p036j0742R90Q166l31r196n312M189
$$ -2460 13938 15526 2888 -2714 7805 15918 8882 -1860 -870 7296 6965 -2231 -7543 -3354
2564c354L319m090n533M71L976K90k873M47K651J510j69J479L479Q99j343K104
$$ -3354 -35 -4125 -9658 -9187 -5211 -4921 -7794 -7347 -4696 -3186 -3355 -1876 1603 2502 1159 3263
2580C263M399J237m017j430M836L503n357p206J301O897j833j0457n042P363N475
$$ 3263 7662 8899 4882 3452 8288 11791 6434 -772 529 7426 5593 -4864 -9906 -2543 2932
2595B932p442j0973K964J2270J571j2111n888J2462J2348n697j3090L477J7691
$$ 2932 -4510 -15483 -12519 -249 1322 -10789 -16677 -4215 8133 2436 -10654 -7177 10514
2608A0514O013j4357r599J2678J6448o358j9528j682J8951P945j8490j7736R698
$$ 10514 16527 2170 -7429 5249 21697 15339 -4189 -5871 13080 21025 2535 -15201 -5503
2621e503J9411m736k4566o949K0901J3691j7041k1528R448K6562J728k4679r520
$$ -5503 13908 9172 -15394 -22343 -1442 12249 -4792 -26320 -16872 9690 11418 -13261 -22781
2634b2781K3780K1260j3410k4787O114L0051O579k6593j6652K1224K4992j2643
$$ -22781 999 22259 8849 -15938 -9824 20227 26806 213 -16439 4785 29777 17134
2646A7134l1430j385L0048J0488k8883k4651J7411K9940p950l5333o807L2655
$$ 17134 -14296 -15681 14367 24855 -4028 -28679 -11268 18672 10722 -24611 -31418 1237
2658A237J9613k5306k9068J5713L7633O64l5904j2042L3944K8144k1815l5217
$$ 1237 20850 -4456 -33524 -17811 19822 20486 -15418 -27460 6484 34628 12813 -22404
2670b2404J0036M0570O381l8751k1614K9618L2347j9583m1940J454M0264J2033
$$ -22404 -12368 28202 34583 -4168 -25782 3836 36183 16600 -25340 -23886 16378 28411
2682B8411l8599k8770K6266L7486j2762m3110l719M2980K0762l3470l2241K3508
$$ 28411 -10188 -38958 -12692 24794 12032 -31078 -34797 8183 28945 -4525 -36766 -13258
2694a3258M3579m551m3339j0138M1864K7624k9892l8934J5681M4573R11m5932
$$ -13258 30321 25770 -17569 -27707 14157 41781 11889 -27045 -11364 33209 34120 -11812
2706a1812j9889L6787L2071k6726m4779P647M5710Q338m4328k6212L3470L8982
$$ -11812 -31701 5086 37157 10431 -34348 -26701 19009 27347 -16981 -43193 -9723 29259
2718B9259j8414m5239K079M7298J8129l8771k9781K8643M2923j0239m5209n525
$$ 29259 10845 -34394 -32315 14983 33112 -5659 -35440 -6797 36126 25887 -19322 -24847
2730b4847M3620K2308l4652l5594J9496M2090n125m5453j4502L8124K6345k8756
$$ -24847 18773 41081 6429 -29165 -9669 32421 27296 -18157 -32659 5465 31810 3054
2742C054l9464J2370M2931L229m1675j9130L4368L3016j9554l9433O348M3446
$$ 3054 -36410 -24040 18891 22120 -19555 -38685 -4317 28699 9145 -30288 -23940 19506
2754A9506J2138l6488k4323K8006L6493j2604m0537k641L9009J6827l2679l0954
$$ 19506 31644 -4844 -29167 -1161 35332 22728 -17809 -20450 18559 35386 2707 -28247
2766b8247J9380L6075o886l9760j0436L3880K1644k6067l2124J2821L6406J639
$$ -28247 -8867 27208 20322 -19438 -29874 4006 25650 -417 -32541 -19720 16686 18325
2778A8325l4716j3810K9284K6842j7274l1356O585L4974Q727l0218j8950K2762
$$ 18325 -16391 -30201 -917 25925 8651 -22705 -16120 18854 27581 -2637 -21587 1175
2790A175K8185j2059l2396j775L0825J2163k6638k4072J5404K8363n990l1541
$$ 1175 29360 17301 -15095 -16870 13955 26118 -520 -24592 -9188 19175 13185 -18356
2802a8356p405K7359J6988k0142k4579J0606K9125J350k6555j0508K3863K0521
$$ -18356 -25761 1598 18586 -1556 -26135 -15529 13596 14946 -11609 -22117 1746 22267
2814B2267j4367k3787N904K6341N394k3527j3554J7308J9731j0249k3653j10K1381
$$ 22267 7900 -15887 -9983 16358 21752 -1775 -15329 1979 21710 11461 -12192 -12302 9079
2827I079P390j9699j5684J2160J8589n425k0573k714J8910R977j4125j4195R202
$$ 9079 16469 -3230 -18914 -6754 11835 6410 -14163 -16877 2033 12010 -2115 -16310 -7108
2840g108J7917r23j6391l993J4861J0408r390j3015M692J4278O29j3379n826R788
$$ -7108 10809 9886 -6505 -10498 4363 14771 5381 -7634 -2942 11336 11965 -1414 -7240 2548
2854B548Q062o711j1156J302R714J222q984n214O067O195l193o946J314O363J472
$$ 2548 10610 3899 -7257 -5955 3759 4981 -4003 -9217 -3150 3045 -148 -7094 -5780 583 2055
2869B055l916k156L850L424j580k164J241J985J9j511R14O82j344j616J155J860
$$ 2055 -1861 -4017 -167 3257 1677 -487 754 2739 2758 1247 2161 2843 1499 -117 1038 2898
2885B898k316m027R74M649m51n983k236N797M462m949o615K996R374O71r595l969
$$ 2898 582 -3445 -2471 2178 1727 -4256 -6492 -695 3767 -1182 -7797 -4801 4573 5244 -4351 -8320
2901h320R778Q160o426j1061L047J3773J912j3764o993J1259J1925p794j5906
$$ -8320 1458 9618 3192 -7869 -4822 8951 10863 -2901 -9894 1365 13290 5496 -10410
2914a0410J863J6957L911j6144j1468J2633J6472p063j9875m17K0443Q629j8096
$$ -10410 -8547 8410 12321 -3823 -15291 -2658 13814 6751 -13124 -13541 6902 15531 -2565
2927b565j5283J3091K1085n074k3692l430K3062J2791j8588k0752J1682K5058
$$ -2565 -17848 -4757 16328 11254 -12438 -15868 7194 19985 1397 -19355 -7673 17385
2939A7385j951k6982q237K4313J7590j8028k5397Q846K8945K133k8697j3087K3931
$$ 17385 15434 -11548 -19785 4528 22118 4090 -21307 -12461 16484 18617 -10080 -23167 764
2952G64K2697j5769k9064M979L1160P543k9154j8352K2064K7298j1989l2354L4
$$ 764 23461 7692 -21372 -16393 14767 22310 -6844 -25196 -3132 24166 12177 -20177 -20143
2965b0143L2004J2754k7884k3444J9098L1120p220l4417n875L2667J8904k5537
$$ -20143 11861 24615 -3269 -26713 -7615 23505 16285 -18132 -24007 8660 27564 2027
2977B027k8686J5038L4968j384l5840j2291L1521K4689k2477l3640R622L6873
$$ 2027 -26659 -11621 23347 21963 -13877 -26168 5353 30042 7565 -26075 -16453 20420
2989B0420N063l6281j8834K8789K9723j7697l7072L437L8045J1025l3751k3683
$$ 20420 25483 -10798 -29632 -843 28880 11183 -25889 -22452 15593 26618 -7133 -30816
3001c0816K4496L3935j1253l8225k557L7383J7440l0209k9090J9829L6856n635
$$ -30816 -6320 27615 16362 -21863 -24420 12963 30403 194 -28896 -9067 27789 22154
3013B2154l9030r439L5208K2829k7019l3989J3778L8176P38l8935j6252L2442
$$ 22154 -16876 -26315 8893 31722 4703 -29286 -15508 22668 23406 -15529 -31781 661
3025F61K8487k1962l6958P868M0416P829l6898k1451K9436L3276j6241l8607K051
$$ 661 29148 7186 -29772 -21904 18512 26341 -10557 -32008 -2572 30704 14463 -24144 -22093
3038b2093L9568J4006l4183k6025K3833L4939j0951l8968m579L6120J7754l0131
$$ -22093 17475 31481 -2702 -28727 -4894 30045 19094 -19874 -24453 11667 29421 -710
3050g10k9614J7774L5438n057l7196r796L3341K2238k4497l0583J2960L6010J765
$$ -710 -30324 -12550 22888 17831 -19365 -29161 4180 26418 1921 -28662 -15702 20308 22073
3063B2073l4380j3674K9706K5746j9115l1620P185L4620N648l1639j8040K4196
$$ 22073 -12307 -25981 3725 29471 10356 -21264 -14079 20541 26189 -5450 -23490 706
3075G06K6315j4945l2540J469L1364R400k8188k0297J8670K6937r065k9357k686
$$ 706 27021 12076 -20464 -18995 12369 21769 -6419 -26716 -8046 18891 9826 -19531 -22217
3088b2217K8501J3168k1492k0559J4420K6566l100k5716n398K3626J4929j6764
$$ -22217 6284 19452 -2040 -22599 -8179 18387 15287 -10429 -15827 7799 22728 5964
3100E964k0505Q949K2629k61k2940r185J7749J4259j2707k0119L623J9691L052
$$ 5964 -14541 -5592 17037 16776 -6164 -15349 2400 16659 3952 -16167 -12544 7147 10199
3113A0199j8572j0458J3823J5042p032j6937J408J7617O323j3043r547R967J4121
$$ 10199 -8373 -18831 -5008 10034 3002 -13935 -12527 5090 11413 -1630 -11177 -1210 12911
3126A2911l081j3460j760J3130O348r688j0075M569J0441j298j1528m021P419
$$ 12911 9830 -3630 -5390 7740 14088 4400 -5675 -1106 9335 8037 -3491 -7512 -93
3139i3N361n982q480J468P713J075o694l435N011N849j808m386O85N882K658k345
$$ -93 5268 -714 -9194 -7726 -13 1062 -5632 -9067 -4056 1793 -15 -4401 -3716 2166 4824 2479
3155B479k419J988M098K82k735j248J294J090j086k201j586j45Mm88j995j636
$$ 2479 60 2048 6146 6428 3693 2445 3739 4829 3743 1542 -44 -189 -185 -673 -2668 -4304
3171d304n79J446M49j663k117J479L724J071k772j179M305M793j166l905N90O022
$$ -4304 -4883 -3437 -2988 -4651 -6768 -5289 -1565 -494 -3266 -4445 -140 4653 3487 -418 172 6194
3187F194K816m868m403K891O080j409q174l189O289M068o393r056K103Q948P63
$$ 6194 9010 4142 -261 2630 8710 7301 -873 -4062 2227 6295 -98 -9154 -7051 1897 2660
3202B660j0319m996Q117Q757m280j0700J506J3363N020j0155p949Q874J3820l022
$$ 2660 -7659 -12655 -4538 4219 -61 -10761 -9255 4108 9128 -1027 -8976 -102 13718 10696
3216A0696j3909k103J4532Q078j2669j3085O492J4885j540j8400o616J4216J0916
$$ 10696 -3213 -5316 9216 17294 4625 -8460 -1968 12917 11377 -7023 -13639 577 11493
3229A1493j1876j7098M480J8905K064j8536q950J5659J6447q584j8766L055K2341
$$ 11493 -383 -17481 -13001 5904 7968 -10568 -19518 -3859 12588 4004 -14762 -11707 10634
3242A0634P372j8862j3156J5125K0394p076k3214j745K2540R952k0390j9350J2050
$$ 10634 18006 -856 -14012 1113 21507 14431 -8783 -10528 12012 21964 1574 -17776 -5726
3255e726K2436n034k6496p089K3347J4558j8416k2827J0094K6941N84k6010r552
$$ -5726 16710 11676 -14820 -21909 1438 15996 -2420 -25247 -15153 11788 12372 -13638 -23190
3268b3190K4107K0641j5098k4854P414K8910N560k6151j4913K1310K3041j2897
$$ -23190 917 21558 6460 -18394 -10980 17930 23490 -2661 -17574 3736 26777 13880
3280A3880k8275R90K7804Q312k6657j9907J7202K5631r260l0431l310K8438J4016
$$ 13880 -14395 -13405 14399 22711 -3946 -23853 -6651 18980 9720 -20711 -24021 4417 18433
3293A8433k3277k2631J5307K9960l137k9669o935K8885J9420j9729k5865J1135
$$ 18433 -4844 -27475 -12168 17792 14655 -15014 -21949 6936 26356 6627 -19238 -8103
3305h103L0970J289l0140j3024K4687K1534j7217k9734M752K9688M902k8765j7896
$$ -8103 22867 24156 -5984 -19008 5679 27213 9996 -19738 -14986 14702 19604 -9161 -27057
3318b7057K0779K4759j2283k9308L21K9629J1167k3815k0053J8042K7845n428
$$ -27057 -6278 18481 6198 -23110 -22789 6840 18007 -5808 -25861 -7819 20026 14598
3330A4598k8014m239K8187J5762k0704k3347J2210K8227j930k9439j0134K4078
$$ 14598 -13416 -17655 10532 26294 5590 -17757 -5547 22680 20750 -8689 -18823 5255
3342E255J8360j8459k6691O595K7814K983k7290j4787K1309K2429j2686k6392
$$ 5255 23615 5156 -21535 -14940 12874 15857 -11433 -26220 -4911 17518 4832 -21560
3354b1560K540K8482Q762k2982j6613J8011K4694o777k5848k169K5655J2113k0101
$$ -21560 -19020 9462 18224 -4758 -21371 -3360 21334 14557 -11291 -13460 12195 24308 4207
3367D207k0010J1956K3641l644k5921p801K1504J4567j7135k2165P324K3786J063
$$ 4207 -15803 -3847 19794 16150 -9771 -17572 3932 18499 1364 -20801 -13477 10309 11372
3380A1372k3593j0082J9412J8022j1681k1193M573K4064N873k0412j1993J6263
$$ 11372 -12221 -22303 -2891 15131 3450 -17743 -13170 10894 16767 -3645 -15638 625
3392F25J9391q115k1358L8K1216P607j8624j4818J1303J7712n325k0874l701J7864
$$ 625 20016 11901 -9457 -9419 11797 19404 780 -14038 -2735 14977 9652 -11222 -14923 2941
3406B941R194j5064j4858Q362J7800j682j7641m200J6094J0886j0480j3097O349
$$ 2941 12135 -2929 -17787 -9425 8375 6693 -10948 -15148 946 11832 1352 -11745 -5396
3419e396J6067J441j4495n764J2689J0169q039j3440L091J2660J687j2802o915
$$ -5396 10671 12112 -2383 -8147 4542 14711 6672 -6768 -3677 8983 10670 -2132 -9047
3432i047Q603Q382n802j1197Q13J0248K177q721n533O564P646l019p415J077Q327
$$ -9047 -444 7938 2136 -9061 -8248 2000 4177 -4544 -10077 -3513 4133 1114 -6301 -5224 3103
3447C103K243n250l384M525N118j779m625L13M062P94l444k434J909J507k188
$$ 3103 5346 96 -3288 1237 6355 4576 -49 264 4326 5120 1676 -758 1151 2658 470
3462D70k333K46J330j362j969P31J480r10k092J326K879L28k936j28M518J986
$$ 470 -1863 -1617 -287 -1649 -3618 -2887 -1407 -2317 -4409 -3083 -204 124 -2812 -2940 1578 3564
3478C564l175l044L360N472j668o150k88O573K555o582n613M196P209k835r414
$$ 3564 389 -2655 705 6177 4509 -1641 -1929 4644 7199 617 -4996 -800 6409 3574 -5840
3493e840j197Q732M106q072p960N449J0395j703j1228k023J1252P115q365r952
$$ -5840 -7037 1695 5801 -2271 -10231 -4782 5613 3910 -7318 -9341 1911 9026 661 -9291
3507i291N743J3059k73j3261m542J2158R366q962j3233L974J4966J379j5583p716
$$ -9291 -3548 9511 9238 -4023 -8565 3593 12959 3997 -9236 -5262 9704 11083 -4500 -12216
3521a2216J2359J2197q545j6309K285J7222L859j5745j0515J2399J5820o379j8162
$$ -12216 143 12340 3795 -12514 -10229 6993 10852 -4893 -15408 -3009 12811 6432 -11730
3534a1730l1J8665Q056j5845j3845J0971J8333l734j9832l782J8528J1015j4731
$$ -11730 -11761 6904 14960 -885 -14730 -3759 14574 10840 -8992 -12774 5754 16769 2038
3547B038j7167Q012K0035r26k0781p661J7829J4640j2620j9854N167K2026L549
$$ 2038 -15129 -7117 12918 11992 -8789 -16450 1379 16019 3399 -16455 -11288 10738 14287
3560A4287k0807j1344J6705J8448r541k2384J373K3240P943k0611j5601J4900
$$ 14287 -6520 -17864 -1159 17289 7748 -14636 -13263 9977 17920 -2691 -18292 -3392
3572c392K1447o669k4500k580K3089J1764j8993j9106J1599K3903k853k5204o727
$$ -3392 18055 11386 -13114 -15694 7395 19159 166 -18940 -7341 16562 13709 -11495 -18222
3585a8222K2238J5753j6303k2148P689K5443J756k4561j1194K0532J9178j3450
$$ -18222 4016 19769 3466 -18682 -10993 14450 16206 -8355 -19549 983 20161 6711
3597F711k4023M023K5689N902k3874j4730J7854K1734r297k5867j59K5838R864
$$ 6711 -17312 -13289 12400 18302 -5572 -20302 -2448 19286 9989 -15878 -16037 9801 19665
3610A9665k1928j8421J5273K4005n632k6507m114K4831J3665j9995k1169J1981
$$ 19665 -2263 -20684 -5411 18594 12962 -13545 -17659 7172 20837 842 -20327 -8346
3622h346K5428k283k6399p875K3023J6345j6547k2680P354K5727K211k4690j1549
$$ -8346 17082 14799 -11600 -19475 3548 19893 3346 -19334 -11980 13747 15958 -8732 -20281
3635b0281K0232J9069j2350k3362L572K4884O105k1986j4275J6967K0168q828
$$ -20281 -49 19020 6670 -16692 -13120 11764 17869 -4117 -18392 -1425 18743 9915
3647I915k3164l28K2906Q819j9718j5967J2390K0980n054k2822l789K0364J1439
$$ 9915 -13249 -13577 9329 18148 -1570 -17537 -5147 15833 10779 -12043 -15832 4532 15971
3660A5971j5960j7509R339K0772j251k0481o683J8486J3445j2231j7741N875J9840
$$ 15971 11 -17498 -8159 12613 11362 -9119 -15802 2684 16129 3898 -13843 -7968 11872
3673A1872K159j8272q788J4209J4489r107j7201J428J7021M898j5502j1121J0728
$$ 11872 14031 -4241 -13029 1180 15669 6562 -10639 -9211 7810 12708 -2794 -13915 -3187
3686c187J3877m842j6084j490J4956O813j1510j1187P296J3746j173j3429l413
$$ -3187 10690 5848 -10236 -11726 3230 10043 -1467 -12654 -5358 8388 7215 -6214 -9627
$$ [...]
8191b00
##END NTUPLES=NMR FID
##END=
