##TITLE=1H_LY-Dixlofos.P.2
 CDCl3, 8 sc, 
 28.10.2020
##JCAMPDX= 6.0         $$ Bruker NMR JCAMP-DX V2.0
##DATA TYPE= NMR FID
##DATA CLASS= NTUPLES
##ORIGIN= UXNMR, Bruker Analytische Messtechnik GmbH
##OWNER= root
$$ XWIN-NMR		Version 3.5
$$ Wed Oct 28 13:02:14 2020 Russian Standard Time (UT+4h)  she@DPX200
##.OBSERVE FREQUENCY= 200.1315066352
##.OBSERVE NUCLEUS= ^1H
##.DELAY= (6, 6)
##.ACQUISITION MODE= SIMULTANEOUS
##.ACQUISITION SCHEME= undefined
##.AVERAGES= 8
##.DIGITISER RES= 18
##SPECTROMETER/DATA SYSTEM= spect
##.PULSE SEQUENCE= zg30
##.SOLVENT NAME= CDCl3
##.SHIFT REFERENCE= (INTERNAL, CDCl3, 0, 15.7039)
##AUDIT TRAIL= $$ (NUMBER, WHEN, WHO, WHERE, WHAT)
$$ ##TITLE= Audit trail, XWIN-NMR		Version 3.5
$$ ##JCAMPDX= 5.01
$$ ##ORIGIN= Bruker BioSpin GmbH
$$ ##OWNER= she
$$ F:/spectra/data/she/nmr/H-F/1/audita.txt
$$ ##AUDIT TRAIL=  $$ (NUMBER, WHEN, WHO, WHERE, WHAT)
(   1,<2020-10-28 13:01:10.23 +0400>,<she>,<DPX200>,
      <created by zg, POWCHK disabled, PULCHK disabled
       configuration hash MD5:
       00 E9 B6 7A A2 85 ED C7 34 08 36 98 17 FE 4E 26
       data hash MD5: 16K
       98 37 9E 50 52 32 BA F2 9A CB C8 10 D0 98 4C 0D>)
$$ ##END=
$$ 
$$ hash MD5
$$ 25 53 D3 04 96 C0 99 20 34 90 04 B4 25 73 1C 6C
##$RELAX= 
##$RELAX= 
##$RELAX= 
##$RELAX= 
##$RELAX= 
##$RELAX= 
$$ Bruker specific parameters
$$ --------------------------
##$DU= <F:/spectra>
##$EXPNO= 1
##$NAME= <H-F>
##$PROCNO= 1
##$TYPE= <nmr>
##$USER= <she>
##$AMP= (0..31)
100 100 100 100 100 100 100 100 100 100 100 100 100 100 100 100 100 100 
100 100 100 100 100 100 100 100 100 100 100 100 100 100 
##$AQSEQ= 0
##$AQ_mod= 1
##$AUNM= <au_zg>
##$AUTOPOS= <>
##$BF1= 200.13
##$BF2= 200.13
##$BF3= 200.13
##$BF4= 200.13
##$BF5= 200.13
##$BF6= 200.13
##$BF7= 200.13
##$BF8= 200.13
##$BYTORDA= 1
##$CFDGTYP= 0
##$CFRGTYP= 5
##$CHEMSTR= <none>
##$CNST= (0..31)
1 1 145 1 1 1 1 1 1 1 1 1 1 1 1 1 1 1 1 1 1 1 1 1 1 1 1 1 1 1 1 1 
##$CPDPRG= <>
##$CPDPRG1= <>
##$CPDPRG2= <>
##$CPDPRG3= <>
##$CPDPRG4= <mlev>
##$CPDPRG5= <mlev>
##$CPDPRG6= <mlev>
##$CPDPRG7= <mlev>
##$CPDPRG8= <mlev>
##$CPDPRGB= <>
##$CPDPRGT= <>
##$D= (0..31)
0 1.2 0 0 0 0 0 0 0 0.06 0 0.03 0 0 0 0 0.0002 0 0 0 0 0 0 0 0 0 0 0 0 
0 0 0 
##$DATE= 1603875669
##$DBL= (0..7)
120 120 120 120 120 120 120 120 
##$DBP= (0..7)
150 150 150 150 150 150 150 150 
##$DBP07= 0
##$DBPNAM0= <>
##$DBPNAM1= <>
##$DBPNAM2= <>
##$DBPNAM3= <>
##$DBPNAM4= <>
##$DBPNAM5= <>
##$DBPNAM6= <>
##$DBPNAM7= <>
##$DBPOAL= (0..7)
0.5 0.5 0.5 0.5 0.5 0.5 0.5 0.5 
##$DBPOFFS= (0..7)
0 0 0 0 0 0 0 0 
##$DE= 6
##$DECBNUC= <off>
##$DECIM= 32
##$DECNUC= <off>
##$DECSTAT= 4
##$DIGMOD= 1
##$DIGTYP= 9
##$DL= (0..7)
0 120 120 120 120 120 120 120 
##$DP= (0..7)
150 150 150 150 150 150 150 150 
##$DP07= 0
##$DPNAME0= <>
##$DPNAME1= <>
##$DPNAME2= <>
##$DPNAME3= <>
##$DPNAME4= <>
##$DPNAME5= <>
##$DPNAME6= <>
##$DPNAME7= <>
##$DPOAL= (0..7)
0.5 0.5 0.5 0.5 0.5 0.5 0.5 0.5 
##$DPOFFS= (0..7)
0 0 0 0 0 0 0 0 
##$DQDMODE= 0
##$DR= 18
##$DS= 0
$$ [...]
##$SUBNAM2= <"">
##$SUBNAM3= <"">
##$SUBNAM4= <"">
##$SUBNAM5= <"">
##$SUBNAM6= <"">
##$SUBNAM7= <"">
##$SUBNAM8= <"">
##$SUBNAM9= <"">
##$SW= 16.880792210976
##$SWIBOX= (0..15)
0 0 2 0 0 0 0 0 0 0 0 0 0 0 0 0 
##$SW_h= 3378.37837837838
##$TD= 16384
##$TD0= 1
##$TE= 0
##$TE2= 300
##$TE3= 300
##$TEG= 300
##$TL= (0..7)
0 120 120 120 120 120 120 120 
##$TP= (0..7)
150 150 150 150 150 150 150 150 
##$TP07= 0
##$TPNAME0= <>
##$TPNAME1= <>
##$TPNAME2= <>
##$TPNAME3= <>
##$TPNAME4= <>
##$TPNAME5= <>
##$TPNAME6= <>
##$TPNAME7= <>
##$TPOAL= (0..7)
0.5 0.5 0.5 0.5 0.5 0.5 0.5 0.5 
##$TPOFFS= (0..7)
0 0 0 0 0 0 0 0 
##$TUNHIN= 0
##$TUNHOUT= 0
##$TUNXOUT= 0
##$USERA1= <user>
##$USERA2= <user>
##$USERA3= <user>
##$USERA4= <user>
##$USERA5= <user>
##$V9= 5
##$VALIST= <valist>
##$VCLIST= <CCCCCCCCCCCCCCC>
##$VD= 0
##$VDLIST= <DDDDDDDDDDDDDDD>
##$VPLIST= <PPPPPPPPPPPPPPP>
##$VTLIST= <TTTTTTTTTTTTTTT>
##$WBST= 1024
##$WBSW= 4
##$XGAIN= (0..3)
0 0 0 0 
##$XL= 0
##$YL= 0
##$YMAX_a= 222137
##$YMIN_a= -245083
##$ZGOPTNS= <>
##$ZL1= 120
##$ZL2= 120
##$ZL3= 120
##$ZL4= 120
##$ABSF1= 10
##$ABSF2= 0
##$ABSG= 5
##$ABSL= 3
##$ALPHA= 0
##$AQORDER= 0
##$ASSFAC= 0
##$ASSFACI= 0
##$ASSFACX= 0
##$ASSWID= 0
##$AUNMP= <proc_1d>
##$AZFE= 0.1
##$AZFW= 0.1
##$BCFW= 1
##$BC_mod= 2
##$BYTORDP= 1
##$COROFFS= 0
##$CY= 11.3945322036743
##$DATMOD= 1
##$DC= 2
##$DFILT= <>
##$DTYPP= 0
##$F1P= 15.9154993809931
##$F2P= -4.1035820241983
##$FCOR= 0.5
##$FTSIZE= 0
##$FT_mod= 4
##$GAMMA= 1
##$GB= 0.15
##$INTBC= 1
##$INTSCL= 1
##$ISEN= 128
##$LB= 0.24
##$LEV0= 0
##$LPBIN= 0
##$MAXI= 10000
##$MC2= 0
##$MEAN= 0
##$ME_mod= 0
##$MI= 1.114404
##$NCOEF= 0
##$NC_proc= 0
##$NLEV= 6
##$NOISF1= 3.799351
##$NOISF2= 2.8
##$NSP= 1
##$NTH_PI= 0
##$NZP= 0
##$OFFSET= 15.70392
##$PC= 1
##$PHC0= -10845.76
##$PHC1= 9.600881
##$PH_mod= 1
##$PKNL= yes
##$PPARMOD= 0
##$PSCAL= 0
##$PSIGN= 0
##$REVERSE= no
##$SF= 200.130013532006
##$SI= 16384
##$SIGF1= 3
##$SIGF2= 2
##$SINO= 400
##$SIOLD= 16384
##$SREGLST= <1H.CDCl3>
##$SSB= 0
##$STSI= 0
##$STSR= 0
##$SW_p= 3612.71676300578
##$SYMM= 0
##$S_DEV= 0
##$TDeff= 0
##$TDoff= 0
##$TI= <>
##$TILT= no
##$TM1= 0
##$TM2= 0
##$TOPLEV= 0
##$USERP1= <user>
##$USERP2= <user>
##$USERP3= <user>
##$USERP4= <user>
##$USERP5= <user>
##$WDW= 1
##$XDIM= 8192
##$YMAX_p= 0
##$YMIN_p= 0
$$ End of Bruker specific parameters
$$ ---------------------------------
##NTUPLES= NMR FID
##VAR_NAME=  TIME,          FID/REAL,        FID/IMAG
##SYMBOL=    X,             R,               I
##VAR_TYPE=  INDEPENDENT,   DEPENDENT,       DEPENDENT
##VAR_FORM=  AFFN,          ASDF,            ASDF
##VAR_DIM=   8192,          8192,            8192
##UNITS=     SECONDS,       ARBITRARY UNITS, ARBITRARY UNITS
##FACTOR=    0.000296,      1,               1
##FIRST=     0,             0,               0
##LAST=      2.424536,      0,               0
##MIN=       0,             -245083,         0
##MAX=       2.424536,      222137,          0
$$ Real data points
##PAGE= N=1
##DATA TABLE= (X++(R..R)), XYDATA
$$ [...]
2985c337M20N104J759n089l287M359M407k354n522L46O103J524n924l061M513
$$ -3337 -2917 2187 3946 -1143 -4430 -71 4336 1982 -3540 -3194 2909 4433 -1491 -4552 -39
3000c9M711k831o251J139O548O79n983k953M939M939l782n935K022O346L45o228
$$ -39 4672 1841 -4410 -3271 3277 3956 -2027 -4980 -41 4898 1116 -4819 -2797 3549 3894 -2334
3016b334k526N797M265m422n265K385O210k88o512j494N766L086m472m764K893
$$ -2334 -4860 937 5202 780 -4485 -2100 4110 3822 -2690 -4184 1582 4668 196 -4568 -1675
3031a675N592j279n877n18N250K291m516l609L400M464j837m599L18M663J256
$$ -1675 3917 2638 -3239 -3757 1493 3784 -732 -4341 -941 3523 1686 -2913 -2595 2068 3324
3046C324m159k103L366K840k167l332J027L471j77l349p04K533J364k131j867
$$ 3324 -835 -2938 428 3268 1101 -2231 -1204 2267 2090 -1259 -1963 570 1934 -197 -2064
3061b064J402J858q61j836M04J679k7j361RJ288K41j079r3J214K66j226k76J341
$$ -2064 -662 1196 335 -1501 -1097 582 555 -806 -797 491 732 -347 -440 774 1040 -186 -462 879
3079H79N16j531j052J498J329j464k084Q56K564m53l169l82L171J336k848k445
$$ 879 1395 -136 -1188 310 1639 175 -1909 -1053 1511 1058 -2111 -2493 678 2014 -834 -3279
3095c279K565L665j694m003O26M530J048m508k417M321L577l236m669J574N525
$$ -3279 -714 2951 1257 -2746 -2120 2410 3458 -1050 -3467 854 4431 1195 -3474 -1900 3625
3110C625k19o051j476N343K981m462m832L108O016j756o254k29O208K635n667
$$ 3625 3406 -2645 -4121 1222 4203 -259 -5091 -1983 4033 2277 -3977 -4206 2002 4637 -1030
3125a030m141M830N582k838o240P09O901J392o752l024N482M521l878o300J957
$$ -1030 -5171 -341 5241 2403 -3837 -3128 3773 5165 -1587 -4611 871 5392 1514 -4786 -2829
3140b829O869m23o774j890N761L943m927n361L589O043j474o060n75O397K511
$$ -2829 4040 3617 -3157 -5047 714 4657 -270 -5631 -2042 4001 2527 -3533 -4108 2289 4800
3155D800n601l506M355M725k415n664Q79N989K79n481k091M295L437l675m643
$$ 4800 -801 -4307 48 4773 2358 -3306 -2427 3562 3841 -1640 -3731 564 4001 326 -4317
3170d317K458M558j024m681o28M770J862m223k420L430L335j792l968J102M537
$$ -4317 -1859 2699 1675 -3006 -3634 1136 2998 -1225 -3645 -215 3120 1328 -2640 -1538 2999
3185B999j69m079q58L583K133l338l115K602L217j873l637L12L778M60m126j168
$$ 2999 2830 -1249 -2107 1476 3609 271 -2844 -242 2975 1102 -2535 -2223 1555 2015 -2111 -3279
3201c279L472K103k658l045K174L981j283l807M41L979J190l737k202L553K938
$$ -3279 193 2296 -362 -3407 -1233 2748 1465 -2342 -1901 2078 3268 -469 -2671 882 3820
3216C820k614l723J302M144k30m760j096M067K081l537l512K412M322j339m637
$$ 3820 1206 -2517 -1215 2929 2699 -2061 -3157 910 2991 -546 -4058 -1646 2676 1337 -3300
3231c300K9M666J760m065k838L519M044j960m495O69M841R67m578k387L728L408
$$ -3300 -3271 1395 3155 -910 -3748 -229 3815 1855 -2640 -1971 2870 3837 -741 -3128 600 4008
3247D008k738m490J018M643J97m679j870L744L167k859l984J465M543K30m258
$$ 4008 1270 -3220 -2202 2441 2638 -2041 -3911 -167 3000 141 -3843 -2378 2165 2395 -1863
3262a863j455L923K932k513l621J465M174J24m018j584L278K702k484l692R18
$$ -1863 -3318 605 3537 1024 -2597 -1132 3042 3166 -852 -2436 842 3544 1060 -2632 -1714
3277a714L721K21l669j895K881K745j967l378N79L641J111l344k039K909L111
$$ -1714 2007 2228 -1441 -3336 -455 2290 323 -3055 -2476 1165 2276 -1068 -3107 -198 2913
3292B913j193l552o2L960J513l447k644K265L532r94m401o20M052J742l480l467
$$ 2913 1720 -1832 -1894 2066 3579 132 -2512 -247 3285 2291 -2110 -2730 1322 3064 -416 -3883
3308c883K040M445q91m743p51M456K661l432m057K656N123q18m987j161N085L165
$$ -3883 -1843 2602 1711 -3032 -3783 673 3334 -98 -4155 -1499 3624 2806 -2181 -3342 1743 4908
3324D908m231m483K861N139p72o072j361N783K773n004m523K970N865j307o608
$$ 4908 677 -3806 -945 4194 3422 -2650 -4011 1772 4545 -459 -4982 -2012 3853 2546 -4062
3339d062n78O335K720n139m629L948O388k099o559K0O654K513n920m500M884N631
$$ -4062 -4640 1695 4415 -724 -5353 -1405 4983 2884 -3675 -3655 2999 5512 -408 -4908 -24 5607
3355E607k919o599L23O758J680o765l574N185M967l393o497J544O950M40o416
$$ 5607 2688 -3911 -3588 3170 4850 -1915 -5489 -304 4663 1270 -5227 -3683 3267 3707 -2709
3370b709k387N529M633m109n636K849O241n96o093j587N843L211n019m470L260
$$ -2709 -5096 433 5066 957 -4679 -1830 4411 3815 -2278 -3865 1978 5189 170 -4300 -1040
3385a040N110j558n915l76N675J569m968k952L560M334k449m839J334M920L30
$$ -1040 4070 2512 -3403 -3779 1896 3465 -1503 -4455 -895 3439 990 -3849 -2515 2405 2735
3400B735m309j674M230K831l370l239K222L763r78m148j9M030P02l728j838K869
$$ 2735 -1574 -3248 982 3813 443 -2796 -574 3189 2211 -1937 -1956 2074 2776 -952 -2790 79
3416G9K559k489l207J632L402q42l444j05L589J102l290j560K917K515k083l027
$$ 79 2638 149 -3058 -1426 1976 1134 -2310 -2415 1174 2276 -1014 -2574 343 2858 775 -2252
3432b252J486L513o06l654l23L587J162l421k313K768K916k142l721J066L895
$$ -2252 -766 2747 2141 -1513 -1836 1751 2913 -508 -2821 -53 2863 721 -3000 -1934 1961
3447A961J1m152j116L981K301l364l157K629M119j285m455J20M690J293m267k559
$$ 1961 1972 -2180 -3296 685 2986 -378 -3535 -906 3213 1928 -2527 -2407 2283 3576 -691 -3250
3463c250L559L597k633m550J258M765J8m750j650M187K908l462l908K285M400
$$ -3250 309 3906 1273 -3277 -2019 2746 2764 -1986 -3636 551 3459 -3 -3911 -1626 2774
3478B774p10m663n76M632J904l789k780K692L924j531m250L74M161Q40l607k163
$$ 2774 2064 -2599 -3175 1457 3361 -428 -3208 -516 3408 1877 -2373 -1999 2162 3002 -605 -2768
3494b768K865K915k164l482J034L326K57l328j290K970J796k154k135J150K685
$$ -2768 97 3012 848 -2634 -1600 1726 1983 -1345 -2635 335 2131 -23 -2158 -1008 1677
3509A677l61k669p3K279P74j585j314J221J669r78j502M31J103J43j086o05J056
$$ 1677 1316 -1353 -1426 853 1627 42 -1272 -51 1618 640 -862 -431 672 815 -271 -876 180
3526A80J60o99j02K94K06k94l29O95J34p68O1P36L54p13q02R43J260j023j230
$$ 180 340 -359 -461 -167 39 -255 -584 111 245 -523 -462 274 628 -85 -887 56 1316 293 -937
3545i37M89J448K46j992p20K052J013j623j758R69K446m76k824p2K563J186k295
$$ -937 -448 1000 1246 -746 -1466 586 1599 -24 -1782 -813 1633 1157 -1667 -1739 824 2010 -285
3562b85k176J966K901j297l035K24L153J059l209j976K814K553j713l201M29L790
$$ -285 -2461 -495 2406 1109 -1926 -1702 1451 2510 -699 -2675 139 2692 979 -2222 -1793 1997
3578A997M87l731j438K945K457j934l480J137L689l9l465j250K991K404k287l136
$$ 1997 2484 -1247 -2685 260 2717 783 -2697 -1560 2129 2090 -1375 -2625 366 2770 483 -2653
3594b653J464L198n8l269j140K996J913k319k408J150K944r1l056p74K615J572
$$ -2653 -1189 2009 1951 -1318 -2458 538 2451 132 -2276 -1126 1818 1727 -1329 -2103 512 2084
3610B084j797k221R49K619j18k439q26J960J602j307k100M98K174K53j901j096
$$ 2084 287 -1934 -985 1634 1516 -923 -1749 211 1813 506 -1594 -1096 1078 1331 -570 -1666
3626a666J307J821p38j944j27J816J057j457j580Q16J995L2j971r37J724J828
$$ -1666 -359 1462 724 -1220 -1347 469 1526 69 -1511 -695 1300 1332 -639 -1576 148 1976
3642A976j151k355K92K525O89k438j808J933K480j096l127J43L154J174k993k247
$$ 1976 825 -1530 -1238 1287 1976 -462 -2270 -337 2143 1047 -2080 -1937 1217 2391 -602 -2849
3658b849K369L197j317l762J47L947J363l661k549K973L573j783m283K26M590
$$ -2849 -480 2717 1400 -2362 -2215 1732 3095 -566 -3115 -142 3431 1648 -2635 -2409 2181
3673B181J127m439k509L431L752k274m831Q21N122P30m792k391M070L958k892
$$ 2181 3308 -1131 -3640 -209 3543 1269 -3562 -2741 2381 3111 -1681 -4072 -2 3956 1064
3688A064m919J634N307L34n217k098M866L563l837m494K147N259n04n703j128
$$ 1064 -3855 -2221 3086 3420 -1797 -3895 971 4534 697 -3797 -1650 3609 3105 -2598 -3726
3703c726N146K590m232m106K810N118j504n433l6N097J968m527l339L759M354
$$ -3726 1420 4010 -222 -4328 -1518 3600 2096 -3337 -3373 1724 3692 -835 -4174 -415 3939
3718C939k260m774P37N050J023m909k230M167L145k874m328J491M796n60m792
$$ 3939 1679 -3095 -2358 2692 3715 -1194 -3424 743 3888 1014 -3314 -1823 2973 2413 -2379
3733b379q45M103K222l453l433K753L968j549m043K22M245J142l985j880L481
$$ -2379 -3224 879 3101 -352 -3785 -1032 2936 1387 -2656 -2434 1811 2953 -1032 -2912 569
3748E69K725k297l457J291L979n38m024n10L422J539l103k700K467L197j887l449
$$ 569 3294 997 -2460 -1169 2810 2272 -1752 -2262 1160 2699 -404 -3104 -637 2560 673 -2776
3764b776N98L629O65l810j284L561K149k519k979J939L800r41l996M8L851J202
$$ -2776 -2178 1451 2116 -1694 -2978 583 2732 213 -2766 -827 2973 2032 -1964 -1916 1935 3137
3780C137l513k591L179L082k318l846Q96M135J69m415j445L973K464l059l432
$$ 3137 -376 -2967 212 3294 976 -2870 -1974 2161 2330 -2085 -3530 443 2907 -152 -3584
3795c584K054M374q04m430l12M351J953l618l146L016L959j880m284J67M482J083
$$ -3584 -1530 2844 2040 -2390 -2702 1649 3602 -16 -3162 -146 3813 1933 -2351 -2184 2298 3381
3811C381m323k542L371L314k356m210Q72M525L30m266j678L676L001k581l756
$$ 3381 -942 -3484 -113 3201 845 -3365 -2493 2032 2362 -1904 -3582 94 3095 514 -3242
3826c242J595M297p9m030j071L674K429k882l221J615L677n27l871q86L325J717
$$ -3242 -1647 2650 2571 -1459 -2530 1144 3573 691 -2530 -915 2762 2235 -1636 -2522 803 2520
3842B520k703k829J674L175n68l271o05K925J778k110k413J485K809j26k615p33
$$ 2520 -183 -3012 -1338 1837 1269 -2002 -2607 318 2096 -14 -2427 -942 1867 1741 -874 -1607
3858a607K519J598j706k117P12K329J40k458j059J755J489j154k236J61K257N02
$$ -1607 912 2510 804 -1313 -601 1728 1868 -590 -1649 106 1595 441 -1795 -1634 623 1125
3874A125j932j342J327K195n64k333q0K343J316j765j936J306K596m25k660o44
$$ 1125 -807 -2149 -822 1373 809 -1524 -1604 739 2055 290 -1646 -340 2256 1831 -829 -1473
3890a473K392J690k106k641J218K801k95l169j135K923J928k404k635J341L228
$$ -1473 919 2609 503 -2138 -920 1881 1586 -1583 -2718 205 2133 -271 -2906 -1565 1663
3905A663K3l535p51L364J993k366k782J513L704m53l781n96L317J826k839l101
$$ 1663 1686 -1849 -2600 764 2757 391 -2391 -878 2826 2373 -1408 -2004 1313 3139 300 -2801
3921b801K050L349j032l690n15L423J644l273k509K391L127j010l499J7L852J000
$$ -2801 -751 2598 1566 -2124 -2639 784 2428 -845 -3354 -963 2164 1154 -2345 -2328 1524 2524
3937B524l090j717K379K802j388l293P11L194K09k853j408K285J951j992k436
$$ 2524 -566 -2283 96 2898 1510 -1783 -1072 2122 2331 -522 -1930 355 2306 314 -2122
3952b122R66K262r2k420o99K249J074j652j280J077J766l99j759L99J672J67j128
$$ -2122 -1156 1106 1014 -1406 -2105 144 1218 -434 -1714 -637 1129 730 -1029 -630 1042 1209 81
3969H1n76J061Q09j024p86O69N21n41q66K35Q23m13r59L13P87k25q22r7J249K73
$$ 81 -495 566 1375 351 -435 234 755 214 -652 -417 406 -7 -966 -653 134 -91 -913 -1010 239 512
3989E12j193k69J275Q57r38j228J003J673o39j934J02K002O03k186j320J928J680
$$ 512 -681 -950 325 1182 244 -984 19 1692 1053 -881 -779 1223 1826 -360 -1680 248 1928
4006A928j560k506P26K819j44k924q34K813J768k244k483J727L215o94l323j95
$$ 1928 368 -2138 -1412 1407 1263 -1661 -2495 318 2086 -158 -2641 -914 2301 1607 -1716 -1911
4022a911L479J441l100k278K371L083j608l512K64L656O38l680j896K938K705
$$ -1911 1568 3009 -91 -2369 2 3085 1477 -2035 -1771 1885 2523 -1157 -3053 -115 2590
4037B590k177l450J085L747J80l764j150L549K195k617k909J857L577o13l795
$$ 2590 413 -3037 -1952 1795 1975 -1789 -2939 610 2805 188 -2721 -864 2713 2100 -1695
4052a695k93L572J316l011k427K330K906j647l294M42L213N23l265j409K744J975
$$ -1695 -1988 1584 2900 -111 -2538 -208 2698 1051 -2243 -1801 1412 1935 -1330 -2739 5 1980
4068A980j952k475J149K986k47k910k33K666J112k116j737J803K152j267k261
$$ 1980 28 -2447 -1298 1688 1441 -1469 -1702 964 2076 -40 -1777 26 2178 911 -1350
4083a350N72K187J87k413p39K146R49j872j527J292J927q62k272N63K231J43k044
$$ -1350 -778 1409 1596 -817 -1556 590 1539 -333 -1860 -568 1359 497 -1775 -1212 1019 1162 -882
4100h82p46K195J379j989j572J492K068p66k482J99K625K69k509r98J991J754
$$ -882 -1628 567 1946 -43 -1615 -123 1945 1179 -1303 -1104 1521 1790 -719 -1717 274 2028
4116B028j820k508J288K688n93k772m45K875J422k742j914K143K620j081l110
$$ 2028 208 -2300 -1012 1676 1083 -1689 -2134 741 2163 -579 -2493 -350 2270 1189 -1921
4131a921J87L534O02l136j565K517K606j934l326J019L491J4l374j497L190K349
$$ -1921 -1734 1800 2402 -734 -2299 218 2824 890 -2436 -1417 2074 2088 -1286 -2783 407 2756
4147B756k624l015J482L478k42l672q74L610J887k795k711J824L517p23l757k79
$$ 2756 132 -2883 -1401 2077 1835 -1837 -2711 899 2786 -9 -2720 -896 2621 1898 -1859 -2138
4163b138L489J476k902k549K029L201j082l452j75L229J372k853k331K083K826
$$ -2138 1351 2827 -75 -2624 -595 2606 1524 -1928 -2103 1126 2498 -355 -2686 -603 2223
4178B223r57l145j69L222J101k666j944J889K599p53l015j72K927J002k188k004
$$ 2223 1266 -1879 -2048 1174 2275 -391 -2335 -446 2153 1400 -1615 -1787 1140 2142 -46 -2050
4194b050J453K524o53k742l03K473J284k031k113J303K509l51k608o36K356J587
$$ -2050 -597 1927 1274 -1468 -1771 702 1986 -45 -2158 -855 1654 1303 -1305 -1941 415 2002
4210B002j806k084R60K529L3k549j065K272J855j604k430O02K780L88k712j323
$$ 2002 196 -1888 -928 1601 1634 -915 -1980 292 2147 543 -1887 -1285 1495 1883 -829 -2152
4226b152K181K210j463k863N08L047O05k973j566K460K515j645l076M88L483O43
$$ -2152 29 2239 776 -2087 -1579 1468 2073 -900 -2466 -6 2509 864 -2212 -1724 1759 2402
4242B402l399j676K743K675j829l426P74L764L14l550j573K989K748k131l556
$$ 2402 -997 -2673 70 2745 916 -2510 -1736 2028 2342 -1208 -2781 208 2956 825 -2731
4257b731J213L853K4l726j487L448K518k725l291J582L689k32l960j000L726J983
$$ -2731 -1518 2335 2359 -1367 -2854 594 3112 387 -2904 -1322 2367 2135 -1825 -2825 901 2884
4273B884k938k982J958L668q67l903k05L734J388l151k485K598L185j672l506
$$ 2884 -54 -3036 -1078 2590 1723 -2180 -2385 1349 2737 -414 -2899 -301 2884 1212 -2294
4288b294N68L483O63l452j655L099K189k133k983J181L384l61l403n51L056J441
$$ -2294 -1726 1757 2420 -1032 -2687 412 2601 468 -2515 -1334 2050 1689 -1714 -2265 791 2232
4304B232k409k270J965K800j293k846M43K860N65k797j284K623J659j916k242
$$ 2232 -177 -2447 -482 2318 1025 -1821 -1378 1482 2047 -750 -2034 589 2248 332 -1910
4319a910J227K582o13k980J05K595O54k398j503K157K134j823k310J166K554j48
$$ -1910 -683 1899 1286 -1694 -1589 1006 1660 -738 -2241 -84 2050 227 -2083 -917 1637 1489
4335A489k887m00K915J105k518j652J910K507j478k970O56L074Q4k959j276K806
$$ 1489 -1398 -1798 1117 2222 -296 -1948 -38 2469 991 -1979 -1323 1751 1835 -1124 -2400 406
4351D06J977k441k612J643K968o05l362l12L473J159k887j999K351K913j464l340
$$ 406 2383 -58 -2670 -1027 1941 1336 -2026 -2338 1135 2294 -593 -2592 -241 2672 1208 -2132
4367b132O74L474M49l322j543K868K455k506k932J309L260l19l560q16L387J613
$$ -2132 -1458 2016 2465 -857 -2400 468 2923 417 -2515 -1206 2054 1735 -1825 -2641 746 2359
4383B359k744k429J883L127q73l362J82L204J025k782j800K259K426j345k759
$$ 2359 -385 -2814 -931 2196 1323 -2039 -1857 1347 2372 -410 -2210 49 2475 1130 -1629
4398a629M98K739L69k665j247K135J722j598k189P17K308j34k144n46J823J126
$$ -1629 -1131 1608 1977 -688 -1935 200 1922 324 -1865 -1148 1160 1026 -1118 -1664 159 1285
4414A285j411j319J007J589l08j527n5J442M79j080p07P49P33l87r43J81N87q
$$ 1285 -126 -1445 -438 1151 843 -684 -739 703 1182 102 -605 144 877 490 -453 -272 315 307
4432C07n42k56L01R1k47m4J14n2k9R5K43j8l83K59P07ro90j26Q10N92q56q80O81
$$ 307 -235 -491 -190 -99 -346 -390 -276 -328 -357 -262 -19 -37 -420 -161 546 537 -153 -279 531 1123 267 -613 68
4455F8J007l84j365k55J451M80j489j027J126J365p23j824K86K051L62j817r11
$$ 68 1075 691 -674 -929 522 1002 -487 -1514 -388 977 254 -1570 -1284 767 1129 -688 -1599
4472a599J625J804j157k054P30K210J28k158r98K103J525j751k011P77K302j54
$$ -1599 26 1830 673 -1381 -651 1559 1687 -471 -1469 634 2159 408 -1603 -826 1476 1322
4488A322k583p27K231J292j735j943J016K535l74k474k39K221J324j679j875J361
$$ 1322 -1261 -1988 243 1535 -200 -2143 -1127 1408 1034 -1440 -1679 542 1866 187 -1688 -327
4504c27K271n94k176k89K104J045k006j567J199J765n61k165k90J988P71j696
$$ -327 1944 1350 -826 -1115 989 2034 28 -1539 -340 1425 864 -1301 -1591 397 1168 -528
4520e28j163R10J756l45j797n8J652P95j067j151P21J576j83j407l33J166Q77
$$ -528 -1691 -781 975 630 -1167 -1225 427 1222 155 -996 -275 1301 1118 -289 -622 544 1421
4537A421q99j353L81J204N2j200p86Q67J015n60j292M5J196O86r95j057Q38J298
$$ 1421 522 -831 -450 754 806 -394 -1180 -313 702 142 -1150 -1105 91 777 -218 -1275 -437 861
4555H61Pj337m65J437J057j080j351N27J633J39j853q28J510J238j161j838L80
$$ 861 868 -469 -934 503 1560 480 -871 -344 1289 1428 -425 -1253 257 1495 334 -1504 -1124
4572a124K069J46k211q42J767J551j174k090P58K468J79k280r42K158J836j604
$$ -1124 945 1091 -1120 -1962 -195 1356 182 -1908 -1150 1318 1497 -783 -1725 433 2269 665
4588F65k314R47K601p9k729r11K464J542k057k362J179K697m45k958m61K703J460
$$ 665 -1649 -702 1899 1820 -909 -1820 644 2186 129 -2233 -1054 1643 1198 -1760 -2221 482 1942
4605A942k330k110J786K723p91k855k9L042R85k511j744K033K412j361k793L71
$$ 1942 -388 -2498 -712 2011 1220 -1635 -1664 1378 2363 -148 -1892 141 2553 1192 -1601 -1230
4621a230K834L77k774j429K309J895j775k557J020K701j61k703o39K649J382k091
$$ -1230 1604 1981 -793 -2222 87 1982 207 -2350 -1330 1371 1210 -1493 -2132 517 1899 -192
4637a92j761J546K446q24k571K62K558N45k377j283J998J770j722k173R55K191
$$ -192 -1953 -407 2039 1215 -1356 -1094 1464 2009 -368 -1651 347 2117 395 -1778 -823 1368
4653A368k86k524m01K430Q82k154j377J584K079j035k362O22K553K13k363p56
$$ 1368 1082 -1442 -1843 587 1469 -685 -2062 -478 1601 566 -1796 -1174 1379 1592 -771 -1527
4669a527K196J580j945k029J458K325p85k667j55K783O51k663j465K090K126j536
$$ -1527 669 2249 304 -1725 -267 2058 1273 -1394 -1549 1234 1885 -778 -2243 -153 1973 437
4685D37k856R45L042j7k910q74K837J847k369k390J811K940p33l264k62L356J136
$$ 437 -2419 -1474 1568 1551 -1359 -2233 604 2451 82 -2308 -497 2443 1710 -1554 -1816 1540 2676
4702B676l108k004K226K792j528l440N49L482L89l255j672K838K647k152l154
$$ 2676 -432 -2436 -210 2582 1054 -2386 -1837 1645 2034 -1221 -2893 -55 2592 440 -2714
4717b714J269L398J32l437j138L283K095k536k767J494L396m66l580n69L203J501
$$ -2714 -1445 1953 2085 -1352 -2490 793 2888 352 -2415 -921 2475 2009 -1571 -2140 1063 2564
4733B564k660k467J724L052r69l294o0L039J143k583k066K088K584j113k740J20
$$ 2564 -96 -2563 -839 2213 1244 -2050 -2110 929 2072 -511 -2577 -489 2095 982 -1758 -1638
4749a638K880R30k570j511J922K064j011k513J32K519N36k168j297J487J816r41
$$ -1638 1242 2172 -398 -1909 13 2077 1066 -1447 -1315 1204 1740 -428 -1725 -238 1578 637
4765F37k139K29J978N35j622j176J223J680o50j635l8J596P57j295j099Q03J323
$$ 637 -1502 -1273 705 1240 -382 -1558 -335 1345 695 -940 -978 618 1375 80 -1019 -216 1107
4782A107k15j428m12J296Q58r69j239L58J353J76j458o67J118J102o88j436K11
$$ 1107 892 -536 -948 348 1206 237 -1002 -644 709 885 -573 -1240 -122 980 292 -1144 -933
4799i33J548M25j344r63J178J357n55j641m5J750O04j527j181J082J608n32j887
$$ -933 615 1040 -304 -1267 -89 1268 713 -928 -973 777 1381 -146 -1327 -245 1363 831 -1056
4816a056p1J774P42j761j225J284J683o87j965K3K096N32j765j124J408J745r83
$$ -1056 -1127 647 1389 -372 -1597 -313 1370 683 -1282 -1259 837 1369 -396 -1520 -112 1633 650
4833F50j937L06J981M07j851j030J656J384j198j685N11J919M4j926n42J585J066
$$ 650 -1287 -981 1000 1407 -444 -1474 182 1566 368 -1317 -806 1113 1157 -769 -1311 274 1340
4850A340j191j471O73J757k99j623j80J423P35j241j026R34J156n00j155K9J217
$$ 1340 149 -1322 -649 1108 809 -814 -994 429 1164 -77 -1103 -169 987 487 -668 -639 578
4867E78K18j128m76R16N97o19p91L92Q71k40q36R4P38J09p05k45P35K87o80k98
$$ 578 796 -332 -808 108 705 86 -705 -313 558 318 -518 -424 314 423 -282 -527 208 495 -185 -483
4887d83N32M44m09p24N10O80l07p61Q9Q27K40j000m05J063M63p56q18N23J230
$$ -483 49 493 84 -640 -130 550 243 -518 -429 398 638 -362 -767 296 759 3 -815 -292 938
4906I38l96j305J04J270L89j294q97J192J257j019j437N08J571J31j818n57J767
$$ 938 542 -763 -659 611 1000 -294 -1191 1 1258 239 -1198 -690 881 1012 -806 -1363 404
4923D04R10j312j369Q21J976m62k067qJ920P12j665j349J383J704r19j923K30
$$ 404 1314 2 -1367 -546 1430 968 -1099 -1107 813 1525 -140 -1489 -106 1598 679 -1244 -1014
4940a014J953M67j960j055J671J397j157j821N90K016K3k037n25J787J187j357
$$ -1014 939 1406 -554 -1609 62 1459 302 -1519 -929 1087 1110 -927 -1452 335 1522 165
4956A65j608R96J875m90j802j66J749O57j617j088J255J290p91j568K98J572J89
$$ 165 -1443 -447 1428 938 -864 -1030 719 1376 -241 -1329 -74 1216 425 -1143 -845 727 916
4973I16j515o24J326R35j058j101P36J327l19j345R3J249L69j131o06R31P77o91
$$ 916 -599 -1223 103 1038 -20 -1121 -385 942 623 -722 -629 620 989 -142 -748 183 960 269
4991B69r66M29J059k97j140l5J112K49j173m40R25P44q17r44P55J090m03j196
$$ 269 -697 -268 791 494 -646 -681 431 680 -493 -933 -8 736 -81 -1025 -270 820 417 -779
5009g79J04J368K82j279o02J269R65r87j325O73J481k68j769k09J613O44j503
$$ -779 -675 693 975 -304 -906 363 1328 341 -984 -311 1170 902 -867 -1076 537 1181 -322
5026c22j291J208J621q21j826K50J986M62j917j041J866J543j198j916O22K285
$$ -322 -1613 -405 1216 395 -1431 -1181 805 1267 -650 -1691 175 1718 520 -1396 -774 1511
5042A511O9k367o86K080J384j666k170J098K395m38k562l93K251J253k055j853
$$ 1511 1580 -787 -1473 607 1991 325 -1845 -747 1648 1210 -1352 -1745 506 1759 -296 -2149
5058b149J513K298p04k472r1K513J006k208j569J771K082q42k502J29K519N86
$$ -2149 -636 1662 958 -1514 -1605 908 1914 -294 -1863 -92 1990 1148 -1354 -1225 1294 1880
5074A880k275j358J645J967j171k419M02K298M58k200j322J828J909j239k023
$$ 1880 -395 -1753 -108 1859 688 -1731 -1329 969 1427 -773 -2095 -267 1642 403 -1620
5089a620M63K211M95k055j010J738J558j004j864K72K045K72j945r20J395J338
$$ -1620 -1157 1054 1549 -506 -1516 222 1780 776 -1088 -816 1229 1501 -444 -1364 31 1369
5105A369q77j774K10J723K71j535q71J086J459p09j557J86J604O29j420r92J085
$$ 1369 492 -1282 -1072 651 922 -613 -1484 -398 1061 352 -1205 -1019 585 1214 -206 -1198 -113
5122a13J348l59j458j58J451P57j329j230P92J419k47j632n04J520Q66j251j257
$$ -113 1235 876 -582 -740 711 1468 139 -1091 -299 1120 873 -759 -1263 257 1123 -128 -1385
5139a385N90J653j9j779m16J601J124j124j512P21J857j1j795o16J712J149j395
$$ -1385 -795 858 839 -940 -1356 245 1369 245 -1267 -546 1311 1300 -495 -1111 601 1750 355
5156C55j638Q12J811k59k006n81J789J135j624j572R82J935l13k113k64K080R56
$$ 355 -1283 -471 1340 1081 -925 -1506 283 1418 -206 -1778 -796 1139 826 -1287 -1551 529 1485
5173A485j606j444J300J941o28k118K0K131O38j870j281J447J654j038k041L54
$$ 1485 -121 -1565 -265 1676 1048 -1070 -1050 1081 1719 -151 -1432 15 1669 631 -1410 -1056
5189a056K005J27j977q40J742J305j351j624P99K010k73j850k23J878Q39j616
$$ -1056 949 1076 -901 -1741 1 1306 -45 -1669 -870 1140 867 -983 -1206 672 1511 -105
5205a05j031J207J554q21j820L59J789J28j796p12J503J068j372j466Q96J574
$$ -105 -1136 71 1625 804 -1016 -657 1132 1260 -536 -1248 255 1323 -49 -1515 -619 955
5221I55m41j731K6J814M41j623q00J479J270r32j640P49J846k79j844k16J760
$$ 955 514 -1217 -1191 623 1064 -559 -1359 120 1390 458 -1182 -433 1413 1134 -710 -926 834
5238H34P60j674j365J372J510r65j874K37K133J43k145o62J849J247j377j798
$$ 834 1594 -80 -1445 -73 1437 472 -1402 -1165 968 1111 -1034 -1696 153 1400 23 -1775
5254a775J032K256m89k173j34K226R49j956j560J657J928j035k257K05K369M05
$$ -1775 -743 1513 1024 -1149 -1283 943 1892 -64 -1624 33 1961 926 -1331 -1126 1243 1648
5270A648k469j099J932J645j454k149P38K475j07k395n39K187J433j754j858J337
$$ 1648 -821 -1920 12 1657 203 -1946 -1208 1267 1160 -1235 -1774 413 1846 92 -1766 -429
5286d29K194n39k262j99K278R11k089j379J465J759q49k251J73K145L54j976j007
$$ -429 1765 1226 -1036 -1235 1043 1954 -135 -1514 -49 1710 861 -1390 -1217 928 1282 -694 -1701
5303a701J497J501j050j729M68J896J47j636o93J582J119j078j304O34J460p3
$$ -1701 -204 1297 247 -1482 -1014 882 1029 -607 -1300 282 1401 323 -981 -347 1113 1040
5319A040j508l47J328M91r33r39M76J022k01j135j8Q29L22o96m49M54N78j88n30
$$ 1040 -468 -815 513 1004 71 -868 -392 630 429 -706 -724 105 427 -269 -718 -264 314 126 -404
5338d04J34M33J53k50j42K17J02L3j26q8P5l1J4K3k46k27K86K13k47l47L8M96
$$ -404 -270 163 316 66 -76 141 243 276 150 62 137 106 120 143 -103 -330 -44 169 -78 -425 -387 109
5360A09J27o08k68O09N60m04p23K80R10J30r15l95Q94P15p40r61L80J037l3j223
$$ 109 236 -372 -640 -31 529 125 -598 -318 592 722 -193 -588 306 1021 281 -680 -300 737 704 -519
5380e19l94J140O25r17j078O19J253k25j295k57J276Q49j214r60Q31J343l62j454
$$ -519 -913 227 852 -65 -1143 -524 729 504 -791 -1048 228 1077 -137 -1097 -266 1077 715 -739
5398g39r0J450O26j321r87Q94J215l94j505n1J471L96j222r84J044J200o85j358
$$ -739 -829 621 1247 -74 -1061 -167 1048 654 -851 -902 569 965 -257 -1241 -197 1003 318 -1040
5416a040K43J329L18j214o88J082R12n98j055J59J199K56j097o09R15P44n16r50
$$ -1040 -797 532 850 -364 -1052 30 942 344 -711 -552 647 903 -194 -803 112 856 340 -610
5434f10O9J056L0q46l84N56P31l94q58J79P70J42n50m20M63N85k38n32o0M42L45
$$ -610 -541 515 545 -301 -685 -129 602 208 -650 -471 299 441 -109 -529 -66 519 281 -251 -311 131 476
5455D76k98n20K02M72Q6m62m31L72N25k89m94o0M71M59n62n76L66N99M8o74l46
$$ 476 178 -342 -140 332 418 -44 -475 -103 422 133 -361 -421 50 509 -53 -629 -263 336 384 -290 -636
5476f36P52N91n83p04J84R06J95r94m50Q71O96n99r50K00J196oj104m04R05Q53
$$ -636 116 707 124 -580 -396 510 705 -289 -739 132 828 229 -721 -521 675 669 -435 -839 66 919
5496I19p52j117M79J244j25j186l74J163Q47j042j064O06J304k23j386k22J387
$$ 919 167 -950 -471 773 648 -538 -912 251 1098 56 -1008 -402 902 679 -707 -929 458
5513D58O12j236q27Q35J161n10j356J71J430J88j270o79J034J149q98j273M69
$$ 458 1070 -166 -993 -158 1003 493 -863 -692 738 926 -344 -1023 11 1160 262 -1011 -542
5530e42J292J36j440l93J293P02j102r47P04J212l83j368M6J348L28j211p22J114
$$ -542 750 886 -554 -947 346 1048 -54 -1001 -297 915 532 -836 -790 558 886 -325 -1047 67
5548F7R85q39j166M84J256r8j340j96J300N28j204q50J010J005o42j354M01J405
$$ 67 1052 213 -953 -469 787 689 -651 -847 453 981 -223 -1073 -63 942 300 -1054 -653 752
5566G52k2j373m34J389Q50j212j088Q55J511n62j613O1J693L90j618q51J417J288
$$ 752 730 -643 -1077 312 1162 -50 -1138 -283 1228 666 -947 -886 807 1197 -421 -1272 145 1433
5584A433j078j666N69J923j42j985m82J863J048j548j584J146J966o55k090Q3
$$ 1433 355 -1311 -742 1181 1039 -946 -1428 435 1483 -65 -1649 -503 1463 808 -1282 -1199
5600a199K129O68k057j205J722J746j188k083M94K293K14k379q24K025J493j677
$$ -1199 930 1598 -459 -1664 58 1804 616 -1467 -973 1320 1534 -845 -1669 356 1849 172
5616A72j996R01K382k63k483m11K180J297j843j872J409K242o61k314j76K347
$$ 172 -1824 -923 1459 1196 -1287 -1698 482 1779 -64 -1936 -527 1715 1054 -1260 -1436 911
5632I11R44k136j520J641J925q65k292J02K357M71k144j175J673J635j065j978
$$ 911 1855 -281 -1801 -160 1765 900 -1392 -1290 1067 1538 -606 -1781 -108 1527 462 -1516
5648a516M34K098J74j888q86J694J439j220j669O93J776N7j736o02J587R37j116
$$ -1516 -1082 1016 1190 -698 -1584 110 1549 329 -1340 -647 1129 1186 -550 -1152 435 1372 256
5665B56j329N12J607j13j581m29J263P44q66j135M78J234p4j170k67R64P18o46
$$ 256 -1073 -561 1046 933 -648 -1077 186 930 64 -1071 -593 641 567 -603 -870 94 812 166
5683A66r27M65R42P0q29m08O84O87m79p72J38N82L00p44n13M34N78j57o87k05
$$ 166 -761 -296 646 716 -113 -521 163 850 371 -401 -263 319 619 -125 -638 -204 374 217 -470 -675
5703f75P34L90n64m67K25P75Q2q30k24P35N20l09q00J02Q61J69q64m60N72P96
$$ -675 59 449 -115 -582 -357 418 500 -330 -554 181 701 392 -408 -306 555 724 -140 -600 -28 768
5723G68m70j011J29R60J50r09n65Q05Q53n12j026K28J068K53j000m52R41P34n52
$$ 768 298 -713 -584 376 526 -383 -948 -143 710 198 -828 -600 468 721 -279 -731 210 944 392
5742C92j029K74J134J8j025l87Q43O01o97q83L43R62j95j008j06P97N10p28o47
$$ 392 -637 -363 771 789 -236 -623 220 821 124 -759 -416 546 351 -657 -763 34 544 -184 -831
5761h31N42P98k88o97R7P24K39o65l53N64N16l02o55J93N92o7o53j44M52K49n20
$$ -831 -289 509 221 -476 -379 345 584 -81 -434 130 646 344 -311 -118 474 407 -246 -390 62 311 -209
5782b09k70K24M06k42m13J85M91j10l15j8M76J25m32p5M64J98l76k81K83M30l09
$$ -209 -479 -255 151 -91 -504 -319 172 62 -253 -271 205 330 -102 -177 287 485 109 -172 111 541 232
5803B32n61J59N29n5o38k89P47K98o18n52M88O41k44q04J32R85J47q39l96P78
$$ 232 -329 -170 359 304 -334 -623 124 422 -196 -748 -260 381 137 -667 -535 450 597 -242 -638 140
5823A40Q05n89q65L05R79l2j058l76R90N74r39q18M74R55k12j168q9J192L55r66
$$ 140 945 356 -509 -204 775 743 -315 -691 299 873 -66 -884 -410 545 333 -835 -924 268 623 -343
5843c43o90Q24J031m83j103K27J200K65j123n57R74Q86p95j017L52J129K4j258
$$ -343 -1033 -209 822 339 -764 -537 663 928 -195 -752 222 1108 313 -704 -352 777 801 -457
5861d57m11J028N29p26r23M47J070k81r89%R19L64p27n35O37Q32m58o92J45P87
$$ -457 -868 160 689 -37 -960 -513 557 276 -713 -713 206 570 -157 -692 -55 777 319 -373 -228 559
5881E59J77q18k72N66M28n44n52K47O73l07o14J02M39J48n02k65M61L90m48k94
$$ 559 736 -82 -354 212 640 96 -456 -209 464 157 -457 -355 84 232 -270 -535 -74 316 -132 -426
5901d26L66M32j66m90J92N37p7m45q1M86K03o35l11M92L81m54n90K35P11j19q60
$$ -426 -60 372 206 -284 -92 445 368 -77 -158 328 531 -104 -415 77 458 4 -586 -351 360 241 -619
5922f19l8Q14L31p83n57P34Q36m64q93K13J097J43j062m58J029P63p96j115M92
$$ -619 -657 157 488 -295 -852 -118 718 254 -639 -426 671 814 -248 -706 323 1086 290 -825 -333
5941c33J267k34j401k32J277N72j079j156Q25J399l97j530K1J545N65j408q97
$$ -333 934 700 -701 -933 344 916 -163 -1319 -494 905 508 -1022 -1001 544 1109 -299 -1196
5958a196J060J430o07j623J96J686L27j615q05J281J250r76j572L82J702N2j622
$$ -1196 -136 1294 687 -936 -740 946 1273 -342 -1147 134 1384 408 -1164 -782 920 972 -650
5975f50p14J475J056j042j447O02J666o2j598l98J484R13j095j312P70J538l09
$$ -650 -1364 111 1167 125 -1322 -720 946 884 -714 -1112 372 1285 190 -1122 -352 1186 877
5992H77j513k96J388P85j195j186Q13J231l25j388j94J359N53j118q98P76J154
$$ 877 -636 -932 456 1241 46 -1140 -327 904 579 -809 -1003 356 909 -209 -1107 -331 823
6009H23l07j217o6J195L97q80o96O37J040l89r80l5Q47L89p04p89M98Q56k22q69
$$ 823 516 -701 -767 428 825 -55 -751 -114 926 537 -443 -478 369 758 54 -735 -237 619 397 -472
6029d72j66P56M68o22o52L96O47K2o56l51P52M77m42n78J40Q08J18p49l70N33
$$ -472 -638 118 586 -36 -688 -292 355 377 -279 -630 122 599 157 -421 -281 527 645 -104 -474 59
6049E9N69l25p88N1Q68P5p16m75N20O81l03q28J10P57L10p34n40O20P61m10p84
$$ 59 628 303 -485 -434 434 509 -207 -682 -162 519 216 -612 -502 255 565 -169 -709 -89 672 262 -522
6070e22O7Q77L20q62n21P12O40m00q62R3R15J51r40l61P56N55m48r57L74J007
$$ -522 -455 422 742 -120 -641 71 711 311 -551 -458 457 608 -332 -693 63 618 170 -787 -413 594
6090E94j32q78j96P84N71p25p16N15R42k99r68N9R45J85q76m46P23O11m93q86
$$ 594 462 -416 -612 172 743 18 -698 -183 759 460 -508 -449 496 681 -195 -641 82 693 200 -686
6110f86L41Q92j20r42r6Q39L76p51o06O75P42l66r37J98J026K6r54k85Q70O14
$$ -686 -345 547 427 -515 -611 228 604 -147 -753 -78 664 298 -639 -441 585 611 -343 -628 242 856
6130H56q29p74N47R71l61j065P9J092L32j151o07R29Q47p26r95L61J276j08j260
$$ 856 27 -747 -200 771 410 -655 -576 516 848 -303 -910 19 866 140 -855 -494 782 674 -586
6149e86l12J199O71j099r65Q72J208m45j452R1J456L77j345q18J145J169q27j431
$$ -586 -898 301 972 -127 -1092 -220 988 543 -909 -818 638 1015 -330 -1148 -3 1166 339 -1092
6167a092M29J510J24j525n87J319J160j173j412P48J561j94j642l39J525P97j286
$$ -1092 -663 847 971 -554 -1141 178 1338 165 -1247 -499 1062 868 -774 -1113 412 1209 -77
6184g7j161R06J479n26j648R4J568M89j352j028J175J297p45j445K74J469K95
$$ -77 -1238 -332 1147 621 -1027 -933 635 1124 -228 -1256 -81 1216 471 -974 -700 769 1064
6201A064j502o68J226R47q32j190L89J397l0j369m12J171P80r10j056N73J198
$$ 1064 -438 -1106 120 1067 235 -955 -566 831 801 -568 -980 191 971 61 -995 -422 776
6218G76j94j101k55J071N75q42q18O12Q54k32q94q7Q48K83p74l92L82O31k18p09
$$ 776 582 -519 -774 297 872 30 -788 -176 678 446 -448 -535 313 596 -178 -570 -188 443 225 -484
6238d84L6O07J40m61k39L33L98j65l76J08K48R3j99j86J27K02l2q7n4p0J77m1
$$ -484 -448 159 299 -162 -401 -68 330 165 -211 -103 145 238 39 -147 -20 182 150 63 9 -61 116 75
6260G5o9j23q1K51Q3k08j97J46K84j6m35M2L78J91l26l28K20N42j28n56l9M91
$$ 75 6 -117 -198 53 136 -72 -269 -123 161 145 -290 -248 130 321 -5 -333 -113 429 301 -255 -294 197
6282A97L05m73n47M33O03k86o64m4P24K55o94n24N40O94k99p02j47J015K06p79
$$ 197 502 29 -518 -85 518 232 -432 -476 248 503 -191 -715 -175 519 220 -482 -629 386 592 -187
6302a87m31O19P49l56r01J28R39J45q88m65O59P16n10r10K57Q54P9r11l73P70
$$ -187 -618 1 750 394 -507 -379 560 705 -183 -648 11 727 217 -693 -436 418 497 -414 -787 -17
6322a7O31n10p51K85Q25Q8q41k36P33M74n29o35L38P36q5p37j87O46L26m71n88
$$ -17 614 104 -647 -362 463 551 -290 -526 207 681 152 -483 -145 591 506 -231 -418 228 554 83 -505
6343e05K52O23j24o09j58N24K99l68l86K21M60M1m05j19M15K29j91l60J26L62
$$ -505 -253 370 246 -363 -521 3 302 -66 -452 -231 229 270 -135 -254 161 390 199 -161 -35 327
6363C27J0l14j54J31K79j58l23n7K20J60j21k96L8K69J69l22k21L01K42%l08p8
$$ 327 337 23 -131 0 279 121 -202 -259 -39 121 0 -296 -258 11 180 -142 -363 -62 180 180 -128 -206
6385b06L30K70k90l36K02L80n7l73j88M54K67m60m12J38N21j8o08j45N92K63m35
$$ -206 124 394 104 -232 -30 350 293 -80 -268 186 453 -7 -419 -281 240 222 -386 -531 61 324 -111
6406a11n34L81P32k02n78q7P27L06n99m35M52N67j95p25p3P82J16o98l50N67M42
$$ -111 -645 -264 468 266 -312 -399 328 634 35 -400 52 619 424 -301 -374 408 524 -174 -524 43 485
6427D85l85o99J04P76n8o07k15O35M38n21n38N02O56k67o31M8O98J35o43k91N62
$$ 485 100 -599 -495 281 223 -384 -599 36 474 -47 -585 -83 573 306 -325 -277 421 556 -87 -378 184
6448A84L96m23o12K40O98k20o71p7N63L47p16m18O27N40m53n65K33P72j3p46p0
$$ 184 580 157 -455 -215 483 263 -408 -485 78 425 -291 -709 -82 458 5 -560 -327 445 432 -314 -384
6469c84P47L37o91n26N61P08m43q34J77Q68K9r91l28R05N99q53q41N82J029k48
$$ -384 363 700 9 -517 44 752 309 -525 -348 520 549 -442 -770 135 734 -119 -960 -378 651 403
6489D03j155MJ186M26j036p56R67J061o45j219K73J362J07j371n72J186Q99r83
$$ 403 -752 -748 438 864 -172 -928 39 1100 455 -764 -491 871 978 -393 -965 221 1120 137
6507A37j272N82J403j97j519l25J440Q30j255j151R31J444l53j603K0J520O15
$$ 137 -1135 -553 850 653 -866 -1191 249 1079 -176 -1327 -396 1048 695 -908 -888 632 1247
6524A247j404r89J155J315p21j550K05J635K65j614p52J250J180j001j450M52
$$ 1247 -157 -1146 9 1324 603 -947 -742 893 1158 -456 -1208 42 1222 221 -1229 -777
6540g77J594L3j632n04J461J029j110j286P33J510j60j518k34J403P05j186j059
$$ -777 817 850 -782 -1286 175 1204 94 -1192 -459 1051 891 -627 -861 542 1247 61 -998
6557i98P48J293l97j403n0J217M81j099q01P74R82m24j114KJ167L83r63o52Q26
$$ -998 -250 1043 646 -757 -807 410 891 -208 -1009 -235 747 323 -791 -789 378 761 -202 -854 -28
6576b8Q33m24r14J33R46K07q78m18N92O21l73p87J54O50Q2o26l82M67M51k49n18
$$ -28 805 381 -533 -400 546 753 -125 -543 49 670 297 -490 -336 314 396 -230 -612 -145 306 57 -461
6597d61Q2M69J91l27l67M05K95p6l81o2M09J84k73k62J67K52M7l55j75J77K76
$$ -461 -379 90 281 -46 -413 -8 287 211 -170 -232 177 361 88 -174 -7 245 292 -63 -238 -61 215
6618B15j28l34k1L44J21l44k52K04L67l6l98m8M42J53k06l69J65N05o2m15q2L23
$$ 215 87 -247 -268 76 197 -147 -399 -195 172 136 -262 -310 132 285 79 -290 -125 380 318 -97 -179 144
6640A44K65l13l79J49M12q8m62q8M04K82l78l58K82L96j08l91j03M51K10l48k57
$$ 144 409 96 -283 -134 278 190 -272 -360 44 326 -52 -410 -128 268 160 -231 -334 117 327 -21 -278
6661b78K36L87j32l99N5L60L0l22k02L18K00k35l09J57K39L3l55o4L15O0j68j99
$$ -278 -42 345 213 -186 -131 229 259 -63 -265 53 253 18 -291 -134 105 138 -217 -281 34 94 -74 -273
6683b73J83K80j35k15Q8K59m9k28N1K34O2k89j43L13Q2k29k25J74L19k32k97O1
$$ -273 -90 190 55 -160 -72 187 138 -90 -39 195 257 -32 -175 138 220 -9 -234 -60 259 27 -270 -209
6705b09L78L7l57j85M48K16m13k57K40M83j52m78k5M77K26n15l28M78M51l77o23
$$ -209 169 206 -151 -336 112 328 -85 -342 -102 381 229 -249 -274 203 429 -86 -414 64 515 138 -485
6726d85K44O01J6o97k33O35M86n29o68L82O98j19p45j54P91L77o19n50M15P49
$$ -485 -241 360 376 -321 -554 81 567 38 -630 -248 450 331 -414 -568 223 600 -19 -569 -154 595
6746E95k23q15J1P66K98p83m76N96O06l47p98J50Q02J13p39l76O66N26m46p37
$$ 595 372 -443 -432 334 632 -151 -627 -31 575 228 -570 -420 382 495 -244 -620 46 572 126 -611
6766f11L29P00k9o27k82O97L83n34m69K79O35j06p11n2O15J85m86l71M17M37j60
$$ -611 -282 418 389 -238 -520 177 560 26 -443 -164 471 365 -346 -398 217 402 -84 -455 -38 399 239
6787B39n59O3M62Q2m47j95M14K16k54k56P0L80n3l52N6L00%j92j47J87J42j62
$$ 239 -320 -257 205 287 -160 -355 59 275 21 -235 -165 215 162 -190 -134 166 166 -26 -173 14 156 -6
6809fj69J91J43q0k40R3K97k14k22J40K20M0l67r7M61J25m22k28K88L57j85n17
$$ -6 -175 16 159 79 -161 -68 229 15 -207 -67 153 193 -174 -271 190 315 -107 -335 -47 310 125 -392
6831c92J46N25Rn35j91N27M67n51n86L97O77j26p34p2P92K50q13m10N64P33l33
$$ -392 -246 279 288 -247 -438 89 556 5 -581 -184 493 367 -367 -439 353 603 -210 -620 -56 677 344
6852C44r37P8R70J93r39m84P64Q07o04r57L13J042R9j085m56R84P59p13r71L85
$$ 344 -593 -515 455 648 -291 -775 -11 796 192 -765 -452 590 689 -396 -852 132 891 178 -793 -408
6872d08J147l5j190k64R94O20q23r09N41J043j94j143r8J060N06r68q16P14J043
$$ -408 739 704 -486 -750 244 864 41 -868 -327 716 522 -621 -719 341 847 -121 -937 -223 820
6891H20l90j077J9J051M02r58o49P13R17m86j033J45J007J87r71m83P49P21n19
$$ 820 430 -647 -628 423 825 -133 -782 -69 848 362 -671 -526 481 668 -303 -786 -37 684 165
6910A65q70J88R45R6q43m09P16O06m80o74K55P73M9p28k01N52M72m44n42J71N30
$$ 165 -705 -517 428 524 -319 -728 -12 594 114 -560 -305 468 517 -211 -412 140 612 168 -374 -203 327
6931C27P2o47j62M48L86l62m85J54M80N2l90k80M43K61k42l25R9L70J21l54j81
$$ 327 399 -248 -410 38 424 62 -423 -269 211 263 -127 -407 36 297 55 -270 -171 199 320 -34 -215
6952b15L01K60j05l91mL08J42l04k84J29L42m2l65q8K84K25k26k92J44M06n8l07
$$ -215 86 346 241 -150 -154 154 296 -8 -292 -163 179 137 -228 -316 -32 193 -33 -325 -181 225 167 -140
6974a40r5L18K22j68l45J54L88n8m17j07L65J97l00l16J45L91j07m20p9L91K25
$$ -140 -235 83 305 137 -208 -54 334 276 -141 -248 117 314 14 -302 -157 234 127 -293 -372 19 244
6995B44l66k69K59M35k23l84Q9M16P7k96k28L43K97k91k92J96L30j32l62j03M42
$$ 244 -122 -391 -132 303 80 -304 -215 201 278 -18 -246 97 394 103 -189 7 337 205 -157 -260 182
7016A82Q7l60l08L13L45k86m16K15M64j00l59j45N09K72m58l06L66M36k07n32
$$ 182 269 -91 -399 -86 259 -27 -443 -228 236 136 -223 -368 141 413 -45 -351 15 451 244 -288
7036b88J24N75po29k19N76L36m78n19K98O03j83o28q8P74K09p02m09N37P17l26
$$ -288 -164 411 404 -225 -444 132 468 -10 -529 -231 372 189 -439 -527 247 456 -246 -655 -118 599 273
7057B73q53J53R44J11q30l36O85O92o13q75L67Q79o9r72k61R00N02q38p02M83
$$ 273 -580 -427 517 628 -202 -538 147 839 226 -649 -282 597 528 -444 -705 195 697 -141 -843 -360
7077c60R74j97j036j00J116L56q95o41O80R86m37j044J36J075K41j030n29P99
$$ -360 614 417 -619 -719 397 753 -142 -783 -103 883 446 -598 -462 613 854 -176 -705 94
7095I4P46n30j012K37R84P6j032m18R15O43o73q56L50J009nr81k22Q90N40o44
$$ 94 840 310 -702 -465 519 595 -437 -855 60 703 30 -826 -476 533 528 -453 -675 215 755 111
7115A11p47M32R27j91r10n7P99L48p17o74M55P43k53p03q1O97K80p26l54N41N12
$$ 111 -636 -204 723 532 -378 -435 364 712 -5 -679 -224 519 266 -437 -518 179 459 -267 -621 -80 432
7136D32k70n71J21N75J36m82k56M60K77k19l96Q6M12l3l62j78K69K39k16k83J4
$$ 432 162 -409 -288 287 423 -59 -315 145 422 203 -193 -107 305 272 -90 -268 1 240 24 -259 -245
7157b45K98k3j78r6J64J85j44o3K6J13M1m0J6P5l5O8o0l4p9J45j3k6j79p9K50
$$ -245 53 30 -148 -244 -80 105 -39 -102 -76 37 78 38 54 129 94 162 102 68 -11 134 121 95 -84 -163 87
7182H7K1k23j41J28K30n3l34oL81N9k18k35K56L02o7l93O7M09P2l74k35L00L21
$$ 87 108 -115 -256 -128 102 49 -285 -291 90 149 -69 -304 -48 254 187 -206 -139 270 342 -32 -267 33 354
7205C54j89m12K4M77J1m30k80L70L93k23m73J20N03j0n03j20M30L72k80m19J82
$$ 354 165 -247 -223 254 265 -165 -445 -75 318 95 -378 -258 245 235 -268 -388 42 414 134 -285 -103
7226a03M82m6l80k64M06L61l85m25K26M40j11n09j01M56K15l76k89K38L84m8m28
$$ -103 379 333 -47 -311 95 456 71 -354 -128 312 201 -308 -409 47 262 -114 -403 -165 219 171 -257
7247b57K0M05J12k32k80K14L65j45k78r4L67M3k10j83J43J73r7j56n6J93Kj32
$$ -257 -237 168 280 48 -232 -18 347 202 -76 -170 197 240 30 -153 -10 163 66 -90 -146 47 49 -83
7269h3n5L1J40m5j07l7J19Q3no7L7M8O2J3j36J9J3Q9m6j18l6J58N9k22n2J02J39
$$ -83 -138 -107 33 -12 -119 -156 -37 46 41 -26 11 59 121 134 -2 17 30 119 73 -45 -81 77 136 -86 -138 -36 103
7296A03l1k13n6K67L6j72j37K19K31j69k75J06K83N1l01j23K69K30k75k72J00
$$ 103 72 -141 -197 70 106 -66 -203 16 247 78 -197 -91 192 243 -58 -181 88 318 43 -229 -129
7317a29L73p9l57q8L30J63l11k19K16L04j21l10O8L13N8k42k14L37K23k05k62
$$ -129 244 165 -192 -280 50 213 -98 -317 -101 203 82 -228 -160 153 211 -31 -245 92 315 110 -152
7338a52K9L71m1l54k4K56J27k25k23K08K13k23k23O9K96k1k20r4L08J13k36j63
$$ -152 -123 248 207 -147 -171 85 212 -13 -236 -28 185 -38 -261 -192 104 83 -137 -231 77 190 -46 -209
7360b09K44J94j77k47J58K65n6k79m4K89J28l61k46L82K43k07m04J17M67p0m70
$$ -209 35 229 52 -195 -37 228 172 -107 -151 138 266 -95 -341 41 284 77 -327 -210 257 187 -283
7381b83n2N02J83m19l69L86M67k28n74J11O58P4o64k62N51M74m56o36K90P34n7
$$ -283 -335 167 350 -69 -438 -52 415 187 -387 -276 382 456 -208 -470 81 555 99 -537 -247 487 430
7402D30p68k64P85M30o27p10N38Q26k44r06j2Q61L24q48n53P15P82m32r77J26
$$ 430 -338 -602 183 613 -14 -724 -186 640 396 -510 -522 339 663 -185 -738 -23 759 327 -650 -524
7422e24J044J80j067l74Q43P10o35r25L05J045kj042l22R83O03p60q22M43R92
$$ -524 520 700 -367 -741 102 812 177 -748 -443 602 600 -442 -764 219 822 62 -760 -317 675
7441F75j10j062j74J005N07q88p78O43R74m05r98L2R99K68q18o55P46Q00n02q79
$$ 675 565 -497 -671 334 841 -47 -825 -182 792 387 -611 -579 420 688 -130 -785 -39 761 259 -620
7461f20J00R26J69p65m68P06O12m67p82J53R29l6p87k79P00M51m79o21K81O89
$$ -620 -520 406 575 -190 -658 48 660 193 -589 -436 493 457 -330 -609 91 542 63 -558 -277 412
7481D12j7o80j53N64L49l92n01L17N04r6n60r8N24K42m10l58K60L96j15l91m3
$$ 412 395 -285 -438 126 475 83 -418 -101 403 307 -253 -351 173 415 5 -353 -93 303 188 -203 -246
7502b46L15J89k86k45K04K46r5k00j33L23J25k00j00O0J07L9j02n3P5N1l0j63
$$ -246 69 258 -28 -273 -69 177 82 -118 -251 72 197 -3 -103 -43 64 103 1 -52 23 74 44 -119
7524a19k9J63P5j16r4M9J35oj02k7O0Q4l9j57O0R0R7j59k0K1J78n8j61QJ32J01
$$ -119 -148 15 90 -26 -120 -71 64 58 -44 -71 -11 73 34 -123 -63 27 124 -35 -55 -34 144 86 -75 -67 65 166
7550A66j86j25J04J64n1j91m3J61J00j33j98J57J15Rj81J9K18L7j43q0J87M4k2
$$ 166 -20 -145 -41 123 72 -119 -162 -1 99 -34 -232 -75 40 49 -132 -113 105 142 -1 -81 106 150 128
7573A28k16O4J53n2j90N8L8J02j45o5R8N3n6o6PJ45l7j24J6J53oj12NJ50Q8j94
$$ 128 -88 -24 129 77 -113 -55 -17 85 -60 -125 -27 26 -30 -96 -89 56 19 -105 -89 64 58 -54 -49 101 189 -5
7599ej0M8J98j49j80M2K26j42j84%J67J34j52k78J73K66o7l07L1L65O0k81j60
$$ -5 -15 33 231 82 -98 -56 170 28 -156 -156 11 145 -7 -285 -112 154 87 -220 -189 176 236 -45 -205
7622b05K48K52j41l86J36M20r5l80j46L66K86l38l74J50M90j08m69o1M29K43m50
$$ -205 43 295 154 -232 -96 324 229 -151 -297 69 355 17 -357 -207 283 175 -294 -355 74 317 -133
7643a33l27L26M54r3n79R0N23J52m91l31M36M57k70n36M1N67J66n84l35M27M16
$$ -133 -460 -134 320 227 -352 -262 261 413 -78 -409 27 484 214 -322 -281 286 452 -132 -467 -40 376
7664C76l79m92J96N47J7n86r3M84L32m17l72K60M74o7n03m8M74K35m04l48L14
$$ 376 -3 -495 -299 248 265 -321 -414 70 402 -15 -387 -127 347 280 -223 -271 203 438 34 -314 0
7685@L60j50m81O5M06L7l56k29K77L19k48l26J96K87J2l19l4K76J34j58k36J48
$$ 0 360 210 -271 -206 200 237 -119 -348 -71 248 0 -326 -130 157 169 -150 -184 92 226 68 -168 -20
7707b0K09l1k12j2K14L7k34j03J85J3j39n4J23N1r9r8N0J80q5j01J11K03j16j89
$$ -20 189 158 -54 -66 148 185 -49 -152 33 46 -93 -147 -24 27 -72 -170 -120 60 -25 -126 -15 188 72 -117
7731a17J0L01P5l44o7K91J53j83k83J31L61j60l88m7L56J60l84k37K79L40k04
$$ -117 -107 194 269 -75 -142 149 302 119 -164 -33 328 168 -220 -267 89 249 -135 -372 -93 247 43
7752D3m14O1N23J04n56j37M30L78l26m89K35O05n8o08j49N85L02m91n60L44O35
$$ 43 -371 -310 213 317 -239 -376 54 432 106 -383 -148 457 399 -209 -358 227 529 38 -522 -178 457
7773D57j82o94p2O93K23n94m06M91N35k83o53Q8P35J12o01l53N52N90m62o58K07
$$ 457 275 -419 -491 202 425 -169 -575 -84 451 168 -485 -397 338 450 -151 -504 48 638 176 -482 -275
7794b75P53m2o75k66N60M78n36n27L08N38m9o24j47N94L95n22m73L71N57n9o92
$$ -275 478 436 -239 -505 55 533 -3 -530 -222 316 267 -357 -504 90 485 -37 -510 -139 418 359 -333
7815c33O9N53J85m33m28L69N00k60m55KM33J44m54l03L56L08k25l64J2M67Ol10
$$ -333 -264 289 474 41 -387 -18 482 222 -233 -231 202 346 -108 -411 -55 253 28 -336 -324 143 149 -161
7837a61p1K32K18j37l10J32K98L9k50j22K35J00j05k20J46Q5k5j41j35K18L5p9
$$ -161 -232 0 218 81 -229 -97 201 240 -10 -132 103 203 98 -122 24 109 84 -57 -192 26 61 -18
7859a8j08pJ41j6m1q9J70M3m3j4j4R1rOj09M5P5L0r7l3JJ4K4j21J1O1Pm5o0MJ23
$$ -18 -126 -133 8 -8 -49 -138 32 75 32 18 4 95 86 92 -17 28 103 133 36 3 4 18 42 -79 -68 -7 0 -45 -105 -101 22
7890B2K1r5J5N9O0m0o3QJ54m9q9N1P4j1j40J1PJ06j25q3N9N4k1j31M4J01L2j49
$$ 22 43 -52 -37 22 82 42 -21 -13 141 92 3 54 128 117 -23 -12 -5 101 -24 -107 -48 6 -15 -146 -102 -1 31 -118
7918a18J2J35L6j10n9J21J53j23j48M2K52j0j78j27K43J32k46j51Q4J83j8k51
$$ -118 -106 29 65 -45 -104 17 170 47 -101 -59 193 183 5 -122 121 253 7 -144 -60 123 105 -146
7940a46k7K65J08l17j61K43K61j35m23K15L37K3l86j64M27K48l79k98K24L75m0
$$ -146 -173 92 200 -117 -278 -35 226 91 -332 -117 220 243 -143 -307 120 368 -11 -309 -85 290 250
7961B50n14m7M51K30m50l29L17M62j92n06m8N76K35n42l92M38N30k84n77J59O31
$$ 250 -264 -311 140 370 -80 -409 -92 370 178 -328 -376 200 435 -107 -499 -61 469 185 -392 -233 398
7982C98O6o17l47O13L77m05n79K04P04k4o43k59O31L28m61n43L38O63j42o42j65
$$ 398 464 -153 -500 113 490 85 -494 -290 414 390 -253 -512 119 447 -14 -557 -219 444 302 -340 -505
8003e05O77L76n74n09M38O28j82o69q7O65K54o09l93M40N22k56o36N9O80P7n78
$$ -505 172 548 -26 -535 -97 531 349 -320 -407 258 512 -97 -490 -50 472 216 -420 -361 319 396 -182
8024a82l35M93M62l27n31J52N79J8m59k78M97L40l65m36J64N34Km91j45M28K84
$$ -182 -517 -24 438 111 -420 -268 311 329 -130 -408 89 429 64 -372 -208 326 328 -163 -308 120 404
8045D04m28k97K39L52j5m93j9L33J68k05k65J73L52j54l12qL02Q1l22j4R3K25
$$ 404 -24 -321 -82 270 255 -238 -257 76 244 39 -226 -53 299 145 -167 -175 127 208 -114 -128 -35 190
8067A90j29j53J6J56K7k13K4J01M5r7n8R6M0o2o9L1Q8r0M0K2M3j07N6K3P5j10
$$ 190 61 -92 -76 80 107 -106 -82 19 64 -33 -91 5 45 -17 -86 -55 33 -57 -17 5 48 -59 -3 20 95 -15
8093a5q4P4J58j21j43K0J56Q7j70r7J07J84j53j35N5J72K3k07j35K25J57j58k08
$$ -15 -99 -25 133 12 -131 -111 45 132 -38 -135 -28 156 3 -132 -77 95 118 -89 -224 1 158 0 -208
8116b08P6K91J4k80j59K89K32k70k05J46K85n4k86q1K99J13j66k64K22K30j03
$$ -208 -132 159 173 -107 -266 23 255 -15 -220 -74 211 157 -129 -210 89 202 36 -228 -6 224 121
8137A21l13N6K47Q7k24k02K16K01j34k44mL27M1k70r4J91J88j15k80R7K08K5j56
$$ 121 -192 -136 111 198 -26 -228 -12 189 55 -189 -193 134 175 -95 -189 2 190 75 -205 -108 100 125 -31
8160c1o8J01J75r7k26J36J73p8j98JJ78Mr6m4N2J7O4j51k2J25jk5j6N3k8O6j9
$$ -31 -99 2 177 80 -146 -10 163 85 -113 -112 66 70 -26 -70 -18 -1 63 -88 -110 15 14 -11 -27 26 -2 64 45
8187D5J4n9K0%
$$ 45 59 0 20 20
8191B0
$$ Imaginary data points
##PAGE= N=2
##DATA TABLE= (X++(I..I)), XYDATA
0@%%%%%%%%%%%%%qJ6j6J6j6J9k7L2m0M8n6O4p2Q8j02J17j35J52j70J94k19K46
$$ 0 0 0 0 0 0 0 0 0 0 0 0 0 0 -8 8 -8 8 -8 11 -16 16 -24 24 -32 32 -40 48 -54 63 -72 80 -90 104 -115 131
35A31k78L11l50L93m38M86n39N98o63P34q11Q94r83J084j197J319j452J600j766
$$ 131 -147 164 -186 207 -231 255 -284 314 -349 385 -426 468 -515 569 -628 691 -761 839 -927
54i27J952k163K400k672K991l365L817m371N067n977P223r034J1915j7223L0123
$$ -927 1025 -1138 1262 -1410 1581 -1784 2033 -2338 2729 -3248 3975 -5059 6856 -10367 19756
69A9756j17361j42597L02814J44212k12527k39380J52530K82702o0571k97120
$$ 19756 -97605 -240202 62612 206824 -5703 -245083 -92553 190149 129578 -167542
79a67542j3288K73199J20912k32661j87947J80916K39792j05132k51302J0711
$$ -167542 -180830 92369 213281 -19380 -207327 -26411 213381 108249 -143053 -132342
89a32342K54401O7973k38161j37390J84907J76030j17846k20433M1072K29938
$$ -132342 122059 190032 -48129 -185519 -612 175418 57572 -162861 -121789 108149
99A08149K0000k15007q0784J72881J40672j22726j75803P6742J91847j2101j74226
$$ 108149 128149 -86858 -167642 5239 145911 23185 -152618 -75876 115971 103870 -70356
110g0356m4733J60112R8403j27792j24465Q3941J36830l2075j45343j8406J33451
$$ -70356 -115089 45023 143426 15634 -108831 -24890 111940 79865 -65478 -83884 49567
121D9567M6576j13283p7415P2093R4584m2266j07072J2107R8301J6197p9097m0209
$$ 49567 96143 -17140 -94555 -22462 72122 29856 -77216 -65109 33192 49389 -29708 -69917
133f9917O5263O1359m2569n9894K6036O1560O88n4654j4630M8954K2804l6932
$$ -69917 -4654 56705 14136 -45758 -19722 41838 42526 -12128 -26758 22196 45000 8068
145H068k8702K0062K8510j4406l3643M022K4695l234k3256m914J7838N753j6545
$$ 8068 -20634 -572 27938 13532 -20111 -16089 8606 5372 -17884 -22798 -4960 793 -15752
158a5752m281J7384P431j2835n463J7193J2918j2730j1933J4633J8672j0055k1746
$$ -15752 -20033 -2649 4782 -8053 -13516 3677 16595 3865 -8068 6565 25237 15182 -6564
171f564O040K3280j737k7347j0032K3159J3388k4762k2481J4868K4465p974l0390
$$ -6564 -524 22756 21019 -6328 -16360 6799 20187 -4575 -27056 -12188 12277 4303 -26087
184b6087m15L2204Q843k5401j4490K1368K6640j1902k7239R095K8552L467k3382
$$ -26087 -26502 5702 14545 -10856 -25346 -3978 22662 10760 -16479 -7384 21168 24635 1253
197A253j3227K1538J8211j8674k0130O369J7366L58k2473q217J7244N860j1187
$$ 1253 -11974 9564 27775 9101 -11029 -4660 12706 13064 -9409 -17626 -382 5478 -5709
210e709r756K303J3192K1j0451K757N309K524L126l107Q93L058m61P312m41j1506
$$ -5709 -15465 -13162 30 51 -10400 -7643 -2334 190 3316 209 1102 4160 3699 11011 10570 -936
226i36J688Q432L382q274j6288Q024J8775j0388k0970k161K0532J4308k5966k2599
$$ -936 752 9184 12566 4292 -11996 -3972 14803 4415 -16555 -18716 1816 16124 -9842 -32441
240c2441K4490K6969j0765l2003j887M3427J4299m1270k0666L2577L6763j7864
$$ -32441 -7951 19018 8253 -23750 -25637 17790 32089 -9181 -29847 2730 39493 21629
252B1629n1339P731N5850M405n0650k6519M0997M5383l6288n8454K0378N8395
$$ 21629 -29710 -21979 33871 38276 -12374 -38893 2104 47487 11199 -47255 -26877 31518
264C1518K390o0431k7736N9602M4047m7759n3061K6714O6309n22p2699j6243O9960
$$ 31518 33908 -26523 -54259 5343 49390 1631 -51430 -24716 41593 41071 -31628 -47871 22089
277B2089L5086n1950n4996L3355P2165j6782p6989n180O8265K9973o0284n5591
$$ 22089 57175 5225 -49771 -16416 55749 38967 -38022 -43202 25063 55036 -5248 -60839
289f0839M7151O5867k8944p0116J056P1096K4643o7543m1056N4864N4245l0433
$$ -60839 -13688 52179 23235 -46881 -45825 25271 49914 -17629 -58685 -3821 50424 19991
301A9991o3928R190P0919R749o3968k5648M9782M3509l4376n6556J9015N7062
$$ 19991 -43937 -34747 36172 45921 -18047 -43695 6087 49596 15220 -41336 -22321 34741
313C4741l137n2445j7203M4371L1388l7065l8615K3408M0058o657m0777o746L9196
$$ 34741 31604 -20841 -38044 6327 37715 650 -37965 -14557 25501 18844 -21933 -28679 10517
326A0517J5260l0143j9364K0184K5354j0311k6642N350K4024J39j8556n725J4215
$$ 10517 25777 -4366 -23730 -3546 21808 11497 -15145 -9795 14229 14368 -4188 -9913 4302
339D302P511j2870o694J0329L961r353m725R292N310j2163p158J4506J0316j4490
$$ 4302 11813 -1057 -7751 2578 6539 -2814 -7539 1753 7063 -5100 -12258 2248 12564 -1926
353a926j5140J3760K2451r566k8002L395L2708O121l4766j7046L3035K8610k6983
$$ -1926 -17066 -3306 19145 9579 -18423 -15028 17680 23801 -10965 -28011 5024 33634 6651
366F651m0342J6641M9038l858n3511j3134N1811L1395m6249m8324L5116O0923
$$ 6651 -33691 -17050 31988 28130 -25381 -38515 13296 44691 -1558 -49882 -14766 46157
378D6157j6923o8321n689P1278K8481o6730m8762N2734O6818l1256q1192P138
$$ 46157 29234 -39087 -44776 26502 54983 -11747 -60509 -7775 59043 27787 -53405 -46267
390d6267Q7336J7726q1717m4065O7283O9168m8417q6583K4914R3033N414r0491
$$ -46267 41069 58795 -22922 -66987 296 69464 21047 -65536 -40622 52411 57825 -32666
402c2666l7255Q2561O3716o5685q1334L8417R2726o339r8931k3842R3963M9383
$$ -32666 -69921 12640 76356 10671 -70663 -32246 60480 54141 -44790 -68632 25331 74714
414G4714p5864p3500M9438R2915k2719j01271m850R5675L5998q1318o5282O4506
$$ 74714 -1150 -74650 -25212 67703 44984 -56287 -61137 34538 70536 -10782 -76064 -11558
426a1558Q5558m0372r2417R025R2785K4115q8177m9981P3851O6828m8660q0681
$$ -11558 74000 33628 -58789 -49764 43021 67136 -21041 -71022 2829 69657 20997 -59684
438e9684J8314Q8814O575q6639k9158P0322N0636m9892o9434L0789P7124r605
$$ -59684 -41370 47444 54019 -32620 -61778 8544 59180 9288 -60146 -29357 47767 38162
450C8162p2041j4639O3765L8844n3364n1897L8944N7114j6338n9046n944N9323
$$ 38162 -33879 -48518 15247 54091 727 -51170 -12226 44888 28550 -30496 -36440 22883
462B2883K1211n2476l1857L5738M0889j9751n0116O440M9237L934m1211j7852
$$ 22883 44094 -8382 -40239 -4501 36388 16637 -33479 -27039 22198 26132 -15079 -32931
474c2931L1922L0318k4466l4052J6844L2839k819k9698q108L0254J4923k4829
$$ -32931 -1009 29309 4843 -29209 -12365 20474 17655 -12043 -20151 10103 25026 197
486A97j6085J5258J9174o700k3628J879K1621n37j7573o372J2035J1179j1831
$$ 197 -15888 -630 18544 11844 -11784 -9905 11716 11179 -6394 -12766 -731 10448 -1383
499a383j3294R732J0877m386j0005m2J3265K744j2067j339R999N130n591q147
$$ -1383 -14677 -4945 5932 1546 -8459 -8501 4764 7508 -4559 -5898 4101 9231 3640 -4507
513d507N554R819n325q737J258P139K064r407n754P594M521n645o703O31P967
$$ -4507 1047 10866 5541 -3196 -1938 5201 7265 -2142 -7896 -302 4219 -1426 -8129 -7498 469
528D69J156p999k182O015N559j362o436O58Q084L356m321n312K551Q586N72q964
$$ 469 1625 -6374 -8556 -2541 3018 1656 -4780 -4122 3962 7318 2997 -2315 236 8822 9394 430
544D30m782O467P875n181j2735n73J2458M141j3597j1129J0462J5790n755j9448
$$ 430 -4352 2115 9990 4809 -7926 -8499 3959 8100 -5497 -16626 -6164 9626 3871 -15577
558a5577l71K2700R304k0067j5262J7465K4896r023k9433J562L2506R482l0522
$$ -15577 -15948 6752 16056 -4011 -19273 -1808 23088 14065 -15368 -13806 18700 28182 -2340
571b340k1980K4671L1394j8236l9822M594M0575Q637m2177k4931L6740L5939k6241
$$ -2340 -24320 351 31745 13509 -26313 -21719 18856 27493 -14684 -39615 -2875 33064 6823
584F823m4941J0896N2538P049n2636k0779M8179L7890l3808n1122K0066O1748
$$ 6823 -38118 -27222 25316 32365 -20271 -41050 7129 45019 11211 -39911 -19845 41903
596D1903k512o2187j7426N5467L7784m7338n6400L1644O3528j3004o8938j3368
$$ 41903 39391 -22796 -40222 15245 53029 5691 -50709 -19065 44463 31459 -37479 -50847
608e0847O7037L4463o0099n1286M3223O5128j8826p3578k275P7203K5301o5426
$$ -50847 16190 50653 -9446 -60732 -17509 47619 28793 -44785 -47060 30143 55444 -9982
620i982m4353M9943O5154l0014p5577R476P4919J4376o8806m1279N6291N7846
$$ -9982 -54335 -4392 60762 30748 -44829 -35353 39566 53942 -14864 -56143 148 57994
632E7994m2316o8857J6950P0776Q096p1529l0505O3672M6891m4826n8649K3880
$$ 57994 15678 -53179 -36229 34547 42643 -28886 -59391 4281 51172 6346 -52303 -28423
644b8423P0906j174o9892j5236O2150L6096m6361n3140L1579O2046j5202o2555
$$ -28423 42483 41309 -28583 -43819 18331 54427 8066 -45074 -13495 48551 33349 -29206
656b9206p366N5419K6179n0404m2087L6419M6608j9729n1192l10N2288J5307m5900
$$ -29206 -36572 18847 45026 -5378 -47465 -11046 35562 15833 -35359 -35669 16619 31926 -13974
669a3974k4240L4625L5359j8141m0484Q403M2972L323l5247j4161K7527K4541
$$ -13974 -38214 -3589 31770 13629 -26855 -18452 24520 27843 -7404 -21565 5962 30503
681C0503k1042k9636J1958K6296l176k5969q638K2369J1777j9535j4037J1121
$$ 30503 9461 -20175 -8217 18079 14903 -11066 -19704 2665 14442 -5093 -19130 -8009
693h009J5205l987j6216J703J5988J031r845j542Q637O139o595m317Q090K893
$$ -8009 7196 3209 -13007 -11304 4684 5715 -4130 -5672 2965 9104 2509 -1808 6282 9175
707I175o448k723M878L912p408p902P281P153q589j0831L935J3029j787j6940
$$ 9175 2727 4 4882 8794 1386 -6516 765 7918 -671 -11502 -7567 5462 3675 -13265
721a3265j781J7870O911j5021j1762J4344J9430q727k1112M607K4395M601k3882
$$ -13265 -15046 2824 9735 -5286 -17048 -2704 16726 7999 -13113 -8506 15889 20490 -3392
734c392j2119K1733J8745j7408k5627Q387K7926j617l1219r671K7507J7338k3671
$$ -3392 -15511 6222 24967 7559 -18068 -9681 18245 16628 -14591 -24262 3245 20583 -3088
747c088k5884J5596L1113n306l2483l944L3337J5476k7109k2362K0925L0811r958
$$ -3088 -28972 -13376 17737 12431 -20052 -23996 9341 24817 -2292 -24654 -3729 27082 17124
760A7124l3464N90L3315R455k9549k0051K1944K6225j6096l1471M564K9907M965
$$ 17124 -16340 -15750 17565 27020 -2529 -22580 -636 25589 9493 -21978 -17414 12493 17458
773A7458k9217j5292K4772K1064j7125k4152Q400K8189J944k6750o890K4309J4522
$$ 17458 -11759 -27051 -2279 18785 1660 -22492 -14092 14097 16041 -10709 -17599 6710 21232
786B1232j5868j9309J0233K3191m881k2360k245J7685Q471j6225j4872J1590J3973
$$ 21232 5364 -13945 -3712 19479 14598 -7762 -10007 7678 16149 -76 -14948 -3358 10615
799A0615p628j4439k44J3920M325j3591m886J0536O670m070p685L072J0310j616
$$ 10615 2987 -11452 -11696 2224 6549 -7042 -11928 -1392 5278 1208 -6477 -3405 6905 5289
813E289o658J707M387J797l923l296N019N22n500PJ972J47l483m211M850L376
$$ 5289 -1369 338 4725 6522 2599 -697 4322 4844 -656 -649 1323 1470 -2013 -6224 -1374 2002
829B002o980k867M546M980j530q427K271J1565n55q433j815Q204Q493p934j0240
$$ 2002 -4978 -7845 -3299 1681 151 -8276 -6005 5560 5005 -3428 -5243 2961 11454 3520 -6720
844f720P657J0129l259j1467l539J2653N570j3647q148P878R678l430j4404K92
$$ -6720 937 11066 7807 -3660 -7199 5454 11024 -2623 -10771 -2893 6785 3355 -11049 -10757
858a0757J5069J783j1484n801Q650J2083n754j2593M806J1731J364r388o039R698
$$ -10757 4312 6095 -5389 -11190 -2540 9543 3789 -8804 -3998 7733 9097 -291 -6330 3368
872C368Q256q110p946K656P402J031r481l591P026K397l998m176LN093M45l633
$$ 3368 11624 3514 -4432 -1776 5626 6657 -2824 -6415 611 3008 -990 -5166 -5163 -70 375 -3258
888c258J67N62J412K714r16j667m21K142M993j699o988J184P389K491p864q019
$$ -3258 -3091 -2529 -1117 1597 681 -986 -1407 735 5728 4029 -2959 -1775 5614 8105 241 -7778
904g778P320J0655o377j3629M80J4946M896j6809j0769J5136J5810r961k0637
$$ -7778 -458 10197 3820 -9809 -9329 5617 10513 -6296 -17065 -1929 13881 3920 -16717
917a6717L893K5138M126k5027j1220K3172K0603j7150k7937J0007L2856q6l4454
$$ -16717 -12824 12314 16440 -8587 -19807 3365 23968 6818 -21119 -11112 21744 21658 -12796
930a2796j1761L1944K2461k7082l2637J7138L8959n651m2821q420M1359K2064
$$ -12796 -24557 7387 29848 2766 -29871 -12733 26226 20575 -22246 -30666 10693 32757
942C2757l5446l4013K5949M3731j2362m7802k414M8690J8845m3813l2673L4618
$$ 32757 -2689 -36702 -10753 32978 20616 -27186 -29600 19090 37935 -5878 -38551 -3933
954c933M3707k0593n1430M089N3986J1746n1273k8020M1746M1654k9275n2515
$$ -3933 39774 19181 -32249 -28160 25826 37572 -13701 -41721 25 41679 12404 -40111
966d0111J3760N6847L315n4942k1351M8743L7924l8084m8843K3397N5148m437
$$ -40111 -26351 30496 33811 -21131 -42482 6261 44185 6101 -42742 -19345 35803 31366
978C1366n6644j3864N3750K9401m4005m1833K8785N1261j2115n6300m142N3363
$$ 31366 -25278 -39142 14608 44009 4 -41829 -13044 38217 26102 -30198 -34340 19023
990A9023J9693m4796l4844L3030M5851k0192n0258M777M8883J2521m4427k6911
$$ 19023 38716 -6080 -40924 -7894 37957 17765 -32493 -27716 21167 33688 -10739 -37650
1002c7650L7360L6269k5123m1180R953M4533M480m3826j5696L7194K5160k6229
$$ -37650 -290 35979 10856 -30324 -20371 24162 28642 -15184 -30880 6314 31474 5245
1014E245l3868J4968L8819n457l7786n358L2554J6718k6826k5260K0542K8305
$$ 5245 -28623 -13655 25164 19707 -18079 -23437 9117 25835 -991 -26251 -5709 22596
1026B2596j1192k8266K95K8012Q586k6217j3493K0355J7071j2091k1163N179K2957
$$ 22596 11404 -16862 -16567 11445 20031 -6186 -19679 676 17747 5656 -15507 -10328 12629
1039A2629p55k0659m060J6097J0030j2775j4062J0606J4491o420j3208O96J3463
$$ 12629 11874 -8785 -12845 3252 13282 507 -13555 -2949 11542 5122 -8086 -7390 6073
1052F073L533j3899m759J1537N665p711q710N193J0903m746j0792K968R238O95
$$ 6073 9606 -4293 -9052 2485 8150 439 -8271 -3078 7825 3079 -7713 -4745 4493 5188
1066E188r332l888J0600N002r244n540O451Q276l548j0804K646J1364o09r877
$$ 5188 -4144 -8032 2568 7570 -1674 -7214 -763 7513 3965 -6839 -4193 7171 6562 -3315
1080c315l363Q773P056q566r012O365R087k717j0449j624J1228L870j0031n919
$$ -3315 -6678 2095 9151 585 -8427 -2062 7025 4308 -6141 -7765 3463 7333 -2698 -8617
1094h617O952Q588l439j0340J423J0747J593q611m704O976P860m904q710K164
$$ -8617 -1665 6923 3484 -6856 -5433 5314 6907 -1704 -6408 568 8428 3524 -5186 -3022
1108c022P955J178p569m528N960N525m167o560M97O229K059n675l746L566M960
$$ -3022 4933 6111 -1458 -5986 -26 5499 1332 -5228 -4731 1498 3557 -2118 -5864 -2298 2662
1123B662n71m940j406M750L864k364m719L88N563K441m548m914K669O423m02p493
$$ 2662 2091 -2849 -4255 495 4359 1995 -2724 -2336 3227 5668 1120 -3794 -1125 5298 4896 -2597
1139b597l223O282N914n339q999K089R992J454j0248n811R558R836o666j1805
$$ -2597 -5820 462 6376 1037 -7962 -5873 4119 5573 -4675 -10486 -928 8908 2242 -9563
1153i563K907J4370L086j4297p343J3241J1812q814j5533L341J8165J732j8849
$$ -9563 -6656 7714 10800 -3497 -10840 2401 14213 5399 -10134 -6793 11372 13104 -5745
1166e745p867J5215J3309j1449j9420N923K1088p4k0595p859J8690J5498j5073
$$ -5745 -13612 1603 14912 3463 -15957 -10034 11054 10980 -9615 -17474 1216 16714 1641
1179A641j9548R821K2466n70k2814p066K2903J3809j8431j8616J1100K3089l559
$$ 1641 -17907 -8086 14380 13810 -9004 -16070 6833 20642 2211 -16405 -5305 17784 14225
1192A4225k6379l991K4211J0018j9876j8361J3357K3311q137k5121M27K3452Q713
$$ 14225 -12154 -16145 8066 18084 -1792 -20153 -6796 16515 8378 -16743 -16316 7136 15849
1205A5849k0502j5698J7592K0414j0225k0974K407K2674O074k1551j0709J7272
$$ 15849 -4653 -20351 -2759 17655 7430 -13544 -11137 11537 17611 -3940 -14649 2623
1217B623J4625j0511j9085L500K0342L98j9228o378J3925J1420j0745j5577P094
$$ 2623 17248 6737 -12348 -8848 11494 11892 -7336 -13714 211 11631 886 -14691 -7597
1230g597J5505k092j3262l325J2857Q168j0518q120P629R116j935r363o29R592
$$ -7597 7908 5816 -7446 -10771 2086 10254 -264 -8384 -755 8361 6426 -2937 -3566 6026
1244F026J350p395k486L647L211l147m782K487K173l074j061J427Q30j778k312
$$ 6026 7376 -19 -2505 1142 4353 1206 -3576 -1089 1084 -1990 -3051 -1624 -794 -2572 -4884
1259d884M109L473n018k872M896N675k131p993J780J0991L40j0576l932R691Q500
$$ -4884 -775 2698 -2320 -5192 -296 5379 3248 -4745 -2965 8026 8366 -2210 -6142 3549 12049
1274A2049r434j2911O551J3868l055j6329l927J6683Q613j6289j3471J2094J8160
$$ 12049 2615 -10296 -3745 10123 7068 -9261 -13188 3495 12108 -4181 -17652 -5558 12602
1287A2602n792k1398N02K3851O842k1059j3174J8048K1083j2094k5394N375K7139
$$ 12602 6810 -14588 -14086 9765 16607 -4452 -17626 422 21505 9411 -15983 -10608 16531
1300A6531L264k6923j3002K3319J9988j8915k6545R543K9278p29l0920r110K8441
$$ 16531 19795 -7128 -20130 3189 23177 4262 -22283 -12740 16538 15809 -15111 -24221 4220
1313D220J7758k2498k4669J5349L0687n306l1624l558L1104J4135k6170k1810
$$ 4220 21978 -520 -25189 -9840 20847 15541 -16083 -19641 11463 25598 -572 -22382
1325b2382J9840K8034j1285l1675J019L1334P735k9451j7568K2788K3729j6215
$$ -22382 -2542 25492 14207 -17468 -16449 14885 22620 -6831 -24399 -1611 22118 5903
1337E903k9053O993L0247K327k8790j1211K5798J9286j8916k3255J1892K7223
$$ 5903 -23150 -16157 14090 16417 -12373 -23584 2214 21500 2584 -20671 -8779 18444
1349A8444k166k7148n178K5415J2215k0397j8401J3426K2124p654k4348k3K1949
$$ 18444 16278 -10870 -16048 9367 21582 1185 -17216 -3790 18334 10680 -13668 -13691 8258
1362H258N994j9752j3136J5606J6639j0913j8080M791J9020K166j7803n838J6660
$$ 8258 14252 -5500 -18636 -3030 13609 2696 -15384 -10593 8427 10593 -7210 -13048 3612
1375C612R925j1403j2149P437J5326l604j5520K76J3262L466j1853q233R530R202
$$ 3612 13537 2134 -10015 -2578 12748 9144 -6376 -6100 7162 10628 -1225 -9458 72 9274
1389I274q393j0345L752J0215k90j1360k005J1089L682q151n236O383Q916m203
$$ 9274 881 -9464 -5712 4503 4213 -7147 -9152 1937 5619 -2532 -7768 -1385 7531 3328
1403C328r079L650R033q2q028l222Q350M934q294o093M902O499k651r406m1R224
$$ 3328 -5751 -2101 6932 6850 -1178 -4400 3950 8884 590 -5503 -601 5898 3247 -6159 -6200 3024
1419C024N80q112l535N959O965m755q104M008Q312p4o728k950P867N672o409n725
$$ 3024 3604 -4508 -8043 -2084 4881 126 -7978 -3970 4342 4268 -2460 -5410 2457 8129 1720 -4005
1435d005L588O659R0q316k597P329L042n378n843J542P211l38p936j759N546M593
$$ -4005 -417 6242 6332 -1984 -4581 2748 5790 412 -5431 -3889 3322 2984 -4952 -6711 -1165 3428
1451C428l011o863J900P919R05n613l444M814P251k844p738O86P212L331o546
$$ 3428 417 -6446 -4546 3373 4278 -1335 -4779 35 7286 4442 -3296 -2610 4602 7933 1387
1466A387p313M847Q260k712r383k419Q889N927q816r003N525J0841q14j2322l400
$$ 1387 -5926 -1079 7181 4469 -4914 -7333 1556 7483 -1333 -10336 -4811 6030 5216 -7106 -10506
1481a0506J2943P880r904j0877O370J5023j066j6237l391J5303Q913j2501j4308
$$ -10506 2437 10317 413 -10464 -4094 10929 9863 -6374 -9765 5538 14451 1950 -12358
1494a2358P972J7508l450j9368l700J7939R753j5951j5893J1254J9538n048k1442
$$ -12358 -4386 13122 9672 -9696 -13396 4543 14296 -1655 -17548 -6294 13244 8196 -13246
1507a3246j987K2005R594j8996j5287J4851K1016p754k3536N29K4388P398k2411
$$ -13246 -15233 6772 16366 -2630 -17917 -3066 17950 10196 -13340 -12811 11577 18975 -3436
1520c436j4791J7623K0398j1679k4851L082K5724M654k4864j2697K0406J9273
$$ -3436 -18227 -604 19794 8115 -16736 -13654 12070 16724 -8140 -20837 -431 18842
1532A8842j4067k4130O742K6640J866k5349r710K2361J7673j6554k2541J0004
$$ 18842 4775 -19355 -12613 14027 15893 -9456 -19166 3195 20868 4314 -18227 -8223
1544h223K5284j538k5410p185K3371J4000j9391j9590J2076K2711m614k4853l059
$$ -8223 17061 15523 -9887 -17072 6299 20299 908 -18682 -6606 16105 11491 -13362 -16421
1557a6421K3580R305j9625j5434J3939K0414p777k2075J909K1394N553j8410j1606
$$ -16421 7159 16464 -3161 -18595 -4656 15758 7981 -14094 -12185 9209 14762 -3648 -15254
1570a5254J5371J5870j0479j7378L954J7835K194j7574p158J4872R881j0517j3093
$$ -15254 117 15987 5508 -11870 -7916 9919 12113 -5461 -12619 2253 12134 1617 -11476
1583a1476N160J4944j596j4759j962J2343O041r312r161P448J0854m571r903R64
$$ -11476 -6316 8628 7032 -7727 -9689 2654 8695 -617 -9778 -2330 8524 3953 -5950 -4986
1597d986R568K766r279m234Q054M646n382n862K718P042k106p289J265N715R7
$$ -4986 4582 7348 -1931 -6165 1889 6535 1153 -4709 -1991 5051 2945 -4344 -3079 2636 2733
1612B733n046k087N533K814n769k405M746L334l060n195K949O671k778o410J267
$$ 2733 -2313 -4400 1133 3947 -1822 -4227 519 3853 793 -4402 -1453 5218 2440 -3970 -2703
1627b703O404J612p331l888P649M813o296o487L435Q719j396j0443l34R865L091
$$ -2703 3701 5313 -2018 -5906 1743 6556 260 -6227 -2792 5927 4531 -5912 -6246 3619 6710
1642F710q309o837P083R721n502j0531K359J0886J984j1151n499J0680P842q176
$$ 6710 -1599 -8436 -1353 8368 2866 -7665 -5306 5580 7564 -3587 -9086 1594 9436 1260
1656A260r952M204J2179o84j3154k355J1949N862r506r552O842J1984l921j2436
$$ 1260 -8692 -4488 7691 7007 -6147 -8502 3447 9309 -197 -9749 -2907 9077 5156 -7280
1670g280k3J1822M439j0823p764Q819R757n481j0818J327J1544K079j0938m757
$$ -7280 -7303 4519 8958 -1865 -9629 -810 8947 3466 -7352 -6025 5519 7598 -3340 -8097
1684h097Q784P225n892r132L103R942m63r212k304P904M827o202o414M332P005
$$ -8097 687 7912 2020 -7112 -4009 5933 5470 -3742 -6046 1858 6685 483 -5931 -1599 5406
1699E406j981p008l71O444J969n553l170L956L878k770m207J393M107l94l636
$$ 5406 3425 -3583 -3954 2490 4459 -1094 -4264 -308 3570 800 -3407 -2014 2093 1699 -1937
1714a937m00L239Q79k575p83K185J242j881j323K042J362k057j445J656J974j651
$$ -1937 -2337 902 1781 -794 -1577 608 1850 -31 -1354 688 2050 -7 -1452 204 2178 527
1730E27l003J475L364j245l821j30M153J480m619k600M418L746l088m842J661
$$ 527 -2476 -1001 2363 1118 -2703 -2833 1320 2800 -1819 -4419 -1 3745 657 -4185 -2524
1745b524O475lo589j293N969L730m771n981L610P127k117p215r64O792L570o803
$$ -2524 3951 3948 -2641 -3934 2035 5765 994 -4987 -1377 5750 3633 -3582 -4546 2246 5816 -987
1761i87n566N145O320k520p448l81Q210K469p286l849N234O144k534p467J179
$$ -987 -6553 -1408 4912 2392 -5056 -5437 2773 5242 -2044 -5893 -659 5485 2951 -4516 -3337
1776c337P771P84o031l457M582N601l641o348J598N263Q23m985l554M267L884
$$ -3337 4434 5218 -813 -4270 312 5913 2272 -4076 -2478 2785 3608 -1377 -4931 -664 3220
1791C220k871l844K1L942K151l603k356K347K762O58k891k051L101K670j014k852
$$ 3220 349 -3495 -3474 468 2619 -984 -3340 -993 1769 2427 -464 -2515 586 3256 2242 -610
1807f10j622L529L091l237m009O90M310J743n634m011M710M999k431o742n89Q314
$$ -610 -2232 1297 4388 1151 -2858 -2168 2142 3885 -1749 -5760 -1050 3949 1518 -5224 -5813 2501
1823B501L191p848m938N854Q347k556j0561L68J1559L256r999p429P989J1353
$$ 2501 5692 -2156 -7094 -1240 7107 4551 -6010 -5642 5917 9173 -826 -8255 -266 11087
1837A1087n788j3814J568J3624L335j3778r098J1921J2557q618j5339L011J7273
$$ 11087 5299 -8515 -6947 6677 10012 -3766 -12864 -943 11614 2996 -12343 -9332 7941
1850G941L014j7437p857J5656J3061j0570j6923N561K0232L46j9900o399J7535
$$ 7941 10955 -6482 -14339 1317 14378 3808 -13115 -7554 12678 13024 -6876 -13275 4260
1863D260J2563j4061j8029Q868K0286k898k1390m845J9925J1053j7455j6384J2138
$$ 4260 16823 2762 -15267 -6399 13887 10989 -10401 -15246 4679 15732 -1723 -18107 -5969
1876e969J9959n324k1914j336K2369Q278j9086j3615J4849J8991q639k1561K362
$$ -5969 13990 8666 -13248 -14584 7785 16063 -3023 -16638 -1789 17202 8563 -12998 -10636
1889a0636K2114M474k0474j1182J6636J6004j2074j9816N208K0656R07k0568p457
$$ -10636 11478 15952 -4522 -15704 932 16936 4862 -14954 -9746 10910 11817 -8751 -16208
1902a6208J7786J2813j3518j6572Q400J9210j987j8948l339J7953R192j4416j2947
$$ -16208 1578 14391 873 -15699 -7299 11911 9924 -9024 -12363 5590 14782 366 -12581
1915a2581J0540J5742n235j7111j53J6399M409j4961r090J1047J1798p741j4211
$$ -12581 -2041 13701 8466 -8645 -8798 7601 12010 -2951 -12041 -994 10804 3063 -11148
1928a1148L409J4116P08j3137m715J1639Q204q844r560O243J1113j846j0986r52
$$ -11148 -7739 6377 7085 -6052 -10767 872 9076 232 -9328 -3085 8028 6182 -4804 -5756
1942e756J0989L569r219n752O537P528m746r329K231Q628l75q360k907P274M646
$$ -5756 5233 8802 -417 -6169 368 7896 3150 -6179 -3948 4680 4305 -4055 -6962 312 4958
1957D958o656n730N001O614k260p080P93Q235J188o959k181O049M665m668o164
$$ 4958 -1698 -7428 -2427 4187 1927 -5153 -4360 3875 5063 -1896 -4077 1972 6637 1969 -4195
1972d195L891O470k461o728n77O572K127p294l824N630M439l892o318J787P768
$$ -4195 -304 6166 3705 -3023 -3600 2972 5099 -2195 -6019 -389 4050 158 -6160 -4373 3395
1987C395m46p166j051O381M196m809n671M377O821j984o415o22O607L116o642
$$ 3395 2949 -4217 -5268 1113 5309 500 -5171 -794 6027 4043 -2372 -2994 3613 6729 87
2002H7m609M705M953k604o798k97O915J199o349l129M140N057k480o085J450O262
$$ 87 -4522 183 5136 2532 -4266 -4563 2352 3551 -2798 -5927 -1787 3270 790 -5295 -3845 2417
2018B417R49m554k765M102N014k764m676J056M432J421m275l392L414L361k058
$$ 2417 3366 -1188 -3953 149 5163 2399 -2277 -1221 3211 4632 357 -3035 379 3740 1682
2033A682m094r66L869K095l820l108J882L507M64m153j551M085K989j977l580
$$ 1682 -2412 -3378 491 2586 -1234 -4342 -2460 1047 1511 -2642 -4193 -108 2881 904 -2676
2048b676N19N039J552m355k609L180M268j375n830n44N648J877m976m681K932
$$ -2676 -2157 2882 4434 79 -2530 650 4918 3543 -2287 -2831 2817 4694 -282 -4963 -2031
2063b031O134j750p148q63O628L557n675n881M443P847j605p963j056Q582M518
$$ -2031 4103 2353 -4795 -5658 970 4527 -1148 -7029 -2586 5261 3656 -4307 -5363 3219 7737
2078G737p245o599N266Q669k409r865j129R650L898q984p174O156R049l576j0879
$$ 7737 492 -6107 -841 7828 5419 -4446 -5575 4075 7973 -1011 -8185 -2029 7020 3444 -7435
2093g435p4J0827L477r761o619P964R460m533j0687J583J1572K497j0511n462
$$ -7435 -7509 3318 6795 -2966 -9585 -1621 7839 3306 -7381 -5798 5774 8271 -2240 -7702
2107g702Q802Q476n944j0554K712J0904N78j0719m522Q920O895p120r136L860
$$ -7702 1100 9576 3632 -6922 -4210 6694 7272 -3447 -7969 951 7846 726 -8410 -4550
2121d550R740l98r864k724R236N297o854o743M476Q561j517q548n49Q010L008
$$ -4550 5190 4792 -5072 -7796 1440 6737 -117 -6860 -2384 6177 4660 -3888 -4437 3573 6581
2136F581o213n167M620O205l216o604P36N704J135n684k883M604L096l183l444
$$ 6581 368 -4799 -179 6026 2810 -3794 -3058 2646 3781 -1903 -4786 -182 2914 -269 -3713
2151c713J498L809k62l662L71L066M61j717p67J852J137j973l46J892j65j647
$$ -3713 -2215 1594 1332 -2330 -1959 1107 1568 -149 -916 936 2073 100 -246 1646 1481 -166
2167a66o72J773J257k927k038K894K160k472l503J068N042l27n806n09N538K910
$$ -166 -838 935 2192 -735 -2773 121 2281 -191 -3694 -2626 2416 2089 -3717 -4226 1312 4222
2183D222m582n039M368O997k895p272L67P889K761q203n226P330O845n171r038
$$ 4222 -360 -5399 -1031 5966 3071 -4201 -3834 4055 6816 -1387 -6613 717 7562 2391 -6647
2198f647J781J0593O49j1194l586R577O929p410j0199N333J2078k017j2144k005
$$ -6647 -4866 5727 6376 -4818 -8404 1173 8102 692 -9507 -4174 7904 5887 -6257 -8262
2212h262J1911O472j0571r428Q222J1495m037j2998l90J3720M085j2879p667R701
$$ -8262 3649 10121 -450 -9878 -1656 9839 5802 -7196 -7586 6134 10219 -2660 -10327 -626
2226f26J0756o224j3552K433J4157J347j3120n750J1294R722q754j1984N388J3153
$$ -626 10130 3906 -9646 -7213 6944 8291 -4829 -10579 715 10437 1683 -10301 -4913 8240
2240H240q18j3069l409J2604O876j0482r400P076J1426l367j2809k12J2332L378
$$ 8240 7422 -5647 -9056 3548 10424 -58 -9458 -2382 9044 5677 -7132 -7344 4988 8366
2254H366j0709o812Q338R331n854j0680K746J0788Q41j0215l894R236O368p208
$$ 8366 -2343 -9155 -817 8514 2660 -8020 -5274 5514 6355 -3860 -7754 1482 7850 642
2268F42p728M512Q905j550r395q49Q843L016p458n134N751O661m027p493J857
$$ 642 -7086 -2574 6331 4781 -4614 -5463 3380 6396 -1062 -6196 -445 6216 2189 -5304 -3447
2283c447P570K49p385k148O619L745n453m979M079N907k434o360Q14O446R46o198
$$ -3447 4123 4372 -3013 -5161 1458 5203 -250 -5229 -1150 4757 2323 -4037 -3223 3223 4169 -2029
2299b029k440N550L726m474m924L078N887j698o367J28O152J618n632l412M906
$$ -2029 -4469 1081 4807 333 -4591 -1513 4374 2676 -3691 -3563 2589 4207 -1425 -4837 69
2314F9M828l788n610J950O298po542j824O187L271m927m879L223O273j645o836
$$ 69 4897 1109 -4501 -2551 3747 3740 -2802 -4626 1561 4832 -95 -4974 -1751 4522 2877 -3959
2330c959p7O349K270n480m364M498N780k945o058O38O291J809o075l556N045M611
$$ -3959 -4036 2313 4583 -897 -5261 -763 5017 2072 -3986 -3348 2943 4752 -1323 -4879 166 4777
2346D777k976n760O16O511J036o081k729M395M550k636n923R76O118Q48n062k984
$$ 4777 1801 -3959 -3343 3168 4204 -1877 -4606 -211 4339 1703 -4220 -3244 2874 3722 -1340 -4324
2362d324L829N067k555n532Q20N158J821m591l977L816M846j984n241o53N198
$$ -4324 -495 4572 2017 -3515 -2695 2463 4284 -307 -4284 -468 4378 2394 -2847 -3500 1698
2377A698K854n038m311L178N151o08o046j882O225L542m689n053K364O883J30
$$ 1698 4552 -486 -4797 -1619 3532 2924 -3122 -5004 1221 4763 74 -4979 -2615 4268 4398
2392D398p435k073O667M505m524p020K494Q453l33q354k793O980N970n783q424
$$ 4398 -3037 -5110 1557 6062 1538 -5482 -2988 5465 5132 -3222 -6015 965 6935 1152 -7272
2407g272L427R063k13r081l697Q741O704p019q509M088J0124Jj0691l287J0323
$$ -7272 -3845 5218 5005 -4076 -7773 968 7672 653 -7856 -3768 6356 6357 -4334 -7621 2702
2422B702O343p872q963M579J1311j404j2121k298J0840N941r028r639O127J1613
$$ 2702 9045 1173 -7790 -3211 8100 6696 -5425 -7723 3117 9058 30 -9609 -3482 8131
2436H131k889j2275j403J1810N697j0405q796P864J1126l734j2182k52J2777M293
$$ 8131 5242 -7033 -8436 3374 9071 -1334 -10130 -2266 8860 5126 -7056 -7308 5469 9762
2450I762j1365p489Q667J0298n194j2391J388J2453K156j1578o141R293R010o778
$$ 9762 -1603 -9092 -425 9873 4679 -7712 -6324 6129 8285 -3293 -9434 -141 8869 2091
2464B091j1115L254J1673N87j1261m046R983P308p515q960M741J0462j130j0507
$$ 2091 -9024 -5770 5903 6490 -4771 -8817 1166 8474 959 -8001 -3260 7202 6072 -4435
2478d435j858R684M705p872p048N459Q289l053r090l9Q512K263p819m623O009
$$ -4435 -6293 3391 8096 224 -6824 -1365 6924 3871 -5219 -5258 3254 5517 -2302 -6925 -916
2493i16O106m069o989K118P471K13o735j786O190L789m830m690L758N363j953
$$ -916 5190 1121 -5868 -3750 3721 3934 -2801 -4587 1603 5392 562 -4128 -370 4993 3040
2508C040n617K72N606O65n407k154M211K827l604m116K566M312j804m325O00M493
$$ 3040 -2577 -2305 3301 3966 -1441 -3595 616 3443 -161 -4277 -1711 2601 797 -3528 -2928 1565
2524A565Q24m385j412M458K450l345l001K726M323j772m998J058M854K07m856
$$ 1565 2389 -1996 -3408 1050 3500 155 -2846 -120 4203 2431 -2567 -1509 3345 3552 -1304
2539a304k293M608L264m597m368K820N006j156o233l65O463J724n511l264M509
$$ -1304 -3597 1011 4275 -322 -4690 -1870 3136 1980 -4253 -4618 1845 3569 -1942 -5206 -697
2554f97N506l015o313K110O707M16o228k711O037M368n212n413L055N926r36p247
$$ -697 4809 1794 -4519 -2409 4298 4714 -1514 -4225 1812 6180 968 -4445 -1390 4536 3600 -3647
2570c647j145O774K297n795m266L820O003k449o582J109O491J372n312l279N057
$$ -3647 -4792 1982 4279 -1516 -5782 -1962 4041 1592 -4990 -3881 2610 3982 -1330 -4609 448
2585D48M936l528n102J754N513M65n815k089N120K635l854m121J779M670j037
$$ 448 5384 1856 -3246 -1492 4021 4486 -1329 -3418 1702 4337 483 -3638 -1859 2811 1774
2600A774n005k51M019J462l118k703K690L365j649k671P58K879P13k484r53K537
$$ 1774 -3231 -3482 537 1999 -1119 -3822 -1132 2233 584 -2087 -1329 1550 2263 -221 -1174 1363
2616A363R48j511j194O69J388q28j603N00Q28p27r21mR85l14j432M62J537k89
$$ 1363 2311 800 -394 275 1663 835 -768 -268 560 -167 -1088 -1092 -107 -421 -1853 -1391 146 -143
2634a43j239j06J903J140j856j095K151J788j143k366O55L087k31l353q62K837
$$ -143 -1382 -1488 415 1555 -301 -1396 755 2543 1400 -966 -311 2776 2545 -808 -1670 1167
2650A167J690k811l182J873L436j162m056l55M119J764l808k743L205M004j563
$$ 1167 2857 46 -3136 -1263 2173 1011 -3045 -3400 719 2483 -1325 -4068 -863 3141 1578
2665A578m380M90N010J229m354k434L658L816k558m653Q59M711M63m862k312L759
$$ 1578 -2802 -2312 2698 3927 -427 -2861 797 4613 2055 -2598 -1739 2972 3435 -1427 -3739 20
2681B0L136k880m200J134M527J87m333j456L651L011k326l474J507M057K10l376
$$ 20 3156 276 -3924 -2790 1737 1924 -2409 -3865 -214 2797 471 -3003 -1496 2561 2771 -605
2697f05j373K901K586k038l030N81K896N42k923j958J944K161j119k647n92K515
$$ -605 -1978 923 3509 1471 -1559 -978 1918 2460 -463 -2421 -477 1684 565 -2082 -2674 -159
2713a59J642k109k047J015K716P23k686j496K586K589r41l085l70L704J632l225
$$ -159 1483 -626 -2673 -1658 1058 1781 -905 -2401 185 2774 1833 -1252 -1622 2082 3714 489
2729D89k847J850L648m72m879j223M451K363l561m384J977N718o00o036j233N634
$$ 489 -2358 -508 3140 2668 -2211 -3434 1017 3380 -181 -4565 -2588 3130 2530 -3506 -4739 895
2745H95L795m488n632L571P007j117p072j464P211M300o600o206M579P338j858
$$ 895 4690 202 -5430 -1859 5148 4031 -3041 -4505 2706 7006 406 -5800 -1221 6117 4259
2760D259q811j265Q788L523p901o188N388Q346k859r849K95R829L006q380o038
$$ 4259 -4552 -5817 2971 6494 -1407 -7595 -2207 6139 3280 -6569 -6274 3555 6561 -1819 -7857
2775g857O954Q899m536r810J632J0078K301r727n560Q465P658o037r471K310J0423
$$ -7857 -903 7996 3460 -6350 -4718 5360 7661 -2066 -7626 839 8497 2460 -7011 -4701 5722
2790E722P69j0884l699R144O371o791q912M120J0467j128j0241j849R392N483
$$ 5722 6491 -4393 -8092 1052 7423 632 -8280 -4160 6307 5179 -5062 -6911 2481 7964
2804G964p716p715N815R058k687r491o84R489L422q648n779O346P272l842q861
$$ 7964 248 -7467 -1652 7406 4719 -4772 -5456 4033 7455 -1193 -6972 -626 6646 2804 -6057
2819f057J099R073J162q321l668O787N963n019p268L234P840n57p471j771P143
$$ -6057 -4958 4115 5277 -3044 -6712 75 6038 1019 -6249 -3015 4825 4268 -3203 -4974 2169
2834B169L793n870n065M070O089k177o691J14O610J272o041l009M652M359l577
$$ 2169 5962 92 -4973 -903 5186 3009 -3682 -3568 3042 4314 -1727 -4736 -84 4275 698
2849F98n303K173N471n46n386r81N267K459m473l282L520M395k171m947J018N206
$$ 698 -4605 -2432 3039 2493 -2893 -3874 1393 3852 -621 -3903 -383 4012 1841 -3106 -2088 3118
2865C118L23n042j802M511K932l856m058K673M655j500n215M3N158J420m828k713
$$ 3118 3441 -1601 -3403 1108 4040 184 -3874 -1201 3454 1954 -3261 -3218 1940 3360 -1468 -4181
2881d181M095M064k994m709J685N287L8n310j562N072K979m177m141K711N004
$$ -4181 -86 3978 984 -3725 -2040 3247 3285 -2025 -3587 1485 4464 287 -3854 -1143 3861
2896C861j248n616l39N347J805m623l597L608M789k379n273O69N296J292n023
$$ 3861 2613 -3003 -3342 2005 3810 -813 -4410 -802 3987 1608 -3665 -2996 2300 3592 -1431
2911a431k815M342L963k787m710J009N289O83n202k008M246L179k790m457J321
$$ -1431 -4246 96 4059 1272 -3438 -2429 2860 3543 -1659 -3667 579 3758 968 -3489 -2168
2926b168N035o6m577j586L589L145k653m077J532M159J04l710j865L303K999k334
$$ -2168 2867 2801 -1776 -3362 227 3372 719 -3358 -1826 2333 2437 -1273 -3138 165 3164 830
2942H30l396Q51L502Q68l500k045K882K644j405l210k13L634J263l166k104J880
$$ 830 -2566 -1715 1787 2655 -845 -2890 -8 2636 1231 -1979 -2192 1442 2705 -461 -2565 -685
2958f85L052m78l647o94L532J645k440k932J147L943j22m004j158L284K718k344
$$ -685 2367 1889 -1758 -2452 1080 2725 285 -2647 -1500 2443 2321 -1683 -2841 443 3161 817
2974H17m147J391M523J34m232k149L839L854l057m601J507M968P52n175k655M840
$$ 817 -3330 -1939 2584 2718 -1514 -3663 176 4030 973 -3628 -2121 2847 3599 -1576 -4231 609
2990F09L934l429n087J398N850N26o180k209N176L915l683n529J960O519k39o348
$$ 609 4543 1114 -3973 -2575 3275 3801 -2379 -4588 588 4503 820 -4709 -2749 3770 3531 -2817
3006b817j746N503M032m366n501K992O252q28o325j510O120L490n208m889L416
$$ -2817 -4563 940 4972 606 -4895 -1903 4349 3521 -2804 -4314 1806 5296 88 -4801 -1385
3021a385N681j284o465p05O273K282n200m056L690N355k099n810M48N636J412
$$ -1385 4296 3012 -3453 -4158 2115 4397 -803 -4859 -1169 4186 2087 -3723 -3275 2361 3773
3036C773m812l022M058M167k627m598J143M648M48m476j737L744K559k821l291
$$ 3773 -1039 -4061 -3 4164 1537 -3061 -1918 2730 3178 -1298 -3035 709 3268 447 -2844
3051b844J554L413o16l386l88K872J143k404j585J796J928j031j826O82J807r2
$$ -2844 -1290 2123 1507 -1879 -2267 605 1748 -656 -2241 -445 1483 452 -1374 -692 1115 1023
3067A023j518M8J279K40j211j85J107Q4j206l04J123L50j493q68J518J187j635
$$ 1023 -495 -447 832 1072 -139 -324 783 867 -339 -643 480 830 -663 -1531 -13 1174 -461
3084d61j684J271K285o09k810J32L297R23l036j847K879L148k202l906J318M298
$$ -461 -2145 -874 1411 802 -2008 -1876 1421 2344 -692 -2539 340 3488 1286 -2620 -1302 2996
3100B996J64m638j849M492K862l891m250K403N050q99n922o24N737K242m810l976
$$ 2996 3160 -1478 -3327 1165 4027 136 -4114 -1711 3339 2440 -3482 -4106 1631 3873 -937 -4913
3116d913L861N654k465o147Q69O389J521n943l442N311M963l967n967J712O546
$$ -4913 -1052 4602 2137 -4010 -3141 3248 4769 -1174 -4616 695 5658 1691 -4276 -2564 3982
3131C982L52p095k320O139L719m703n511K802O723j285o837o57O426K989n279
$$ 3982 4334 -2761 -5081 1058 4777 74 -5437 -2635 4088 2803 -4034 -4691 1735 4724 -555
3146e55m653M433N929k597o056M94O305J648o124l141N036M059l479n311J461
$$ -555 -5208 -775 5154 2557 -3499 -3005 3300 4948 -1176 -4317 719 4778 1299 -4012 -2551
3161b551N865l91n914j186M753K929l999m079L186M733j798m458K88M734J489
$$ -2551 3314 2923 -2991 -4177 576 3505 -494 -4573 -1387 3346 1548 -2910 -2622 2112 3601
3176C601m471k094L923K914k647l636J392M255p33m382m40L664J422l499k803
$$ 3601 -870 -2964 959 3873 1226 -2410 -1018 3237 2504 -1878 -2318 1346 2768 -731 -3534
3191c534K943L116k270l435J075L783J82l991o89L970J688k980k471K513L612
$$ -3534 -591 2525 255 -3180 -2105 1678 1860 -2131 -2820 1150 2838 -142 -2613 -100 3512
3206C512j742l896Q94L874L29l965j784L563K528l320l441J906L887q14m516m71
$$ 3512 1770 -2126 -1232 2642 2971 -994 -2778 785 3313 -7 -3448 -1542 2345 1531 -2985 -3456
3222c456M487J601l771k661L043M077j825m485Q82M735J012m366k321L842L502
$$ -3456 1031 2632 -1139 -3800 -757 3320 1495 -2990 -2108 2627 3639 -727 -3048 794 4296
3237D296k829m355J267M608K4m932j761M180K822l331m016J779M700m53m642j042
$$ 4296 1467 -2888 -1621 2987 3011 -1921 -3682 498 3320 -11 -4027 -2248 2452 1999 -2643 -3685
3253c685M417K652l306l471K279M450n31m444p51M134K219l283l335J834L962
$$ -3685 732 3384 78 -3393 -1114 3336 2805 -1639 -2390 1744 3963 680 -2655 -821 3141
3268C141q17m271r66L632K056l025l314J690L723l70l641j059L375K558k433l012
$$ 3141 2324 -1947 -2913 719 2775 -250 -3564 -1874 1849 1479 -2162 -3221 154 2712 279 -2733
3284b733J458L640L26l502j538L236K659k078l448M73L767O91l930k136K759L019
$$ -2733 -1275 2365 2691 -811 -2349 887 3546 1468 -1980 -1507 2260 2951 -979 -3115 -356 2663
3300B663j728m108J58M315J138l799k545K882M079j348m660K03M838J736l799
$$ 2663 935 -3173 -3015 1300 2438 -1361 -3906 -1024 3055 1707 -2953 -2750 2088 3824 25
3315B5l463L236M614j758n120k22M964K144m899l923L563M738j941n695l55N915
$$ 25 -3438 -202 4412 2654 -2466 -2688 2276 4420 -479 -4402 -839 3899 1958 -3737 -4092 1823
3331A823K114n517l652M096N382k053o298M37O735J729n715l641M602N706l148
$$ 1823 3937 -1580 -5232 -1136 4246 2193 -4105 -3668 3067 4796 -919 -4560 42 5748 2600
3346B600o592J080O618J200o396l718N351N031m104o178J574O708O92o970k556
$$ 2600 -3992 -2912 3706 4906 -1490 -5208 143 5174 1070 -5108 -3534 3174 3866 -3104 -5660
3361e660O113M313m176n697K470O936l96o736j317O078L541m816n250L506N997
$$ -5660 453 4766 590 -5107 -2637 4299 3903 -2833 -4150 1928 5469 653 -4597 -1091 4906
3376D906j785o349n91N964K305n513l969M062M849k530n524O38N889J001n364
$$ 4906 3121 -3228 -3819 2145 4450 -1063 -5032 -970 3879 1349 -4175 -3537 2352 3353 -2011
3391b011k145M426L792l014m584K038N004m67m682j010M273K280l853l146K772
$$ -2011 -4156 270 4062 1048 -3536 -1498 3506 3039 -1643 -2653 1620 3900 47 -3099 -327
3406c27L394j666m048L45M097L32l922j292L314K153k650k848K159L415j205l322
$$ -327 3067 1401 -2647 -2302 1795 2127 -1795 -3087 227 2380 -270 -3118 -959 2456 1251 -2071
3422b071L86L606P21l433j382L195K002k538k800J733L284j163l692J22L486P45
$$ -2071 -1685 1921 2642 -791 -2173 1022 3024 486 -2314 -581 2703 1540 -2152 -2030 1456 2201
3438B201l595j805L121K618k480l330J756L825m55m125l72M182J763l683k731
$$ 2201 -1394 -3199 -78 2540 60 -3270 -1514 2311 1856 -2269 -2641 1541 3304 -379 -3110
3453c110L096L680j999m275P04M579N52m746j901L877L043l156m165J918M666
$$ -3110 -14 3666 1667 -2608 -1904 2675 3227 -1519 -3420 457 3500 344 -3821 -1903 2763
3468B763o01m789q50M579K353l828l439L061M209j459m509j2M781J340m247k427
$$ 2763 2162 -2627 -3477 1102 3455 -373 -3812 -751 3458 1999 -2510 -2522 2259 3599 -648 -3075
3484c075L273L374k144m264R11M247J49l935j584L257K571k618l230J664L412
$$ -3075 198 3572 1428 -2836 -1925 2322 2471 -1464 -3048 209 2780 162 -3068 -1404 2008
3499B008l70l298p56L237J568k506j991J730K479p93k671J32K507L73j988j060
$$ 2008 1638 -1660 -2416 821 2389 -117 -2108 -378 2101 1308 -1363 -1231 1276 1649 -339 -1399
3515a399J353J528j111j687P24J164p2j167l43J104L88q66j58N03K49k65k58N19
$$ -1399 -46 1482 371 -1316 -592 572 500 -667 -1010 94 482 -384 -542 -39 210 -55 -313 206
3533B06L09p53k3Q06J14o75o62Q27R77r33j288P45J311j40j759n69K091Q95j887
$$ 206 515 -238 -261 545 659 -16 -678 149 1126 193 -1095 -350 961 821 -938 -1507 584 1479 -408
3552d08j336J285K122o29k715J85K785O22k384j676K134K596j751k928P98L069
$$ -408 -1744 -459 1663 1034 -1681 -1496 1289 1911 -473 -2149 -15 2581 830 -2098 -1300 1769
3568A769M21l229j594L118K258k401k888J115L521M7l807r71L376J955k436l052
$$ 1769 2190 -1039 -2633 485 2743 342 -2546 -1431 2090 2137 -1670 -2641 735 2690 254 -2798
3584b798J504L737n49l705n68L234J877k679k872K002L160p36l270o00L185J565
$$ -2798 -1294 2443 1894 -1811 -2379 855 2732 53 -2819 -817 2343 1607 -1663 -2263 922 2487
3600B487k649k326J819K712n34l062m70K890J239k216j915J328K467n06k569l36
$$ 2487 -162 -2488 -669 2043 1509 -1553 -2023 867 2106 -110 -2025 -697 1770 1264 -1305 -1641
3616a641K203J205j638j882Q98K238k03k038o96J683J496j023j929L38J956N94
$$ -1641 562 1767 129 -1753 -855 1383 1180 -858 -1554 129 1625 602 -1327 -989 967 1561
3632A561j672j394J168J895m14k013n96J942J397j550k122P09K451J83k526j227
$$ 1561 -111 -1505 -337 1558 1144 -869 -1465 477 1874 324 -1798 -1089 1362 1545 -981 -2208
3648b208K140K187j508k834O55L238N30l099j709K752K787j893l468O75L960N02
$$ -2208 -68 2119 611 -2223 -1568 1670 2200 -899 -2608 144 2931 1038 -2430 -1755 2205 2707
3664B707l854j970L406L065k551l901R32M522M24m631j854M011L191k879m363
$$ 2707 -1147 -3117 289 3354 803 -3098 -2166 2356 2780 -1851 -3705 306 3497 618 -3745
3679c745J606N104o6m955j561M560L292l570m529K450N144p29n345j222N058K827
$$ -3745 -2139 2965 2899 -2056 -3617 943 4235 665 -3864 -1414 3730 3001 -2344 -3566 1492 4319
3695D319m440m123K983M866j254n603l93N547J861m809l285L505M818k139n376
$$ 4319 -121 -4244 -1261 3605 2351 -3252 -3645 1902 3763 -1046 -4331 -826 3992 1853 -3523
3710c523Q34N380J064m838k698M182L972l126m615J502M891J63n125j687M604
$$ -3523 -2689 2691 3755 -1083 -3781 401 4373 1247 -3368 -1866 3025 3188 -1937 -3624 980
3725I80K622l620l802K129M582r62m967p8M562J596l736k772L156L811k196l943
$$ 980 3602 -18 -3820 -1691 2891 1929 -3038 -3116 1446 3042 -694 -3466 -310 3501 1305 -2638
3741b638R46M127M99m100j578L784K264l005l135J709L651q97m097rL698J028
$$ -2638 -1692 2435 2934 -1166 -2744 1040 3304 299 -2836 -1127 2524 1627 -2470 -2479 1219 2247
3757B247l267k197K826L115k224l254J272L663M9l707r17L814J723l026k536K130
$$ 2247 -1020 -3217 -391 2724 500 -2754 -1482 2181 2230 -1477 -2394 1420 3143 117 -2419 -289
3773b89L474j453m073N12L870N21l805j994L326K897k888l498J641M019l08m221
$$ -289 3185 1732 -2341 -1829 2041 2562 -1243 -3237 89 2986 98 -3400 -1759 2260 1952 -2269
3789b269q59M319K046l453k945K633M085j444m450K06M425J146m013k607L262
$$ -2269 -3128 1191 3237 -216 -3161 -528 3557 2113 -2337 -2131 2294 3440 -573 -3180 82
3804H2L487k440m310R34M366M56m468j941L943K905k842l754J665M492k03m345
$$ 82 3569 1129 -3181 -2247 2119 2575 -1893 -3834 109 3014 172 -3582 -1917 2575 2372 -1973
3820a973j004M149K450l141l369K132M056q92m220n56L846J726l430k917K223
$$ -1973 -2977 1172 3622 481 -2888 -756 3300 2408 -1812 -2368 1478 3204 -226 -3143 -920
3835i20L416j170l811k30L607J393l034k336K237L161j029l228k0L269J329k629
$$ -920 2496 1326 -2485 -2715 892 2285 -749 -3085 -848 2313 1284 -1944 -1964 1305 2634 5
3851Ek007J922K591p74k827l07K574J083k192j978J144K173l41k543o42K136J343
$$ 5 -2002 -80 2511 1737 -1090 -1397 1177 2260 68 -1910 -766 1407 1066 -1477 -2119 17 1360
3868A360j509j902P26K428K32k148q17J737J875r17k304L32K442O19k060j674
$$ 1360 -149 -2051 -1325 1103 1335 -813 -1630 107 1982 1065 -1239 -907 1535 2154 94 -1580
3884a580J495K266r77k740j74K449J129k423k227J781K670p80k983l87L107J659
$$ -1580 -85 2181 1204 -1536 -1710 739 1868 -555 -2782 -1001 1669 889 -2094 -2481 626 2285
3900B285k682k210K034L011n60l422l63L601J371k876k429J806L336j055l918
$$ 2285 -397 -2607 -573 2438 1878 -1544 -1907 1694 3065 189 -2240 -434 2902 1847 -2071
3915b071j00L542J080l062k621K325L340j584l560L06L635J191l370k002K970
$$ -2071 -2171 1371 2451 -611 -3232 -907 2433 849 -2711 -2405 1230 2421 -949 -2951 19
3930A9K895j713l215N81L698N40l500j408K737K248j948l150R37L249l29l111
$$ 19 2914 1201 -2014 -1433 2265 2805 -695 -2103 634 2882 934 -2216 -1279 1970 1641 -1470
3946a470r73K535J745k146k268J506K433m63k322k64K452R94j950j056J422J522
$$ -1470 -2443 92 1837 -309 -2577 -1071 1362 899 -1423 -1687 765 1759 -191 -1247 175 1697
3962A697o72j803L81J735j68j429m46J029N69j056q89P27O63o44o93L06Q66k77
$$ 1697 1025 -778 -397 1338 1170 -259 -705 324 893 -163 -1052 -325 338 -306 -999 -693 173 -104
3980a04q37M67Q92j89p39J63J067K54j148k64J285N85j226j013R46J454r68j873
$$ -104 -941 -474 418 229 -510 -347 720 974 -174 -438 847 1432 206 -807 139 1593 625 -1248
3998a248L60J883J66k207r85K035J555j800k120J268K602l03k845k91L052J274
$$ -1248 -888 995 1161 -1046 -2031 4 1559 -241 -2361 -1093 1509 1206 -1639 -1930 1122 2396
4014B396k465k058K001K931j220l372K79L453O92l322j950K759K590k094l430
$$ 2396 -69 -2127 -126 2805 1585 -1787 -1508 1945 2637 -685 -2635 124 2714 620 -2810
4029b810Q86L684P7l677j252L280K390k549l014J746L746m18l772n90L693J710
$$ -2810 -1924 1760 1837 -1840 -3092 188 2578 29 -2985 -1239 2507 2089 -1683 -2273 1420 3130
4045C130l098k560K234L284j344l758K04L558P77l410j932K682K659k055l139
$$ 3130 32 -2528 -294 2990 1646 -2112 -1908 1650 2427 -983 -2915 -233 2426 371 -2768
4060b768J075L261J33l233r15L091J736k304k231J625K824o69k947J1K787O36
$$ -2768 -1693 1568 1701 -1532 -2447 644 2380 76 -2155 -530 2294 1625 -1322 -1311 1476 2112
4076B112k355j504J889J952j584k332R11K166k02k354m93K237R44k017j194J556
$$ 2112 -243 -1747 142 2094 510 -1822 -911 1255 1053 -1301 -1794 443 1387 -630 -1824 -268
4092b68J745r38k180P97K344k11k083l66K024J106k038j493J702J690j123k285
$$ -268 1477 539 -1641 -844 1500 1289 -794 -1160 864 1970 -68 -1561 141 1831 708 -1577
4108a577M33K562n5k668o68K279J387j957k133J667K549r46k612M7K888R90k817
$$ -1577 -1144 1418 1363 -1305 -1973 306 1693 -264 -2397 -730 1819 873 -1739 -1692 1196 2186 -631
4125f31j565K484K291j658k890O27L375J91l467j070K828K077k290l032J459L446
$$ -631 -2196 288 2579 921 -1969 -1342 2033 2224 -1243 -2313 515 2592 302 -2730 -1271 2175
4141B175n37l487p10L261J968k908k614K146L217p92l607l81L811J365l253k253
$$ 2175 1638 -1849 -2559 702 2670 -238 -2852 -706 2511 1719 -1888 -2269 1542 2907 -346 -2599
4157b599K310L093j220l744J38L659Q24l161k095K411L013j689l382N45L279Q54
$$ -2599 -289 2804 1584 -2160 -2022 1637 2461 -700 -2795 -384 2629 940 -2442 -1897 1382 2236
4173B236l056j906K585K677j592l031M30L167Q20k975j638K332K294j308k904
$$ 2236 -820 -2726 -141 2536 944 -2087 -1657 1510 2330 -645 -2283 49 2343 1035 -1869
4188a869K08L026O33k672j535J859K288j051k702J60K667Q45k232j732J691K369
$$ -1869 -1661 1365 1998 -674 -2209 -350 1938 887 -1815 -1655 1012 1857 -375 -2107 -416 1953
4204A953q79k582j51K526J193k143j917J437K400m91k582n49K422J516j998k243
$$ 1953 1074 -1508 -1659 867 2060 -83 -2000 -563 1837 1346 -1236 -1785 637 2153 155 -2088
4220b088J143K669j16k771r12K534J858j959k544J069K964kl001j153K746K120
$$ -2088 -945 1724 1608 -1163 -2075 459 2317 358 -2186 -1117 1847 1845 -1156 -2309 437 2557
4236B557k066k892J138L237P5l434j139L053K149k269l103J388L588j67l721j031
$$ 2557 491 -2401 -1263 1974 2049 -1385 -2524 529 2678 409 -2694 -1306 2282 2115 -1606 -2637
4252b637L380K188k559l307J777L708n59l858p42L562K079l141k949K125L561
$$ -2637 743 2931 372 -2935 -1158 2550 1991 -1867 -2609 953 3032 -109 -3058 -933 2628
4267B628r14l883l61L898J509l420k477K512L423j439l918M39L863P77l458j964
$$ 2628 1714 -2169 -2530 1368 2877 -543 -3020 -508 2915 1476 -2442 -2003 1860 2637 -821 -2785
4283b785K868K868k184l368J081L524J04l528j279L336J965k685k507J637L160
$$ -2785 83 2951 767 -2601 -1520 2004 2108 -1420 -2699 637 2602 -83 -2590 -953 2207
4298B207o54l461m6L277R91k707j895K182K618j661k813Q67K781J28k899r15K730
$$ 2207 1553 -1908 -1954 1323 2314 -393 -2288 -106 2512 851 -1962 -1095 1686 1814 -1085 -2000 730
4315G30J462k361j968J523K419r14k746L38K769K84k513j007K278J968k094k214
$$ 730 2192 -169 -2137 -614 1805 891 -1855 -1517 1252 1536 -977 -1984 294 2262 168 -2046
4331b046J573K392o23k676j31K956O87k833j339K221K038j670k876J064L021l81
$$ -2046 -473 1919 1296 -1380 -1511 1445 2132 -701 -2040 181 2219 549 -2327 -1263 1758 1377
$$ [...]
8191B5
##END NTUPLES=NMR FID
##END=
