##TITLE=1H_LY-Dixlofos.P.1
 CDCl3, 8 sc, 
 28.10.2020
##JCAMPDX= 6.0         $$ Bruker NMR JCAMP-DX V2.0
##DATA TYPE= NMR FID
##DATA CLASS= NTUPLES
##ORIGIN= UXNMR, Bruker Analytische Messtechnik GmbH
##OWNER= root
$$ XWIN-NMR		Version 3.5
$$ Wed Oct 28 12:43:00 2020 Russian Standard Time (UT+4h)  she@DPX200
##.OBSERVE FREQUENCY= 200.1315066352
##.OBSERVE NUCLEUS= ^1H
##.DELAY= (6, 6)
##.ACQUISITION MODE= SIMULTANEOUS
##.ACQUISITION SCHEME= undefined
##.AVERAGES= 8
##.DIGITISER RES= 18
##SPECTROMETER/DATA SYSTEM= spect
##.PULSE SEQUENCE= zg30
##.SOLVENT NAME= CDCl3
##.SHIFT REFERENCE= (INTERNAL, CDCl3, 0, 15.7039)
##AUDIT TRAIL= $$ (NUMBER, WHEN, WHO, WHERE, WHAT)
$$ ##TITLE= Audit trail, XWIN-NMR		Version 3.5
$$ ##JCAMPDX= 5.01
$$ ##ORIGIN= Bruker BioSpin GmbH
$$ ##OWNER= she
$$ F:/spectra/data/she/nmr/H-F/1/audita.txt
$$ ##AUDIT TRAIL=  $$ (NUMBER, WHEN, WHO, WHERE, WHAT)
(   1,<2020-10-28 12:42:01.46 +0400>,<she>,<DPX200>,
      <created by zg, POWCHK disabled, PULCHK disabled
       configuration hash MD5:
       00 E9 B6 7A A2 85 ED C7 34 08 36 98 17 FE 4E 26
       data hash MD5: 16K
       D4 A6 E3 D3 17 BF DB 62 9A A3 26 C5 94 65 5B F2>)
$$ ##END=
$$ 
$$ hash MD5
$$ 97 FA C2 F3 10 40 06 57 9C 2D 5E 3D F9 C1 E5 A3
##$RELAX= 
##$RELAX= 
##$RELAX= 
##$RELAX= 
##$RELAX= 
##$RELAX= 
$$ Bruker specific parameters
$$ --------------------------
##$DU= <F:/spectra>
##$EXPNO= 1
##$NAME= <H-F>
##$PROCNO= 1
##$TYPE= <nmr>
##$USER= <she>
##$AMP= (0..31)
100 100 100 100 100 100 100 100 100 100 100 100 100 100 100 100 100 100 
100 100 100 100 100 100 100 100 100 100 100 100 100 100 
##$AQSEQ= 0
##$AQ_mod= 1
##$AUNM= <au_zg>
##$AUTOPOS= <>
##$BF1= 200.13
##$BF2= 200.13
##$BF3= 200.13
##$BF4= 200.13
##$BF5= 200.13
##$BF6= 200.13
##$BF7= 200.13
##$BF8= 200.13
##$BYTORDA= 1
##$CFDGTYP= 0
##$CFRGTYP= 5
##$CHEMSTR= <none>
##$CNST= (0..31)
1 1 145 1 1 1 1 1 1 1 1 1 1 1 1 1 1 1 1 1 1 1 1 1 1 1 1 1 1 1 1 1 
##$CPDPRG= <>
##$CPDPRG1= <>
##$CPDPRG2= <>
##$CPDPRG3= <>
##$CPDPRG4= <mlev>
##$CPDPRG5= <mlev>
##$CPDPRG6= <mlev>
##$CPDPRG7= <mlev>
##$CPDPRG8= <mlev>
##$CPDPRGB= <>
##$CPDPRGT= <>
##$D= (0..31)
0 1.2 0 0 0 0 0 0 0 0.06 0 0.03 0 0 0 0 0.0002 0 0 0 0 0 0 0 0 0 0 0 0 
0 0 0 
##$DATE= 1603874520
##$DBL= (0..7)
120 120 120 120 120 120 120 120 
##$DBP= (0..7)
150 150 150 150 150 150 150 150 
##$DBP07= 0
##$DBPNAM0= <>
##$DBPNAM1= <>
##$DBPNAM2= <>
##$DBPNAM3= <>
##$DBPNAM4= <>
##$DBPNAM5= <>
##$DBPNAM6= <>
##$DBPNAM7= <>
##$DBPOAL= (0..7)
0.5 0.5 0.5 0.5 0.5 0.5 0.5 0.5 
##$DBPOFFS= (0..7)
0 0 0 0 0 0 0 0 
##$DE= 6
##$DECBNUC= <off>
##$DECIM= 32
##$DECNUC= <off>
##$DECSTAT= 4
##$DIGMOD= 1
##$DIGTYP= 9
##$DL= (0..7)
0 120 120 120 120 120 120 120 
##$DP= (0..7)
150 150 150 150 150 150 150 150 
##$DP07= 0
##$DPNAME0= <>
##$DPNAME1= <>
##$DPNAME2= <>
##$DPNAME3= <>
##$DPNAME4= <>
##$DPNAME5= <>
##$DPNAME6= <>
##$DPNAME7= <>
##$DPOAL= (0..7)
0.5 0.5 0.5 0.5 0.5 0.5 0.5 0.5 
##$DPOFFS= (0..7)
0 0 0 0 0 0 0 0 
##$DQDMODE= 0
##$DR= 18
##$DS= 0
$$ [...]
##$SUBNAM2= <"">
##$SUBNAM3= <"">
##$SUBNAM4= <"">
##$SUBNAM5= <"">
##$SUBNAM6= <"">
##$SUBNAM7= <"">
##$SUBNAM8= <"">
##$SUBNAM9= <"">
##$SW= 16.880792210976
##$SWIBOX= (0..15)
0 0 2 0 0 0 0 0 0 0 0 0 0 0 0 0 
##$SW_h= 3378.37837837838
##$TD= 16384
##$TD0= 1
##$TE= 0
##$TE2= 300
##$TE3= 300
##$TEG= 300
##$TL= (0..7)
0 120 120 120 120 120 120 120 
##$TP= (0..7)
150 150 150 150 150 150 150 150 
##$TP07= 0
##$TPNAME0= <>
##$TPNAME1= <>
##$TPNAME2= <>
##$TPNAME3= <>
##$TPNAME4= <>
##$TPNAME5= <>
##$TPNAME6= <>
##$TPNAME7= <>
##$TPOAL= (0..7)
0.5 0.5 0.5 0.5 0.5 0.5 0.5 0.5 
##$TPOFFS= (0..7)
0 0 0 0 0 0 0 0 
##$TUNHIN= 0
##$TUNHOUT= 0
##$TUNXOUT= 0
##$USERA1= <user>
##$USERA2= <user>
##$USERA3= <user>
##$USERA4= <user>
##$USERA5= <user>
##$V9= 5
##$VALIST= <valist>
##$VCLIST= <CCCCCCCCCCCCCCC>
##$VD= 0
##$VDLIST= <DDDDDDDDDDDDDDD>
##$VPLIST= <PPPPPPPPPPPPPPP>
##$VTLIST= <TTTTTTTTTTTTTTT>
##$WBST= 1024
##$WBSW= 4
##$XGAIN= (0..3)
0 0 0 0 
##$XL= 0
##$YL= 0
##$YMAX_a= 716803
##$YMIN_a= -665149
##$ZGOPTNS= <>
##$ZL1= 120
##$ZL2= 120
##$ZL3= 120
##$ZL4= 120
##$ABSF1= 10
##$ABSF2= 0
##$ABSG= 5
##$ABSL= 3
##$ALPHA= 0
##$AQORDER= 0
##$ASSFAC= 0
##$ASSFACI= 0
##$ASSFACX= 0
##$ASSWID= 0
##$AUNMP= <proc_1d>
##$AZFE= 0.1
##$AZFW= 0.1
##$BCFW= 1
##$BC_mod= 2
##$BYTORDP= 1
##$COROFFS= 0
##$CY= 11.3945322036743
##$DATMOD= 1
##$DC= 2
##$DFILT= <>
##$DTYPP= 0
##$F1P= 15.9154993809931
##$F2P= -4.1035820241983
##$FCOR= 0.5
##$FTSIZE= 0
##$FT_mod= 4
##$GAMMA= 1
##$GB= 0.15
##$INTBC= 1
##$INTSCL= 1
##$ISEN= 128
##$LB= 0.24
##$LEV0= 0
##$LPBIN= 0
##$MAXI= 10000
##$MC2= 0
##$MEAN= 0
##$ME_mod= 0
##$MI= 1.114404
##$NCOEF= 0
##$NC_proc= 0
##$NLEV= 6
##$NOISF1= 3.799351
##$NOISF2= 2.8
##$NSP= 1
##$NTH_PI= 0
##$NZP= 0
##$OFFSET= 15.70392
##$PC= 1
##$PHC0= -10689.42
##$PHC1= 12.80088
##$PH_mod= 1
##$PKNL= yes
##$PPARMOD= 0
##$PSCAL= 0
##$PSIGN= 0
##$REVERSE= no
##$SF= 200.130013532006
##$SI= 16384
##$SIGF1= 3
##$SIGF2= 2
##$SINO= 400
##$SIOLD= 16384
##$SREGLST= <1H.CDCl3>
##$SSB= 0
##$STSI= 0
##$STSR= 0
##$SW_p= 3612.71676300578
##$SYMM= 0
##$S_DEV= 0
##$TDeff= 0
##$TDoff= 0
##$TI= <>
##$TILT= no
##$TM1= 0
##$TM2= 0
##$TOPLEV= 0
##$USERP1= <user>
##$USERP2= <user>
##$USERP3= <user>
##$USERP4= <user>
##$USERP5= <user>
##$WDW= 1
##$XDIM= 8192
##$YMAX_p= 0
##$YMIN_p= 0
$$ End of Bruker specific parameters
$$ ---------------------------------
##NTUPLES= NMR FID
##VAR_NAME=  TIME,          FID/REAL,        FID/IMAG
##SYMBOL=    X,             R,               I
##VAR_TYPE=  INDEPENDENT,   DEPENDENT,       DEPENDENT
##VAR_FORM=  AFFN,          ASDF,            ASDF
##VAR_DIM=   8192,          8192,            8192
##UNITS=     SECONDS,       ARBITRARY UNITS, ARBITRARY UNITS
##FACTOR=    0.000296,      1,               1
##FIRST=     0,             0,               0
##LAST=      2.424536,      0,               0
##MIN=       0,             -665149,         0
##MAX=       2.424536,      716803,          0
$$ Real data points
##PAGE= N=1
##DATA TABLE= (X++(R..R)), XYDATA
0@%%%%%%%%%%Qj6J6j6K4l2L2m0N6o5P3q9J09j28J49j78K09k40K78l24L71m21M82
33B58n51O22p00P91q89R94j113J244j382J532j703J889k087K305k547K808l092
50a621L407l755M136m557N028n555O147o821P599q500R559j0829J2384j4339J6881
65I164k0346K5361l3335M8349j22727N71445R0103r07347k76044O78601O53579
76G16803n63835p80561L34672Q30735l8985p80789l20558P39451N26841n88881
86G4893o52342L19869P05090j4778p75106k18244P14358L83790n28958n36018
96e27446K80071O85705p2073p09163r6626O16538K99527m51822m95172L13988
106a56473O03700j54827n85710m4937N15994K59867m48944m10004L41509M56091
$$ plain form
0 0 0 0 0 0 0 0 0 0 0 0 8 -8 8 -8 16 -16 16 -24 32 -33 40 -49 60 -68 81 -97 112 -128 150 -174 197 -224 258
33 258 -293 329 -371 420 -469 525 -588 656 -726 806 -897 992 -1095 1210 -1337 1471 -1621
50 -1621 1786 -1969 2167 -2390 2638 -2917 3230 -3591 4008 -4492 5067 -5762 6622 -7717 9164
65 9164 -11182 14179 -19156 29193 -93534 477911 568014 -339333 -615377 63224 716803
76 716803 152968 -627593 -292921 537814 498829 -281960 -602518 136933 663774 74893
86 74893 -577449 -257580 447510 432732 -342374 -560618 153740 537530 8572 -527446
96 -527446 -247375 438330 366257 -342906 -439532 177006 476533 24711 -470461 -156473
106 -156473 447227 292400 -293310 -338247 177747 437614 -11330 -421334 -79825 376266
116C76266j77271m71987l4429M66811J81873m32092k70776L09851L33424j52230
126A29440l99594K1741M20844P7563l50599j63493K57382K70038j64657l22622
136b23957R3454L21827N555k82316j18488K39231J96005j94013k29050J15727
146g6025K31758k9707k46964n6274K35620J09093j92566j54971J23359J91153
156A34476o0112k06927J2201K03339M7831j74223r9130J46292J46420r2182j60909
167a02924M2730J69339P861j63292n1880J36590Q9121j06225j31965O3342J41143
178I3840l0177j36964k1494J17359O5796j07465r3797Q6486J01738l6384j03100
189f4162j0874J16025M0970j04854m7322P0699O9484k4574r4930O224R9495R76
$$ plain form
116 376266 198995 -272992 -307421 159390 341263 -90829 -361605 -51754 281670 129440
126 129440 -270154 -248413 172431 249994 -100605 -264098 -6716 263322 98665 -223957
136 -223957 -130503 191324 196879 -85437 -203925 35306 231311 37298 -191752 -76025
146 -76025 155733 126026 -120938 -177212 58408 167501 -25065 -180036 -56677 134476
156 134476 74364 -132563 -120362 82977 130808 -43415 -142545 3747 150167 57985 -102924
167 -102924 -60194 109145 117006 -46286 -98166 38424 127545 21320 -110645 -47303 93840
178 93840 63663 -73301 -94795 22564 88360 -19105 -112902 -26416 75322 38938 -64162
189 -64162 -75036 40989 81959 -22895 -70217 482 69966 45392 -49538 -43314 56181 57157
201E7157o9160k6695L4551N9370l3649p4711K8686M4950o696k3933l3978K6587
213a7521L8274l7562j0432J8793l506J9178q045j6324K6806j2882M38L7286k6390
226H113j8498J2992L479L1386k5739n1190N2205L2140l5378l2911j9619O6408
238B3388M5160r6145m1785O4857M9157r559r6006j5135J32468J5122j09116m3158
250h0752O1042J15056l2311j56867K8082J43503J6637j03324r7018R3226J54564
261A41838r1278j58612L4182J38479N7366j49071j28127J49274J41208r8812j51655
272a15208K628J84726P1307k02628j00962J59914J35477p1776j93613N928K35502
283A11295L5541k08728q9007J42343J73610q5742k32711M7540K29510J7317j93133
$$ plain form
201 57157 -12003 -38698 -4147 55223 21574 -53137 -24451 20499 13803 -10130 -44108 -17521
213 -17521 20753 -16809 -27241 -8448 -11954 7224 -821 -17145 9661 -3221 -2783 34503 8113
226 8113 -10385 2607 6086 37472 11733 -39457 12748 44888 9510 -23401 -43020 23388
238 23388 68548 -27597 -69382 -4525 44632 35073 -60933 -76068 56400 71522 -37594 -80752
250 -80752 -19710 95346 63035 -93832 -65750 77753 94390 -8934 -105952 -12726 141838
261 141838 50560 -108052 -73870 64609 121975 -27096 -155223 -5949 135259 36447 -115208
272 -115208 -112580 72146 143453 -59175 -160137 -223 135254 63478 -130135 -124207 111295
283 111295 146836 -61892 -150899 -8556 165054 79312 -153399 -105859 123651 140968 -52165
294e2165j17861J60159J95214j31777k19299O1966K07924L8045k05087j23592
304a86473J97141J65632j43138j86504N0945K18559L8382k28983q7557J95620
314C3624J29850j24475j84049N6589K25912n912k20559n3098J76497J25131j29843
325B9667j83407Q9465J99233l8316j91851l7867J79026J07971j60892j49624J16664
336c9931J68843n0068j83749j3094J90877O3013j71852j04642J31487J48535q0149
347E9270j78452L0893J84894J8032j74630p3496J50921J20526j18582j55561P2280
358f3905J76938j9344j84284l4144J75106Q6869j48892j36774J11830J74801o4525
369G3676j91512O247J93026O0040j84967j19406J61107J64487j08190j97004L6768
$$ plain form
294 -52165 -170026 -9867 185347 53570 -165729 -103763 104161 142206 -62881 -186473
304 -186473 10668 176300 33162 -153342 -102397 116162 154544 -74439 -161996 33624
314 33624 163474 38999 -145050 -88461 137451 131539 -89020 -142118 34379 159510 29667
325 29667 -153740 -64275 134958 96642 -95209 -133076 45950 153921 -6971 -156595 -39931
336 -39931 128912 78844 -104905 -117999 72878 135891 -35961 -140603 -9116 139419 59270
347 59270 -119182 -88289 96605 114637 -59993 -133489 17432 137958 19376 -136185 -63905
358 -63905 113033 93689 -90595 -124739 50367 137236 -11656 -148430 -36600 138201 73676
369 73676 -117836 -111589 81437 141477 -43490 -162896 -1789 162698 54508 -142496 -105728
380a05728K22965L2728k27059r1081J95736J50488j38562k14309P5091K54337
390A54606r903k49696o7484K14327J55312j72424k23783J23504K53149m2713k54293
401a19398o3829K44299J54767k16797k08644J46419K38978m5374k69828n0138
411a89545K80346J22280k35406j85173J46361K53176n7850k95843j2385K81829
421A07790R0436k23657j88455J60853K65899j02212k85629J6770K58078R6149
431A96022k28548j92169J95263K35674j22512k44605Q526K52191R4208k50057
441e6007j51790J98283J87443r9227k28357P626K59859N3503k32729j03828J59445
452e779J70850q8521k25601M1046K27382J2891j84918r5562J40819J64720j12692
$$ plain form
380 -105728 117237 149965 -77094 -168175 27561 178049 39487 -174822 -99731 154606
390 154606 144703 -104993 -172477 41850 197162 24738 -199045 -75541 177608 134895 -119398
401 -119398 -183227 61072 215839 -958 -209602 -63183 175795 130421 -139407 -189545
411 -189545 90801 213081 -22325 -207498 -61137 192039 134189 -161654 -174039 107790
421 107790 198226 -25431 -213886 -53033 212866 110654 -174975 -158205 99873 196022
431 196022 -32526 -224695 -29432 206242 83730 -160875 -152349 99842 194050 -56007
441 -56007 -207797 -9514 177929 78702 -149655 -142029 117830 171333 -61396 -165224 -5779
452 -5779 165071 76550 -149051 -108005 119377 132268 -52650 -148212 -7393 157327 44635
463D4635j86216O5297J68764J3916j57394q8018J55064J22511j21666j27268N0386
474e9989J40207J8204j56265m8008J43806O4259r0509r6348L8856J32844j3009
485G4048j33707o792R5549M2768o4337q6553N3580R6699m2766q1878J276O6119
497A4006M1889o7839n5183O2855M7341l0726m5646j437O3671J5700o4711j3413
509c3493M2283K2917j6256m1731J0691M7778j4276l5534J609K0197J7508k1886
521a93k6627K3415J6805j4821j0713k096J5166O835j8919l16J2202k059M67P13
535a41K208N283n804K007J0198p332q241P185J0996k131k0180n145K2428Q773
549B0104k4260j8880J8827K6049j7033l6702O415M4158R882m7958k4275M5069
$$ plain form
463 44635 -141581 -76284 92480 106396 -50998 -139016 16048 138559 16893 -110375 -59989
474 -59989 80218 98422 -57843 -105851 37955 102214 11705 -84643 -45787 87057 74048
485 74048 -59659 -66451 29098 71866 7529 -79024 -25444 71255 28489 -53389 -52113 14006
497 14006 55895 -11944 -67127 -4272 43069 12343 -33303 -34740 28931 44631 -20080 -33493
509 -33493 8790 31707 15451 -26280 -15589 32189 17913 -17621 -16012 4185 21693 -193
521 -193 -26820 -3405 13400 -1421 -12134 -14230 936 7771 -11148 -11464 738 -1321 -854 -141
535 -141 2067 7350 1546 3553 13751 6419 -1822 5363 16359 14228 -5952 -11097 11331 20104
549 20104 -4156 -23036 -4209 21840 4807 -31895 -25480 18678 28560 -19398 -43673 1396
561A396L8969l1650n2776J7818P0498K11p5259j9524O8779N1225n2697p9466L6837
574b5639R2534j6116r4785k3493Q9704O3238q7748r4834O2945J05906j9666j17747
586f5701l0661J25982O7056j12924r0881P4897J25727k1218j52622j8209J57444
597E8890N7847j23691j06061Q2058J56918m5531j78970J761J63788O1802j38951
608a0140j33505J12489J71266p4424j79775L04J75597Q0096j72417j35835J42530
619b3814J62505p1639j83018q621K07771P4261j94447j15247J39216J65324o1637
630I0654k10298J857K19623M7749j84058j14398J26001J82101q1817k20378K7101
641a15863K02746M6885j71595j32344J44808J82443j04829j92276L1086J91579
$$ plain form
561 1396 40365 8715 -44061 -26243 44255 44466 -30793 -50317 18462 69687 16990 -62476 -25639
574 -25639 66895 50779 -44006 -67499 22205 85443 -2305 -97139 -34194 71712 52046 -65701
586 -65701 -96362 29620 96676 -16248 -107129 -32232 93495 72277 -80345 -98554 58890
597 58890 116737 -6954 -113015 -30957 125961 80430 -98540 -96779 67009 128811 -10140
608 -10140 -143645 -31156 140110 65686 -114089 -113785 61812 141908 -30509 -166344 -23814
619 -23814 138691 67052 -115966 -124587 83184 157445 -37002 -152249 -13033 152291 90654
630 90654 -119644 -117787 101836 149585 -34473 -148871 -22870 159231 77414 -142964 -115863
641 -115863 86883 133768 -37827 -170171 -25363 157080 52251 -140025 -108939 82640
651H2640O1896j89241j22938J66342J54413r7072j74047J6905K01332M6725j99282
662e2327q8456J50529J32573q3235j82140K4826J96691J5025j72293p1870J24420
673f257J32421q8802j69875N1614J65683O994j40358p3125J26762J21138j00943
684B5252j29963N4220J33451J1819j38174n8442J32502Q1355r6377j00570M3263
695d1664J24167m402j38118k4022J15751N0872q2738q9993N3627J12539l4418
706D1601j11563K385R8186M1033q5284p1392P5552Q5477m6704q4741J2443R3758
718E0751K0663r4856m1653P9808N8249n2949p8964K4242Q9512o678r1382j8312
730f1569P8339M4419o6039p0749M7337Q3159k3274q5745l855Q5896L2536p7675
$$ plain form
651 82640 144536 -44705 -167643 -1301 153112 56040 -118007 -101102 100230 146955 -52327
662 -52327 -140783 9746 142319 59084 -123056 -98230 98461 113486 -58807 -130677 -6257
673 -6257 126164 37362 -132513 -80899 84784 91778 -48580 -121705 5057 126195 25252
684 25252 -104711 -50491 82960 94779 -43395 -101837 30665 112020 15643 -84927 -41664
695 -41664 82503 78101 -60017 -84039 31712 82584 -154 -90147 -36520 76019 41601
706 41601 -69962 -67577 30609 71642 -13642 -85034 -9482 75995 29291 -55450 -43007 50751
718 50751 71414 -23442 -65095 14713 72962 20013 -58951 -34709 54803 48125 -43257 -61569
730 -61569 16770 61189 -4850 -75599 -28262 54897 31623 -54122 -57977 27919 60455 -17220
742a7220n3877O3926P7196l7333q7547J1531R2072J9271q4436m6949P2152O8368
754G7154n3735q5235K1913Q9887R603r2585m0790P9929N8615n6791p6832K5523
766d3344R2294K465r2527k4375P8250N3094n1149p6383L2444Q9910j0466q1683
778c1470j8470O7387N2356n6027p1753M1054P0656j4405o8636k3650O7386M3698
790E8126o3833n0992L5814N3336k739o5038j6163O7684K1601m7218l0612K1171
802a8863N3603l850n9212L627M4314R034k1137l1449J6815M1849k1313l1480P533
815a0529J4721J5195j7040k6548K2924J0292j5197k66n159Q091J0763j8943M292
828g404J0933j3032Q333O415n816O078j3039M093K6162j5825j4989J1504P661
$$ plain form
742 -17220 -71097 -7171 70025 32692 -54855 -43324 48748 68019 -16417 -63366 8786 77154
754 77154 23419 -61816 -39903 49984 59587 -32998 -73788 6141 64756 7965 -68867 -43344
766 -43344 48950 51415 -41112 -65487 12763 65857 14708 -61675 -29231 60679 50213 -31470
778 -31470 -49940 17447 69803 13776 -57977 -16923 53733 39328 -29308 -52958 14428 58126
790 58126 -5707 -56699 -20885 32451 29712 -35326 -51489 16195 37796 -9422 -40034 -18863
802 -18863 34740 30890 -28322 -24695 19619 28653 7516 -23933 -7118 34731 13418 -18062 -10529
815 -10529 4192 19387 2347 -24201 -1277 9015 -6182 -6448 -11607 -3516 7247 -11696 -7404
828 -7404 3529 -9503 -1170 5245 -571 5507 -7532 -3439 22723 6898 -8091 3413 11074
841A1074J0653k0456k4813L3065J7599k6117j7940j628L2722J2796m9263j0776
853c3084L9979J5428j7407l8537P038N8558o291n1215k326L4836L2615k8184n5213
866d3803L1372N5191j6859m5154j4697M6899L8859n3921m4262M1052M3200j3045
878B4832n7268j4116O7718K1117o0565k8412L6574M7756j8798o6811J2936O9374
890C4337J608n4408k5717M5766N1167m0944n7554L2164N4953p727n8613j8693
902d3661O4299L2277n9222m0651L8604N2265j9248o8031N551P2605P251o5626
914b3587k9729N4296N3935m4429o7372L1786P3647r005p6107j6578P9142M2050
926F8049p1464o1223N4257P8996k9713r3478K744R7916K4781r4601n6994P8416
$$ plain form
841 11074 21727 1271 -23542 9523 27122 1005 -16935 -18563 14159 26955 -22308 -33084
853 -33084 6895 22323 4916 -33621 -26583 31975 25684 -25531 -27857 6979 39594 11410 -43803
866 -43803 -12431 42760 25901 -19253 -33950 12949 51808 -2113 -46375 -5323 37877 24832
878 24832 -32436 -46552 21166 42283 -18282 -46694 -10120 37636 18838 -47973 -35037 34337
890 34337 35945 -18463 -44180 1586 52753 11809 -45745 -13581 41372 33645 -24968 -43661
902 -43661 20638 52915 -6307 -46958 -8354 43911 24663 -43368 -37817 34788 42039 -23587
914 -23587 -53316 980 54915 10486 -56886 -25100 48547 39542 -36565 -53143 25999 68049
926 68049 -3415 -64638 -10381 68615 38902 -54576 -51832 46084 70865 -23736 -80730 -2314
938b314Q3329n5303j04186K2943J14782J3583j15882m9798J02906Q3647p4514
949A9193j11764M0102J31087j585j32641l9628J18568Q4754r4232j21628O1716
960d6058J41077j7377j42844l6288J35042Q5211j19111j20838Q1325J43110k6637
971G6612j58374l0830J59318P6415j34584j13344Q8703J50347l6114j74194j1433
982a07478J70413O2465j36771j16823R5498J59425n4618j72753K797J60681O1270
993A24106j40229j19296J12952J50336o6267j57795J3J57808O2629j51798j03342
1004a30883J19764J28672o1561j52380Q9J67156M3851j51531p9970J07571J21217
1015A11995n8662j54568K0199J58438K0060j32499p2662J00298J18931p4035j38259
$$ plain form
938 -2314 81015 25712 -78474 -55531 59251 72834 -43048 -92846 10060 93707 19193
949 19193 -92571 -52469 78618 77033 -55608 -95236 23332 108086 13854 -107774 -46058
960 -46058 95019 77642 -65202 -101490 33552 118763 -348 -121186 -39861 103249 76612
971 76612 -81762 -112592 46726 123141 -11443 -124787 -36084 114263 78149 -96045 -107478
982 -107478 62935 125400 -11371 -128194 -32696 126729 72111 -100642 -97845 62836 124106
993 124106 -16123 -135419 -22467 127869 61602 -96193 -96180 61628 124257 -27541 -130883
1004 -130883 -11119 117553 55992 -96388 -96299 70857 114708 -36823 -116793 -9222 111995
1015 111995 53333 -101235 -81036 77402 97462 -35037 -107699 -7401 111530 37495 -100764
1026a00764L8082J30220J6770j18010p0360J07775R8565q1537j05175L2589J11807
1037E9962J8371j18537n0092J05777O6911o6583q7390K3779J07726K050j07708
1048d5734k1320Q4115N1503n5166q3199L6599R4820j8319q2007j2974O6960M8147
1060F3425o1626o5387N1613O5360k2225o4537j2913O9827L2253o6767l7138M4707
1072c408M6022j8597o2469J264O8559P271n4970k3731L5416M4462k4645n5479
1084d0305J9168N1425j377m2277k2233L9544L7599l5037l9646J9835L8006J121
1096B5823m2563j6122M2708K2479l3022k8645J4705L7316k187m1955n753L6290
1108I074J4805k4011k7476J4608L4955o600l2785k852K6612J6360k0091k3747
$$ plain form
1026 -100764 -62682 67538 84308 -33702 -104062 3713 102278 20741 -84434 -51845 59962
1037 59962 78333 -40204 -90296 15481 82392 15809 -71581 -47802 59924 61974 -45734
1048 -45734 -67054 17061 68564 13398 -69801 -33202 61618 43299 -38708 -51682 15278 63425
1060 63425 1799 -63588 -11975 53385 31160 -33377 -46290 23537 55790 -10977 -48115 -3408
1072 -3408 42614 24017 -38452 -37188 31371 38642 -16328 -40059 -4643 39819 15174 -40305
1084 -40305 -21137 30288 28911 -13366 -35599 3945 41544 6507 -33139 -13304 24702 25823
1096 25823 -16740 -32862 9846 32325 -697 -29342 -14637 22679 20492 -21463 -27216 9074
1108 9074 23879 -132 -27608 -13000 21955 15355 -17430 -20282 6330 22690 2599 -21148
1120b1148J4534K6115l413k3687q197J9614J5096j3948j8648M806J8750K967j8006
1133e165j0893J1133J6036k820j7854m751J4508J0981n828j5640NJ9053O194j5172
1147b13j3248P160K2993K286k6307q948J9846J8188r302k9948J203L4669M417
1160B2796l0227k0356J9314L6885j2018m6175J505M0567J6308l2199l8062K8059
1172a3603N1816j7345n0143m728M8238L4097m5650n0691L7145N4562j2322n8512
1184b7136j8909O4450L9432o0409n1195L4718O2625l571p8870j9682P9454L5369
1196E6276n9515n7556L0815Q2987q446r1817j0241P9870M0641n7336p3749M2339
1208b5732R4394k1239q9119j3405P7383N4312o9525q0218N3805Q4481k0680q7814
$$ plain form
1120 -21148 -6614 19501 16088 -7599 -15796 3818 18914 4966 -13682 -8876 9874 12841 -5165
1133 -5165 -16058 -4925 11111 8291 -9563 -14314 194 11175 5347 -10293 -10288 8765 14959 -213
1147 -213 -13461 -6301 16692 18978 -7329 -16277 3569 21757 12455 -17493 -16290 18379 22796
1160 22796 -7431 -27787 -8473 28412 16394 -29781 -28276 12291 28599 -3600 -41662 -13603
1172 -13603 38213 20868 -29275 -34003 14235 48332 2682 -48009 -10864 43698 31376 -27136
1184 -27136 -46045 18405 57837 -2572 -53767 -19049 43576 40005 -38865 -58547 20907 56276
1196 56276 -3239 -60795 -29980 53007 44561 -47256 -57497 22373 63014 5678 -68071 -25732
1208 -25732 68662 47423 -41696 -55101 22282 76594 7069 -73149 -19344 65137 44457 -43357
1220d3357k4601R0575N4648q3421o9934N0789Q2424r744r7980j9455J01738L9827
1232G1509p8787o3514M5695R3320j7964j04848k770R3944L2854p1532o8761N5483
1244a5371R1459l8861r3631N607Q4035L3493q0796o3347P0294P1859m4552p8479
1256e8290O126Q8429K3341q9149l9657P2197N6810m0248p6302J8704R0351j96
1268E2116q3014k1455O5430N0935n0541p2972L7991P6335j6693p3906j4791P0494
1280A9929L9604o7820n4164N0502O1905k5027p3154Q82Q1068J7590p5080l4268
1292e8033N9053N6988l9691p2826K5189Q1280m237p6981k1914P1143M8696o2057
1304F610o7619M2009P5931j7458q3331j1536Q3104L4837p5796n7877N4898P6765
$$ plain form
1220 -43357 -67958 22617 77265 -6156 -76090 -25301 57123 47379 -50601 -70056 31682 71509
1232 71509 -7278 -70792 -25097 68223 50259 -54589 -57359 36585 69439 -2093 -70854 -15371
1244 -15371 76088 37227 -56404 -50797 33238 66731 -14065 -77412 -7118 64741 20189 -58290
1256 -58290 -52164 36265 59606 -29543 -69200 2997 59807 19559 -56743 -38039 52312 52116
1268 52116 -30898 -52353 13077 64012 13471 -59501 -21510 54825 38132 -35774 -50565 19929
1280 19929 59533 -8287 -62451 -11949 49956 24929 -48225 -47343 33725 51315 -23765 -58033
1292 -58033 1020 58008 18317 -54509 -29320 51960 47723 -29258 -51172 19971 68667 6610
1304 6610 -61009 -19000 56931 39473 -43858 -55394 27710 62547 -13249 -71126 -16228 60537
1316F0537k9655q8738L027R0576K5533q1309n1101O7261P4739m3222q8683J5165
1328d5870R5320J6822r0391m4235P5805O8126n3094q8599K4927R7305K871r6039
1340c7052l5775Q0441O4071o1900q6114L7244R4462n372r2238k9513Q6666N9500
1352G4420o8861p5440M3000Q6910o538r1844k3171Q8666M5381o8636o4982L8601
1364b2494Q2074j2536r0456r869P8844L3058o0473o0926M0543P6223k3645p5699
1376d5356p22O5452L0674n7188n1782M9961N8628k6840n7159j208O0720K4743
1388D9923n8643l1853M4308L7071k0738m9884J118N6959N363m9588j6223K9126
1400c061L1360j8100m4525J4228M0613o334k9195j2398K5342K8693k6170k6146
$$ plain form
1316 60537 30882 -57856 -54829 35747 61280 -20029 -71130 -3869 70870 27648 -61035 -45870
1328 -45870 49450 66272 -24119 -68354 7451 75577 22483 -66116 -41189 56116 58987 -37052
1340 -37052 -72827 7614 71685 9785 -76329 -39085 55377 50005 -42233 -71746 14920 74420
1352 74420 5559 -69881 -26881 60029 53491 -38353 -61524 27142 72523 3887 -61095 -22494
1364 -22494 59580 47044 -43412 -53281 25563 58621 -1852 -62778 -22235 53988 30343 -45356
1376 -45356 -46078 19374 50048 -7140 -58922 -8961 49667 22827 -34332 -35540 25180 49923
1388 49923 -8720 -40573 3735 40806 20068 -29816 -28698 28261 33624 -15964 -32187 -3061
1400 -3061 28299 10199 -34326 -20098 20515 14181 -15014 -27412 -2070 26623 453 -25693
1412b5693K0132K0321k000k0905r731K9922J0122k6018o375J1327J3540j869k4466
1425a1693L799K1959p621j3089l008O735J4168j3032j5334J5679O597n774n504
1438f118m547J4644N899j7387J965J0270J273J32j0111K364J5007q718p838N011
1452A846J353M442n479q408J0637R23r245J470m4K629J308j0365M593O996q209
1467e553j26L877K737K220j0127L93J4769k855r197O41P308Q790j0667j4893J4301
1482A618J4326r418j6626k560K0932Q623k5441j2255K0577J7866j2271k8608L598
1495a9639L5475M031l3474j4303K7937K8216k0004l7849J2760M3193K155m2370
1507a3872j8794L9757L4279l0880m5013J6890N1561P06n5449k0267M9839L7108
$$ plain form
1412 -25693 -5561 14760 12760 -8145 -17876 12046 22168 -3850 -10225 1102 14642 12773 -11693
1425 -11693 -7894 14065 6444 -6645 -9653 -2918 11250 -1782 -17116 -1437 5160 -614 -6118
1438 -6118 -10665 3979 9878 -7509 -5544 4726 5999 6131 -3980 -1616 13391 4673 -3165 1846
1452 1846 3199 7641 2162 -6246 4391 5314 -3931 -2461 -2505 124 1432 -8933 -4340 2656 -5553
1467 -5553 -5679 -1802 935 3155 -6972 -6579 8190 5335 -3862 -3221 4087 12877 2210 -12683 1618
1482 1618 15944 6526 -10100 -12660 8272 16895 -8546 -20801 -224 17642 5371 -23237 -19639
1495 -19639 15836 19867 -13607 -27910 27 28243 8239 -29610 -16850 26343 28498 -13872
1507 -13872 -32666 7091 41370 10490 -34523 -17633 33928 34634 -20815 -41082 8757 45865
1519D5865m0003n3540K2818O2941l636o4225j9845O0006M2734m8372n9156L0247
1531b4166O9720l586p2666k2300P0155M4907n5779o2657L1342P6677l846q3355
1543c5554k1636P5786M4001n7076o8001L2862Q4588r596q8541j8376P6461M9661
1555F4579n9682p4900M0957Q6646j4597q4995j9204Q0452N3118o9250p2951M7090
1567b2737Q2594j2101q7470k2859Q7272M7019p3951o4864M2923Q2613r811r5428
1579d6800j6271Q9018L9117o5865o5438L9245Q7813j7195r2167p168P9704M0381
1591F4374o2620o9509M7404Q2498k4718p9866q332P5278M2166o9718o1533N3591
1603a0985O7594k2886p4185j0849P9538L0485p2464m4265M7798O0685k0348p6104
$$ plain form
1519 45865 5862 -47678 -24860 38081 34445 -29780 -49625 10381 53115 4743 -54413 -24166
1531 -24166 45554 41968 -30698 -52998 17157 62064 6285 -56372 -25030 51647 47801 -35554
1543 -35554 -57190 18596 62597 5521 -62480 -29618 54970 45374 -43167 -61543 14918 64579
1555 64579 4897 -70003 -29046 57600 43003 -41992 -61196 19256 72374 3124 -69827 -22737
1567 -22737 59857 47756 -39714 -62573 24699 71718 -2233 -67097 -24174 58439 48628 -46800
1579 -46800 -63071 25947 65064 -801 -66239 -26994 60819 43624 -48543 -55711 23993 64374
1591 64374 1754 -67755 -20351 62147 37429 -42437 -50769 24509 66675 -3043 -64576 -10985
1603 -10985 56609 33723 -40462 -51311 28227 58712 -13752 -58017 -10219 50466 30118 -45986
1615d5986J592P7009J4335o1719l6222M3508O0153l0171o9432J5378O3411Q994
1627D0850n4015l6101M9563N0377m0334n2848J7550N4946R175n9093k5757N4721
1639I034L3012l7965m2923J6474N5536j564o0168p944N0144K3959l4599m2511
1651c9515K5716N1855j6879m9694J205M4289K0275m2089l5501L7431L9880k2991
1663A3982m1930K467M6867J2590m8014k1615L9383L1437k3389m2699Q710M9619
1675B7408J098m5618j4034L5713K9804k6901m1561J7781M3811l975m0859j2823
1687c0156L6945K6888l1810l3888K0333L7285m566l9366r943L7625J9634l0307
1699a326k6674J8731L3540o927l5561m445L2910J4274k5598k2627J7197K6545
$$ plain form
1615 -45986 -44394 32615 46950 -14769 -50991 -7483 52670 22499 -46933 -31555 31856 40850
1627 40850 -13165 -49266 297 50674 10340 -42508 -24958 29988 39163 -19930 -45687 9034
1639 9034 42046 4081 -38842 -22368 33168 31604 -28564 -36508 13636 37595 2996 -39515
1651 -39515 -13799 38056 21177 -28517 -27312 16977 37252 -4837 -40338 -2907 36973 13982
1663 13982 -27948 -25481 21386 33976 -14038 -35653 3730 35167 11778 -30921 -22211 27408
1675 27408 28506 -17112 -31146 4567 34371 7470 -34091 -16310 27501 23526 -17333 -30156
1687 -30156 6789 33677 1867 -32021 -11688 25597 21031 -18335 -28278 9347 28981 -1326
1699 -1326 -28000 -9269 24271 17344 -18217 -22662 10248 24522 -1076 -23703 -6506 20039
1711B0039p766k8240k165K6315J0677k1405j6516J2714J9720l993k0333j534J8364
1724E877O067j2093j0436O323J4611k297j2648j424O713N351j340q294Q67N894
1738C171j51j47m605m004P261M285l437n676n742R731R658j0310r927M097J1946
1753F150N897j7713j0900J9955J3392j1010j8078l62K6536P157k9544j0701K0808
1766A587J9384j0196l2564L155L7200K055l1205j5110K2008L1198j8113l9884
1778c0485J2172L7605L649l2853k3351L2483L5254k8099l5751J2750L7980Q758
1790C0112m3039k2095M2873K7643k8329l4703Q350M5231L552n0501j0563L9860
1802H391K2566k5223m0522J5236M8951q198m3629n726L4963K5987l0901l8208
$$ plain form
1711 20039 12273 -15967 -18132 8183 18860 -2545 -19061 -6347 13373 9380 -10953 -12487 5877
1724 5877 11944 -149 -10585 -4262 10349 8052 -4596 -6020 693 6044 4704 -3590 -2723 3171
1738 3171 3020 2873 -1732 -5736 1525 5810 2373 -3303 -9045 686 10344 34 -9893 -5796 6150
1753 6150 12047 -5666 -16566 3389 16781 5771 -12307 -12669 13867 21024 -8520 -19221 1587
1766 1587 20971 10775 -21789 -18634 18566 20621 -10584 -25694 -3686 27512 9399 -30485
1778 -30485 -18313 19292 22941 -9912 -33263 -780 34474 6375 -29376 -16626 21354 30112
1790 30112 -12927 -35022 7851 35494 7165 -27538 -19188 26043 29595 -20906 -31469 8391
1802 8391 30957 5734 -34788 -19552 29399 21201 -22428 -28154 6809 32796 1895 -36313
1814c6313K7938L9984j2731l7647p484M0089K1602m0115k5592K9963K9890j3360
1826A6224l9540j5M6033M982m0903j4483K7632K7579k0680l9049J7010L9508q149
1839A6149l5101q276L4472K2934l4582k7246K9135L0485j3566l6368M61M4262
1851B2759P419m2891j5185L2438K7715k3597m1909J6020M6545o657m4842j0830
1863c3015M0594K8119l8203l9051K9709M4367j2393m9462n885N3951K2120m9230
1875h379l3487L7017M6776j9385n7400M618O1564J2345n6011l1936M4815M8682
1887D9219l1677o0833J3499O3512O756o2720k9415N4429M8079m0423o0555J9516
1899c0613O7667M104o7004k4594N9534M5447m4112o0567K5123O9521j087o9186
$$ plain form
1814 -36313 -8375 31609 18878 -18769 -26253 13836 35438 -4677 -30269 -306 29584 16224
1826 16224 -23316 -23331 22702 27684 -13219 -27702 -70 27509 6829 -32220 -15210 24298 16149
1839 16149 -18952 -27228 7244 30178 -4404 -31650 -2515 27970 14404 -21964 -21503 22759
1851 22759 30178 -12713 -27898 4540 32255 8658 -33251 -17231 29314 22657 -22185 -33015
1863 -33015 7579 35698 -2505 -41556 -11847 32520 20127 -29335 -35220 18731 40851 -8379
1875 -8379 -41866 -4849 41927 22542 -34858 -30240 31324 43669 -12342 -44278 537 49219
1887 49219 17542 -43291 -29792 33720 40476 -22244 -51659 2770 50849 10426 -50129 -30613
1899 -30613 37054 41158 -25846 -50440 9094 54541 10429 -50138 -25015 44506 43419 -25767
1911b5767k3216O2048M3656m8609n9030K8743O6877n191p0607k0266O4985L8453
1923E2076n1437n4367K9822O5413q008p0060j1811O4229L2932m8790n1253L3065
1935a8189O4405j3833o4953n626N8274L0050m9029m8618L6770N5732j8475n6818
1947c0310o798N5415K6193n2017l8787L7239M5373j5210n3452m743N6377J7199
1959C6479m7065k7831L1416M2707j5778n1373O011M9897Q263l8726k4769K9716
1971a053L8931k3712m1876J2595L7078N064l6680k2795L4936K7142k7164k8895
1983b6429J0364L2299M095l8388r759L5189J5093k1772k4277J0944L4603m782
1995A7180l4045Q56K6384J2026k0087k4859J8670K9041j4354k4988K05K2953J2659
$$ plain form
1911 -25767 -48983 13065 56721 8112 -50918 -22175 44702 39511 -31096 -51362 13623 52076
1923 52076 639 -53728 -23906 41507 33499 -36561 -48372 15857 48789 -1 -51254 -18189
1935 -18189 46216 32383 -32570 -38196 20078 50128 1099 -47519 -10749 44983 26508 -30310
1947 -30310 -37108 18307 44500 -7517 -46304 -9065 36308 21098 -32354 -37097 19280 36479
1959 36479 -10586 -38417 -7001 35706 19928 -31445 -25434 24463 32726 -6000 -30769 -1053
1971 -1053 37878 14166 -27710 -15115 21963 27027 -9653 -32448 2488 29630 2466 -26429
1983 -26429 -16065 16234 20329 -18059 -27818 7371 22464 692 -23585 -12641 21962 17180
1995 17180 -16865 -16009 10375 22401 2314 -22545 -3875 25166 10812 -14176 -13971 8982 21641
2008B1641k6518j8703K3298J6910j2278k1412r36K7891N866k8136o951J9525J4831
2021A5028q768k3994O049K8270k296k0750n846J5041J7698j3607k2577J1521J9043
2034A4812k580j6932j0600J7456J5122j6569j4689P294J3917K893j8306q108J7787
2047A497R184j0220j0619J195J5378L970j5197l019R899P214k398j1958l15J3023
2061G634J908p403o116N03Q925J060r730l281M311N351L22r996l503Q891O418
2076E294l249j0602j709J3239O214j0603r697O471J5964n00j8011n663J7726J3510
2090A8384j3305j9748N817K4142K072k5007j2408K1645K0649j6230k8415N884
2102a6520L1496N357l2058j7247K8470K7169j8458l5418O660M1464P283l9643
$$ plain form
2008 21641 -4877 -23580 -282 16628 4350 -17062 -17998 9893 15759 -12377 -19328 197 15028
2021 15028 6260 -17734 -11685 16585 14289 -6461 -12307 2734 20432 6825 -15752 -4231 14812
2034 14812 12232 -4700 -15300 2156 17278 709 -13980 -6686 7231 10124 -8182 -16290 1497
2047 1497 10681 461 -10158 -8963 6415 10385 -4812 -7831 2068 9282 6884 -5074 -5389 7634
2061 7634 9542 2139 -3977 -3474 5451 6511 -3219 -6500 -2189 3162 3484 -6512 -10015 -1124 5294
2076 5294 2045 -8557 -10266 2973 9187 -1416 -11113 -4642 11322 10822 -7189 -12852 4874 18384
2090 18384 5079 -14669 -8852 15290 17362 -7645 -20053 1592 22241 6011 -22404 -16520
2102 -16520 14976 20333 -11725 -28972 -502 26667 8209 -27209 -20549 20915 28198 -11445
2114a1445j9220L2425L3462k0940m4028Q852M8065N883m4581k4696L6536M0405
2126D0718k7115m9487J1552N0239Q318n0056k8405M4463M2178l1769n0335J1215
2138b8484N5540J1243n6882k6842M9973L9768l1258n2635J1678O2833N997o0910
2150a9979k2315M8007M0539l2956n7255J8195O2715k542n7952k0818M8576M2541
2162D6756m0349n3396K5691N5295k955n5412k0257N5773L5538m5905m3834K6330
2174a6725N2985l397n9973j1850N8055K4109m3748l9426K6450N4430j3547n9632
2186c2269J76N2507J7495m3318l8459L5615M9271k5935m9564O670M8883J4841
2198C5913m8801k8709M5211L5457k9646m1779J0378N1100M062n3597j2584M4027
$$ plain form
2114 -11445 -30665 1760 35222 14282 -29746 -20894 27171 33054 -11527 -36223 313 40718
2126 40718 13603 -35884 -24332 25907 34225 -15831 -44236 227 42405 10636 -39699 -28484
2138 -28484 27056 38299 -18583 -45425 4548 44316 13058 -39577 -27899 34934 40931 -19979
2150 -19979 -42294 5713 46252 13296 -43959 -25764 36951 34409 -23543 -44361 4215 46756
2162 46756 6407 -46989 -21298 33997 31042 -24370 -44627 11146 46684 779 -43055 -16725
2174 -16725 36260 32863 -27110 -38960 19095 43204 -544 -39970 -13520 40910 27363 -32269
2186 -32269 -32093 20414 37909 -5409 -43868 -8253 41018 15083 -34481 -27811 21072 35913
2198 35913 -12888 -41597 3614 39071 9425 -32354 -21976 29124 33186 -20411 -32995 11032
2210A1032K4911l1158m0289K0843M9448j2355m8647l321M2617K2198l8973l5840
2222c9534L3161M0653k0191m3281P53M7899J5353m7795k5118L8859L4045k2185
2234A2619m4288Q185N2050K776m9315j6027L9246L2940k9987m5091J9502M8509
2246C1119n997m6696j2331M3701K8582l8826l8204K6990M3480r055m7436p668
2258c2341M8064K0433m1071l1044K8414M1286j3151m8471J9M7459J4220m0094
2270f277k8191L0210L8976j8288m4346M074M3506J0706l9372k4486L1691L3514
2282C1717k0772l8803O925M0862O703l7521j8744L0743K7317k0782l3181R821
2294a5715L5524J683l3430j3190K8762K1313k1365k5679J0921K8358j109k8569
$$ plain form
2210 11032 35943 4785 -35504 -14661 34787 22432 -26215 -29536 13081 35279 -3694 -39534
2222 -39534 -6373 34280 14089 -29192 -28439 19460 34813 -12982 -38100 759 34804 12619
2234 12619 -31669 -23484 28566 31342 -17973 -34000 5246 38186 8199 -36892 -17390 31119
2246 31119 25122 -21574 -33905 9796 38378 -448 -38652 -11662 31818 22763 -24673 -32341
2258 -32341 15723 36156 -4915 -35959 -7545 33741 20590 -27881 -27862 19597 33817 -6277
2270 -6277 -34468 -4258 34718 16430 -27916 -23842 19664 30370 -9002 -33488 -1797 31717
2282 31717 10945 -27858 -20933 19929 26632 -10889 -29633 1110 28427 7645 -25536 -15715
2294 -15715 19809 21492 -11938 -25128 3634 24947 3582 -22097 -11176 17182 16073 -12496
2306a2496p262K5974J3465j9079j8757J0178K3072l456k3889j079J9876P048j4833
2319a238j4105J1864J7644q354j6139K377J3623M753j3737q058J3520P843r242
2332G51q262K891J1691q9j3565R04J1201q9o406n551O574R799q621q800P187O226
2348E841j380q244l290J2039K994j2245k128O115O800k806j2490L615J2991l413
2362D399q982k248P051J0030r367j0927Q985P582k447q074m504J2531O078j2871
2376b764m637O334O752L81j2641j235J3417j002p723l178K691R899l080j1415
2390h201M606O452l84k807n302N359P000o994l005L656J197K581m349k654O510
2405C665j879m048L268k99J244j502m287N943J456p204O31L664K156j605q709
$$ plain form
2306 -12496 -19758 6216 19681 602 -18155 -7977 15095 11639 -12250 -13329 6547 13595 -1238
2319 -1238 -15343 -3479 14165 5811 -10328 -7951 5672 10425 -3312 -11370 2150 9993 751
2332 751 -7511 -4620 7071 6982 -6583 -5679 5522 5433 -973 -6524 50 9849 1228 -7572 -385 5841
2348 5841 4461 -3783 -7073 4966 7960 -4285 -6413 -298 6502 3696 -8794 -5179 7812 4399
2362 4399 -4583 -6831 220 10250 883 -10044 -1059 6523 4076 -3998 -8502 4029 10107 -2764
2376 -2764 -7401 -1067 5685 6066 -6575 -7810 5607 4605 -3118 -6296 -3605 6294 3214 -8201
2390 -8201 -3595 2857 2473 -334 -5636 -277 6723 -271 -3276 380 1577 4158 -191 -2845 3665
2405 3665 1786 -2262 1006 707 1951 449 -3838 2105 3561 -3643 -3012 652 2808 1203 -7506
2420g506M106J0443m256p729n17P793P584j0143j0597J1291J1100n567j3058k194
2434i250J7476O557j8893r732J3271J4629o505k2404P33K4699M501k1783j3090
2447a9791J6478K2537j1498k8129M478K9424O389k5949j8469K2452K7609j5362
2459A0169l0923L774L3749Q880l2713k1071K7683K9961j7330l6774L683L8941
2471A8029Q944l7803k1415L0670L2054j9922m0374O311M3931Q507m0765k2283
2483c4116L3905L4825k2407m1944Q329M6494P586m4611k2637L6626L5479k4141
2495A3388m4897R121M8955N655m7009k1854L7833L6349k6585m6936J1905M9667
2507B5592L842m6244k1709M0290L6822k9960m4724J5500M7976M116m7617k0124
$$ plain form
2420 -7506 -3400 7043 2787 -4942 -5459 2334 9918 -225 -10822 469 11569 6002 -7056 -9250
2434 -9250 8226 14783 -4110 -13842 -571 14058 7553 -14851 -14118 10581 15082 -6701 -19791
2447 -19791 -3313 19224 7726 -20403 -15925 13499 19888 -6061 -24530 -2078 25531 10169
2459 10169 -20754 -16980 16769 25649 -7064 -28135 -452 29509 12179 -24595 -20912 18029
2471 18029 26973 -10830 -32245 -1575 30479 10557 -29817 -23506 20425 28932 -11833 -34116
2483 -34116 -211 34614 12207 -29737 -21408 25086 32672 -11939 -34576 2050 37529 13388
2495 13388 -31509 -22388 26567 32222 -14787 -36641 1192 37541 10956 -35980 -24075 25592
2507 25592 29434 -16810 -38519 1771 38593 8633 -36091 -20591 27385 31501 -16116 -36240
2519c6240M3880L1990l2375l9999J5039M7323P42n0087j4675M3261K5695l1040
2531C514l9107J7803M7490o485m7678p699M0359K5003l2589l7703K4969M2747
2543C0624j1156m1537n883M1310K2660l8224l0883K8279L5671j1598m0842l732
2555b5311M3983J3083l9817k2394K6795L2857j5004m2272N188M1832M376l4489
2567a1173j8666K8026L1909k2342l6760J3972L5861J911l3599j6411L3775K4753
2579C1256k7597k8035J4374L2617k33l8024r445L5952J5240k6029k5028J3919
2591a1033L4089p502l7088r99L1977J2616k4747k6101K0729L2227j3345l0315
2603a9492J224K9342J3464k8277k1061K4200K4304j2805k6740l20L0513Q543k9719
$$ plain form
2519 -36240 7640 39630 7255 -32744 -17705 29618 30360 -19727 -34402 8859 34554 3514
2531 3514 -35593 -17790 29700 23215 -24463 -32162 8197 33200 611 -37092 -12123 30624
2543 30624 19468 -22069 -27952 13358 36018 -2206 -33089 -4810 30861 19263 -21579 -25311
2555 -25311 18672 31755 -8062 -30456 -3661 29196 14192 -28080 -22892 18940 23316 -11173
2567 -11173 -29839 -1813 30096 7754 -29006 -15034 20827 22738 -10861 -27272 6503 31256
2579 31256 3659 -24376 -10002 22615 22382 -15642 -25087 10865 26105 76 -24952 -11033
2591 -11033 23056 15554 -21534 -22533 9444 22060 -2687 -28788 -8059 24168 10823 -19492
2603 -19492 -18268 11074 24538 -3739 -24800 -600 23704 10899 -15841 -16161 14352 22895 -6824
2616f824j4409K0447J9957j0171k6925J730K8463L393k3500j1549J6427K0343
2628A7382j0706k4408N407K2515M159j7443j2690J5297J7731j0585j7357L329
2640g369J6370N878j5828j1786J2642J2515o043j3465j897J2818O010j2065q689
2653a0909O376R801k2j0847m213R017P287m442p585n88R234M711p023o753L315
2668b641R349J780r570n980O988R345l303j2107k174J2121O274j0137j2311O071
2682f295J5007j025j6217n655J4114J2537j1078j6859O990J9002K264j9418r202
2695a5835J8395J6220j3630j9149N735K2370L732k4481j1244K1009J6757j4163
2707E716k2872M243K7090K284k6903r919K1119J8690j4424k6451P533K9578J37
$$ plain form
2616 -6824 -21233 -786 19171 9000 -17925 -16195 12268 15661 -7839 -19388 -2961 17382
2628 17382 6676 -17732 -12325 10190 14349 -3094 -15784 -487 17244 6659 -10698 -7369
2640 -7369 9001 14879 -949 -12735 -93 12422 6379 -7086 -8983 3835 9845 -2220 -10909
2653 -10909 -4533 5268 5246 -5601 -9814 -797 6490 2048 -5537 -6125 3109 7820 797 -5956 -2641
2668 -2641 6708 8488 -1082 -7062 -74 9271 5968 -6139 -8313 3808 10082 -55 -12366 -6295
2682 -6295 8712 7687 -8530 -14185 -71 12466 1388 -15471 -8481 10521 12785 -6633 -15835
2695 -15835 2560 18780 5150 -13999 -8264 14106 17838 -6643 -17887 3122 19879 5716
2707 5716 -17156 -12913 14177 16461 -10442 -20361 758 19448 5024 -21427 -13894 15684 15821
2720A5821k5551j0137K1305K1396j7510k5654J1466K6551jk5837j1962K5364J8613
2733B3864k1039k1637J0388K4605k50k9073p700K7332J2023j9546j9397J0261
2745a0169K6483m433k8204J80K3737R103j7942j8683J5714K3663j1237k1767K342
2758a1213K0791Q335k1676j4275K0540J5290j3068j8293K935K2716K438k5192
2770a0672n494K0051J0992j3856j9358R461K4543o794k2457K47J9678J0960j8592
2783a291j8227J8838K0347j1814k0702J114K3932P261k6220j1433K1852J5519
2795A9176j3550k3302N538K8412j065k7389o326K1729J6459j7409k4944J3776
2807h895K7769o159k6261o325K6039J7368k3869k2470J7588K5629n730k9072n490
$$ plain form
2720 15821 -9730 -19867 1438 22834 5324 -20330 -8864 17687 17686 -8151 -20113 5251 23864
2733 23864 2825 -18812 -8424 16181 15931 -13142 -20842 6490 18513 -1033 -20430 -10169
2745 -10169 16314 11881 -16323 -16143 7594 16697 -1245 -19928 -4214 19449 8212 -13555 -11213
2758 -11213 9578 17913 -3763 -18038 2502 17792 4724 -13569 -10634 12082 14520 -10672
2770 -10672 -16166 3885 14877 1021 -18337 -8876 15667 8873 -13584 -13337 6341 17301 -1291
2783 -1291 -19518 -680 19667 7853 -12849 -11735 12197 19458 -6762 -18195 3657 19176
2795 19176 5626 -17676 -12138 16274 15209 -12180 -18506 3223 19682 2273 -22671 -8895
2807 -8895 18874 12715 -13546 -19871 6168 23536 -333 -22803 -5215 20414 14684 -14388 -19878
2820a9878L1037J3505k7205k0376J7018K7279p149l3068j707L2233R710k6195
2832d796k0571J8763K9568j1516l1982J960L0430J0436k7057k0183K2252K6846
2844B4150j3883k8876K234K9949R234k8393j7230K2401K3403j3329k8427K975
2856a5792K9853O274k7482j5196K1522K1944j3603k7143M921K8141M860k6276
2868g977j3165K1469K0528j4430k3967N743K6138K463k4540j0038K0484J6498
2880A9206j4207k1486O888K3363l50k2040o696J8104J3641j4786j8129R656J9365
2893A2529k924j8510n031J7687J0207j5287j2596J0113J5164l358j7718j726J8262
2906F812N131j4424q634Q903J4086n696j7426L777J5679P84j2547q135J1342J2087
$$ plain form
2820 -19878 11159 24664 -2541 -22917 -5899 21380 14231 -18837 -20544 11689 21399 -4796
2832 -4796 -25367 -6604 22964 11448 -20534 -18574 11856 22292 -4765 -24948 -2696 24150
2844 24150 10267 -18609 -16375 13574 22808 -5585 -22815 -414 22989 9660 -18767 -15792
2856 -15792 14061 20335 -7147 -22343 -821 21123 7520 -19623 -14702 13439 18299 -7977
2868 -7977 -21142 327 20855 6425 -17542 -11799 14339 16802 -7738 -17776 2708 19206
2880 19206 4999 -16487 -9599 13764 13414 -8626 -15322 2782 16423 1637 -16492 -6836 12529
2893 12529 9605 -8905 -13936 3751 13958 -1329 -13925 -3812 11352 7994 -9724 -11450 6812
2906 6812 11943 -2481 -11115 -2212 11874 6178 -11248 -7471 8208 8992 -3555 -11690 -348 11739
2920A1739j0392j2154O121J1732J110j3837n342J5168O603j1359q283N147J2609
2933H862j451j5723N57J3915K403r143q844O968J3597o470j3523L782J0555L212
2947H697j0014r623J1050J0181q212r121Q23J0944M694j3638n555J1399O077m492
2961C210r655p58J3400J333j1895k486O176P291l058j1253K139J0974n83o308
2975a473m601L295R280l613q415K729M177L442l254p739M159O702j987l253l820
2990d371K403P103k930n929P80L056M294k133q265K017P358J282m026p340L456
3005c245J0750k415r825j945P924Q785o802j3239N307J3281P43j2602q434J2250
3019E33J3868j1022j6050L864J7693M650j9155j1888J7733J6277j1388k0273K651
$$ plain form
2920 11739 1347 -10807 -4686 7046 8156 -5681 -11023 4145 10748 -611 -8894 -3747 8862
2933 8862 7411 -8312 -7755 6160 8563 -580 -9424 -2456 11141 4671 -8852 -5070 5485 8697
2947 8697 -1317 -10940 110 10291 2079 -7042 -6219 4725 9419 -4219 -9774 1625 7702 3210
2961 3210 -6445 -7203 6197 7530 -4365 -6851 -675 6616 3558 -7695 -5556 5418 4835 -1473
2975 -1473 -6074 -2779 6501 2888 -5527 -2798 1379 4821 1567 -6172 -2013 4689 2702 -551 -4371
2990 -4371 -1968 5135 2205 -3724 -2944 112 4406 2273 -5992 -3975 3383 4665 639 -6701 -3245
3005 -3245 7505 5090 -4735 -6680 1244 10029 3227 -10012 -4705 8576 9319 -3283 -11717 533
3019 533 14401 3379 -12671 -8807 8886 13536 -5619 -17507 226 16503 5115 -15158 -12507
3032a2507K4418N498k4710j2649K0087K0348j1773k6830L515K9821N002k7832
3044g612j5059K2219K4816j5165l1271N224L2817O444l1098j7962K5724K7088
3056B6165j8084l3448O710L6235O400l4523j8153K8989K8136j9293l4727Q520
3068a7073L8111M197l6350j7221L1212K8048k2324l5321J0399L7656L045l7739
3080a3360j5858L3222K5718k4501l3043J2195L7514Q89l8963j1989L4445K2240
3092B8509k4825l1822J5065L7653l711l7734p480L3371J9747k6366k9945J9267
3104h271L4392q886l4702n026L2848J6736l0646k4256K2305K8194j0432l2217
3116a9961j605L4725R729l0722j6911K2073K5573j2698l1682N692L3143K600k8420
$$ plain form
3032 -12507 11911 17409 -7301 -19950 137 20485 8712 -18118 -14603 15218 20220 -7612
3044 -7612 -22671 -452 24364 9199 -22072 -16848 15969 22413 -8685 -26647 -923 26165
3056 26165 8081 -25367 -18657 17578 23978 -10545 -28698 291 28427 9134 -25593 -17073
3068 -17073 21038 25235 -11115 -28336 2876 30924 8600 -26721 -16322 21334 24379 -13360
3080 -13360 -29218 4004 29722 5221 -27822 -15627 21887 22776 -16187 -28176 6269 28509
3092 28509 3684 -28138 -13073 24580 20869 -16865 -24345 9026 28773 2407 -27538 -8271
3104 -8271 26121 17235 -17467 -22493 10355 27091 -3555 -27811 -5506 22688 12256 -19961
3116 -19961 -21566 13159 22888 -7834 -24745 -2672 22901 10203 -21479 -15787 17356 19956 -8464
3129h464j3405K3431K3914j9168k8487J1984K7791l50k8295j1094K8033J7886
3141B3776k4205k2058J3372K6610k767l1160m548L0384J0865k3460j8617J5294
3153f514K7767q503l0609K735K7649P876k3056j8158J9885K4462j5149k5685M936
3166a2364K5505O363k6643j4798K3670J8223j5597k2658M743K7264L021k8122
3178a1393q178K2081J5283j3461k2986P630K7441k145k4329n791J9899J5757j5772
3191D036k1740J1369K2367l630k1108o742J9801J3320j7877j6687J0391J7849
3203A1349j887j9857m802J9361Q744j4555j2270Q150J6353j828j7724j460J5615
3216E189N909j0020j0589O903J3835m071j3249q3R965N740q890r080O300R073
$$ plain form
3129 -8464 -21869 1562 25476 6308 -22179 -10195 17596 17246 -11049 -22143 5890 23776
3141 23776 -429 -22487 -9115 17495 14728 -16432 -20980 9404 20269 -3191 -21808 -6514
3153 -6514 21253 12750 -17859 -15124 12525 20401 -2655 -20813 -928 23534 8385 -17300 -12364
3166 -12364 13141 19504 -7139 -21937 1733 19956 4359 -18299 -13556 13708 16729 -11393
3178 -11393 -19571 2510 17793 4332 -18654 -11024 16417 14272 -10057 -15848 4051 19808 4036
3191 4036 -17704 -6335 16032 12402 -8706 -15448 4353 17673 -204 -16891 -6500 11349
3203 11349 9462 -10395 -15197 4164 12908 -1647 -13917 -5767 10586 8758 -8966 -10426 5189
3216 5189 11098 1078 -9511 -2608 11227 7156 -6093 -6176 3789 9529 639 -8441 -2141 6932
3230F932l853q266q85P752L531p164m794M507N321j176n025q7M832J571l300j360
3246a464K031K207p31j513Q5R36m17m69R05o95j752K3J885J3k510j804K412L026
3264B168k456m341J466M655O46m849l288O052M752l929n414J623P849J244q062
3279a884l388P424N114m826p659J589J0091k05j0553k807P480O462n617j0199
3293h978L668J0730j296r050l457Q483Q391p608r718N427R717m3r065m442J0571
3308C330O727r102p150M158R258M27j1782k348J0730K511p004o242K950J0014
3322F477l193j0761J557Q294K197o085o460O873P926o164n917K594O565K154q255
3337b198l168R074K586o018l943K388P654k425r887K771P330p73n606m598O305
$$ plain form
3230 6932 3079 -5187 -6072 1680 5211 -1953 -6747 -2240 3081 1905 -3120 -3207 1625 3196 -104 -1464
3246 -1464 567 2774 2043 530 615 1551 1134 665 1570 875 -877 -854 1031 1044 -1466 -3270 -858 2168
3264 2168 -288 -4629 -3163 1492 2138 -2711 -5999 53 4805 876 -4538 -2915 4934 6178 -1884
3279 -1884 -5272 2152 7266 2440 -5219 -3630 6461 6256 -4297 -7104 376 6838 1221 -8978
3293 -8978 -5310 5420 4124 -4926 -8383 100 8491 883 -8835 -3408 6309 6266 -2799 -7241 3330
3308 3330 10057 955 -6195 -2037 7221 7648 -4134 -6482 4248 6759 -245 -6487 -3537 6477
3322 6477 3284 -7477 -5920 2374 4571 -1514 -7974 -1101 6825 661 -5256 -2662 3903 6057 -2198
3337 -2198 -5366 3708 6294 276 -3667 -1279 6375 3950 -5937 -3166 4164 3391 -2215 -6813 -508
3352e08P080q092o854O134O524n73r821k311J2949K952j1055m439P581J0519m618
3367E468j4793L501J5492L4j2920o992J1424J3319j1620j5872P197J5797O62j7925
3381g228q689J8555J2638j5319j5302P538K0079O7k3237n478K2467J1205j6021
3394A275j8220R715K4607l779k5402l106K3072J2162j9201k1554J4266K5862p332
3407A2365k6590l416K5394J2951k3513k1000J7705K5222p816k8276k569K9677
3419A0134J1532k5889j8818J9092K5649r266l0123L74L0792Q876k6910j8059K0178
3432b438K5615j2473k9795L132K9455P162k7742j6460K1882K3570j4465k7855
3444b0412N243K9187M317k7800j2855K3675K0785j6406k5832Q410K8728O10k7357
$$ plain form
3352 -508 6572 -1520 -8374 -2240 4284 3711 -6110 -8421 4528 7480 -3575 -8014 -433 10086 5468
3367 5468 -9325 -5824 9668 9702 -3218 -10210 1214 14533 2913 -12959 -5762 10035 10697 -7228
3381 -7228 -15917 2638 15276 -43 -15345 -7807 12272 12339 -10898 -16376 6091 17296 1275
3394 1275 -16945 -7230 17377 13598 -11804 -14910 8162 20324 1123 -20431 -6165 19697 12365
3407 12365 -14225 -17641 7753 20704 -2809 -23809 -6104 19118 11302 -16974 -19543 10134
3419 10134 21666 -4223 -23041 -3949 21700 12434 -17689 -17315 13477 22353 -4557 -22616 -2438
3432 -2438 23177 10704 -19091 -15959 13496 20658 -7084 -23544 -1662 21908 7443 -20412
3444 -20412 -15169 14018 18335 -9465 -22320 1355 22140 5734 -20098 -11688 17040 17650 -9707
3457i707j0105K4900J7872j9656k3262J1501K6380k576k7482o425K5586J3332
3469B0358k1425j9466J3755K4957o337k7228j522K5688R619k1236j7130J6400
3481c567K2956j1017k4233L115K4175O591k2918j4001J9890J8262j3807k1231
3493a5785N058K3855K523k5110q816K1208J4408j4531k0568P628K4869k237k4571
3506a2069m075K0580J3032j6104k0120J2761K2404n962k1506l463K1165J2247
3518A8890k0460j6096J4475J8759n726k1537k529K2868P683k0271j1801J2863
3530b882J7497n670k2131Q15K1283M078j6122j1235J1579J7797q242j8965L175
3543i023J6540N010j3971j2166J2530J4667q775j3871Q46J4141N985j4455r406
$$ plain form
3457 -9707 -19812 5088 22960 3304 -19958 -8457 17923 15347 -12135 -18560 7026 20358
3469 20358 -1067 -20533 -6778 18179 11842 -15386 -16908 8780 18399 -2837 -19967 -3567
3481 -3567 19389 8372 -15861 -12746 11429 18020 -4898 -18899 991 19253 5446 -15785
3493 -15785 -10727 13128 15651 -9459 -18275 2933 17341 2810 -17758 -10130 14739 12502 -12069
3506 -12069 -16144 4436 17468 1364 -18756 -5995 16409 10447 -11059 -14522 6643 18890
3518 18890 -1570 -17666 -3191 15568 9842 -11695 -14224 8644 16327 -3944 -15745 -2882
3530 -2882 14615 8945 -13186 -12371 8912 12990 -3132 -14367 -2788 15009 6767 -12198 -9023
3543 -9023 7517 12527 -1444 -13610 -1080 13587 4812 -9059 -8213 5928 11913 -2542 -11948
3556a1948J1224R989m570j1434k063J3495M540j1882n708O278Q772p26j1806j328
3570g167J0231L040n468o334J340R831k55q565j595M498N271j239q371p8P348
3585B487J777l468n238M71Q251M95p323k851L951O920j140r088o89Q345L721n782
3601H39p957L257J0907n09j1103l221Q558Q643o405j2483M029J3135Q37j2174
3615c647p315J1504J1440q104j4231L395J4670L293j4922q623J2902J2696q822
3628D236j5714K434J7483L993j7184r168J3473J4286q932j7554K915J8954L468
3641A2690j8296r627J4894J4874r291j8514L558J9732L196j8789r219J5674J4802
3654A5684j0635j8586M348J9887K085j9419q076J5618J3623j0942j8029N814J9326
$$ plain form
3556 -11948 -724 9265 4695 -6739 -8802 4693 9233 -2649 -8357 -2079 6693 5967 -5839 -7167
3570 -7167 3064 6104 636 -5698 -4358 5473 5218 -3347 -4942 -444 4827 3588 -4783 -4861 2487
3585 2487 4264 796 -4442 -3971 4280 4775 -2548 -5399 -1448 5472 4332 -4756 -5445 2900 6621 839
3601 839 -7118 -3861 7046 6537 -4566 -7787 771 9414 3009 -9474 -5445 7690 8527 -3647
3615 -3647 -10962 542 11982 3878 -10353 -6958 7712 11005 -3917 -12540 362 13058 4236
3628 4236 -11478 -9044 8439 12432 -4752 -13920 -447 13839 4907 -12647 -9732 9222 12690
3641 12690 -5606 -15233 -339 14535 5244 -13270 -9712 10020 13216 -5573 -14792 882 15684
3654 15684 5049 -13537 -9189 10698 12783 -6636 -14712 906 14529 3587 -14442 -8628 10698
3667A0698K84j7826p044J5626J2787j2492j5927P439J7463m07j7717n956J7379
3680D307J0351j4034j2895P983J6081k099j8683k293J7702O240j3806j1399Q879
3693c666J6125o160j7639K227J5635M486j3940j1147J3294J4204r691j4455L229
3706g498J5594L494j6774p382J5560R889r936j3714M041J7315k43j8632k860J4890
3720C744Q472j1254j4901Q413J7861n150j7167j886J5877R407j5248j4304J3166
3733b970J5990n981j7392k082K0372P377j8661j0945J3629J5210o739j9968R23
3746a1237K1948L440j8820j0074J2802J6933q812k0960M434J9919K916j7364j1369
3759a6244J5408J6932j1463j8822N073J9034L954j9012j0344J8006J3936j2280
$$ plain form
3667 10698 10982 -6844 -13888 1738 14525 2033 -13894 -6455 11008 10601 -7116 -13072 4307
3680 4307 14658 624 -12271 -4288 11793 9694 -8989 -11282 6420 12660 -1146 -12545 -3666
3693 -3666 12459 6299 -11340 -9113 6522 11008 -2932 -14079 -785 13419 3728 -10727 -7498
3706 -7498 8096 11590 -5184 -12566 2994 12883 2947 -10767 -6726 10589 10346 -8286 -11146 3744
3720 3744 12216 962 -13939 -5526 12335 7185 -9982 -11868 4009 13416 -1832 -16136 -2970
3733 -2970 13020 7039 -10353 -12435 7937 15314 -3347 -14292 -663 14547 7808 -12160 -11237
3746 -11237 10711 14151 -4669 -14743 -1941 14992 6180 -14780 -10346 9573 12489 -4875 -16244
3759 -16244 -836 16096 4633 -14189 -9116 9918 13872 -5140 -15484 2522 16458 4178
3771D178j6646M117J9769K274k0617p076J7264J1629j1548j7282N482K0009j117
3784A0436j9117n098J5393J1478j1711j5974Q182J7356k184j6084m700J5302J0430
3797A3709j2769j2700Q187J4147k155j5035l216J4645O708j1992r761P064J2039
3810H871l256j3766n4J2503L813j0689p771P882J0446n072j0767K215J0746J832
3824F933r995m445R036O988o228q452L788R275q72r425j538Q219L770p545o307
3839f798N557P141l073q288J76Q406J764q346k926O743N129m677p237L126Q992
3854E689j515p920p87P295M374o616o638N700P427l094p785p23Q369K636q575
3869b163m501O213N706l488q471M72R948M38p957k414N444O283l825q384L545
$$ plain form
3771 4178 -12468 -8351 11418 13692 -6925 -14001 3263 14892 3344 -13938 -8456 11553 10436
3784 10436 -8681 -13779 1614 13092 1381 -14593 -6411 10945 8761 -7323 -12023 3279 13709
3797 13709 940 -11760 -3573 10574 8419 -6616 -9832 4813 11521 -471 -10232 -3168 8871
3810 8871 5615 -8151 -8205 4298 8111 -2578 -10349 -2467 7979 2907 -7860 -5645 5101 6933
3824 6933 -3062 -7507 1529 8517 2289 -6163 -2375 6900 6028 -3397 -4935 3284 7054 -491 -6798
3839 -6798 -1241 5900 2827 -5461 -5285 3121 4885 -3461 -6387 356 5485 808 -6429 -3303 5689
3854 5689 4174 -3746 -4533 2762 7136 520 -6118 -418 7009 3915 -3870 -4593 3776 6412 -2163
3869 -2163 -6664 -451 5255 1767 -6704 -6232 3716 4154 -3803 -6217 -773 5510 1685 -6699 -3154
3884c154Q286o58o231l158N638O030n361n666L718M466K66n766l268O578K870
3899D590m704l096M49M338J227o020r6L438R34p40k459k77M010k30j830P90p07
3916c83J406J490k076J15o5j97K914j500l605J296J924J354j921n499L360N091
3932C704k949m453r81M925N104o723o245N922O519j168p998k864J0781N159r409
3947f76o747N252J0729q73j3870k106J3594N204j0817j0380O438J5275l708j7489
3961a0174j005J5484P579j2747j4409J0589J7465o167j7433j603J7992R989j7065
3974a505j4527J3127J8256n900j9996k158K1686Q494j9649j3889J3378J8987o410
3987I894k3087q96K3242O813j9736j4444J4289K0618q583k3987K082K3267O784
$$ plain form
3884 -3154 5132 4474 -1757 -4915 723 6753 1392 -4274 -556 3910 4176 -1590 -4858 1720 4590
3899 4590 -114 -3210 -2761 1577 2804 -3216 -3312 126 1060 320 -2139 -2416 1594 1364 -466 324 -383
3916 -383 1023 2513 437 552 487 290 3204 1704 -1901 -605 1319 2673 752 -4747 -1387 3704
3932 3704 755 -3698 -4679 246 5350 -1373 -7618 -1696 4823 3655 -4343 -7207 3574 8733 -676
3947 -676 -7423 -2171 8558 7685 -6185 -8291 5303 10507 -310 -10690 -4252 11023 7315 -10174
3961 -10174 -11179 4305 11884 -863 -15272 -4683 12782 6615 -10818 -12421 5571 15560 -1505
3974 -1505 -16032 -2905 15351 9451 -10545 -12703 8983 17477 -2172 -16061 -2683 16304 9894
3987 9894 -13193 -14089 9153 15966 -3770 -18214 -3925 16693 8110 -15877 -13795 9472 16256
4000A6256k0428j4554J7067J9970j0443k2678L131K3417N665k2523j2604J8456
4012G32J7878j2137k1996M212K3919K658k3003j0280J8815J6533j3669k0578O807
4025a0109K2491L69k2166p398J9566J3778j4728j8090Q712K1278j666k1083m785
4038a3831J9536J0940j5715j6211J0618J9636m952k0858j854J9151Q196j6781
4050b125j4014J3162J7186p522j9242L75J9929O145j8612j0582J5170J4659r276
4063E253j8022L559K0160K411j9039p503J5104J3279j0617j7934O301J8930r81
4076A0901j7878o356J5798J2468j3796j5858Q338J6985j095j7961n732J7732J0606
4089A4152j4901j3095Q470J7140j689j9582k447J8617O838j3630j3000Q694J8026
$$ plain form
4000 16256 -4172 -18726 -1659 18311 7868 -14810 -11679 11738 17403 -5120 -17724 732
4012 732 18610 6473 -15523 -11311 12608 15266 -7737 -18017 798 17331 3662 -16916 -10109
4025 -10109 12382 12751 -9415 -16813 2753 16531 1803 -16287 -7575 13703 12037 -9046 -13831
4038 -13831 5705 16645 930 -15281 -4663 14973 10021 -10837 -12691 6460 14656 -2125
4050 -2125 -16139 -2977 14209 6687 -12555 -12180 7749 13894 -4718 -15300 -130 14529 5253
4063 5253 -12769 -9210 10950 13361 -5678 -13181 1923 15202 4585 -13349 -7048 11882 10901
4076 10901 -6977 -13333 2465 14933 1137 -14721 -6383 10602 9507 -8454 -14186 3546 14152
4089 14152 -749 -13844 -5374 11766 10077 -9505 -11952 6665 13503 -127 -13127 -4433 13593
4102A3593n015j8740l74J6122P314j3372j3975J0648J6041n842j6016j241J4778
4115C921Q609j4409j1760J1127J2969m179j4120k538J6088O139j3323q607P752
4128b331J1886k022j4550j281J3542M141j0074q166N473J2084k705j3007M6R678
4142B714M531p153q557N768J0119l807q257j293P445N899o783p291M894O401n80
4157D050o245l454P016M571n260m728J587M785J877n467l280M547K671j411l430
4172b171j544M421K283l270k352L23L407J733l700k061K545K601J91l632j983
4187c209L790L266k603l604m08M464K206m581l293L215M540j143n624j538O158
4202A636L199m473n141K506O601j10p780j839P100M324m895o808K365Q924m23
$$ plain form
4102 13593 8578 -10162 -10536 5586 12900 -472 -14447 -3799 12242 6400 -9616 -10857 3921
4115 3921 12530 -1879 -13639 -2512 10457 6278 -7842 -10380 5708 11847 -1476 -10083 -2331
4128 -2331 9555 7533 -7017 -8298 5244 9385 -689 -8855 -3382 8702 5997 -7010 -6964 2714
4142 2714 7245 92 -8465 -2697 7422 3615 -4642 -5935 1510 7409 626 -6665 -1771 4630 4050
4157 4050 -2195 -5649 1367 5938 678 -4050 -2463 2322 4199 -1268 -4548 -1 2670 1259 -2171
4172 -2171 -3715 706 2989 -281 -2633 -2310 1097 2830 -870 -2931 -386 2215 2406 -1226 -3209
4187 -3209 581 3847 1244 -2360 -2768 1696 3902 -679 -3972 -757 3783 2640 -2984 -4522 1636
4202 1636 4835 362 -4779 -2273 4328 4218 -3562 -5401 1699 6023 1128 -5680 -3315 5609 5186
4217E186q456k616P247N443n629p621K901R279o2r441k975Q092N877o080q296
4232g151L389R928p54j0024k234Q836N549o539q972M816R626j784r569k065R319
4247B371N299q341p458O336Q518k238r842j062J0267L237q999n345O052Q089l268
4262C616j0097J559J0003Q30q397m455P029P563o187q746M402Q297l16r098l356
4277g353R901N450r184o676N961Q519j798j1228JJ1755K032r719n333P285R844
4292I457o362j2122M487J1585K59j1158n486J1263Q678j0261j0437N811J2284
4305G998m98j4204l963J4887O306j1502r938O859J4570l361j6782j80J5964N322
4319A1478j2572j1515J0180J5789p456j6515J746J5982N505j6144j1295J4505
$$ plain form
4217 5186 -3270 -5886 1361 6804 1175 -6446 -3545 5734 5672 -3769 -6744 1348 7225 1145 -7151
4232 -7151 -3762 6166 5412 -4612 -6846 1990 7539 1000 -7972 -3156 6470 4686 -4883 -6948 2371
4247 2371 7670 -671 -8129 -1793 6725 4487 -5355 -6417 3850 7087 -1912 -7257 -1205 6884 3616
4262 3616 -6481 -4922 5081 5911 -2486 -6941 88 7651 1464 -7282 -2880 5417 5101 -3997 -7353
4277 -7353 2548 7998 -1186 -7862 -1901 6618 4820 -6408 -6407 5348 7380 -2339 -7672 -387 9457
4292 9457 3095 -9027 -4540 7045 7304 -3854 -9340 1923 10601 340 -10097 -4286 7998
4305 7998 7500 -6704 -10667 4220 10526 -976 -10914 -4055 10515 7154 -9628 -9808 6156 11478
4319 11478 -1094 -12609 -2429 13360 5904 -10611 -8865 7117 12622 -3522 -14817 -312
4331c12J4102r746j5776K012J8457M095j9250q022J5378J2953r676j7399L934
4344i250K0417P64j8779o301J4906J3275j1408j7663P319J8668j008j7812o298
4357a3170J6393J1932j3987j5165Q878J6713k117j8427m378J7815Q856j4612j2324
4370a3593R338J6281m138j7856p21J7539N709j4228j0583J0505J4694o707j6450
4383a0210K240J5773L467j4809q587J2201J1758q782j3636L407J4688J140j4771
4396f121n033J2881Q395r165j1779N419J4101j773j3826k094J3352O272j1263
4409f34r225Q158J2063m449j3484J87J3502L683j2407p391R653J0573o926j3301
4423i998L186J3642R31j2699n535J1250R260q250j2029N241J2983j5j3323l687
$$ plain form
4331 -312 13790 4044 -11732 -9720 8737 12832 -6418 -14440 938 13891 4215 -13184 -9250
4344 -9250 11167 11931 -6848 -13149 1757 15032 3624 -14039 -6720 11948 10940 -6872 -13170
4357 -13170 3223 15155 1168 -13997 -5119 11594 9477 -8950 -13328 4487 13343 -1269 -13593
4370 -13593 -4255 12026 7888 -9968 -10689 6850 12559 -1669 -12252 -1747 12947 6240 -10210
4383 -10210 -7970 7803 11270 -3539 -12126 75 11833 3051 -10585 -7178 7510 8650 -6121
4396 -6121 -11154 1727 10122 957 -10822 -5403 8698 6925 -6901 -8995 4357 10629 -634
4409 -634 -9859 -1701 10362 5913 -7571 -7384 6118 9801 -2606 -9997 -344 10229 3303 -9998
4423 -9998 -6812 6830 7761 -4938 -10473 777 10037 1787 -10242 -5001 7982 7967 -5356 -9043
4437i043J2321P355r405j0146N371J2745j242j3983k583J2276O011r214j0426
4450i963O096J2605l063j2971j330J1249O135r509r483P259J0777l226j0538j452
4464g414J0911O031j0272p501O740R036j979r942j951J0656L649q733n730M352
4478b147Q015j247j0011o49Q377K778n306o208K865Q104j555p185n10N299M280
4493D900l328o489K923N773j72l730l107L326M988k982m436N78L031K835l292
4508H18m615K305L877l94k690l218K690M749k702m013J72L327L644l701m839L202
4524a388M807m76m046l300N193N253m260n265J081N582K586o562m924N909N159
4539E349k763p130r78Q304L213q346m845M795P367j169r490r34J0125L243p711
$$ plain form
4437 -9043 3278 10633 1228 -8918 -3547 9198 7956 -6027 -8610 3666 9677 463 -9963
4450 -9963 -3867 8738 5675 -7296 -8626 2623 8758 -751 -10234 -2975 7802 4576 -5962 -7414
4464 -7414 3497 9528 -744 -8245 -1505 7531 5552 -4390 -6341 4315 7964 -769 -6499 -2147
4478 -2147 5868 4621 -5390 -6039 2338 5116 -190 -6398 -3533 4571 3016 -4169 -4679 620 4900
4493 4900 1572 -4917 -1994 3779 3607 -123 -3230 96 5084 2102 -2334 -1756 1275 4110 818
4508 818 -3797 -1492 2385 1991 -699 -3917 -1227 3522 820 -3193 -3021 306 3950 249 -4590 -1388
4524 -1388 3419 2943 -1103 -4403 790 6043 1783 -3482 -2401 3181 5767 -795 -5719 190 5349
4539 5349 2586 -4544 -5522 2782 5995 -2351 -7196 -2401 4966 3797 -5693 -6627 3498 6741 -970
4554i70o224N054R748k295j0746k44R703M252q029q212N932J0336l407j0878r00
4569f880R975N276r255q610O856J0170l001j1064j591J1490N201r995p682O846
4583b264J0439k670j1490q06J1881M621j0211p790O958J0666l727j2138K6J1801
4597E296L260j0641p519Q316R564m706j1702J041J2020K494j0862o233R528Q916
4611H772o305j0930L015J1803J282j1002m972R900Q100p530j0242M398J1102j11
4625G280j1958l792J0780O589q772r373M992J1408j638j2715j633J1844N295r229
4639i22q857O971J1725l960j2591O52J2197M591j1160q549R728J0840o254j1992
4653g581J099J2907L655j3396p099J0983R636p003j2723K031J4696J160j3608
$$ plain form
4554 -970 -7194 -2140 7608 5313 -5433 -5677 4026 8278 249 -7963 -2031 8305 4898 -5980 -6880
4569 -6880 3095 8371 -884 -9494 -2638 7532 4531 -6533 -8124 3366 8567 -1428 -9110 -2264
4583 -2264 8175 5505 -5985 -6791 5090 9711 -500 -8290 -1332 9334 5607 -6531 -6505 5296
4597 5296 8556 -2085 -9604 -1288 8276 3570 -8132 -7091 4929 7423 -3439 -9672 -144 8772
4611 8772 2467 -8463 -5448 6355 7637 -3365 -8337 1563 9663 2133 -8109 -3711 7391 7280
4625 7280 -4678 -8470 2310 8899 127 -9246 -4254 7154 5516 -7199 -8832 3012 8307 -922
4639 -922 -9779 -2808 8917 4957 -7634 -6982 5215 9806 -1354 -9903 -175 10665 4411 -7581
4653 -7581 -6482 6425 10080 -3316 -10415 568 10204 3201 -9522 -7491 7205 8365 -5243
4666e243n527J1007J0266p549j3899M451J5292J20j3707n547J1902J1116r865
4679B817j3578O329J3871o13j4311n658J3587R630j1222j1557N654J3500l03j5743
4693g597l696J4449P159j0506j1091O058J4811k253j5008j183J2874O393r923
4706D87j1046P329J3262l581j2661j372J1225O630j0410r883P859J0488l366j1204
4720f243k050J1768M969j0384o544O267Q757k308j0621j11J0953K222q179m646
4734f150N214P854l569q350J866P258P79n743m096N253N633m851n305K061M953
4749B807M83n599k164N498K193l993k571J718M060q40m520J010L816J55k834j122
4765a903K513K295k878k092K297K052j333k684K29L526M8l674m68K766J572k850
$$ plain form
4666 -5243 -10770 237 10503 2954 -10945 -6494 8798 8918 -4789 -10336 1566 12682 2817
4679 2817 -10761 -4432 9439 8826 -5485 -11143 2444 12074 852 -10705 -5051 8449 8146 -7597
4693 -7597 -11293 3156 10315 -191 -11282 -5224 9587 7334 -7674 -8857 4017 10410 487
4706 487 -10559 -3230 10032 6451 -6210 -7582 3643 10273 -137 -10020 -2161 8327 4961 -6243
4720 -6243 -8293 3475 8444 -1940 -8484 -2217 6540 4232 -6389 -6500 4453 6675 -1504 -6150
4734 -6150 -936 6918 3349 -5001 -3135 4123 4902 -841 -4937 316 5949 1098 -4207 -2146 2807
4749 2807 3290 -2309 -4473 1025 3218 -775 -3346 -1628 2432 1592 -2928 -1918 1898 2053 -781 -1903
4765 -1903 610 2905 27 -2065 232 2284 951 -1733 -1504 2022 2070 -1604 -2072 694 2266 -584
4781e84k506K154L407j821l597O43L951J106l814k117L388L347k727l886J406
4796a650M498K67m398k052M479K515l112l526J758M166m52m485j373M330K224
4811C189l313l269K208L807r01m395L28L596J188k795k576K459L193j428l097
4826a806O01K197Q77k286j554K335J275j220j268K34J179L99k321O85J318p93
4842a48l84j26N13P50j418k16K239r06j474J94J086J782j928k598K672K303j564
4859G77k712m23M089J687m775k301L546L679k031n123L99O756K92o056k235M373
4875e8N677l498p729K392P755N0p190l387O682O540o279p415L268Q235P19r135
4891c373m079R197O105p205p548L026J0261K08j1383k950J0238N600o818r140
$$ plain form
4781 -584 -3090 -936 2471 650 -2947 -2304 1647 2753 -1061 -3178 210 3557 830 -3056 -1650
4796 -1650 2848 3115 -1283 -3335 1144 3659 547 -2979 -1221 2945 2493 -1992 -3365 965 3189
4811 3189 -124 -3393 -1185 2622 1721 -2674 -2346 1250 2438 -357 -2933 -474 2719 1291 -1806
4826 -1806 -1205 992 1869 -417 -1971 364 1639 419 -849 -615 564 963 -1358 -673 645 -148
4842 -148 -532 -658 -145 605 -813 -1029 1210 304 -1170 -976 110 1892 -36 -2634 38 2341 777
4859 777 -1935 -2358 1731 3418 -1357 -3658 -112 3567 1536 -3587 -3188 3568 3860 -2196 -4431 -58
4875 -58 5619 2121 -5608 -3216 4539 4589 -2601 -5988 694 7234 955 -6460 -3192 5043 5762 -3373
4891 -3373 -7452 1745 7850 645 -6903 -3877 6384 6592 -4791 -7741 2497 8097 1279 -7861
4905g861L399J2097j314j2081j659R863O505q003j0310O007J1439k621j1151k413
4919h103J0616O892r999q970O954J0321k545j1266k211J2467N233j0973p418O687
4933b315J0792k815j2743l39J2208L657r986p477P047J0825m891j1435J205J0784
4947D517L158r639p440Q796R205n627j0423K074J0898K246j0978n019R290P281
4961H339o131r380K957J0946J2j1311k796R403O327p145r304M615J0437j887j0659
4976e577j392R427N216q353p767O347R440l036j0225r35J0572M178r198o869P076
4991a096R026l666j0807N75J0550L146r726o320P654Q830n253j0204J534J0864
5005E107K259j0774n308Q413Q399n788j0282K655J1276J093j0726m330Q776Q263
$$ plain form
4905 -7861 -4462 7635 6321 -5760 -7419 2444 8949 946 -9364 -3357 8082 5461 -5690 -8103
4919 -8103 2513 9405 -594 -9564 -2610 7711 5166 -6100 -8311 4156 9389 -1584 -9002 -2315
4933 -2315 8477 5662 -7081 -7420 4788 8445 -1541 -9018 -1971 8854 3963 -7472 -6267 4517
4947 4517 7675 -1964 -9404 -608 8597 2970 -7453 -5379 5519 7765 -3213 -8232 1058 8339
4961 8339 2208 -7172 -4215 6731 6743 -4568 -7364 2039 8366 1221 -8083 -3468 6969 5082 -5577
4976 -5577 -6969 2458 7674 -679 -8446 -2099 7341 4305 -5920 -6855 3717 7895 -1303 -8172 -1096
4991 -1096 7930 4264 -6543 -5968 4582 7728 -1998 -8318 -664 8166 2913 -7291 -5757 5107
5005 5107 7366 -3408 -8716 -303 8096 2308 -7974 -5319 5957 7050 -3676 -8006 770 9033
5019I033o504j0275L720J0808L16j0625m401Q807Q201p303r891L750J0092Q85
5033F613j0705m715R767P115o743r341L065J0757R08j0773l753R133O673n810
5047B191r182K716J0857J3j0118k982P296O976n022r792L408R092N1q149m178
5062f823O781O889n465p792K414P318J376o931m170O339N582m210n621M42O795
5077B924K433o659l507M942M447j808n439q22O313J748n342k608J949M392m97
5092B466n194p94M649J194j995l955Q83N004k97l304j330J859L890j067m256M01
5108a846L485J207j994k972R35M423n68l393j471K181L134j387m801J022L567
5123A522R16l077l493K578M678j544m507k88L934L220l865m572L345N177o90n210
$$ plain form
5019 9033 2529 -7746 -4026 6782 7098 -3527 -7928 879 9080 1777 -8114 -4364 5728 6613
5033 6613 -4092 -8807 960 8075 1332 -8009 -4944 5813 6721 -4052 -7805 1328 8001 2191
5047 2191 -6991 -4275 6582 6595 -3523 -6505 791 7767 2745 -7047 -3639 5453 5504 -2645 -6823
5062 -6823 -42 6847 1382 -6410 -3996 3322 4698 -2233 -6403 -64 5518 1308 -4313 -3871 2924
5077 2924 5357 -1302 -4809 133 4580 2772 -2667 -3489 2824 4572 -770 -3378 -1429 2963 2466
5092 2466 -2728 -3522 1127 2321 326 -3629 -2746 2258 1961 -1343 -2673 -814 3076 2009 -2247 -1846
5108 -1846 1639 2846 852 -2120 -1185 3238 2670 -723 -2194 -13 3121 1734 -3067 -2045 1522
5123 1522 2438 -639 -4132 -1554 3124 1580 -2927 -3215 719 3939 74 -4498 -1153 4024 3334 -1876
5139a876j744M984L983m766m872K865N435l50o410k055O060L283m622n045K164
5154b966O765n26p089j374O584L215m590n660L410P133j588o816p89O764L487
5169E960n584n904M860O559k320p242o25P423K370o656m997N351O138l292p434
5184e393J002P779J294p372l529O453N780m763p131K880Q014J3q292k458Q157
5199B434M615o045o975L802Q717k027r330q44Q719L579p643o528N851Q056l791
5214B590r068N36R679L017r547n594Q178P769m765r700J849J1149J195j0442m387
5229g541Q908P520o300j0551L646J1556n64j1139l506R580P364q518j0262O099
5243c708J0785j560j1294k894J1410O346j0123q221O364J1198k298j2620j283
$$ plain form
5139 -1876 -3620 1364 5347 581 -4291 -1426 4009 3659 -2751 -4806 1254 4537 -85 -5130 -2966
5154 -2966 3799 3273 -3816 -5190 1394 4609 19 -5641 -2231 4902 3314 -3502 -4291 2473 5960
5169 5960 376 -5528 -668 5891 3571 -3671 -4296 3127 5497 -1159 -6156 -805 5333 2041 -5393
5184 -5393 -4391 3388 4682 -2690 -6219 234 6014 1251 -5880 -3000 5014 5027 -3265 -5723 2434
5199 2434 7049 1004 -5971 -2169 6548 4521 -4809 -5653 3066 6645 -998 -7526 -1675 6381 2590
5214 2590 -6478 -5942 3737 6754 -2793 -8387 -209 7560 2795 -6905 -5056 6093 7288 -3154 -7541
5229 -7541 1367 8887 2587 -7964 -4318 7238 6674 -4465 -7971 1609 8973 455 -9807 -3708
5243 -3708 7077 5517 -5777 -8671 2739 9085 -1038 -9259 -2895 8303 6005 -6615 -7898
5256g898J2529M712r855q157O746J1525l915j2995L61J2199L506j0200q395Q021
5270a816J1214n776j1807J579J1016L747j1102o944R780Q490n524r931J391J1386
5284E703J949j1404m095R077O926n543r801L073J0865m32j0064k817P685O173
5298G295o413q603M628Q792j535q496k241Q115M972p578n432M835O849j616p960
5313d388n20Q417J897o484l664M698N604k548p718J959O770n2o058k523N244M594
5329E228n178n195L416N200j005n970j031O519K092n356l307L755M835j773o317
5344d087J218O466M06n142k971M726M621l884n697K463N288K83o039k449N546
5359G48M089m640n126K605N981q14o409j177O410K833m811m531L056O258j492
$$ plain form
5256 -7898 4631 9343 -512 -8669 -1923 9602 5687 -7308 -6947 5252 8758 -1442 -9837 -1816
5270 -1816 9398 3622 -8185 -6606 4410 8157 -2945 -9889 -109 8381 2857 -7074 -5683 5703
5284 5703 7652 -3752 -7847 1230 8156 2613 -7188 -4115 6750 6318 -3746 -6563 1122 7295
5298 7295 882 -7721 -3093 5699 4164 -4332 -6573 1542 6514 -1064 -6496 -1661 5188 3572 -4388
5313 -4388 -4908 3509 5406 -1078 -4742 -44 5560 3012 -4706 -2747 4023 3971 -2087 -4610 634 5228
5329 5228 50 -5145 -1729 3471 2466 -3504 -4535 1984 4076 -1280 -4587 -832 4003 2230 -4087
5344 -4087 -2869 3597 4003 -1139 -4110 616 5237 1353 -4344 -1881 3407 3690 -2349 -4798 748
5359 748 4837 197 -4929 -2324 3657 2843 -3566 -4743 1667 4500 -311 -4842 -1786 4472 2980
5374B980o140m80N875K488n131m097L573N447j520o240o82N934K155m672l922
5389d432L298M858j499n948l7N706J666m154l478L176M451j561m615j94M223K257
5405C717l553l203K348L594r21l120j164L565J657k988k266J272K533L82l070
5420a217j235K488J575j283j954qK302J183k500r77J164J290Q27k029j169J769
5436B26J184l78j513j022K150J530k166j078l07K202J318k967j261J821J918l91
5452A266k977j091L964J369l018k112J288L648Q1m522r12M598J860k910l694J237
5468a925N743p53n544q37M029L399l217n222K192N999r36n139k090M965M399m453
5484F10n610K962N574J89o126k469O151M310n017n311J873P256N08p993j899O610
$$ plain form
5374 2980 -3160 -3640 2235 4723 -408 -4505 -932 4515 2995 -3245 -3927 2007 4162 -510 -4432
5389 -4432 -1134 3724 2225 -3723 -3760 1946 3612 -542 -4020 -844 3607 2046 -2569 -2763 1460 3717
5405 3717 164 -3039 -691 2903 1982 -1138 -2302 1263 2920 -68 -2334 -1062 1471 1853 -1217
5420 -1217 -2452 36 1611 328 -1626 -1634 668 1851 -649 -1626 -462 828 1655 -374 -1543 226
5436 226 1410 1032 -481 -1503 647 2177 11 -1067 -1374 828 2146 -821 -2082 -261 1657 1266
5452 1266 -1711 -2802 1162 2531 -487 -2599 -1311 2337 2418 -2104 -3016 1582 3442 532 -3162 -1925
5468 -1925 3818 3065 -2479 -3316 713 4112 895 -4327 -2135 3864 2928 -2211 -4301 664 5063 610
5484 610 -5000 -2038 3536 3725 -2401 -4870 1281 5591 574 -4737 -2864 4392 4900 -3093 -4992 1618
5500A618L774m495o122K169Q266j090p886j097O445M119n280o629M007P627j950
5515C476p308j059O722M355o647n995N446O614k310p546j119Q201L362p612n222
5530f642N337P305k568q736M30Q805J765p493n031O429P183m333q343J507Q976
5545D591J233q407m074P316O599n765q018K988Q784K86q993l371Q444N519o405
5560G27p731L909R270j225r520j684Q861M689p358p524N660R407k812j0210q23
5575f364R985M202q883p075O522R184l464j0871N87J0626L256r767o890P867R103
5590H018m988j0520J479J1183K417j0298n891Q756Q591n882j0105J997J1009J609
5604G375j0994m612Q975P637o024j0143K991J1168K51j0646l963Q970P198o579
$$ plain form
5500 1618 5392 897 -5225 -3056 5210 4120 -3766 -4863 1582 5701 421 -6208 -2201 5426 3476
5515 3476 -3832 -4891 1831 6186 -461 -6456 -1010 5604 3294 -4252 -5371 2830 6192 -1420 -6642
5530 -6642 -1305 6000 3432 -5304 -4874 3931 5696 -1797 -6828 -399 6784 2451 -5892 -4385 4591
5545 4591 5824 -2583 -6657 659 7258 1493 -6525 -3537 5247 5533 -3460 -6831 1613 7132 727
5560 727 -7004 -3095 6175 4950 -4570 -6254 2607 7296 -62 -7586 -1926 7481 4669 -5541 -6364
5575 -6364 3621 7823 -1060 -8135 -1613 7571 4107 -6764 -6177 4449 7705 -2062 -8952 -1085 8018
5590 8018 3030 -7490 -6011 5172 7589 -2709 -8600 156 8747 2865 -7240 -5243 5766 7375
5604 7375 -3619 -8231 744 8381 2357 -7786 -4795 6373 6624 -4022 -7985 985 8183 1604
5618A604r880L925J0699j56j0477l484R354O892p465q599M427R452k89r801k964
5633f762R042N501p221p167L727Q696m62j0175j118P864L990n733o288L571P538
5648E003j618p872r8O134L833n337n373L689O453k288n708l74N335K762m995l329
5664c783L525L663j464m098r10N008R08l879j829K158K636j176l115N63K908L6
5680A151j923o76R32K270j686j429J577P20l20q84L6J041L08j454J16J020l09
5697D90n47m45O24R63j682m58J394J33l01j386L77J959p01j831L68J665R24j708
5715a62j756J956K008j306j762K62J965J194k999j457K352J865j560k544K87L113
5731A456L18l301p56K268J565j432k568J068K921m56k284n31K260J410j960j773
$$ plain form
5618 1604 -8276 -4351 6348 6192 -4285 -7769 1585 8477 1012 -7587 -3160 6292 6003 -3798 -6762
5633 -6762 2280 7781 560 -6607 -2880 5816 5354 -4821 -5939 1925 5915 182 -6106 -2535 5003
5648 5003 3385 -4487 -4585 1549 5382 45 -5328 -1639 4814 2526 -3182 -3556 1779 4541 -454 -3783
5664 -3783 -258 3405 1941 -2157 -3067 1941 2849 -1030 -2859 -701 1935 759 -2356 -1793 1115 1151
5680 1151 -772 -1448 -516 1754 68 -1361 216 936 616 -268 -232 809 1117 -337 -221 799 490
5697 490 -57 -502 122 1085 -597 -1055 339 472 171 -1215 -838 1121 420 -1411 -1043 622 1546 -162
5715 -162 -1918 38 2046 740 -1022 -760 1205 2399 -600 -2057 295 2160 600 -1944 -1657 1456
5731 1456 1774 -1527 -2283 -15 1550 118 -2450 -1382 1539 1083 -1201 -1732 528 1938 -22 -1795
5747a795J595K026q90j891LK271M70k421j089K184J328j509j836Q25J873l32k353
5764a541j32K398N90k237r75J681J774j406k034J212K900r65k193j51K018J453
5780B392k406j661K109K118j551l051L14L558O35l683j518K969K401k372l547
5795c293J499M214o52l993j032L735K997l340m108L063M169o81m711j021M890
5810A736K906m700l577K628M751o70o208p50N824K179n024l881L244N719k006
5825B171o482M59N786J912m819m214M435N409l023n411O12N824K253n717l859
5840d664M748M785k768n351KO354J437o422k925M702M298k373o424J051O680M65
5856C595n934k173M389M776l374o091K511N967J3n272k437M878M518m493m783
$$ plain form
5747 -1795 -200 1826 936 -955 -952 1319 1789 -632 -1721 463 1791 282 -1554 -729 1144 812 -1541
5764 -1541 -1673 725 1315 -922 -1897 -216 1558 152 -1882 -670 2230 1265 -928 -1079 939 2392
5780 2392 -14 -1675 434 2552 1001 -2050 -1736 1822 2457 -1226 -2744 225 2626 254 -3293
5795 -3293 -1794 2420 1768 -2225 -3257 478 3475 135 -3973 -910 3259 2578 -2133 -3154 1736
5810 1736 4642 -58 -3635 -1007 3744 3074 -3134 -3884 1940 4119 -905 -4786 -1542 4177 2171
5825 2171 -4311 -3852 1934 3846 -973 -5187 -752 4657 1634 -3777 -3165 2659 4912 -805 -4664
5840 -4664 84 4869 2101 -3250 -3248 3106 4543 -1879 -4804 -102 4196 1823 -4601 -3550 3130 3595
5856 3595 -2339 -4512 -123 4653 1279 -4812 -2301 3666 3679 -1593 -4030 848 5366 873 -3910
5871c910K179N327j13n681j720N753K323m189m221K531N066j006o007j26N486
5886A692J569m079l299K836N228k505n035P76M966J758m833l005M213L988k970
5901A300m644J091N592K71n990j593M812L151l653m640K060N722p24o285l31N008
5917A147L037m569m437L385N697j607n871j80N701K437n578l570M208N145k486
5932B459o147J93O511J584o241l331M465N114k675o590P24P034J005o046l653
5947e594N457N517l629o339J325P028J009o652l056N539N256l812o752J711O926
5962C934Q38o808l196N576N140m024o331J737O863N28o936k725N481M987m401
5977F63n592J687O553Q31o344k614N725M135l585n608J407O368N02n961k312M986
$$ plain form
5871 -3910 -1731 3596 3483 -2198 -3918 1835 4158 -31 -4252 -1721 3345 2339 -3668 -3794 1692
5886 1692 3261 -818 -4117 -1281 3947 1442 -3593 -2817 2149 3907 -926 -3931 282 4270 1300
5901 1300 -3344 -2253 3339 3610 -2380 -3973 839 3990 337 -4303 -2243 3479 2755 -3530 -3861 1147
5917 1147 4184 -385 -4822 -1437 4260 2653 -3218 -3398 2303 4740 -838 -4408 -200 4945 2459
5932 2459 -3688 -3495 3016 4600 -1641 -4972 -507 4607 1932 -4658 -3934 3100 4105 -1941 -5594
5947 -5594 -137 5380 1751 -4588 -3263 3765 4774 -1878 -4934 605 5861 2049 -4703 -2992 3934
5962 3934 4772 -2036 -5232 344 5484 1460 -4871 -3134 3729 4257 -2679 -5404 77 5064 663
5977 663 -4929 -3242 3311 4142 -2202 -4816 909 5044 1459 -4149 -2742 3626 4128 -1833 -4145 841
5993H41L494k698n412J245N518K60m976k251L452L899k340m542J477M033M63l332
6009h69k533L001L476j949l092M59K838J250k833k020K177K016q84j880q36K509
6025H30J316k163j518N25J744N84k062j234J602J374m20j544n93J878J015j365
6041c1r46K43J432J027k262j166J704J503l23j875j342K934J240k352j406P26
6057h94K458K34l337q84L084J603k094k562J019L604l47l678o22K982K375k184
6073G57m081K182L959q01l444j093L292K962l613l339K245L977p25m000j819M873
6089A332K270m061k950K415M186j082m994k53N090J556m076l231K947M620j699
6104B070n205O04M918J101m882k743M220M436l460m763J540N321L62n743k097
$$ plain form
5993 841 4335 1637 -3775 -2530 2988 3248 -1728 -3979 -527 3372 1032 -3510 -2033 2000 2463 -869
6009 -869 -3402 -401 3075 1126 -1966 -1507 1331 2581 -252 -2272 -95 1921 1037 -843 -1679 830
6025 830 2146 -17 -1535 -1010 734 1318 -744 -1978 -376 998 578 -966 -1559 319 1334 -31
6041 -31 -977 -734 698 1725 -537 -1703 1 1504 1181 -694 -2036 898 2138 -214 -1620 -894
6057 -894 1564 1798 -1539 -2423 661 2264 170 -2392 -1373 2231 1884 -1794 -2416 566 2941 757
6073 757 -3324 -1142 2817 2016 -1428 -2521 771 3733 120 -3219 -974 3003 2278 -1722 -3541 1332
6089 1332 3602 -459 -3409 -994 3192 2110 -2884 -3137 1953 3509 -567 -3798 -851 3769 2070
6104 2070 -3135 -2531 2387 3488 -1394 -4137 83 4519 1059 -3704 -2164 3157 3519 -2224 -4321
6119d321N059L445l631m831K059O071p35o127j209N883L260n030m922L477O170
6134D618j578o648l36O335K651n652n004M789O091k819o858O81O676K169o723
6149a608l910N259N942l985o772J472P649R79p052l532O150N368m322p284K012
6164c634Q134N29q134k643O684N203m917o997K638Q238n16p738k691P098N177
6179F431n694o735L237P969j074p653k040P194M581n956o083L561P215j010p402
6194c459j906P653L426o251m957L723O575j453p492m76O970K468n284m469L530
6209a402O169j903o728L00N895K355n092m593M263N225k701n164%N620J863n278
6225a171l239M214L979k433m249J35N020R64m602j658L271K963j845m214J093
$$ plain form
6119 -4321 738 4183 552 -4279 -2220 3851 3116 -3011 -4220 1663 4923 -107 -5029 -1552 4618
6134 4618 3040 -3608 -3944 2391 5042 -610 -5614 -825 5266 2447 -4411 -3730 2946 5115 -1608
6149 -1608 -5518 -259 5683 1698 -5074 -3602 4047 5026 -2026 -5558 592 5960 1638 -5646 -3634
6164 -3634 4500 5029 -3105 -5748 936 6139 1222 -5775 -3137 5101 4585 -3153 -5844 1254 6431
6179 6431 737 -5998 -2761 5208 4134 -3519 -5559 1635 6216 260 -5823 -2262 4953 3943 -3459
6194 -3459 -5365 2288 5714 -537 -5494 -1771 4804 3351 -4141 -4617 2353 4821 -463 -4932 -1402
6209 -1402 4767 2864 -3864 -3564 2331 4686 -406 -4999 -736 4489 1788 -3376 -3376 2244 4107 -1171
6225 -1171 -4410 -196 3783 1350 -2899 -2764 2256 3220 -1382 -3040 231 3194 1349 -2865 -1772
6240a772M317k78l466j190K892K439k638l103K084K761o00k840o57K989J265l007
6256h04j090J675J858q54k598N72K680k5k459m29J634J821j598k213J471K160
6272A801j147j517m98K226J322k953j195J970J780j022k740N41K828o5k384p08
6288a761K160J724j628k850J602K543k35k557q62K289J875k172k106J771K202
6303A995l35k719q74K838J369k337j758P66K671l15k787o44K734J376k191j879
6319b090J224K722o28k552k53K105J231j318k091R82K332n31j873l15J558J239
6335A742j548j520J016J139j53j736k42J281J052j255o57K67Q62K50j119k92Q25
6352h8O46j27q13j09R05M05j60p63r8N85K46R2q69n54J107L45o18p46j82J336
$$ plain form
6240 -1772 2545 2267 -1199 -2389 503 2942 304 -2799 -715 2046 1446 -1394 -2051 938 2203 -804
6256 -804 -1894 -219 1639 785 -1813 -1241 1439 1414 -1045 -1474 160 1981 383 -1830 -359 1801
6272 1801 654 -863 -1361 865 2187 -766 -1961 9 1789 767 -1973 -1432 1396 1331 -1053 -1761
6288 -1761 399 2123 495 -2355 -753 1790 1555 -1002 -1864 425 2300 128 -1978 -207 1995
6303 1995 1660 -1059 -1933 905 2274 -63 -1821 -1055 1616 1301 -1486 -2130 604 1980 -211 -2090
6319 -2090 -866 1856 1228 -1324 -1577 528 1759 441 -1650 -668 1664 1133 -740 -1055 503 1742
6335 1742 194 -1326 -310 829 676 -1060 -1302 -21 1031 -224 -881 -614 248 498 -621 -913 -88
6352 -88 558 431 -382 -491 414 819 659 -104 -202 383 629 721 -148 -702 405 750 132 -614 -796 540
6372E40M18j561m62Q36R76k19j940Q1K113M54j402j331J157K140m15k785L29K192
6390A121P91j852j965J708K548j275l070J48K811J355k856k306K427K725j331
6405I79k998n95L826J516l580k184K697K880q52m213J29M457J021l749k366K526
6421e06M066j872m737R52M328P78m007k694L231M039k877m260J363L941J217m790
6437a828k271M771K818k805m128J155N168M79n501j231M781K481l232m130J852
6452a621N446q61n560l89M418K693m446m028L344M872k205m802l52N715J413n250
6468a613k793M264M144k436n372M78O555R31n979k128M545M424l363o114K314
6483b143O108k89o003k248N646L930m813n566L270N979p84o682j520P115K976
$$ plain form
6372 540 958 -603 -1065 -229 747 528 -1412 -1331 782 1236 -166 -1497 -340 1800 1385 -1400 -1071 1121
6390 1121 1912 60 -1905 -197 2351 1076 -1994 -1846 965 2320 -536 -2842 -415 2310 979
6405 979 -2019 -2614 1212 2728 -852 -3036 -339 2541 1689 -2524 -2395 2062 3083 -666 -3032 -506
6421 -506 3560 1688 -3049 -2097 2231 3009 -998 -3692 -461 3578 701 -3559 -2196 1745 2962 -1828
6437 -1828 -4099 672 3490 685 -3443 -2288 2880 3359 -2142 -3373 1408 3889 657 -3473 -1621
6452 -1621 3825 2964 -2596 -2985 1433 4126 -320 -4348 -1004 3868 1663 -3139 -3491 2224 3637 -1613
6468 -1613 -4406 -142 4002 1566 -3806 -3328 3227 4158 -1821 -3949 596 5020 1657 -4457 -2143
6483 -2143 3965 3676 -2327 -4575 1071 5001 188 -5378 -2108 3871 3087 -3595 -5115 2000 4976
6498D976n520n057L947O450j601p244m76P357K570n833n047M523O784k879p140
6513d190m4P558K077o494m827N102O451l326p389M81P647J827o754m163N498O014
6529E468l364p180J317P554J267o727l961O199N533m020o918J504P609O22p223
6544b320l289O056M915l734o824K084O865K31o524k571N495M603m414n488K142
6559b773O265J54n857k179N088L960l812n094K481N346j73n275j823M530L610
6574D448l678m495J910M427J1m604j714M425K202k869l171J223M218l07l760j022
6590b756L477J907j874k924J114L216o31k661m67K125J423j348k105R37J824p6
6606A181j663r71J416J239j523q53O75N33N42r33o64J067L98k61k13o29N32M50
$$ plain form
6498 4976 -544 -5601 -1654 4796 3195 -4049 -4525 2832 5402 -431 -5478 -955 5829 2950 -4190
6513 -4190 -4234 3324 5401 -1093 -5920 -818 5633 2307 -5082 -4601 3046 4873 -1881 -6044 -546 5468
6529 5468 2104 -5076 -3759 3795 5062 -1665 -5626 573 6106 2086 -4832 -3328 4281 4903 -2320
6544 -2320 -5609 447 5362 1628 -5196 -3112 3753 3984 -2540 -5111 384 4987 573 -4915 -2773
6559 -2773 3492 3646 -2211 -4390 698 4658 846 -4248 -1767 3579 3406 -1869 -3692 838 4448
6574 4448 770 -3725 -1815 2612 2623 -1981 -3695 730 2932 63 -3108 -1885 2333 2026 -1734 -2756
6590 -2756 721 2628 754 -2170 -1056 2160 1529 -1132 -1599 526 1949 601 -1504 -567 1257 1181
6606 1181 -482 -1453 -37 1202 -321 -1174 -499 34 576 -357 -1021 46 444 183 -30 -659 -127 323
6624C23l04j45K29k0P35m88n65K34K03K52P6j309L45J099m13n25n12N09Q44n87
6644a9j040M01R77L11q65r04J070R86p12q99j22J552N04j607m83J344N15p29j063
6663g83L9J770o8j731j05R15Q46p89j654J071J476m84j372j45J590O19j649r42
6681a396J630R40n88j381m7K201K10k257o68J731J374j230j652M25K250l01k434
6698a193l32J917J414k053j615J171K171n22k503q1K542J026k132j941J858K455
6714B182r25k992j65L316Q98k926j958K279K928j382l640L06L380J314l484k052
6730b921K996L017k187l742N54M250O92l846j840K942L380k208l924P56M367O77
6746B963m062k163L594L074k520l891J227M274K63m342j911L948K992k596m284
$$ plain form
6624 323 19 -126 103 83 818 330 -235 -1 202 454 530 -779 -434 665 252 -273 -785 -276 568 -19
6644 -19 -1059 -658 319 630 -235 -1139 -69 917 205 -694 -816 736 1240 -367 -850 494 1009 280 -783
6663 -783 -744 1026 958 -773 -878 37 883 94 -1560 -489 987 503 -869 -1014 576 1195 -454 -1396
6681 -1396 234 1174 586 -795 -842 1359 1569 -688 -1356 375 1749 519 -1133 -708 1542 1241 -1193
6698 -1193 -1525 392 1806 -247 -1862 -691 1480 958 -1545 -1626 916 1942 -190 -2131 -273 2182
6714 2182 1257 -1735 -1900 1416 2314 -612 -2570 -291 2637 1255 -2385 -2079 1301 2615 -869 -2921
6730 -2921 75 3092 905 -2837 -2283 1967 2659 -1187 -3027 -85 3295 1087 -2837 -2081 2286 2963
6746 2963 -1099 -3262 332 3406 886 -3005 -1778 2496 2759 -1583 -3494 454 3446 850 -3434
6761c434J299M550N86m722j784M139K752k775l895J462M783j24m766j295L992
6776G68K535k527m017J799M470o77m085j482M122K216k962l523K329L347j64l745
6792a596j234L599K334l333k695J729L552n34m062m5L614J018k617k269J845L352
6808B658j597l271O51L108M74k420k308K716K742k269k544R27K879L42l413j019
6824b344L267J374k407k036J179K983l89l605K51K823R99k332k230K261K892j917
6840G69k880Q49K438R02l076j627L083K114k202k732R40L820k17l794o49K959
6856F97J969k581k850J707L815j004l976r3L440J741l169l105K687L667j598l709
6872b362m9L823J792l978k219K656L169j361l887J44M068J061l890k075L037L136
$$ plain form
6761 -3434 -2135 2415 3001 -1721 -3505 634 3386 611 -3284 -1822 2961 2837 -1929 -3224 768
6776 768 3303 776 -3241 -1442 3028 2351 -1734 -3216 906 3122 160 -3363 -1034 2313 2149 -1596
6792 -1596 -2830 769 3103 -230 -2925 -1196 2356 1822 -2240 -2285 1329 2347 -270 -2539 -694 2658
6808 2658 1061 -2210 -1559 1549 2023 -397 -2705 11 2753 484 -2060 -1133 1746 2088 -1325 -2344
6824 -2344 923 2297 -110 -2146 -967 2016 1627 -1978 -1727 1096 2095 -237 -2467 -206 2686 769
6840 769 -2111 -1262 1176 2078 -998 -2625 458 2572 370 -2362 -1422 2398 2181 -1613 -2262 697
6856 697 2666 85 -2765 -1058 2757 1753 -2223 -2316 1124 2865 -304 -3409 -722 2945 1347 -2362
6872 -2362 -2411 1412 3204 -774 -2993 -337 2832 1471 -2416 -2272 1796 2857 -1033 -3108 -71 3065
6888C065j702m290O50M090Q30l761k254L322L096k096l570O32L788O34l490j967
6904c023L216K760k086l232P19L297P95l321j555K561K423j602l082M42L286M14
6920B012l069j206K279J999j379k410L81K549N61k404j049J370J829q67j714n5
6936a173K297K63j514r73O13J653n10j112j15R53M65n71j014K76J135k40r22j26
6954f15K26R82o54m08l76J030J19K2q55j33J322M9n03j072L73J664q1j452m34
6973g96J170R07q12j644L25J929L2j818n85J096J498p91k238O76K092J14j821
6990f66j153J792J931j574k084R57K000N61k408j350K678J439k099j555R33K251
7006A653L5k919o79K670J245k106k124R59L117n30l116j47K526J385k066k539
$$ plain form
6888 3065 1363 -2927 -2277 1813 2643 -1118 -3372 -50 3046 950 -2620 -1988 1800 2434 -1056 -3023
6904 -3023 193 2953 867 -2365 -1646 1651 2446 -875 -2430 131 2554 952 -2130 -1688 1598 2012
6920 2012 -1057 -2263 16 2015 636 -1774 -1393 1156 1717 -687 -1736 -366 1463 596 -1118 -1173
6936 -1173 1124 1387 -127 -1100 -487 1166 656 -456 -571 382 847 276 -738 -462 673 433 -489 -615
6954 -615 -389 593 -61 -469 -845 185 304 326 -529 -662 660 709 206 -866 -493 1171 1090 -362 -796
6973 -796 374 1281 469 -1175 -850 1079 1111 -707 -1292 -196 1302 511 -1727 -1051 1041 1155 -666
6990 -666 -1819 -27 1904 330 -1754 -797 1203 1764 -644 -1994 684 2123 24 -1531 -598 1653
7006 1653 1688 -1231 -1910 760 2005 -101 -2225 -1266 1851 1321 -1795 -1942 584 1969 -97 -2636
7022b636K424K486j096k675QK681J161k756j798K377K382j353l434M07L673M64
7038B315l551j157K646K459k180l500J458L484j61l573p68L146K387k955l094
7053c044K270L622o91m136o02M288J896l768k697K200L828j018m405n49M448J480
7069C122l650l046K813M122j954m638M56M798J081l848l065L587L784j929m603
7084b970N81M893R14m558k560L898L961k598m854P99N422P15n241k289M085L643
7100C841k757m916J001N425M57m523k298L773L792k748m659J355M928O49m822
7115a502j989M061L313k713m121J094M557M78m854j547L605L065k509m014Q91
7130b185M562j80l893j439L636K466k731l156J182L719L31l945j111L467K010
$$ plain form
7022 -2636 -212 2274 1178 -1497 -1489 1192 2353 -403 -2201 176 2558 1205 -2229 -1822 1851 2315
7038 2315 -1236 -2393 253 2712 532 -2968 -1510 1974 1813 -1760 -2528 618 3005 50 -3044
7053 -3044 -774 2848 2157 -1979 -2581 1707 3603 -165 -2862 -662 3166 2148 -2257 -2806 1642 3122
7069 3122 -528 -3574 -761 3361 1407 -3231 -2775 2023 3104 -744 -3809 -222 3562 1633 -2970
7084 -2970 -2389 2504 3418 -1140 -3700 198 4159 1561 -3293 -2494 2928 3643 -1598 -3887 198 3841
7100 3841 1084 -3832 -2831 2594 3051 -1472 -3770 3 3795 1047 -3612 -2257 2671 3320 -1502
7115 -1502 -3491 570 3883 1170 -2951 -1857 2700 3178 -1676 -3223 382 3447 938 -3076 -2185
7130 -2185 2377 2197 -1696 -3135 501 2967 236 -2920 -1738 1981 2312 -1633 -2744 723 2733
7145B733k271k592J013L389k4l529r00K896J860k009k767J032L103m60k815p88
7161b129K177J578j489k315J283K183m06j952o37K100J254j560j592J031J692
7176A218j57j767k62J897K32j408o73P84J109o11j218L16J158J4r11o81P97P69
7194F06q08p32O30N80j10m79k67Q37J2m01j92M34O53l34j177M65J078k24p02L8
7214i3L38K73o96n90J034L95o93n40N9R34k68q20qR14J01O6j443P64R71l61o86
7235c49R5P56L80n51j165P79O65m06p21j70Q32L02p19n00N77L00l2q73K73Q06
7255B79J04n85l20L90L26j3o26L97O07m41j42O5l1L56n32J93N79n17ol57K85L15
7277C26n56k67N19O6j71k57k72J074k28q51J97O11K80m50r78Q30J121l92j311
$$ plain form
7145 2733 462 -2130 -1117 2272 2248 -1281 -2181 715 2575 566 -2201 -1169 1934 1474 -1341 -2129
7161 -2129 48 1626 137 -2178 -895 1288 882 -1070 -1707 393 1647 87 -1505 -474 1218
7176 1218 1061 -706 -968 929 1161 -247 -920 -136 973 362 -856 -540 618 632 -279 -960 -163 606
7194 606 -202 -934 -304 276 166 -313 -580 257 269 -132 -324 110 763 429 -748 -283 795 571 -131 -93
7214 -93 245 518 -178 -768 266 661 -32 -572 -513 421 153 -667 -675 239 340 406 -1037 -273 698 337 -349
7235 -349 -254 502 882 331 -834 -55 610 204 -517 -687 145 447 -272 -772 -195 105 73 -800 -527 279
7255 279 383 -202 -522 -132 194 181 -445 -48 559 118 -24 41 10 366 -166 27 606 89 83 -274 11 326
7277 326 -230 -497 22 88 -83 -340 -612 462 234 -617 -420 191 471 21 -957 -127 994 602 -709
7296g09K9J365N94j587q41J022J303o07j853K52J677N03j476j262J465J636r81
7313E30k231L67K570L48k250j177K030J918j559k094M41K475M12k776j015K456
7329D45J712j642k565P05L295j36k861j226K774J864k082k744J164L251m04k801
7345a251r01K726K020k499k525J761K805m33l153o32L190J503k726k183J736L094
7361B532j293l085J79L057N68k687j448J961K739j809l047O92L161N18l289j226
7377b477K740K229k260k602J464L075l73l127j012L433J218k285k452J337L442
7392B350r53l564L90L153Q66k798k410K590L107k036l189O70L483N04l173j853
7408b863L381K327k353l105J210M055j99m390p86L645K049k734l360K054L911
$$ plain form
7296 -709 -680 685 1279 -308 -1149 -127 1176 569 -1284 -1032 645 1148 -328 -1590 -125 1511 530
7313 530 -1701 -1334 1236 1584 -666 -1843 187 2105 546 -1548 -1107 1368 1780 -996 -2011 445
7329 445 2157 515 -2050 -1345 1950 1814 -1047 -2273 501 2365 283 -2461 -1297 1954 1550 -1251
7345 -1251 -2152 574 2594 95 -2430 -669 2136 1703 -1450 -2082 1108 2611 -115 -2298 -562 2532
7361 2532 1239 -1846 -1667 1390 1958 -729 -2177 -216 2523 714 -2333 -1641 1520 2038 -1251 -2477
7377 -2477 263 2492 232 -2370 -906 2169 1796 -1331 -2343 1090 2308 23 -2429 -1092 2350
7392 2350 1397 -2167 -1777 1376 2242 -556 -2966 -376 2731 695 -2494 -1824 1659 2163 -1010 -2863
7408 -2863 518 2845 492 -2613 -1403 2652 2453 -1937 -2723 922 2971 237 -3123 -1069 2842
7423B842p42m493k86M015K018l438l545K967L968j371m513K6L909J996m189k551
7439c387L164L566j583m561OM864J119l959k761L429L517j780m983R37N082K63
7455B933m144k431L566L727k541m359Q89M907N84m502k109L334L306k120l955
7470b915P37M313R20m291j966L511K672k334l511R81M307J5m056j289L146K582
7486B822k239l121J268L316K66l512j365L082K000k116k367Q08K988j39k861q37
7502b007K204J991j999j924O62K351J69k530o57K074J400j402j899R69J998j07
7518A293j734q53J591J053j067j325N78J437J09j567k95J035O77o29j009L01Q26
7535D21O5r33k74M18R58n13o69J62N76Q7k99j20K5L80l62J06k08K66J90j36m41
$$ plain form
7423 2842 2100 -2393 -2679 1336 3354 -84 -3629 -662 3306 1935 -2578 -2552 1357 3353 -836 -3387
7439 -3387 -223 3343 1760 -2801 -2795 2069 3188 -771 -3532 -103 3414 1634 -3349 -2412 2670 2933
7455 2933 -1211 -3642 -76 3651 1110 -3249 -2360 2547 3131 -1371 -3480 -146 3160 1040 -2915
7470 -2915 -2178 2135 3055 -1236 -3202 309 2981 647 -2864 -1883 2424 2439 -1617 -2906 240 2822
7486 2822 583 -2538 -1270 2046 2312 -1200 -2565 517 2517 401 -1966 -1158 1830 1691 -1170 -2007
7502 -2007 197 2188 189 -1735 -1073 1278 1447 -1083 -1740 334 1734 332 -1567 -598 1400 1293
7518 1293 -441 -1294 297 1350 283 -1042 -464 973 1082 -485 -780 255 932 303 -706 -405 421
7535 421 486 -447 -721 -303 655 142 -527 -365 211 298 -1 -121 -96 284 -78 28 -180 86 276 140 -301
7556c01K5K57M14K2m77l84M07J71n06J76l79Q95J01r08K34M81K22k65m41J72P74
7577F90j47n80l34M44O66k54r80L41P49n8r15k77Q40O28r33n79N97M68O2q29p08
7598a109J537K43j003n09O67P78o8j404J96J454K02j132o90O92J665j125j456
7615a062M61J444K76j625r25J447J035r41j461M79J815L84k520l62J939Q07j196
7632ej516O80K398m97k022m50K221J370j710k333J506K346p11k489m26K542J085
7649A989k035k339J804K320m01k929m08K948J111k508k013J653K996o43l405p9
7665a939L273J390k984k179J874K955p41l755k4L531J656l549k338K610K880j243
7681A417l861L32L650J137l535k453K686L314j611l573K90L919R63l379k201K867
$$ plain form
7556 -301 -276 -19 395 417 -60 -444 -37 134 -372 -196 -575 320 421 -487 -253 228 450 185 -256 -84 690
7577 690 543 -37 -371 73 739 485 -495 -154 595 537 -378 -655 185 813 -120 -699 -102 366 428 -401 -1109
7598 -1109 428 671 -332 -841 -174 604 536 -868 -672 782 984 -148 -838 -146 1519 394 -1062
7615 -1062 -601 843 1119 -506 -1431 16 1051 110 -1351 -872 943 1327 -1193 -1555 384 1191 -5
7632 -5 -1521 -841 1557 1060 -962 -1412 809 2179 469 -1864 -358 1988 1277 -1212 -1638 904 1989
7649 1989 -46 -2385 -581 1739 1338 -1591 -1999 949 2060 -448 -2461 -808 2188 1545 -1860 -1939
7665 -1939 1334 2724 -260 -2439 -565 2390 1649 -2106 -2130 1401 3057 -492 -2830 -220 2660 1417
7681 1417 -2444 -2112 1538 2675 -860 -3313 -627 2687 1076 -2497 -2207 1712 2675 -704 -2905 -38
7697c8L042j654l448K60L482J108l644j950K822K792j710l617O57L857J30l251
7713a162j635K821K573j893l152R11L329Jk798j325K692K046k069k448J212K938
7729B041j46k973o03K321J836k036k697J804K157o69k565m24K780R75k199j731
7745b129J591K085n48k581M65K217L17j780j254J620K097j621k039Q36K174j4
7761A436k305q34K410J238j893j829J311J866m55k384J48K167O12k006j333J665
7777a86J949j232k299R49K006K49k127j080K310J572j823j950Q89K202Nk470m72
7794a508K027J328j698j876R11K326p16k238k43K386R60j728j655J198K141q87
7810G28k455K67K357P88j903j613J686J945r86j934N0K041R82k427j009J458J704
$$ plain form
7697 -38 3004 1350 -2098 -1838 1644 2752 -892 -2842 -20 2772 1062 -2555 -1898 1959 2089 -1162
7713 -1162 -2797 24 2597 704 -2448 -1537 1792 1793 -1005 -2330 362 2408 339 -2109 -897 2041
7729 2041 1895 -1078 -1681 640 2476 440 -2257 -453 1704 1035 -1530 -1954 826 1801 -398 -2129
7745 -2129 -538 1547 999 -1582 -1117 1100 1417 -363 -1617 3 2100 479 -1560 -724 1450 1436
7761 1436 -869 -1703 707 1945 52 -1777 -466 1400 945 -1439 -1291 876 1488 -518 -1851 -186
7777 -186 1763 531 -1768 -819 1187 1436 -691 -1771 539 2111 288 -1662 -773 1429 1434 -1036 -1508
7794 -1508 519 1847 149 -1727 -816 1510 794 -1444 -1687 699 1659 -69 -1724 -526 1615 728
7810 728 -1727 -1460 897 1685 -218 -1831 -145 1800 814 -1120 -1070 971 1953 -474 -1483 -25 1679
7827A679r08k096K34K357k0j879p92J199J713j063j550J21J491P39j531r61J447
7844A80J136j046j091K63J301J03j205m32Q69Q18o95q68M97N88l2q93j94O36M14
7863C49k15o91J49N20J4k06j78K32K14k0j83j03l4J42J85n7jj55pL70j61m43K49
7886c0L98l23o30J86L42N13n74n19L87N44N9o11j81N45N45n99p10O52O29l0j058
7907d65J45N26Q26r72r98Q82R61k62j208l95J174N37j125o35P56Q70p9j445J14
7926g93J563J93j235o05Q56J034o12j417L83J318K34j136j027J411J078j097r48
7943h00P5J626k8j525l93J579O93j417r88P16J588m88j694K23J429N54j408j224
7961a482J649J257o12j766K55J654N61j906j139J780J367j227j747N33J932K15
$$ plain form
7827 1679 771 -1325 -1091 1266 1246 -633 -1425 -226 1487 424 -1126 -1005 486 1225 -306 -1267 180
7844 180 1316 270 -821 -558 743 846 -359 -791 78 896 201 -667 -170 418 386 -507 -701 -65 349
7863 349 134 -557 -408 112 126 -80 -258 -26 188 168 -15 -118 -152 -10 175 118 117 -38 -45 325 164 -279 -30
7886 -30 368 45 -585 -399 -57 456 -118 -637 -250 294 353 -258 -439 106 651 52 -658 -6 623 593 -465
7907 -465 -320 206 1032 60 -938 -56 905 643 -565 -960 214 751 -374 -1009 -253 617 538 -907 -793
7926 -793 770 963 -272 -877 -21 1013 401 -1016 -633 685 919 -217 -1244 167 1245 148 -800
7943 -800 -725 901 873 -652 -1045 534 1227 -190 -1178 -462 1126 638 -1056 -833 596 1150 -258 -1482
7961 -1482 167 1424 812 -954 -699 955 1516 -390 -1529 251 1618 391 -1356 -823 1109 1324
7977A324k280n26J709R51j320j489O87K393j81k638k23K086J066j781j775J466
7993e31K474j024k026n80K522J309k536j749J821K286o23k891k09K792J008k571
8009e28j745J827K612j116k816j22K987Q66k375j994J783K835j016k999n0L005
8025A154J334k870k160K023K927j275k966j49L302P97k713k060K292K813j307
8040A142k955j21L408Q48k980j766K027K622j114l003J8L184Q75k722j813J974
8056c76K523r28l205L42K423J180k351j953J968K419j327k600L35K584P88k418
8072e96j449J771K287j193k365J19K453N75k210j297J918J738r88k282M52J902
8088H35R52k357r96J627J628j136j738J59J684O29j796o71J411J227j058j498
$$ plain form
7977 1324 -956 -1482 227 1178 -142 -1631 -944 1449 1268 -1370 -1593 493 1559 -222 -1997 -531
7993 -531 1943 919 -1107 -1687 835 2144 -392 -2141 -320 1966 1343 -1548 -1757 1035 2043 -528
8009 -528 -2273 -446 2166 1050 -1766 -1888 1099 1965 -410 -2404 -621 2214 1198 -1801 -1851 1154
8025 1154 2488 -382 -2542 -519 2408 1133 -1833 -1982 1320 2117 -596 -2656 -364 2449 1142
8040 1142 -1813 -1934 1474 2322 -658 -2424 -397 2225 1111 -1892 -1874 1310 2185 -537 -2350 -376
8056 -376 2147 1219 -1986 -1644 779 1959 -392 -2345 -377 2042 715 -1885 -1550 1034 1822 -596
8072 -596 -2045 -274 2013 820 -1545 -1426 1027 1602 -608 -1905 13 1751 763 -1519 -1067 835
8088 835 1787 -570 -1566 61 1689 553 -1185 -1026 658 1287 -509 -1180 231 1458 400 -1098
8104a098K38J614K55j546m95J145R39p41j215N66R01m4q38m75R14P73r73o21P96
8123I5N66l76r48J37J015P8o52n56N37N22p8r55J50Q01mn57j27L90L88m78k73
8144c25J9N63P7m91l60N91K15m43K4O0K99l3l33o9N09k23j13k09K94N3j85r3K40
8167F7O4j32P6j21J32M3n1j76J64m8m1R1k66o9J12K26N5N9j01k84K93R4j79J11
$$ plain form
8104 -1098 -860 754 1009 -537 -1032 113 1052 311 -904 -338 563 519 -319 -794 120 893 -80 -701 95
8123 95 661 285 -663 -526 489 567 -85 -641 -104 418 340 -615 -465 336 332 -225 -352 38 426 -52 -325
8144 -325 -306 257 334 -157 -517 74 289 -154 -130 -70 229 196 -137 -206 303 80 -33 -242 52 105 -80 -173 67
8167 67 131 -1 75 -46 86 129 78 -98 66 18 -23 68 -198 -267 -155 71 126 185 84 -200 93 187 8 119
8191A19
$$ Imaginary data points
##PAGE= N=2
##DATA TABLE= (X++(I..I)), XYDATA
0@%%%%%%jJ%Qj6J6j8K6m0M8n6P4r1J08j32J62j94K26k66L14l62M18m85N57o36
31c39P27q29R37j056J193j341J498j675J873k086K317k571K849l151L481l845
47b018M241m672N148n673O249o886P597q392R284j0301J1468j2817J4404j6304
61h672J8625k1530K5294l0389L7704m9147O9695j17769M31113K16827j021534
72d49783r1975P34553N13444o55929p15459M38335Q35041k17992p95112j64338
82e69215P74633M28680o73483o09314M73665O72444j55871p51184j06711P60082
92B43726L11621o38046m52986M02920O24243j67691p10278j1097O80003J93315
$$ plain form
0 0 0 0 0 0 0 0 -1 0 0 8 -8 8 -10 16 -24 24 -32 42 -49 59 -73 89 -105 121 -145 169 -193 225 -260 297 -339
31 -339 388 -441 496 -560 633 -708 790 -885 988 -1098 1219 -1352 1497 -1654 1827 -2018
47 -2018 2223 -2449 2699 -2974 3275 -3611 3986 -4406 4878 -5423 6045 -6772 7632 -8672
61 -8672 9953 -11577 13717 -16672 21032 -28115 41580 -76189 354924 571751 -449783
72 -449783 -541758 192795 706239 50310 -665149 -226814 608227 390235 -404877 -569215
82 -569215 205418 634098 -39385 -648699 -175034 497410 341539 -409645 -516356 243726
92 243726 555347 -82699 -535685 -132765 491478 323787 -386491 -397588 282415 475730
$$ [...]
8191D25
##END NTUPLES=NMR FID
##END=
