##TITLE=1H_LY-Dixlofos.1
 CDcl3, 8 sc, 
 22.10.2020
##JCAMPDX= 6.0         $$ Bruker NMR JCAMP-DX V2.0
##DATA TYPE= NMR FID
##DATA CLASS= NTUPLES
##ORIGIN= UXNMR, Bruker Analytische Messtechnik GmbH
##OWNER= root
$$ XWIN-NMR		Version 3.5
$$ Thu Oct 22 12:11:41 2020 Russian Standard Time (UT+4h)  she@DPX200
##.OBSERVE FREQUENCY= 200.1315066352
##.OBSERVE NUCLEUS= ^1H
##.DELAY= (6, 6)
##.ACQUISITION MODE= SIMULTANEOUS
##.ACQUISITION SCHEME= undefined
##.AVERAGES= 8
##.DIGITISER RES= 18
##SPECTROMETER/DATA SYSTEM= spect
##.PULSE SEQUENCE= zg30
##.SOLVENT NAME= D2O
##.SHIFT REFERENCE= (INTERNAL, D2O, 0, 15.7039)
##AUDIT TRAIL= $$ (NUMBER, WHEN, WHO, WHERE, WHAT)
$$ ##TITLE= Audit trail, XWIN-NMR		Version 3.5
$$ ##JCAMPDX= 5.01
$$ ##ORIGIN= Bruker BioSpin GmbH
$$ ##OWNER= she
$$ F:/spectra/data/she/nmr/H-F/1/audita.txt
$$ ##AUDIT TRAIL=  $$ (NUMBER, WHEN, WHO, WHERE, WHAT)
(   1,<2020-10-22 12:10:40.50 +0400>,<she>,<DPX200>,
      <created by zg, POWCHK disabled, PULCHK disabled
       configuration hash MD5:
       00 E9 B6 7A A2 85 ED C7 34 08 36 98 17 FE 4E 26
       data hash MD5: 16K
       4B 56 F0 A0 AB 51 05 69 F4 8E 90 6C 3D 85 51 82>)
$$ ##END=
$$ 
$$ hash MD5
$$ 43 E9 96 3D 44 70 74 44 70 F1 7D 6B 3C E8 51 AE
##$RELAX= 
##$RELAX= 
##$RELAX= 
##$RELAX= 
##$RELAX= 
##$RELAX= 
$$ Bruker specific parameters
$$ --------------------------
##$DU= <F:/spectra>
##$EXPNO= 1
##$NAME= <H-F>
##$PROCNO= 1
##$TYPE= <nmr>
##$USER= <she>
##$AMP= (0..31)
100 100 100 100 100 100 100 100 100 100 100 100 100 100 100 100 100 100 
100 100 100 100 100 100 100 100 100 100 100 100 100 100 
##$AQSEQ= 0
##$AQ_mod= 1
##$AUNM= <au_zg>
##$AUTOPOS= <>
##$BF1= 200.13
##$BF2= 200.13
##$BF3= 200.13
##$BF4= 200.13
##$BF5= 200.13
##$BF6= 200.13
##$BF7= 200.13
##$BF8= 200.13
##$BYTORDA= 1
##$CFDGTYP= 0
##$CFRGTYP= 5
##$CHEMSTR= <none>
##$CNST= (0..31)
1 1 145 1 1 1 1 1 1 1 1 1 1 1 1 1 1 1 1 1 1 1 1 1 1 1 1 1 1 1 1 1 
##$CPDPRG= <>
##$CPDPRG1= <>
##$CPDPRG2= <>
##$CPDPRG3= <>
##$CPDPRG4= <mlev>
##$CPDPRG5= <mlev>
##$CPDPRG6= <mlev>
##$CPDPRG7= <mlev>
##$CPDPRG8= <mlev>
##$CPDPRGB= <>
##$CPDPRGT= <>
##$D= (0..31)
0 1.2 0 0 0 0 0 0 0 0.06 0 0.03 0 0 0 0 0.0002 0 0 0 0 0 0 0 0 0 0 0 0 
0 0 0 
##$DATE= 1603354239
##$DBL= (0..7)
120 120 120 120 120 120 120 120 
##$DBP= (0..7)
150 150 150 150 150 150 150 150 
##$DBP07= 0
##$DBPNAM0= <>
##$DBPNAM1= <>
##$DBPNAM2= <>
##$DBPNAM3= <>
##$DBPNAM4= <>
##$DBPNAM5= <>
##$DBPNAM6= <>
##$DBPNAM7= <>
##$DBPOAL= (0..7)
0.5 0.5 0.5 0.5 0.5 0.5 0.5 0.5 
##$DBPOFFS= (0..7)
0 0 0 0 0 0 0 0 
##$DE= 6
##$DECBNUC= <off>
##$DECIM= 32
##$DECNUC= <off>
##$DECSTAT= 4
##$DIGMOD= 1
##$DIGTYP= 9
##$DL= (0..7)
0 120 120 120 120 120 120 120 
##$DP= (0..7)
150 150 150 150 150 150 150 150 
##$DP07= 0
##$DPNAME0= <>
##$DPNAME1= <>
##$DPNAME2= <>
##$DPNAME3= <>
##$DPNAME4= <>
##$DPNAME5= <>
##$DPNAME6= <>
##$DPNAME7= <>
##$DPOAL= (0..7)
0.5 0.5 0.5 0.5 0.5 0.5 0.5 0.5 
##$DPOFFS= (0..7)
0 0 0 0 0 0 0 0 
##$DQDMODE= 0
##$DR= 18
##$DS= 0
##$DSLIST= <SSSSSSSSSSSSSSS>
$$ [...]
##$SUBNAM2= <"">
##$SUBNAM3= <"">
##$SUBNAM4= <"">
##$SUBNAM5= <"">
##$SUBNAM6= <"">
##$SUBNAM7= <"">
##$SUBNAM8= <"">
##$SUBNAM9= <"">
##$SW= 16.880792210976
##$SWIBOX= (0..15)
0 0 2 0 0 0 0 0 0 0 0 0 0 0 0 0 
##$SW_h= 3378.37837837838
##$TD= 16384
##$TD0= 1
##$TE= 0
##$TE2= 300
##$TE3= 300
##$TEG= 300
##$TL= (0..7)
0 120 120 120 120 120 120 120 
##$TP= (0..7)
150 150 150 150 150 150 150 150 
##$TP07= 0
##$TPNAME0= <>
##$TPNAME1= <>
##$TPNAME2= <>
##$TPNAME3= <>
##$TPNAME4= <>
##$TPNAME5= <>
##$TPNAME6= <>
##$TPNAME7= <>
##$TPOAL= (0..7)
0.5 0.5 0.5 0.5 0.5 0.5 0.5 0.5 
##$TPOFFS= (0..7)
0 0 0 0 0 0 0 0 
##$TUNHIN= 0
##$TUNHOUT= 0
##$TUNXOUT= 0
##$USERA1= <user>
##$USERA2= <user>
##$USERA3= <user>
##$USERA4= <user>
##$USERA5= <user>
##$V9= 5
##$VALIST= <valist>
##$VCLIST= <CCCCCCCCCCCCCCC>
##$VD= 0
##$VDLIST= <DDDDDDDDDDDDDDD>
##$VPLIST= <PPPPPPPPPPPPPPP>
##$VTLIST= <TTTTTTTTTTTTTTT>
##$WBST= 1024
##$WBSW= 4
##$XGAIN= (0..3)
0 0 0 0 
##$XL= 0
##$YL= 0
##$YMAX_a= 913617
##$YMIN_a= -719157
##$ZGOPTNS= <>
##$ZL1= 120
##$ZL2= 120
##$ZL3= 120
##$ZL4= 120
##$ABSF1= 10
##$ABSF2= 0
##$ABSG= 5
##$ABSL= 3
##$ALPHA= 0
##$AQORDER= 0
##$ASSFAC= 0
##$ASSFACI= 0
##$ASSFACX= 0
##$ASSWID= 0
##$AUNMP= <proc_1d>
##$AZFE= 0.1
##$AZFW= 0.1
##$BCFW= 1
##$BC_mod= 2
##$BYTORDP= 1
##$COROFFS= 0
##$CY= 11.3945322036743
##$DATMOD= 1
##$DC= 2
##$DFILT= <>
##$DTYPP= 0
##$F1P= 16.9975609425685
##$F2P= -3.02152046262296
##$FCOR= 0.5
##$FTSIZE= 0
##$FT_mod= 4
##$GAMMA= 1
##$GB= 0.15
##$INTBC= 1
##$INTSCL= 1
##$ISEN= 128
##$LB= 0.24
##$LEV0= 0
##$LPBIN= 0
##$MAXI= 10000
##$MC2= 0
##$MEAN= 0
##$ME_mod= 0
##$MI= 1.114404
##$NCOEF= 0
##$NC_proc= 0
##$NLEV= 6
##$NOISF1= 3.799351
##$NOISF2= 2.8
##$NSP= 1
##$NTH_PI= 0
##$NZP= 0
##$OFFSET= 15.70392
##$PC= 1
##$PHC0= -10687.58
##$PHC1= 10.40089
##$PH_mod= 1
##$PKNL= yes
##$PPARMOD= 0
##$PSCAL= 0
##$PSIGN= 0
##$REVERSE= no
##$SF= 200.130013532006
##$SI= 16384
##$SIGF1= 3
##$SIGF2= 2
##$SINO= 400
##$SIOLD= 16384
##$SREGLST= <1H.CDCl3>
##$SSB= 0
##$STSI= 0
##$STSR= 0
##$SW_p= 3612.71676300578
##$SYMM= 0
##$S_DEV= 0
##$TDeff= 0
##$TDoff= 0
##$TI= <>
##$TILT= no
##$TM1= 0
##$TM2= 0
##$TOPLEV= 0
##$USERP1= <user>
##$USERP2= <user>
##$USERP3= <user>
##$USERP4= <user>
##$USERP5= <user>
##$WDW= 1
##$XDIM= 8192
##$YMAX_p= 0
##$YMIN_p= 0
$$ End of Bruker specific parameters
$$ ---------------------------------
##NTUPLES= NMR FID
##VAR_NAME=  TIME,          FID/REAL,        FID/IMAG
##SYMBOL=    X,             R,               I
##VAR_TYPE=  INDEPENDENT,   DEPENDENT,       DEPENDENT
##VAR_FORM=  AFFN,          ASDF,            ASDF
##VAR_DIM=   8192,          8192,            8192
##UNITS=     SECONDS,       ARBITRARY UNITS, ARBITRARY UNITS
##FACTOR=    0.000296,      1,               1
##FIRST=     0,             0,               0
##LAST=      2.424536,      0,               0
##MIN=       0,             -719157,         0
##MAX=       2.424536,      913617,          0
$$ Real data points
##PAGE= N=1
##DATA TABLE= (X++(R..R)), XYDATA
0 0 0 0 0 0 0 0 0 0 0 0 8 -8 8 -8 16 -20 24 -32 40 -42 49 -64 76 -86 102 -124 140 -164 189 -219 247 -283
32 -283 324 -367 414 -469 529 -590 661 -738 822 -912 1013 -1127 1243 -1374 1519 -1676 1846
49 1846 -2034 2242 -2469 2718 -3001 3314 -3662 4059 -4513 5038 -5649 6377 -7261 8352
63 8352 -9749 11612 -14219 18154 -24828 38949 -135415 474162 643862 -354559 -699477
74 -699477 69430 853313 275815 -589861 -331520 614495 716788 -171474 -632002 120154
84 120154 766661 267949 -567288 -407468 442368 571595 -259838 -677019 -42121 583029
94 583029 189990 -558287 -439440 363404 537585 -147376 -538995 3535 603110 309982
104 309982 -363297 -298397 382827 573130 -21567 -417351 352 517405 283221 -334912
114 -334912 -350589 206686 384003 -98883 -487055 -183704 287291 136126 -361436 -410655
124 -410655 34115 263194 -85703 -414230 -178948 223188 184913 -191047 -276854 81972
134 81972 307457 66938 -220232 -98838 222460 227963 -88745 -221558 23184 224265
144 224265 59769 -211454 -183392 79476 135625 -103976 -246390 -85144 122062 55842
154 55842 -166994 -164409 61374 168691 23528 -125114 -18806 183248 172692 -847 -49923
165 -49923 109858 230207 118103 -39987 -3500 149234 166226 2843 -95763 4659 111939
176 111939 44470 -102172 -111379 22142 67385 -49855 -134127 -62855 56608 42093 -76287
187 -76287 -83728 31034 91744 25771 -57954 -11510 91636 77827 -12760 -43696 19552 72203
199 72203 10720 -66056 -47914 4862 1316 -63351 -100332 -61624 -30247 -57534 -89926 -82682
211 -82682 -49497 -35420 -48752 -49957 -30983 -15910 -6497 5999 9858 8368 17857 42349 60938
224 60938 39275 7599 28432 68893 57018 2511 -21865 28146 66630 4663 -62422 -28898
236 -28898 50145 49825 -50353 -88602 16394 89385 17001 -76947 -35203 105444 117150 -25427
248 -25427 -68987 62031 165225 76229 -80371 -37305 139054 143397 -31208 -114113 22592
259 22592 159081 40912 -153743 -108453 83907 106112 -93160 -206880 -36904 132105
269 132105 14443 -189545 -150977 79440 136564 -83504 -207956 -21352 171959 70163
279 70163 -161678 -139923 116875 182245 -52912 -200908 -27614 186268 84669 -179049
289 -179049 -169987 93561 172516 -61157 -232162 -59790 180336 91006 -178007 -180233 88456
300 88456 198856 -19087 -204738 -42857 208079 143952 -116014 -143087 108305 236659
310 236659 32354 -167554 -34746 205894 166509 -87248 -151502 77094 216251 32519
320 32519 -173333 -79054 157041 152596 -94032 -181316 27099 185440 46723 -165313 -110338
331 -110338 125931 155516 -63943 -172097 -615 177595 75699 -144817 -126186 91874
341 91874 154246 -36828 -180954 -49499 140746 78017 -135215 -162516 34502 140168 -18667
352 -18667 -186399 -96639 102760 96474 -104335 -175396 1102 142444 27907 -156329 -112015
363 -112015 95956 134306 -55691 -164621 -14853 160596 80351 -127633 -122116 90252 170075
374 170075 -10809 -166412 -40188 167421 117651 -105797 -141847 72281 197324 25583
384 25583 -163812 -58960 169240 154728 -82268 -159702 54543 210035 51437 -161458
394 -161458 -85150 157953 170850 -76411 -181735 25057 203314 62920 -171025 -119254
404 -119254 136002 174898 -67464 -193107 -152 194306 70802 -175505 -141374 116255
414 116255 170603 -65707 -207723 -28048 179431 67846 -182641 -159498 91735 157882
424 157882 -68012 -221474 -47735 167612 69027 -170567 -160311 79779 162804 -48494
434 -48494 -199704 -37567 164380 87479 -133226 -137478 88913 171283 -20557 -158766 -27702
445 -27702 155734 95815 -111626 -120378 76537 147766 -10394 -139971 -34111 134192 82884
456 82884 -93922 -101395 60726 133015 4569 -110300 -15938 125783 86397 -53516 -67767
467 -67767 64391 126786 15844 -77529 -5796 101158 72277 -44621 -63836 37697 79611
478 79611 -6276 -77350 -31530 46023 25799 -60297 -69793 3453 32931 -19542 -65091 -33417
490 -33417 23252 12430 -36962 -35740 7876 26251 -1769 -27670 -5853 21862 8690 -14773
502 -14773 -15446 -702 1744 -16533 -22925 -10503 -12169 -24154 -26412 -18942 -13770 -24512 -28917 -8866
516 -8866 1381 -11144 -18355 -2032 24853 21789 -3941 1794 35032 46716 21356 -1393 23034
529 23034 58529 42659 682 -3797 33514 49463 7247 -31582 -7729 34586 22816 -31355
541 -31355 -44336 6221 37378 -2916 -49745 -24106 38750 40218 -20865 -41222 19536 70270
553 70270 30987 -36077 -19405 56386 66989 -9754 -57204 -404 65181 22281 -67547 -66840
565 -66840 20025 47945 -41511 -109869 -47588 41643 13219 -91333 -100630 10446 65278 -22752
577 -22752 -104659 -39026 80455 66238 -57443 -82007 41307 116947 24833 -86283 -32615
588 -32615 102924 93674 -52062 -100050 25045 116887 16811 -121983 -72786 83344 86848
599 86848 -70824 -133169 7017 127303 29291 -123929 -71154 108766 130834 -36556 -114823
610 -114823 35790 175083 73933 -97369 -59390 126462 156246 -29489 -129959 16287
620 16287 157893 58484 -130376 -109686 84591 121783 -66785 -174587 -34070 125641 43086
631 43086 -150301 -130634 71811 127106 -45249 -160033 -22793 151622 77831 -115017 -105135
642 -105135 89226 155110 -16660 -147995 -21812 144861 72400 -122485 -132024 55108 126285
653 126285 -43757 -176287 -59987 108361 57694 -128540 -143131 42166 124492 -20228
663 -20228 -143353 -39685 130170 98818 -73727 -94721 71580 155482 30519 -97389 -21155
674 -21155 133110 108241 -53041 -91131 44481 128202 18793 -112331 -57274 82319 74681
685 74681 -65297 -113744 5374 98384 15367 -100326 -57603 72921 87367 -30363 -84229
696 -84229 18805 110932 48976 -57967 -39939 72952 96516 -10765 -75514 -4467 76863
707 76863 34016 -71164 -76909 17449 49346 -32432 -99721 -52061 32091 16556 -70945 -85366
719 -85366 -4811 45882 -5071 -69224 -35812 47646 52510 -18914 -48385 14213 71688 34097
731 34097 -35362 -26425 43187 59152 -6832 -53018 -10133 45762 21016 -49787 -57310 7426
743 7426 37885 -13223 -61849 -28111 37578 33732 -26289 -39094 20707 63815 27131 -24487
755 -24487 -1860 61266 66338 9228 -18885 25415 67358 34307 -23319 -18350 32357 40857 -13169
768 -13169 -48922 -14066 27496 4276 -47061 -47859 819 19271 -21069 -50039 -18089 24696
780 24696 15248 -24754 -26112 16921 36064 4613 -21405 -1195 31341 23358 -13323 -20368 7332
793 7332 17342 -7271 -31287 -23032 -1168 -7417 -31647 -34984 -18091 -7856 -16295 -27745 -18426
806 -18426 -3885 -3047 -5285 -2619 4416 11483 11865 15224 19808 16153 16878 23514 24340 16510 6341
821 6341 10637 23873 15253 -5538 -7941 7520 15830 -4920 -26521 -9391 16093 6751 -22133
834 -22133 -25034 11402 32086 2038 -24317 671 40175 34150 -9848 -17463 29246 51219 10544
847 10544 -28453 -6127 42058 31137 -30212 -43989 6195 33204 -11369 -63009 -38198 22976
859 22976 15438 -48506 -64263 -5773 36580 -6407 -63422 -34695 35757 36808 -28456 -51860
871 -51860 11418 61939 16119 -47547 -25057 46329 51038 -22182 -56362 5458 58144 14715
883 14715 -55983 -43830 32160 46565 -26592 -65741 -8642 52726 23148 -48951 -42595 37015
895 37015 62454 -1148 -47997 -1178 68877 49508 -25475 -32365 38662 73692 15759 -45646
907 -45646 -11857 59859 49655 -28490 -53791 11133 59457 9028 -61070 -39180 37468 44615
919 44615 -31063 -68770 -5736 57180 18977 -58186 -48299 35294 60003 -13753 -66096 -10885
931 -10885 64152 36354 -51530 -58280 26671 65621 -7894 -78168 -32988 53491 39120 -55896
943 -55896 -79281 7226 63536 -3049 -84506 -46362 52849 54401 -43582 -79023 10653 81743
955 81743 20372 -72213 -42613 64954 76474 -27316 -75315 12819 93519 34858 -69453
966 -69453 -49011 64054 82279 -25450 -83818 2176 92343 38769 -72893 -58267 58163
977 58163 84666 -21304 -86973 -3935 93768 44873 -68529 -59837 55428 90032 -12552
988 -12552 -85155 -8852 88814 45739 -66145 -66456 43624 83127 -15889 -90054 -20318 74033
1000 74033 39695 -68808 -74691 31363 71593 -18492 -88486 -26547 66657 38173 -64927
1011 -64927 -70692 27445 67063 -11918 -80447 -25395 62528 37612 -54101 -61131 24132 64185
1023 64185 -5828 -69568 -21657 54924 37192 -40873 -52294 21469 59514 1142 -53315 -16406
1035 -16406 48491 39027 -27469 -40701 20614 53191 8017 -37877 -12620 41763 36248 -18781
1047 -18781 -31397 14862 42352 9755 -29260 -10968 32881 29019 -12113 -22777 10061 33255
1059 33255 9670 -21029 -8076 22350 20345 -7248 -18156 3770 19751 1809 -18411 -11892
1071 -11892 5728 6730 -11238 -19063 -5348 3197 -5040 -14937 -12851 -2258 -986 -9747 -10905 -4945
1085 -4945 -1477 -2564 -5109 -3497 -528 -2688 -3003 -257 -543 -2785 -4112 -833 2209 -2754 -7570
1100 -7570 -3183 2594 220 -8419 -9844 994 6439 -2195 -9772 -2143 11659 10504 -2968 -4614
1114 -4614 11135 20750 9655 -3895 3532 22353 22046 2491 -5574 10930 24828 10816 -10800
1127 -10800 -7472 14835 17913 -6447 -20717 -2536 18228 6467 -21512 -20483 9060 19525
1139 19525 -6538 -27160 -7027 23846 15955 -17922 -21318 13219 30220 1094 -28801 -10469
1151 -10469 26739 20457 -22144 -33380 3507 27596 -3622 -43201 -26880 18139 16936 -30345
1163 -30345 -48089 -5093 30886 1613 -44396 -28890 25590 33782 -16436 -41292 4955 49107
1175 49107 21039 -32009 -22637 37144 50358 -7245 -41316 2943 52026 24578 -38553 -35281
1187 -35281 29629 46955 -13232 -53876 -9388 49186 24938 -43581 -41723 28424 53895 -4395
1199 -4395 -50739 -5349 60755 39369 -31804 -35196 34403 65300 4613 -49671 -8601 56924
1211 56924 38285 -36864 -50179 18117 52401 -7395 -65514 -30384 37603 27598 -46398 -62670
1223 -62670 6727 47428 -3810 -61343 -30549 41877 38621 -32265 -50612 13885 57599 11769
1235 11769 -48788 -23614 45838 44294 -24961 -50630 5251 50050 8167 -53274 -35259 28910
1247 28910 33879 -27745 -57076 -6175 41887 10668 -44702 -33005 27969 43965 -7555 -38397
1259 -38397 4322 51826 31627 -20650 -20461 32989 52953 7003 -29379 -1521 42700 30906
1271 30906 -21270 -31411 12501 35070 -677 -39806 -22222 23136 21513 -23398 -38101 -151
1283 -151 31255 7839 -31367 -20483 23864 32824 -4882 -27751 2173 37643 21788 -19778
1295 -19778 -21867 16761 32518 -2335 -35595 -16314 21304 14154 -28589 -41385 -5314 20285
1307 20285 -7107 -43730 -29770 13411 18468 -20478 -37780 -1808 33242 13392 -25571 -17780
1319 -17780 26756 38052 -1147 -25885 5115 41309 23168 -21250 -21282 21006 34705 -5216
1331 -5216 -35691 -9459 28591 14821 -29242 -31990 11121 30109 -4957 -35133 -9510 32079
1343 32079 24281 -16846 -21131 20730 42101 10316 -20212 163 37898 30767 -10910 -19926 14678
1356 14678 32744 2838 -28970 -14288 18949 12326 -24362 -33072 -3094 14783 -8602 -34416
1368 -34416 -19193 11477 9300 -17969 -23261 3723 20763 1904 -17174 -4470 18632 16254
1380 16254 -6405 -11571 8210 17587 1141 -14224 -7572 7423 3425 -14327 -16190 -4023 574
1393 574 -8626 -16204 -9084 986 -2258 -8867 -5183 3076 6064 1956 2434 10184 12196 8240 8034
1408 8034 13035 14855 9414 4739 9656 12734 5190 -1868 744 7484 4016 -8661 -10522 1081
1422 1081 4411 -6588 -15335 -6222 7704 3224 -11576 -9262 7949 14602 461 -11144 2350
1435 2350 20337 12469 -6920 -7511 12038 19499 -818 -17919 -5018 13300 5404 -19560 -23924
1448 -23924 -754 9713 -11312 -29848 -16706 7934 4684 -21395 -25360 1500 17603 -358
1460 -358 -21204 -8356 21163 20568 -7702 -15901 9610 29148 10338 -17424 -8837 21303 22597
1473 22597 -7884 -23557 88 24201 6886 -24672 -20460 12311 21673 -8175 -28666 -4291
1485 -4291 26537 16112 -17769 -18458 17660 34206 4752 -21599 -948 34798 28264 -11168 -20477
1498 -20477 15485 36257 5825 -29124 -13834 25271 22021 -21369 -36231 859 28538 387
1510 387 -39029 -25745 19803 23389 -20869 -39523 -252 35043 9874 -33964 -23320 26295
1522 26295 34863 -12018 -37919 -706 39370 15604 -34044 -29429 21600 34768 -13509 -45437
1534 -45437 -9926 34668 14651 -38421 -37216 16929 36079 -10018 -45012 -9438 40030 23737
1546 23737 -29829 -30961 23266 46506 933 -37272 -4087 45945 31310 -23969 -30357 22504
1558 22504 46440 1032 -39620 -10403 39093 27278 -27941 -36571 15200 40675 -927 -41615
1570 -41615 -15680 35075 27487 -25117 -34741 13219 41331 4457 -36630 -14244 34619 29142
1582 29142 -19959 -33467 9161 37501 4071 -36235 -18324 25263 22650 -22491 -37492 1135
1594 1135 28697 -240 -36499 -21875 18850 20014 -19601 -33271 1443 27001 4376 -27709
1606 -27709 -16495 20366 22625 -11176 -24290 3125 26239 8395 -20935 -13359 16799 19767
1618 19767 -7281 -20215 419 21241 7894 -16073 -11540 12086 17225 -2871 -15434 616
1630 616 18117 9544 -8490 -7417 10581 16573 1413 -9389 1220 13995 9632 -4331 -6274
1643 -6274 6580 11683 1441 -6803 -2592 6711 5468 -4742 -7111 286 4628 371 -6445 -5344
1657 -5344 1255 2361 -2788 -6113 -4028 299 455 -4217 -5666 -2683 311 -614 -4790 -6050 -2400
1672 -2400 104 -1544 -5120 -5110 -982 1258 -1696 -4686 -3038 1340 1947 -2145 -4612 -710 3369 2384
1688 2384 -2231 -2946 2190 5234 1296 -2984 -1319 4306 5182 -93 -3156 1713 6724 5067 -1190
1703 -1190 -1660 4414 8151 3416 -1917 542 7283 8359 1473 -2233 3205 9266 5896 -2787 -3585
1718 -3585 4220 8194 359 -7835 -3537 5921 5170 -6091 -10765 -819 7575 4 -11711 -8720 5137
1733 5137 7997 -5796 -13498 -1661 11266 4310 -11835 -11031 6281 12044 -4540 -16170 -3864
1746 -3864 12981 6412 -14625 -16210 4505 13186 -4907 -21251 -9011 13234 8783 -15228 -18653
1759 -18653 5229 18706 -4 -20322 -6896 19870 16675 -9483 -15843 9494 26865 6289
1771 6289 -17477 -5659 22509 20416 -9249 -19486 7038 25749 4856 -21709 -11753 18646
1783 18646 18938 -12426 -23848 3730 24464 5572 -22111 -12958 19712 22115 -8527 -21344 4214
1796 4214 27264 10256 -19592 -13196 18103 22411 -6929 -23666 -1643 22635 7396 -23117
1808 -23117 -20779 8625 16751 -10357 -29162 -9063 16276 6144 -21818 -21953 6643 18847 -4700
1821 -4700 -23540 -5985 19531 14282 -12292 -16631 9498 22910 2859 -18107 -7021 17424
1833 17424 15556 -10729 -19124 2709 18284 3230 -19363 -13736 11333 14601 -8016 -19787 -1901
1846 -1901 18876 9800 -13231 -11737 13132 23027 3471 -13805 -259 22968 18164 -6347 -11855
1859 -11855 10096 23913 5325 -16725 -8152 15578 14761 -11115 -21894 -976 16725 1523
1871 1523 -22420 -16581 9824 14484 -10033 -23397 -2260 19618 8068 -17409 -14330 13688 21825
1884 21825 -3347 -20634 -2050 21993 11845 -17392 -18632 9051 19171 -6018 -26734 -10212
1896 -10212 15956 7801 -21903 -25025 3581 17705 -5149 -26156 -9489 18529 13942 -14287
1908 -14287 -17720 10840 25904 4646 -16759 -2138 24726 20036 -8090 -13989 11265 24405
1920 24405 3459 -18735 -6916 17554 13036 -13310 -19659 3782 17439 -895 -20292 -8768
1932 -8768 14473 12469 -10024 -14885 7087 20407 4759 -11929 -2324 17670 15943 -4752 -10188
1945 -10188 7148 16566 2636 -12940 -6645 9295 5928 -11396 -15458 -2131 5308 -5599 -17192
1958 -17192 -10244 2732 815 -10779 -11610 396 6588 -1407 -8006 -1115 7990 5792 -2190 -2195 6373
1973 6373 8201 1003 -2846 1493 5291 1107 -4985 -3346 1338 -371 -5362 -5452 -1238 234 -3991
1988 -3991 -5468 -32 3035 -181 -2759 1266 7426 5933 937 2822 9516 10076 4288 681 6419
2003 6419 11469 5064 -2413 -227 6907 5688 -4273 -8307 -282 4489 -3135 -11413 -7781 2993 2490
2018 2490 -8473 -10665 370 7472 681 -8850 -3799 9181 8833 -3282 -7041 4037 12508 3712
2032 3712 -9189 -5314 7649 7297 -6898 -13840 -2948 7271 -1465 -15578 -12223 2197 5149
2045 5149 -8868 -16022 -3849 8964 3104 -10747 -8628 8327 13989 294 -8935 2243 16610
2058 16610 11558 -5014 -6276 10077 16717 2124 -10957 -2661 13187 9656 -9534 -13640 2625
2071 2625 12746 -204 -15870 -8357 11274 11241 -7754 -14282 3098 17961 6546 -11903 -6368
2084 -6368 14946 18147 -2254 -12975 3448 20055 8548 -13523 -11805 10108 15113 -6645 -21131
2097 -21131 -5648 13840 4453 -19741 -19384 4670 13367 -7708 -23823 -7790 15569 9017 -15795
2110 -15795 -17196 8671 20574 -576 -19491 -4503 20347 14544 -12721 -17364 8381 21990
2122 21990 133 -22023 -9026 17174 13120 -15862 -22018 4003 19911 100 -22696 -10240
2134 -10240 17507 16065 -11655 -18536 7206 24768 5891 -17151 -5833 21741 20494 -6805
2146 -6805 -15482 7964 25069 6379 -17556 -8505 17034 16365 -10038 -20163 1827 18371 2250
2159 2250 -20096 -12939 12021 13689 -10080 -19528 992 17784 4921 -15938 -10539 12657 15435
2172 15435 -5651 -15510 855 16627 5700 -14308 -10850 8693 11582 -6544 -17012 -3876
2184 -3876 10487 2043 -14641 -12483 3930 8310 -5641 -14647 -3705 9405 4249 -8406 -8381 5537
2198 5537 10850 465 -7318 -536 10122 8154 -2905 -5244 4526 9897 2724 -4927 -2562 6189
2212 6189 6712 -1902 -6024 -204 5997 3172 -4133 -4485 3340 6659 1260 -3994 -1064 6201 6049 -605
2228 -605 -3202 1978 7205 4481 -2770 -2690 4096 5641 -129 -5460 -2238 3937 2308 -5180 -6987 -614
2244 -614 3407 -1401 -8266 -5483 2225 2401 -5147 -8033 -1539 4336 263 -6690 -4867 3234 4806
2259 4806 -2505 -6601 -698 5404 1640 -5324 -4665 2743 4737 -2169 -6036 -1125 4434 2190 -4531
2274 -4531 -4065 2209 4541 -579 -4067 21 5236 3624 -1728 -1419 3530 4988 1559 -1218 1354
2289 1354 4386 3623 280 243 2919 3530 1333 -52 807 1703 1337 388 211 700 293 500 893 155
2307 155 -1176 -850 891 1060 -1455 -2727 -370 1837 18 -3735 -3074 1318 1941 -3175 -5734 -1479
2323 -1479 3000 -38 -6123 -4666 2304 3427 -3577 -7424 -1233 5509 1266 -7209 -5490 4069 6085
2338 6085 -3094 -8849 -900 7714 2310 -7868 -6702 5194 8346 -2780 -9567 -560 10088 5085
2352 5085 -7499 -6728 7233 11227 -983 -8961 293 12860 7743 -6807 -6400 7959 12793 57
2366 57 -9775 -983 12486 7397 -7764 -8643 5854 12009 -932 -12339 -3706 10513 6626 -8609
2380 -8609 -10988 3927 11999 -55 -12196 -4556 10372 8535 -7336 -11419 3047 12220 997
2393 997 -12566 -6979 8895 8735 -7785 -13927 -577 10077 1027 -13935 -10153 6223 8200 -6641
2407 -6641 -14284 -2342 10852 3898 -11346 -9200 6774 12014 -1797 -11600 -685 13300 8037
2420 8037 -7541 -8465 6748 13729 524 -11399 -2878 11721 8864 -7411 -11344 3612 12882
2433 12882 1080 -12668 -5810 10542 10673 -5532 -11651 3252 15195 5460 -9886 -5849 11922
2446 11922 14078 -2839 -11116 1984 15190 6847 -10683 -9035 8399 12237 -4714 -15528 -3481
2459 -3481 11490 3962 -13736 -13344 4570 10659 -4853 -16601 -4709 11599 6392 -11454 -12230
2472 -12230 6080 13969 -1230 -13917 -3474 13552 9250 -9574 -11841 5507 13726 -986 -15384
2485 -15384 -5904 11066 7442 -11078 -14316 2515 11744 -1388 -14926 -6118 10981 9250 -7864
2498 -7864 -10781 5665 15252 3194 -9667 -2033 14167 12174 -4225 -7848 6778 14735 3103
2511 3103 -9629 -3518 10549 8058 -6842 -10484 2225 9701 -765 -11810 -5568 7040 5609
2524 5609 -6700 -8988 2317 9664 1122 -7492 -2119 8470 6889 -3573 -5754 3445 8064 551
2538 551 -6867 -2919 5109 2883 -6085 -7399 -530 2475 -3666 -8953 -4796 1206 -1007 -6605 -5971
2553 -5971 80 2465 -2038 -4367 208 4108 1781 -1431 430 4609 4452 376 -114 3528 4089 664
2569 664 -1300 726 2969 301 -3097 -1789 1460 579 -3192 -3618 907 2434 -1193 -2993 701 4614
2585 4614 3247 -1432 429 5963 6340 1402 -705 3670 7253 3257 -2416 -344 4639 4065 -2644
2600 -2644 -5284 -120 3162 -1719 -7825 -5519 936 1158 -5779 -8119 -1141 3428 -643 -6559 -3912
2615 -3912 4297 4708 -2309 -4923 1677 7077 2843 -4658 -2784 4688 5433 -2604 -6990 -1192 4766
2630 4766 557 -7682 -6586 1214 3592 -3694 -8892 -2673 4901 2308 -5628 -5464 3682 8100 1508
2645 1508 -4742 764 9112 7997 -895 -3107 5167 10152 3412 -4524 -1641 7178 6857 -3546 -7393
2660 -7393 328 6922 1297 -8719 -6576 4312 6076 -4001 -9207 -897 8323 3777 -6764 -5581
2674 -5581 6291 9809 -104 -7529 -36 10575 6144 -6272 -7313 4460 8611 -2088 -11595 -4625
2688 -4625 6740 3206 -9941 -12130 456 6696 -3132 -13295 -6128 6945 5108 -7751 -10067
2701 -10067 3107 11130 1708 -9382 -3129 10693 9846 -4270 -8362 4055 12640 3065 -9539
2714 -9539 -4857 8511 8414 -5844 -11210 859 10006 1569 -10680 -6705 7224 8643 -4265 -9452
2728 -9452 1707 11634 4878 -6759 -3933 9509 11563 -536 -6911 2110 11769 5641 -6282 -5304
2742 -5304 5872 8526 -2373 -9641 -2435 6796 2264 -8682 -9022 1587 5786 -2771 -10249 -3928
2756 -3928 5607 3838 -5770 -7247 2330 7637 637 -6519 -2582 5977 6018 -3273 -6552 917 6104
2771 6104 1103 -6783 -5370 2598 3657 -3862 -8105 -2461 3963 1216 -5930 -5558 1826 5060 -361
2786 -361 -5294 -1090 6182 5610 -1443 -2822 3521 8229 3626 -3213 -758 6174 6442 -632 -4366 906
2802 906 6498 2656 -4666 -3957 2782 5031 -1681 -6504 -1458 5268 2993 -4227 -4681 2903 6337 241
2818 241 -5061 -940 6063 5000 -2796 -4574 2450 6157 335 -5634 -3164 3716 2940 -4614 -6737
2833 -6737 -664 3358 -1149 -7421 -4801 2182 2107 -4424 -6518 -691 3674 221 -5244 -2985 3669
2848 3669 3935 -1666 -3834 1324 5204 1558 -3446 -1903 3586 3763 -1221 -3337 802 3743 867
2863 867 -3224 -1924 2392 2427 -1234 -2570 682 3262 1404 -1051 133 3208 2860 548 -62 2327
2879 2327 3328 1509 426 1229 2695 1317 -79 201 1041 527 -1092 -687 293 120 -1735 -1581 19
2896 19 436 -1594 -2767 -559 1124 -885 -3166 -1627 1418 1047 -2232 -3228 409 2428 -695 -4050
2912 -4050 -1785 2405 1490 -3368 -4298 555 3134 -1091 -5268 -2410 3302 2061 -3785 -4421 1565 4964
2928 4964 32 -5171 -1734 5329 4066 -2944 -4273 2928 7033 698 -5382 -1108 6555 5671 -3134
2943 -3134 -4917 2792 7784 1229 -5559 -1974 6896 5938 -3058 -5511 2607 7879 1658 -6303 -2995
2958 -2995 6254 6154 -3312 -6581 1372 7550 1762 -7108 -4310 5151 5843 -3685 -8218 -294 7088
2973 7088 1621 -7635 -5620 4238 6130 -3320 -8990 -1098 6992 2663 -7244 -6491 3696 6908 -2461
2988 -2461 -9214 -2220 6727 3450 -7089 -7567 2752 7200 -1147 -8924 -3279 6781 5182 -5326
3002 -5326 -7213 2805 8652 1146 -7545 -2766 7944 7367 -3350 -6574 2608 9801 2900 -6987
3016 -6987 -3627 7350 8053 -2927 -7974 1277 9457 3119 -7728 -5391 6123 8261 -2770 -8838
3030 -8838 173 9460 4291 -7223 -6214 6006 9316 -1537 -8930 -687 9422 4842 -7281 -7429
3044 -7429 4376 8464 -2041 -10492 -3137 7394 3791 -8455 -9388 2209 7176 -2699 -10760 -4128
3058 -4128 6930 4311 -7468 -8232 3086 8660 -435 -9128 -2656 8312 6072 -5597 -7023 3278
3072 3278 8895 387 -8267 -2861 7149 5565 -5409 -7794 2316 7671 -17 -7754 -3288 6538
3086 6538 5470 -4109 -6092 3147 8302 1920 -5071 -1114 7497 6436 -1809 -3989 3647 7556 1902
3101 1902 -4473 -1628 4978 4203 -3037 -5034 829 4003 -329 -5451 -2982 2468 1666 -3383 -4673
3116 -4673 -166 3133 -279 -3826 -1623 2680 2495 -1256 -2261 1064 2893 223 -2209 -1003 1140
3131 1140 722 -1835 -2624 -740 -121 -1519 -2860 -2154 -1017 -1360 -1908 -1764 -791 -637 -693 -528 485 713
3149 713 198 955 1930 1755 1064 1248 2465 2861 1226 414 1596 2554 1237 -752 -724 1121 1362 -1005
3167 -1005 -2126 -430 1324 251 -2246 -1502 1360 1992 -310 -1373 527 3443 2212 -581 31 2756
3183 2756 3598 513 -1483 568 3018 1557 -1785 -2468 399 1230 -1738 -4379 -2784 0 -636 -3972
3199 -3972 -4550 -1406 757 -1239 -3824 -2543 1222 1880 -1131 -2422 496 3432 1984 -1393 -1321 2313
3215 2313 3478 229 -2642 -908 2669 1755 -2603 -3348 51 2419 -701 -4241 -2661 1959 2084 -1987
3231 -1987 -3480 473 4466 2225 -1863 -743 4204 5587 1244 -1792 1744 6375 4066 -1465 -2028
3246 -2028 3423 5374 -73 -4891 -1547 4065 2112 -4558 -5624 555 3678 -1347 -6443 -3044 3915
3261 3915 3016 -3896 -5433 1398 6002 1024 -5106 -1943 5333 5030 -2520 -5296 1155 5843 541
3276 541 -6265 -4329 3264 3620 -4333 -7822 -1522 4165 -233 -7598 -5626 2674 4154 -3060 -6807
3291 -6807 -114 6626 2900 -4490 -3170 5649 7458 85 -4490 978 8002 4364 -3721 -3635 4136
3306 4136 6684 -695 -6346 -1760 5502 3137 -5077 -5596 2163 5603 -684 -6035 -1587 5485 4500
3321 4500 -2800 -4053 3326 7136 2023 -4086 -1068 6041 5383 -2131 -4590 1353 5604 1101 -5480
3336 -5480 -4285 2691 3114 -3637 -7141 -1912 3335 -196 -6367 -5304 1448 3476 -2060 -5985 -1455
3351 -1455 4867 2765 -3485 -3739 2447 5449 620 -4188 -863 4446 3511 -2920 -4734 815 4376
3366 4376 -262 -5440 -3349 2599 2905 -3098 -5369 -76 4566 1443 -3874 -2595 3855 5362 -162
3381 -162 -3354 1352 6480 4035 -2219 -1586 4430 5997 237 -3961 -148 5195 2809 -3764 -3876 1891
3397 1891 3956 -1336 -5667 -2251 3449 1876 -4017 -4480 1537 4464 -113 -4697 -1177 4198 3238
3412 3238 -2620 -3678 1912 4761 330 -4348 -1623 3263 2112 -3444 -4508 180 2583 -1462 -5438
3427 -5438 -2981 1890 1126 -3819 -4509 338 2670 -603 -3695 -1100 3040 2400 -1248 -1779 2111 4101
3443 4101 999 -1679 501 3378 2461 -1023 -1273 1511 2557 -79 -2121 -235 1913 665 -1805
3458 -1805 -1071 1327 1439 -523 -1117 853 2236 814 -582 759 2299 1682 -188 53 1975 1940 -498
3475 -498 -971 776 1786 -437 -2190 -806 963 -165 -2504 -2350 205 635 -2219 -3409 -960 1362
3491 1362 -437 -3076 -2163 1540 1619 -1929 -2764 500 3038 256 -3117 -1551 2478 2047 -2299 -3246
3507 -3246 719 3092 -87 -3799 -1908 2577 2286 -2506 -3767 835 3832 563 -3622 -1349 3738
3522 3738 3563 -1730 -3127 1806 5191 1446 -3030 -829 4518 4301 -1201 -3234 1548 5232 1315
3537 1315 -3498 -1778 3650 3704 -1865 -4227 564 4428 954 -4108 -2737 3026 3677 -1642 -4460 -34
3553 -34 4215 1679 -4099 -3386 2450 3879 -1499 -5039 -1096 4131 1652 -4083 -4309 1546 3837 -1132
3569 -1132 -5550 -1969 3559 2052 -3983 -4684 797 4364 -354 -5311 -2416 3576 3278 -2709 -4614
3584 -4614 1126 5117 1024 -4449 -2527 4119 4575 -1954 -4624 666 5647 2014 -4220 -2592 4042
3599 4042 5144 -1084 -4570 436 5900 2666 -3772 -3045 3703 5754 -771 -4754 -240 5776 3077
3614 3077 -3998 -4120 2993 5409 -730 -5399 -1224 5070 3027 -4084 -4461 2425 5082 -498 -5534
3629 -5534 -1788 4826 2817 -4053 -5035 1463 4876 -452 -5778 -2457 3734 2768 -3878 -5472 684
3644 684 4377 -372 -5697 -2671 3409 3161 -3179 -4929 749 4780 553 -4390 -2077 3945 3779 -1995
3660 -1995 -3756 1167 4794 1185 -3533 -1849 3495 3562 -1424 -3465 450 3970 1186 -3130 -2068
3675 -2068 2716 3062 -965 -2852 440 3829 2004 -1963 -1264 2325 3448 50 -1876 450 3148
3690 3148 1853 -1156 -1398 1250 2223 -196 -2231 -1200 1306 646 -1809 -2237 -658 926 -672 -2293
3706 -2293 -1741 238 725 -1327 -1765 -569 928 382 -1128 -1139 500 1193 27 -1216 -693 665 806
3723 806 -678 -1306 -612 487 74 -1261 -1602 -129 409 -296 -1418 -840 918 950 -285 -708 613 1655
3741 1655 1268 22 24 1791 2342 1055 -89 914 2343 1707 -75 -420 921 1474 481 -1024 -575
3758 -575 734 691 -939 -1561 -427 769 -19 -1083 -716 610 1073 12 -513 210 1117 850 -111 -497
3776 -497 616 922 8 -876 -543 -4 -112 -921 -1781 -1162 -835 -1110 -1819 -1841 -1315 -816 -683 -1064 -1353 -313
3796 -313 371 -23 -642 -82 1144 1507 432 -263 726 1968 1404 -288 -717 932 1834 87 -1429 -676
3814 -676 1241 955 -1525 -1998 10 1527 252 -1923 -873 1736 2250 -234 -1412 1357 3704 1902
3830 1902 -1034 -230 3247 3614 -43 -1974 817 3772 1312 -2501 -2307 1561 2335 -1778 -4074 -1155
3846 -1155 2016 74 -4132 -3519 1131 2435 -1659 -4458 -833 3362 1722 -2893 -2763 2203 3805
3861 3805 -340 -3569 -500 3766 1919 -3121 -3610 1459 3417 -1160 -5067 -1844 2853 1508 -3850
3876 -3850 -4325 880 3170 -564 -4308 -1331 3885 3204 -1952 -2833 2377 5249 1545 -2665 -345 4651
3892 4651 4256 -1135 -2676 1685 4745 950 -3519 -2013 2956 2961 -2234 -4190 -93 3361 744 -3992
3908 -3992 -2754 2343 3316 -1129 -3688 203 4122 2194 -2380 -2020 2606 4079 -212 -3351 -625
3923 -625 3588 1942 -3062 -3626 617 2717 -1194 -4960 -2488 1718 1192 -3756 -4901 -201 2541 -431
3939 -431 -4204 -2123 2899 3010 -1524 -3198 1167 4331 1459 -2796 -1431 3368 3806 -871 -3357 435
3955 435 3921 1278 -3447 -2915 2102 2965 -1615 -4371 -598 3442 1491 -3149 -2585 2525 4231 -196
3971 -196 -2930 546 4942 3164 -1568 -1830 3170 4699 190 -2873 -217 3727 2080 -2830 -3237 1478
3987 1478 2838 -1130 -4510 -1880 2109 588 -3390 -3502 664 2596 -823 -3612 -747 2899 1743
4002 1743 -2149 -2212 1632 3178 -177 -2459 -594 2586 1212 -2233 -2471 573 1677 -1306 -3089 -1102
4018 -1102 1293 154 -2600 -2246 581 1374 -716 -1883 102 1898 943 -601 -87 1885 2281 649
4034 649 -352 1233 2193 1189 -231 471 1658 1124 -287 -664 595 802 -458 -1020 -7 794 -15
4051 -15 -1190 -378 891 623 -678 -454 882 1428 29 -633 616 1838 686 -769 -312 1265 713
4068 713 -1134 -1596 332 956 -833 -2475 -1387 546 -68 -2303 -2373 -265 1008 -955 -2804 -1196
4084 -1196 1454 820 -1609 -1667 886 2392 241 -1895 -371 2392 1827 -1290 -1589 1240 2465 18
4100 18 -2321 -563 2167 1434 -1859 -2326 965 2423 30 -2494 -805 2258 2257 -1034 -1659 1341 3132
4117 3132 1236 -1705 -306 2839 2758 -498 -1813 863 3219 855 -2082 -1516 1723 2362 -1088 -2900
4133 -2900 -520 1964 289 -2505 -2207 973 1986 -898 -2929 -981 2136 1163 -2054 -2284 1124 2648
4149 2648 -133 -2609 -1270 1998 1743 -2002 -2918 246 2455 -191 -3150 -2076 1493 1860 -1864 -3308
4165 -3308 -125 2763 650 -3005 -1701 1852 2757 -678 -2880 207 3368 1575 -1983 -1827 2117
4180 2117 3596 -15 -2529 -272 3439 2156 -2006 -2234 1964 3452 52 -3103 -879 3190 2546
4195 2546 -2033 -2895 1274 3441 399 -3267 -938 3114 2414 -1864 -3052 849 3553 628 -3387
4210 -3387 -1869 2474 2429 -1940 -3373 287 2956 207 -3425 -2327 2155 2196 -2141 -3449 -276 2681
4226 2681 497 -3255 -2432 1643 2280 -1339 -3362 -443 2870 895 -2754 -2034 1580 2433 -841 -2837
4242 -2837 -127 2753 1333 -1959 -1779 1626 2734 -146 -2226 -341 2518 1762 -1394 -1505 1426 2715
4258 2715 581 -1847 -388 2108 1562 -900 -1668 882 2334 700 -1430 -624 1720 1669 -613 -1441
4274 -1441 197 1771 782 -1073 -954 1083 1455 -146 -1471 -295 1001 450 -1126 -1406 -63 886
4290 886 -257 -1806 -1069 673 333 -976 -1751 -488 924 -70 -1415 -1184 183 1140 -484 -1537 -486
4307 -486 1428 727 -1069 -1001 479 1408 201 -1296 -387 1083 889 -872 -1158 48 1253 225 -1148
4324 -1148 -693 1221 1251 -444 -863 393 1869 856 -408 -379 1449 1561 266 -524 812 1913 776
4341 776 -544 -233 1117 1076 -316 -950 -79 750 84 -1140 -819 376 263 -736 -1242 -295 436 -138 -758
4360 -758 -448 396 436 -290 -481 275 473 15 -588 -126 126 -285 -871 -407 20 -353 -1036 -921 -302 -473
4380 -473 -863 -928 -218 112 -579 -1099 207 951 97 -635 26 1213 1151 -84 -312 1128 1893 566 -664
4399 -664 64 1827 1194 -836 -1109 845 1770 -103 -1646 -676 1361 835 -1260 -1645 992 1858 53
4416 53 -1793 -195 2276 1577 -956 -1241 1713 2876 190 -1925 -166 2392 1694 -1831 -2073 710
4432 710 2089 -634 -3199 -1309 1544 623 -2739 -3021 363 1924 -749 -3384 -1554 1856 1711 -2073
4448 -2073 -2579 1073 3103 406 -2460 -896 2895 2239 -1468 -2494 568 2955 151 -2823 -1663
4463 -1663 2031 1779 -1881 -3045 195 2593 143 -2994 -1374 2279 2508 -695 -2190 815 3434
4478 3434 1615 -1519 -720 2787 3377 -225 -1907 753 3190 1435 -1915 -1736 1330 2073 -760 -3232
4494 -3232 -854 2069 686 -2483 -2588 953 2220 -386 -2943 -887 2529 1976 -1476 -2188 1068 3054
4510 3054 341 -2244 -902 2129 1964 -1714 -2777 280 2217 -130 -2910 -2230 1125 1353 -2068 -3526
4526 -3526 -481 2082 349 -2828 -1988 1411 2552 -615 -2320 384 3054 1709 -1382 -1050 2203
4541 2203 3391 288 -2090 130 2913 1612 -1840 -2006 1083 2380 -488 -2685 -872 2066 1092
4556 1092 -2137 -2319 1057 2431 69 -2242 -227 2700 2120 -858 -1486 1628 3007 485 -1852 -393
4572 -393 2187 1513 -1463 -2009 466 1600 -636 -2888 -1357 812 177 -2332 -2372 -247 1145 -686
4588 -686 -2308 -1052 1187 984 -1132 -1333 698 1562 250 -930 -178 1561 904 -820 -886 157 1038
4605 1038 -225 -1535 -719 432 270 -1071 -1105 95 385 -328 -863 8 849 521 -188 -19 1037 1152
4623 1152 580 426 980 1375 853 322 664 746 438 -23 141 145 -3 -454 -472 -250 -152 -659 -797 -194 253
4644 253 -280 -861 -329 469 266 -409 -640 525 896 132 -621 33 985 540 -633 -834 287 522 -670
4663 -670 -1594 -839 378 -183 -1826 -1747 -272 471 -703 -1753 -779 943 581 -947 -952 800 1609 235
4681 235 -859 132 1629 1304 -205 -641 935 1777 258 -1160 -261 1174 851 -597 -1257 136 1183
4698 1183 -53 -1338 -765 903 1028 -502 -1118 543 1676 873 -800 -293 1413 1415 176 -995 121
4715 121 1533 654 -908 -987 419 1067 -535 -1626 -998 691 291 -1481 -1825 -486 795 -314 -1783
4732 -1783 -1397 941 963 -829 -1435 21 1477 626 -1018 -997 1015 1739 -364 -1660 -416 1462 814
4749 814 -1419 -1380 543 1562 -514 -2050 -798 1648 1150 -1493 -1808 584 2192 321 -2018 -468
4765 -468 2008 1942 -483 -1395 904 2674 1079 -1544 -716 2060 2235 -799 -2015 209 2301 665
4781 665 -2175 -1347 1495 1790 -869 -2414 -223 2112 782 -2052 -1597 1385 2123 -738 -2450 -26
4797 -26 2180 1113 -1852 -1594 1308 1898 -683 -2762 -752 1942 699 -2166 -2245 688 1633 -763 -2672
4814 -2672 -788 1787 967 -1796 -2043 578 1917 -106 -1998 -687 1950 1485 -1035 -1528 655 2043
4830 2043 464 -1702 -683 1694 1844 -756 -1458 503 2327 607 -1436 -768 1324 1581 -547 -1539
4846 -1539 249 2056 1070 -1228 -782 1305 1708 11 -1300 38 1562 995 -891 -1001 670 1541
4862 1541 -87 -1399 -503 1240 691 -1135 -1581 227 1229 -63 -1459 -826 610 945 -1057 -1615
4878 -1615 -134 1082 264 -1570 -1169 681 747 -734 -1665 -306 1003 360 -1418 -1199 692 1219 -451
4895 -451 -1138 -216 1421 701 -903 -898 703 1350 23 -1017 5 1256 598 -702 -676 912 1313 32
4913 32 -864 -4 1011 970 -520 -455 655 1250 -4 -624 -37 1134 815 -388 -272 537 931 -67 -571
4932 -571 67 653 306 -458 -583 477 326 -467 -682 -56 105 -128 -644 -374 115 -153 -697 -567 -9 151
4952 151 -209 -669 1 298 -291 -578 -137 377 185 -422 -613 274 339 -625 -779 -122 643 -181 -1109 -502
4972 -502 678 246 -693 -806 541 1165 -9 -919 149 1553 887 -597 -505 1040 1923 357 -763
4989 -763 20 1747 1074 -616 -949 812 1663 33 -1730 -448 1273 884 -1167 -1539 626 1574 -280
5006 -280 -1757 -474 1706 1158 -1070 -1371 901 2041 -85 -1767 -296 1753 1033 -1434 -1666 556
5022 556 1590 -565 -2367 -1103 1157 673 -1672 -2300 2 1551 -441 -2378 -1243 1380 1321 -1181
5038 -1181 -1907 493 2318 626 -1500 -608 1887 1928 -725 -1451 645 2296 579 -1768 -1217 1473
5054 1473 1747 -726 -2125 -213 1809 493 -1899 -1224 1404 1895 -250 -1714 123 2232 1391 -1063
5070 -1063 -923 1514 2404 173 -1529 125 2322 1208 -1110 -1605 547 1717 -242 -2322 -1167 971
5086 971 816 -1529 -2488 -314 1322 82 -2155 -1275 1254 1376 -944 -1934 280 2036 798 -1429
5102 -1429 -1054 1451 1766 -377 -1834 -165 1684 531 -1686 -1667 673 1470 -764 -2263 -806 1291
5118 1291 546 -1738 -1722 887 1838 -83 -1607 -43 2163 1795 -883 -834 1375 2554 548 -1129 -119
5135 -119 2041 1507 -833 -1343 404 1815 258 -1786 -837 1170 742 -1130 -1577 232 1330 -42
5151 -42 -1409 -761 1391 1278 -560 -990 535 1718 678 -932 -360 1049 1233 -614 -1280 -55 1052
5168 1052 27 -1494 -1178 114 225 -1390 -1705 -724 320 -196 -1111 -1054 296 904 -57 -630 45 920
5186 920 535 -5 33 880 928 345 -338 145 518 358 -311 -289 98 210 -93 -456 -346 -45 64 -73 -360
5207 -360 -71 549 334 315 413 430 737 832 473 413 550 921 718 292 217 382 437 -39 -441 -303 -69 -25 -513
5230 -513 -925 -459 -296 -267 -793 -815 -176 59 -318 -463 -14 462 263 -410 -278 266 771 218 -406 7 529
5251 529 380 -440 -779 -92 315 -265 -1111 -400 -109 -246 -630 -982 -121 224 -32 -356 -245 482 818 270
5271 270 33 227 789 650 318 178 733 918 471 -187 113 431 547 -120 -323 -138 273 -15 -370 -714
5291 -714 30 315 -36 -459 -256 451 671 -6 -440 163 850 627 -235 -282 356 848 42 -911 -513 534
5311 534 275 -1018 -1179 -148 288 -583 -1545 -887 90 509 -1179 -1587 -85 904 -18 -1257 -803 1037
5329 1037 1323 -513 -1082 214 1933 817 -1053 -725 1190 1465 -663 -1437 -82 1669 515 -1512
5345 -1512 -1232 964 1461 -416 -1867 -9 1965 921 -1171 -987 1334 2075 31 -1522 190 2221
5361 2221 1333 -1110 -1137 1414 2008 43 -1715 -395 1829 1018 -1476 -1727 806 1643 -687 -2205 -815
5378 -815 1293 835 -1501 -1731 484 1735 -294 -2105 -789 1798 1370 -1183 -1895 862 1947 41
5394 41 -1907 -1005 1352 1121 -1184 -1976 110 1563 -52 -2066 -1351 1119 1257 -1011 -1720 73 1600
5411 1600 613 -1490 -865 1431 1659 -235 -1163 336 2036 1050 -978 -883 1318 1727 -63 -1415 -130
5428 -130 1628 766 -1186 -1237 640 1393 -51 -1553 -381 1539 925 -866 -1410 489 1470 205 -1367
5445 -1367 -353 1359 1076 -563 -1323 180 1648 140 -1449 -790 828 751 -814 -1504 -118 1015
5461 1015 81 -1635 -1120 644 741 -641 -1382 -229 949 440 -1170 -908 609 975 -318 -1294 -27
5478 -27 1153 423 -923 -858 726 1237 -141 -1025 -64 1204 491 -731 -656 624 1039 -183 -741 148
5496 148 1107 651 -521 -253 762 969 347 -406 188 1031 686 -207 -325 610 683 32 -601 183 642 252
5516 252 -308 -109 395 335 -258 -389 114 227 -174 -570 -306 224 84 -330 -530 170 137 -417 -588 -188 101
5537 101 -374 -675 -60 401 -12 -406 -502 17 145 -179 -539 14 678 -14 -509 -371 755 409 -426 -670
5557 -670 176 919 51 -892 -202 864 671 -699 -625 518 1114 281 -727 -176 1205 871 -461 -688
5575 -688 732 1434 263 -815 -16 1035 1074 -608 -885 500 1620 -215 -1157 -355 1090 744 -1039
5592 -1039 -1025 320 1292 -83 -1346 -842 1081 822 -943 -1227 311 1383 96 -1351 -576 1029 756
5609 756 -1008 -1275 111 1329 -236 -1287 -872 634 637 -1081 -1803 -46 1137 22 -1438 -886 832
5626 832 1143 -424 -1321 97 1644 718 -883 -511 1080 1472 -26 -834 -53 1460 1057 -760 -912
5643 -912 698 1174 -109 -931 -161 1247 764 -924 -987 239 1236 185 -1135 -569 1133 1062 -422 -771
5661 -771 278 1412 500 -772 -579 870 1200 -581 -1234 -117 1180 415 -1370 -1239 385 870 -789
5678 -789 -1796 -511 692 334 -1227 -1526 116 1047 -273 -1207 -517 1183 921 -792 -1299 474 1401
5695 1401 177 -1187 -585 1187 967 -628 -1338 133 1416 214 -1353 -863 817 909 -615 -1358 202
5712 202 1413 494 -964 -541 1110 1522 -21 -854 615 1769 1156 -576 -449 985 1527 -18 -1213
5729 -1213 -140 1442 643 -1189 -1157 519 922 -549 -1421 -454 609 258 -1090 -1013 453 744 59 -857
5747 -857 -168 983 668 -365 -831 144 938 69 -827 -425 379 466 -754 -1222 -347 305 -268 -1373 -949
5766 -949 -36 89 -646 -997 -365 616 221 -509 -529 465 778 517 -263 243 1094 764 -10 -285 247 699
5786 699 224 -297 -211 492 284 -172 -593 -211 413 -82 -459 -400 221 242 24 -299 -90 695 729 95 -330
5807 -330 372 898 456 -4 -27 531 517 -179 -370 -94 -185 -335 -848 -784 -220 -129 -475 -788 -564 92 -188 -572
5829 -572 -484 -27 67 -127 -490 76 156 218 -59 202 278 367 25 -201 62 49 -143 -264 -111 -179 106 -354 -187
5852 -187 -365 -90 -124 -230 199 -21 -155 132 349 209 190 400 585 852 540 160 593 843 409 259 -64
5873 -64 554 626 -130 -505 -42 250 28 -585 -638 130 421 -349 -927 -217 390 317 -499 -410 633 658 59 -710
5895 -710 -204 1252 640 -631 -818 177 861 -395 -1093 -432 632 59 -1105 -1361 -14 599 -566 -1458
5913 -1458 -636 864 547 -897 -1034 280 1162 228 -908 -6 1607 1044 -514 -853 846 1579 114
5930 114 -1083 -430 1498 1280 -903 -1448 526 1314 -38 -1592 -568 1127 966 -819 -1180 467 1836
5947 1836 568 -1174 -174 1390 1592 -409 -988 651 1793 388 -1408 -670 1160 1291 -716 -1347
5963 -1347 -247 1118 -143 -1334 -1313 618 665 -960 -1844 -366 973 154 -1412 -1111 803 1002 -559
5980 -559 -1436 65 1468 624 -830 -1011 793 1151 -199 -1339 -217 1017 455 -1029 -1247 378 938
5997 938 -272 -1415 -494 914 854 -787 -919 497 1345 323 -861 -34 1184 1117 -151 -710 674
6014 674 1516 476 -723 -457 827 1131 -325 -1117 169 945 429 -955 -879 442 1002 -305 -1112 -38
6032 -38 969 439 -452 -806 525 942 42 -746 -129 860 557 -738 -978 384 843 -358 -1170 -500 424
6051 424 308 -802 -1060 -108 543 -289 -1028 -460 633 439 -545 -782 280 1015 354 -489 -167 817 377
6070 377 -142 -648 522 1011 450 -445 -57 525 672 -116 -613 230 667 50 -456 -264 441 372 -75 -440
6090 -440 56 635 161 -104 127 627 303 203 175 250 609 185 -256 224 395 146 -353 -213 -11 62 -326
6111 -326 -228 -167 -27 -388 -444 -140 -26 -277 -461 -204 48 -126 -448 -404 6 280 -302 -600 -63 259 -96
6132 -96 -559 -159 137 357 -372 -509 130 164 -67 -722 -412 507 328 -316 -581 296 673 49 -388 74 718
6153 718 522 -265 -568 294 847 -13 -639 -76 593 556 -64 -415 414 873 251 -613 -295 841 555 -326
6173 -326 -551 277 720 82 -780 -309 483 518 -473 -742 -34 620 2 -780 -389 465 464 -436 -611 -202 527
6194 527 59 -694 -600 313 353 -90 -860 -190 471 124 -457 -756 -50 592 -64 -702 -266 477 599 -420
6214 -420 -812 193 722 180 -592 -150 539 781 207 -554 249 875 518 57 -157 576 878 85 -313 -20
6234 -20 634 430 -376 -604 369 981 218 -669 -256 482 739 -315 -852 153 708 106 -705 -675 633 819
6254 819 -361 -941 5 1014 188 -951 -590 582 620 -479 -1171 -479 733 523 -1196 -1080 176 667
6272 667 -474 -1305 -618 909 426 -857 -995 492 1061 -108 -953 -175 1166 476 -583 -932 636
6289 636 1300 37 -884 -65 1003 647 -569 -851 345 1017 197 -947 -467 1010 794 -608 -870 468
6307 468 1122 338 -716 -167 950 1132 8 -552 449 1212 353 -844 -371 688 945 -514 -1005 -101
6325 -101 825 -77 -982 -823 220 512 -522 -928 -205 694 151 -916 -391 446 547 -157 -490 -89 618
6344 618 418 -662 -487 303 479 -11 -775 -262 446 -66 -371 -735 -87 384 53 -767 -492 282 400 -137
6364 -137 -392 73 603 550 -38 -97 539 843 294 -41 423 806 557 -168 -24 440 703 -78 -353 -89 282
6385 282 118 -382 -357 23 315 -94 -223 -192 459 369 -131 -221 240 569 219 -79 23 416 416 -113 -218 -27
6407 -27 257 -258 -507 -372 -175 -55 -681 -728 -462 -189 -281 -545 -373 -286 -56 -175 -118 208 237 20 134 154
6429 154 240 170 -78 181 155 194 -23 -92 136 135 -131 -272 33 173 -83 -182 -102 293 -36 -202 -232 287 498
6452 498 22 -194 409 591 320 9 182 534 556 58 -143 49 563 177 -512 -400 437 170 -441 -810
6472 -810 -221 330 -212 -798 -417 378 216 -461 -654 154 749 47 -540 -331 615 577 -527 -551 204 964
6492 964 76 -756 -522 566 549 -625 -1068 14 725 -266 -1386 -686 669 473 -726 -1118 43 989
6510 989 219 -675 -499 1110 1109 -13 -659 424 1329 520 -459 -311 1048 1081 -309 -724 95 945 383
6529 383 -909 -732 577 585 -571 -1037 49 1078 265 -834 -509 844 915 -118 -879 203 1143 416
6547 416 -422 -604 408 849 -219 -1045 -302 576 153 -799 -880 83 372 -425 -1250 -515 313 399 -806 -817
6567 -817 296 682 34 -747 -52 741 570 -201 -491 337 759 266 -722 -253 554 625 -217 -695 32 705
6587 705 70 -831 -492 268 353 -164 -689 -106 750 623 -169 -303 512 813 288 -361 259 848 759 -224 -506
6608 -506 257 626 128 -627 -335 382 120 -306 -844 -66 567 -17 -741 -523 595 283 -224 -715 108 625
6628 625 140 -511 -223 522 368 -75 -541 -79 661 -16 -490 -457 -28 292 -405 -832 -294 216 1 -607
6648 -607 -667 -83 199 -128 -622 -11 430 314 -251 -62 574 551 265 -176 125 684 745 202 -210 435 326
6669 326 -98 -158 -153 411 328 -210 -305 82 310 52 -312 -180 376 284 8 162 66 338 218 -152 21 123
6691 123 79 69 -61 47 39 -109 -259 -183 -317 -109 -185 -180 -163 -413 -370 -85 -181 -105 -131 -135 -56 -103 -75 -217 220 163
6717 163 -318 -27 33 216 69 -108 30 -32 63 -248 -220 148 146 -136 -150 -285 436 161 -38 -135 320 272 -107
6740 -107 -167 -80 543 277 15 -24 229 442 483 161 -103 480 160 -38 -194 128 520 16 -298 -129 59
6761 59 217 -241 -240 -149 208 -112 -219 -330 20 405 -187 -364 -352 80 -79 -372 -390 -161 153 -106 -337 -229
6783 -229 35 158 -47 -269 -246 -13 150 -375 -328 203 284 44 -469 -111 90 98 -205 -383 104 322 121 -134
6805 -134 -163 338 346 -195 -582 104 388 304 -412 -333 345 508 -154 -469 85 824 232 -403 -369 418 751 -55
6827 -55 -577 -204 612 456 -386 -573 147 670 122 -714 -294 541 551 -519 -663 225 570 87 -769 -386
6847 -386 836 480 -512 -928 181 708 -2 -1060 -464 597 519 -587 -1081 -16 602 -168 -972 -601
6865 -601 510 484 -570 -851 41 940 303 -899 -556 706 892 -349 -615 112 903 535 -569 -484 635
6884 635 886 -316 -671 109 648 350 -688 -673 586 876 23 -687 127 722 365 -330 -546 493 678
6903 678 -2 -615 -31 595 448 -317 -326 277 571 -163 -731 -48 583 196 -745 -711 33 342 -90 -658 -380
6924 -380 272 -65 -652 -617 5 630 201 -678 -219 259 381 -386 -486 171 444 154 -355 -334 219 369 -252
6945 -252 -566 -65 618 326 -92 -459 112 354 -12 -422 -152 480 258 -162 -167 410 667 258 -139 266 281
6966 281 565 -30 -203 267 479 195 -165 -154 345 108 -93 -215 -225 -42 -54 -313 -192 160 10 -54 -153 187
6988 187 98 150 -168 -79 212 117 -246 -192 88 189 81 -20 -165 21 -201 -328 -207 -54 -154 -335 -564 -196
7010 -196 -243 86 -235 -51 -54 85 -64 -99 410 -39 5 87 365 153 126 115 -50 231 356 -47 90 205 288
7033 288 -79 -245 -102 106 14 -165 -181 123 301 103 -192 335 526 151 -136 47 572 505 -213 -258 215
7054 215 407 178 -356 -183 166 371 -321 -653 -301 154 33 -564 -657 92 311 -388 -663 135 441 18
7074 18 -386 -196 459 607 -89 -468 221 610 86 -456 -349 303 352 -433 -817 -37 391 -70 -863 -512 107
7095 107 413 -418 -617 -200 486 230 -508 -262 438 856 53 -389 118 904 573 -178 -432 433 672 172
7115 172 -446 31 611 103 -541 -550 246 511 -261 -658 -251 508 313 -385 -509 233 585 141 -395 -71 448
7136 448 367 -320 -365 250 693 104 -629 -331 468 315 -450 -885 -380 344 -285 -640 -528 179 351 -185 -610
7157 -610 -240 424 217 -273 -472 472 586 134 -341 261 660 351 -46 -465 73 580 356 -502 -273 364
7177 364 252 -336 -641 -115 391 -23 -508 -391 438 590 -39 -381 74 484 417 -209 -23 286 771 -5
7197 -5 -305 97 559 282 -410 -263 58 332 -133 -421 -479 245 196 -331 -449 -192 214 113 -590 -343 360
7218 360 463 -229 -421 -80 458 277 -246 -202 332 550 -160 -494 -78 203 -30 -415 -305 142 213 -253 -622
7239 -622 -169 418 65 -129 -444 245 464 82 -340 184 586 341 -69 109 431 355 159 -274 200 367
7259 367 316 -160 -216 200 240 -146 -193 -26 145 72 -246 -4 -90 -83 67 -201 -62 133 340 129 86 138 58 80
7283 80 -90 -47 188 -89 -63 -210 -106 -193 33 -179 -370 -124 -103 -320 -362 -202 -25 -168 -137 -4 -130 105
7305 105 52 62 -201 -37 214 -6 32 -18 184 40 -22 -6 -42 101 166 5 -208 -106 112 -6 -158 -148 -62
7328 -62 179 63 56 248 161 94 -33 -50 95 177 270 54 108 118 337 55 67 -50 222 102 12 -318 -281 -56
7352 -56 -143 -309 -166 -127 -26 44 -362 4 15 5 -177 -380 68 90 19 -198 -365 111 228 -290 -317 -128 117
7375 117 -32 -227 -183 243 214 -204 -516 -122 173 200 -193 -198 123 552 172 -367 -68 494 510 -140 -276 159
7397 159 465 107 -491 -58 455 639 -158 -441 12 617 196 -547 -349 369 581 -400 -611 148 601 227
7417 227 -479 -465 428 480 -261 -498 16 471 113 -542 -474 401 410 -371 -658 -71 458 249 -460 -465 156 480
7439 480 -287 -759 -57 534 221 -833 -599 320 602 -227 -665 -42 589 188 -581 -453 138 557 -56 -548
7459 -548 -195 598 395 -395 -486 218 604 10 -630 -282 569 403 -95 -9 354 806 88 -462 -323 559 449
7480 449 -365 -386 246 619 373 -282 -37 539 485 -307 -567 76 570 72 -407 -179 272 274 -42 -462 59
7501 59 253 87 -314 -440 289 208 -7 -328 -233 228 -6 -557 -407 95 332 -61 -359 -149 -8 75 -325
7522 -325 -193 94 312 147 -354 -164 269 189 33 -101 259 419 116 -208 -115 317 325 136 -221 -19 280
7543 280 40 -148 -135 412 355 25 -66 61 333 216 -66 -173 212 395 163 -101 78 311 278 16 -110
7564 -110 5 366 62 -252 -199 2 9 -245 -211 60 0 -172 -210 -220 -131 -82 -43 -175 -31 -48 108 139 54 98 -169
7589 -169 -8 -89 -21 -52 103 13 -215 -107 -373 -135 -22 25 -288 -108 -170 23 -44 -92 126 93 102 70 45 230
7613 230 266 138 99 89 351 233 87 44 391 237 -30 -74 -52 88 276 -107 -109 191 331 30 -204 50 373
7636 373 89 -128 -102 218 426 15 -236 44 571 174 -154 -255 73 294 -286 -439 -15 172 -61 -422
7656 -422 -526 18 184 -189 -620 -282 292 72 -264 -253 58 398 116 -274 27 180 151 32 -233 202 381
7677 381 49 -240 -29 160 249 -245 -324 91 226 -105 -390 -217 197 233 -164 -411 128 353 267 -107 6
7698 6 320 647 72 -74 265 499 336 -410 -157 286 284 -88 -168 -231 477 166 -437 -386 53 294 -107 -493
7720 -493 -265 163 94 -255 -304 83 369 63 -150 -182 261 450 -189 -406 86 416 10 -577 -318 220 142
7741 142 -351 -475 -341 71 178 -447 -665 244 169 -86 -279 -296 311 446 -134 -14 371 517 325 -288 -56
7762 -56 501 370 49 -391 37 352 -13 -442 -286 286 314 -287 -456 -76 475 183 -512 -254 471 476 2
7783 2 -345 111 322 226 -160 -208 401 439 -146 -317 82 282 76 -545 -303 226 328 -301 -685 -363 286 -24
7805 -24 -350 -407 21 409 -296 -414 -228 356 146 -423 -262 217 320 -107 -344 75 374 24 -395 -178 123
7826 123 375 -160 -413 -51 -10 241 -247 -368 260 336 30 -154 -49 223 351 -77 -43 249 485 109 -139
7847 -139 110 312 80 -32 -1 70 126 -18 -173 -71 1 144 57 -288 -86 277 -25 -373 -95 78 144 176
7869 176 -222 -69 301 71 -99 -78 73 133 153 -56 -103 24 84 -215 -54 87 -35 -114 -135 -82 -70 -44 -283
7892 -283 -298 -210 -212 -17 -12 -73 34 141 157 -67 -25 45 163 -15 129 44 27 260 76 33 164 -13 -3 -21 -37
7917 -37 -180 -29 11 -31 -67 71 191 237 120 70 14 106 216 96 141 7 184 270 174 -126 112 85 -227 -81
7941 -81 137 64 -45 -387 -99 -69 -73 -29 -233 52 -1 279 -290 -283 464 233 -338 -320 -22 162 1 -233 -75
7964 -75 167 236 21 -346 23 414 92 -362 -524 -8 247 -119 -458 119 159 -28 -221 -272 183 675 26
7985 26 -214 91 574 265 -200 -370 380 580 134 -56 84 441 563 -209 -399 124 422 15 -538 -191
8005 -191 353 261 -378 -529 256 426 -207 -457 -273 311 233 -447 -376 55 531 74 -402 -67 201 105 -478
8026 -478 -322 67 287 -73 -533 -146 214 351 -407 -477 122 572 154 -334 -114 456 224 -156 -432 -30
8046 -30 284 29 -209 -219 276 306 32 -222 43 321 114 -249 -250 153 286 -135 -364 -16 405 173 -129 -299
8068 -299 307 258 66 -289 -16 400 126 24 -184 200 418 -67 -158 -290 190 252 -265 -234 44 389 13
8089 13 -229 -250 154 -4 -100 -370 -11 90 -95 -409 -89 -183 78 35 -258 -99 45 60 -380 -201 -67 231
8111 231 111 -181 -58 231 203 -102 -322 65 225 108 -260 -42 238 61 -41 -140 -63 204 26 -140 -115
8132 -115 488 286 9 19 -61 362 202 -32 -91 28 99 192 -188 119 107 135 -212 -75 179 351 -55 -229
8154 -229 -308 112 52 -236 -87 120 89 -57 -156 -125 -8 66 -8 -11 36 176 -337 -211 -159 64 -82 141 -49 189
8178 189 177 222 -162 -98 -48 -45 -150 -38 -8 -112 101 -51 91
8191I1
$$ Imaginary data points
##PAGE= N=2
##DATA TABLE= (X++(I..I)), XYDATA
0 0 0 0 0 0 0 0 -8 0 0 8 -16 8 -16 24 -32 32 -40 56 -64 72 -91 112 -128 152 -178 208 -237 277 -321 363 -416
31 -416 476 -540 609 -689 777 -870 972 -1091 1213 -1349 1499 -1664 1842 -2033 2249 -2479
47 -2479 2734 -3011 3319 -3657 4026 -4440 4903 -5417 6001 -6667 7434 -8325 9383 -10661
61 -10661 12233 -14231 16859 -20488 25842 -34550 51127 -93917 442883 780897 -370501
72 -370501 -520234 289977 913617 183289 -641781 -249119 676398 561182 -362899 -688782
82 -688782 147113 685554 48632 -719157 -382150 464341 463421 -393480 -658730 90150 634194
93 634194 117778 -567117 -305873 495414 529533 -219620 -506597 118703 620324 194606
103 194606 -464725 -293595 379682 431464 -233327 -547650 -47030 405907 66785 -517278
113 -517278 -415082 183452 280834 -244819 -527514 -123990 327252 109718 -371223 -303236
123 -303236 187896 346975 -41867 -319682 -12814 365098 230869 -161546 -189316 183944
133 183944 341494 31975 -235252 -60050 241472 175391 -157946 -238037 42247 209404
143 209404 -1083 -240717 -141726 135737 159603 -90630 -184087 28230 214042 109507
153 109507 -102268 -59612 178147 236535 52036 -78917 45719 221211 153443 -47618
163 -47618 -78434 78099 153899 3775 -150074 -83742 65639 48827 -119348 -185346 -53798
174 -53798 50277 -34205 -159782 -126674 22757 59499 -61619 -119906 -17322 91456 54177
185 54177 -65365 -60155 60995 94542 3676 -71479 -18862 74258 37842 -67582 -82435 -13181
197 -13181 24919 -42552 -113775 -73028 -6681 -14816 -69083 -82963 -23369 19206 -6922 -30841
209 -30841 -5622 36578 50198 34679 33721 55777 68727 65945 64735 59002 48210 48001 55457 53562
223 53562 24791 -6222 11473 43396 20511 -31674 -41782 6691 36706 -22197 -75231 -22380
235 -22380 53103 38553 -47672 -63884 45151 103916 13816 -67423 -9517 108603 93599 -53476
247 -53476 -81773 54917 122318 5701 -132469 -73371 90677 62696 -121673 -168431 -15002
258 -15002 94898 -34676 -203586 -116634 82392 71474 -122817 -188527 4079 154511 12344
269 12344 -170475 -84145 139856 153948 -72612 -164425 44420 204580 57001 -158615 -97756
280 -97756 150418 171746 -80906 -188929 17150 198814 58318 -186076 -130011 139318
290 139318 175443 -74927 -198048 11533 225030 95575 -160850 -113504 162326 220874
300 220874 -24858 -174661 18248 241533 125569 -135850 -119157 135934 211329 -25101
310 -25101 -198618 -31696 188584 96774 -156853 -172380 71111 174401 -37393 -213390
320 -213390 -72723 150555 100570 -145240 -187837 46257 172828 -2047 -189002 -90842
330 -90842 138134 125295 -108526 -178570 19364 164284 25135 -178872 -117527 106573 128352
341 128352 -80008 -186488 -23463 146950 47291 -157498 -137581 73354 144739 -33461
351 -33461 -170107 -40053 149813 103579 -98423 -130202 64555 174566 27886 -135861
361 -135861 -53887 147432 145155 -58087 -133036 38762 182212 64531 -131997 -87976 126612
372 126612 163999 -36058 -155595 323 184948 93857 -127270 -121232 99899 180763 -16416
383 -16416 -177814 -36836 174807 112237 -125432 -159366 68248 185135 -6969 -195292
393 -195292 -76605 153868 121210 -128944 -189767 41182 183952 5722 -204413 -107837
403 -107837 140415 134364 -118679 -201573 20408 182802 22301 -201653 -121963 134279 143821
414 143821 -108010 -206978 4662 183193 37331 -194772 -124637 131957 154476 -86182
424 -86182 -196051 8770 199838 63758 -165107 -106778 138583 178545 -48860 -168763
434 -168763 21961 201465 79183 -135331 -99717 127223 171932 -41840 -154414 8754
444 8754 170001 73108 -127315 -103492 102401 142371 -37472 -138636 -5616 147202 68621
455 68621 -107734 -85150 86607 126579 -19960 -116525 -4105 127235 58345 -85577 -74692
466 -74692 60358 97742 -29358 -112897 -23084 75332 22169 -93241 -90971 19185 50505
477 50505 -45138 -102250 -35241 40807 9722 -71762 -64284 20235 43481 -16791 -52406 -7977
489 -7977 45748 26349 -27652 -21607 25357 33672 -2267 -25429 -1469 26076 7327 -19692 -14715
502 -14715 2557 4120 -12512 -17248 -746 2889 -7082 -4095 8109 14771 9182 6944 24813 34109
516 34109 19237 13042 29388 47411 38046 10598 14270 42088 40832 7789 -13428 7449 33182
529 33182 8608 -33666 -30679 7470 16039 -25897 -54801 -21273 19873 1816 -45717 -44227 11704
542 11704 36362 -7460 -44390 -9061 47403 35438 -28419 -39560 21860 56265 3540 -58330
554 -58330 -31608 38835 32636 -47514 -80235 -14796 40222 -12293 -92000 -68846 22434 38292
566 38292 -48714 -94154 -12650 71445 28926 -65368 -51282 62371 98533 73 -65797 14491
578 14491 117435 76606 -48210 -55432 68146 115991 3024 -94847 -23664 99489 65325
589 65325 -79818 -99944 36873 106570 -8249 -125128 -47961 103763 82225 -74244 -104134
600 -104134 49981 145469 26268 -111202 -33369 136319 119864 -57918 -110430 48934 157279
611 157279 25473 -136042 -68982 107484 98647 -94842 -165682 344 120758 -5782 -173502
622 -173502 -112185 84348 95118 -97648 -167946 2786 141295 32446 -143912 -88808 116568
633 116568 136637 -51108 -135441 21280 168320 59845 -129705 -88848 104768 130333 -57337
644 -57337 -160639 -11191 139443 36945 -147147 -115401 78522 121263 -58755 -160299
654 -160299 -10707 145567 65577 -110269 -88400 104445 157219 -8320 -110838 16011
664 16011 164768 96587 -79289 -76153 94266 144270 -7342 -119239 -22461 116899 61774
675 61774 -102917 -112331 36139 97141 -27364 -136637 -52294 87453 57064 -83051 -101479
686 -101479 31725 106999 6559 -97677 -31426 94927 81419 -44470 -80895 29841 102283
697 102283 15264 -88849 -51494 57268 57798 -57248 -105283 -16352 56057 -2819 -98481 -80227
709 -80227 23011 44433 -42623 -89399 -19556 62281 34867 -48679 -44570 44438 80541 16017
721 16017 -40959 2788 78983 63883 -15964 -35092 30748 72604 18514 -50049 -29240 38913
733 38913 40461 -29744 -62483 -6916 45673 11715 -51530 -40900 30116 51429 -5393 -42757
745 -42757 2630 63617 46765 -15656 -19300 41953 69465 18823 -31514 -4213 51627 39210
757 39210 -25617 -45930 2139 34528 -7817 -61831 -44974 7934 8605 -44831 -67195 -20636
769 -20636 20823 -6094 -50053 -35822 17797 30610 -12280 -34457 4492 42184 22365 -19072
781 -19072 -15020 27089 36635 -2781 -27576 -3965 23149 7188 -29900 -31247 699 9297 -17040
794 -17040 -34057 -16826 7746 2304 -19401 -15126 8053 17726 8798 478 12441 28532 26394
807 26394 19549 20918 25099 26707 22254 18221 18369 12361 8237 10975 7330 -2712 -10232 -7203 2717
822 2717 -5537 -24063 -20549 -1927 4088 -12576 -26478 -5458 20126 7415 -18420 -13816 20053
835 20053 33147 -719 -24617 3785 36339 19054 -24810 -27831 16244 28433 -18724 -51468
847 -51468 -21277 21451 3757 -52648 -54681 2936 23968 -23575 -62095 -25424 34281 20154
859 20154 -40737 -41537 23541 55684 6618 -42359 -4417 61133 46503 -22395 -34756 29818
871 29818 66564 10014 -49284 -15601 51283 40811 -33962 -55187 13034 57227 3282 -58733
883 -58733 -29093 46397 49198 -25811 -51765 15886 67607 24633 -42469 -24032 54182 64326
895 64326 -8825 -45686 9252 67757 32502 -43535 -39727 32707 51566 -16014 -66747 -21463
907 -21463 45171 21403 -56250 -64182 7968 45720 -12651 -72597 -34400 41620 35921 -40118
919 -40118 -61732 10419 62649 11372 -59519 -35109 46850 54471 -26506 -65563 86 63943
931 63943 21182 -62280 -52252 35137 57930 -23115 -78561 -17627 63254 33671 -57468 -60559
943 -60559 32914 75089 -1970 -70972 -15956 76944 58956 -40053 -57731 38403 93050 15832
955 15832 -67586 -21414 79199 68807 -40085 -71364 25411 89896 14374 -80201 -40896 68945
967 68945 67687 -45612 -85092 13078 88620 17634 -84475 -49486 66623 72830 -39965 -87088
979 -87088 8505 90811 23108 -84813 -56049 59818 72553 -38414 -93547 -2884 83108
990 83108 21323 -85581 -64406 47783 68084 -38013 -95919 -9523 76662 23991 -78244
1001 -78244 -63811 45862 70003 -29219 -84302 -6272 77231 32946 -66241 -53824 48957
1012 48957 72164 -17038 -72293 -4578 75432 35294 -55738 -46280 43760 68278 -10192 -63084
1024 -63084 -3264 68816 35599 -43113 -40207 36985 63123 -3946 -51351 -3075 57302 33558
1036 33558 -33543 -36827 27530 51007 -3853 -43831 -8900 42165 26841 -29527 -33432 17462
1048 17462 37100 -3257 -37230 -12308 29754 18769 -25052 -28843 8250 25213 -3576 -32151
1060 -32151 -14339 16217 8417 -21414 -25996 -1294 12648 -7298 -26289 -13858 5478 3015
1072 3015 -14942 -19199 -2394 6702 -3264 -11354 -4939 5988 6452 -2691 -3974 4132 6924 3915
1086 3915 1103 2389 5674 3750 1964 4361 3695 684 22 2304 4773 834 -2960 2627 8316
1101 8316 5567 -1272 -295 10123 13797 3941 -2177 6445 17338 13442 -381 -652 13916 19245
1115 19245 4303 -8757 -466 15059 9854 -10924 -15951 1405 11660 -4625 -23656 -15385 6495
1128 6495 5498 -18346 -26761 -4645 13822 -551 -24472 -16722 13338 18654 -9388 -24786 -974
1141 -974 25037 10687 -22307 -20132 14505 24028 -9000 -33371 -9867 23360 9949 -30869 -33446
1154 -33446 7208 25578 -8419 -39895 -14606 29443 21254 -24584 -31259 15675 44551 8604
1166 8604 -31799 -7414 44318 41370 -11300 -28377 20168 54711 15632 -34450 -16732 39587
1178 39587 40608 -20337 -45582 5520 46515 9240 -48247 -33079 32418 39506 -23914 -51998
1190 -51998 2028 53173 19330 -44652 -31002 40356 52350 -13049 -49561 2520 59302 24473
1202 24473 -46046 -37565 32608 48410 -19440 -64660 -13972 45729 13839 -57707 -55303 17526
1214 17526 42249 -22835 -69023 -19371 45621 23907 -46882 -48451 26254 56857 -3079 -51707
1226 -51707 -8721 57942 41209 -31796 -40037 28352 58882 2199 -51698 -16685 48664 34065
1238 34065 -37040 -50105 12675 48556 -864 -55395 -23758 41038 35252 -26843 -42956 15481
1250 15481 56607 15531 -36342 -13382 45975 48744 -8389 -32747 14981 54294 21220 -30860
1262 -30860 -22419 29466 37738 -14736 -44753 -8908 30576 9983 -39918 -39817 9152 26069 -14238
1275 -14238 -45070 -17352 26800 18427 -26304 -31522 12155 36656 6328 -29031 -11711 30875
1287 30875 29010 -13583 -30528 2850 31645 7226 -33345 -27246 12926 21153 -17216 -43082
1299 -43082 -15332 20973 8100 -31819 -33275 8393 29457 -913 -30981 -8188 33753 30774
1311 30774 -10015 -20617 18666 46058 17706 -19879 -6474 35317 35949 -8210 -27922 6136
1323 6136 35533 9290 -32773 -24606 18752 25378 -16534 -39278 -5565 29968 10328 -30394
1335 -30394 -23710 21898 34209 -4266 -28409 3168 40030 23068 -19162 -18173 23253 35176
1347 35176 -3344 -30956 -6122 27101 11420 -30479 -32551 4831 17504 -15969 -42031 -19358
1359 -19358 14304 4147 -30268 -30169 5009 20168 -5521 -26594 -5441 24757 16805 -11272 -12206
1372 -12206 16055 27925 4302 -14559 837 21009 12805 -11764 -14878 6101 12582 -6398
1384 -6398 -19013 -7712 7324 2425 -13602 -11941 3886 8498 -766 -5708 3830 14333 10265
1397 10265 3109 7231 14787 14583 8354 6442 11967 11859 4836 2899 5703 5031 -1379 -6248 -2517
1412 -2517 -112 -7516 -13549 -8689 -2116 -4991 -14319 -12778 504 3526 -6894 -12121 -848 11314
1426 11314 5561 -8713 -4174 12576 14398 -1596 -11410 1757 15720 3803 -16166 -13537 4928
1439 4928 8399 -12334 -25413 -8414 9067 -1525 -22955 -20555 4403 13302 -8240 -21424 -2738
1452 -2738 20708 14127 -10710 -10045 17810 28326 5901 -12525 2873 28640 21391 -8699 -13136
1465 -13136 13459 26571 2687 -22578 -9599 19115 14745 -16795 -25497 2052 22586 2291
1477 2291 -25722 -13945 19614 22831 -8216 -22814 5317 32194 14746 -17853 -12970 22112
1489 22112 30532 -3970 -26782 -2320 28339 12922 -26106 -28474 9043 23381 -10845 -39787
1501 -39787 -16963 20254 10870 -30973 -36351 5559 28033 -4276 -37239 -15114 28875 24896
1513 24896 -19987 -30737 11975 39716 7313 -32755 -14471 32983 31365 -18239 -36526 6080
1525 6080 38470 6685 -39324 -24708 26558 30956 -19509 -41643 1605 40939 13047 -35858
1537 -35858 -24175 30933 40637 -9382 -36442 5729 49294 23015 -29569 -22073 32263 44109
1549 44109 -7309 -39241 -95 44241 19373 -34893 -31406 22821 37601 -13337 -46442 -8780
1561 -8780 36583 15815 -37293 -35455 19534 37044 -9986 -43096 -8705 38170 21240 -31100
1573 -31100 -32022 19098 37984 -5225 -40202 -10572 34754 20140 -30653 -34713 11062 32033
1585 32033 -6573 -41848 -15606 27452 17360 -27150 -33432 9506 31991 -1914 -34055 -11424
1597 -11424 28727 22871 -17629 -24693 13513 33999 5039 -24192 -7364 27763 23351 -13130
1609 -13130 -20971 10188 28293 5203 -21447 -9151 20766 18304 -11033 -19262 4667 22304
1621 22304 5383 -17507 -8154 16189 16574 -5740 -14694 3236 18619 5995 -12276 -7598 10214
1634 10214 12717 -4393 -13564 -719 10835 2774 -10989 -10465 2748 6557 -5377 -12223 -5017
1647 -5017 3844 1159 -8515 -9459 -539 2735 -2912 -8442 -5874 1634 1912 -3726 -5849 -2085 1783
1662 1783 1017 -3457 -4291 4 2458 746 -2694 -2645 1485 3859 1221 -1916 -950 3187 4622 1337
1678 1337 -1141 1621 5254 5125 907 -1046 3073 6543 3723 -717 -414 4377 6548 1700 -1738
1693 -1738 828 5626 5123 -672 -2818 2573 6405 3328 -2388 -1802 4366 6193 30 -4761 -1279
1708 -1279 4751 3308 -4107 -6572 -698 4059 -667 -8568 -7359 734 2889 -5446 -11581 -5289 3787
1723 3787 1439 -9125 -10785 484 7176 -1507 -11504 -5913 7399 7471 -6416 -11434 1872 12499
1737 12499 2915 -11641 -7931 9018 11434 -6496 -14996 -528 13930 4701 -14289 -11857 10055
1750 10055 15308 -4162 -16383 -664 19558 11252 -12000 -10829 14141 22858 1611 -15617 758
1763 758 24456 15842 -11652 -13792 12310 24041 323 -21164 -5117 20912 12998 -16765 -21423
1776 -21423 6959 21441 -3086 -25941 -10047 18883 14195 -16762 -22569 7684 24140 905
1788 905 -23539 -9313 21229 18146 -14261 -22314 5764 23968 1930 -25711 -14444 16215 14690
1801 14690 -16624 -27534 -1410 19380 759 -27203 -18030 13032 16099 -12004 -25105 -479
1813 -479 23189 8456 -18084 -12247 16926 23709 -2380 -18267 2446 25334 13677 -13295 -12779
1826 -12779 13682 22208 -1952 -19679 -4474 18161 11575 -14918 -18430 6213 18686 215
1838 215 -18839 -8069 16770 16334 -7759 -15050 5857 22807 9588 -12838 -7549 17070 20879
1851 20879 -2084 -16734 -596 19412 9134 -16384 -17482 5626 14618 -6294 -25132 -11380
1863 -11380 11970 6782 -18233 -23119 720 15967 -1769 -22681 -10552 15447 15703 -9883 -18705
1876 -18705 4845 23259 6468 -17901 -10433 16560 19258 -8337 -21725 -43 20353 5146
1888 5146 -22256 -17978 10820 16627 -10459 -26008 -4085 20661 8773 -18877 -15536 14860 24156
1901 24156 -1365 -18326 2067 27798 17130 -11249 -10535 18119 27079 1321 -18184 -409
1913 -409 22878 12649 -16580 -17642 8798 18019 -5734 -24146 -7821 15912 7583 -18371 -18726
1926 -18726 6800 17643 -2728 -19006 -3614 18970 12305 -10726 -11919 10537 19248 63
1938 63 -15587 -3385 14512 8221 -13074 -15745 2789 9496 -6881 -19722 -9829 6100 1366
1951 1366 -15172 -15194 1171 7793 -3714 -12718 -2591 10671 6766 -4734 -3667 8720 12774 3076
1965 3076 -3568 4201 11626 6689 -2362 -2003 5670 6069 -2078 -5644 -248 3202 -1137 -6158 -3688
1980 -3688 1831 525 -3980 -2481 2943 4193 504 -366 5393 7948 4043 1371 4977 9018 5938
1995 5938 -177 1026 6413 4960 -2291 -5091 -98 3202 -3607 -11001 -7001 120 -1718 -10250 -11851
2010 -11851 -2021 2714 -4876 -10827 -4617 5702 4112 -6225 -6342 5258 10499 1750 -6625 -606
2024 -606 10549 7175 -5848 -7930 3174 8931 -1557 -12853 -6708 6072 3523 -9973 -13500
2037 -13500 -598 8370 -1188 -12821 -5899 9490 10217 -3255 -8265 6022 16789 7673 -5660
2050 -5660 -1241 14509 16165 190 -7877 4326 16033 6953 -9571 -8437 7719 11180 -5258
2063 -5258 -15964 -4273 10251 4200 -13489 -13331 4594 12192 -2175 -14944 -4220 14194 10901
2076 10901 -8289 -11412 7225 18163 3182 -14023 -5818 14004 12117 -9758 -17295 766 14154
2089 14154 -458 -20737 -14379 8045 9411 -13132 -22697 -3264 14346 2155 -19119 -13533 11723
2102 11723 16563 -5807 -17808 1919 22268 10861 -13658 -10622 15316 22037 -2261 -18340
2114 -18340 -149 21697 10612 -16304 -16185 10461 19579 -4816 -22776 -5162 19486 11069 -16735
2127 -16735 -17344 10712 22587 -945 -19715 -2725 23481 16429 -11861 -14260 12653 24934 2029
2140 2029 -19273 -4463 21187 13984 -14435 -18806 6682 19148 -3194 -24157 -10351 14509
2152 14509 9396 -17047 -21829 3108 17148 -1930 -21426 -9157 15146 12777 -11894 -17193 5527
2165 5527 18940 2226 -16801 -7615 14807 13193 -9580 -16561 2353 14925 971 -17309 -10108
2178 -10108 9918 9510 -9220 -15916 158 13042 2298 -12937 -7183 10261 11623 -3195 -9794
2191 -9794 3527 15075 7032 -6029 -3444 10051 12613 245 -6905 1660 10888 5894 -5242
2204 -5242 -6028 4510 8128 -786 -7879 -3321 5009 4323 -4515 -6888 921 5777 1768 -5124 -3692
2219 -3692 3899 5679 -637 -5178 -946 5365 3748 -3498 -5141 714 4304 -29 -6672 -5313 1164
2234 1164 2031 -4458 -8019 -3701 2645 12 -6963 -6971 337 3796 -1576 -7107 -2735 4717 3565 -3328
2250 -3328 -4667 2387 7049 1535 -4985 -1765 6069 5668 -2013 -4922 1746 6961 2045 -4813 -2433
2265 -2433 4887 5560 -1605 -4579 1568 6804 2893 -3279 -1666 5025 5931 58 -2877 1856 6072
2280 6072 3366 -1921 -1275 3911 4528 -8 -2720 255 3184 980 -2553 -2242 570 1172 -1311 -2740
2296 -2740 -1380 11 -902 -2311 -2012 -1348 -1534 -1315 -1265 -1509 -2137 -1902 -573 -598 -2645 -3347 -1103 941
2314 941 -1003 -4299 -2532 1869 2053 -3047 -4412 486 4072 218 -5053 -2511 4419 4474 -2370 -4981
2330 -4981 1950 7300 1798 -5766 -2765 6529 6588 -2498 -6473 2439 9420 2852 -6755 -3320 7883
2345 7883 8808 -2831 -7793 2877 11354 4264 -7219 -4375 8940 10631 -2720 -9211 1496 11787
2359 11787 4249 -9540 -6984 7510 9466 -4504 -12303 -1473 10275 2734 -11834 -9760 5531
2372 5531 9122 -4641 -13662 -2503 10607 4071 -10748 -10049 5558 11043 -2949 -12821 -2885 10774
2386 10774 6140 -9606 -11105 4313 11039 -2098 -13846 -5484 9563 6838 -9510 -12458 2768
2399 2768 11321 239 -12718 -5735 10615 9902 -5612 -10089 3905 14706 5141 -9116 -4289
2412 -4289 11651 12895 -2331 -9748 2482 14512 5715 -9513 -7325 8129 11635 -3151 -12939
2425 -12939 -1864 11559 5927 -9945 -10314 5899 12443 -1077 -12573 -3282 12307 9089 -7710
2438 -7710 -10918 5478 14247 1680 -12354 -5240 10975 9632 -8280 -14078 689 11739 286
2451 286 -15575 -10184 7322 8111 -9334 -16578 -1897 11276 1661 -14576 -10216 8245 11869 -4881
2465 -4881 -13649 689 15204 6459 -10615 -8165 9887 14240 -2566 -13085 -398 14458 6848
2478 6848 -11702 -10828 7385 12750 -3797 -15161 -2955 13145 6741 -10745 -10596 7824 14395
2491 14395 -575 -11935 -657 15500 10335 -6893 -7756 9500 15885 1282 -10636 -918 13224
2504 13224 7902 -9202 -10623 4971 10323 -3228 -14139 -5314 8285 3728 -10787 -11677 2559
2517 2559 8436 -2644 -12008 -3266 8955 5553 -6704 -7368 4963 9933 -506 -8291 -1581 8176
2531 8176 4672 -6670 -7568 2582 5747 -3100 -9533 -4042 3626 615 -7855 -7408 1073 3765 -2791
2546 -2791 -6381 -731 5476 2662 -2997 -803 5423 6592 1683 -766 3909 7299 3574 -231 1305
2561 1305 4739 3650 -1211 -1800 1782 2081 -1692 -3332 -910 1469 -992 -3826 -1604 1773 795 -2178
2577 -2178 -1626 2637 3867 377 -1219 2367 5261 2728 -1784 5 4532 3497 -2048 -3631 427
2592 427 2921 -1783 -7081 -4499 815 -826 -6829 -7918 -1618 1653 -3507 -7877 -3637 3074 2406
2607 2406 -4148 -4662 2782 6525 1309 -3903 112 7136 5871 -2016 -3682 2729 6604 808 -5876
2622 -5876 -3164 4494 3562 -4444 -7196 -256 5343 300 -6797 -3903 4460 5968 -1490 -5063 2267
2637 2267 9140 4967 -2714 -1110 7418 9360 1332 -3960 1942 9080 5302 -3963 -4960 3082 6341
2652 6341 -1964 -9034 -4362 4242 2384 -7414 -9223 62 5652 -1136 -9335 -5105 5910 5945 -4290
2667 -4290 -7561 1969 9765 2794 -7267 -4262 7026 8063 -3387 -9479 -424 8246 1924 -10156
2681 -10156 -8692 3578 6067 -5515 -12608 -3379 7382 2300 -9953 -8465 4923 9588 -1270
2694 -1270 -9374 -76 11980 7876 -5440 -5637 7832 13393 1475 -8012 -208 11945 7780 -6641
2708 -6641 -8637 4398 10592 -851 -11630 -4353 8893 6146 -7797 -10445 3045 10674 613
2721 613 -9822 -3750 10161 8910 -4560 -7861 4454 12158 2873 -8318 -3678 8961 7678 -5311
2735 -5311 -9840 297 8295 192 -11116 -7708 3826 4430 -6774 -11872 -2381 6319 286 -9516
2749 -9516 -6895 4317 6688 -2679 -8300 -193 8549 4431 -4847 -4672 4987 8499 -49 -6769 -1241
2764 -1241 6622 4476 -5049 -6733 1548 5850 -439 -7187 -3816 4480 4516 -3471 -5806 1218 6758
2779 6758 2859 -3707 -1699 5896 7437 1025 -2985 1801 7895 5450 -2185 -2598 3773 6731 621
2794 621 -5290 -2158 4492 3314 -4280 -6611 -488 4254 -548 -6940 -4432 3086 3913 -2739 -6302
2809 -6302 -261 5605 1856 -4966 -4038 3747 5409 -1176 -5942 -876 5234 2271 -5294 -5714 1292
2824 1292 4034 -2494 -7579 -3267 3567 1568 -5801 -6143 868 4386 -1053 -6049 -2031 5038 3896
2839 3896 -2704 -3477 3066 6732 1640 -3246 -118 5761 4845 -1407 -3044 2704 5587 1165 -3846
2854 -3846 -1247 3844 3172 -2304 -3538 1148 3801 622 -3267 -1053 3268 2856 -1186 -1847 1652 3658
2870 3658 1064 -1550 161 2697 1994 -852 -1347 946 1480 -821 -2156 -1020 14 -1001 -2561 -1784
2886 -1784 -849 -1303 -2572 -2151 -921 -991 -2380 -1850 -18 99 -1417 -1984 109 1539 -479 -2353 -573
2903 -573 1996 1313 -2217 -2155 1363 2782 -493 -3137 -676 3139 1673 -2834 -2775 2226 4166 -273
2919 -273 -3554 -105 5164 3247 -2732 -2771 3572 5830 144 -3944 346 6666 4050 -3245 -3231 3922
2935 3922 6614 -73 -5535 -478 6367 3675 -4390 -4910 3262 6544 -994 -6875 -1978 5897 3630
2950 3630 -5385 -6505 2449 6366 -928 -7781 -3111 5592 3881 -5722 -7475 1464 6220 -762 -8483
2965 -8483 -3966 5365 4291 -5376 -7884 995 6977 208 -8005 -4299 5569 5753 -4031 -7601 757
2980 757 7884 1522 -7461 -4705 5629 6788 -3031 -7613 516 8465 3317 -6268 -5127 5685 8233
2995 8233 -1333 -6980 160 9116 5571 -5188 -5188 5400 9351 417 -7284 -972 8732 5925 -4965
3010 -4965 -6499 3587 8833 310 -8420 -3159 7211 5572 -5411 -8415 1698 8545 828 -8952
3024 -8952 -4849 6723 6579 -4634 -9103 920 9180 1737 -8919 -5630 6120 7346 -4709 -10040
3038 -10040 -689 8211 1880 -9667 -7441 4935 6925 -4489 -10820 -1494 8113 2436 -8836 -7190
3052 -7190 5125 8162 -2577 -9023 -281 9790 4877 -6550 -5501 6181 9662 -850 -7980
3065 -7980 -36 9786 5144 -6084 -6126 4999 8517 -1497 -8529 -1592 8120 4303 -6139 -6268 4388
3080 4388 8406 -447 -7314 -575 8326 5109 -4264 -4731 4509 8329 529 -6109 -635 6679 4106
3095 4106 -4819 -5669 1998 5263 -1634 -7117 -3045 3542 1392 -5802 -6201 312 3044 -1905 -5975
3110 -5975 -2491 3410 1744 -3360 -3435 1515 4068 49 -3248 -474 3326 2201 -1771 -2484 1103 2446
3126 2446 -444 -3125 -1274 1017 213 -2452 -2337 -46 808 -755 -1463 25 1190 898 123 685 2026
3143 2026 1943 1644 2080 2352 2422 1425 1817 2227 1819 752 558 1181 1299 -553 -1258 -245 638 -855 -2262
3162 -2262 -1847 118 85 -1916 -2204 -75 1383 226 -1684 -621 1917 1927 -447 -1486 803 2778
3178 2778 910 -2083 -1172 1356 1294 -1899 -3629 -1252 697 -1093 -4203 -3759 -641 444 -2633 -4164
3194 -4164 -1520 1107 456 -2468 -2047 1459 3157 750 -1289 526 3739 3702 223 -726 1910 3894
3210 3894 1585 -1698 -1186 2385 2661 -1270 -3258 -673 2264 899 -3054 -2801 1254 3100 -57 -3007
3226 -3007 -270 3972 3512 -609 -1581 2720 5626 2106 -1939 -157 4401 4071 -1063 -3597 493 3899
3242 3899 527 -4927 -4141 1131 2228 -3545 -6518 -2163 2804 149 -5599 -5107 1692 3920 -1604
3257 -1604 -5503 -1035 5537 3443 -3377 -3849 3441 6024 93 -5429 -1461 5121 3295 -4494 -5924
3272 -5924 1214 4765 -1122 -7265 -3642 3713 3271 -4594 -6142 1371 6161 1164 -5255 -1818 6401
3287 6401 6424 -1492 -3807 3332 8650 3560 -3831 -1699 6583 6635 -1553 -5319 992 6544 1726 -6334
3303 -6334 -4606 3444 4722 -3060 -7354 -1119 5276 1646 -5687 -4493 3696 5831 -1067 -5513 -37
3318 -37 6467 3692 -3582 -4019 3530 5660 -673 -5900 -2012 4365 2585 -5174 -6295 106 3338 -1919
3334 -1919 -7295 -4345 2495 2243 -4610 -6213 132 4776 684 -4872 -2517 4465 5162 -885 -3828
3349 -3828 1488 6436 3270 -3174 -2303 3941 5292 -690 -4769 -580 4535 2056 -3902 -4284 1751
3364 1751 4406 -692 -4987 -1556 4228 3663 -2231 -3390 2692 6074 2176 -3044 -633 5160 5333
3379 5333 -1125 -3394 1838 5719 1816 -4312 -2916 2994 3307 -2955 -6015 -1437 3252 73 -5900
3394 -5900 -4849 1858 3069 -2523 -5638 -1115 4243 1809 -4132 -3362 2769 4729 -719 -4324 -143
3409 -143 4694 2261 -3517 -3574 1906 3686 -1514 -5317 -1778 3110 1295 -4066 -4203 1168 3334 -1195
3425 -1195 -4200 -906 3653 2629 -2060 -1858 3240 4756 901 -1858 1191 4654 3117 -1176 -1262 2737
3441 2737 3899 75 -2217 99 2955 1215 -2235 -1752 1021 1839 -1303 -2505 -90 1719 302
3456 302 -1801 -808 1765 1545 -883 -1015 1118 1842 149 -1227 -44 1320 155 -1769 -1447 364
3472 364 -26 -2106 -2307 -408 245 -1850 -2809 -1215 551 -810 -2747 -2046 726 1018 -1612 -2085 681
3489 681 2518 548 -1941 -451 2777 2298 -1249 -1876 1498 3291 294 -2499 -396 3151 1955 -2369
3505 -2369 -2654 1537 3561 -207 -3479 -356 3685 2752 -2064 -2651 2534 4483 596 -3017 -142 4598
3521 4598 3154 -1940 -2424 2545 4641 201 -4053 -986 4118 2428 -3068 -4033 1225 3775 -877
3536 -877 -5069 -2366 2992 2112 -3348 -4745 686 3992 -290 -4735 -2389 3090 2982 -2932 -4575 338
3552 338 3967 522 -4527 -2856 2843 3168 -2345 -4877 -279 4027 1013 -4379 -3309 2607 3931
3567 3931 -1467 -4541 -409 5078 2439 -3504 -3165 2917 4983 -109 -4192 -375 5227 3631 -2662
3582 -2662 -3374 2600 5514 432 -4061 -1327 4917 4253 -2494 -4121 1797 5653 1066 -4467 -2153
3597 -2153 4474 4479 -2425 -4778 1022 5261 1199 -5005 -3288 3672 4170 -2386 -5576 -344 4905 1311
3613 1311 -5233 -4102 2848 4297 -2467 -6257 -767 5095 1622 -5031 -4388 2872 4703 -1786 -6080
3628 -6080 -1012 4757 2047 -4777 -4715 2363 4605 -1427 -5748 -1305 4674 2422 -4077 -4305 2591 5195
3644 5195 -398 -4853 -783 5070 3487 -2973 -3393 2884 5591 528 -3814 -600 4986 3504 -2228
3659 -2228 -3085 2091 5049 382 -3809 -1413 3758 2962 -2423 -3463 1055 4013 503 -3431 -1487
3674 -1487 2989 2848 -1456 -2789 712 3621 887 -2775 -1330 2225 2208 -1176 -3003 -382 2023 -39
3690 -39 -3090 -2440 548 1024 -1814 -3165 -1304 762 107 -2243 -2338 286 1057 -530 -1775 -741 1392
3707 1392 1264 -540 -1023 632 1523 828 -730 -644 985 1446 -105 -1044 -363 901 638 -648 -1030 111
3725 111 1112 387 -639 -599 720 1448 610 -248 449 1970 1876 283 -1 1275 2212 1382 -259 -186 1568
3744 1568 1365 36 -1215 -292 1055 -76 -1681 -1674 -66 111 -910 -1992 -1366 242 36 -1164 -1392
3761 -1392 -149 950 -57 -867 -299 879 761 -523 -1020 307 833 104 -991 -1126 64 -75 -1145
3778 -1145 -1485 -941 -488 -442 -1210 -1454 -788 52 -347 -521 -464 399 1197 932 275 622 1425 1970 1254 503
3798 503 932 1683 1639 273 -135 648 1283 852 -829 -874 756 1046 -542 -1783 -705 1177 688 -1312
3816 -1312 -1327 930 2167 304 -1250 -28 2565 2190 -557 -1421 1094 2850 583 -2333 -1270 2038
3832 2038 1577 -2051 -3387 -678 1542 -790 -4195 -2838 914 1224 -2848 -4154 -501 2507 204
3847 204 -3562 -2114 2618 3142 -964 -2903 860 4273 1562 -2775 -1898 2931 3605 -1414 -3890 -64
3863 -64 3631 1219 -3611 -3088 1801 2900 -1747 -4502 -426 3973 1994 -3123 -2133 2837 4821 207
3879 207 -2883 561 5185 3471 -1865 -1922 3246 5037 324 -3482 -537 3603 2253 -3344 -3856 866
3895 866 3216 -1084 -4956 -2239 2633 1827 -3373 -4319 381 3729 138 -3948 -1568 3427 3335 -1460
3911 -1460 -3414 899 4180 1010 -3312 -2325 2176 2815 -1953 -4544 -886 2756 -48 -4258 -3694 1000
3927 1000 2470 -1676 -4551 -1008 3225 1849 -2736 -2647 2334 4383 573 -2566 11 4529 3591 -1205
3943 -1205 -2225 2275 4585 787 -3358 -1461 3328 2717 -2104 -3735 518 3483 205 -4021 -2137
3958 -2137 2597 3058 -1741 -3579 727 4449 1482 -2895 -1545 3529 3941 -864 -3192 771 4213
3973 4213 1530 -3238 -2549 2015 2757 -2131 -4639 -1054 2430 338 -4476 -3808 1115 2103 -2118 -4514
3989 -4514 -924 3031 953 -3089 -2183 2168 3190 -487 -2636 286 3777 1924 -2420 -1823 2144
4004 2144 2871 -914 -3029 -496 2248 591 -2579 -2181 1183 1989 -1196 -2455 -85 2196 1079 -1523
4020 -1523 -661 2217 2688 368 -748 1187 2910 1577 -540 25 2133 1966 -569 -973 664 1414
4036 1414 -152 -1493 -775 567 -160 -1646 -1313 93 297 -1062 -1552 -328 577 -290 -938 -195 910
4053 910 539 -694 -243 835 1148 -621 -1143 234 823 -482 -2139 -1023 500 49 -1909 -2155 56
4070 56 805 -1322 -2472 -922 999 425 -1673 -1389 1127 2087 -106 -1655 389 2759 1544 -868
4086 -868 -726 1966 2619 330 -1775 175 2489 1256 -1675 -1600 1227 2131 -545 -2486 -389 2358
4102 2358 1216 -1798 -1684 1489 2616 -362 -1978 -69 3063 1822 -1331 -1659 1517 2832 83
4117 83 -2385 -902 2167 1558 -2031 -2804 479 1970 -536 -3303 -1924 1488 876 -1995 -3232 -469
4133 -469 2037 -27 -2704 -1671 1534 1953 -964 -2767 -53 2432 1050 -2068 -1753 1607 2433 -401
4149 -401 -2867 -682 2688 1397 -2317 -2481 1183 2530 -187 -2830 -908 2734 2238 -1706 -2084 1222
4165 1222 3498 1046 -2282 -768 2931 3084 -667 -2291 1134 3805 1180 -2474 -1448 2436 3012
4180 3012 -1049 -2943 -117 3260 1180 -2951 -2445 1736 2785 -988 -3625 -647 3201 1559 -2733
4195 -2733 -2969 1666 2936 -818 -3879 -964 2795 1655 -2983 -3045 1185 2937 -670 -3908 -1540 2552
4211 2552 1618 -2663 -3451 875 2916 -392 -3537 -1572 2557 2132 -2112 -3082 758 3414 559 -2958
4227 -2958 -1426 2650 2630 -1375 -2613 672 3444 935 -2550 -1266 2658 2732 -1021 -2473 685 3087
4243 3087 1094 -2046 -1288 2182 2714 -521 -2095 345 2778 1189 -1631 -1367 1473 2072 -418 -2247
4259 -2247 -263 2023 908 -1514 -1718 792 1634 -437 -2158 -833 1375 941 -1365 -1861 183 1270
4275 1270 -161 -1895 -1231 545 818 -858 -1750 -555 792 261 -1367 -1436 262 759 -551 -1697 -732
4292 -732 802 771 -610 -1186 394 1285 479 -802 -415 1179 1387 -52 -1009 202 1772 919 -759
4309 -759 -866 948 1451 -95 -1226 -80 1276 1069 -765 -1004 851 1574 288 -1065 -207 1472 1455
4326 1455 -278 -582 709 1847 417 -704 -330 1364 1022 -623 -1069 -75 909 -42 -1379 -891 232
4343 232 215 -1180 -1616 -455 365 -380 -1612 -900 261 558 -621 -1107 96 661 -6 -857 -118 721
4361 721 397 -461 -256 386 315 -106 -665 -228 0 -324 -772 -338 67 19 -543 -119 419 176 -163 -136 852
4382 852 709 175 184 1090 1533 705 65 552 1607 980 -380 -334 938 1479 -279 -1308 -206 1044 371
4401 371 -1352 -1317 574 1078 -705 -1852 -461 1449 602 -1576 -1196 1205 1992 -476 -1833 196 2327
4418 2327 1109 -1741 -1647 1111 1822 -1118 -2807 -846 1647 248 -2903 -2554 516 1459 -1347 -3215
4434 -3215 -803 1993 886 -2415 -2220 1571 2748 -387 -2436 216 3141 2007 -1581 -1574 1985 3298
4450 3298 -53 -2589 -424 2902 1862 -2158 -2232 1243 2640 -467 -3174 -998 2425 1609 -1778 -2346
4466 -2346 1219 3363 278 -2225 -346 2995 2610 -1127 -1845 1339 3414 727 -2314 -1063 2332
4481 2332 2078 -1702 -2991 -229 2040 -159 -3247 -2403 1168 1281 -1797 -3382 -372 2276 576 -2500
4497 -2500 -2065 1731 2459 -549 -2259 -199 2827 1531 -1871 -1949 1345 2443 -756 -2987 -808 1927
4513 1927 1056 -2453 -2906 340 2072 -409 -3074 -1349 1869 1767 -1313 -2146 1019 3007 856 -1845
4529 -1845 -499 2815 3024 -490 -1650 1198 3192 1369 -1724 -1059 2237 2191 -979 -2719 -215 2222
4545 2222 409 -2837 -2321 1331 1853 -1200 -2823 -345 2643 1085 -1916 -1568 1748 2583 -348 -2225
4561 -2225 17 2668 1167 -1741 -1687 1325 2024 -888 -2780 -973 1328 268 -2449 -2522 250 988
4577 988 -1143 -2823 -1003 1629 815 -1555 -1431 786 2124 100 -1221 20 2328 1625 -695 -718
4593 -718 1256 1922 123 -1219 -76 1579 635 -1096 -1072 301 900 -285 -1392 -299 945 492 -799
4610 -799 -634 1006 1249 220 -117 750 1495 994 107 453 849 1093 -59 -102 201 353 -104 -704 -566
4629 -566 -265 -448 -959 -874 -390 -422 -946 -822 -272 -9 -635 -792 231 486 -99 -394 -104 977 499 -345
4649 -345 -497 523 746 -247 -905 -302 488 49 -1124 -1113 171 408 -907 -1455 -460 684 118 -1112
4667 -1112 -580 754 1434 159 -754 417 1849 1103 -241 -29 1289 1750 310 -684 222 1592 923
4684 923 -796 -872 517 1186 -277 -1526 -493 886 477 -1190 -1336 373 1107 -27 -1126 -432 1251
4701 1251 1017 -735 -846 734 1477 321 -1073 -532 873 801 -1022 -1798 -380 666 -256 -1790 -1529
4718 -1529 166 458 -978 -1949 -753 879 369 -1246 -1381 494 1394 -90 -1124 -312 1522 1320 -451
4735 -451 -936 571 1845 444 -1065 -720 1286 1560 -728 -1516 -223 1479 616 -1592 -1309 898 1655
4752 1655 -347 -1419 1 2196 1278 -973 -978 1467 2381 237 -1599 -18 2143 1757 -1033 -1791 810
4769 810 2130 -65 -2320 -734 1448 1154 -1752 -2427 67 1821 -223 -2581 -1357 1669 1623 -1757
4785 -1757 -2513 70 2322 126 -2312 -1329 1601 1690 -1297 -2148 -18 2183 373 -2265 -1464 1405
4801 1405 1595 -1174 -2606 -194 1999 674 -2164 -1597 1410 2056 -510 -2109 -148 2539 1113 -1374
4817 -1374 -1366 1693 2497 152 -1774 -26 2384 1435 -1160 -1333 1337 2134 -50 -1711 -312 1862 1363
4834 1363 -1291 -1485 598 1938 80 -1844 -516 1394 1355 -797 -1386 410 1776 233 -1713 -678
4850 -678 931 1177 -583 -1810 -44 1463 197 -1696 -1273 520 1061 -708 -1756 -603 1034 457
4866 457 -1339 -1425 456 1245 -329 -1770 -564 1142 833 -1111 -1553 312 1270 160 -1442 -503 1031
4883 1031 1090 -735 -1025 405 1509 497 -934 -619 1190 1338 -245 -958 571 1672 746 -650 -550
4900 -550 928 1299 -129 -979 234 1281 578 -714 -690 915 1138 -347 -943 -121 945 493 -864
4917 -864 -666 818 706 -90 -834 -75 781 86 -993 -609 310 442 -530 -1107 -169 416 -262 -1061 -596
4936 -596 0 5 -750 -814 -192 269 -237 -831 -233 498 51 -403 -291 459 304 -191 -376 483 752 23 -642
4957 -642 226 489 156 -600 -244 310 447 -258 -447 346 805 181 -524 158 1092 1085 -306 -401 994 1389
4977 1389 202 -575 301 1504 816 -704 -668 911 1019 -272 -1503 -310 1049 138 -1324 -1285 457
4994 457 967 -800 -1725 -461 1251 390 -1639 -1303 807 1468 -565 -1700 2 1793 533 -1297
5010 -1297 -1369 1156 1548 -493 -1944 -467 1405 654 -1878 -1741 507 1470 -644 -2268 -685 1618
5026 1618 789 -1564 -1679 1073 2147 21 -1572 -167 2304 1793 -782 -1051 1333 2533 301 -1594
5042 -1594 -306 2085 1704 -820 -1431 734 1772 86 -1990 -907 1528 1414 -1257 -2102 426 2021
5058 2021 289 -1762 -933 1631 1857 -500 -1545 429 2271 779 -1568 -944 1118 1584 -917 -2132
5074 -2132 -439 1359 328 -2234 -1909 299 1147 -997 -2401 -999 1421 630 -1797 -1709 796 1761
5090 1761 73 -1545 -373 1874 1706 -892 -1448 660 2019 511 -1581 -748 1525 1334 -988 -1926
5106 -1926 46 1644 119 -1927 -1153 1001 1460 -526 -1707 288 2150 987 -1049 -673 1884 2206
5122 2206 283 -1114 363 2435 1532 -1068 -1068 1220 1797 -377 -1834 -505 1530 690 -1608 -1725 300
5139 300 1173 -770 -2151 -766 1100 806 -1306 -1369 512 1621 242 -1311 -250 1354 1278 -848 -959
5156 -959 565 1310 -76 -1428 -878 839 337 -1089 -1795 -201 640 -341 -1586 -939 878 706 -691
5173 -691 -890 487 1153 518 -436 -11 1343 1436 291 -27 703 1422 730 -326 -224 520 528 -102 -361 -103
5193 -103 317 -121 -453 -548 75 296 -235 -226 -133 233 363 -16 30 412 739 462 215 335 392 470 144 78 -196
5216 -196 -35 126 -161 -665 -719 -385 -253 -638 -1077 -913 -342 -172 -814 -917 -510 100 -180 -497 -66 389
5236 389 583 203 -261 316 798 447 -206 -208 536 502 -342 -569 -397 358 -111 -727 -593 120 335 -351 -634
5257 -634 -272 605 387 -243 69 708 1205 674 195 382 1065 1039 199 7 405 817 452 -99 -266 145
5277 145 426 -202 -900 -515 -225 64 -591 -867 -265 133 -210 -442 -747 296 395 -79 -306 -53 789 699
5297 699 -123 -507 6 525 -42 -601 -920 100 351 -725 -1240 -671 -2 -29 -1188 -1175 -88 557 -369
5316 -369 -1058 -402 946 845 -446 -760 615 1616 497 -672 -146 1565 1517 -293 -767 416 1516
5333 1516 484 -1323 -775 1428 995 -1000 -1321 145 1492 269 -1622 -877 1386 1447 -655 -1543 342
5350 342 2049 865 -1327 -882 1572 1546 -569 -1701 128 2047 661 -1714 -1514 843 1150 -1138
5366 -1138 -2404 -651 1485 347 -2143 -1715 933 1231 -781 -2166 -333 1695 782 -1314 -1342 1179
5382 1179 1886 -144 -1777 -410 1836 878 -1472 -1496 736 1729 -358 -2084 -406 1575 952 -1277
5398 -1277 -1800 502 1755 -44 -1620 -522 1825 1496 -731 -1099 1006 2274 874 -1123 -274 1540
5414 1540 1701 -532 -1341 511 1722 569 -1398 -840 1312 1230 -865 -1657 -108 1263 474 -1558 -1176
5431 -1176 705 1330 -675 -1432 -193 1457 735 -1261 -1211 560 1393 -171 -1573 -320 1198 729 -1241
5448 -1241 -1756 256 1011 -419 -1569 -896 873 716 -1109 -1427 241 1179 87 -1268 -635 851 899
5465 899 -555 -963 392 1638 517 -1098 -477 904 1180 -387 -953 77 1398 662 -796 -499 909
5482 909 1082 -146 -909 178 1168 513 -767 -383 775 974 -270 -737 309 1135 328 -712 -525 540
5500 540 766 -316 -714 -285 623 30 -678 -548 214 308 -413 -702 -59 389 -277 -763 -484 254 107 -551
5520 -551 -598 -312 87 -245 -380 -261 232 -63 -636 -425 168 -55 -266 -389 -112 355 -248 -469 208 589
5540 589 213 -140 -32 583 466 -140 -165 322 804 279 -557 100 935 754 -437 -467 495 920 -57 -798
5560 -798 -239 1008 392 -538 -525 637 1002 36 -688 -50 1078 540 -726 -635 842 1113 -301 -1290 -135
5579 -135 915 292 -1321 -1286 345 703 -664 -1638 -450 933 354 -1286 -1357 485 1145 -426 -1553
5596 -1553 -476 1059 750 -1142 -1230 355 1173 -239 -1263 -623 1112 718 -980 -1303 551 1311 -148
5613 -148 -1469 -649 1236 898 -919 -1241 437 1552 255 -1206 -249 1378 1362 -375 -881 663 1819
5630 1819 761 -802 -526 1151 1366 -554 -1142 222 1220 110 -1302 -832 470 851 -409 -1204 -201
5647 -201 885 520 -993 -943 655 1202 -18 -1088 -340 1243 833 -883 -979 357 1152 258 -1424 -880
5665 -880 829 497 -1013 -1480 -239 901 -145 -1658 -1062 531 805 -650 -1425 -151 1274 408 -965
5682 -965 -780 840 1620 -91 -972 46 1737 1046 -837 -707 775 1359 42 -1269 -324 1264 816
5699 816 -1079 -1168 615 1261 -45 -1328 -238 1152 1026 -606 -951 725 1687 436 -953 -352 1343
5716 1343 1402 -454 -998 319 1394 352 -1271 -832 621 860 -563 -1594 -229 773 -82 -1681
5732 -1681 -1218 300 706 -553 -1386 -302 1068 346 -1097 -637 781 1044 -93 -974 67 1077 638
5749 638 -776 -909 378 730 -381 -1076 -584 653 151 -832 -977 2 734 -118 -713 -108 678 812 -26
5768 -26 -406 545 1071 531 -148 157 1049 1049 258 -352 184 836 466 -200 -596 161 447 -165 -775 -493 95
5789 95 90 -501 -538 -56 360 74 -496 -265 486 424 9 -141 169 631 162 -158 -278 171 331 -72 -794 -534
5811 -534 15 -137 -732 -1012 -466 -151 -409 -807 -591 -78 49 -221 -427 -54 356 204 -6 98 514 826
5831 826 130 92 272 521 391 -102 52 91 110 -43 -100 -149 40 90 -299 -115 265 173 20 -16 173 477 318
5854 318 353 296 443 399 471 495 487 342 152 451 437 86 -259 -33 90 -142 -662 -735 -143 -16 -714 -1000 -346
5877 -346 -110 -260 -740 -550 68 346 -416 -669 154 837 216 -460 -333 470 715 -167 -826 -124 833 104
5897 104 -939 -725 389 547 -612 -1112 -216 860 141 -1153 -730 711 921 -139 -828 381 1452
5914 1452 977 -691 -357 1280 1721 107 -882 167 1496 851 -809 -884 809 1169 -286 -1527 -564
5931 -564 1265 421 -1233 -1260 630 1163 -265 -1467 -390 1367 857 -1008 -1065 721 1566 114 -1368
5948 -1368 -170 1316 842 -1007 -1389 341 1263 -257 -1983 -1023 922 382 -1314 -1605 -180 1034
5964 1034 -196 -1745 -964 1027 1082 -920 -1236 408 1582 386 -1073 -361 1228 1408 -504 -913 278
5981 278 1505 194 -1154 -636 871 948 -604 -1414 -81 1195 334 -1028 -999 789 1400 -129 -1126
5998 -1126 317 1515 1025 -711 -567 908 1470 99 -971 19 1084 820 -409 -809 254 1092 -126
6015 -126 -1150 -509 611 698 -827 -1324 -110 869 -124 -1037 -795 690 685 -796 -978 86 1018 367 -1001
6034 -1001 -507 609 704 -444 -1144 -129 838 213 -1093 -1030 296 500 -441 -1068 -341 818 225 -902
6052 -902 -585 459 752 -49 -514 39 1061 850 -327 -424 752 1118 96 -355 -94 924 598 -344
6070 -344 -456 435 786 -92 -516 -160 547 391 -514 -506 201 509 35 -345 -5 445 607 -241 -555 77 391
6091 391 7 -387 -100 204 -47 -310 -263 -122 -46 -480 -599 -197 65 -316 -556 -347 -52 -128 -333 -446 151
6112 151 119 -452 -327 -219 113 -37 -311 -66 229 65 -228 -165 167 271 -271 -236 252 322 97 -140 -189 417
6134 417 494 -230 -332 317 627 -33 -330 -75 705 550 -205 -278 433 642 -41 -693 22 585 328 -344 -396
6155 -396 273 599 -290 -673 -148 650 216 -311 -688 206 552 -235 -733 -330 372 372 -686 -585 30 504
6175 504 -176 -915 -431 573 337 -664 -643 55 546 -184 -785 -393 328 491 -387 -605 150 726 64 -460
6195 -460 -183 790 592 -185 -683 145 825 78 -443 -273 475 594 -86 -560 82 766 383 -290 -377 554
6215 554 638 126 -285 -43 893 719 -273 -299 419 1038 297 -482 -371 532 565 -340 -823 -138 650 171 -724
6236 -724 -600 201 604 -355 -786 -389 519 339 -849 -872 83 801 -55 -835 -283 607 644 -595 -990 132
6256 132 782 138 -1023 -782 505 685 -527 -1164 -105 515 121 -1087 -627 527 915 -381 -710 -19
6274 -19 1231 635 -808 -608 833 1232 138 -875 249 1246 619 -750 -709 774 1110 -326 -1000 -371
6292 -371 1155 694 -849 -680 540 1163 -116 -957 -236 1043 752 -500 -756 709 1198 59 -698
6309 -698 -26 908 643 -847 -769 451 859 -72 -1037 -616 368 307 -951 -1076 -138 626 -263 -1002 -523 551
6329 551 608 -473 -1052 128 766 293 -649 -421 629 600 -154 -652 209 756 343 -471 -362 140 465 -230
6349 -230 -819 -17 476 141 -413 -480 216 624 134 -546 167 855 769 -84 -195 550 839 242 -275 102 448
6370 448 611 -17 -423 136 496 152 -513 -353 194 12 -218 -505 -206 293 81 -305 -578 120 361 -274
6390 -274 -351 57 268 345 -294 -216 -14 319 -126 -446 -312 60 -86 -535 -614 -255 -168 -150 -655 -356 -6 -22
6412 -22 -173 -395 -121 31 -20 -153 258 494 507 241 85 261 522 376 175 263 399 179 127 341 61 16
6434 16 -122 -115 -13 15 -89 48 58 155 -228 11 256 504 16 -128 196 402 476 183 -101 219 707 210
6456 210 -373 -176 470 109 -477 -495 -122 157 -243 -972 -430 211 110 -693 -823 -37 423 -100 -840 -260
6476 -260 624 215 -381 -485 541 836 234 -636 -48 776 542 -482 -816 344 726 -233 -1026 -328 584
6495 584 372 -654 -939 134 942 -112 -977 -200 1045 1001 -314 -477 720 1308 394 -677 -22 1029
6513 1029 936 -553 -849 374 944 -53 -1095 -310 693 656 -737 -1190 59 924 -230 -1150 -710 706
6531 706 580 -401 -740 116 1067 464 -804 -391 1051 899 -475 -827 77 982 168 -1208 -676 474
6549 474 426 -618 -925 -146 578 -50 -942 -710 593 584 -437 -870 7 770 485 -253 -446 705 1126 167
6569 167 -687 299 918 589 -315 -538 322 750 29 -732 -300 650 565 -480 -581 285 556 116 -639 -296
6589 -296 678 726 -277 -504 337 841 487 -249 -224 512 610 -36 -470 -227 576 127 -677 -579 -102 217 -433
6610 -433 -1085 -454 164 73 -698 -764 35 594 -127 -713 -344 624 631 -234 -470 217 800 164 -712 -287 542
6631 542 504 -361 -807 138 466 -50 -482 -286 177 249 -283 -808 -153 651 313 -287 -61 614 787 -37 -148
6652 -148 379 804 471 -157 -50 456 633 104 -242 36 470 92 -114 -195 200 289 -148 -466 -64 117 -60
6673 -60 -306 -309 67 249 -60 -394 137 273 209 -164 -5 100 -15 -246 -242 -192 -67 25 -307 -256 -146 -131 -244
6696 -244 -48 -256 -68 -214 -114 23 -74 -147 -389 15 77 121 43 184 210 89 114 171 387 314 -6 10 204
6719 204 151 81 -156 96 161 171 -168 -39 118 281 148 -41 77 166 228 -291 -32 513 425 100 -287 119
6741 119 285 443 81 -227 107 420 -79 -561 -96 128 171 -248 -367 -76 103 -39 -687 -282 72 -86
6761 -86 -381 -383 81 205 43 -240 -231 169 154 -203 -418 -304 369 -40 -391 -517 2 455 9 -194 -95 300
6783 300 292 -99 -325 5 491 51 -299 -136 321 217 82 -142 24 551 292 -158 -76 251 630 152 -256
6804 -256 40 486 472 -166 -368 321 737 8 -471 -233 488 400 -91 -408 -44 554 183 -717 -419 319 418
6825 418 -167 -576 -139 370 362 -722 -735 221 590 -201 -899 -178 673 147 -684 -648 241 627 -350 -880 -211
6846 -211 523 402 -540 -772 280 728 -201 -806 -251 558 551 -603 -671 201 739 185 -733 -294 964 848
6866 848 -294 -821 525 1019 272 -537 -7 1010 731 -308 -711 190 866 307 -850 -320 729 686
6884 686 -374 -756 444 832 30 -802 -269 604 689 -232 -720 46 789 119 -752 -467 359 658 -240 -799
6904 -799 -113 648 103 -496 -570 274 328 -394 -958 -258 448 148 -840 -565 183 582 -215 -668 -242 537 271
6925 271 -453 -401 543 550 136 -495 -70 593 439 -305 -342 166 591 27 -504 -148 380 449 -183 -325 -42 551
6947 551 182 -273 -103 456 570 55 -198 372 415 248 -125 -197 282 454 81 -473 -123 194 132 -360 -553
6968 -553 98 -33 -223 -467 -120 -14 42 -231 -351 -53 187 -191 -330 -136 258 143 -161 -109 42 236 -42
6989 -42 -116 -45 116 104 -287 -249 -187 -18 -191 -346 -48 -47 -175 -270 -229 -78 233 -212 -99 318 93 57 -22 413
7013 413 347 295 378 61 371 186 236 -117 189 238 -117 -28 -38 86 -36 -379 -167 -103 44 -195 -247 -44 211
7036 211 245 -165 -132 301 592 -43 -144 158 413 -19 -296 -61 240 42 -328 -484 -129 120 -318 -529 -343
7057 -343 216 38 -542 -786 60 328 15 -637 -212 562 405 -286 -437 364 592 -61 -416 -126 612 441
7077 441 -165 -520 179 619 155 -465 -268 530 341 -427 -723 75 559 196 -763 -59 605 632 -142 -392
7097 -392 131 934 412 -426 23 965 697 -140 -356 147 728 109 -455 -492 298 436 -317 -772 -213 421
7117 421 153 -670 -574 166 357 -195 -635 -198 442 186 -432 -234 346 465 -63 -483 -211 472 234 -386
7137 -386 -471 -98 505 -112 -588 -438 285 112 -683 -711 59 247 63 -477 -165 365 547 163 -145 202 688
7158 688 482 -214 -3 329 598 42 -294 46 488 206 -388 -332 75 494 -168 -539 -214 270 294 -380 -553
7179 -553 259 587 59 -338 23 456 384 -126 -492 230 508 197 -344 -237 239 396 -231 -609 -108 249
7199 249 40 -655 -614 153 154 -441 -766 -281 327 -19 -512 -384 128 348 -130 -311 -63 780 456 -268 -462
7220 -462 332 670 20 -397 -296 422 360 -192 -396 257 396 -164 -396 -133 374 384 -198 -351 229 480 277
7241 277 -115 -207 452 546 139 -269 156 362 241 25 -72 331 7 -277 -429 -133 281 113 -369 -400 -195
7262 -195 70 -199 -254 31 221 111 -142 -300 151 75 73 -126 -54 39 153 9 -27 -30 121 -175 -38 -373 39
7285 39 -22 -290 -275 -147 -140 -3 -213 -183 -77 -16 16 -8 70 267 130 65 81 220 346 344 80 250 106 181 164
7310 164 100 -58 133 149 357 -21 -132 166 83 -116 -42 70 43 95 -5 -129 171 195 106 -141 -37 103 104
7333 104 -170 -41 102 16 42 -161 -18 -26 118 -338 -334 -219 -26 -361 -266 -456 -115 61 -238 -305 -136 112 18
7356 18 116 -294 109 34 24 102 -73 124 411 127 -160 -284 111 193 -139 -215 85 199 164 -147 -166 66 376
7379 376 -117 -72 85 460 157 -93 -156 290 574 189 -389 -105 560 371 -264 -132 152 602 -65 -486 -271
7400 -271 479 498 -392 -490 137 530 -56 -389 -172 313 362 -477 -676 221 619 105 -690 -333 403 466 -339
7421 -339 -513 113 569 109 -786 -343 323 481 -265 -558 107 570 148 -578 -282 418 186 -231 -581 30
7441 30 460 94 -538 -382 511 654 -312 -785 91 835 129 -378 -282 494 668 -202 -353 20 1024 312
7461 312 -349 -263 329 560 -6 -337 -43 506 328 -433 -150 395 478 41 -543 -178 517 227 -430 -433 218
7482 218 410 68 -474 -201 424 303 -423 -336 224 572 -189 -637 -149 187 170 -283 -335 9 228 -27 -355
7503 -355 -219 283 110 -118 -493 10 356 138 -236 -416 331 363 103 -233 -63 500 270 -313 -165 262
7523 262 458 143 -205 24 241 222 -107 -104 179 341 3 -104 -128 278 26 -158 -85 155 450 77 -75 -65
7545 -65 348 337 104 -261 68 291 338 -83 -30 -50 148 -43 -510 -99 5 46 -357 -324 -127 -3 -159 -475
7567 -475 -223 116 -76 -183 -410 20 129 -152 -82 30 173 67 -31 9 65 253 1 -265 172 126 -54 -65
7589 -65 -263 138 -35 -99 -108 -286 226 -74 -25 53 -66 144 -176 128 114 90 81 104 185 271 63 -111 175 208 -60
7614 -60 9 -266 233 -50 -148 70 28 30 -137 -273 70 274 61 -362 -146 170 142 113 -266 194 118 314 -204
7637 -204 -37 240 292 -298 -243 -44 277 70 -396 -372 -90 54 -400 -438 -315 136 -151 -435 -168 213 290 -279
7659 -279 -281 65 408 71 -87 -135 321 579 -42 -300 97 355 304 -196 -271 68 268 -70 -355 -20 214 178
7681 178 -299 -211 103 451 9 -307 -38 568 405 -187 -92 118 443 157 -245 -90 243 434 -268 -165 38
7702 38 392 -88 -507 -315 96 219 -193 -383 -200 385 -40 -371 -365 196 231 -324 -428 -159 157 40 -58 -103
7724 -103 199 228 20 -180 -188 120 106 -261 -314 133 222 -47 -468 -218 62 174 -304 -436 102 283 255 -327
7746 -327 -112 295 566 186 -164 31 505 529 0 -142 268 562 46 -429 -171 219 231 -314 -430 11 349
7767 349 -101 -614 -259 284 214 -313 -320 -89 485 181 -239 -266 514 398 -321 -432 205 371 -89 -441 -260
7788 -260 299 72 -363 -599 0 193 -131 -455 -157 159 123 -136 -558 18 391 123 -251 -166 353 371 -24
7809 -24 -139 136 362 301 -254 -123 288 134 -51 -464 20 354 319 -296 -140 154 282 -114 -318 -56 555
7830 555 246 -256 -97 331 483 -14 53 161 362 293 -380 74 120 224 -73 -134 -48 213 -9 -389 -395 -138
$$ [...]
8191b9
##END NTUPLES=NMR FID
##END=
