##TITLE=1H_LY-Dixlofos2
 CDCl3, 8 sc, 
 27.10.2020
##JCAMPDX= 6.0         $$ Bruker NMR JCAMP-DX V2.0
##DATA TYPE= NMR FID
##DATA CLASS= NTUPLES
##ORIGIN= UXNMR, Bruker Analytische Messtechnik GmbH
##OWNER= root
$$ XWIN-NMR		Version 3.5
$$ Tue Oct 27 12:25:47 2020 Russian Standard Time (UT+4h)  she@DPX200
##.OBSERVE FREQUENCY= 200.1315066352
##.OBSERVE NUCLEUS= ^1H
##.DELAY= (6, 6)
##.ACQUISITION MODE= SIMULTANEOUS
##.ACQUISITION SCHEME= undefined
##.AVERAGES= 8
##.DIGITISER RES= 18
##SPECTROMETER/DATA SYSTEM= spect
##.PULSE SEQUENCE= zg30
##.SOLVENT NAME= D2O
##.SHIFT REFERENCE= (INTERNAL, D2O, 0, 15.7039)
##AUDIT TRAIL= $$ (NUMBER, WHEN, WHO, WHERE, WHAT)
$$ ##TITLE= Audit trail, XWIN-NMR		Version 3.5
$$ ##JCAMPDX= 5.01
$$ ##ORIGIN= Bruker BioSpin GmbH
$$ ##OWNER= she
$$ F:/spectra/data/she/nmr/H-F/1/audita.txt
$$ ##AUDIT TRAIL=  $$ (NUMBER, WHEN, WHO, WHERE, WHAT)
(   1,<2020-10-27 12:24:43.18 +0400>,<she>,<DPX200>,
      <created by zg, POWCHK disabled, PULCHK disabled
       configuration hash MD5:
       00 E9 B6 7A A2 85 ED C7 34 08 36 98 17 FE 4E 26
       data hash MD5: 16K
       F6 6E FA AB 46 49 B2 3A DA 91 2F CB 49 9D 20 64>)
$$ ##END=
$$ 
$$ hash MD5
$$ CC 19 C5 CA 35 0E 16 36 4B C3 38 20 3E 20 F3 01
##$RELAX= 
##$RELAX= 
##$RELAX= 
##$RELAX= 
##$RELAX= 
##$RELAX= 
$$ Bruker specific parameters
$$ --------------------------
##$DU= <F:/spectra>
##$EXPNO= 1
##$NAME= <H-F>
##$PROCNO= 1
##$TYPE= <nmr>
##$USER= <she>
##$AMP= (0..31)
100 100 100 100 100 100 100 100 100 100 100 100 100 100 100 100 100 100 
100 100 100 100 100 100 100 100 100 100 100 100 100 100 
##$AQSEQ= 0
##$AQ_mod= 1
##$AUNM= <au_zg>
##$AUTOPOS= <>
##$BF1= 200.13
##$BF2= 200.13
##$BF3= 200.13
##$BF4= 200.13
##$BF5= 200.13
##$BF6= 200.13
##$BF7= 200.13
##$BF8= 200.13
##$BYTORDA= 1
##$CFDGTYP= 0
##$CFRGTYP= 5
##$CHEMSTR= <none>
##$CNST= (0..31)
1 1 145 1 1 1 1 1 1 1 1 1 1 1 1 1 1 1 1 1 1 1 1 1 1 1 1 1 1 1 1 1 
##$CPDPRG= <>
##$CPDPRG1= <>
##$CPDPRG2= <>
##$CPDPRG3= <>
##$CPDPRG4= <mlev>
##$CPDPRG5= <mlev>
##$CPDPRG6= <mlev>
##$CPDPRG7= <mlev>
##$CPDPRG8= <mlev>
##$CPDPRGB= <>
##$CPDPRGT= <>
##$D= (0..31)
0 1.2 0 0 0 0 0 0 0 0.06 0 0.03 0 0 0 0 0.0002 0 0 0 0 0 0 0 0 0 0 0 0 
0 0 0 
##$DATE= 1603787082
##$DBL= (0..7)
120 120 120 120 120 120 120 120 
##$DBP= (0..7)
150 150 150 150 150 150 150 150 
##$DBP07= 0
##$DBPNAM0= <>
##$DBPNAM1= <>
##$DBPNAM2= <>
##$DBPNAM3= <>
##$DBPNAM4= <>
##$DBPNAM5= <>
##$DBPNAM6= <>
##$DBPNAM7= <>
##$DBPOAL= (0..7)
0.5 0.5 0.5 0.5 0.5 0.5 0.5 0.5 
##$DBPOFFS= (0..7)
0 0 0 0 0 0 0 0 
##$DE= 6
##$DECBNUC= <off>
##$DECIM= 32
##$DECNUC= <off>
##$DECSTAT= 4
##$DIGMOD= 1
##$DIGTYP= 9
##$DL= (0..7)
0 120 120 120 120 120 120 120 
##$DP= (0..7)
150 150 150 150 150 150 150 150 
##$DP07= 0
##$DPNAME0= <>
##$DPNAME1= <>
##$DPNAME2= <>
##$DPNAME3= <>
##$DPNAME4= <>
##$DPNAME5= <>
##$DPNAME6= <>
##$DPNAME7= <>
##$DPOAL= (0..7)
0.5 0.5 0.5 0.5 0.5 0.5 0.5 0.5 
##$DPOFFS= (0..7)
0 0 0 0 0 0 0 0 
##$DQDMODE= 0
##$DR= 18
##$DS= 0
##$DSLIST= <SSSSSSSSSSSSSSS>
$$ [...]
##$SUBNAM2= <"">
##$SUBNAM3= <"">
##$SUBNAM4= <"">
##$SUBNAM5= <"">
##$SUBNAM6= <"">
##$SUBNAM7= <"">
##$SUBNAM8= <"">
##$SUBNAM9= <"">
##$SW= 16.880792210976
##$SWIBOX= (0..15)
0 0 2 0 0 0 0 0 0 0 0 0 0 0 0 0 
##$SW_h= 3378.37837837838
##$TD= 16384
##$TD0= 1
##$TE= 0
##$TE2= 300
##$TE3= 300
##$TEG= 300
##$TL= (0..7)
0 120 120 120 120 120 120 120 
##$TP= (0..7)
150 150 150 150 150 150 150 150 
##$TP07= 0
##$TPNAME0= <>
##$TPNAME1= <>
##$TPNAME2= <>
##$TPNAME3= <>
##$TPNAME4= <>
##$TPNAME5= <>
##$TPNAME6= <>
##$TPNAME7= <>
##$TPOAL= (0..7)
0.5 0.5 0.5 0.5 0.5 0.5 0.5 0.5 
##$TPOFFS= (0..7)
0 0 0 0 0 0 0 0 
##$TUNHIN= 0
##$TUNHOUT= 0
##$TUNXOUT= 0
##$USERA1= <user>
##$USERA2= <user>
##$USERA3= <user>
##$USERA4= <user>
##$USERA5= <user>
##$V9= 5
##$VALIST= <valist>
##$VCLIST= <CCCCCCCCCCCCCCC>
##$VD= 0
##$VDLIST= <DDDDDDDDDDDDDDD>
##$VPLIST= <PPPPPPPPPPPPPPP>
##$VTLIST= <TTTTTTTTTTTTTTT>
##$WBST= 1024
##$WBSW= 4
##$XGAIN= (0..3)
0 0 0 0 
##$XL= 0
##$YL= 0
##$YMAX_a= 306587
##$YMIN_a= -359924
##$ZGOPTNS= <>
##$ZL1= 120
##$ZL2= 120
##$ZL3= 120
##$ZL4= 120
##$ABSF1= 10
##$ABSF2= 0
##$ABSG= 5
##$ABSL= 3
##$ALPHA= 0
##$AQORDER= 0
##$ASSFAC= 0
##$ASSFACI= 0
##$ASSFACX= 0
##$ASSWID= 0
##$AUNMP= <proc_1d>
##$AZFE= 0.1
##$AZFW= 0.1
##$BCFW= 1
##$BC_mod= 2
##$BYTORDP= 1
##$COROFFS= 0
##$CY= 11.3945322036743
##$DATMOD= 1
##$DC= 2
##$DFILT= <>
##$DTYPP= 0
##$F1P= 15.9154993809931
##$F2P= -4.1035820241983
##$FCOR= 0.5
##$FTSIZE= 0
##$FT_mod= 4
##$GAMMA= 1
##$GB= 0.15
##$INTBC= 1
##$INTSCL= 1
##$ISEN= 128
##$LB= 0.24
##$LEV0= 0
##$LPBIN= 0
##$MAXI= 10000
##$MC2= 0
##$MEAN= 0
##$ME_mod= 0
##$MI= 1.114404
##$NCOEF= 0
##$NC_proc= 0
##$NLEV= 6
##$NOISF1= 3.799351
##$NOISF2= 2.8
##$NSP= 1
##$NTH_PI= 0
##$NZP= 0
##$OFFSET= 15.70392
##$PC= 1
##$PHC0= -10852.75
##$PHC1= 19.20088
##$PH_mod= 1
##$PKNL= yes
##$PPARMOD= 0
##$PSCAL= 0
##$PSIGN= 0
##$REVERSE= no
##$SF= 200.130013532006
##$SI= 16384
##$SIGF1= 3
##$SIGF2= 2
##$SINO= 400
##$SIOLD= 16384
##$SREGLST= <1H.CDCl3>
##$SSB= 0
##$STSI= 0
##$STSR= 0
##$SW_p= 3612.71676300578
##$SYMM= 0
##$S_DEV= 0
##$TDeff= 0
##$TDoff= 0
##$TI= <>
##$TILT= no
##$TM1= 0
##$TM2= 0
##$TOPLEV= 0
##$USERP1= <user>
##$USERP2= <user>
##$USERP3= <user>
##$USERP4= <user>
##$USERP5= <user>
##$WDW= 1
##$XDIM= 8192
##$YMAX_p= 0
##$YMIN_p= 0
$$ End of Bruker specific parameters
$$ ---------------------------------
##NTUPLES= NMR FID
##VAR_NAME=  TIME,          FID/REAL,        FID/IMAG
##SYMBOL=    X,             R,               I
##VAR_TYPE=  INDEPENDENT,   DEPENDENT,       DEPENDENT
##VAR_FORM=  AFFN,          ASDF,            ASDF
##VAR_DIM=   8192,          8192,            8192
##UNITS=     SECONDS,       ARBITRARY UNITS, ARBITRARY UNITS
##FACTOR=    0.000296,      1,               1
##FIRST=     0,             0,               0
##LAST=      2.424536,      0,               0
##MIN=       0,             -359924,         0
##MAX=       2.424536,      306587,          0
$$ Real data points
##PAGE= N=1
##DATA TABLE= (X++(R..R)), XYDATA
0@%%%%%%%%%%%Qj6J6j6J6k4L2m0M8n6P2q8J03j19J36j59J84k10K43k80L19l63
33a94M14m68N28n95O67p46Q34r30J034j148J273j409J558j722J900k093K307k544
51a334K802l087L404l757M154m603N117n707O397p219Q209r434J1002j3086J6001
66H859k0406K7926m4141J42213j69860k36218L43483K54731j89934l95182P3690
77b04839L76219O5982l64804j94464K62558L09823j64942l49692L0381L59729
87A25951J05605k95412k15919K31490L00326j04569l23855j2779L08313J36863
97B56014k60352k29641J62782K74719o1351k95775o3768K59743J46701k07154
107a8082k26741J07389K52296r969k50886q1866K18192J64786j39888j99217O5023
$$ plain form
0 0 0 0 0 0 0 0 0 0 0 0 0 8 -8 8 -8 8 -16 16 -24 24 -32 40 -48 55 -64 72 -87 97 -113 130 -150 169 -194
33 -194 220 -248 280 -315 352 -394 440 -490 544 -604 669 -740 818 -904 996 -1097 1210 -1334
51 -1334 1468 -1619 1785 -1972 2182 -2421 2696 -3011 3386 -3833 4376 -5058 5944 -7142 8859
66 8859 -11547 16379 -27762 114451 -55409 -291627 51856 306587 116653 -278529 -204839
77 -204839 171380 237362 -127442 -321906 -59348 250475 85533 -264159 -233778 125951
87 125951 231556 -63856 -279775 -48285 252041 147472 -176383 -189162 119151 256014
97 256014 -4338 -233979 -71197 203522 142171 -153604 -217372 42371 189072 -18082
107 -18082 -244823 -137434 114862 104893 -145993 -227859 -9667 155119 15231 -183986 -118963
118a18963K29748L6105j99328r4954J62289J59567q0527j80179J4973J83268N1336
129A63335j52806j11843R3472J40278m4045j58485k3085J31948O7814j02396j12110
140a07923N2496J26473m083j19285m2533R8647Q9149n3215r8864K1038J06188
151F8088K9909q3915o0805O2092Q4494k4914q9803j7994P5396M3200o2615p2794
163d9661K0294O8002j340p7196l8147N1644N1759l1019o6873R76O4661K4739m8218
176c0379l9847L3757N9232l871n2600q945N0606L5268k9436m5183J3593M7915
188C0110K892m3134k3924K9224L2938k1784m2087N7L1451J0472l0357k5103J9907
201b9338K7650n763k2128j460K5138J7132j1708j0480J1754J6742M892n841j295
$$ plain form
118 -118963 110785 146890 -52438 -147392 14897 174464 93937 -86242 -71269 111999 163335
129 163335 10529 -101314 -7842 132436 88391 -70094 -93179 38769 106583 4187 -107923
140 -107923 -55427 71046 66963 -52322 -94855 3792 92941 39726 -59138 -38100 68088
151 68088 97997 14082 -46723 15369 99863 74949 -14854 -32848 42548 85748 23133 -49661
163 -49661 -29367 38635 37295 -39901 -78048 -26404 25355 -5664 -72537 -71561 -6900 17839 -30379
176 -30379 -70226 -36469 22763 18892 -33708 -42653 7953 43221 13785 -31398 -17805 30110
188 30110 33002 -10132 -34056 -4832 28106 6322 -35765 -35708 -4257 6215 -24142 -49245 -29338
201 -29338 -1688 -7451 -29579 -31039 -5901 11231 -477 -10957 797 17539 22431 16590 15295
214A5295R668N538j583j08k710m818J43K576j84j1246j3774O848J4675p556k1659
229h895p318J8975J5590k2212k5757J7247L4061J029l5710j5210M1351L3952k9523
242A7580m1503J3057N2708R350n8561k9250M9824M4805l3691o8026J814P1205
254B9312J5238p3164m6169M8583O6189k8003q6063k32Q6320L1402p1714o3013
266i1314N1924R0623k0002r3668r322R3295N3684p2947q2732M8991J01705j0349
278E9888j03699l2631R4863P0487p4000r8208L6052J09266O367j12054n1934R5596
290gQ5515o3210j06921K2422J20894K7205j10900o4452Q9249R9740m5222j15447
302f1134K976J21455M3886j01773p9070O8599J05888k8400j20464j8837J09370
$$ plain form
214 15295 24963 30501 28918 28810 26100 21282 21425 24001 23817 12571 -1203 5645 20320 12764 -8895
229 -8895 -16213 2762 18352 -3860 -29617 -12370 21691 22720 -12990 -28200 13151 47103 17580
242 17580 -23923 -10866 41842 51192 -7369 -36619 13205 58010 24319 -43707 -41893 29312
254 29312 44550 -28614 -74783 -26200 39989 11986 -74077 -74309 12011 43413 -28301 -91314
266 -91314 -39390 51233 31231 -62437 -71759 21536 75220 2273 -80459 -31468 70237 59888
278 59888 -43811 -76442 18421 88908 14908 -83300 -47248 62018 68385 -43669 -95603 -7
290 -7 85508 22298 -84623 -62201 58693 85898 -25002 -89454 -205 99535 54313 -61134
302 -61134 -58158 63297 107183 5410 -73660 -5061 100827 72427 -48037 -66874 42496
313D2496N6848q5699r3106M6542J09873q728j13707l6383R4532P3264o6538j02063
325h2669K8049J10571J6048r9595n6128P7416Q7248m4827j02560L379J01178L8318
337G6428q6252p3520N6268R2155j9663r9852k4121Q7860N6713o6602q3150L0560
349e3176R4542R289r0083m5545P0751P4072l8326q8663L198R0867L5777p3588
361a0885o4432M8458Q6710j2082r0029k3853Q0836N8763n6862q2287K5884R4053
373E4274J3591q8355n1028O9765Q0339l8767r5059O32R7015M1243q2127p3490
385g1967N5183R5629j5677j02897k6532R4459O3566p1160r0370L5033J04646O407
397G6320j05659m8600Q7186Q0609n5763j03340J3909J10581K7819j01039o5196
$$ plain form
313 42496 99344 13645 -79461 -32919 76954 68226 -45481 -81864 12668 85932 19394 -82669
325 -82669 -54620 55951 71999 -27596 -83724 -6308 80940 36113 -66447 -63068 38110 76428
337 76428 -9824 -83344 -27076 65079 45416 -54436 -78557 9303 66016 -586 -83736 -53176
349 -53176 41366 50655 -39428 -84973 -14222 59850 21524 -67139 -63941 26926 62703 -10885
361 -10885 -75317 -26859 59851 47769 -42260 -66113 14723 73486 16624 -65663 -39779 54274
373 54274 67865 -20490 -71518 -1753 78586 39819 -55240 -54608 42407 83650 1523 -71967
385 -71967 -16784 78845 63168 -39729 -66261 28198 91764 20604 -69766 -34733 69913 76320
397 76320 -29339 -77939 9247 89856 34093 -69247 -55338 55243 83062 -17977 -83173
408h3173P4722R3242l9232j12054m362J10606M3517r3214p9514O0361J03313k4356
420D9856j14846j8145J04359N6114q2813r1233M9334J09716j0062j09394l1275
431h8389R5244O9610p0185r4489L7630J05289N219r8263m2776Q4825P4201n6700
443B1216q9651K0579R4303J7176q8980m8734P0052O9934l9604q2399N877Q4953
455C4722K3202p4770m6555N3182O6394k3722p3588K40P3455K5817n6405m3935
467d1963L8400N9768j6010o1705m098N5762K5483m2505m2038K5350M6459j1540
479C1363m7429r817L7698K1918l1090l3036J7094L2604m016l1091r789K5998J7305
492A7712j8096j8262J0683K0550P76j8213n202J5683P620j0054q940L127Q277
$$ plain form
408 -83173 -8451 84791 45559 -66495 -70857 39749 83266 -9948 -89462 -29101 74212 49856
420 49856 -64990 -83135 21224 77338 -5475 -96708 -47374 62342 52280 -57114 -88389
431 -88389 6855 76465 6280 -88209 -50579 54710 59929 -38334 -81110 3715 77916 21216
443 21216 -68435 -47856 46447 63623 -25357 -74091 -4039 65895 26291 -56108 -50231 34722
455 34722 57924 -16846 -63401 -10219 56175 32453 -41135 -40895 32560 58377 1972 -41963
467 -41963 -3563 56205 40195 -21510 -25608 30154 55637 13132 -28906 -3556 42903 31363
479 31363 -16066 -25883 11815 33733 2643 -30393 -13299 19305 15289 -15802 -25591 407 17712
492 17712 -384 -18646 -7963 12587 13363 -4850 -10052 5631 13251 3197 -5743 -2616 5661
505E661k920r644P71M844l273o231k190L322o51q087L9Q613R67p572l934R313
521a0972J0768o100j0696O468J6278L539j3613o316J7069J5449r761j8031K679
534c239K0533M817k2025j4475J5538J9651r543k6475k714K5023J0930k2617k1477
547b6073J4770K9163k545k9726p245L0848K3490j9544k9773J0753L7490O834l4686
560C756j9932K9624L2925j7666m1956j252M1073J5215m0879l5796K3214M1908
572C0234r851n1369j3102M6442K9570l7472m6451J9039N7152M791n6214k4165
584e1396N0256M7358k9126n8506R064O6561J6602o1392m0544M5585O0059k4814
596B9707p3919m162P0917K8188o4163n7982M0527P3768j6944q3061j4700P7810
$$ plain form
505 5661 2741 -6903 -6132 -1288 -4561 -10792 -12982 -9660 -10311 -18398 -18359 -9746 -8779 -16351 -20285 -10972
521 -10972 -204 -6304 -17000 -10532 5746 9285 -4328 -10644 6425 21874 12113 -5918 -3239
534 -3239 17294 22111 86 -14389 1149 20800 11257 -15218 -17932 7091 18021 -4596 -26073
547 -26073 -11303 17860 15315 -14411 -21656 9192 32682 13138 -16635 -5882 31608 38442 3756
560 3756 -16176 13448 46373 28707 -13249 -14501 26572 41787 908 -34888 -11674 30234
572 30234 20383 -30986 -44088 2354 31924 -5548 -51999 -32960 24192 28983 -27231 -51396
584 -51396 -1140 46218 17092 -41414 -32350 34211 50813 -10579 -51123 -5538 54521 29707
596 29707 -44212 -48374 22543 50731 -13432 -71414 -30887 42881 25937 -57124 -71824 5986
608E986M7498n9766p0340L8339Q8302k588q5211k7784Q0636O4641n5075q0969
620e6331K7910R2681J0206r0233m6037P4735P1205n0165r1413J0692R4952K3110
632G1312r1261n8258O6411Q0243l5806r6618p17R9408L7844q2015o5010N8210
644a6257R1786k1154r8317j0847R5190M7785p3938p6646M5899R4580j3506r9880
656c5305k6803Q3370N5656o7014q5386L2030R1030o57r1629l8012P5154O5265
668E7699n1368q1985K0110Q8061J7278p7865m3599O5086O9298l4317p7343M774
680d4171Q0261K7158o9119n1342M7011O6079k0942p5499j0616O8694L1989n7076
692g573n5103L0831O4745o669o7033j7135N8890M0340l8371n2566K0315O3074
$$ plain form
608 5986 53484 -6282 -76622 -38283 50019 47431 -37780 -65564 15072 79713 24638 -56331
620 -56331 -28421 64260 74466 -15767 -61804 12931 84136 33971 -57442 -46750 48202 71312
632 71312 -19949 -78207 -11796 68447 32641 -63977 -64694 34714 72558 -9457 -74467 -16257
644 -16257 75529 54375 -43942 -54789 40401 88186 14248 -62398 -16499 78081 64575 -35305
656 -35305 -62108 21262 76918 9904 -75482 -43452 47578 46921 -44708 -82720 -7566 57699
668 57699 6331 -75654 -55544 32517 49795 -28070 -71669 -6583 62715 28398 -48945 -44171
680 -44171 36090 63248 -5871 -57213 -10202 55877 34935 -40564 -51180 17514 49503 -7573
692 -7573 -62676 -31845 32900 26231 -40802 -57937 953 41293 2922 -49644 -29329 33745
704C3745O900n3392k3502M5321M5129k3719n0658N766N1069J4671m3384l3898
716b5952K6975M1592j2990m6689r225L8032K1765l1577l6487J4646L8833J080
728B0003l7537j6235L1048K9732j6187l2767M568L6321J2371k8592k1943K0597
740A379L1193o356l3011p730K7420J6809k2726k9000O890K7399N66k9820j6238
753c3225K0205K2207j2515k8233m2K7138J1331k0552j8122J5587K6652j817k3088
766a4474m497K3793J7101j4710k0558P570K3202K385k1577j1497J6193J6056j1605
779G382k1514k0J8255N415j7827j3077J1738J5831m139j5547j249J6958R275j0431
793A050q856Q105J3943J681j0536j945J1213O283n311p555L98P007q5p454l381
$$ plain form
704 33745 40645 -12747 -36249 9072 54201 30482 -20176 -14410 36659 51330 7946 -25952
716 -25952 1023 42615 29625 -17064 -26289 11743 33508 1931 -34556 -19910 18923 20003
728 20003 -17534 -33769 -2721 27011 10824 -21943 -17375 18946 31317 2725 -19218 1379
740 1379 32572 26216 -6795 -14525 12895 29704 6978 -22022 -15132 12267 12833 -16987 -33225
753 -33225 -13020 9187 -3328 -31561 -31603 -4465 6866 -13686 -31808 -16221 10431 8614 -14474
766 -14474 -18971 4822 21923 7213 -13345 -5775 17427 19812 -1765 -13262 2931 18987 7382
779 7382 -14132 -14152 4103 9518 -8309 -21386 -9648 6183 2044 -13503 -14752 2206 11481 1050
793 1050 -7806 299 14242 15923 5387 3442 14655 20938 15627 8072 8470 15477 15392 7938 4557
808D557O76Q90j443m348k291o87j634J066n16m124j258L426N284J75p082k91R977
825B377N076o122p795M872J3925o93j5338l903J3429J0038j1706j9429M028J9252
839H011n81k1985j1516J6838J8158j3446k5219M561K6745O819k4498j6675K2124
852a0664K7474j0448k8347J805L2973J4617k7823k3079K1703L2124p841l5738
864a3244o413L5557J9080l0186l0866J6265L6645l742m1532j2486L6591K4846
876C0515k6191l5401J3151M3279L125m1142j6642L5101L2877k0475m0451P624
888a4630M4600R969l8973k5484K8306L7352j6107m4355k697M0034J7810l4813
900A012l3887K0246L9073o987m2728j2609L6639K6881k7283l7416J2471M2273
$$ plain form
808 4557 5233 6123 4680 332 -1959 -2646 -4280 -3214 -3730 -7854 -9112 -5686 -402 -227 -7309 -7600 2377
825 2377 7453 1331 -6464 -1592 12333 11640 -3698 -7601 5828 15866 4160 -15269 -11241 8011
839 8011 7430 -14555 -26071 -9233 8925 -4521 -29740 -25179 1566 8385 -16113 -32788 -10664
852 -10664 16810 6362 -21985 -20180 12793 27410 -413 -23492 -1789 30335 22494 -13244
864 -13244 -19657 15900 34980 4794 -26072 -9807 26838 23096 -18436 -30922 5669 30515
876 30515 4324 -31077 -17926 25353 28478 -12664 -29306 5795 38672 18197 -22254 -14630
888 -14630 29970 39939 966 -24518 3788 41140 25033 -19322 -22019 18015 35825 1012
900 1012 -32875 -12629 26444 19457 -23271 -35880 759 27640 357 -37059 -24588 17685
912A7685O083l9208k1061L2131L4394j7602m0637J520M2251J6319l5637l0830
924c4592K2607L9472p561m3676j1609L8214K5990k8674l8734J2653M3956N529
936B3575m2256k2828L3703L7565j7847m3902J508M6917J9668l7861l3542K6504
948h796M5973p256m8555j1601M5463L0186l4016m3638J7104N0962K471n1999k3535
961c7237M2764L9636k8529n1556Q320N5966J3249n2006l2589L9787M8743k0949
973B5599n7437q09N8254K2785m9658m1117L3671N4800j3546o1603r959N6352L0297
986D7629m4794m9288K5706N8588n409o0816j8359N1899L8181l8814n3886J8720
998c0643N9551L589n6556k5771M7548M3627l1888n4062J1434N7457J1401n3244
$$ plain form
912 17685 23768 -15440 -36501 -4370 30024 12422 -28215 -26695 15556 31875 -3762 -34592
924 -34592 -11985 27487 19926 -23750 -35359 2855 28845 171 -38563 -25910 18046 23575
936 23575 -18681 -41509 -7806 29759 11912 -31990 -30482 16435 36103 -1758 -35300 -8796
948 -8796 37177 29921 -18634 -30235 15228 45414 11398 -32240 -15136 35826 38297 -13702 -37237
961 -37237 5527 45163 16634 -34922 -26602 29364 42613 -9393 -41982 -2195 46548 25599
973 25599 -31838 -32647 25607 48392 -1266 -42383 -8712 46088 32542 -29061 -39020 17332 47629
986 47629 2835 -46453 -20747 37841 32432 -28384 -46743 5156 43337 4523 -49363 -30643
998 -30643 28908 32497 -24059 -49830 -2282 41345 9457 -44605 -33171 24286 35687 -17557
1010a7557l0825M2713M5479k4457n2980L445N4349J6644m8329l2678L4924M5155
1022C5883j5901n0360k174M9701J9690l9890l3168K5971M3324r119m5415n925
1034b7383M1409K1727l0666l2791J8193L8892m529l7968r483L2257K2463k3247
1046H874l0062J2532L2372k24l0239j1888K5032K0488j7410k4815P366K5418L061
1059B0505k3713j2018J7946J5783j1925j9106K369J8561L728j7434r276J1445
1071c135J1348o119j3852N33J2870K652r896n295O607Q151l090q231R09O560J036
1086A048m436k717L383L373l010k906K056J738j425k735N48K713j480l148J463
1101e535L965M13m236j227N570M052m238m271L939P773J94p480j367R055N867
$$ plain form
1010 -17557 -48382 -5669 39810 15353 -37627 -34182 20167 36811 -11518 -44196 -9272 35883
1022 35883 19982 -30378 -32552 17149 36839 -3051 -36219 -10248 33076 23957 -21458 -27383
1034 -27383 14026 35753 5087 -27704 -9511 29381 24852 -13116 -22599 9658 32121 8874
1046 8874 -21188 -8656 23716 23492 -6747 -18635 6397 26885 9475 -15340 -7974 17444 20505
1059 20505 -3208 -15226 2720 18503 6578 -12528 -10159 8402 12130 -5304 -14580 -3135
1071 -3135 8213 2094 -11758 -11225 1645 4297 -5599 -10894 -4287 3864 774 -7457 -6548 12 1048
1086 1048 -3388 -6105 -2722 651 -2359 -5265 -3209 -1471 -2896 -5631 -5083 -2370 -3850 -6998 -5535
1101 -5535 -1570 -1157 -5393 -6620 -1050 3002 -1236 -5507 -1568 6205 6399 -1081 -2448 6607 12474
1116A2474o591q411L689J0699o0j1587m924R853Q670p346j2911J731J3316K691
1130A1293j3467q766J0112J3311n269j5657m29J7000P762j3902j3112R390J8088
1143A6354k219j9336m971J8416J2351j4449j9424N886K1466R58k3408j1914J7666
1156b624J7626j2183k4859K007K5697O875k3874j7404J7530K5696p448k8488k067
1169b3516K9195J5195k2256k4167J5301L1498k795l2233j0055K9218K2551k2004
1181E932l1522J0071L4637K768l5589j8141K9137K8686j9482l6330N411L9540
1193A5118J0943l6468k3321K9265L5547j3791m0010j68M3655J7713l5602k9389
1205b6508K4785M0364r233m5134p698M1720K2248l3771l7055J8215M3521m099
$$ plain form
1116 12474 5883 -2528 1161 11860 11800 213 -4711 5142 13812 6466 -6445 -4714 8602 11293
1130 11293 -2174 -10940 -828 12483 7214 -8443 -8872 8128 15890 1988 -11124 -1734 16354
1143 16354 14135 -5201 -10172 8244 20595 6146 -13278 -7392 14074 15032 -8376 -20290 -2624
1156 -2624 15002 2819 -22040 -20033 5664 12539 -11335 -28739 -11209 14487 7039 -21449 -23516
1169 -23516 5679 20874 -1382 -25549 -10248 21250 18455 -13778 -23833 5385 27936 5932
1181 5932 -25590 -15519 19118 21886 -13703 -31844 -2707 25979 6497 -29833 -24422 15118
1193 15118 26061 -10407 -33728 -4463 31084 17293 -22717 -22885 20770 38483 2881 -26508
1205 -26508 -1723 38641 29408 -15726 -23424 18296 40544 6773 -30282 -12067 31454 27355
1217B7355m6669j4671L8709K9024k8858m1412J4047M6621L776m3462k0451L6753
1229G62L5863k3123m2972Q227M6011J0635m1562k6426L2324L7699j8913m4719
1241b6194n16M2686J5177l9606l0895K5935L8146j1774m3412o455M0553K0778
1253B4423l1877l1476J9157L9699j807l8862j0285L5991K5115k2906l2595J1100
1265a4323L7770L963l4666j6105K6653K6767j6496l3656K714L2194Q207k9047
1277f025k1130J9047K7534q957k9773k883K8078J4875k0554k1807J3313K7458
1289A9176n3k4673q441K2339J9080j3318k2545L900K3391N878k1428j5545J3195
1302I56J9385o796k3017n185J8711J1240j6022j9110O262K0628J914j9792j0190
$$ plain form
1217 27355 -19314 -33985 4724 33748 4890 -36522 -22475 24146 27922 -15540 -35991 762
1229 762 36625 13502 -29470 -21243 24768 35403 -6159 -32585 -261 37438 18525 -26194
1241 -26194 -26710 15976 31153 -8453 -39348 -13413 24733 12959 -30453 -36908 3645 24423
1253 24423 -7454 -38930 -19773 19926 18119 -20743 -31028 4963 30078 7172 -25423 -14323
1265 -14323 23447 27410 -7256 -23361 3292 30059 13563 -20093 -17379 14815 23022 -6025
1277 -6025 -27155 -8108 19426 10469 -19304 -22187 5891 20766 212 -21595 -8282 19176
1289 19176 19123 -5550 -13991 8348 27428 14110 -8435 -4535 18856 24734 3306 -12239 956
1302 956 20341 13545 -9472 -14657 4054 15294 -728 -19838 -13576 7052 8966 -10826 -21016
1315b1016J6056J7565p729j9599R60K1138R035j6548j4483J1593K0074k905k1110
1328f969n918J7981J2205j4476j9492N173J9805Q97k0989j0866J5796J6173j0014
1341f94k0583J659K1290P283j7258j2773J4292J9893m343j9156j413K0581J0848
1354A9626j4930j4831R595J8676j660j9443n843J6556J0437j3183j6358M588J6695
1367I925o9j7428o879J3410J1126q309j4059L743J5560K474j2180n499J0756J1216
1381A3787n037j1084K940J1432K186r305o291O288O948m842q606k80N703Q60o806
1396b107m819L234K615k952l840j21L032M66k058Q34K214J77l52J208K478M50
1412D59k091J206M269K71l877j701L854L631m783o812K001O232r33q539l923P443
$$ plain form
1315 -21016 -4960 12605 4876 -14723 -13763 7375 16410 -138 -14621 -3028 17046 14141 -6969
1328 -6969 -12887 5094 17299 2823 -16669 -11496 8309 9206 -11783 -22649 -6853 9320 -694
1341 -694 -21277 -19618 1672 8955 -8303 -21076 -6784 13109 8766 -10390 -11803 8778 19626
1354 19626 4696 -10135 -540 18136 16476 -2967 -8810 7746 18183 5000 -11358 -6770 9925
1367 9925 9856 -7572 -14451 -1041 10085 1776 -12283 -8540 7020 9494 -2686 -8185 2571 13787
1381 13787 8750 -2334 606 12038 14224 4919 -1372 4916 11864 7022 -1584 -1864 3839 4699 -2107
1396 -2107 -6926 -3692 -1077 -4029 -7869 -7990 -4958 -4492 -6550 -5716 -3502 -3325 -3677 -2469 9 459
1412 459 -1632 -426 3843 4114 237 -1464 2390 6021 1238 -5574 -3573 2659 1726 -6813 -10736 -3293
1428c293O014o851r004L177J0802J887j0875m915J1474J0068n430j1013L082J5169
1442A0292L983j3206p279J0902J2775n551j5924P8J6113M858j4968j2310Q668
1455a569J5407n146j8835k689J6696Q946j3667j4955Q683J8645j255j8459n438
1468a3636J7441J3708j1654j7126O158K0195K636j9014j0597J5132J5979r831
1480I391k0761N5J9711O976j8708j5865J1365J8567m878k2239m974K0138J2849
1493A1627j5073j8596Q187K2799J998k1458r447J9129J8005j1017k1869L175K4566
1506A2026P263k1785j5750J5412K1598p461k5768l420K3965J2370k0302k1072
1518b2924J1726K5864j694k7009q894K4222J9250j6111k4973P695K9554N552k6865
$$ plain form
1428 -3293 2721 -4130 -13134 -9957 845 2732 -8143 -13058 -1584 8484 3054 -7959 -4877 10292
1442 10292 14275 1069 -6210 4692 17467 11916 -4008 -3930 12183 17041 2073 -10237 -1569
1455 -1569 13838 8692 -10143 -12832 3864 12810 -857 -15812 -7129 11516 10261 -8198 -13636
1468 -13636 3805 17513 5859 -11267 -5109 15086 17722 -1292 -11889 3243 19222 9391
1480 9391 -11370 -11315 8396 15372 -3336 -19201 -7836 10731 5853 -16386 -21360 -1222 11627
1493 11627 -3446 -22042 -13855 8944 10942 -10516 -19963 -834 17171 6154 -15715 -12540 12026
1506 12026 19289 -2496 -18246 -2834 18764 11303 -14465 -17885 6080 18450 -1852 -22924
1518 -22924 -11198 14666 12972 -14037 -22931 1291 20541 4430 -20543 -12848 16706 22258 -4607
1531d607j5066K2485K4781j2192k9552J161L0630J0785k7083k1557J8024K8281
1543B6090q370l3024n009L0212J5548k5114k6082J4860L2099l418l3594r172K9993
1556E019K0980k1731k9581J1916L4142J510l2889j3959K7917K4942j9372l2221
1568b3327O707L3748N973l2182j9094K4763K7150j5060l3230J204L3200J0642
1580B0494k9855k1603K1276K9390r096l2327k512L2219J4368k5636k2976J7066
1592i192L0069m844l1285n606K8993J6255k1591k4363J2344K8737k547k8955q183
1605b0168K4607J7721j7604k4034Q876K6548O67k4763j0273K0710J8401j3460
1617G228k1733N645K3142M160k0734j1569J6472J6812r659j9438J569J9296N628
$$ plain form
1531 -4607 -19673 2812 27593 15401 -14151 -12990 17640 28425 1342 -20215 -2191 26090
1543 26090 17720 -15304 -20313 9899 25447 333 -25749 -10889 21210 17792 -15802 -24974 5019
1556 5019 25999 4268 -25313 -13397 20745 22255 -10634 -24593 3324 28266 8894 -23327
1568 -23327 -16620 17128 23101 -9081 -28175 -3412 23738 8678 -24552 -23348 9852 20494
1580 20494 -9361 -30964 -9688 19702 10606 -21721 -24233 7986 22354 -3282 -26258 -9192
1592 -9192 20877 16033 -15252 -20858 8135 24390 2799 -21564 -9220 19517 16970 -11985 -20168
1605 -20168 4439 22160 4556 -19478 -10602 15946 16613 -8150 -18423 2287 20688 7228
1617 7228 -14505 -8860 14282 18442 -2292 -13861 2611 19423 9764 -9674 -8105 11191 16819
1630A6819j7187j1380J1565J4262n770j7020r81J5539N700j2842r987P727J2526
1643H971l138j3397j485J1388N126q610q416N203R699j770r138j922P256M315
1657D082n379o087K807O124o23n276j608M167K983l107l138J286K951M6k094m50
1673c316K075Q79j129k69R47N53o48l07J177M93j309l22J934J448j138k215R84
1690a63L177q8k986q10L319K818k305l621J592M666K60m586k473M123M065k786
1706D202n372M72N895J632n756m536L742N627j728p320j384O769M107n371o818
1721e839K918Q092K83q386l869O981O925m570r107J143J0041K637r341p275O217
1736c150R787l269j1753j950J0807O280r302j0655N325J2608l28j3453n274J2269
$$ plain form
1630 16819 -368 -11748 -183 14079 8309 -8711 -9692 5847 11547 -1295 -11282 -3555 8971
1643 8971 5833 -7564 -9049 2339 7465 -1145 -9561 -4358 5341 3571 -5567 -7489 -233 4082
1657 4082 -1297 -7384 -4577 1547 924 -4352 -5960 -1793 1190 -1917 -5055 -3769 -818 -772 -2866 -3316
1673 -3316 -1241 -362 -1491 -1760 -813 -260 -908 -1215 -38 455 -854 -1176 758 2206 1068 -1147 -163
1690 -163 3014 2926 -60 -870 2449 5267 2962 -659 933 5599 5859 1273 -1200 2923 6988 4202
1706 4202 -1170 -698 5197 6829 1073 -3463 279 5906 4178 -3142 -4526 2243 6350 979 -5839
1721 -5839 -2921 5171 5454 -2932 -6801 180 7105 2535 -6572 -5429 4612 7249 -2092 -9367 -3150
1736 -3150 6637 3368 -8385 -10335 472 6752 -2550 -13205 -7880 4728 4400 -9053 -14327 -2058
1750b058J0653q120j3311L453J5895L647j4736q923J2460J4295o310j6968j91
1763a0214J8259P361j5851j3140J0486J7476l991k0448l687J9319J0658j5239
1775I89j6938Q944K1359j204k1924o480J9839J4823j3835k0021P576K3898J795
1788A8821k2602j0169J8859J8044j3054k3144L968K3911N012k2815j4746J6814
1800a101K0347j0485k4695l46K3669R314k1517j7521J4947K2692n631k4469l878
1813a8674K3759J3022j8570j8911J1180K3747j477k4249p208K1402J4609j5430
1825C200k1130O494K2915J034k2720r994J7510J6437j1273k1370K873K1877N477
1838A1330j8788j2277J3951J8771n723j9413o62J9500R862j4275j4773R178J8595
$$ plain form
1750 -2058 8595 475 -12836 -9383 6512 10159 -4577 -13500 -1040 13255 6945 -10023 -10214
1763 -10214 8045 15406 -445 -13585 -3099 14377 10386 -10062 -13749 5570 16228 989
1775 989 -15949 -7005 14354 13150 -8774 -15254 4585 19408 5573 -14448 -6872 17026 18821
1788 18821 -3781 -13950 4909 22953 9899 -13245 -9277 14634 19646 -3169 -17915 -1101
1800 -1101 19246 8761 -15934 -16280 7389 16703 -4814 -22335 -7388 15304 9673 -14796 -18674
1813 -18674 5085 18107 -463 -19374 -8194 15553 14076 -10173 -17381 4021 18630 3200
1825 3200 -17930 -11436 11479 12513 -10207 -20201 -2691 13746 2473 -18897 -16024 5853 11330
1838 11330 -7458 -19735 -5784 12987 7264 -12149 -12811 6689 16551 2276 -12497 -3319 15276
1851A5276j221j7926o084J5234J2134j0759j6534L290J6540L098j6082j0227J1181
1864b080J4085n701j6006j118J5444P777j2142j1821P652J5665l87j4691n145
1877h468J3450J1098q441j4288K231J5287L540j4593j0137R462J3141m990j6437
1890i145l125J4503P453j2541j3633O313J5943Kj6286o091J4241J2200q630j5318
1904a4114L645J7509M046j5046r246J2507J4601o431j6707l71J6465N985j4594
1917a751j2362R213J4941m188j7230k973J5571Q443j2636j3090P316J6318p32
1930F840j5599l925J5062J0858r312j3236N551J6189J260j4396n960J2265J0842
1943A6439q053j3725K819J3369J593j3554p681R115R799o483j2508J143J1639
$$ plain form
1851 15276 14055 -3871 -9955 5279 17413 6654 -9880 -6590 9950 13048 -3034 -13261 -2080
1864 -2080 12005 6304 -9702 -10820 4624 12401 259 -11562 -3910 11755 11368 -3323 -8468
1877 -8468 4982 16080 7639 -6649 -4418 10869 14409 -184 -10321 -859 12282 7292 -9145
1890 -9145 -12270 2233 9686 -2855 -16488 -10175 5768 5770 -10516 -16607 -2366 9834 1204 -14114
1904 -14114 -10469 7040 11086 -3960 -13206 -699 13902 7471 -9236 -9607 6858 12843 -1751
1917 -1751 -14113 -4900 10041 5853 -11377 -14350 1221 9664 -2972 -16062 -8746 7572 6840
1930 6840 -8759 -12684 2378 13236 3924 -9312 -3761 12428 13688 -708 -6668 5597 16439
1943 16439 8386 -5339 -2520 10849 12442 -1112 -8793 322 10121 3638 -8870 -7727 3912
1956C912L178j0530o691Q048R281l891r322P93J0236L596p803n052O137O923k730
1971F085p972j61P014J607o519m298L326M150k902o249Q7M172M1m203k143K981
1987d984K614k118k272K321K890k64k129R36L808O44k580L79L479J447k679k437
2003i45K829L047k798m364N48M165M37n762k821M909L614m143n633J774P191O94
2019B742o852k270P211O140l819p021K833R471J338q401l945P475P627m919r736
2034b126J335R615J782j0262p065O938Q502n017j1480l47J0818M105j0125q297
2048a1624P150J1034k825j1668j605J2219P102r137r305N820J2431o30j2840m350
2062h228J1219Q376q478j2255K670J3112J380j3473p675R488J0702o139j4138
$$ plain form
1956 3912 7090 -3440 -10131 -2083 7198 3307 -6015 -5222 5014 8610 807 -4245 1892 8815 6085
1971 6085 -1887 -2048 4966 6573 54 -4244 -918 3232 330 -5919 -5832 -1660 -1619 -5822 -7965 -4984
1987 -4984 -2370 -4488 -6760 -4439 -1549 -1813 -3942 -3006 802 1446 -1134 -755 2724 4171 1492 -945
2003 -945 1884 4931 2133 -2231 -1683 2482 2919 -2843 -5664 -755 2859 -1284 -6917 -5143 2048 2742
2019 2742 -4110 -6380 831 6971 3152 -3869 -1036 8435 9773 1372 -2573 4902 12529 7610 -2126
2034 -2126 -791 8824 10606 344 -6721 217 8719 3702 -7778 -8125 2693 6798 -3327 -11624
2048 -11624 -4474 6560 3735 -7933 -9538 2681 9783 646 -8659 -2839 9592 8962 -3878 -8228
2062 -8228 2991 11367 2889 -9366 -6696 6416 7796 -5677 -13352 -3864 6838 699 -13439
2075a3439K57J4232N456j1743r856Q480J4272k134j4387k400J4406R394r906j2519
2089i887N903J5755Q42j5377o914J2714J1529q662j5743K000J6201L874j5373
2102c138j0596J0975J4707n583j7530j040J7254Q491j3812j3240R579J8039j710
2115A2396j8442m733J7236J2262j2495j7094O192J9880J024j9805r331J5495J4947
2128A7532j1324k0294K548K0396M574j9493j2896J4604J8193q283k1089k38K1381
2141E611Q636j8051j4919J3203K0334m857k1537l037K1097J0909j6942j7222R950
2154f825K0785k288k2212o150J9452J2804j4952j9008P006K1348M43k1102q267
2167a8966J7842J5239j1311j9136N228K1204L303j8556j0056J5673J6421q850
$$ plain form
2075 -13439 -13182 1050 6506 -5237 -15093 -6613 7659 5525 -8862 -11262 3144 12538 2632 -9887
2089 -9887 -3984 11771 12613 -2764 -9678 3036 14565 5903 -9840 -7840 8361 12235 -3138
2102 -3138 -13734 -2759 11948 6365 -11165 -12205 5049 13540 -272 -13512 -3933 14106 12396
2115 12396 -6046 -10779 6457 18719 6224 -10870 -4678 15202 16226 -3579 -12910 2585 17532
2128 17532 6208 -14086 -11538 8858 13432 -6061 -18957 -4353 13840 5557 -15532 -15770 5611
2141 5611 14247 -3804 -18723 -5520 14814 9957 -11580 -14617 6480 17389 447 -16775 -6825
2154 -6825 13960 11672 -10540 -16690 2762 15566 614 -18394 -11388 9960 10403 -10699 -18966
2167 -18966 -1124 14115 2804 -16332 -11104 10100 13403 -5153 -15209 464 16885 8035
2179H035j8636K515J9197N175j6959j1456J2271J5312o990j7510k90J6626O288
2192A3578j4603j1422R681J3956l832j5278j948J4483P095j0978j0361O913J2867
2205A0151j380j2921k814J1065O974p755r751L677J0566j24j0264m139P212O148
2219F645n135q455J363P877J219p046m018M688N568k604o020L56N371K227l808
2234a772l138K514M204n23l363r81K580K198j446k479K78J891J048j296j839L21
2250a803J569O88j299j794M83K215P71j500j448J342K464K52k598p59K464K340
2266C387j063k790L16L326J307k636k450J615L201m68l790r72L052K222k104l553
2282a400R45L513M75l538k162K589K880j243l492k92L391J675k714k790J124L128
$$ plain form
2179 8035 -10601 -8086 11111 16286 -673 -12129 142 15454 8464 -9046 -9336 7290 13578
2192 13578 -1025 -12447 -2766 11190 7358 -7920 -9868 4615 11710 732 -9629 -2716 10151
2205 10151 8771 -4150 -6964 4101 11075 3320 -6431 -2754 7812 7688 -2576 -6715 497 6645
2219 6645 1510 -6945 -5582 2295 3514 -3532 -7550 -2862 2706 102 -5918 -5562 -191 2036 -1772
2234 -1772 -4910 -2396 1808 1285 -2078 -3059 -479 1719 273 -2206 -1928 -37 1011 -285 -2124 -1803
2250 -1803 -234 454 -845 -2639 -2156 59 830 -670 -2118 -776 1688 1940 -658 -1417 1047 3387
2266 3387 2324 -466 -150 3176 4483 1847 -603 1012 4213 3745 -45 -1017 2035 4257 2153 -1400
2282 -1400 -455 3058 3533 -5 -2167 422 3302 2059 -1433 -1725 1666 3341 627 -2163 -1039 2089
2298B089J15l216j834K425K506j168l273o00K914J714k427k954O08L506P55l281
2314b121k215K201L603q09m094j154L780K924k766m064Q73N106J289m895l277
2329e619L811M996j470o214q06O551L467m844n348K947P528m3p815k703P106N853
2345G397m382q144J832R610J592q747n415O897Q472m082j0606K43J0626L994r135
2360A52q196O611J0715k758j1980j811J1285O538r132r994N880J2306j053j2784
2374d221m088J1467Q302q810j1708M015J3123R35j3345o398J0719R881p170j3375
2388a0673J495J3972L435j3069q133R506J2059m681j4058l95J4139N718j1402
2401b087r982P796J3508k377j4120k680J2832P733r770j1908N398J3466m02j3459
$$ plain form
2298 2089 2204 -1012 -2846 -421 2085 917 -2356 -2956 -42 1672 -755 -3709 -3101 405 1160 -2121
2314 -2121 -4336 -2135 1468 659 -3435 -4589 -809 2115 -651 -4715 -3842 1264 2553 -2342 -5619
2329 -5619 -1808 3188 1718 -4496 -5302 1249 4716 -128 -5476 -2529 4999 4956 -2859 -5562 1544 7397
2345 7397 3015 -5129 -3297 6313 7905 -842 -6257 640 9112 5030 -5576 -5333 5293 9287 152
2360 152 -8044 -1433 9282 6524 -5456 -7267 4018 10556 1424 -8570 -2690 9616 8563 -4221
2374 -4221 -8309 3158 11460 2650 -9058 -5043 8080 9015 -4330 -10728 -9 9872 2702 -10673
2388 -10673 -9178 4794 8229 -4840 -12973 -3467 8592 3911 -10147 -10542 3597 9315 -2087
2401 -2087 -12069 -4273 9235 6858 -7262 -9942 2890 10623 853 -11055 -5657 7809 7407 -6052
2415f052n069J1082R482p655j2448K902J3102K657j1683p085R461J1204m625j2239
2429f966K07J2605N583j0075r186O804J1892j517j2318l399J0975P575q369j1166
2443g355L152J1961J265j2071o319R208R424n314j1819L72J1938M122r989p927
2457i352O853J1318k170j1717k162J1120O618q294j0015M015J1749J59j2001n229
2471i108R336Q692o714j1835J292J1860K737j1339p795Q177J0839l839j2265p31
2485a0693J2476N912r776r317O982J2387j378j2372k795J1902P772q357j1035
2498h292M344J2370J13j2717n135J0181Q748p265j1719K541J2208J888j1469o196
2512a0400R121R879n210j1244J655J2317L784j0017o840P970J0269l952j0732
$$ plain form
2415 -6052 -11121 -39 9443 1788 -10660 -7758 5344 8001 -3682 -10767 -1306 9898 5273 -6966
2429 -6966 -6759 5846 11429 1354 -7832 -1028 10864 9347 -2971 -6370 4605 12180 3811 -7355
2443 -7355 -4203 7758 9023 -3048 -9367 -159 9265 3951 -7868 -7496 4442 8564 -1425 -9352
2457 -9352 -2499 8819 6649 -5068 -7230 3890 10508 2214 -7801 -3786 7963 8122 -3879 -9108
2471 -9108 228 8920 2206 -9629 -8337 3523 6260 -5079 -12874 -4697 6142 2303 -9962 -10693
2485 -10693 1783 7695 -2081 -11398 -4416 7971 6593 -5779 -8574 3328 11100 2743 -8292
2498 -8292 -3948 8422 8535 -4182 -9317 864 9612 2347 -9372 -6831 5377 7265 -4204 -10400
2512 -10400 -1279 8600 3390 -7854 -6199 6118 9902 -115 -6955 1015 11284 7332 -3400
2525c400l20J0909M288r495p651O046Q789k944j0835j626R148M048p965p294M639
2540c663Q318j819r000j413Q374M169n926n804M071P755j029p146r43O573L479
2555E996m955n158L075N539j660n932r76M756J892m684l818K527L511j504m374
2570e765J94M248P95l353j104L260K655j646k546J987L780j51k984M51L494J460
2586D775l300k033K894K604k496l892R11L787k16m756j570L979K486l605m296
2601d728K204N475n22n392p26N745L724m157m716L336O661p44o368j619O412M062
2617H647n372o224K762O760p63q430l102O481M530n626p407K176Q104L61q431
2632e534l659P248O284m361p883J929R330K097p977m337O467P727l469q895P6
$$ plain form
2525 -3400 -3720 7189 11477 1982 -5669 377 9166 6222 -4613 -6239 2909 6957 -1008 -8302 -3663
2540 -3663 4655 2836 -6164 -7577 797 4966 -960 -6764 -2693 5062 4033 -3113 -4056 2517 5996
2555 5996 1041 -4117 -1042 4497 2837 -3095 -4071 685 2577 -2107 -5925 -3398 113 -1391 -5765
2570 -5765 -5571 -1323 -528 -3881 -4985 -1725 930 -716 -3262 -1275 2505 2354 -630 -179 3315 4775
2586 4775 1475 -558 2336 4940 2444 -1448 -537 3250 3034 -1722 -3292 687 3173 -432 -4728
2601 -4728 -2524 2951 2429 -2963 -3689 2056 5780 1623 -3093 243 6904 6160 -208 -1827 4585 8647
2617 8647 3275 -2949 -187 6573 5810 -2620 -5722 759 5289 -337 -7744 -5568 2536 2897 -5534
2632 -5534 -9193 -1945 4339 -22 -7905 -5976 3354 5451 -2526 -6863 -396 7331 3862 -5033 -4957
2647d957Q884L370p954o750N072Q233k430r803k032Q475M984p059q144L809R870
2662C568L15r434l733Q756P776n038r118K153J0893L093r238n922P464R420l512
2677G443j0875q53J0380M602r115q657N327J0306j768j1744l245J0010O888p813
2691H86j0271L968J1728J041j1238n083R900R674n954j1425J750J2753L366j1431
2705c36p812Q624J1118m775j3137j272J2496N133j1407j0410O763J2385k754j3872
2719i256l127J2626P650r807j1398N545J3758K65j3344m493J2147R686p641j2243
2733i632L531J4056J624j2992o468J0205J0508o620j3110J556J2908L098j1961
2746c297q263Q679J1008m559j2494k57J2472N444j0147q506P303J1621k110j1634
$$ plain form
2647 -4957 3927 7297 -657 -7407 -2335 5898 3468 -6335 -8367 108 5092 -1967 -10111 -6302 3568
2662 3568 3883 -5551 -9284 -528 7248 2210 -6908 -4755 6138 9231 -7 -5929 1535 10955 7443
2677 7443 -3432 -4285 6095 10697 1582 -7075 -1748 8558 6790 -4954 -8199 1811 8699 886
2691 886 -9385 -5417 6311 7352 -3886 -8969 931 10605 4651 -6774 -5024 7729 11095 -336
2705 -336 -8148 476 11594 6819 -6318 -7590 4906 10039 -1368 -11778 -5015 7370 4616 -9256
2719 -9256 -12383 243 7893 -1914 -13312 -7767 5991 6256 -7088 -11581 566 10252 2611 -9632
2733 -9632 -6101 7955 9579 -3413 -9881 324 10832 4212 -8898 -7342 5566 8664 -3297
2746 -3297 -11560 -2881 8127 3568 -8926 -9183 3289 8733 -1414 -9920 -2617 9004 6894 -4740
2760d740j893J1436O657q409q778M835J0631o82j0864l635Q925O455o830q997
2774e889K420R401N38r423m324O834O405m176q176J123Q411J998o619m505M971
2789a011O535k097o970k43O466L010m823n074K891N563q25n756k256L957L583
2804B950l333m856P55M491R13l962k801K565L858q24l676o67L594K605k108k685
2820c181J417L426P68k530j952K183K772o38k953p64K587J912j976k826M96K754
2836A495O25k836j910J987K784p10k891l53L070J836j957k392J219L246M75k792
2852H96j451K596K540j360l127q0K988Q01k842k199J351K659p52l155q50K321
2868C36J463j930k668Q20K534K68k334j238J927J823r03k001J07J905Q34j470
$$ plain form
2760 -4740 -6633 4803 11460 3051 -5727 -892 9739 9057 -1807 -5442 3483 9938 3108 -5889
2774 -5889 -3469 5932 6470 -2953 -7277 -443 5962 1786 -6390 -5267 3144 5142 -1477 -5982 -1011
2789 -1011 5524 3427 -3543 -3786 2680 5690 867 -4207 -1316 4247 3422 -2334 -4590 -633 2950
2804 2950 -383 -5239 -4484 7 920 -3042 -5843 -3278 580 -244 -3920 -4587 -993 1612 -496 -3181
2820 -3181 -1764 1662 2430 -100 -2052 131 2903 2265 -688 -1452 1135 3047 1071 -1755 -1259 1495
2836 1495 2120 -716 -2626 -639 2145 1435 -1456 -1809 1261 3097 1140 -1252 -33 3213 3688 896
2852 896 -555 2041 4581 3221 94 14 3002 3803 961 -1238 113 2772 2020 -1135 -1985 336
2868 336 1799 -131 -2799 -1979 555 823 -1511 -2749 -822 1001 98 -1903 -1796 109 943 -527
2884e27j357R09J481k4j551o92P90Q69n17j260l08Q12Q92n17j036k24J015J042
2902b03n36j315R8J772Q65j055j433R30K432K23k193j016J857K418j086k944J60
2919a026L235J395k849k717J970L828q75m270j016M162K815l290m261J963N293
2934D357J36n408k474M915M196l515n738J411O343J208o249l908N097N526l079
2949B818p100J34P360K370o720n102M675O909k063q267r87P735L864o468o410
2964g252L919Q151r65q803k275P835N153n936p697K873R134L56r001l637P510
2979f35O917m919q897J799R522K142q632n241O826Q228l613r229J8R322L927q013
2995d78o868N560Q763j948r426j794Q950N159o842p818L744R103K32r169l563
$$ plain form
2884 -527 -1884 -975 506 482 -1069 -1761 -971 -102 -619 -1879 -2187 -1375 -483 -1000 -2036 -2260 -1245 -203
2902 -203 -739 -2054 -1956 -184 681 -374 -1807 -877 1555 1778 -415 -1431 426 2844 1758 -1186 -1026
2919 -1026 2209 3604 755 -1962 8 3836 2961 -1309 -2325 1837 4652 1362 -2899 -936 4357
2934 4357 4493 -915 -3389 1526 5722 2207 -3531 -2120 4223 5431 -818 -4726 371 5897 2818
2949 2818 -4282 -4148 3212 5582 -1138 -6240 -1565 5344 3281 -4986 -5973 1762 5626 -842 -7252
2964 -7252 -3333 4818 3853 -4950 -7225 610 5763 -173 -7870 -4997 4137 4493 -4508 -8145 -635
2979 -635 6282 1363 -7534 -5735 3787 5929 -2703 -7944 -1118 7110 3497 -5732 -5714 3608 7535 -478
2995 -478 -7346 -1786 6977 5029 -4397 -6191 2759 7918 1076 -6742 -2998 6105 6337 -2832 -6395
3010f395P994O674n035q388J533R429J981q397n318O374P928l177r276n81Q913
3025D259L861p662p340M513Q957j386r562k840Q279N953o187q511K629R574R30
3040E467r103m569P384P654m131r175N35R619L200q342o477N729Q751k469r737
3055e664j553R178M958p511q206M071R753o54j0202l290Q867O830o133r064K986
3070e634J0467J259r505m747Q265Q237m666r609J333J0600K701r245o102O758
3084A12Q687l667j0141k49R621M003q669p083N505Q770k223r770j349R114M653
3099G314o938o991M539Q891q65q925k087Q163N148n945o977L219Q099m92q131
3114a978k946O690M655n151p019K071O982J03p097k989N524M615l993n696J629
$$ plain form
3010 -6395 1599 8273 3238 -5150 -3617 5812 7793 -604 -5922 452 8380 5203 -4073 -4654 4259
3025 4259 8120 458 -6882 -2369 6588 5202 -4360 -7200 1079 7032 845 -7666 -5037 4537 5467
3040 5467 -3636 -8205 -821 6833 2702 -6473 -5938 3681 6881 -1461 -7938 -2209 6542 4073 -5664
3055 -5664 -7217 1961 6919 -592 -8798 -4727 5026 4372 -5830 -9120 -253 6577 444 -8620 -5634
3070 -5634 4833 6092 -3413 -8160 105 8342 3676 -5933 -4600 6000 8701 -544 -6646 112
3084 112 8799 5132 -5009 -5258 4363 8366 -303 -7386 -1881 6889 4666 -5104 -6453 2661 7314
3099 7314 376 -6615 -2076 6815 5950 -2975 -5062 3101 8249 2304 -4673 -1454 6645 6153 -1978
3114 -1978 -4924 1766 6421 1270 -5749 -3678 3304 3407 -3690 -6679 -1155 3460 -533 -6229 -4600
3129d600O133P59n339k301M812M104k844m361J425M862M19m289j775L457K655
3144C117k519l243R77L303l44l587r08K311J501k004k203J499K429o54k165N32
3160a958K370P49j743o22K400J507j266j284J419K097n66k453J18K399L49k537
3176I79j616J836K028j995l058O65K918J61l563j646L073K550k111l310J226M254
3192B391N31l730j750L639L417k222m168J003M699O86m600k796L423L633k540
3207A616n398J87M846J107m860l531L241M647j930n370l48N326K721m072m085
3222e903L219N758n58n356j268N659L626l819n044J952N916M17n871k885M599
3237D42M278l239o057M55O008J638n669m062M030N873j560o364n09O423L616m733
$$ plain form
3129 -4600 1533 2292 -3047 -5348 -536 3568 724 -3637 -2212 2650 3069 -1220 -2995 462 3117
3144 3117 598 -2645 -1668 1635 1291 -2296 -3204 -893 608 -1396 -3599 -2100 329 -325 -2490 -1958
3160 -1958 412 1161 -582 -1204 1196 2703 1437 153 1572 3669 3103 650 768 3167 3516 979
3176 979 -637 1199 3227 1232 -1826 -1161 1757 1918 -1645 -3291 -218 2332 221 -3089 -1863 2391
3192 2391 2922 -808 -2558 1081 4498 2276 -1892 -889 3810 4496 -104 -2900 523 4156 1616
3207 1616 -3782 -3595 1251 2358 -2502 -6033 -2792 1855 -75 -5445 -5793 -467 2254 -1818 -5903
3222 -5903 -2684 3074 2516 -2840 -4108 1551 5177 1358 -3686 -1734 4182 4599 -1272 -4157 442
3237 442 4720 1481 -4576 -4121 1887 3525 -2144 -6206 -2176 3697 2137 -4227 -4736 1687 5303 570
3253E70m995L291O955M9o572k283O201M998m191o840J317P116J184p287m444N173
3269B42N878l261p654m41P411K762o616n645M380P396j136p998j558P822M876
3284F458n526o650L115Q401J96q251l280P046N999n012q346J570Q484J242q611
3299c165n069O140P034l731r125L37Q798L161p552o074N691Q506k076q588o57
3314f370Q765M825o514p014M444Q806p95q731k592P750N443n836p832K599Q221
3329E169M18q602l899O614O292m465p661J323Q424K026p468m346N898O873k482
3344D114p708L31P942L011o058n216L962O833j641p435j533O154L661n200o007
3359d790K364O146m90o485k625M976M228l333n538J340N633J506m759l270L945
$$ plain form
3253 570 -4425 -1134 5821 5870 -702 -2985 3216 8214 4023 -2817 -1500 5616 6800 -487 -4931 242
3269 242 6120 2859 -4795 -5236 2175 4937 -1679 -7324 -2944 4452 3316 -4682 -6240 1582 6458
3284 6458 932 -5718 -2603 5798 5994 -2257 -5537 1509 7508 2496 -5850 -4280 4204 5446 -3165
3299 -3165 -8234 -2094 4940 1209 -7916 -7579 1219 4380 -3172 -9246 -3555 4951 2875 -5713 -6370
3314 -6370 2395 7220 706 -6308 -1864 6942 6147 -2584 -5176 2574 8017 2181 -5651 -3052 5169
3329 5169 5587 -3015 -6914 -300 5992 1527 -6134 -4811 3613 5639 -1829 -6175 -277 6596 4114
3344 4114 -3594 -3263 4679 7690 1632 -3584 378 7211 5570 -1865 -3398 2756 6417 1217 -4790
3359 -4790 -2426 3720 3230 -3255 -5880 -904 3324 -9 -5547 -4207 1426 2932 -1827 -5097 -1152
3374a152M802j713m833q7M719K264l519l729K029M288l59m615k049L552K801k611
3390b12m127N89L914J203l803k575K636L560p37l667m82L922K463k223k867J425
3406i81L747P72l347j706K706K889j226l471r2L141J380l037k779J371L336n99
3422B104l643j161L108K242k105l032R97L622N50l107j639K798K909j387l183
3437i27L83L440J034k995k294K052K535j114l426n39K769J193k473k612J294K442
3453G62o38k765o63K226J575j699j914J038K411k2j986m01J726J385j070j330
3469a365O43J503L7j401l97Q58N47q05q94M15M73k20n69J59L72j19l03L46M63
3488b57j85n30O38J125J44r95j36J532Q75j048j334J139J780l01k295l62K205
$$ plain form
3374 -1152 3650 1937 -2896 -2983 1736 4000 481 -3248 -1219 3069 2710 -1905 -3954 -402 2399 -212
3390 -212 -4339 -3750 164 1367 -2436 -5011 -2375 1185 448 -3219 -3701 221 2684 461 -2406 -981
3406 -981 2766 3538 191 -1515 1191 4080 2854 -617 -709 2432 3812 775 -2004 -633 2703 2104
3422 2104 -1539 -2700 408 2650 545 -2487 -1490 2132 2682 -425 -2064 734 3643 2256 -927
3437 -927 -544 2896 3930 935 -1359 693 3228 2114 -1312 -1851 918 2111 -362 -2974 -1680 762
3453 762 124 -2641 -3304 -1078 497 -1202 -3116 -2078 333 311 -1675 -2076 -350 1035 -35 -1365
3469 -1365 -722 781 818 -583 -980 -122 425 -380 -1274 -859 -386 -606 -1175 -1016 -644 -763 -1066 -720 -257
3488 -257 -442 -972 -334 791 935 -60 -196 1336 2211 1163 -171 968 2748 2447 152 -210 1995
3505A995J249k103k366J256K757n45l449q88L180K151k808l153J528M069l33m133
3521a593j504M179K854l053m019J516M982K04n071k254M388L626l212n202J098
3536c061N691P49n628k978M216M835k990o121N37O285J848n619l982M306N788
3551C876k073o570j32O425L003n372m995L696O525j242o710j325O436L889n191
3566B40n763K896O844P3p028k641O270N029m275o460J766P251J230o823l585N430
3582D54N845k966o918K42P270K266o108m853M129O681j631p312j085O707L695
3597F416n354n906K898O887l01o964k608N936M914m100o602J363P081J318o856
3612a878m109N130O074l024p121r2P150K774o258n369L990O926j401p397j652
$$ plain form
3505 1995 3244 1141 -1225 31 2788 2243 -1206 -2094 1086 3237 429 -2724 -1196 2873 2540 -1593
3521 -1593 -3097 1082 3936 883 -3136 -1620 3362 3566 -1505 -3759 629 4255 1043 -4159 -3061
3536 -3061 2630 3379 -2249 -5227 -1011 3824 834 -5287 -4750 1535 3383 -2236 -6218 -1912 3876
3551 3876 1803 -4767 -4899 1526 4529 -843 -5838 -2142 4383 3141 -3569 -4894 1542 5431 240
3566 240 -5523 -2627 4217 4290 -2738 -5379 891 5920 1645 -4815 -3049 4202 5432 -1391 -4976 454
3582 454 6299 3333 -3585 -3343 3927 6193 85 -4768 -639 6042 4411 -2901 -3986 2721 6416
3597 6416 1062 -4844 -1946 4941 4640 -2324 -4932 1004 5918 1818 -4784 -3421 3660 4978 -1878
3612 -1878 -5987 -857 5217 2193 -4928 -5020 2130 4904 -1354 -6723 -2733 4193 2792 -4605 -6257
3627f257P001M386n208o334K762P590J40p474l049O334N564m110p073J463P627
3642C362J443o972m271N441O291k973p394J45P557K759o319n078M615O887j804
3657C689p297r18P390L831n686n697L647P098q82p268j972O612M162m835o120
3672d246K304O874J64o952k702N568M482l862o104J505O368R53n966l068M651
3687c1M953k978n549P15N776J428n062l214L700M400k036n245l3M762J538m340
3703a216l217K843L769j475m355k59L900J642l315k738K160L447o25l234k30L184
3719B81J554k176j929J458K619k86k468k23K091J074j603j474J043J314o65j479
3735h69k06J361L59j202m69R06O95n45o69O00R40j97o07L75J230m2q40L7J008
$$ plain form
3627 -6257 744 5130 -78 -6412 -3650 3940 4080 -3394 -6443 -109 5455 1345 -5728 -4265 3362
3642 3362 4805 -2167 -6438 -997 5294 2321 -5073 -4928 2629 5388 -931 -6009 -1394 5493 3689
3657 3689 -3608 -4526 2864 6695 1009 -4688 -1041 6057 5175 -2093 -4065 2547 6709 1874 -4246
3672 -4246 -1942 4932 5096 -1856 -4558 1010 5492 1630 -4474 -2969 3399 4352 -1614 -4682 -31
3687 -31 4922 1944 -3605 -2890 2886 4314 -748 -3962 -262 4138 2102 -3143 -3176 1586 3124 -1216
3703 -1216 -4433 -1590 2179 704 -3651 -3910 -10 1632 -1683 -4421 -2261 1186 561 -2673 -2903 281
3719 281 1835 -341 -2270 -812 1807 1521 -947 -1170 921 1995 392 -1082 -39 1275 610 -869
3735 -869 -1075 286 645 -557 -1026 -120 575 30 -639 -39 901 704 97 472 1702 1660 820 857 1865
3754A865N95j089p63Q28R62q01j483j1J450O2j936r53J161J201j182k016K56K310
3772D56K37j926j213J862K070j165k191L46K610Q93k333j537J868K417r76k962
3788a544k30K619J097k667k484J603K531n04l403p40K908J803k307k601J062L374
3804E17L80k995j248L046K741j547k803N65L536J130k914j965K070L012q12l628
3820i15m55L134J661k915k965J325L286j66l659j365K875K868j915l432O57M047
3836B066J190l367k292K797L772q88m121m19M070K005l293l568J749M094l54m665
3852a224k046L798K870k802m667O02M660Q43m496k867L506M434j876m852J10N186
3868A179K221m094l691L161N134r52n396j070N040L247m107n111K166N364j72
$$ plain form
3754 1865 2460 1371 608 1436 2398 1597 114 103 1553 1615 -321 -1274 -113 1088 -94 -2110 -1854 456
3772 456 693 -1233 -2446 -584 1486 321 -1870 -1524 1086 1979 -354 -1891 -23 2394 1418 -1544
3788 -1544 -1774 845 1942 -725 -3209 -1606 925 421 -2982 -3722 -814 989 -1318 -3919 -2857 517
3804 517 897 -2098 -3346 -300 2441 894 -1909 -1344 2192 3322 408 -1557 513 3525 2713 -915
3820 -915 -1370 1764 3425 510 -2455 -1130 2156 1990 -1669 -3034 -159 2709 794 -2638 -1981 2066
3836 2066 3256 -111 -2403 394 4166 3278 -843 -1262 2808 4813 1520 -2048 -299 3795 3441 -1224
3852 -1224 -3270 528 3398 596 -4071 -3469 1191 2034 -2462 -5329 -1823 2611 735 -4117 -4007 1179
3868 1179 3400 -694 -4385 -1224 3910 2958 -2438 -3508 1532 4779 672 -4439 -2273 3091 2919
3883B919n928k403M869M049l683n331J319N936J051n532l045M827N053k321n719
3898c939P04O489K091n182l740M115N276j569o066p21N801K760m839m709K526
3913a003N415q80o036j773N046L564l879n018J854N654N07n401k378M673M281
3928D626k572n052R98N551J365m722l230L557M354k005n046n45M727J965m151
3943a80l942K012M315p38m786j595L872K947k718l866J184M323Q89l676k195L226
3959i28L702j388l864J25M042J928l310k890J903L729n23m128j415L313K369k483
3975A82l582P84L827N43l611j983K789L289j336l653K21M098J811k883k538K139
3991I7L720k63l804r68L499K322k607l282J007L752p2l916k033K811K792k188
$$ plain form
3883 2919 -3009 -5412 -543 3506 -177 -5508 -4189 1747 2798 -2734 -5779 -952 4101 1780 -3939
3898 -3939 -3235 3254 5345 163 -3577 538 5814 4245 -1821 -2542 3259 6019 1180 -3529 -1003
3913 -1003 4412 3532 -2504 -4277 769 4333 454 -4564 -2710 2944 3451 -1950 -4328 345 4626
3928 4626 2054 -2998 -2000 3551 4916 194 -3036 521 4875 2870 -2176 -2721 2006 3971 -180
3943 -180 -4122 -2110 2205 1467 -3319 -4914 -1042 1905 -813 -4679 -3495 828 1717 -1959 -4154 -928
3959 -928 2774 1386 -2478 -2353 1689 3617 307 -2583 -680 3049 2526 -1602 -3017 296 2665 182
3975 182 -3400 -2616 1211 1754 -1857 -3840 -1051 2238 902 -2751 -2530 1568 3379 496 -2042 97
3991 97 3817 3554 -250 -1218 2281 4603 1996 -1286 -279 3473 3401 -515 -2548 263 3055 867
4007H67l764N28L769P80l412k337K783L293j377l544J88L802J432l043k208K240
4023cL145r44l527l38L196J225k951k298J414K686q25l196o32K589J294k359k072
4040c596J352K445l38k325k79K328J246j554j236J167K111k69j700kJ773P09j371
4057D61r55R59J130q68j433L20J231k10j225m14J112M81j131o80R18J143o40j068
4075h69O37J724L5j517j65J610J123j510j288J148J876o79k252j76K202P37k400
4092B36j914J635K198j160k994k32L069J160k991k200K079L062j047l558r1L750
4108A002J659l171k605K315L725j019m224m48L948J949l408l418K122M225q86
4123A766m631j095M064K574l355m018J929M521J66m694j633M353L424k855m310
$$ plain form
4007 867 -2897 -2369 1400 2180 -1232 -3569 -786 2507 1130 -2414 -2226 1576 3008 -35 -2243 -3
4023 -3 3142 2198 -1329 -1667 1529 2754 -197 -2495 -1081 1605 780 -2416 -3048 -459 835 -1524 -3596
4040 -3596 -2244 201 -137 -2462 -2741 -413 833 -721 -1957 -790 1321 1052 -648 -650 1123 1832 461
4057 461 -494 465 1595 727 -706 -386 845 635 -590 -1004 108 589 -542 -1222 -304 839 199 -869
4075 -869 -232 1492 1527 10 -155 1455 2578 1068 -220 928 2804 2125 -127 -303 1899 2636 236
4092 236 -1678 -43 2155 995 -1999 -2231 838 1998 -993 -3193 -1114 1948 901 -2657 -2748 1002
4108 1002 2661 -510 -3115 -800 2925 1906 -2318 -2766 1182 3131 -277 -3695 -1573 2652 1766
4123 1766 -2865 -3960 104 2678 -677 -4695 -2766 1755 1921 -2773 -4406 -53 3371 516 -3794
4138c794J301N202Q09m735k412M162L939k264m902N67N066J486m796l304L358
4153c17M658j801n273l99N204K248m160m071K761N154q53n336j173M945L254l496
4169A345m570J762N264K63n090k355M207L986k784n095P37N084J272m779l611
4184d364L501M503j698n258p01N252K356m233m050K475N216o73n283j535M738
4199B46L511l469m712J605N430M39n090k682M210M204k545n188N55N516J448m806
4215a328l426L431M887j731n307m50N281K710m094m311K739N366n96n429j507
4230c765M881L519l560m679J844N368L50n223k354M402L954k776n057J022N295
4245C221J091m850k930L679M389k163n160K62N125J577m296l536L225M233j376
$$ plain form
4138 -3794 -2493 2709 3518 -1217 -3629 533 4472 2208 -2694 -2127 2939 4425 -371 -3675 -317
4153 -317 4341 2540 -2733 -3132 2072 4320 160 -3911 -1150 4004 3151 -2185 -3358 1587 4841 1345
4169 1345 -3225 -1463 3801 4064 -1026 -3381 826 4812 2028 -3067 -2330 2754 4026 -753 -4364
4184 -4364 -863 3640 1942 -3316 -4017 1235 3591 -642 -4692 -2217 2999 2326 -2957 -4492 246
4199 246 3757 288 -4424 -2819 2611 3050 -2040 -4722 -512 3692 1147 -4041 -3486 2030 3478 -1328
4215 -1328 -4754 -1323 3564 1833 -3474 -3924 1357 4067 -27 -4338 -1599 3767 3171 -2258 -3765
4230 -3765 1116 4635 1075 -3604 -1760 3608 3958 -1265 -3619 783 4737 1961 -3096 -2074 3221
4245 3221 4312 -538 -3468 211 4600 2437 -2723 -2461 2664 4241 -55 -3591 -366 3867 2491
4260B491m964n72M579K158l755l774K495M283p37m508j038L957K440l166l379
4275c490J640L968j35l746j359L207K438k372l237J090L308J52l207j305K534
4290e14K124j491k868N98K770N43k558j142J798K044r75j996L63K178O09j756
4306b73r79J265J584p48j358K32J349L57j147n35O92O33m64p26O3N39J96l88k83
4325IM55K2k01K0K39L6k99pO31R5m60j46M77N77m94r02J20J019n7j098n41Q53
4347C48P80j031j270K62J173M9j500q09J237J149q06j414K76J726L93j601q88
4364a926J386J394m90j696J23J858O65j573j282R56J657n83j980k19J781Q08j516
4381f37j495P76J829pj863o28J617J454r07j532L60K107P04j552j075J314J742
$$ plain form
4260 2491 -2473 -3045 1534 3692 -63 -3837 -1342 2941 2204 -2304 -3342 615 3055 -111 -3490
4275 -3490 -1850 2118 1983 -1763 -3122 85 2523 151 -3086 -1996 1312 1464 -1743 -3048 -514
4290 -514 1610 119 -2749 -2151 619 1162 -1396 -2538 -740 1304 329 -1667 -1304 874 1483 -273
4306 -273 -1252 13 1597 849 -509 -277 1072 1429 282 -253 439 1072 608 -118 -55 484 680 292 9
4325 9 464 486 285 305 544 580 281 274 905 1000 540 394 871 1448 954 52 172 1191 1134 36 -505 348
4347 348 1128 97 -1173 -911 262 311 -1189 -1998 -761 388 -418 -1832 -1556 170 563 -1038 -1926
4364 -1926 -540 854 364 -1332 -1209 649 1314 -259 -1541 -585 1072 489 -1491 -1710 71 879 -637
4381 -637 -2132 -1356 473 466 -1397 -2025 -408 1046 139 -1393 -1033 1074 1778 226 -849 465 2207
4398B207m67j606l16J645R63j018j713L05J770J00j858j211J189J490n71j973
4414a064k34J722J164j485j568O52K102L95k065j009J852K044j041k319L1K557
4430A734Q77k333j932J245K568n91l188q69K601J628k199k893Q38L264J1l038
4446b277j588K713K821j635l301N09L881J111l275k161K608L591j040m028j33
4461b204L898J836l511l296K278L862p60m444j113L987K442l222l703J700M483
4476B233l3m297j602M109L285k577l960J311M938O73m364k133L607L596k014m458
4492a686L81M617J092m126l152K624L831j339m693p24M208K071l338l658J950
4507a942M283l20m360j131L960K965k720l630J249M250N69l952k074L310L136
$$ plain form
4398 2207 1740 134 -182 1463 2426 1408 -305 0 1770 1870 12 -1199 -10 1480 909 -1064
4414 -1064 -1298 424 1588 103 -1465 -813 1289 1684 -381 -1390 462 2506 1465 -854 -823 1734
4430 1734 2611 278 -1654 -409 2159 1568 -1620 -2489 112 1740 -459 -3352 -2514 750 761 -2277
4446 -2277 -3865 -1152 1669 34 -3267 -2758 1123 2234 -1041 -3202 -594 2997 1957 -2071 -2204
4461 -2204 1694 3530 19 -3277 -999 2863 2103 -2341 -3454 533 2975 -247 -3950 -2250 2233
4476 2233 2200 -2097 -3699 410 3695 1118 -2842 -1531 3407 4080 -284 -2417 1190 4786 2772 -1686
4492 -1686 -1305 3312 4404 278 -2874 -250 3581 2242 -2451 -3175 1033 3104 -234 -3892 -1942
4507 -1942 2341 2021 -2339 -3470 490 3455 735 -2895 -1646 2604 3173 -779 -2853 457 3593
4522C593k181l866J87L784J073l677k681K356L195j220l933n84L598J990k895
4537a261k767J628L780K4l538j014L167K723j843k950O58L737Q25l276j897K372
4553C68K842j155l660j95L263J368k925k638J545L247m40l624p16L045K063j943
4569D45k834J164L471M39k946j294K552K641j466l097N14L101Q22k830k102J806
4585C86K599j223l211m69K798J178k642k453J661K633n11l113m89K734J685k049
4601d86k206J304K810M4k582p97K490J679j656k324Q45K373M6k471j045J836J487
4618A347j523k176N28K029J48k158q63J694J439p96j779N90J981K26j291m49J366
4635C13J208o90j140P03J363n7j199k74J004K86q44r11N49Q06n57j080KJ037L
$$ plain form
4522 3593 1412 -2454 -2267 1517 2590 -1087 -3768 -1412 1783 563 -3370 -3954 -356 1634 -1261
4537 -1261 -4028 -2400 1380 1404 -2134 -3148 19 2742 899 -2051 -1393 2344 3169 -107 -2004 368
4553 368 3210 2055 -1605 -1800 1463 2831 -94 -2732 -1187 2060 1620 -2004 -2720 325 2388 445
4569 445 -2389 -1225 2246 2685 -261 -1555 997 3638 2172 -925 -411 2690 3512 682 -1420 386
4585 386 2985 1762 -1449 -1918 880 2058 -584 -3037 -1376 1257 746 -2367 -2856 -122 1563 -486
4601 -486 -2692 -1388 1422 1466 -1116 -1913 577 2256 600 -1724 -879 1494 1540 -931 -1976 -140 1347
4618 1347 -176 -2352 -1824 205 353 -1805 -2668 -974 465 -331 -2110 -1520 461 687 -604 -1053 313
4635 313 1521 831 -309 394 1757 1700 501 227 1231 1517 673 -238 311 1117 560 -520 -518 519 522
4654E22j031l17R56O39q36o88Q32J229m19j163K04J480L54j263o86J081J165q39
4672A220j815L87J695J6k147j031J505J353j181k286M11K278Q5k171j186J866
4688a001K104j403k372O67K877N69k514j387K352K432j453k799L10L202P25k997
4704f88k014K332K703j437l356N0L267J099l069k306K215L160q75l495k43L679
4720A022J655k731k627J872L744l02l708p24L485K153k453l246J324L669k6l736
4736f29j568L003K656k256l559O79L792M84l601j995K674L049j460l536J09L770
4752A612J436l195k521K106L458p99l655o10L344K010k763l151J296L501j22l726
4768a779j548K966K627k023l512N57L649Q04l300k117K524L064r92l627j99L801
$$ plain form
4654 522 -509 -826 130 769 -67 -755 77 1306 887 -276 -72 1408 1762 499 -187 894 2059 1220
4672 1220 -595 -208 1487 1503 -644 -1675 -170 1183 2 -2284 -1873 405 490 -1681 -2867 -1001
4688 -1001 1103 -300 -2672 -2005 872 1441 -1073 -2460 -108 2324 871 -1928 -1618 1584 2309 -688
4704 -688 -2702 -370 2333 896 -2460 -2410 857 1956 -1113 -3419 -1204 1956 1081 -2414 -2657 1022
4720 1022 2677 -54 -2681 -809 2935 2633 -1075 -1799 1686 3839 1386 -1860 -536 3133 3107 -629
4736 -629 -2197 806 3462 1206 -2353 -1674 2118 2602 -999 -2994 -320 2729 1269 -2267 -2158 1612
4752 1612 3048 -147 -2668 -562 2896 2097 -1558 -2168 1176 3186 423 -2728 -1432 2069 1947 -1779
4768 -1779 -3327 -361 2266 243 -3269 -2712 937 1741 -1559 -3676 -1152 1912 920 -2707 -2906 895
4784H95J667k836k711J696L700m36l651j044L432K338k501l233J048L872K72l744
4800a236j878L033K927j752l675M68L868J078l318k278K480L410j082l722l62
4815b039L700J935k835l011J859L678m78l814j190L385K354k567l357J183L577
4830B380K78l758j608K938K605k056l329O20L565P09l268j948K614K807j463l452
4846b366J47L350J022k770k180J929K846r04l191l63K881J404k343k198J401K632
4862A297l54k706o51K414J507j645k076Q08K390J49k247p03J737J476j046j888
4878a538M95J805M11j625r47J321J493n61j479qJ363O90r90j129P16J085l2j196
4896a26q0P72O68n25q26J16P64K52p55l30J50P52o1o45l21M31M29k88m85j97N84
$$ plain form
4784 895 2562 -274 -2985 -1289 2411 1975 -1676 -2720 712 3050 549 -2684 -1636 2236 2508 -1236
4800 -1236 -3114 -81 2846 1094 -2581 -2113 1755 2833 -485 -2763 -283 3127 2045 -1677 -2039
4815 -2039 1661 3596 761 -2250 -391 3287 2809 -1005 -2195 1190 3544 977 -2380 -1197 2380
4830 2380 2658 -1100 -2708 230 2835 779 -2550 -1930 1635 2344 -924 -2872 -258 2549 1086 -2366
4846 -2366 -2219 1131 2153 -617 -2797 -868 1978 1074 -2117 -2480 401 1805 -538 -2736 -1335 1297
4862 1297 943 -1763 -2414 0 1507 -138 -2214 -1406 984 1133 -1114 -1817 -80 1396 350 -1538
4878 -1538 -1043 762 1173 -452 -1399 -78 1415 854 -625 -633 730 1420 430 -699 17 1102 1070 -126
4896 -126 -206 566 1234 709 -117 -1 763 1015 260 -70 80 832 771 126 -195 236 665 377 -108 -305 279
4917B79M07m28n40J11N68J70n01n97K25P14r0p44l05N65M91l59p57j78Q36J97
4937F4p76n25L06Q77j58o85l44Q08O10m89q26M00Q24J30o34m24O70P68k84p69
4957d57K1P06L47n24p40L91P82k24o63k01N29M57l17o37J20P22K81l67l67K65
4977A24O78K0l46m52M72P26l5o85k66N39O00m32q79n0Q49K69r70q34L69J073j95
4998E75j050o39R93J040r01j261K24J610L73j476p58J084J553o58j697k46J992
5015G58Q23j769j586J064K089m31k444n05K032J301j840k091Q76K569j01k623
5031a878r47K310J934j405k475O45K987O81k741j412K288K644j285l011L07L140
5047A782J053k840k224K070K913j111l356l64L290J442k817k576J829L242n32
$$ plain form
4917 279 686 258 -282 -171 397 567 66 -531 -306 408 318 -426 -731 -166 325 -34 -791 -969 -133 64
4937 64 -712 -1237 -931 -54 -212 -897 -1241 -433 177 -312 -1138 -738 86 216 -418 -842 -172 596 312 -457
4957 -457 -436 270 617 93 -647 -256 526 302 -361 -562 -33 424 107 -530 -410 312 593 226 -141 124
4977 124 802 822 476 24 496 1222 1187 502 236 775 1375 943 64 14 863 1132 162 -672 -303 770 575
4998 575 -475 -1114 -121 919 18 -1243 -1019 591 964 -512 -1270 -186 1367 709 -988 -1234 758
5015 758 1581 -188 -1774 -710 1379 948 -1496 -2001 31 1332 -508 -2599 -1723 846 745 -1878
5031 -1878 -2825 -515 1419 14 -2461 -1816 1171 1852 -889 -2301 -13 2631 1346 -1665 -1358 1782
5047 1782 2835 -5 -2229 -159 2754 1643 -1713 -2077 1213 2655 -162 -2738 -909 2333 1801
5062A801l560o42L299K036k277k945J530L509J14l476j187K956K511k216l310
5077a857R28L468L22l415j982K584K701j719l600J04L542J010l104k297K178K967
5093A830r86l392k95L351J797k501k641J903L155k62l373q40K878J994k016l014
5109b412R48L196J36l217j523K318K242j436l105L02L069Q77k567j861J918K890
5125A775p84k953n9K839J710k064k189J398K868k0k805j100K411J940j767k569
5141a369N80K655L45k703j524J941K175j248k696J4K706J020k235j714J743K348
5157B038m66k616k08K425J448j858j957J152K296j48k449q95J941J397j567k304
5173a771M61K234J8k234j307J838J603j066k182J84K329O38j812j221J636K002
$$ plain form
5062 1801 -1759 -2401 898 2934 657 -2288 -758 2751 2865 -611 -1798 1158 3669 1453 -1857
5077 -1857 -929 2539 2861 -554 -2536 48 2749 1030 -2570 -2466 1076 2086 -1018 -3315 -1137 1830
5093 1830 844 -2548 -2843 508 2305 -196 -2837 -934 2221 1959 -1414 -2254 624 2618 602 -2412
5109 -2412 -1464 1732 1868 -1349 -2872 -554 1688 252 -2853 -2551 518 1395 -1172 -3033 -1115 1775
5125 1775 991 -1962 -2021 818 2528 464 -1725 -327 2541 2521 -284 -1384 1027 2967 1200 -1369
5141 -1369 -789 1866 2211 -492 -2016 -75 2100 852 -1844 -1830 876 1896 -339 -2053 -310 2038
5157 2038 1572 -1044 -1252 1173 2621 763 -1194 -42 2254 2106 -343 -1238 703 2100 533 -1771
5173 -1771 -1310 924 942 -1292 -2599 -761 842 -224 -2406 -2222 107 745 -1067 -2288 -652 1350
5189A350q55j828J78J923P51j550j261J133J586n48j813o5J390O18j474j120P73
5206h12J402n64j397m8J350O27j004q78Q81J189k40r46J12J194N42p51m57P16
5224I16Q07m29p91J78N84j9q64k66N49K34o61n93K55O06n57o89M8P97J40p52j61
5245f68Q31N77o79o61N92J043j52j140o9J197N81j162r54P25J089n65j579k71
5263a265J287O40j431j294R43J388m09j777j36J784P91j464j311J308K072m10
5279G16k007q8K050J152j678j623J050K115k42k204n88K014J208j596k089Q80
5295i30K173j04k423q06K098J540j304k188P59K576L50k137j141K045J916j037
5311A387k211L54K450O88k100j608J576K016p81k645k88K257J047j952j944R53
$$ plain form
5189 1350 495 -1333 -1155 768 1519 -31 -1292 -159 1427 879 -934 -999 391 1009 -465 -1585 -812
5206 -812 590 26 -1371 -1419 -69 558 -446 -1324 -443 746 506 -440 -328 866 1408 657 200 916
5224 916 1723 1294 503 681 1265 1246 382 116 665 899 238 -355 -100 506 -51 -740 -692 105 245 -507 -668
5245 -668 163 740 61 -600 -8 1035 883 -257 -326 871 1452 290 -664 61 1150 585 -994 -1265
5263 -1265 22 662 -769 -2063 -1120 268 -141 -1918 -2054 -270 521 -943 -2254 -946 1126 716
5279 716 -1291 -1379 671 1823 145 -1478 -428 1687 1445 -759 -1347 667 1875 279 -1810 -930
5295 -930 1243 1139 -1284 -2090 8 1548 244 -1944 -1185 1391 1741 -396 -1537 508 2424 1387
5311 1387 -824 -470 1980 2668 568 -1040 536 2552 1771 -874 -1162 1095 2142 190 -1754 -801
5327h01K070k81k374p86K065J527j389k081P11K494K04k082j121J744J903q96
5343I07k295N7K295Q51j994j708J192K124n77k439m92J956J385j467k303O65K453
5360F10K05k306j087J978J948r83k139M0K589Q50j843j649J566K303n08k565j33
5377a124K276J216j698k277J049K425q5k616r42K147J753j420k401N08K658N47
5393B016k522j410K067K203r82k607Q3K693J107k285j903J553K510p23k720n36
5409a456K396J444k073k316J192K488l06k762r00K291J586j579k504R32K554K72
5425A259k459j052J944J940j143k386L64K511N56k194j312J636J867p80k312j99
5441a760K203Q60j788j649J235J916l71j957m56J797J204j200j534N89J848K76
$$ plain form
5327 -801 1269 988 -1386 -2172 -107 1420 31 -2050 -1339 1155 1359 -723 -1844 -100 1803 907
5343 907 -1388 -1331 964 1815 -179 -1887 -695 1429 852 -1587 -2079 -123 1262 -205 -2508 -1843 610
5360 610 815 -1491 -2578 -600 1348 365 -1774 -1734 855 1705 -138 -1787 -221 2082 1574 -991 -1124
5377 -1124 1152 2368 670 -1607 -558 1867 1782 -834 -1776 371 2124 704 -1697 -1189 1469 2016
5393 2016 -506 -1916 151 2354 1372 -1235 -1152 1541 2648 363 -1540 13 2523 1800 -920 -1456
5409 -1456 940 2384 311 -2005 -813 1675 1369 -1393 -2293 -2 1584 5 -2499 -1567 987 1259
5425 1259 -1200 -2252 -308 1632 489 -1897 -1533 978 1534 -660 -1972 -336 1531 751 -1561 -1760
5441 -1760 443 1303 -485 -2134 -899 1017 646 -1311 -1767 30 1234 34 -1500 -911 937 1213
5457A213j730p26J421J465p41j655L85J385M91j349r38J137J180m17j462j41J230
5474G48O87j019j073N35J086mj091l73R01O72m99j077J35R67L13q00o54O36P60
5493H50q2j030l21Q65M11n30q34K41P63k1p08n05N11O48k57q59JP89K03m64n68
5514h97K80P70q8p27k40O86L16k51o53J45N95K39m74m42M22L97m2m61j24O31K94
5535C76m37m06L60N36r7l72m7K96K63k21j53k8L05O2j70r6J43J14j68M2q8j7J52
5558C49O5J4j36j10K00J67j68k25J5L73J57k96m16J40M71m5o25k20M54L93m45
5579A12q56K89P62L2r62l62P37O92n45j069J67J210L00j109p53R63J389p21j406
5598a130n7J662N49j365j095R41J504l61j950j81J778Q34j441j609J154J730k63
$$ plain form
5457 1213 -517 -1243 178 1643 902 -753 -368 1017 1508 159 -779 358 1538 1121 -341 -482 748
5474 748 1435 416 -657 -122 964 960 -131 -504 397 1069 570 -507 -372 595 908 108 -546 90 850
5493 850 768 -262 -583 282 693 163 -671 -430 333 312 -396 -901 -390 258 1 -858 -857 -68 135 -329 -897
5514 -897 -617 153 65 -662 -902 -216 100 -151 -804 -659 -64 175 -299 -741 -319 78 36 -425 -549 82 376
5535 376 -61 -467 -107 429 332 -40 -87 209 472 251 98 70 375 437 267 171 314 428 260 302 214 197 349
5558 349 414 428 292 182 382 549 381 156 171 544 701 405 -11 129 600 555 -70 -290 164 557 112
5579 112 -744 -455 307 339 -623 -985 -248 444 -101 -1170 -1003 207 507 -602 -1355 -392 997 276 -1130
5598 -1130 -1187 475 1024 -341 -1436 -495 1009 648 -1302 -1483 295 1129 -312 -1921 -767 963 700
5615G00j972m94K023J345j574j763R29K299l9k036r02K203J620j408k297P58K511
5632A903L00k494j233K004K006j353k553K56K720M81k487j635J834K374j122k621
5648a620L0K787J019k417j829J719K453o26k746k64K735J115k089k067J238K529
5664A967m24k833p01K350J416j773k480R31K677O2k715j061K168J968j504k307
5680b259M37K598P18k321j399J832K256q61k601J12K443J016k039j708J336K019
5696A579l64k336o10J946J291j647j938R36K231L0k211p60J878J737j162j973
5712a373N09K207O30j927j225J573J920o87k128j85K017R42j836j523Q94J868
5728A676k15k285n92J849J041j461j737O07J968J07j861p24J626J489r45j827
$$ plain form
5615 700 -1272 -1766 257 1602 28 -1735 -806 1493 1454 -582 -1484 719 2339 931 -1366 -608 1903
5632 1903 2203 -291 -1524 480 2486 1133 -1420 -1164 1556 2037 -450 -2085 -251 2123 1001 -1620
5648 -1620 -1590 1197 2216 -201 -2030 -311 2142 1516 -1230 -1494 1241 2356 267 -1800 -562 1967
5664 1967 1543 -1290 -1991 359 1775 2 -2478 -1547 1130 1192 -1523 -2584 -416 1552 48 -2259
5680 -2259 -1822 776 1494 -827 -2226 -394 1862 1001 -1600 -1488 955 1971 -68 -1776 -440 1579
5696 1579 1215 -1121 -1731 215 1506 -141 -2079 -1143 1088 1118 -1093 -1853 25 1762 600 -1373
5712 -1373 -864 1343 1973 46 -1179 394 2314 1627 -501 -686 1331 2273 437 -1086 -192 1676
5728 1676 1461 -824 -1416 433 1474 13 -1724 -1117 851 958 -903 -1627 -1 1488 543 -1284
5744a284L87J940M10j605r92J198J497o08j935j5J556O69j560j339R13J467m53
5761B46j718m16J554Q73j190j336Q02J573pj452l42J417R40p30j226N65J398J44
5779A095j192n32J051Q40p06j060J40J111O0j059n57P23O84n86p49J59Q47J85
5797D54p81k80O39N85l10m97K64P78R3n30j2L99L13l97l01R5K47j45m55j9K39
5818C79j98m57r5K97m5l63k51K53L37j28m82K75N27J2n01J6N46L59n22l33K86
5839h8P73j91q50j27Q25K86q12q52N29P36k64j044k39J045M26q22q22N72J063
5858A44N3j174r0J082Q18o59j021N73J431j4j156m52J105J017q59j211L30J173
5876A090J85j410p25R48R76o40j360J20J225N13j107j000J017J226l43j278o6
$$ plain form
5744 -1284 -897 1043 1453 -152 -1144 54 1551 943 -992 -1007 549 1218 -342 -1681 -768 699 246
5761 246 -1472 -1888 -334 539 -651 -1987 -1185 388 381 -1071 -1413 4 944 214 -1012 -447 951 1095
5779 1095 -97 -629 422 1262 556 -504 -364 747 807 -252 -809 -86 598 12 -737 -578 269 454
5797 454 -327 -607 32 617 307 -190 74 852 945 415 403 802 1115 718 417 512 759 614 159 140 379
5818 379 181 -276 -371 -74 -119 -482 -733 -480 -143 -271 -753 -478 49 61 -440 -424 122 481 -41 -374 -88
5839 -88 685 494 -356 -483 342 628 -184 -1036 -507 229 -35 -1079 -1318 -273 153 -669 -1491 -919 144
5858 144 197 -977 -1067 15 833 174 -847 -274 1157 1143 -13 -465 640 1657 798 -413 -83 1090
5876 1090 1275 -135 -860 88 1064 424 -936 -816 409 922 -185 -1185 -168 1058 715 -563 -629
5893f29J453O03r22j033N47J407q2j443m75J125Q57q58j262O8J311K33j554o90
5911a344Q87J096o54j383r3J323O43r58j055Q24J320j17j280l76J259R21p13j173
5929h73L22J264L49j351r37R35J349p05j411j56J316O03j046j238O96J565l59
5946C23j408l99J451J247r13j494N97J654M06j424r81J285J644q01j812J81J835
5963A391M83j656j135Q11J751n33k025l74J780R71j448j550P64K002j58j940o18
5980a484J779J362j125j807N49K016M68k034j000J486J583r90j811K7J786P00
5996A505j918j379J287J739p37k144j07J812Q79j594j382R94J742n9j888m15J784
6013A19J089j197j611P33J991n8j725o21J428J240q74j790M33J755R5j464r72
$$ plain form
5893 -629 824 1427 505 -528 19 1426 1344 -99 -574 551 1408 550 -712 -644 667 900 -654 -1344
5911 -1344 -457 639 -15 -1398 -1491 -168 475 -483 -1538 -714 606 489 -791 -1167 92 1013 300 -873
5929 -873 -551 713 1062 -289 -1226 -291 1058 353 -1058 -1214 102 705 -341 -1579 -883 682 323
5946 323 -1085 -1484 -33 1214 301 -1193 -596 1058 1464 40 -941 344 1988 1187 -625 -444 1391
5963 1391 1874 218 -917 -106 1645 1112 -913 -1287 493 1464 16 -1534 -770 1232 1074 -866 -1484
5980 -1484 295 1657 532 -1275 -726 1290 1758 -276 -1276 210 1793 803 -1008 -981 805 1505
5996 1505 -413 -1792 -505 1234 497 -1647 -1754 58 937 -657 -2039 -1045 697 638 -1250 -1665 119
6013 119 1208 11 -1600 -867 1124 1066 -659 -1280 148 1388 514 -1276 -843 912 1007 -457 -1429
6030a429J242J186n26j606R6J530N89j297r61Q67J450l09j359j79J505P05j025
6047D79j077O18J174M2j220m80R66Q90p51j177J96J002L33r75q38P16Q58l34j051
6066f29k09J009O26q29p61M49R51j03q96k91Q21O48o37p45J15P66J42q20m70N68
6086b95O83l21q15p5O60K28n78n50M73P32j08p57j00O38L60l44o91L76P20J19
6106C55m88l38N15N04k96n14L3O06Q4m46k95L91M37k53m81J18M07Q3l84j92L53
6127A99J94q9k64J10L34K0l07N4J38lj84q6K03P1r9k24M9L56j64k53p8K53K4l27
6151g3j26K46K21k53l72J05O04p5p25j82O43L16m87o84L83P75r0r21k45Q55M61
6172C76n91q82N64R50q2j269r9R71P12o97j152M19J413J2j294m60J269R29q96
$$ plain form
6030 -1429 -187 999 473 -1133 -1037 493 1082 -215 -1176 -309 1141 832 -527 -706 799 1504 479
6047 479 -598 20 1194 1236 16 -464 502 1392 641 -536 -340 662 995 20 -818 -102 756 422 -629
6066 -629 -838 171 797 -32 -793 -344 607 504 -392 -683 138 786 149 -596 -481 285 427 -393 -863 -295
6086 -295 388 67 -748 -823 -163 65 -513 -1063 -590 142 34 -723 -823 -185 175 -169 -860 -484 236 355
6106 355 -133 -471 44 548 252 -262 -229 377 461 15 -280 111 548 295 -186 -68 339 422 38 -154 199
6127 199 393 304 40 150 484 504 197 251 389 386 202 116 319 390 291 67 116 472 308 55 -23 230 254 -73
6151 -73 -199 47 268 15 -357 -252 352 277 -448 -630 13 329 -158 -842 -459 316 226 -695 -940 -85 376
6172 376 -215 -1097 -533 417 335 -934 -1033 -62 650 -47 -1199 -780 633 645 -649 -1109 160 1089 193
6191A93j261L23J513J95j360p90J305J160o91j624L10J686M37j581r99J384J360
6208A560p18j639P9J902M45j573j166J229J638o57j855j54J908O46j546j415J067
6225b49J669l26k034m62J979Q56j314j669Q48J958k19k009m80J650J247j277j562
6242a394N91J914Oj762q62J353J349q48j928L60J729M23j618j133J271J477o15
6259C13j752j55J797P86j455j288J137J639k65j587m05J547J088j116j367N56
6275e27J570K30j593p12J308J213q78j501J86J424L51j345q70J066J232l62j607
6292h15l6J463O11j081j096P28J507j12j336m81J339Q94r33j235K47J364J71j290
6310i1q86J071J025o02j600N0J457K61j093r19P81J139l44j262k09J358P37q65
$$ plain form
6191 193 -1068 -745 768 963 -397 -1187 118 1278 587 -1037 -727 959 1396 -185 -1184 200 1560
6208 1560 842 -797 -718 1184 1629 56 -1110 119 1757 1100 -755 -909 999 1645 99 -1316 -249
6225 -249 1420 1094 -940 -1402 577 1433 119 -1550 -702 1256 1037 -972 -1452 198 1445 168 -1394
6242 -1394 -803 1111 1117 -645 -1507 -154 1195 347 -1581 -1221 508 931 -687 -1820 -549 928 313
6259 313 -1439 -1594 203 989 -466 -1754 -617 1022 757 -830 -1235 312 1400 284 -1083 -527
6275 -527 1043 1273 -320 -1032 276 1489 611 -890 -704 720 1071 -274 -1144 -78 1154 792 -815
6292 -815 -851 612 1223 142 -954 -226 1281 1169 -167 -648 691 1585 652 -583 -336 1028 1199 -91
6310 -91 -977 94 1119 517 -1083 -1033 424 685 -408 -1327 -546 593 249 -1013 -1222 136 873 8
6328Hj177O00J219J10j261m34J085P83p72j190K90J196J20j131p42R01R68n94
6346b1j146Q6J218L66r80q33Q50J099l20j056L6J138M85p61o62N76R85k16r54
6365a10j50P86O65p08p37K80P14j05p21k86M99L24l54n58K04N53P1n69j81N02
6385A19L41j06m64J18N51j2k46j29K35K16l04k69Q7P7j5k30m9j3Pk55r4Jr3lP8
6410d52r6Q8j02P6J95J49j00j84J20L50Q9l48j4L49K94l99l33J21M35O1o39m9
6432c89L39L27l30p01K34N49J4n57k10O02M41l62m81L32N77L19n44l91N70O03
6452I42k31o33J4P85J66o92m02M05N74k19r01k15O78L66o95n61J44Q83j04p00
6472c96k19O15M81l88o59K66P55K45o01n19N27O39l16o73j1O07L53o82o94L10
$$ plain form
6328 8 -1169 -569 650 760 -501 -935 150 933 161 -1029 -739 457 577 -554 -1296 -395 573 -21
6346 -21 -1167 -1081 137 503 -477 -1310 -460 639 319 -737 -701 437 922 161 -501 75 1060 844 -110
6365 -110 -260 526 1191 483 -254 26 740 635 -86 -372 127 451 97 -461 -257 296 367 -202 -383 119
6385 119 460 354 -110 8 559 547 301 172 407 623 319 50 137 214 199 -31 -80 -93 -86 -341 -435 -434 -527 -530 -452
6410 -452 -548 -460 -562 -486 -291 -142 -242 -426 -306 44 133 -215 -229 120 414 15 -318 -197 238 299 -340 -389
6432 -389 -50 277 -53 -754 -520 29 43 -514 -724 -122 319 -43 -524 -192 385 704 160 -231 339 942
6452 942 711 78 92 877 1043 351 -51 354 928 709 -192 -407 271 637 -58 -619 -475 408 304 -396
6472 -396 -615 0 481 93 -566 -300 455 700 99 -420 107 746 430 -243 -254 353 706 24 -670 -360
6492c60O34p4p54l45M70M76k62q21nP58L70o34n29N67P87Jp30k76R32N76o01o35
6514d55K68Q89J44q85n52O91P14m10q60j58R30L15q72q48P60J018k70j084l74
6533a039J233R19q80r91M81J360J37j269n51J160J065q29j266K20J464J79j372
6550B1p53P67J146o12j490j39J452N21j345r71R18J381l89j604j41J566P11j115
6568g6j055P29J538q1j752l76J478R70j190j364N21J546j27j612p16J435J135
6585A003j079j496K45J680K36j438p60J311J271o75j560L60J511N29j270r03J163
6602A28J202l33j461j05J297O13j101j119P46J262l33j402k99J238P13r34j086
6619i74M63J319k4j187m25J005R20n50j136K16J335J15j008n82P29R81l97j132
$$ plain form
6492 -360 274 200 -554 -899 -429 47 -215 -1036 -1041 -283 87 -547 -1076 -509 278 279 -451 -727 205 781 180 -455
6514 -455 -187 702 846 -39 -591 100 814 404 -456 -614 316 631 -241 -1089 -329 689 419 -665 -1039
6533 -1039 194 1113 233 -758 -277 1083 1220 -49 -600 560 1625 796 -470 -250 1214 1393 21
6550 21 -732 35 1181 569 -921 -1060 392 913 -432 -1403 -485 896 507 -1097 -1238 328 1039 -76
6568 -76 -1131 -402 1136 1055 -697 -1073 405 1375 185 -1179 -658 888 761 -851 -1567 -132 1003
6585 1003 -76 -1572 -1327 353 589 -849 -1609 -298 973 298 -1262 -902 609 1138 -132 -1035 128
6602 128 1330 997 -464 -569 728 1341 240 -879 -133 1129 796 -606 -905 333 1046 112 -974
6619 -974 -511 808 784 -403 -828 177 1097 547 -589 -373 962 1077 69 -513 216 1197 800 -332
6637c32Q6Q51M04r79p16M00Q16j68j000k61P51O37o13p54K49Q10m2p20l03P19
6657a65N68k98o28M2P11K79o83n13N05O35k69o72m2N49L07m44m93J06N80K5n81
6678d81k43N72L69l79l00J56N66k0l79j86M64M43k50l61m2O50Ll95k22K19L20
6699E04j81l84M7J63L57l92k18K69R5j18k57J5K79R4l43L8K43O4j25K0J19l7k1
6722B31j41PJ44L6m00J18QJ74k26k32R5J48n2l87P8L87m6l92j70L27K70q6m49
6745e58M6N59m5m26j40M42N13k89o89J14O93J66o95k97N96O06m72p41J93P36L00
6766F12r36m46P36P60m21q14q3J104L65r23o35O51J037m29j048PJ054N21r63q42
6786f93N57J237m38j058l05J122O33q20j047N96J227j35j309m07J189O40o64j200
$$ plain form
6637 -332 -246 605 1009 30 -686 -286 530 362 -638 -899 -148 489 -124 -878 -629 181 139 -581 -884 -165
6657 -165 403 105 -523 -481 230 509 -174 -687 -182 453 184 -488 -530 19 326 -118 -611 -505 75 100 -481
6678 -481 -724 -152 217 -162 -462 -306 260 240 -139 -325 139 582 332 -29 -71 579 582 187 -35 184 504
6699 504 323 -61 -14 149 506 114 -104 165 260 142 -115 -100 179 273 -70 -32 211 275 150 170 289 252 231
6722 231 90 97 241 277 -123 -5 3 177 -49 -281 -186 -38 -90 -477 -399 -12 -58 -450 -620 -293 -23 -109 -558
6745 -558 -512 47 2 -424 -564 -122 391 102 -587 -473 220 386 -309 -606 -10 596 124 -617 -424 312 612
6766 612 -324 -770 -34 726 305 -509 -592 512 877 -46 -681 -30 1007 578 -470 -463 591 1112 149 -693
6786 -693 -136 1101 663 -395 -700 422 1055 235 -812 -216 1011 876 -433 -840 349 989 325 -875
6804h75M54J189J23j255o52J095R79p18j342L00J205L09j327o33R92J027o06j348
6822a083J35J262M87j250p06P12J192l39j225j12J086O47r03j104O85J010J04
6839E98j226l04R52O43n29r83J20J303J87j112o11R62Q67l60j156L7J151L43p67
6858A15p08O46Q93l49r85j46R78N25q11p20M08J047k01r31l80Q27P12n69r41K59
6878c31Q60J94q56m41N60Q96k43r55j21Q68L67o91q36N20Q24p1r06l56P39N63
6898E84n19r01P0J056M8q27n39P11P10k99q77j8J022L03p17o65M77Q88q8q25k82
6919f88Q38N11n79p19L06Q71j7q77l63P53N61n63p10J99P96Q4p98l48P67N69l12
6940B81p27J43P94K59n84n47O70O08k52o82l1O24L38o45n10L31O18k17n31l09
$$ plain form
6804 -875 -421 768 891 -364 -1016 79 1058 340 -1002 -702 503 812 -515 -1148 -156 871 265 -1083
6822 -1083 -948 314 801 -449 -1155 -443 749 410 -815 -927 159 806 -97 -1201 -516 494 598
6839 598 -628 -932 20 663 134 -849 -729 574 761 -351 -962 0 867 507 -649 -612 539 882 115
6858 115 -593 53 946 597 -388 -534 444 969 158 -562 -154 893 692 -239 -619 208 920 351 -590 -331
6878 -331 529 723 -133 -574 -14 882 639 -316 -437 431 798 107 -729 -209 615 544 -362 -718 21 584
6898 584 65 -836 -766 290 338 -489 -1028 -317 393 94 -783 -801 221 524 -193 -858 -381 507 419 -406 -688
6919 -688 150 661 82 -637 -331 540 523 -354 -717 36 597 34 -676 -477 319 403 -395 -743 24 593 281
6940 281 -446 -303 491 750 166 -381 289 897 645 -37 -68 556 894 249 -261 70 688 471 -60 -369
6960c69M36L63k76o35J51N89o3l65k63M52L57j49n48K12M11N8l26j71L11N9q4
6981A50l17l5L03J16k26l22J0K04n7k07j18J36R6j01j69J04O6P7L4l7Q3J10J75
7004G5J6j16m4J65M0O3k17P4R2P6j46k61J71J56n9j04r4J07M4j16k16J19K41K35
7028C01l63j27L04K96o5j89p9L87P1j08j81p6M47j21l63r4K09J34j91l37N0J04
7050IQ6l39k73L05K55j23k26j57M02O1p8k88J62K57K03k88k39K77L36m9l74j54
7072b35L95J21l14m73J49L22J64o32k95L40M85k48m95O3N81K23m97l58N03O56
7092D55p9n39j79O64M33n42l98K48O43L1p69k32N31M00l13o97K0P37J33p35n40
7113g28N07P43j61q82q0J013M19p56p60P09R18j43j059k49J100O21r05r02N61
$$ plain form
6960 -369 67 430 154 -481 -330 259 196 -169 -432 20 377 228 -320 -108 303 361 35 -136 175 234 150
6981 150 -167 -202 101 217 -9 -331 -321 -117 -174 -381 -499 -363 -267 -368 -537 -433 -367 -290 -256 -293 -210 -100 75
7004 75 91 -25 -69 96 136 199 -18 56 148 224 78 -183 -12 144 85 -19 -113 -6 38 -78 -294 -175 66 301
7028 301 -62 -189 115 411 346 157 78 465 536 428 247 171 618 497 134 40 249 383 192 -145 -95 9
7050 9 95 -244 -517 -212 43 -80 -306 -463 -61 0 -78 -366 -204 53 256 -32 -271 6 342 293 -81 -235
7072 -235 160 281 -33 -506 -357 -35 129 -503 -798 -458 27 -221 -716 -653 -72 151 -346 -704 -201 455
7092 455 376 -163 -342 322 755 213 -185 63 706 737 -32 -264 267 667 354 -343 -323 414 547 -188 -728
7113 -728 -221 522 361 -521 -601 412 831 75 -685 24 942 799 -260 -509 591 1212 307 -595 -34
7132c4R00j66j185l66J062O21q34j097M27J192j37j203l93R43Q99o49j037Q5J411
7151D39K65j127n46Q43R77m71j109N4J218L75r79q71P80J050l55j296j22J146
7169B71L68q89r30O42J121k25j133j82J161N75p56r48N83J067N3r88l52J034P54
7188A226p11j041M53J019Q3j062m44P95N70l64r84o1R44J93p91o01N90R36m61
7207B89q27j4Q51N19p61o33N30P29j21p30j89P23L90l98q36K26O90P6q88l85N96
7228a63N62m16p65O5O61P7m67l22L00N40j62l97l5M89L22l43m35L19O18j13m94
7249a59k08M71L91k72m89O9N33q0k86l39K60M24l05l77J27L99M9j77l64M13K41
7270C21p3l05q2M60O4j07j77J81K46o7l24j5K05K08k68k11o0J70Pk17j32K04J03
$$ plain form
7132 -34 866 700 -485 -851 211 832 -2 -1099 -672 520 383 -820 -1213 -270 629 -20 -1057 -972 439
7151 439 704 -423 -969 -126 851 380 -729 -675 543 918 -61 -932 -152 898 543 -753 -875 271
7169 271 639 -250 -1180 -538 583 358 -775 -957 204 779 23 -925 -342 725 778 -210 -562 472 1226
7188 1226 515 -526 -73 946 1029 -33 -477 318 888 524 -460 -521 423 616 -175 -776 -186 750 289
7207 289 -538 -552 299 818 57 -576 -46 683 562 -168 -357 366 756 358 -478 -252 438 514 -374 -759 -163
7228 -163 399 -17 -782 -717 -56 21 -446 -768 -468 72 -90 -487 -522 -33 289 -54 -489 -170 448 335 -159
7249 -159 -367 104 495 223 -266 -197 336 256 -30 -369 -109 315 10 -367 -240 159 208 31 -333 80 321
7270 321 248 -57 -139 321 385 278 101 282 528 461 137 122 327 535 267 56 -4 166 173 -44 -176 28 131
7293A31k91pL0J02O6j50lJ68J16j73n4J3J08m3o2J9J47J3l12N4K10j32j70q3J50
7318a53J71k93k46J49L45k04k76J11K50R0j77k27K21L28j13k17l0L96K19l41k47
7339b44K50L76m3m61k16P13J71n67l42K41N52j27m09k76N65L59m24n41L57O61
7359E95J3p36j53N72M44m60n25J47P26J71q76l07O42L56l15p35J32Q24N5p85n31
7380g46O73O79m56o87M8P06K60p06n30N07P74l99o41n3P03L03o28n66M21P75r3
7401C44q74q3O99L63n71o00L19O77M4p81k60P81M92m77o73K61O57R8o47l64N18
7422g7N74k06p73J60P25K73n79n72L05P40j09n75j51O23K56l36o64K30O62O4n92
7443b2l48N89L69l20n09L7M53L26n46m15K06P37m1p79j45N11M15k26p56K22N38
$$ plain form
7293 131 -160 -167 -137 -35 31 -119 -122 46 162 -11 -65 -52 56 13 -49 -30 117 130 -182 -128 82 -50 -220 -303 -153
7318 -153 18 -275 -521 -372 -27 -231 -507 -396 -146 -56 -233 -460 -239 89 -24 -241 -271 125 344 3 -244
7339 -244 6 382 339 -122 -338 375 546 -21 -363 -122 430 303 -106 -382 183 542 118 -423 -66 595
7359 595 608 -128 -281 291 735 275 -250 -103 623 794 -82 -389 253 609 294 -441 -309 515 570 -215 -746
7380 -746 -73 606 150 -537 -489 217 477 -229 -759 -252 522 123 -518 -571 132 435 -193 -759 -338 437 344
7401 344 -530 -613 86 449 -122 -722 -403 274 318 -463 -723 58 550 73 -600 -339 318 416 -231 -595 -77
7422 -77 497 291 -482 -322 403 676 97 -475 -170 570 461 -114 -265 358 614 278 -386 -156 506 570 -22
7443 -22 -370 219 588 268 -241 -204 249 575 29 -386 -180 557 516 -263 -408 103 518 292 -464 -242 296
7464B96J65o44l73M41O01k77n71j64P24K29o01m72M07N91m2q23j19O52L56m55
7484g9p17K77Q03L8p38k60N68N03k76q56K67P13J18o22m24O72N65k41p27l0Q71
7505D25K04n41o19L34P92j32p39k22Q05L23n53n20L37O19k8o11k85M92N21l09
7525B93o44K50O87o4m51k71L89L64k09n86J40N96M3n17l33K51M35l35l17M7M23
7546A91M7l13n38L38M84j45m02j68M82J87k89j86J12L64m2k54j33J88K98k05l54
7567c38R3K30K00l85k5R5qO9k23k6J25J46j01j32M0K55l6j61J57l0J41nK5m8J11
7592A69N2M0j27nO5K6j3j82L5J75j04j17mL4O2k9k6j46M2J91kj17r1J43O7lj2
7619A23OR1p0p0l3J11N5l7j11j48J22K6j63j22l9J14lj33q1J15J80o4q6j93K70
$$ plain form
7464 296 461 -183 -556 -115 486 209 -362 -526 198 427 -174 -646 -239 352 310 -513 -632 20 376 -79
7484 -79 -796 -519 284 322 -416 -676 -108 395 119 -737 -470 243 361 -261 -685 -13 552 311 -416 -446 425
7505 425 629 88 -531 -197 595 463 -276 -498 307 630 77 -443 -106 513 485 -126 -411 81 602 293
7525 293 -351 -101 586 522 71 -200 189 553 344 -242 -102 494 537 20 -313 -62 373 38 -279 -232 191
7546 191 238 -75 -613 -275 209 64 -338 -506 -24 163 -126 -312 -200 164 122 -132 -265 -77 221 16 -338
7567 -338 -245 -15 185 -200 -225 -130 -138 -69 -292 -318 -193 -47 -148 -280 -240 15 -21 -182 -25 -55 86 81 106 58 169
7592 169 221 261 134 129 194 220 207 25 60 235 131 14 10 44 106 77 51 -95 -53 138 136 19 -72 71 138 135 123
7619 123 129 220 150 80 47 158 213 176 65 -83 39 65 -98 -220 -259 -145 -148 -281 -362 -247 -67 -131 -217 -410 -140
7644a40O4j08j39R9L85q0j32k30K59K06q7k77K2K16J38k21k23J75L03q3l08k11
7666c72K10K63j32m42J07M93J27m12k19M05L89k00n08J96N26K95n67l94M33N01
7686F99k93n11j15N53L22n21o20M62N59j56p34q2M52M54l96p08K23Q17P7o53l20
7707d91N64O45m32p80K19Q44J13p73m12N15O93n75p64Q2P88K04q40m86N63O35
7727C12j44r86j4Q80L76p62n15M46Q20j8q82j71Q87M84o81o78M24Q20N6q89m20
7748f55Q93N06n59q26K57Q49J18q75m63O54N88k67q34Q5R17K99q25l57N37O83
7768G25j93q26J62O98L80p91m10L61N88j73p92M3N12L18m97n67J27P36q9p34j40
7789e62M75M56l33o42L10N49M0n68k03L85M50j04n95J12N05Q9m85j96J24N61j35
$$ plain form
7644 -140 -76 -184 -323 -224 161 81 -51 -281 -22 184 97 -180 -158 58 196 -25 -248 -73 230 147 -161 -372
7666 -372 -162 101 -31 -473 -366 127 254 -158 -377 28 417 217 -291 -95 431 726 159 -235 198 699
7686 699 406 -105 -220 333 655 134 -486 -24 535 379 -355 -437 15 469 73 -635 -412 405 482 -171 -491
7707 -491 73 718 286 -494 -275 569 682 -91 -503 12 705 130 -634 -552 236 440 -400 -886 -323 312
7727 312 168 -818 -832 48 424 -338 -853 -407 413 395 -487 -658 229 713 32 -646 -222 598 654 -235 -655
7748 -655 238 744 185 -641 -384 465 583 -292 -755 -101 487 220 -614 -529 388 687 -138 -495 42 725
7768 725 532 -294 -132 566 946 155 -255 106 694 521 -271 -228 284 602 105 -462 -335 401 312 -422 -562
7789 -562 -87 369 36 -606 -296 253 293 -275 -478 -93 357 253 -342 -230 275 364 -121 -317 -193 368 233
7810B33n98q1L76K18l53l03P0M12j0l52j74L59L20j42m21J35M71K3j65k76K73
7831A5L36K1m13M1K85J61k89k24M4L48j32k78j35K18J49j30l06J87L26j9j96j90
7853a81K39L34k54k17R2K64N1j49j23Q4J52J1k62kJ65K1j84k25K01K9j20k3j91
7876b88J29Q9k03j4lJ78L0l2o6J35O0j55L7Q9o3M1l9J53n9j24mN4R6j43j19J0
7902b11J42m2j31O4P9R9k05j48J83J52Rj56K8J94J41j95m5J52K33m6k78j3L29
7925C35M2j54k93J83L02rl72k35K44L03k78l14J24L76L3n15N5K49K43j64l90J00
7947a35M53j0l73j27K23L90k18l08j50N12J06n33j50J81M54k33m78r4N02J71l84
7968b01l45K13M50K0n14j71M82L46l13m95K58M56Q5n17k69N20M42l07n04Q1M77
$$ plain form
7810 233 -365 -446 -70 148 -205 -508 -438 -26 -36 -388 -562 -203 117 -25 -446 -311 160 183 18 -258 15
7831 15 351 372 -41 0 285 446 157 -67 -23 325 193 -85 -220 -2 147 17 -289 -102 224 205 9 -181
7853 -181 58 392 138 -79 13 277 328 179 56 140 292 303 41 39 204 225 41 -184 17 46 -74 -97 -288
7876 -288 -159 -70 -273 -287 -290 -112 -82 -114 -180 -45 15 -140 -103 -14 -77 -36 -75 78 19 -105 -109 -55 41 -102 -221 -211
7902 -211 -69 -111 -242 -178 -99 0 -205 -353 -170 -18 -9 -165 -137 57 198 3 -42 110 343 297 19 6 335
7925 335 377 223 -70 113 415 406 34 -201 43 346 68 -246 -122 254 287 -228 -173 76 319 155 -235 -135
7947 -135 318 308 -65 -192 31 421 203 -105 -255 257 363 -170 -320 -139 315 82 -396 -490 12 183 -201
7968 -201 -546 -333 117 137 -377 -548 -66 280 -33 -528 -270 186 271 -246 -515 5 447 140 -364 -283 194
7989A94K3m66l38M30M46k01l26j48N36J95m05l36L10L54L8m81o5L50K62j49m57
8010b34K12M68J7k83l02J73M25r0m89qM21J68l54l15P5M54n0l33l08L44M47k68
8032A70n61R4M47K46n31l13L31O00j68n67o7M08L21l83n62K33O02j86m76j82N04
8053d0L90k58o58J41N97J22n48l23M11M70j58p48K27M75J79l20o18N47N44j68
8073B64o19l8N89L38n02n55M08N81r7m85l42P70L44n39n05L47M74J0m03l46M46
8094A40M15l13n39Q9O14R1n23l19M21M51k89m15j92P30O0m92j66J67M63p0n18
8115a95p5N31J30l32m81L33L94q0m84l8M72J20l38l96J27M10j2l61j31K42L85
8136B21j75m28K9M48l0k89j10K74J57j28k50J4K82N0j92j37J71K55j75j14N4N0
$$ plain form
7989 194 217 -249 -587 -157 289 88 -238 -386 150 345 -60 -396 -86 268 306 -175 -240 110 372 223 -234
8010 -234 -22 446 463 180 -122 51 476 386 -103 -111 310 478 124 -191 -116 338 288 -45 -353 -9 438 170
8032 170 -391 -297 150 396 -135 -448 -117 483 315 -252 -319 89 410 27 -535 -302 300 114 -362 -544 -40
8053 -40 350 92 -566 -425 172 294 -254 -577 -166 304 146 -602 -375 100 279 -41 -659 -112 432 264
8073 264 -355 -393 196 534 32 -523 -115 466 369 -116 -458 312 656 117 -388 -41 433 443 40 -306 140
8094 140 555 242 -297 -208 406 497 -26 -345 76 527 238 -177 -369 361 421 -71 -237 -70 393 323 -195
8115 -195 -270 261 391 59 -422 -89 305 225 -259 -297 175 295 -43 -439 -312 98 86 -275 -406 -164 221
8136 221 46 -382 -353 95 65 -224 -334 -60 97 -31 -281 -267 15 65 -127 -264 -93 162 -13 -127 -73 -23
8158b3K08j85j60M8J83k6m8j68K46N4j18o3M0K34n8r5n3K14o9j4k8J01n2lo8K
8184I9k7L0m8K8q0J11l7
$$ plain form
8158 -23 185 0 -160 -112 71 45 -3 -171 75 129 11 -52 -12 222 164 69 16 230 161 147 119 220 168 165 97 99
8184 99 72 102 54 82 2 113 76
8191G6
$$ Imaginary data points
##PAGE= N=2
##DATA TABLE= (X++(I..I)), XYDATA
0@%%%%%%%%%%%%Qj6J6j6K4l2L2m0M8n6O7p5Q8j04J23j47J70j94K23k55K88l23
34a71L66m14M64n20N82o48P19q01Q91r86J088j201J328j464J614j779J958k155
52a129K378k626K898l210L564l968M440m995N662o480P510q856J0689j3349J7581
67A0109k5357M4225j73547k15354L95216K11150k48014l46745J44181L85686N341
78A86891l80674j20592L18426K69500k13921l26744J02017L68313L8795l27930
88h5919j66131K69510K61431j70513l21149M5980L16887P4787k94104j91849K09863
99e1207K53711j17471k91199l145K84564J10743k33345j86346J64950K48901n3612
110A26544k51089l2285K43738J32193j77158j80703J07666K20913j2176k19467
$$ plain form
0 0 0 0 0 0 0 0 0 0 0 0 0 0 8 -8 8 -8 16 -16 16 -24 24 -32 35 -40 48 -56 67 -80 90 -104 119 -136 152 -171
34 -171 195 -219 245 -275 307 -341 378 -423 468 -518 570 -631 697 -767 847 -932 1026 -1129
52 -1129 1249 -1377 1521 -1689 1875 -2093 2347 -2648 3014 -3466 4044 -4812 5877 -7472 10109
67 10109 -15248 28977 -144570 -359924 35292 246442 -1572 -348317 -204136 181550 186891
78 186891 -193783 -314375 4051 273551 59630 -267114 -165097 203216 242011 -85919
88 -85919 -252050 17460 278891 108378 -212771 -166791 150096 224883 -69221 -261070 -51207
99 -51207 202504 85033 -206166 -209311 75253 185996 -47349 -233695 -68745 180156 126544
110 126544 -124545 -156830 86908 219101 41943 -138760 -31094 189819 177643 -41824
120d1824o9899J81608J25899j26778j77490M2936J82097J4996j75758q7308J19936
131a1585J24917p2704j55890Q565J47913M7804j16419q8934Q1783J25769k5350
142F5869j23142j7688J12417O9266p5744r6328L7851J04333L389r8754n0119O9946
154A296O9556n0078r4280j735Q0414K9235p2282o1077M1349P1157j0709p3927
166g1081j8136O7849M8844l8428n6180K0883P2530J7568n3366k9818M3889N2107
178E6661j7750n6959k557N2860K2141m1148m2797J9560M5646q555m9278j6231
190c8407L4291K8459k6106l7821J3083L9383P930k8378j6364K7759K9675j0740
202B2764k2225M759K6761J2951j6595j3187J2029J3085m615j3717o569M953J194
$$ plain form
120 -41824 -111723 69885 195784 69006 -108484 -65548 116549 131545 -44213 -131521 -11585
131 -11585 113332 40628 -115262 -106697 41216 89020 -27399 -116333 -34550 91219 65869
142 65869 -57273 -74961 37456 106722 30978 -65350 -27499 76834 80223 -18531 -68650 1296
154 1296 70852 20774 -73506 -75241 5173 34408 -37874 -98951 -57602 13555 2846 -71081
166 -71081 -89217 -21368 27476 -10952 -67132 -46249 26281 43849 -9517 -39335 4554 56661
178 56661 38911 -18048 -20605 32255 54396 13248 -29549 -9989 35657 27102 -22176 -38407
190 -38407 -4116 24343 -1763 -39584 -26501 12882 20812 -7566 -23930 3829 33504 22764
202 22764 539 5298 32059 45010 28415 15228 27257 40342 35727 22010 15441 20394 21588
215B1588q647n619l504n253j023K00l723r653q991Q148J4174p507j7090K338K2176
230b386J3536j9347j9847K1847L0759q280l4473p592M0103K5491l7180l8960K0545
243a5784M4798m596n9247k2251N3919L5383m3912n7385J7768P1269O741p4026
255d7323l0114O2554N7565l6771p5165J7309R1678J8803p7254m5004O4440Q0099
267H0817l5758r3420O984R5291L1908q4037o9859O2005R3333l2283j05960j2810
279f3789R9004N1634q6945q5956N7271J06151j4302j11552k9163J06542P0630
290I9525q0801r7022M4480J16911L821j17044m6099J02676Q3214o9477j10760
301g0576K2558J18882J9447j15589o3795Q5275R2492n0622j17382K725J15725
$$ plain form
215 21588 12941 7322 3818 -1435 -2458 -2258 -5981 -15634 -24625 -16477 -2303 -9810 -26900 -24562 -2386
230 -2386 11150 -8197 -28044 -6197 24562 16282 -18191 -25783 14320 39811 2631 -36329 -15784
243 -15784 29014 24418 -34829 -57080 -3161 32222 -11690 -69075 -51307 19962 26703 -47323
255 -47323 -77437 -14883 42682 5911 -69254 -51945 39733 58536 -18718 -63722 718 80817
267 80817 45059 -48361 -41377 53914 85822 1785 -68074 -6069 87264 54981 -50979 -63789
279 -63789 35215 86849 -96 -86052 -28781 77370 63068 -48484 -77647 28895 99525
290 99525 18724 -78298 -33818 83093 86914 -30130 -76229 26447 109661 40184 -70576
301 -70576 -48018 70864 90311 -25278 -89073 -3798 88694 38072 -79310 -76585 39140
312C9140L6494j00790p7049O6571J03884k7147j13368j2950J06773N6248q1729
323c923q9676M8154J09088n813j06400l6264R0348P3967o2403r7406K4009J03065
335D6746J6937r5969n7739P2968Q5265l8140r7160j860R6009M1568p8865p1058
347h1298N0152R1713r228r2746k6449Q4199O2482n4450q2317K1244R1964J6717
359G1983q3782n0728O2757P7992l0387r0207o039Q6662M1331p1097p2675M1945
371b2245Q9985o449r2623l2384Q0961O7168n6063r0206J9351R6889K0083r2098
383a7631n8899P0294Q6278l6607j01458o279R9691M5057q5670p9341N3384R8793
395F7612j4645j07249k8101R8436O5334p3615r4431L4770J08171P001j07916m7137
$$ plain form
312 39140 75634 -25156 -102205 -35634 68250 41103 -72265 -85215 21558 77806 -3923
323 -3923 -93599 -45445 63643 57830 -48570 -84834 5514 79481 17078 -80328 -56319 46746
335 46746 63683 -32286 -90025 -17057 68208 30068 -67092 -68952 27057 68625 -10240 -81298
347 -81298 -31146 60567 51339 -41407 -67856 16343 78825 24375 -57942 -36698 55266 71983
359 71983 -11799 -62527 230 78222 47835 -42372 -48411 38251 79582 8485 -64190 -22245
371 -22245 67740 61291 -31332 -63716 17245 84413 28350 -61856 -42505 54384 74467 -17631
383 -17631 -76530 -6236 80042 43435 -58023 -64302 35389 80446 -5224 -84565 -31181 67612
395 67612 52967 -54282 -82383 16053 81387 7772 -86659 -51889 56282 63283 -44633 -91770
407i1770Q9987Q0519n7616j04625J7156J13072K3605j04422o2943P7873R3448
418G4284m2064j10584L975J12545L8002r4826p4479O7577J03488k9262j10401
429f1745r142J05141N2572q2881q3491N5327J01848j6843j03452k4686R3103O0681
441H6432p1906q3268L9595R2830j928r3673l4736Q0856O0408n5614p6792K3362
453c4434Q5808J0143q1008l5422O5229N7315l8551p0922J1770P5554J3448o5706
465f776l5698M6876N1894k8774o3991M160N8280J3533n0701l5702L3346M4679
477C1126j9362m8558r2M2229J5935l4786k8045K5044L4578r417l1049k443K9420
490D580J4652k2086j8203J4756J9522m412j9456l527J7428O275j3895r411M908
$$ plain form
407 -91770 -1783 78736 21120 -83505 -66349 46723 70328 -34094 -97037 -19164 74284
418 74284 32220 -78364 -74389 38156 76158 -18668 -93147 -25570 77918 48656 -61745
429 -61745 -70887 34254 86826 3945 -79546 -24219 77629 60786 -42666 -67352 25751 86432
441 86432 14526 -68742 -29147 63683 61755 -31918 -66654 14202 74610 18996 -57796 -34434
453 -34434 51374 61517 -19491 -54913 10316 67631 29080 -41842 -30072 45482 58930 -6776
465 -6776 -42474 4402 56296 27522 -36469 -32309 25971 39504 -11197 -46899 -13553 31126
477 31126 11764 -36794 -36886 5343 21278 -13508 -41553 -16509 18069 8652 -22397 -24840 4580
490 4580 19232 -2854 -21057 -6301 13221 8809 -10647 -14174 3254 9529 -4366 -13777 -8869
503h869P377l740j0055J846P446j725m514J392N491K183m695J499R823J592o286
518a235l31J0400R520o417r981P376J3521k189j5524n688J4969J0568j4415j7661
532g087N459J8430l63k3247j0823J7972J6276j3266k3369M021K7272P859k3297
545d163j5468K0108K6372q400k9309j562L1636J6180k5388k7285J5193L3284l925
558B7273l8584j5624L0514K4701k6175l9487P276M1027P645m2933k6972L2466
570a8873L9068j6880m6922o25N1433K3385m1075l6620L0811N4156o372n6847j4173
583c9534N4839L6699m0271n3663J9591O3179K943o6543l0161N2963M9379l7058
595A2363o9248R959P4009J6428o8099m2595N4328O8230k8223p8667L125Q3840
$$ plain form
503 -8869 -1492 -5232 -15287 -13441 -5995 -7720 -12234 -10842 -5351 -3168 -7863 -6364 3459 5051 -1235
518 -1235 -1566 8834 18354 11937 1956 9332 22853 20664 5140 -548 14421 24989 10574 -7087
532 -7087 -1628 16802 16439 -6808 -17631 341 16617 3351 -20018 -15997 11275 19134 -4163
545 -4163 -19631 477 26849 18449 -10860 -12422 19214 35394 10006 -17279 -2086 31198 27273
558 27273 -11311 -26935 3579 28280 2105 -37382 -30106 10921 18566 -24367 -51339 -18873
570 -18873 20195 3315 -43607 -44232 7201 30586 -10489 -47109 -16298 37858 31486 -25361 -39534
583 -39534 15305 52004 11733 -41930 -22339 40840 43783 -22760 -52921 42 49421 12363
595 12363 -56885 -46926 27083 43511 -24588 -67183 -12855 55375 27152 -51515 -48390 35450
607C5450L3438o7779n8005N1890Q2516k0405q7878j2747Q3838M6494p0348p5592
619e9128M1558Q6845j0415r4499l0588Q2426N7751o5892q4180K9978R4149O756
631E4761r4692m0620Q1531P1455n0819q8694J8608J00964K0606r1622n1198P1787
643B067Q0210l9968r7579M113R7155K7685q7998o5438N8866Q5715l1972j00461
655f7605p650R2103M1352p6995p2418N0251R0408j5852r1591j7152Q6834N5208
667F6893o2103p3378L8223Q7923p3q3524l0509P3413N8013n0744p4655J9363P9205
680D8047J0502p7749m2094N7746N8265l5366p2393M683P4016K2298o3565m3497
692e9107M5564O1978j7465o5969m107O6278L1135m7602m5670L0660N9889o403
$$ plain form
607 35450 68888 1109 -56896 -5006 77510 57105 -30773 -43520 40318 86812 16464 -59128
619 -59128 -17570 69275 58860 -35639 -66227 16199 73950 8058 -76122 -46144 48005 54761
631 54761 -39931 -80551 980 72435 21616 -67078 -48470 52494 73100 -18522 -69720 2067
643 2067 82277 42309 -55270 -51157 45998 73683 -14315 -79753 -20887 64828 32856 -67605
655 -67605 -75255 16848 58200 -18795 -91213 -40962 49446 33594 -57997 -75149 11685 66893
667 66893 4790 -68588 -30365 57558 57485 -26039 -56548 16865 74878 24134 -50521 -31158 48047
680 48047 58549 -19200 -61294 -3548 54717 19351 -53042 -48359 25657 47955 -15610 -59107
692 -59107 -13543 48435 30970 -34999 -39106 27172 58307 10705 -34965 -4305 55584 49181
704D9181n9927j6279M9208L3920l6202n0420J3524N0220K942n0128k7088L3978
716g071L6786k1952m6070J304M3166J6395l4699k8688K4539L9460n720l7948q149
729b8647L5777K4832k2963l1308J1019L5324L842l3885j8849K3665K5534j5395
741H946l4471k226K9673J1906k6319k4203J4528K8455l155k9181q027K6523K1005
754A3454j4832k3679Q554L0293P737k2446j3858J9414K3818q080k4899j041K4076
767A8511J0980k0191k0248J0190K0858m147k4176q487J8184J3728j4549j9142
779a8489O247K0518L476j7798q904J5839J5706o902j4588K531J7850O861j3448
792H899r031R325J1025l822j3458l103R973K972r701q550J200N916j833r253l476
$$ plain form
704 49181 -10746 -27025 22183 56103 19901 -30519 -16995 33225 36167 -13961 -41049 -7071
716 -7071 29715 7763 -38307 -37003 6163 22558 -12141 -40829 -16290 23170 17450 -20498 -28647
729 -28647 7130 31962 8999 -22309 -11290 24034 27876 -6009 -24858 -1193 24341 8946
741 8946 -25525 -27751 1922 13828 -12491 -36694 -22166 6289 3134 -26047 -34074 -7551 13454
754 13454 -1378 -25057 -16503 13790 21527 -919 -14777 4637 28455 20375 -4524 -5565 18511
767 18511 29491 9300 -10948 -758 20100 15953 -8223 -16710 1474 15202 653 -18489
779 -18489 -12242 8276 11752 -6046 -14950 889 16595 9693 -4895 -2364 15486 22347 8899
792 8899 -132 9193 20218 16396 2938 -165 9808 12780 3079 -5471 -4271 1645 -188 -9441 -12917
807a2917L016J190j004k757k58K961J085J916J429k048N99N022L859o65n461M18
823c615R731K924q512o664M815J0097m012j6022k198J3913O291j3225j5425P833
837a4069J9636k805k0947n191K0135J6144j4353k0643J1514K7931K696k4510j0932
850a5394K4742K3486j6481k7830O911L1208O529l1156j9729K4750K7008j6588
862A7456l5601m89L5189J2127l4078k5326K3632L4012j0005l9669m506L9898J9190
875C1830l1464k9965K0720M0789m261m2745r628L8961K4865k8877l8339J3590
887a4524M2633K19m3217j8938L3255L1166k3888m2957N662M2096R732l8425k6585
900d3771K8279L7762j3196m1044k320M1169K0899l2139l2187K0908M1421k269
$$ plain form
807 -12917 -9901 -8711 -9715 -12472 -12730 -9769 -8684 -6768 -5339 -7387 -6788 -1766 2093 1428 -4033 -3615
823 -3615 6116 9040 528 -6136 -1321 8776 4764 -11258 -13456 457 6748 -6477 -21902 -14069
837 -14069 5567 2762 -18185 -23376 -3241 12903 -1450 -22093 -10579 17352 20048 -4462 -15394
850 -15394 9348 32834 16353 -11477 -4566 26642 33171 2015 -17714 7036 34044 17456
862 17456 -18145 -18634 16555 28682 -5396 -30722 -7090 26922 16917 -22752 -27258 12640 31830
875 31830 366 -29599 -8879 31910 27649 -15096 -24724 14237 39102 10225 -28114 -14524
887 -14524 28109 28328 -14889 -33827 -572 30594 6706 -36251 -30589 11507 21239 -17186 -43771
900 -43771 -15492 22270 9074 -31970 -34290 6879 27778 -4361 -36548 -15640 25781 23512
912B3512m0845j3381L7023K8550k5690l8406R312M1845P211m0208k4140K9819
$$ plain form
912 23512 -17333 -30714 6309 34859 9169 -29237 -19925 21920 29131 -11077 -35217 -5398
$$ [...]
8191f9
##END NTUPLES=NMR FID
##END=
