##TITLE=1H_LY-DiX.30.05
 CD3CN, 8 sc, 
 31.05.2021
##JCAMPDX= 6.0         $$ Bruker NMR JCAMP-DX V2.0
##DATA TYPE= NMR FID
##DATA CLASS= NTUPLES
##ORIGIN= UXNMR, Bruker Analytische Messtechnik GmbH
##OWNER= root
$$ XWIN-NMR		Version 3.5
$$ Mon May 31 12:14:08 2021 Russian Standard Time (UT+4h)  she@DPX200
##.OBSERVE FREQUENCY= 200.131506
##.OBSERVE NUCLEUS= ^1H
##.DELAY= (6, 6)
##.ACQUISITION MODE= SIMULTANEOUS
##.ACQUISITION SCHEME= undefined
##.AVERAGES= 8
##.DIGITISER RES= 18
##SPECTROMETER/DATA SYSTEM= spect
##.PULSE SEQUENCE= zg30
##.SOLVENT NAME= CD3CN
##.SHIFT REFERENCE= (INTERNAL, CD3CN, 0, 15.7039)
##AUDIT TRAIL= $$ (NUMBER, WHEN, WHO, WHERE, WHAT)
$$ ##TITLE= Audit trail, XWIN-NMR		Version 3.5
$$ ##JCAMPDX= 5.01
$$ ##ORIGIN= Bruker BioSpin GmbH
$$ ##OWNER= she
$$ F:/spectra/data/she/nmr/H-F/1/audita.txt
$$ ##AUDIT TRAIL=  $$ (NUMBER, WHEN, WHO, WHERE, WHAT)
(   1,<2021-05-31 12:12:32.10 +0400>,<she>,<DPX200>,
      <created by zg, POWCHK disabled, PULCHK disabled
       configuration hash MD5:
       00 E9 B6 7A A2 85 ED C7 34 08 36 98 17 FE 4E 26
       data hash MD5: 16K
       E0 BF 94 64 A4 DC D5 FB 99 AE B7 E7 A7 A2 8C BB>)
$$ ##END=
$$ 
$$ hash MD5
$$ 38 2E 67 AF 62 DC 9A 00 94 75 F7 B5 CF 14 E8 86
##$RELAX= 
##$RELAX= 
##$RELAX= 
##$RELAX= 
##$RELAX= 
##$RELAX= 
$$ Bruker specific parameters
$$ --------------------------
##$DU= <F:/spectra>
##$EXPNO= 1
##$NAME= <H-F>
##$PROCNO= 1
##$TYPE= <nmr>
##$USER= <she>
##$AMP= (0..31)
100 100 100 100 100 100 100 100 100 100 100 100 100 100 100 100 100 100 
100 100 100 100 100 100 100 100 100 100 100 100 100 100 
##$AQSEQ= 0
##$AQ_mod= 1
##$AUNM= <au_zg>
##$AUTOPOS= <>
##$BF1= 200.13
##$BF2= 200.13
##$BF3= 200.13
##$BF4= 200.13
##$BF5= 200.13
##$BF6= 200.13
##$BF7= 200.13
##$BF8= 200.13
##$BYTORDA= 1
##$CFDGTYP= 0
##$CFRGTYP= 5
##$CHEMSTR= <none>
##$CNST= (0..31)
1 1 145 1 1 1 1 1 1 1 1 1 1 1 1 1 1 1 1 1 1 1 1 1 1 1 1 1 1 1 1 1 
##$CPDPRG= <>
##$CPDPRG1= <>
##$CPDPRG2= <>
##$CPDPRG3= <>
##$CPDPRG4= <mlev>
##$CPDPRG5= <mlev>
##$CPDPRG6= <mlev>
##$CPDPRG7= <mlev>
##$CPDPRG8= <mlev>
##$CPDPRGB= <>
##$CPDPRGT= <>
##$D= (0..31)
0 1.2 0 0 0 0 0 0 0 0.06 0 0.03 0 0 0 0 0.0002 0 0 0 0 0 0 0 0 0 0 0 0 
0 0 0 
##$DATE= 1622448751
##$DBL= (0..7)
120 120 120 120 120 120 120 120 
##$DBP= (0..7)
150 150 150 150 150 150 150 150 
##$DBP07= 0
##$DBPNAM0= <>
##$DBPNAM1= <>
##$DBPNAM2= <>
##$DBPNAM3= <>
##$DBPNAM4= <>
##$DBPNAM5= <>
##$DBPNAM6= <>
##$DBPNAM7= <>
##$DBPOAL= (0..7)
0.5 0.5 0.5 0.5 0.5 0.5 0.5 0.5 
##$DBPOFFS= (0..7)
0 0 0 0 0 0 0 0 
##$DE= 6
##$DECBNUC= <off>
##$DECIM= 32
##$DECNUC= <off>
##$DECSTAT= 4
##$DIGMOD= 1
##$DIGTYP= 9
##$DL= (0..7)
0 120 120 120 120 120 120 120 
##$DP= (0..7)
150 150 150 150 150 150 150 150 
##$DP07= 0
##$DPNAME0= <>
##$DPNAME1= <>
##$DPNAME2= <>
##$DPNAME3= <>
##$DPNAME4= <>
##$DPNAME5= <>
##$DPNAME6= <>
##$DPNAME7= <>
##$DPOAL= (0..7)
0.5 0.5 0.5 0.5 0.5 0.5 0.5 0.5 
##$DPOFFS= (0..7)
0 0 0 0 0 0 0 0 
##$DQDMODE= 0
##$DR= 18
##$DS= 0
##$DSLIST= <SSSSSSSSSSSSSSS>
$$ [...]
##$SUBNAM2= <"">
##$SUBNAM3= <"">
##$SUBNAM4= <"">
##$SUBNAM5= <"">
##$SUBNAM6= <"">
##$SUBNAM7= <"">
##$SUBNAM8= <"">
##$SUBNAM9= <"">
##$SW= 16.9725357007746
##$SWIBOX= (0..15)
0 0 2 0 0 0 0 0 0 0 0 0 0 0 0 0 
##$SW_h= 3396.73913043478
##$TD= 16384
##$TD0= 1
##$TE= 0
##$TE2= 300
##$TE3= 300
##$TEG= 300
##$TL= (0..7)
0 120 120 120 120 120 120 120 
##$TP= (0..7)
150 150 150 150 150 150 150 150 
##$TP07= 0
##$TPNAME0= <>
##$TPNAME1= <>
##$TPNAME2= <>
##$TPNAME3= <>
##$TPNAME4= <>
##$TPNAME5= <>
##$TPNAME6= <>
##$TPNAME7= <>
##$TPOAL= (0..7)
0.5 0.5 0.5 0.5 0.5 0.5 0.5 0.5 
##$TPOFFS= (0..7)
0 0 0 0 0 0 0 0 
##$TUNHIN= 0
##$TUNHOUT= 0
##$TUNXOUT= 0
##$USERA1= <user>
##$USERA2= <user>
##$USERA3= <user>
##$USERA4= <user>
##$USERA5= <user>
##$V9= 5
##$VALIST= <valist>
##$VCLIST= <CCCCCCCCCCCCCCC>
##$VD= 0
##$VDLIST= <DDDDDDDDDDDDDDD>
##$VPLIST= <PPPPPPPPPPPPPPP>
##$VTLIST= <TTTTTTTTTTTTTTT>
##$WBST= 1024
##$WBSW= 4
##$XGAIN= (0..3)
0 0 0 0 
##$XL= 0
##$YL= 0
##$YMAX_a= 148653
##$YMIN_a= -149005
##$ZGOPTNS= <>
##$ZL1= 120
##$ZL2= 120
##$ZL3= 120
##$ZL4= 120
##$ABSF1= 10
##$ABSF2= 0
##$ABSG= 5
##$ABSL= 3
##$ALPHA= 0
##$AQORDER= 0
##$ASSFAC= 0
##$ASSFACI= 0
##$ASSFACX= 0
##$ASSWID= 0
##$AUNMP= <proc_1d>
##$AZFE= 0.1
##$AZFW= 0.1
##$BCFW= 1
##$BC_mod= 2
##$BYTORDP= 1
##$COROFFS= 0
##$CY= 11.3945322036743
##$DATMOD= 1
##$DC= 2
##$DFILT= <>
##$DTYPP= 0
##$F1P= 15.9154993809931
##$F2P= -4.1035820241983
##$FCOR= 0.5
##$FTSIZE= 0
##$FT_mod= 4
##$GAMMA= 1
##$GB= 0.15
##$INTBC= 1
##$INTSCL= 1
##$ISEN= 128
##$LB= 0.24
##$LEV0= 0
##$LPBIN= 0
##$MAXI= 10000
##$MC2= 0
##$MEAN= 0
##$ME_mod= 0
##$MI= 1.114404
##$NCOEF= 0
##$NC_proc= 0
##$NLEV= 6
##$NOISF1= 3.799351
##$NOISF2= 2.8
##$NSP= 1
##$NTH_PI= 0
##$NZP= 0
##$OFFSET= 15.70392
##$PC= 1
##$PHC0= -11204.96
##$PHC1= 15.00099
##$PH_mod= 1
##$PKNL= yes
##$PPARMOD= 0
##$PSCAL= 0
##$PSIGN= 0
##$REVERSE= no
##$SF= 200.130013532006
##$SI= 16384
##$SIGF1= 3
##$SIGF2= 2
##$SINO= 400
##$SIOLD= 16384
##$SREGLST= <1H.CDCl3>
##$SSB= 0
##$STSI= 0
##$STSR= 0
##$SW_p= 3612.71676300578
##$SYMM= 0
##$S_DEV= 0
##$TDeff= 0
##$TDoff= 0
##$TI= <>
##$TILT= no
##$TM1= 0
##$TM2= 0
##$TOPLEV= 0
##$USERP1= <user>
##$USERP2= <user>
##$USERP3= <user>
##$USERP4= <user>
##$USERP5= <user>
##$WDW= 1
##$XDIM= 8192
##$YMAX_p= 0
##$YMIN_p= 0
$$ End of Bruker specific parameters
$$ ---------------------------------
##NTUPLES= NMR FID
##VAR_NAME=  TIME,          FID/REAL,        FID/IMAG
##SYMBOL=    X,             R,               I
##VAR_TYPE=  INDEPENDENT,   DEPENDENT,       DEPENDENT
##VAR_FORM=  AFFN,          ASDF,            ASDF
##VAR_DIM=   8192,          8192,            8192
##UNITS=     SECONDS,       ARBITRARY UNITS, ARBITRARY UNITS
##FACTOR=    0.0002944,     1,               1
##FIRST=     0,             0,               0
##LAST=      2.4114304,     0,               0
##MIN=       0,             -149005,         0
##MAX=       2.4114304,     148653,          0
$$ Real data points
##PAGE= N=1
##DATA TABLE= (X++(R..R)), XYDATA
0@%%%%%%%%%%%%%Qj6J6j6J6k4L2l3M1m9N7p2Q6r6J08j26J49j71J95k24K53k85
35a51L22l62M07m57N09n67O30p01P80q61R50j050J160j280J409j553J712j885
53i88K078k294K535k805L115l470L883m373M958n678O588p773R395j1771J5605
68I005k3091O0551j49628M8014K03802k28397L5167J56354j77915J1063J78506
79A23431j81489p163J72609j53706k0004J89307j75084m9754K37376j35282j35085
90a34844K29128n7696j47517J77264l0584j41987J68589j3400j51169J47557N181
101E0522j47453J50401P570j82570J58332O9345k18416R9198J24278j85015M6696
112b7112J23765j60288L0068J30921j46725O095J29783j31641N254J37354j48250
$$ y = [0, 0, 0, 0, 0, 0, 0, 0, 0, 0, 0, 0, 0, 0, 8, -8, 8, -8, 8, -16, 16, -17, 24, -25, 32, -40, 46, -50, 58, -68, 81, -90, 105, -119, 134, -151, 171, -191, 216, -241, 268, -299, 331, -370, 410, -451, 499, -551, 609, -671, 738, -815, 897, -988, 1090, -1204, 1331, -1474, 1641, -1829, 2054, -2319, 2639, -3039, 3549, -4224, 5171, -6600, 9005, -14086, 46465, -103163, -55149, 148653, -79744, -44577, 111777, -66138, -55075, 123431, -58058, -65221, 107388, -46318, -66322, 122985, -52099, -101853, 135523, 241, -134844, 94284, 36588, -110929, 66335, 35751, -106236, 62353, 48953, -102216, 45341, 50522, -96931, 53470, 61040, -121530, 36802, 106147, -112269, -13071, 111207, -73808, -27112, 96653, -63635, -33567, 97354, -49371, -43276, 86507, -45134, -39880, 97474, -50776]
123e0776j8772J82728j29014q3268J85549o9881j07857J54870m0265j10631J39474
134E2157j8235j14304J19679q023j07485J23365q255j35308J33944L5334j66872
145i4003R6166Q1738j53236N4599R3964j34861L0938J01356j17592J2068R6114
156F7251j06843J4720J02266j22828q80J38503j15178m8395J50500p6275p7092
167g4251J36243m6364q8508J20294k2904q9441J01908j6272q3136J05428j7626
178B5371j03326J16107J1158j30794R6002M9327j31884O3597P0444j19021L6279
189a6740P8218j00277K0285P2266r1274K2253P5951j02587J3814J01620j03826
200c0297j8091J20640q1772m9912J19434n2051o7597J04240k8927o8074Q9283
$$ y = [-50776, -69548, 113180, -15834, -99102, 86447, 16566, -91291, 63579, 23314, -87317, 52157, 33922, -80382, 39297, 31274, -76211, 47154, 38899, -96409, 37535, 72869, -94003, 2163, 83901, -69335, -14736, 79228, -55633, -24695, 76661, -40931, -28863, 67251, -39592, -24872, 77394, -45434, -46314, 92189, -22989, -71384, 79116, 2841, -74251, 61992, 15628, -72880, 47414, 24510, -64931, 36977, 20705, -62431, 42997, 25371, -77955, 38152, 49310, -81484, 14518, 63845, -68039, -4442, 66002, -53019, -16740, 61478, -38799, -18514, 53752, -37522, -15269, 60682, -41905, -28091, 73529, -30297, -48388, 72252, -9520, -59432, 60002, 7951, -59646, 44594, 15667, -52407, 36876]
211C6876k3374o4982R1212k3075p8301J00132o754j01818R4907K4528j15693P0190
223C848N3227j08091M0543O2000r0062K6696N8230q3078K5004O1369q7512K0063
235a7763P6175r3032J894R8112q4162l0465J06212n5113n1849R1295l2955n1613
247d3264P9493k7864n1659P8996k4843n7941Q4041j9716p5045R0807K670r8101
259f2426P5074L5353r6527M5989M5500q1503L4359M5031p7383K9090M8958p6328
271c4813K5976N5064q4463J9209P8078q6892j1587R4328o0918l6247Q2444l9535
283F44l8088P3735l2607m1956P0316k5453m3189P0386k6937n3903Q3531j1950
295B4529q0944P4421K1243q3558M7705L2195p2170L7541L5315o9876K8603L9607
$$ y = [36876, 13502, -51480, 39732, 16657, -61644, 38488, 31734, -70084, 24823, 49351, -66342, 3848, 57075, -51016, -10473, 51527, -38535, -11839, 46391, -36687, -11683, 49686, -37826, -17763, 58412, -34620, -32726, 65386, -18776, -49241, 56971, 1858, -49991, 41304, 8349, -43264, 36229, 8365, -43294, 35702, 10859, -47082, 36959, 17243, -57802, 33005, 35675, -62426, 12648, 48001, -48526, -2537, 42963, -38540, -4181, 40850, -36533, -7443, 41515, -34813, -8837, 46227, -38236, -19027, 59051, -27841, -39428, 54900, -6018, -42265, 40179, 644, -37444, 36291, 3684, -38272, 32044, 6591, -36598, 33788, 6851, -47052, 36479, 24529, -56415, 18006, 39249, -44309, 3396, 35591, -36579, 962, 36277, -33599, -4996, 34611]
307C4611o4048K6492L8945p3123K7864O0949q2862N76Q1195o1737k3779P3680
319C8763m3932k8308O9548l5171l6012O3786k4859l3457O0284l0742l9359P6653
331C7194k1188o6904P2135R708p1942M9490K0784o5090M0528K8117o3919K7431
343c656L2681n3305K5358K6292o1547L2435M5517p5392R754O6713n9396j2121
355b6667O3109m6257j8582O3770l6908k9872N7175k4004k5303N0859l2488k7003
367c2171O8709k8267n3284O9178j517o1120N2062R628n9190M4843K0309o0051
379c0871K9532K6445m7134K5827J7130n2503L5916L1581o8157J9251N2399n8004
391a8588j69N2900m8256q414N6592l9009k1667N0788k4725j7690M2185l2473j5302
$$ y = [34611, -29437, -2945, 36000, -37123, -9259, 51690, -31172, -30596, 50599, -11138, -34917, 38763, -5169, -33477, 36071, 900, -35112, 28674, 3815, -29642, 30642, -100, -39459, 37194, 16006, -50898, 21237, 30945, -40997, 8493, 29277, -35813, 4715, 32832, -31087, -3656, 29025, -24280, 1078, 27370, -34177, -1742, 43775, -31617, -21863, 44850, -14546, -26667, 36442, -9815, -28397, 35373, -1535, -31407, 25768, 1764, -23539, 27320, -5168, -32171, 36538, 8271, -45013, 24165, 22648, -38472, 13590, 23218, -35972, 8871, 29180, -30871, -1339, 25106, -22028, 3799, 20929, -31574, 4342, 35923, -32234, -12983, 39416, -18588, -18757, 34143, -14113, -22527, 34065, -4944, -26611, 24177, -548, -18238, 23947, -8526, -23828]
404b3828N7909l3788l7072O3729j3646m8218N3550j959n1319M7813J0716n4200
416c0313L3056J8460m2779K7710J0225m5213L7321J9515o0055K7696L8209n7006
428b3174J1591M4078n0687O06N0066m1064j3386M5424k6877j1688L6797l1223
440i537q314M7630l4397k3640N5371k1502l5911N1800r864m3398M6752M161m6793
453b7642L3158J1972l7760K7475O263l8329L4523J1317m9885L0830K5618n2871
465b5331J9745L5789n0820P046M3888m1598o607M0823k9249p099L3975l0352m510
478a4300L9960l3547j3510M7817k7394k5285M9798j6712l5880M5690k305l9725
490b5393L3787N712l3536K7398L321l2033L0711M709l9256L1551J4077m6363K5345
$$ y = [-23828, 34081, 293, -36779, 26950, 13304, -34914, 18636, 16677, -34642, 13171, 23887, -30313, 2743, 21203, -21576, 6134, 16359, -28854, 8467, 27982, -32073, -4377, 33832, -23174, -11583, 32495, -18192, -17586, 32480, -8584, -21970, 23454, -3423, -15111, 21686, -9537, -17851, 29779, -4618, -28258, 27113, 5611, -30300, 21500, 11636, -31762, 14990, 19151, -27642, 5516, 17488, -20272, 7203, 13466, -24863, 9660, 20977, -28908, 1922, 27540, -25331, -5586, 30203, -20617, -13571, 30317, -11281, -17888, 22935, -6314, -13413, 20562, -9790, -14300, 25660, -7887, -21397, 26420, -974, -26259, 23539, 6827, -29053, 16637, 14332, -25393, 8394, 14106, -19430, 7968, 11289, -20744, 9967, 14676, -24580, 6971, 21048, -25315, 30]
503C0K6523m7886J2654L5701m0399M27L5078l0889k756L0838k8788j529L2406
516B1410l1732m786M0251l1655j5902M6969k2276k8506M4150q733l3031L5346
528A1505n33l1009K8649J506k8189K7491M74l0899L1357N425m0489K8687J9056
541B3031m3857J6354K7868l7924O326K9428l1548M91K8070k6169l21K5363k7876
554a0764J483L2025l2681q131M2045k5041k1340M0425j3652k5860L5528o439k8193
567b0595K9898k89k5437K4922k523k4181L0640j453l5171L1180J2392m0075J9809
580h83K0726l5812J2000K4296l2543L931K6057k4649M64K0419k4177N325K4959
593B0113l1519k171L6064k5753j4607L5467j6854j8990L3829j0772k4483K9444
$$ y = [30, 26553, -21333, -8679, 27022, -13377, -12950, 22128, -8761, -11517, 19321, -9467, -10996, 21410, -10322, -15108, 25143, -6512, -22414, 24555, 2279, -26227, 17923, 9190, -23841, 11505, 10972, -20037, 8612, 10118, -18071, 9420, 9894, -21005, 10352, 15777, -24712, 3975, 23031, -20826, -4472, 23396, -14528, -8202, 21226, -10322, -9831, 18239, -7930, -8251, 17112, -10764, -9281, 22744, -9937, -18068, 23977, -1064, -22404, 18021, 4369, -21491, 14037, 7598, -20595, 9303, 9014, -16423, 8499, 5976, -18205, 12435, 10982, -24189, 6991, 19383, -20692, -883, 19843, -15969, -3969, 20327, -12216, -8285, 17772, -6877, -6413, 14006, -10171, -4846, 20113, -11406, -13577, 22487, -3266, -17873, 17594, 740, -18250, 15579, 4807, -19676, 9768]
605I768j987k2254K2034m552j8290K8343o461k9062L1484N863l5117K2696J3423
618A5888l3582J7474J9043l3533Q259K3622k4711K712J6870k2553Q820J9693l0742
631a2740L282L0471k6846p458L1057k0712j2146L2548j5201k0497K9052m203j9077
644a2470J9852o212j3550K5494r650k3006K9626M38k8880K3669O322k9871K1283
657C045J3496l2888J1602K0593k4141M500J3855k0894J0952J5435k9143P085K5361
670A8858k6832j562K6829k3612n943L1141j9360j6428K9286p075j6630J9303p626
683C49j0588K3310j1408j8130K7404l598k3340K3541Q49k5806K3055Q461l0769
696a6670J3970J7077k3150N733J1568j8755J1103J1582k5720R286J9708k5281
$$ y = [9768, 7781, -14473, 7561, 3009, -15281, 13062, 6601, -22461, 9023, 14886, -20231, 2465, 15888, -17694, -220, 18823, -14710, -6451, 17171, -7540, -4828, 12042, -10511, -1691, 18002, -12740, -9458, 21013, -5833, -13291, 17766, -2946, -15092, 17456, 2255, -18242, 10810, 6607, -12470, 7382, 1170, -12380, 13114, 3464, -19542, 10084, 10522, -18358, 5311, 11633, -18238, 3045, 16541, -16347, -4745, 15848, -8293, -3793, 10062, -10832, 120, 15555, -13588, -6503, 18858, -7974, -9536, 17293, -6319, -12262, 18879, -481, -16909, 12377, 5302, -11328, 7975, 349, -10239, 13071, 1663, -16467, 10937, 7339, -16001, 7540, 8389, -17417, 5638, 14099, -16670, -2700, 14377, -8773, -3040, 8528, -10227, 876, 12458, -13262, -3976, 15732, -9549]
708i549L012K2196k4435r41K8182k1783j1805K8451j0163j4073J9590q830q870
721i018K1512j2239j3865K5361p306j8606K4006l760k2482K4427L772k8126J6677
734C53J2707k2740Q178R821j7817J0701Q762k1861J0361J4026k2937O739J7442
747A3735k3889K758K3969k2077p044K5578j2609j0777J9222r593p551J9020j1689
760i47r760K1987r929j3577K3325p306j8892K4595k49k4572J8729P926k2001J1296
774F25Q055j7870J0800O983j8937J1162R269k0974R982J3358k3371N903J9876
787A4861k1984k443K2249j4945p203J8716j0585o510J6645j0605o252J8008j1388
800a436q676K1381r985j4599K3246l847k0037J9662L147k0287J3908O014j7479
$$ y = [-9549, -6537, 15659, -8776, -9717, 18465, -3318, -15123, 13328, 3165, -10908, 8682, -148, -9018, 12494, 255, -13610, 11751, 4445, -14161, 9845, 6085, -16397, 8030, 11802, -16324, 353, 13060, -9680, -1502, 8319, -9498, 1203, 9965, -11896, -1535, 12491, -10446, -3707, 13735, -10154, -7396, 16573, -5504, -12548, 13030, 421, -10356, 8866, -727, -8278, 10742, -947, -10707, 11280, 1351, -12226, 11099, 3793, -15099, 9496, 9247, -15325, 3404, 11330, -10671, 625, 8680, -9190, 1610, 8593, -10344, 818, 10087, -10887, -905, 12453, -10918, -5015, 14861, -7123, -9566, 12683, -2262, -9465, 9251, -1334, -7844, 8801, -1804, -8056, 9952, -1436, -10112, 11269, 1284, -13315, 9931, 6084, -13953, 5709, 8856, -11431, 2477, 8491, -8988]
813h988J0907N336j6137J1646N258j8850J2470R629k2355Q681J5724k1698K151
826f226J8994j7491l520J8499j2097n588J5152r977l809J4988j2185n254J9243
839A0729j1159j1044K0806o193j5403J9295q33j8052J5331M403j6517J0106M253
852E722j3113J1039K293j6176J3252O640k0001R943J1569k0032N903J5344j9077
865f694K7J7901j3556m378J4021r901j641J2842j3183k452J7668j2373p909J8785
879I157q663j1067J9142n042j5805J7110K212j5902J0158L152j0939J0475Pj3654
893i659J3348M044j7211J0408P639j7455Q661J1242j9184L328J6202j4291k839
906e767J2630r514K4J0590j3092m1J5330j2839m637J6283j0669o728J8337q948
$$ y = [-8988, 1919, 7255, -8882, 2764, 8022, -10828, 1642, 11271, -11084, -2403, 13321, -8377, -6226, 12768, -4723, -8243, 10256, -1841, -7429, 7723, -2254, -6063, 8925, -3260, -8514, 10729, -430, -11474, 9332, 3139, -12264, 7031, 6198, -11854, 3477, 7880, -8637, 1469, 5722, -7391, 3648, 5941, -10235, 3017, 9657, -10344, -401, 11168, -8864, -2961, 12383, -6694, -6667, 11234, -2322, -6700, 7321, -2580, -4221, 8621, -4562, -7014, 10654, -1719, -9628, 9157, 494, -10573, 8569, 3527, -12278, 4832, 7044, -8858, 1300, 4452, -6487, 3988, 3995, -9659, 3689, 7733, -9478, 930, 8569, -8886, -225, 11017, -8167, -4839, 11363, -2928, -5767, 6863, -2651, -2627, 7963, -5129, -5170, 10160, -2679, -7316, 8967, -1702, -8430, 9907, 959]
920I59j2744J8409r76j4662J1153J274r604J0653j889j1647J3331J507j4542J0993
934B215L873j5077J0907P349j8582O228J3783j4571q73J1078r275J236Q735j2093
948e067J410J2420j1909j770J2986j1337k816J6323j1224r399J8012l498j2584
961h453J1627o50q378J0790l170j0019J2831m48j1953J1247M98j2896J2844L738
975G608j7887R019J1161j5020J527R644r784K607P609j1672K382J0370j0966J76
989c226J0208j1322J87J4104j2454o418J7080n396j0464J1549k013p219J0399
1002E015l725q436J1697j646r456J0627j846j0376J3397M95j6072J1117P944j5028
1016f293M194Q059j0543M016O601j1469L583Q517j0724K125Q176j1476K615J1915
$$ y = [959, -11785, 6624, 5648, -9014, 2139, 3413, -6191, 4462, 2573, -9074, 4257, 5764, -8778, 2215, 6088, -8989, 1918, 9267, -9315, -3087, 10696, -3875, -4748, 6330, -2945, -1709, 7026, -5067, -3657, 8763, -3146, -4916, 8070, -3267, -6083, 10240, -984, -10383, 7629, 4131, -8453, 3174, 2524, -5854, 4936, 1766, -8253, 4578, 4130, -7823, 3424, 3922, -8974, 3870, 7608, -10279, -1260, 9901, -5119, -3592, 6052, -3732, -1125, 6484, -5188, -2806, 7564, -3402, -3226, 6982, -4340, -4153, 9951, -2503, -8921, 8159, 2763, -7701, 3848, 1835, -5384, 5015, 1290, -7146, 4551, 2905, -6551, 4076, 2230, -8146, 5251, 5746, -10326, 791, 8735, -6293, -2099, 5960, -4583, -567, 6034, -5435, -1852, 6665, -4059, -1934, 6242, -5234, -2619, 9296]
1030I296j3381l066J5739p826p929J2036l762o422J0227m029o951J0468k629p277
1044e506R863l224q181J2636j566j3381J1724M747j4018O301O532j0983M700N905
1058E549j0587M104O516j0035L773O367j1350M296R677j3434J11J3641j0169m749
1072f290J2472o143n524J0587m704n635R685l945n372R711m605o553J1984l257
1086B411j0624J1936J423j2536Q434M610j1275N445N285r572M171M738q891M703
1100B58M737j0503N023P441j2284K415J0870j1289j604J2047q111m355J0627n280
1114hm366Q856n087l625R497n799n068J1254m739p945J1956j828j0820J0475K327
1129E080j1406O610M383q992M624L291q191N438L612r631N180N537j0685L973
$$ y = [9296, -4085, -7151, 8588, 762, -7167, 4869, 1107, -5315, 4912, 883, -6068, 4400, 1771, -5506, 4357, 1133, -7048, 5588, 4022, -9359, 2365, 7112, -6906, -605, 5927, -5056, -356, 5549, -5038, -934, 5582, -4453, -680, 5687, -5663, -1367, 8310, -5124, -5013, 8628, -1541, -6290, 6182, 39, -5485, 5102, 398, -5237, 4448, 503, -4869, 4842, 237, -6316, 5668, 2411, -8213, 3723, 5146, -7390, 1044, 5654, -5621, -176, 5109, -4463, -292, 4446, -4445, 258, 4995, -5508, -485, 6956, -5328, -2913, 7957, -3332, -4936, 7111, -1000, -5355, 5272, -8, -4374, 4482, -605, -4230, 5267, -532, -5600, 5654, 915, -7030, 4926, 3098, -7722, 2753, 5080, -6326, 284, 4667, -4325, 299, 3590, -4601, 837, 4449, -5182, -2, 5535, -5150, -1177]
1143a177Q119j1448Q28J1111r078l407J0176n248l427P839n423k495Q890n927
1157f67m063R871n193n477J1136m252q928J1716L08j1204P590L317q495N353J931
1172B943p957O326K791r174N359M002r368N327N670j1580L100J0132j0000k301
1186d730R701n430k493P110n697j738Q364n632l435Q359m914l462R706n636o950
1201f877J1900j183j0445P919K436p817N617R53p510O664K170q572N296K738q112
1216d823O246L408j1346N242Q616j0910m80R047o378j117O733o513p54Q010n891
1231i10k517P315n097j692Q553o785m909J1684k812r095Q308J156p122O002J87
1246B266o987O601J622p594M938J649o717O486J567j0340O420O757j0868J170
$$ y = [-1177, 6942, -4506, -3678, 7433, -1645, -5052, 5124, -124, -3551, 4288, -1135, -3630, 5260, -667, -4730, 5141, -52, -5529, 5607, 1355, -7573, 4143, 4451, -6753, 837, 4154, -4341, 1012, 2943, -5014, 1312, 4103, -5071, 288, 4290, -5078, 249, 5919, -5661, -2561, 7571, -2429, -4730, 4971, -459, -2952, 4158, -1539, -3277, 5087, -545, -3980, 4379, -535, -3997, 5709, 73, -6877, 5023, 3840, -6605, 1314, 3750, -4067, 1550, 2503, -5007, 1657, 3827, -4745, 551, 3289, -4823, 1423, 4831, -6515, -1273, 7343, -3567, -4047, 5000, -1378, -2495, 4238, -2275, -3029, 4981, -910, -3427, 3888, -1209, -2901, 5652, -1133, -6042, 5642, 2830, -6265, 2043, 3199, -3923, 2079, 2266, -4721, 1880, 3502, -4092, 846, 2495, -4222, 2264, 3831, -6509, -89, 6668, -4200, -3030]
1260c030P924p108J75O370p103p9P567o001j646O400n407k38P645p649l130J1158
1276E848m294p434Q694n26o379O758o33o679O637J208o757M646Q27n549O380L31
1292C078r054O801N039j0132K365O582p314J140N874p212K62O957n722j111N477
1307C030n259O65O510p797j582J0138n465n627Q808k212n550P482j595o330O938
1322B154N08o159M887L8m874O448o17p911P196L323r445L727N316p644K094N473
1338D514p255O50O358n575o75M907m975R15N469p200m68Q631o048l924Q540l448
1354D16m845P726k180n779O882k74n531N173n51m467O270j247o635P311J454q562
1370d839N320L860q137L287N045p399J356N606n727K06M614n127R94M875o431
$$ y = [-3030, 4894, -2214, -2039, 4331, -2772, -2851, 4716, -1285, -2931, 3469, -1938, -2176, 5469, -2180, -5310, 5848, 1554, -5880, 2814, 2288, -4091, 2667, 2034, -4645, 1992, 3200, -3557, 1089, 1916, -3633, 2747, 3078, -5976, 825, 5864, -4268, -1903, 4679, -2635, -1495, 4379, -2833, -2571, 4386, -1336, -2447, 3030, -2229, -1564, 4946, -2851, -4433, 5705, 240, -5387, 3421, 1209, -4341, 3141, 1546, -4784, 2154, 2662, -3497, 1390, 1428, -3446, 3002, 2385, -5526, 1670, 4993, -4452, -725, 4591, -3053, -959, 4514, -2741, -2091, 4267, -1308, -1983, 2924, -2051, -1136, 4333, -2867, -3335, 5296, -752, -4676, 3864, 416, -4429, 3297, 1117, -4662, 2220, 1946, -3585, 1588, 1037, -3430, 2840, 1593, -5042, 2269, 3723, -4839, 481, 4341, -3796, -509, 4536, -2863, -1507, 4099, -1628, -1422, 3192, -1935, -941, 3934, -2497]
1385b497K73P051o238k320Q073m326m350P655k172n363O284n85m920N088o61m371
1401c379N576j001n424O460K25p302O016K671q153L913M627p152J767M795n746
1416b107J138M301n401J190M430n822J022N560o461m75P488n502l318P636k793
1431H86m493O023j457m123N291j169m113N052j025m184N634j085n747O438J178
1446C106p646M471L717o657K292L741n625J934L836n380J283L807n009J691L989
1461C550o426J229O599o344k061P337l557l313N861k582l251N708j841l879M826
1476A856j160l147N013k155m476O722m4p118M846K885o164K725K808n530K460
1491d79L621n322R74L470m042J705K736n858K122N665o441j256O715l750k376
$$ y = [-2497, -2224, 4827, -1411, -3731, 4342, 16, -4334, 3321, 1149, -4214, 2070, 1485, -3435, 1653, 992, -3379, 2197, 1196, -4228, 2232, 2457, -4845, 1171, 3842, -4311, -398, 4229, -2923, -1156, 3639, -2107, -969, 3332, -2069, -879, 3551, -2271, -1249, 4311, -2150, -2625, 4863, -639, -3957, 3679, 886, -3607, 2416, 959, -3164, 2127, 958, -3155, 1897, 872, -3312, 2322, 1237, -4510, 1928, 3106, -4540, -69, 3648, -3009, -717, 3024, -2601, -667, 3169, -2211, -928, 2879, -2130, -439, 3550, -2876, -1647, 4952, -1392, -3453, 3884, 327, -2986, 2875, 293, -2958, 2750, 909, -2970, 1856, 696, -2451, 2562, 407, -4069, 2653, 2609, -4509, 337, 3222, -2942, -217, 2591, -2939, -479, 3142, -2180, -1206, 2264, -1778, -73, 2663, -3195, -1073, 4592, -1849, -3105, 3610, -140, -2516]
1506b516N436l230k528N888k235l679M589j151k340M430k917l300O830j234o366
1521d323N336J760n670L444J753n468L234L090n413J167L071l533J782J789n274
1536c255K751M605o330l79N920l939j529M994l641j920N731k402l383M252j059
1551D16j791L779l085k258O310k029n232N456N86m977M087P04n261L941K360n357
1567b351J709K482l350K178R65m835L425L334o159Q96M831m479k43M542m294j129
1583b478N504k799k847M003j229j340L267l010j509N515k413m011N157m10m136
1598b736M388k8m885M161J851n027J928K038l093K243N30m226L518K306n590J814
1614h08L670m712R13L956m788k88N161l307k103L840j671r41L024l034q93M772
$$ y = [-2516, 2920, -310, -2838, 3050, 815, -2864, 1725, 574, -1766, 2664, -253, -3553, 3277, 2043, -4323, 1013, 2773, -2897, 547, 2300, -3168, 66, 3156, -2257, -1090, 1981, -1552, 230, 2019, -3255, -504, 4101, -2229, -2608, 3312, -627, -2156, 2838, -803, -2723, 3008, 606, -2777, 1475, 416, -1375, 2404, -681, -2939, 3371, 1342, -3890, 1566, 2152, -2825, 1262, 1966, -3295, 646, 3006, -2351, -642, 1840, -1510, 668, 1633, -3202, 223, 3557, -2602, -1706, 3125, -1354, -1597, 2945, -1349, -2478, 3026, 227, -2620, 1383, 154, -1186, 2081, -929, -2438, 3077, 664, -3347, 1810, 1400, -2736, 1652, 1624, -3261, 900, 2751, -2276, -348, 1690, -1403, 840, 1370, -2856, 662, 2968, -2622, -808, 2862, -1850, -937, 3019, -1769, -2057, 3104, -203, -2306, 1534, -137, -1078, 1946, -1088, -1981, 2791]
1630B791k753k839M809j328l332M568o95m446M271J317m670K148J719k953K084
1645F91N01l579L162J539m747K251K710m610J573L447m835K98M624l590j375L755
1661A815k132p56K933k872m90M021l055j699M564k274k624M766j364l876M388
1676A345M53m220K742J169l143K211N68l128K750Q92l935K626J874m477J952L073
1692B752m583N74L993l604p32L647k471q20K982k398m59L177k891p70M103k878
1708c78k036M740j762l274M274l79l592L329M25l309K509N82k804K462K30l209
1724b192L087R83m418K492K612m425R91L273l663N9L447k923p64L128k040n85
1740i38K512k533j55L563l103j581M512j843k772L929q70l006L607r0l384K684
$$ y = [2791, 38, -2801, 2008, 680, -2652, 1916, 1221, -3225, 1046, 2363, -2307, -159, 1560, -1393, 691, 1192, -2387, 775, 2314, -2433, -182, 2528, -2082, -509, 2938, -1897, -1599, 3025, -565, -1940, 1815, -317, -1073, 1860, -1012, -1502, 2519, -536, -2235, 2329, 55, -2569, 2197, 833, -3043, 1345, 1798, -2422, 320, 1489, -1654, 557, 1125, -2003, 747, 1639, -2296, 330, 2204, -2273, -321, 2752, -1831, -1257, 2736, -868, -1600, 2047, -424, -1244, 1738, -660, -1119, 2058, -833, -1603, 2500, -378, -2414, 2326, 564, -2710, 1564, 1185, -2407, 922, 1347, -1962, 547, 1129, -1675, 787, 1017, -2192, 895, 1878, -2540, -48, 2564, -1861, -870, 2403, -1260, -1201, 2246, -677, -1441, 1687, -353, -938, 1574, -959, -1114, 2449, -654, -2235, 2277, 434, -2338, 1591, 721, -2285, 1322, 1232, -2152, 532]
1756E32O62k567K117j97k513L316J48m121K957J905m155J638K338l788J106L040
1772B418l520k86L112k071l36J950k488N60L052l394r55M152k094k024L598j508
1788A66k338L852o38l356K824P08k379J781l89j916L203l50l672L035J342l664
1804a791J974J489l653J890K562l880J80L010k114r7J510k446J139K545l598k82
1820a562L683k404j185L243k206j535M012j351l130L070M83k218J655n39j543
1835a527L033o11l251K921R81l201K047R81l431K204K277l952L53K985k093j35
1851d19J408k232J176K206l396L5L224k474n95K914k600r41L972j904k703L241
1867I12pk023J793q06j280K934r86k707K949K88k749K377L44l247K630J728l920
$$ y = [532, 1194, -1373, 744, 547, -1966, 1350, 1498, -2623, 334, 2239, -1916, -278, 2060, -1728, -622, 2418, -1102, -1388, 1724, -347, -683, 1267, -1221, -661, 2391, -1003, -1958, 2194, 100, -1924, 1674, 166, -2172, 1680, 1042, -2314, 510, 1218, -1161, 620, 231, -1685, 1518, 1168, -2504, 531, 1873, -1791, 183, 1672, -1981, -91, 2471, -1409, -1229, 1781, -333, -430, 1080, -1366, -227, 2318, -1280, -1562, 2121, -283, -1468, 1775, -431, -1966, 2046, 695, -2435, 635, 1118, -1100, 555, 16, -1527, 1506, 895, -2356, 565, 1546, -1655, 392, 1373, -2058, 146, 2423, -1529, -1176, 1809, -284, -419, 989, -1243, -67, 2139, -1257, -1222, 2002, -472, -1067, 1847, -753, -1694, 2278, 374, -2329, 912, 905, -1118, 675, -131, -1411, 1523, 537, -2170, 779, 1067, -1682, 695, 1039, -2208, 422, 2150, -1770]
1884a770Q48K675k256Q2J403k120J097J869k998L15K652k446j05K623k764n36
1900a431L756k151k255L239m08j872J976q98j256K734j059k196K750k90k266K635
1916A008k48l030K921J197l751J320K165k441N20J354k202J058J675k681N10K154
1932A529k398L23K359k826k57L501k230j861L173p15j765K144q10j355K448q58
1948D02j836K434n42j910K652n43k758K927P33l466J721J670k625R15J298k293
1964a221J092J384k459Q65J614k452Q21K029k906K09L065k483j136L090j290j534
1980a312K416q82j374K255q14j456K266p70j674K578n93k445K749L51l087K026
1996B34J268k824J152J432k292Q42J239k127R95J252k473J016J838k803M58K554
$$ y = [-1770, -922, 1753, -503, -421, 982, -1138, -41, 1828, -1170, -855, 1797, -649, -754, 1869, -895, -1431, 2325, 174, -2081, 1158, 750, -1122, 854, -44, -1300, 1434, 375, -1821, 929, 639, -1627, 1008, 760, -2270, 651, 1848, -1903, -583, 1582, -859, -339, 1015, -1187, -129, 1546, -1135, -625, 1529, -869, -546, 1813, -1013, -1270, 2231, 1, -1860, 1313, 598, -1167, 977, 167, -1188, 1260, 402, -1434, 1000, 458, -1452, 1200, 657, -2101, 826, 1559, -1907, -186, 1484, -1141, -226, 1072, -1221, -129, 1255, -1204, -339, 1275, -1177, -356, 1673, -1233, -1024, 2041, -442, -1578, 1512, 222, -1312, 1104, 222, -1152, 1103, 289, -1167, 1099, 329, -1345, 1233, 640, -1805, 944, 1295, -1792, 234, 1502, -1322, -170, 1262, -1030, -188, 1051, -1076, -81, 1171, -1302, -286, 1552, -1251, -793, 1761]
2012A761k584m27K907j908j184K659j054j315K057q98r81K176j175j409K650p56
2028E19k089K568j04k550K336P15k938J525J502k370O83J160j847J050R88k437
2044a289J074J735k567M60K087k490J07K648k346r27K842j187j312J911r28o49
2060h31K045j475j127K642r42j715K412o02j989K663k5k861K018J266k393Q13
2076a01R06j652J261O86k402J242J512k359O11J599k375O00K338k647o35K903
2092A487j304j276J789r26m76J914j557r87K466r36j386K121r42j442K744n63
2108G26k682K332R37k332R93O16j499J472L65k283J404J211k120Q58J054k250
2124a198J163J892k880j48K775j489j064J693r89l17J821j572q97K273q67j160
$$ y = [1761, -823, -1250, 1657, -251, -1435, 1224, 170, -1145, 912, 14, -967, 1209, 34, -1375, 1275, 519, -1570, 998, 894, -1656, 680, 1395, -1543, -18, 1484, -886, -203, 957, -890, 160, 1148, -1289, -215, 1520, -1047, -587, 1500, -990, -883, 1765, -581, -1508, 1334, 147, -1165, 746, -182, -831, 1214, -261, -1388, 1254, 312, -1403, 1009, 407, -1582, 1081, 1056, -1805, 213, 1479, -914, -101, 805, -847, 414, 1100, -1302, -60, 1452, -907, -296, 1303, -1072, -472, 1866, -781, -1416, 1487, 183, -1093, 696, -230, -706, 1208, -349, -1336, 1130, 194, -1192, 929, -13, -1455, 1289, 726, -1956, 376, 1313, -1019, -26, 590, -909, 563, 928, -1355, 49, 1260, -860, -2, 1052, -1198, -35, 1857, -1023, -1171, 1604, 115, -949, 744, -245, -562, 1259, -313, -1210, 1063, 196, -964]
2140i64J825j062j078K657q54k495K423P50k282J040N35j456J484K72k138J385
2156D2J010j891R41O83k055J481J468k889L04K525j724o87J630j166j13J714j606
2173c33o63K065r50q34J624j227p36K527j149k135K459M13k204J241M28j520J443
2190D49K98j982J248Q67j704R39N21j885J493J192k717N70K207j854l76J639j315
2207d10p0J658j522m89J818j036n00J509j353m50K305j313j671K399p6j919J501
2224C81J72j545J431K88j793J156O37j522J010L49j760J433R82k454P19J861j954
2241f09o9J684j492j34J682j364m45J604j028l39J427j345l30K081j369j209K249
2258I94n02j588J746j38j526J522J47j581J187L03j326J151J21j596J463N97k148
$$ y = [-964, 861, -201, -1279, 1378, 524, -1971, 452, 1202, -1080, -40, 495, -961, 523, 795, -1343, 42, 1052, -839, 102, 785, -1270, 211, 1679, -1210, -906, 1619, -105, -792, 838, -328, -441, 1273, -333, -996, 1069, 119, -715, 909, -318, -1054, 1473, 324, -1811, 648, 1061, -1143, 98, 526, -994, 449, 747, -1235, 13, 880, -824, 115, 636, -1249, 244, 1436, -1281, -711, 1496, -358, -734, 905, -410, -480, 1178, -344, -833, 985, -51, -551, 958, -395, -845, 1460, 147, -1524, 875, 799, -1120, 381, 553, -992, 439, 727, -1066, 90, 727, -795, 215, 564, -1196, 237, 1219, -1235, -516, 1345, -609, -678, 1006, -486, -620, 1062, -302, -747, 857, -171, -510, 917, -428, -758, 1323, -46, -1255, 994, 492, -1096, 650, 512, -1014, 508, 655, -926, 261, 564, -762, 389, 510, -1086, 377, 974, -1174]
2275a174J015J354k018L50J562j658n6J613j301l37J447j072k38J391j276k80
2291f78J806j315q51K101q42j375J938k69j570J523J14j412J188J18j274J236
2307D38O8j446J370K82j795J293Q15k071Q12J412j806R3J443j286o5J228j221
2324d36m4J374j246k42J515j238m65J887j177j121K123m25j625J528J13j295J211
2341D37k8j305J321J58j430J153K31j468J352M51k059J107J329j931J84J343j256
2358d11J63J049j376J50J358j262j61J252j189k5J590j507p17K174p16j456J536
2375D52q0j087J267k65j239J419J25j370J021J31j204J395J38j997J343J189k007
2392g69L03J277j279L05R88j478K25J361j216j34J032j119K75J351j703l77K134
$$ y = [-1174, -159, 1195, -823, -473, 1089, -569, -625, 988, -313, -650, 797, -275, -513, 878, -398, -678, 1128, -187, -1038, 1063, 221, -1154, 784, 515, -1055, 468, 582, -830, 358, 476, -798, 438, 506, -940, 430, 712, -1083, 210, 1025, -1046, -234, 1178, -628, -535, 908, -378, -443, 785, -436, -480, 894, -352, -594, 921, -317, -782, 1105, -72, -1193, 930, 505, -1120, 408, 521, -774, 437, 409, -896, 425, 583, -847, 306, 537, -931, 421, 872, -1187, -80, 1249, -682, -498, 845, -411, -248, 801, -575, -425, 933, -329, -490, 762, -427, -452, 1138, -369, -1086, 1088, 372, -1084, 452, 372, -715, 552, 287, -952, 467, 592, -778, 243, 374, -830, 565, 703, -1294, 49, 1238, -769, -466, 811, -468, -163, 825, -653, -428, 933, -283, -417, 615, -504, -229, 1122, -581, -958, 1176]
2409A176r66j202J510l24q40J332n35j119J499rj203R63r3r06J458k30j810J542
2427B43R01j955M90J073j308N04Q96j583L07J371j191j55R21j027L83J184j749
2444f95j75K049j084j026J511n04p10J422p10j048J524p0j113R15k13o72J423
2461H24n12j550J674N34j811P67P38j294P38O90j593M93J197j208oP79r88N06
2479b2R61j725R9J840j259p55J528p18o06J474q01r94J558j64j061R62k80o24
2497e87J370n90j326J680K20j658J011N00j346R27N73j573O38R94j204J98O54
2514D81j008O19P34j602L60J481j391l37J432r84m26J476q83q49J480l29r14J035
2532C75l48o42J307n60j134J569j1j478J193L25j430J038N84j557O54Q99j222
$$ y = [1176, 210, -992, 518, 194, -646, 686, 151, -968, 531, 522, -681, 282, 189, -717, 741, 511, -1299, 243, 1144, -811, -321, 752, -556, -52, 844, -739, -432, 939, -252, -407, 514, -513, -130, 1054, -695, -870, 1179, 95, -931, 580, 76, -634, 788, 78, -970, 554, 484, -629, 286, 73, -599, 824, 312, -1238, 436, 970, -841, -74, 664, -630, 108, 798, -795, -302, 895, -313, -319, 460, -528, -22, 939, -786, -687, 1153, -106, -861, 667, -51, -657, 817, 16, -978, 580, 416, -645, 317, 37, -587, 783, 193, -1133, 547, 767, -891, 120, 620, -726, 201, 774, -799, -161, 833, -371, -173, 481, -527, 92, 826, -776, -416, 1065, -326, -663, 769, -215, -641, 835, -48, -897, 583, 254, -660, 375, 27, -615, 692, 132, -1002, 567, 556, -922, 271, 596, -834, 204, 788, -769, -115, 784, -438]
2549d38L30O45j075N99P03j445M61J165j397J4J330j206k80J467r57o73J374n05
2567A12o99J065n04n72J237o05q77J431k88j220J355O4j437J162M92j516P54P25
2585F79j236M90O44j154N71O79j301N17R44j414K77J261j354j63J465j016n02
2602f13J312p05n44J151n97n57J154o19n97J282o00r25J466k23j327J235K64j344
2620g87R08M21j248P35N56j180N53N76j137O32O60j443N59J190j489m0J399j065
2638b00l11J257q86m30J302o81o18J114n45m51J174p88p43J577m14j285J285J11
2656D68j163R85J40j206R29M63j231N51M87r58P07L35j381Q14J009j561J21J247
2674G56j071o7J125j089k26J388p99o28J102n08l39J085r15n79J652n49j240J341
$$ y = [-438, -108, 537, -538, 61, 764, -681, -220, 945, -452, -438, 892, -314, -594, 873, -84, -757, 617, 112, -587, 478, -26, -598, 639, 34, -843, 588, 300, -920, 435, 499, -938, 224, 716, -800, -46, 679, -557, -67, 577, -577, -6, 673, -628, -111, 833, -581, -304, 957, -397, -560, 905, -111, -613, 699, -6, -550, 601, 4, -553, 601, -18, -615, 667, 67, -858, 608, 385, -942, 293, 557, -787, 121, 542, -706, 29, 585, -595, -42, 534, -603, 29, 689, -754, -195, 995, -494, -534, 865, -200, -511, 746, -140, -570, 732, 51, -567, 547, 2, -449, 725, -63, -806, 771, 357, -928, 357, 468, -695, 290, 430, -776, 153, 616, -615, -64, 423, -535, 172, 507, -874, -60, 949, -612, -491, 756, -315, -382, 743, -346, -572, 816, 17, -611, 491, -17, -356, 729, -186, -765, 887, 338, -902, 439]
2692D39j5j081J108m0j266J134M23j327N81M39q66P48J45j334R92P99j560L18
2710c63J050j126J94R63j261J3J366r37n05J024n51j34R56j042l42J603p28j035
2728h55J341k01r21J211k52j215J292L09j341O54L96q44P84M5j297J085O61j550
2746f98M78Q96j194M10Q75j412J82J330j046l92R87o22JQ51j115j37J473q68p57
2765g58J275m49o62J251m95j082J392J35j274P58K75p98Q40n6j191J130N02j480
2783f87O10P39j214N58P94j470K95J302j160k79J001p05KQ32j094m6J347r51n58
2802f84J251o37n29J278o62r21J428q4j144Q66J17p48Q70j55r96J114K39j289
2820f86P85M90j196P13O36j410M46J129j233p7J006q42J7Q60j018k3J170r84l53
$$ y = [439, 424, -657, 451, 411, -855, 279, 702, -625, -44, 395, -471, 277, 422, -912, 80, 879, -681, -363, 687, -439, -245, 718, -543, -530, 836, -101, -606, 418, -133, -267, 689, -353, -695, 908, 180, -855, 486, 285, -636, 575, 323, -892, 400, 709, -632, 22, 418, -426, 358, 403, -894, 191, 852, -698, -220, 676, -518, -108, 767, -645, -463, 867, -179, -571, 416, -206, -205, 646, -469, -606, 867, -1, -758, 517, 68, -594, 657, 162, -920, 472, 607, -667, 91, 366, -432, 408, 352, -839, 291, 793, -687, -77, 662, -552, 6, 800, -670, -375, 927, -233, -512, 489, -216, -214, 618, -476, -522, 825, -126, -684, 567, -70, -599, 679, 17, -904, 524, 440, -704, 162, 279, -469, 401, 246, -750, 364, 603, -686, 99, 589, -607, 106, 742, -668, -222, 907, -326, -403, 603, -239, -222, 638, -380, -403, 767, -217, -570]
2839e70J246q13m84J344p16q48J401k50j043J014k6q25R19j32r12J031O0j094
2857f98R32K48j194Q71N12j355N73Q82j202J78Q82r51J27Q18r58P6R49r95p9J137
2877G53r84l36J327p79p11J338m29q88J132j87q74R90j09q66R56n8r66J031Q1
2896D21j206R68M28j310O80O84j214M01Q01j073J98Q06r15J65P46r71J42J001
2914G52j077j57J234q58m64J211o13o70J202l57q57J016j21p67Q89k01q32J097
2932D27m4j167R84L52j224P54N01j248N99P83j208K18Q57q88J59O60r91K88R46
2951G58j128q8J149q35l13J108p84m78J267n02q16J022j34o59Q26l36o63J126
2969E20j72j091R86K31j076P98K98j218P85O90j299K67Q60q59J79N73j002L91
$$ y = [-570, 676, -137, -621, 723, 7, -841, 560, 310, -733, 281, 255, -570, 349, 217, -695, 336, 396, -698, 234, 482, -712, 159, 671, -684, -111, 771, -431, -253, 629, -322, -195, 623, -335, -259, 690, -305, -384, 753, -231, -567, 760, -19, -730, 608, 179, -709, 423, 236, -638, 352, 243, -623, 333, 275, -691, 340, 421, -785, 183, 611, -699, -19, 665, -549, -148, 653, -420, -222, 584, -331, -166, 580, -391, -249, 752, -325, -482, 752, -106, -570, 641, 28, -642, 560, 203, -654, 362, 241, -526, 363, 162, -670, 427, 383, -784, 200, 552, -672, 82, 583, -665, -66, 717, -491, -273, 584, -304, -145, 515, -476, -188, 758, -370, -458, 691, -144, -457, 651, -133, -611, 656, 154, -662, 360, 226, -433, 393, 57, -606, 520, 348, -743, 243, 474, -602, 196, 494, -724, 61, 751, -548, -281, 579, -280, -101, 472, -530, -139]
2987a39R12j167n8J113q51j92J032r08l43J343o36q16J075j70n93P90m11n65J159
3006E75k94r99R93R0r17Q66N2j119R49N29j306L86P41q39K73M39r76M91Q04j168
3026d30N7R91q86j4R48j041j71J367p89p43J113k54n59Q39m94n29J178l52r26
3045f95J001l1q20R38j22j068J084L80j309N08O41q38L86L44r52N66O59j113J84
3064b57Q06q76J74Q00j099nJ285q78o00J106l69m63Q32n51m70J141m01q23R74
3083C26j20p37R77k13j045J147K78j283N95N70q93M56L48r81N80O25j075K43P11
3102E09q77K72P22j113J20J167r45m25J064m78l93Q43n71m04J058m52o61R55k62
3121A29o48R97k95r52J158J37j215P40M51r70N38L68r95N69N63j047L52O41r51
$$ y = [-139, 773, -394, -452, 661, -190, -382, 650, -258, -601, 742, 106, -710, 365, 195, -398, 392, -19, -584, 575, 281, -718, 275, 365, -552, 314, 366, -753, 196, 725, -581, -195, 546, -293, -20, 419, -557, -66, 738, -430, -373, 618, -268, -282, 666, -375, -546, 821, 32, -711, 402, 148, -411, 428, -66, -595, 583, 231, -695, 306, 275, -545, 393, 271, -797, 287, 667, -642, -134, 507, -331, 55, 399, -553, 13, 672, -441, -257, 549, -327, -153, 647, -452, -457, 828, -50, -650, 456, 87, -376, 456, -95, -565, 576, 175, -648, 326, 206, -531, 446, 233, -812, 335, 613, -670, -75, 495, -398, 58, 406, -575, 5, 630, -445, -202, 509, -368, -96, 626, -487, -367, 800, -145, -570, 494, 16, -377, 466, -105, -509, 549, 97, -564, 391, 129, -519, 478, 183, -769, 389, 526, -689, 51, 502, -468, 70, 438, -557, 12, 575, -472, -120, 521, -430]
3140d30L34P27j138J96J044r81k76J081o31l56Q94n39l96R73n24m58R16m30n08
3159e02J029l91q12J108p3j030Q89K71j031O67K95r20N81L64r09N02M38r81M64
3178d1O42j101K62R10j056RJ042q64k63J004o35l29Q81n37l59R09n04m76J017
3197E11m62o47J063k85q33J018j2r75P82K72r04O09K40q20O14K73r71N77N01j022
3217d71M02O50j030K58Q67r97q5R94p17k49Q30o38j89R21o98l70J038n08n44J000
3237D64m14o76J101j98r61R08J67q82O31J29p58P15J85r67O31M10r20M80M38r93
3257e10M69P34j090N3R39p17j53P06o62m1Q53p63k82R53n31l85Q92n56m95J142
3277E56l66r31R94R0q34O56K3p28Q20R4r80O85L57q65N34K96r82O40O46j182J88
$$ y = [-430, -96, 631, -507, -311, 733, -248, -524, 557, -74, -430, 464, -75, -471, 502, -22, -480, 436, 6, -502, 527, 136, -676, 432, 359, -671, 218, 489, -542, 125, 420, -500, 81, 445, -464, 38, 476, -505, -41, 601, -500, -238, 672, -384, -375, 667, -197, -460, 544, -91, -420, 461, -76, -435, 474, -30, -506, 511, 49, -598, 465, 180, -653, 365, 353, -622, 160, 432, -472, 137, 377, -443, 171, 444, -527, 50, 551, -471, -69, 581, -449, -191, 676, -321, -406, 588, -129, -378, 452, -186, -375, 546, -152, -522, 516, 8, -536, 464, 50, -626, 475, 277, -684, 224, 391, -491, 140, 269, -489, 226, 411, -556, 75, 485, -435, 45, 483, -510, -41, 693, -397, -344, 595, -122, -275, 431, -231, -272, 581, -182, -464, 489, -42, -427, 465, -91, -586, 556, 190, -741, 253, 343, -491, 165, 188, -540, 280, 374, -606, 79, 436, -429, 105, 401, -581, 59, 705, -477, -289]
3298b89R04p69l5O26p21J09Q06q37j89Q82n40k35P69o87k69J109n49p82J021n0
3318B74p36O89j18o52Q79k5r35P23K45p93O12J33r33P72N13j218L27Q35q34Q1
3338a61O11p95J72Q06q75j22Q70o01j35P37p57j57J104o78o60J034j84o33P35
3357C11k39n90Q93j07q50P22J30o73O28mq58Q41L51j166M55O88q62K13N49q61
3377d29K85P50q96k2P82o56rO96p90q9J097p12n71J053l36n83Q34l79n37R48k10
3398B26p57P41J07p06O90q0q53Q99K25j106N26N43q47L92L76p97L24O16q73P8
3418b76P20o74O9O48q60N8R62q36k93J026m94m63Q65l80o34R81k56o76P55k9o11
3439c98P40j53p21Q54N7r73P01L48r18M70M26q63L48N99q71J88N96p65J69O10
$$ y = [-289, 615, -154, -189, 437, -284, -175, 631, -206, -395, 487, -53, -288, 481, -206, -475, 634, 85, -697, 324, 274, -462, 227, 109, -543, 336, 311, -624, 99, 344, -449, 163, 296, -637, 135, 648, -570, -243, 592, -242, -161, 450, -345, -173, 633, -242, -364, 506, -95, -230, 507, -250, -407, 697, 19, -641, 393, 209, -424, 311, 72, -518, 375, 268, -582, 140, 270, -403, 225, 221, -637, 204, 555, -611, -156, 532, -330, -117, 432, -429, -144, 606, -290, -312, 470, -186, -195, 501, -289, -378, 719, 7, -564, 489, 153, -430, 404, 25, -512, 436, 226, -531, 210, 317, -389, 301, 221, -632, 267, 492, -614, -88, 455, -392, 0, 376, -421, -97, 519, -354, -276, 444, -230, -161, 487, -373, -315, 647, -189, -482, 544, 50, -413, 452, 72, -562, 419, 163, -513, 242, 213, -398, 342, 189, -532, 322, 379, -594, 107, 455, -463, 7, 433, -430, -82, 517, -354, -166, 430, -335, -166, 444]
3459D44p85J20P93q07j71R40o40l39R30n14m55R20l63n04P90k52n22P45j17p43
3479e30Q69r4q63Q84J35r24N58N00r65M01N22q84L34N31p75J62O31q02J50P33
3499E73q23k8Q14p86j88R22n14m25P98l36m09P88l30n23Q08k05n97P64j44o84
3519e25Q48J2r32P25L55r22M45M09p94L88M65q77L12O01q01J52O08q07J56P87
3539F05q70j57R79o02l94Q00l90l51P97m00m89Q09k01n70P27k07n81Q83j32r03
3559f47P63K86q46M69L12p58M52L79q46L32N22o72J69M60p22K23P55q29j75R99
3579F26o55l04P57m77k61Q10m84n19Q69k13n34O55k58m72Q72j70q84Q46J88q44
3599d52N31K09p30N61L12q88L63N24o84K04L70o92L49O04r41L5Q81o21k36P12
$$ y = [444, -341, -221, 572, -235, -406, 534, -106, -445, 485, -29, -484, 436, 73, -431, 359, 107, -415, 330, 213, -530, 339, 245, -618, 266, 401, -523, 35, 535, -430, -29, 493, -391, -57, 474, -301, -139, 492, -310, -160, 573, -250, -278, 536, -250, -438, 484, -30, -455, 343, 7, -402, 386, 56, -467, 341, 136, -461, 303, 159, -525, 323, 335, -597, 128, 483, -439, 6, 415, -379, 9, 474, -403, -91, 510, -291, -139, 469, -338, -182, 605, -265, -422, 557, -45, -439, 361, -29, -380, 417, 17, -472, 337, 136, -434, 293, 86, -495, 388, 256, -647, 116, 402, -444, 25, 337, -421, 31, 410, -436, -104, 418, -254, -85, 375, -347, -124, 631, -198, -373, 626, -29, -333, 424, -53, -314, 496, 12, -507, 362, 149, -385, 270, 12, -460, 412, 242, -642, 204, 392, -452, 79, 288, -442, 119, 431, -457, -94, 430, -254, -50, 320, -372, -23, 581, -360, -325, 556, -65, -301, 411]
3619D11n43j94Q07m83m64Q18k38m79O73l45l82Q60k34p91P39K28q12N23J76p43
3639d73O42K15q59L76M79o39K22L27p28M14N80r45R2Q27o49j55O62n77q4Q14o06
3660f5l98Q09k68l94O31l66l41Q78l80o99Q67K8p43O22M6p40P16K08r34M87M42
3681D06p17L16K83p33M84M83r36J79P57p45J4O34o73m4Q19o27l02P78l12l32N70
3702C02l66l14Q35l95o11Q47p1o42O43k6o59O81P8q64N92L86p74M02K53o97M81
3723H1L86q88K76O74q08P6O51p09j9Q46p50k14Q84n11k54N96m02k38Q15n23m14
3744d45P84j59o38Q07k10o51P59Po83N30K04o28M22J42o58M48L19q02L72N21q63
3765d22L07O00q09J27P08p30p9P60n09k12O55n02j82O90m04l37P38l60n12Q17
$$ y = [411, -132, -326, 481, -2, -466, 352, 114, -365, 308, -37, -419, 441, 207, -584, 155, 383, -429, 94, 270, -473, 169, 384, -475, -99, 380, -259, -37, 290, -438, -24, 556, -389, -297, 530, -119, -274, 388, -189, -273, 541, -65, -463, 346, 78, -316, 315, -51, -392, 486, 106, -593, 274, 302, -441, 181, 227, -513, 203, 411, -523, -36, 406, -311, 5, 288, -445, 39, 522, -414, -235, 522, -223, -209, 425, -248, -292, 527, -100, -402, 376, 64, -268, 302, -64, -378, 457, 62, -549, 298, 227, -415, 228, 202, -457, 224, 302, -562, 30, 416, -358, 44, 297, -400, 81, 467, -421, -145, 529, -279, -203, 448, -261, -280, 566, -184, -398, 486, -25, -279, 317, -85, -323, 492, -31, -445, 339, 180, -458, 349, 139, -512, 247, 254, -429, 101, 305, -323, 99, 241, -417, 31, 350, -452, -80, 441, -422, -115, 485, -324, -197, 511, -219, -298, 462, -47, -259, 396, -106, -288, 402, -2, -339, 399, 39, -473, 344]
3785C44j85p15Q18pp66O84J06p33O31J36p30M47K56o91M69L20q01L33N80q74J89
3806a89O48p09K0O64o17j01P16n23j85O44m57j88P34n22l71Q74l13n88P67j36
3826A68n91P02n6o96O56J40p05M88J44o43N47J85q27M83M88q41K22N47p15J87
3846a17N64p20RP06n56j46N86m82m8O58o07k51Q65l93m85P33k30m60P29k02o39
3867d86P02Q5o68M82P6n50O05M3q09N86L89q28K95M51p22K95N06q06J08P20o09
3888a35j10N57n19M9O23o76j71Q62m65l98P05l14l53P49l03n83P31K0o04M77j1
3909A31m63O17m6p30O16K94p76L64L11o71L87M27q47J90O75o39l4M94n35J29N71
3930D65p48p6Q32n15l20O96m16k66P96m20n49Q11n9n89N23p8m22O50j33o96O87
$$ y = [344, 159, -556, 262, 255, -511, 173, 279, -454, 177, 313, -417, 30, 286, -405, 64, 384, -417, -84, 496, -378, -189, 459, -250, -230, 434, -183, -284, 432, -91, -276, 368, -89, -277, 457, -65, -436, 438, 125, -463, 304, 168, -423, 279, 223, -473, 183, 323, -382, 106, 250, -393, 154, 339, -488, -5, 483, -358, -136, 411, -304, -117, 447, -273, -264, 442, -114, -260, 326, -156, -204, 454, -153, -404, 461, 68, -417, 316, 86, -374, 355, 153, -486, 216, 301, -367, 115, 191, -359, 246, 289, -520, 66, 455, -373, -78, 373, -349, -54, 452, -354, -246, 474, -135, -245, 312, -207, -158, 465, -211, -382, 480, 15, -383, 322, 8, -345, 404, 101, -482, 249, 269, -335, 142, 131, -332, 285, 239, -491, 125, 419, -357, 7, 318, -353, 34, 461, -386, -196, 479, -160, -194, 300, -235, -106, 465, -283, -359, 473, -42, -362, 334, -82, -348, 448, 28, -521, 290, 231, -358, 165, 87, -335, 315, 182, -514, 173]
3951A73J81p22M46J99o51M90L19q52K98N79o39M7M37n51J86N06p37K8P29n72j77
3972b83O56n17j81P97n08m48Q21j77n35N95j76m11P03k01o37O93Q3o89N39J03
3992B27o64N85K50q43L86M95o71J42L98n85K37M74p15R1O30n88o1O03n69r4P54
4013D82n49l51P70k71m30O02k31l88O91k25n49O79l1o14O16no67O44J67q18M67
4034a1M06p11K69L70o47K99M21o94J76N35o38P3N73o42RP03n91k44P59l92l31
4055c08O29l02l22O26k78m13O53j73m99O49j08n96O51N2p23N40K41p09L93L15
4075C18o68L25L57o70K76M33o81J85N48o96Q2O30o15q6O91n24k22P19l94l16O41
4096C33l07l26O35k88m15O89j69n59O33j9o09N85P5o77N05K34o65L40K73n88L38
$$ y = [173, 354, -368, 78, 277, -374, 116, 435, -417, -119, 460, -179, -132, 305, -246, -60, 446, -291, -263, 466, -106, -283, 373, -144, -325, 472, -36, -484, 337, 160, -375, 220, 44, -367, 336, 135, -502, 191, 274, -415, 124, 227, -437, 148, 398, -445, -59, 436, -235, -93, 305, -280, -43, 431, -284, -193, 437, -151, -212, 391, -178, -272, 482, -67, -418, 352, 81, -349, 253, 22, -366, 325, 100, -449, 230, 199, -415, 201, 196, -471, 173, 340, -478, -11, 395, -316, -47, 323, -324, -25, 396, -298, -122, 413, -225, -152, 421, -221, -212, 491, -100, -344, 415, 23, -308, 321, 19, -303, 323, 45, -368, 285, 112, -387, 262, 154, -442, 209, 261, -462, 78, 319, -390, 3, 318, -350, -25, 332, -338, -62, 371, -310, -125, 423, -273, -191, 439, -176, -262, 429, -95, -317, 402, 8, -308, 333, 26, -300, 335, 47, -368, 321, 152, -407, 226, 207, -402, 183, 258, -419, 86, 320, -345, -5, 268, -320, 18]
4117A8L02o96L08M84p17J22N71o18L7O18o24j12P38m57k87O14l17k23O12m14l19
4138c60P36k54n14O52j06n07O26p5o39N85J97o86L53K30n28L72J80o67M01L93
4158C89o96J82M43n83J57N05o73QO92n03k32N86l43j29N50m58k51P47l05m53O25
4179B58j62m18O46j70o23O69J46o83L92J69n03M21J13o57M37L48o65J95L84n67
4199b70K37M24o99P4O74n32j93N29l40p2N10m89j80O89l12l75N65k16l31O54k69
4220G8n54P01P6o53M09J41m77M67O3o66M69L25o68K49L20n68L08L93p48J41O51
4241D57n67j35N10l71m7N06n02j52O58l40l16N33k42k67O30l08m89O82Rn99M35
4262H5R6m60M52L7n99M63K54n94K62K57n58L41L37p23K00N98o02n5N17m40j4N05
$$ y = [18, 320, -376, -68, 416, -301, -179, 392, -226, -189, 429, -195, -307, 431, -26, -313, 301, -16, -239, 373, -41, -360, 376, 122, -392, 260, 154, -353, 273, 198, -441, 144, 341, -345, 8, 238, -290, 82, 262, -405, -4, 389, -307, -125, 318, -265, -108, 397, -276, -268, 424, -79, -311, 275, -68, -197, 353, -105, -356, 391, 86, -367, 258, 96, -322, 324, 154, -469, 200, 346, -337, 55, 224, -279, 142, 255, -402, 35, 383, -282, -87, 297, -270, -33, 391, -308, -234, 440, -92, -285, 244, -96, -168, 342, -147, -327, 362, 50, -325, 240, 24, -307, 347, 78, -476, 225, 301, -352, 57, 198, -279, 188, 251, -415, 54, 379, -289, -40, 280, -288, 20, 413, -335, -194, 457, -110, -245, 265, -106, -153, 353, -149, -301, 357, 17, -299, 234, -8, -275, 355, 47, -442, 240, 249, -350, 85, 181, -279, 173, 210, -389, 74, 328, -266, -4, 253, -305, 36, 373, -350, -150, 448, -154, -209, 308, -132, -146, 359]
4284C59n11j23O34l72k65N50l23k25O42l44m44O90p5n37M69K8m58M84J3n58M49
4305H3J89n56L21J75n18L55K83o77K43N03n93K9M71m96M1N04n12r6N91l99j85
4326b44N45l85j78O22l84l61O80j60m95N60o9m66N37j4n50M67J29n35L78J44n38
4347c17L91K39o44K72M17n90J03M52n20N6M74m89n7N29m01j31N20l94j55N87l68
4368b6l06O38k33m30O09j23m77N37j2n09M78N6n23M36J20n68M10K04o13L35L43
4389C46o40K12M44n91P6M80m81qM72m60l4N10m36j36N42l49k16N73l19l24O26
4410B87j72m64N17k7m29M55k3m69M76P8n57M03J65n42L71K11o30L29M04o34R5
4431a56M72m76O0M04n04L0N32m71j45N63l83j42N46m24k34O71k51m58N33m7l86
$$ y = [359, -152, -275, 359, -13, -278, 272, -51, -276, 366, 22, -422, 268, 193, -344, 125, 153, -305, 179, 192, -366, 83, 272, -284, 37, 212, -306, 49, 332, -345, -102, 401, -192, -163, 308, -188, -147, 357, -155, -251, 340, -59, -244, 301, -84, -262, 360, -24, -385, 295, 135, -360, 200, 131, -335, 202, 188, -362, 105, 234, -301, 77, 221, -317, 74, 313, -331, -59, 358, -232, -129, 323, -197, -141, 333, -156, -213, 316, -85, -216, 304, -90, -245, 342, -26, -332, 306, 73, -357, 252, 129, -348, 189, 177, -332, 146, 202, -321, 115, 235, -333, 77, 281, -332, 3, 346, -294, -82, 362, -229, -153, 327, -154, -162, 310, -150, -184, 326, -110, -246, 296, -53, -269, 304, -15, -339, 287, 115, -349, 168, 141, -288, 167, 144, -325, 151, 229, -328, 75, 240, -302, 69, 280, -350, -21, 383, -251, -156, 316, -160, -100, 304, -200, -170, 362, -109, -254, 309, -74, -216, 330, -94, -328, 343, 92, -366, 167, 120, -266]
4452b66M50r7m32N33L2n41L85J25m60L86J22o15L99L55o47J48M20m70J06L55n34
4473b46J09N04n07q2M96l76o1N03m75j68O92l41m02N55j08l37M82j97l90N68k4
4494A95n19M16O8m27M23J3n55M68K59o44J96L71m63J60K89n32J73M66n06m5M44
4515B50l84K1M47n22q4O65l83l37N59j79k85N07k50l74O24j05m91M34J5l78M52
4536B02n5n48N28K06o51K63L05m91K40K55n67K21M36n22RM07l99P4L93n22l1O24
4558C77m20k64N28k32k17N07k92l14N98j19m50M52n4l61M94j13n11N60J31o30
4578c30L51K36n18L01K40n99K78L83n63R8L78m52J31L84n58L9N72m75j68N45l40
4599f7j63N22l37k76N87j84l64M63j19l20M92j43m52N69K0n62M28J36n24L92J79
$$ y = [-266, 184, 87, -345, 188, 220, -321, 64, 189, -271, 115, 237, -378, 21, 376, -271, -123, 297, -173, -67, 288, -246, -137, 367, -140, -222, 274, -102, -163, 340, -135, -303, 389, 48, -354, 201, 93, -244, 238, 41, -349, 219, 195, -324, 92, 160, -267, 156, 169, -386, 82, 341, -303, -107, 264, -199, -39, 250, -282, -109, 357, -149, -194, 250, -134, -113, 334, -188, -272, 393, 10, -327, 232, 53, -232, 275, 25, -349, 275, 170, -321, 113, 128, -250, 202, 147, -401, 127, 333, -318, -55, 250, -241, -1, 254, -313, -92, 344, -178, -169, 238, -161, -87, 306, -216, -247, 377, -43, -307, 221, -11, -228, 279, -13, -327, 271, 152, -298, 154, 100, -261, 233, 120, -391, 169, 300, -330, 21, 257, -261, 40, 280, -319, -41, 342, -221, -123, 255, -197, -66, 318, -240, -201, 371, -104, -272, 273, -67, -230, 292, -45, -321, 266, 82, -282, 181, 62, -258, 234, 91, -361, 208, 228, -334, 94, 230, -294, 98, 277]
4620B77n90L32L05n55J78L22n06K10L46n85J26N13n44m6N36m50j06N58m09k19
4640c07N80k57l11N10k08k91N41j96m00N60o8m93M96M9n33M42J49n60L28K55n27
4661b41K48K71n14K35L21n65J68M29n61N5M96n10n2N70m41j70N57l45k21N35k87
4682b2k83N52k28l55N68j47m42N72n0n36M96R1n36L95J57n22L42K20n44K64K85
4703B77n09K07L36n52J58M52n62KN33m51j01N15m07j33N63l68k66N69k76k58N27
4724B56k77l44O48j35n47N67J4m99M55N1n46M82J54n94L00K51m77K82K24n54K60
4745b9M65o86N2N65m96JM44m43o1N07l17k88N78k34k66N53l96k85O73k20n08N32
4767A41qm22M58o0m65N16Q0n90L56K21m75L15J32n59L80L66o72J46M55m80O4M09
$$ y = [277, -313, 19, 324, -231, -53, 269, -237, -27, 319, -266, -140, 373, -171, -217, 319, -131, -237, 321, -88, -307, 273, 16, -295, 215, 7, -284, 257, 61, -339, 221, 153, -340, 156, 205, -328, 114, 263, -297, 31, 286, -241, 7, 278, -236, -1, 320, -245, -77, 352, -209, -154, 342, -168, -220, 350, -91, -261, 296, -49, -270, 265, -22, -305, 247, 19, -336, 232, 85, -357, 215, 165, -371, 125, 216, -320, 75, 232, -290, 52, 272, -272, -8, 277, -232, -25, 311, -241, -83, 369, -193, -191, 342, -109, -210, 305, -102, -235, 328, -40, -306, 263, -13, -271, 256, -21, -365, 283, 148, -399, 168, 182, -317, 138, 189, -357, 125, 279, -315, -15, 236, -241, 41, 265, -289, -29, 436, -250, -198, 367, -129, -128, 316, -127, -188, 319, 2, -286, 292, 58, -208, 345, -51, -336, 337, 117, -391, 141, 133, -289, 169, 109, -356, 160, 240, -350, 6, 227, -248, 67, 199, -360, 20, 386, -286, -140, 315, -165, -101, 308]
4789C08n22M8N55m71j73N15k75j25M27l79j75O35k99m19N48q3l70M54j16m28N47
4810B02K4n46L60J42m12L33P2n39M25K81o49K04L95m92J43L57n63J27N22n17j10
4831b41M96l39n7M40m62p8O15l52l45N63j71l10M89k05l88N75j8n36L90J07l92
4852b19L63J1m90M39K00o06K47L24m89K10K92n65J90M59n26l2M44l52j3M00m74
4873a87k8N78m15k44N57k52k37N10k78l39O03j16m74M40K7l71L93m4m50M73J24
4894B70n77L27K30m90K70K39n48K23M00n22L5L96l86M1L74m68QN12m32j49N19
4915B72l16j92N20l08k78N77j84m06M90q2l48M53q5m28M92L1n16L99J36n14L63
4936G6J90n52K70L27n27J36L51m49J00L70m68N1M27m39m3M69l81j34N20l35k42
$$ y = [308, -214, -166, 389, -82, -255, 260, -15, -140, 287, -92, -267, 368, 69, -350, 198, 115, -255, 199, 83, -345, 202, 226, -320, 40, 182, -230, 103, 175, -364, 61, 342, -307, -103, 292, -200, -57, 300, -263, -136, 386, -131, -241, 255, -84, -141, 299, -163, -241, 374, 22, -323, 240, 69, -241, 248, 43, -345, 230, 212, -324, 66, 173, -219, 144, 155, -335, 104, 304, -302, -55, 269, -220, -10, 282, -283, -93, 366, -160, -192, 252, -100, -113, 287, -187, -215, 363, -52, -296, 261, 9, -228, 282, 4, -335, 268, 152, -322, 118, 145, -226, 167, 123, -327, 146, 270, -307, 20, 250, -240, 30, 269, -279, -56, 344, -178, -143, 253, -133, -92, 282, -186, -178, 334, -98, -247, 272, -44, -236, 284, -24, -302, 275, 91, -315, 175, 93, -255, 198, 113, -315, 177, 208, -308, 91, 227, -287, 76, 266, -286, -16, 311, -216, -80, 271, -178, -78, 292, -176, -125, 302, -137, -180, 289, -92, -226, 294, -41, -283]
4957b83N50k39l07M90j48l50M80j06l82M64l4m36M47L8n01M17J50n50L33K49n26
4978b44K28K96n06J54L57m73J04L81m70M7M49m61o7N08l61j67M92k86k30M98k20
4999B9l04M69j14l36M27r4l58M71l3m75M24J24n01L24J64m88L09K39n25J93L19
5020B64m45J39K92m64J40L98n15J0M99m17p7M56l74j30N19l03k83N05j55k90M35
5041B04j87k97N14j13m53M48P1m41L54O5m60L74J76n34K40K88m16J60K13m47K32
5062iL42n46N0M58l97m2M00l90n4N11l67k49N24j92k43M05k42k18N45k10m13M89
5084A52J1m15L93k7m33M53J17n49K63K77m09J73J76m19K56L10n49Q1M04l68jL42
5106B38m11RM94l87k19N01j98k08L81k66j76N14k23l73M79m1l49L95q1m01M87
$$ y = [-283, 267, 28, -279, 211, 63, -287, 193, 87, -295, 169, 135, -301, 146, 184, -317, 100, 250, -300, 33, 282, -244, -16, 280, -226, -72, 285, -188, -84, 297, -173, -126, 323, -138, -205, 303, -58, -225, 267, -19, -249, 249, 29, -275, 194, 80, -256, 171, 77, -281, 190, 157, -318, 106, 230, -271, 53, 217, -271, 38, 277, -248, -55, 264, -181, -42, 250, -214, -74, 324, -191, -181, 318, -99, -176, 280, -94, -224, 295, -8, -291, 214, 59, -231, 204, 17, -280, 234, 121, -332, 116, 187, -254, 100, 165, -295, 79, 255, -279, -39, 249, -167, -7, 206, -241, -9, 333, -213, -163, 295, -102, -144, 256, -134, -188, 323, -44, -293, 231, 39, -204, 201, -41, -259, 286, 76, -337, 152, 163, -252, 141, 114, -319, 134, 251, -298, -35, 242, -167, 6, 182, -237, 19, 329, -220, -139, 265, -103, -104, 238, -173, -164, 330, -57, -276, 225, 27, -181, 200, -66, -242, 272, 49, -324, 155, 114, -235, 160, 79, -322, 165]
5127A65O5n45L14K23m07K30J13m27L21K41n25J37L70m11P3L06m46Q1M58m35j29
5148b28M58k26j61L58k87j36N01k54l25M70j00k90L98j31l48M88rm98L52J57l91
5169b02K61P5m11L49J81n05K06L06m39J66K61m76J43M32m75n4M59l23q7L87l36
5190h2p1M64l75j70M53j72k78M22j65k89M58n5m42L78Q2l73K92O0l98L19J51m58
5212b49K41K19m12J91K49m68J72L65m68J2M06l59k3L74l53n7M31l20j49M32k38
5233dk00M35k22k81M95j37l72M09J1l72L42K6l82L33R1m15K82J35m12K45K16m55
5255b32J88L00m46R5L55m02K4L66l61k2L86l26p8M11l11j41M66k67k25M49j79
5276E0k94M46j03l63M28l4l75L57K9l83L37O7m34L21J64m57K43K17m47J81L02
$$ y = [165, 230, -315, -1, 222, -185, 45, 158, -269, 52, 293, -232, -95, 275, -136, -63, 243, -203, -122, 336, -99, -228, 230, 4, -157, 201, -86, -222, 279, 25, -300, 170, 70, -220, 178, 47, -301, 187, 178, -320, 32, 189, -202, 59, 134, -277, 72, 253, -252, -46, 260, -179, -13, 248, -228, -85, 347, -128, -182, 277, -46, -133, 254, -82, -153, 311, -64, -234, 219, 47, -231, 191, 26, -263, 195, 140, -302, 76, 158, -215, 77, 137, -261, 58, 209, -249, -8, 211, -201, -10, 239, -229, -57, 308, -160, -148, 258, -101, -124, 250, -103, -160, 271, -49, -198, 234, -4, -204, 231, 9, -272, 223, 86, -286, 123, 134, -238, 104, 130, -252, 81, 172, -243, 39, 174, -238, 7, 223, -232, -44, 256, -190, -95, 260, -142, -118, 248, -113, -135, 251, -75, -153, 258, -53, -194, 272, 5, -220, 229, 50, -244, 202, 99, -264, 164, 130, -245, 112, 141, -242, 95, 162, -272, 49, 213, -244, -1, 216, -231, -50, 252]
5297B52m46Q9L65l87j1L58l41oL80l53r0M45k77j84M38k31k14M65j95l19M43n0
5319A31l55L51k5l44M02j2m26L59J32m56K74J55m32K82K17n00J56L61m11M8L00
5340B07l59O1L66m09n0M33k97j33L84k71j37M68k48k90M63p6l19L34p8k70M10
5361A89o4m07L82Q9l95K80P9m04L41J76n46K32L10m09Q9K49l82J47L23m63K0M17
5383B53l28p1L53l33m1M57l29k50M96j34k76L46j31k29M21j24l65L97L9l56L04
5404I9Ql59L85R3n05K62K73m03J18J97l62K09K51m78R1L82l60JL18l91M7M27m03
5427a00j65M94k11k20L56j94j70M53k22l15M44m1l15L25o1l28M37Pm81L36K04
5448B33m15J92J53l71K53K09m65J28L28l56N2K64l78R7L77m29q6M56k64j46L55
$$ y = [252, -194, -105, 260, -127, -138, 220, -121, -127, 253, -100, -190, 255, -22, -206, 232, 1, -213, 252, 57, -262, 181, 131, -224, 127, 102, -242, 160, 148, -278, 81, 213, -243, 31, 186, -246, 36, 253, -247, -91, 270, -141, -93, 207, -152, -91, 275, -134, -184, 249, -48, -181, 203, -68, -205, 263, 15, -275, 188, 112, -207, 127, 49, -221, 189, 125, -282, 100, 189, -206, 74, 153, -251, 90, 266, -280, -48, 262, -147, -58, 191, -191, -44, 279, -184, -164, 253, -75, -146, 207, -126, -167, 290, -39, -289, 207, 73, -203, 143, 12, -217, 204, 80, -285, 112, 151, -205, 99, 107, -252, 133, 226, -279, -17, 256, -147, -29, 168, -194, 15, 266, -212, -121, 261, -99, -98, 220, -171, -124, 303, -100, -265, 229, 18, -202, 154, -40, -210, 243, 21, -294, 150, 109, -206, 119, 58, -270, 167, 174, -307, 29, 233, -182, 10, 163, -208, 45, 254, -211, -83, 245, -111, -59, 205, -173, -76, 301, -128, -214, 242, -22, -168, 187]
5469A87k60j21M46k58k62M28j10k65L69j31k87M61p9m32L94Q7l80K52R0l64K95
5490F0J67m59J92K62l75J27K35l91J33L27m28pM15l15q8L62k98r3M27k83j81M09
5512A98j79k18L79j84k38M42j28l61M19Ol74L34L3l83L20J07m22K64J82l98K07
5533FJ92m14J86K83m25P4L51l65j6L67l21n5L86k88j25L72k26j66L96k19k00M11
5555B04j57k95L99p0l40L90j2l67L29N5l75L04Q5l84K75J56m28K28K13m10J65
5576c5K87m42R4L51l78ML40l02m5L67l12r2M02k56j72L97j98k14M11j58l00M17
5598A66m8l50L34Rl21L20K3l80L10J19m02K33J63l77K08K06m29J55L16l95M1L04
5620B05l18J4L35l61l5M17l04j23L68k36j36M26k62k34M50j11l20L48l7k99L62
$$ y = [187, -73, -194, 252, -6, -268, 160, 50, -215, 154, 23, -264, 197, 118, -314, 80, 167, -213, 39, 129, -235, 60, 227, -232, -40, 222, -153, -26, 209, -182, -49, 278, -150, -157, 258, -57, -145, 217, -81, -174, 253, -30, -211, 198, 19, -199, 180, -4, -242, 200, 72, -289, 130, 136, -238, 96, 129, -254, 66, 173, -249, 15, 197, -201, 6, 198, -216, -30, 253, -172, -98, 253, -112, -128, 239, -82, -137, 249, -39, -164, 208, -18, -184, 212, -7, -207, 204, 47, -248, 151, 81, -259, 131, 119, -248, 81, 136, -239, 65, 150, -234, 41, 197, -231, -3, 210, -200, -35, 252, -190, -96, 255, -123, -119, 221, -81, -126, 241, -71, -163, 239, -17, -189, 208, 10, -204, 207, 49, -251, 166, 118, -232, 102, 111, -210, 110, 133, -247, 63, 182, -220, 13, 176, -201, 7, 213, -216, -61, 255, -140, -99, 205, -113, -99, 236, -125, -160, 257, -47, -170, 198, -38, -174, 252, -10, -244, 206, 95, -225, 123, 86, -213, 149]
5641A49l7l72L47P2l67K45J05l53K63J46m41K11K87m01O5K68l19Q1K83l87J7L84
5663B46k98r2L34k63m5L79l11j79M61j64k80L54j15k21L66j18l22L90K5l49K77
5684G5J8l16L45M8m43K72K48m09J18K19l28J51K40m08M9L71l22m0K80k72J9L47
5706B62l52j22M47j92k33L32j36j78L75j68k91L99ql30K77k5k64L62l3m03L30
5727D9J58l90J70J62l28K09J84m16J34L01l20QK47k93P2L03l71o4M30k23j85L33
5749A70j94j31L82k09k57L96p1k78L04p2k30L59o1l62L28J03l70K16R2l20K57
5770E2J46m05J67K53l44P9K07l00J24K60l89J7L73k93q6L25k42r2L73k37j95L89
5792A82j30k21L07j13k17L65r5l11L41K8l37K58P0l32K71J07l97K17J91l28J22
$$ y = [149, 112, -260, 87, 159, -208, 37, 142, -211, 52, 198, -243, -32, 255, -146, -81, 187, -132, -51, 232, -155, -138, 246, -52, -144, 190, -73, -118, 261, -50, -229, 232, 68, -212, 142, 27, -194, 172, 54, -268, 122, 147, -202, 75, 93, -223, 122, 170, -273, -1, 247, -162, -44, 175, -153, -2, 238, -170, -121, 250, -72, -112, 168, -104, -85, 262, -90, -212, 235, 43, -190, 142, 6, -172, 203, 35, -256, 143, 135, -195, 82, 57, -207, 155, 122, -281, 49, 207, -183, -13, 149, -179, 30, 214, -202, -68, 233, -87, -79, 168, -125, -53, 250, -121, -185, 245, 22, -163, 170, -24, -155, 227, 18, -239, 157, 86, -192, 112, 40, -190, 169, 108, -254, 74, 177, -193, 23, 115, -205, 52, 198, -207, -40, 213, -131, -52, 155, -145, -21, 239, -150, -133, 240, -53, -139, 186, -56, -148, 225, -12, -207, 182, 52, -169, 138, 25, -192, 173, 78, -233, 108, 136, -201, 57, 127, -205, 66, 173, -224, -7, 184, -144, -22]
5813b2J84l26J53K33l85P5L13l11k7L10k89l9L60k71j30L65j83j61L16j60j73
5834a68L47j38k54L44k8l12L13J8l33K91P3l57K26J44l42J75J64l24J38K14l49
5855a58J03K57l39M6K90l10k4L41k69p9L40k36j09L33j98j47L23j43j95L45j33
5876C8k44L46m4l01L08K3l02K53P0l30K29J22l33J77J61l23J42J89l40J09K67
5897B17l34J3L05k80k7K89k61o8L41k15j49L26j58j34L06j78j85L57q9l01L20
5918I5kk72K76Ml10K94Q2l37J92J15k86J88J27l51J88K26l58L9K71k67J8K70l08
5941a06k3L34k30j33L13j82r5L05k11j72L79j25k58L03m8k05K71n0k77K97N5l19
5963a77K03R2k61K23N2l39K26J93l52R6K18k87R1K29l34M4L14k82o8K71k04k8
$$ y = [-22, 162, -164, -11, 222, -163, -88, 225, -86, -113, 197, -92, -131, 229, -42, -172, 193, 10, -151, 165, 5, -168, 179, 41, -213, 131, 103, -209, 104, 122, -211, 80, 153, -204, 22, 166, -176, -1, 163, -161, -23, 191, -158, -55, 202, -137, -91, 199, -111, -135, 206, -63, -142, 198, -38, -147, 186, -12, -159, 164, 21, -174, 171, 38, -206, 140, 96, -205, 103, 126, -176, 77, 147, -183, 46, 168, -165, 12, 173, -150, -8, 181, -159, -50, 217, -117, -104, 201, -79, -106, 183, -78, -146, 195, -20, -169, 157, -1, -135, 171, -7, -192, 165, 76, -225, 95, 93, -179, 97, 101, -209, 85, 167, -170, 22, 137, -149, 39, 166, -185, 3, 229, -129, -90, 181, -86, -68, 202, -106, -129, 205, -25, -158, 155, -27, -122, 183, -28, -200, 179, 54, -204, 99, 51, -154, 117, 67, -210, 87, 142, -177, 26, 118, -143, 80, 132, -207, 19, 212, -140, -44, 174, -113, -22, 207, -127, -83, 231, -51, -119, 152, -52, -80]
5985h0K74k77r2L78j77k26L11q3j78L02j08k72L34K5l11K12M5k28K44J4l22K49
6007C4J67l46J16J83k82J29J89l49Q6L15l01l5K52k23J3K64l41l3L86k16j70L25
6029A63j58j34L03j70k25L55l3k87K39J0k20K63k5l11K78J22l38J60J29k68J60
6050A3J59l48J20K76l00nK25k19L0K49k90l2L47k38j20K86j75r4L05j89j94L63
6072A69q4k47K56l1k16K84o1k86L02M9l08K03R0k98K22J10l56J72K21l06M9K15
6094A49k57O5K31k97J0L04k49n7K67j99q6L20k14j57L51j22k02K62p4j89K82q3
6116E5k43K84J3k87K39L9k92K46Q4l31K03J52l04J04J69k68J00J98k94N5K54k67
6138i1j2K85k49n2L00k16j17L34j70j64K95j08j78K89r8k03K83m1k49K65J1k81
$$ y = [-80, 194, -83, -175, 203, 26, -200, 111, 28, -150, 152, 44, -228, 106, 131, -180, 32, 77, -151, 93, 107, -215, 34, 201, -145, -29, 154, -128, 1, 190, -159, -73, 242, -59, -94, 158, -65, -52, 212, -129, -162, 224, 8, -162, 163, 5, -129, 174, 4, -221, 134, 101, -186, 53, 63, -157, 106, 81, -230, 48, 170, -168, -8, 121, -147, 13, 172, -176, -56, 220, -80, -85, 140, -79, -49, 200, -90, -122, 225, -13, -133, 153, -22, -116, 189, 0, -194, 169, 85, -162, 94, 63, -153, 131, 70, -216, 86, 135, -173, 30, 120, -178, 44, 154, -202, -30, 191, -115, -66, 149, -108, -43, 188, -109, -99, 205, -44, -101, 166, -33, -119, 201, -13, -170, 181, 59, -143, 119, 45, -144, 138, 55, -188, 96, 109, -178, 61, 100, -192, 54, 138, -193, 10, 162, -142, -38, 131, -137, -37, 161, -133, -78, 176, -91, -103, 182, -67, -119, 181, -35, -152, 182, 12, -152, 143, 35, -143, 146, 48, -155, 128, 87, -162, 103, 114, -167]
6160a67K42M8k90J97J13l09J73J43k99J35J66k83P8K07k85N4K56k79rK74k25n8
6182a18K83k06r9L19j62j72K79r5j65K61r6j97K93l6k74K60L9k66K11N5k87J99
6204B6J30l03J23J63k55J08J51k82J11K09k83MK58k25k1K43k27n4L00j92j40K96
6226A40j31j24K49j34j56L04q2k48K55J5k35K25Mk66K39R0k99J46J59k55J18J16
6248A30k82J05K36l00K5K42k18j1K45k73MK87k23j13K64j06j43K67k27q9K98r0
6270B8k32K80j8k22K16j02j15K25J15l54J61J51k31J77J8k70J81J76k97L8K34
6291A59k36M1J96k67J7K85k27j08K65j44p7K42j87j03L09j19k19K69n6j76K59
6312A23q9k21K99Qk82J83P3k10J69M7k74J99J41k97P8J81k23Q9J64k86N5K59k36
$$ y = [-167, 75, 123, -167, 30, 143, -166, 7, 150, -149, -14, 152, -131, -53, 154, -131, -77, 179, -100, -109, 165, -60, -118, 165, -41, -140, 179, 17, -155, 124, 29, -136, 125, 29, -168, 125, 89, -185, 75, 114, -152, 59, 114, -173, 26, 156, -147, -24, 139, -116, -8, 143, -139, -28, 181, -102, -98, 160, -65, -86, 157, -70, -124, 176, -16, -156, 140, 9, -115, 134, 0, -156, 148, 66, -182, 73, 88, -147, 78, 82, -184, 55, 145, -154, -8, 151, -104, 14, 130, -152, -47, 189, -111, -86, 156, -62, -73, 172, -101, -97, 190, -33, -146, 118, 12, -131, 136, -91, -180, 118, 28, -204, 76, 58, -164, 52, -50, -165, 60, 175, -179, -18, 133, -98, 79, 97, -173, 8, 184, -113, -75, 159, -77, -36, 160, -107, -90, 195, -32, -140, 125, -19, -96, 146, -41, -144, 165, 46, -173, 96, 40, -136, 123, 34, -187, 112, 120, -162, 21, 94, -116, 53, 100, -174, 25, 166, -131, -53, 128, -95, -6, 158, -128, -73, 186, -50]
6335e0o2K44j71l5K28k06p2K88j34j73K60q2j47K44j07k04K87J2k80K12L1j97
6357a14J85J7k60K13J19k87J15J35k36J17J35k79Q3K41k74kK38j93j7K09k10n2
6379a17K84j72j17K42j20j09K60j41j65K96o2k49K45Pk19K10Nk41K15Q1k63J30
6401@J21k43J39J05k73J18J92k59L2K12k27L3K07k22k4K52j89o8K21j33q9K35
6423A40j56j34K88p8j78K43n9k07K37l4j97K42k7k42J56N7j97J29J30k52M8K81
6445A90k95Q9K21k84N7J88k35mK19j98l8K38j87o3K52j66j08K57j20j45K44n8
6467E4j95K38l0k07K28j9k12K05J4k14J85O7k44J54R9k49J16J53k51N5J86k23
6489i0M0J84k14K2K09k02m3K39j67p4K26j56r3K70j25j75K39m8j55J98m8j72K31
$$ y = [-50, -112, 132, -39, -74, 154, -52, -124, 164, 30, -143, 117, 35, -112, 132, 25, -179, 108, 120, -160, 52, 83, -114, 71, 88, -172, 41, 160, -127, -12, 123, -113, 4, 139, -140, -57, 184, -90, -92, 146, -47, -64, 145, -65, -117, 167, -5, -122, 120, 0, -109, 151, 10, -155, 141, 79, -170, 75, 82, -137, 73, 78, -163, 52, 133, -130, 0, 121, -122, 17, 122, -151, -33, 159, -100, -68, 144, -83, -50, 157, -65, -89, 163, -26, -94, 127, -6, -95, 140, -16, -150, 138, 60, -118, 125, 66, -141, 96, 62, -135, 107, 80, -162, -6, 51, -146, -17, 113, -139, -91, 190, -105, -16, 205, -79, -22, 166, -69, -73, 146, -52, -90, 148, -39, -102, 150, -16, -124, 133, 13, -132, 112, 54, -141, 97, 67, -140, 88, 69, -143, 62, 76, -138, 47, 114, -130, 24, 123, -126, -10, 143, -108, -53, 133, -90, -50, 134, -80, -58, 151, -51, -94, 145, -22, -96, 130, -26, -119, 151, 26, -149, 90, 42, -113, 85, 37, -135, 96]
6512I6k5k26J94M9k07J56M8k32J77J07k58Q7J61k21P2J27k09P5J75k30mK14j58
6535c2l2J99j74n8K53j53j37K54p5j43K01q5j28K18k6k25K06K3j94J59J8k06J93
6558E6N7k52J35J28k14Q2J08k20J18J46k39J5J94j63MJ61j84qK43j87j01K29p7
6581C1j11J77r4j19K46q0j79J95J2j76J71j3j99K07M6k60J41J17k01R1P9k07J21
6604eJ47k38M0J73j75K0J55k00K0K09j93o0K23j15p4J74j22p6K48j26j45K09m0
6627D9j30J74o4j54K34rk26J55O7j82J22L0j94J46J16k38O4J51j98O9J16k09N7
6650e4J93k03l6K13j44m6J87j64m4K31j27j23K03p0j06J85q1j26K23m8j93J91
6672F1K3j66J39J4j88J57N8k07J03J00j66O8J12k17P4J63k04jJ79j54k0J88j76
$$ y = [96, 71, -155, 39, 88, -119, 37, 85, -147, 30, 137, -121, -34, 127, -94, -22, 105, -104, -29, 146, -84, -88, 126, -32, -64, 135, -39, -97, 156, 3, -134, 120, 45, -98, 103, 18, -110, 108, 82, -143, 63, 86, -108, 51, 69, -137, 56, 113, -139, -4, 124, -90, -8, 100, -120, -2, 144, -95, -80, 114, -49, -45, 116, -68, -76, 167, -20, -121, 108, 31, -80, 97, 3, -116, 130, 50, -129, 66, 78, -98, 73, 60, -139, 68, 114, -146, -5, 112, -89, 2, 81, -126, -5, 142, -96, -56, 117, -58, -38, 117, -83, -63, 146, -47, -107, 116, 1, -73, 101, -21, -97, 151, 25, -120, 89, 49, -81, 93, 29, -125, 109, 100, -126, 29, 96, -86, 36, 66, -128, 18, 134, -104, -40, 111, -87, -18, 98, -111, -54, 139, -64, -100, 113, -31, -77, 110, -54, -98, 133, 6, -117, 86, 16, -90, 95, 14, -112, 111, 63, -130, 61, 84, -82, 57, 71, -117, 40, 98, -109, -6, 94, -72, -4, 108, -109, -35, 128, -76, -77, 102, -52, -72, 116, -60]
6695f0j5K01j37q3J91r4r4J84r2j15K17n5j73K05k4j57J74j2j67J62L3j90J25
6718B4N7j69J07P4k01J07J16k03N8J40j87L1J58j79OJ66j42n8J88j17n4J88j13
6741cr1J87q5j09J90o1j41J92k5j59J68Oj58J40L0j80J28M4j69J07Q6j82R1J04
6765A10j93N8J41j74J5J41j48j1J67j55k6J82j25o9J89j12q0J86r1j18J87l9j34
6788i9J64l2j32J68%j74J38M3j74J30M2j62J10P7j95P2J29j72M0J10j52M6J34
6811A11j68jJ54j29k5J45j26l2J90j23r0J77o4j04J48m7j04J73m9j46J69J0j46
6834g7J15J0j40J36N1j98R3J03j62M9R4j45O0J12j78K1J63j33j5J22j29j1J63
6857A04j26o8J83p8q6J47p5p1J58o3j27J59nj28J28j8j22J55Mj80J17Q0j51O6
$$ y = [-60, -75, 126, -11, -94, 97, 3, -91, 93, 1, -114, 103, 48, -125, 80, 56, -101, 73, 61, -106, 56, 89, -101, 24, 81, -88, 19, 93, -108, -1, 115, -88, -30, 110, -77, -46, 112, -67, -61, 105, -37, -95, 93, -24, -78, 110, -3, -94, 93, 8, -101, 89, 28, -113, 79, 54, -105, 63, 69, -89, 51, 81, -99, 29, 73, -96, 11, 97, -85, 6, 110, -83, -25, 116, -58, -43, 98, -50, -61, 106, -49, -75, 107, -18, -87, 102, -10, -90, 96, 5, -113, 74, 35, -99, 65, 33, -99, 69, 69, -105, 33, 76, -98, 32, 74, -88, 22, 99, -96, -24, 105, -67, -27, 83, -69, -23, 111, -57, -58, 96, -33, -58, 87, -39, -71, 119, -4, -94, 83, 19, -85, 63, 16, -88, 85, 36, -110, 59, 69, -77, 38, 48, -92, 44, 95, -103, -10, 93, -69, -20, 74, -71, -11, 101, -77, -56, 107, -26, -41, 81, -48, -59, 104, -22, -90, 93, 15, -71, 76, 1, -70, 88, 25, -102, 57, 52, -76, 52, 34, -88, 67, 71, -109, 8, 88, -63, 3]
6881CM5j33R0Q2j70M7J34j43OJ06j29K9J50j60l5J68q7o7J44r1n3J64p3j17J57
6906F7k5j04J09j6j13J58k3j49J10O0j46Q5L0j32J12N6j71O0J11j22K6Q4j24M1
6930a6J17j54j1J54r7n2J30r2m6J58q1q7J54l7r6J17m0j03J55k6j38J26L9j42
6954f8R4L2j37J10M7j59P0J00j49N2P6j48P0R7j50J2J39j15j8J12r9k1J46r7p1
6979g5J39n7p2J31o6p4J45k8j33J46nj21J10J3j35J11L5j41Q8O0j31O5O1j48P7
7004eP4j39K9J20j30J4J11j14mJ38j10m5J25p7n0J30n8p4J36n0r2J23j3j11J22
7029E0rj16J17J9j25R7M0j36Q1N4j43P6P5j44M9R0j33K2J12j17%J22j10j3J25
7054H3j05l9J35p3p3J37o3n8J20m1r8J36k1j14J11J1j18J06J4j25J03L8j33Q8
$$ y = [3, 48, -85, 5, 87, -83, -36, 98, -45, -39, 67, -62, -33, 117, -43, -78, 90, 3, -64, 80, -11, -64, 100, 27, -90, 67, 42, -62, 47, 31, -82, 76, 53, -96, 14, 74, -72, 13, 43, -89, 23, 79, -92, -32, 79, -43, -17, 67, -57, -16, 101, -53, -64, 90, -7, -59, 71, -21, -67, 91, 10, -77, 77, 40, -56, 61, 21, -82, 73, 47, -91, 35, 74, -68, 26, 58, -79, 31, 78, -81, -11, 89, -60, -8, 68, -80, -10, 87, -63, -51, 88, -27, -45, 67, -32, -53, 93, -4, -75, 64, 7, -65, 66, 0, -74, 71, 43, -90, 56, 51, -70, 40, 53, -82, 29, 64, -77, 11, 71, -60, 5, 66, -82, -5, 69, -70, -41, 79, -51, -37, 74, -40, -44, 94, -16, -61, 64, -13, -63, 67, 9, -65, 71, 21, -71, 52, 39, -72, 50, 41, -75, 42, 61, -64, 33, 73, -63, 18, 72, -71, 5, 80, -64, -15, 75, -58, -36, 76, -41, -41, 81, -29, -42, 83, -22, -61, 74, 1, -72, 65, 2, -56, 64, 23, -75, 61, 40, -74, 37, 48, -70, 36, 50, -75, 28, 66, -67, 21]
7078B1M2j28P5O3j45N6J01j43K7J01j05lJ19j09k0J15p8l5J09o8m2J24p0o8J33
7103G2m1r9J23j8r3J21j9j15J10Qj28R7L7j09P4M7j30O8P1j34L6Q4j19L4R4j21
7129e0MJ20r3k5J02q0k5J21r1o4J39l7p8J04k9p6J16j9j19J29J4j20Q7J6j12R6
7155C0K8j34P5P6j20M0P5j23M1Q5j28K0J03r5j4R9q8oJ08j08k3J29o1p1J12m7
7181Cm1J01l7r4J23pj16J02Pr2R9Kj28R4N5j27N2N6j04N0O5j18L1R3j06jQ6q7
7209c9%J14j14j3J15o1n3J03n8m4J25o8o9J11j5q3Q9Mp8Q5jj12R5L9j21O8M2j12
7237e1P2N3j23L7Q8j01NQ4r7LR8j01j4J17p4n7J16o2m5J11o3o2J16k1q7R5k1p5
7265e9J06j1j06R7K2j03P0K6r7P6L3j11M7Q1j12L7N6j00L8P9j08LQ9p6k3R0o0
$$ y = [21, 63, -65, 10, 73, -72, -16, 85, -58, -31, 70, -35, -38, 81, -28, -48, 67, -11, -46, 63, -5, -47, 77, 7, -61, 72, 31, -68, 55, 37, -56, 65, 46, -69, 41, 49, -79, 18, 55, -54, 20, 67, -63, 5, 76, -58, -22, 62, -57, -23, 71, -50, -46, 74, -19, -44, 58, -22, -47, 74, -17, -81, 58, 21, -57, 47, 18, -58, 58, 39, -80, 49, 63, -57, 30, 46, -66, 30, 58, -76, -1, 75, -45, -5, 70, -53, -12, 73, -55, -35, 68, -27, -41, 58, -30, -36, 72, -36, -59, 70, 9, -62, 50, 3, -38, 63, 26, -68, 55, 48, -68, 34, 41, -51, 48, 50, -78, 16, 71, -56, -4, 52, -52, -2, 63, -55, -24, 69, -37, -38, 48, -39, -39, 75, -39, -52, 63, 2, -51, 52, -6, -50, 75, 7, -62, 49, 34, -49, 40, 44, -34, 51, 50, -62, 33, 72, -49, 19, 61, -51, 21, 74, -49, -12, 76, -25, -20, 64, -33, -30, 68, -33, -47, 70, -4, -61, 55, -7, -52, 59, -4, -66, 50, 29, -58, 37, 16, -59, 47, 36, -70, 27, 49, -54, 16, 42, -55, 21, 54, -57, -10, 71, -41, -4, 52, -48, -10, 69, -39, -36, 53, -23, -46, 44, -16]
7292a6l2J04o2n4J28n6o1R5k5p6J03k7p4R0Qj02R3J9j07Q1K9j16P9L4j02L5O0
7319D8r4M7N2r7J1Q6r2LQ6q5qR7o5l9J05o0m5J03n3n5R9k2r0J02j3q2R5%r1Q9
7349C2J0j01P3M5j14N4N6j12M9N2r1L7P2j02K3P8r0jR6q7l2J19p5m6J10m3o6J01
7377D7l6n8Q9j9p4R1Jj01Q4J9r7P8K4j01O6M4j08M8N6r6L8O4j04J8R9j07LQ8p7
7406b1j6Q6o5l6R9n8m8J00l3n5R7l9o9J21k6r7Q5Rp4P2J1r4P3L6j00M7N2j01N0
7435FN0j10N0P7j10OQ6r7PR1q7j2J01p3l9R8m4l5Q3m7n8J11m0o9Q8j3p8Q3Jq6
7465f0Q1K2q7N1L2q2N1L8j03N9O3j08J6P3q4K1N5p7NJ00p6m0J01n3l7Q8n0o3J07
7494D3l4p0Q4pm9O3po8Q5Qr6O6L4q8N4L8q8M1N0q7K3O3q5J9N4o9MP5p0k3P2m0
$$ y = [-16, -48, 56, -6, -60, 68, 12, -49, 46, 21, -55, 48, 21, -53, 37, 45, -57, 36, 55, -52, 29, 58, -58, 21, 55, -47, -12, 48, -46, 1, 53, -44, -33, 53, -39, -36, 50, -35, -43, 54, -11, -50, 55, -5, -50, 53, 0, -55, 44, 22, -68, 34, 21, -61, 34, 34, -57, 32, 42, -59, 14, 59, -55, -1, 55, -57, -8, 44, -47, -10, 62, -40, -17, 61, -29, -30, 66, -21, -53, 66, -9, -55, 55, 12, -54, 47, 11, -47, 42, 23, -51, 40, 41, -60, 24, 43, -54, 24, 48, -53, 13, 57, -51, -3, 53, -43, -5, 59, -45, -27, 72, -35, -32, 56, -21, -37, 49, -16, -52, 47, -11, -59, 41, 8, -47, 50, 11, -58, 63, 37, -60, 25, 34, -40, 32, 43, -51, 22, 58, -42, 5, 57, -44, 6, 56, -54, -4, 73, -37, -31, 55, -42, -35, 56, -31, -43, 58, -15, -54, 44, 0, -35, 48, 1, -57, 54, 14, -55, 33, 20, -58, 25, 26, -60, 21, 43, -44, 7, 39, -43, 8, 46, -57, 2, 65, -43, -27, 46, -38, -17, 38, -39, -34, 66, -10, -50, 51, -2, -39, 49, -1, -64, 43, 9, -61, 23, 16, -33, 30, 23, -45, 40, 48, -48, 18, 52, -36, 18, 56, -32, 9, 59, -28, -5, 58, -27, -8, 46, -23, -19, 56, -14, -37, 35, -5]
7526ek8P9n8m2R4m6n4Q9j7m6P4j6p7Q3lp8O4K2p1N8K3q1N0L2p6K9N7p5J8O1r6
7557c6K5O9q9KP3n4k1R0p0l0O0k5o0O4J3o7N6L6r0R6L3j12P1K6p4J1L9p5N6pm6
7588c6L6L1p1M1N6q0K3O4q5mP8p0pO8o0rO1l7l5Q2m9m1O8j7n7P6j5o1P0Mp3O4
7620A5K2p9N7L3q6N3M3q0L2L9p6J1O6p4J2O2o6qO8m8j5P0o8qO5n0l8Q9l2n7P6
7651B8l1m7P4ro1N7K5p7N3K1p5N5L5p1K3M7p5J5P2q4K4N7p1lO6n8j6N9n8mP5n6
7683a0l8Q0l0m3P5k2o1Q1j3p2Q0lo6O0J2p8O4L8r2L8N2q4M0L5p6K9N4p1J0O4o4
7714a1rO8n6j8Q4n2m3P2l7l9P5l7m1P6j2o7P8j8o6O4J0p1O1K8q1M4M4p7L5L9p3
7745c0K5N8p9K1N9o1j4O5o1oP8o2j1N6l5k9O6m0m6P6k3o0P8ln3M4Mo1O0K1p8M7
$$ y = [-5, -33, 46, -12, -54, 40, -6, -60, 29, 12, -34, 40, 24, -53, 30, 27, -51, 13, 35, -36, 22, 45, -36, 14, 46, -30, -1, 56, -19, -1, 60, -36, -11, 58, -31, -29, 44, -10, -31, 59, -11, -41, 19, -6, -66, -2, 11, -56, 0, 36, -54, 42, 75, -37, 34, 60, -14, -3, 36, -39, 17, 10, -36, 0, 31, -40, 1, 57, -23, 0, 64, -21, -25, 53, -17, -24, 44, -16, -25, 36, -1, -36, 46, -3, -44, 24, 7, -50, 26, 11, -50, 20, 24, -49, 15, 37, -42, 15, 48, -38, 15, 58, -22, 10, 49, -27, -16, 50, -24, -12, 50, -16, -24, 44, -4, -19, 51, -17, -25, 40, -10, -48, 41, 9, -48, 28, -3, -50, 24, 15, -46, 11, 36, -41, 12, 33, -42, 13, 48, -23, 0, 47, -28, -13, 59, -25, -1, 56, -15, -18, 48, -10, -26, 33, -25, -29, 46, -10, -48, 32, 2, -41, 34, 12, -49, 32, 19, -53, 27, 24, -42, 18, 30, -48, 16, 54, -38, 0, 52, -32, 8, 43, -33, -4, 50, -21, -11, 53, -11, -20, 48, -8, -26, 58, 6, -37, 35, -2, -41, 34, -3, -44, 32, 20, -47, 31, 13, -53, 11, 21, -50, 11, 39, -42, 2, 46, -31, 4, 43, -30, -5, 53, -26, -5, 54, -7, -21, 44, -17, -23, 55, -7, -18, 38, 3, -26, 40, 0, -46, 30, 7, -53, 25, 22, -31, 13, 17, -44, 16, 37, -41, 6]
7777FL5o7L9J8o1L8M3q1L9N2p6JO4o6NN4n9rO5m0k7O7m4l7P8k1n2N7on2N4kn6
7810d1N1J9o3M0K8o9M0J5o4M5L2o1K7M8o1PN3n6NM8m6k0O6n2j0O4m8k7P5l8n0
7841d3P8k3n1P2j9m3M4J1o4N0Qm7L3L0o0K0L8p2L7L6o4K6N0o6J1N3n3JN3l3m5
7872c2R0p0oO3k6j7Mj8qP7n6m2L1K7n3K7m0J6M0J7o7M2J8n2L0M2o7RN0n1J1M9
7904C8m6JN6m8k4P9m2k9N9l0l8O2k7m0O5j5n7O0Ko3M7J7p6N5J5n9K8L5o5L6L6
7935C2o0K1L8m9PL7l8j3O9n8nO8n2k5P2k8l4O0l3n2P6k8m4P1k8m3N1Po2N8Ro2
7967c8M4J4p0N6K2o5K3M3n7J4M9o8J6N3o2QO2n6qO1l2m8J32r5k4P7m0o8J13rp5
7998b8J5O6j04N3M3r3M4Q4r8%O5j17O7N6j07O5Q7q8o6J04n4jP2j06kJ41q6n0Q3
$$ y = [6, 41, -26, 13, 31, -30, 8, 51, -30, 9, 61, -15, -14, 50, -16, -11, 43, -16, -25, 40, 0, -27, 40, -4, -41, 37, 16, -36, 21, 15, -37, 17, 15, -41, 10, 29, -34, 6, 34, -35, 5, 20, -44, 1, 33, -28, -1, 47, -14, -7, 46, -10, -5, 43, -3, -23, 43, -9, -19, 45, -3, -30, 45, 7, -43, 35, 12, -39, 33, 14, -29, 15, 26, -38, 12, 20, -27, 6, 36, -24, -4, 34, -38, -1, 35, -29, -3, 47, -19, -8, 45, -8, -7, 46, 13, -32, 58, -12, -18, 45, 19, 2, 6, -12, -20, 57, 1, -41, -10, 17, -36, -9, -49, -33, 7, 24, -43, -1, 17, -35, -5, 37, -30, -21, 29, -22, -11, 38, -8, -7, 49, 1, -23, 56, 14, -15, 44, 14, -24, 38, 11, -29, 36, 21, -36, 24, 26, -37, 10, 27, -49, 6, 21, -38, -10, 25, -40, -4, 32, -28, -7, 31, -18, -11, 26, -12, -25, 44, -14, -19, 49, -3, -28, 44, 16, -18, 42, 9, -43, 33, 5, -39, 32, 4, -39, 12, 19, -43, 15, 24, -38, 6, 20, -50, 6, 28, -37, -14, 29, -28, -14, 35, -33, -17, 36, -26, -18, 44, -12, -20, 41, 9, -39, 93, -2, -26, 51, 11, -57, 56, 47, -28, -13, 53, -51, 2, 45, -48, -4, 80, -18, -18, 47, -70, -3, 53, -54, 11, 98, 10, -56, 48, -6, -7, 65, -41, -43, 98, 12, -38, 45]
8027D5n8rO3l3m7P3j6n3O0mo6O5%n6N3J5q2N1L2q1L1L8n8K7L0m8J7M6n5JN4n6
8059b1KN9n3j8P4n9j5N6j7l2P0k7m4N8j3n2N4j1n0O0jo4N3J8o2K9K9o6M4K8p1
8090d2L4M4o1mO5o6%P3m7j0M9l8k2N7l7k9O6k3n3Q3j3o3N7nm4N6kp2N6J8p0M2
8122aL2o8L9K6o7K4M5n9MN4o1QO4o8mP3n5j9P1m6k4P4m4l7P2k6l6O8k5m8O7j1
8154B2p5P6J6p8M9J8p7M6L8p9L6L5n3J6L1o3K4N4o7pP1m8pO7n0l1P3l5l3P1l7
8185Cl4O3j4n1O6l
$$ y = [45, -13, -22, 41, 8, -39, 34, 18, -35, 25, 21, -45, 20, 20, -36, 17, 32, -50, 1, 33, -48, -17, 21, -37, -10, 20, -28, -11, 35, -20, -19, 35, -21, -19, 40, -13, -31, 43, -16, -31, 25, 8, -24, 46, 19, -25, 33, 20, -32, 22, 11, -39, 21, 20, -44, 9, 27, -35, -6, 23, -43, 1, 29, -42, -8, 36, -25, -29, 36, -30, -30, 43, -4, -14, 35, -3, -25, 32, -5, -34, 32, 9, -44, 39, 26, -37, 20, 15, -29, 27, 25, -47, 9, 27, -43, -1, 31, -37, 2, 28, -39, -15, 30, -29, -25, 29, -32, -24, 40, -28, -32, 41, -14, -33, 38, -8, -32, 42, -2, -39, 33, 7, -29, 39, 14, -34, 33, 22, -53, 23, 39, -39, 10, 28, -49, -3, 35, -44, -8, 27, -26, -10, 21, -42, -18, 36, -31, -38, 33, -15, -22, 45, -5, -36, 37, 2, -31, 40, 3, -31, 32, 18, -33, 33, 30]
8191C0
$$ Imaginary data points
##PAGE= N=2
##DATA TABLE= (X++(I..I)), XYDATA
0@%%%%%%%%%%%%%%Oj4J6j6J6j7K5l2L2m0M8n6O5p3Q8j02J14j28J46j66J86k09
36a11K34k61K92l26L64m04M46m92N44o01O63p31Q04q86R77j076J187j311J449
55G61j606J784j991K232k518K866l291L833m548N530o967R266j3485K3478q4291
70f8947l9856K57388j72186q0556K09196j17869q5028K05820j13048j01509J98436
81I1841q1024j12031J95886q5829j34152K27025m4785k05936K03172L9031k07404
92a14206J33885O3330j80505J14818P1065j80395R1700Q8705j68232Q1390Q9445
103I1000j86271Q1005J40840k07903J7067J88083j59227m0369J72084j18671n0944
114g3306J63981j01218o9582J56893p8835p1587J52597q4251q9434J83474n9729
$$ y = [0, 0, 0, 0, 0, 0, 0, 0, 0, 0, 0, 0, 0, 0, 0, 6, -8, 8, -8, 8, -9, 16, -16, 16, -24, 24, -32, 33, -40, 48, -54, 60, -68, 78, -88, 98, -111, 123, -138, 154, -172, 192, -212, 234, -258, 286, -315, 348, -383, 421, -465, 512, -564, 623, -688, 761, -845, 939, -1052, 1180, -1338, 1528, -1763, 2070, -2478, 3052, -3915, 5351, -8134, 15344, -68947, -108803, 148585, -23601, -104157, 105039, -12830, -97858, 107962, -5086, -106595, 91841, 10817, -101214, 94672, 8843, -125309, 101716, 56931, -149005, 54167, 93198, -114206, 19679, 83009, -97496, 17322, 88387, -92008, -308, 88397, -79835, 1555, 91000, -95271, -14266, 126574, -81329, -64262, 123821, -35406, -75775, 96309, -22362, -73306, 90675, -10543, -80125, 76768, -2067, -73654, 78943, -5308, -94742, 88732, 29003]
125B9003j46738J74056N604j61720J27201L5410j48445J02916N0486j43165P9672
136D280N9853j29618P4078N8092j45228P7323R5918j65962L3665J36739j38902
147c9762j3147J36987j07420l3573J32348q5265m9230J21374o8375m7215J18998
158F5720p5945n9940J45260o2123j03910J46834j6290j25574J19079J5336j25060
169g6613R4850L5078j18124P2204M0925j05814O9001L8747j17740P3386O5097
180G0997j36677M6724R9557j26380R221J11750j02697j7150J10020p8308l1134
191d4077R8007o4295k8902R5514o9575l6667J14171o4314o7263J24049l5358r4137
203g2847J11760k566j03506Q8352J9860r6851O8072K4639q8176O5049K4890r6113
$$ y = [29003, -117735, 56321, 61925, -99795, 27406, 62816, -85629, 17287, 67773, -75392, 4280, 64133, -65485, 8593, 66685, -78543, -1220, 94698, -71264, -37599, 99140, -39762, -52909, 84078, -23342, -56915, 75433, -9832, -59062, 62312, -6063, -53278, 65720, -10225, -70165, 75095, 12972, -90938, 55896, 39606, -85968, 33111, 48447, -76613, 18237, 53315, -64809, 7395, 48320, -57494, 11507, 50254, -67486, 5900, 70997, -65680, -18956, 80601, -45779, -36558, 75192, -27505, -44655, 65365, -12943, -44077, 53930, -10365, -39267, 56247, -13328, -49995, 64176, -138, -67401, 56648, 21290, -72847, 38913, 36347, -67159, 21193, 41053, -55798, 12274, 36913, -51263, 13786, 38676, -57437]
215e7437O8045M1402j12369N5659P0366j16405K5858R2989r9538n219R4465p4608
227a6792j8283Q4073o3070j8810Q2499o3283k4415R2295o2216m2426J05995m7231
239H336p1000J05262j4750q6969Q2458Q767q0101O4548J2653p4789O0853J5667
251C0935p8083O0760K2800q9345O0443M3949j04389M0002P3285r5338P403P8548
263E0970p2481m894P1442o3886q701P1984n9768j3645P4772o1221k1326R0581
275E3827n7978m9675R9935k8026p1404Q0360l463o7103O4622K188o5389N8712
287A6606R151o4793N4133J0258p0421O0588K4347r0884M7349N5948q7458J5869
299a9307O3676o7813M088O0292o1120l240O2057n2932p751N9132n5598p762P5103
$$ y = [-57437, 10608, 52010, -60359, -4700, 65666, -50739, -24881, 68108, -31430, -36649, 57816, -16792, -35075, 48998, -14072, -32882, 49617, -13666, -38081, 54214, -8002, -50428, 55567, 8336, -62664, 42598, 27848, -59121, 23337, 32104, -47997, 16551, 29204, -45585, 15268, 30935, -47148, 13612, 36412, -52933, 7510, 51459, -52930, -12928, 60357, -34981, -27578, 50970, -21511, -26405, 45037, -18849, -27550, 44434, -15334, -28979, 45793, -15428, -36754, 53827, -4151, -53826, 46109, 18083, -53321, 27039, 23576, -43527, 21095, 23283, -42106, 16606, 25757, -39036, 15097, 25355, -45066, 15522, 39869, -51015, -3666, 52282, -35176, -19307, 44369, -23444, -19356, 40936, -20184, -23424, 38633, -14299, -22050, 37082, -18516, -26278, 48825]
312D8825o0395l3780R0391l4831n7329P5661j2424n6572O4275m675n9174N6476
324A6448N670n5496M8689K474n6958N9160J1310p9424N1154M1900p9612K3007
336a1678N0826o4463J1936N1845n9116M97N4304m6528m017M6085m8968J863O0328
349D2914n8896k0358P8277l8401m3083O8270j9815m5229O1856j0934n2096N3549
361A6054K390m7027M3263l253m5063N6038O66o7739N3428K8448p2006L0353L8822
374C4374o2307K0311M3962n8992O219M8240m4311K33L7387m4627R220M7797n7147
387a9641p479O6525m2785k8690O1638k7313l3797N8605j7725m3171N0872k836
399A4203l8840L8909p935l3733N0460q983n3156N3548J3105o1906L7551K5374
$$ y = [48825, -11570, -45350, 45041, 10210, -47119, 28542, 16118, -40454, 23821, 19146, -40028, 16448, 22118, -33378, 15311, 17785, -39173, 19987, 31297, -48127, 3027, 44927, -34685, -11678, 39148, -25315, -13379, 38466, -20650, -20153, 34151, -12377, -16394, 29691, -19277, -17414, 42914, -15982, -36340, 41937, 3536, -39547, 28723, 8908, -36321, 25535, 14601, -37495, 16054, 18444, -28583, 14680, 11427, -33636, 22402, 23068, -44671, 8757, 37205, -34801, -4448, 34374, -27933, -7622, 36340, -22652, -16433, 31807, -12504, -12271, 25116, -19511, -10291, 37506, -19641, -27120, 39405, -3380, -32070, 29568, 2255, -31542, 27063, 9338, -33833, 17039, 14203, -24637, 14272, 6337, -27396, 23064, 14081, -39075, 14473, 27578, -34328, 3223, 28597]
411B8597n8434K8146L4074n7054J3486M0210m3617O015L0759m1803J4275L7186
423C1840n3840L839N4498m6814j4550N6020l4872k3752N5992k3829l4627M8765
435A8670q768l2044L6963j1052k6474M4389j3588m0201M9481J515n0599M0621
447H913J4302n2762L1688K5888n2092J7071L2273m0590R535K5386l7863J5296
459b955K8783m7045J0124M2237m6239l421M9165l9172j5660N2458k7557k7353
471b6635M6297j3737k6666L6485j3409k2403L9930j5640l0457M5176p227m0715
483b9001M2676M743m7313L4780J8035m7373K0887K4712l8281J3035K0902l4216
495a6414J5271K1371l9382J4318L0197m3144N811M0438m0454p529M6132k9845
$$ y = [28597, -29837, -1691, 32383, -24671, -11185, 29025, -14592, -8577, 22182, -19621, -5346, 31840, -22000, -18161, 36337, -10477, -25027, 30993, -3879, -27631, 28361, 4532, -30095, 18670, 9902, -22142, 14821, 3769, -22705, 21684, 8096, -32105, 17376, 18891, -31708, 8913, 23215, -29547, 2141, 28029, -24063, -6992, 25281, -15309, -5774, 19612, -18251, -2955, 25828, -21217, -11093, 31144, -15095, -18516, 30649, -8523, -24183, 28275, 718, -26635, 19662, 5925, -20741, 15744, 2335, -20068, 19862, 4222, -26235, 18941, 11714, -29001, 13675, 18418, -28895, 5885, 23920, -23453, -2566, 22146, -16135, -3100, 17802, -16414, -1143, 20228, -19154, -4836, 25361, -17783, -11972, 28466, -11988, -19517, 26615, -3230]
507c230j8982M2214j8364k0835L5318j5130j8634L5033j6635k1552M0293j4324
519E172l1498M3402l347m1591L6894J0494m2687K5159J7501l7335J7137J8080
531A7381l2589J4935J6659l3243J6793K0914l9900J2345L3047m0014j377L9482
543B4433l0439j1453L7440k1757j5755L3723j5617j6055K9680j5545j4212L3824
555A8267j8342k2840M1223r052l4952L6310L951l6641K7772J0393l5554K0935
567A470J5232l1443J4819J3234k8275J8343J3529l6672J7551K6484l9265M216
579a0777L3454l1090m464L3300k5216j0882L2741j6749j4078K5922j4267r207
591a1313K7985k0005j5718L7303j2779k8007L3886j438l0152K8369M317l2370
$$ y = [-3230, -22212, 20002, 1638, -19197, 16121, 991, -17643, 17390, 755, -20797, 19496, 5172, -26326, 17076, 13729, -27862, 9032, 19526, -23161, 1998, 19499, -17836, -699, 17381, -15208, -273, 16386, -16857, -64, 20850, -19050, -6705, 26342, -13672, -15049, 24433, -6006, -17459, 19981, -1776, -17531, 16192, 575, -15480, 14200, -1345, -15557, 18267, -75, -22915, 18308, 9256, -25696, 10614, 14565, -22076, 5696, 16089, -19465, 1470, 16702, -14741, 78, 13312, -14963, 3380, 16909, -19763, -2212, 24272, -14993, -10777, 22677, -8413, -12877, 20423, -4793, -15675, 17066, 317, -13761, 12161, -2106, -11313, 16672, -3333, -19051, 18252, 5473, -22534, 11352, 9914, -20238, 8131, 12448, -19922]
603a9922K2861J2071k9185J4303J0109k3453J8409P558l2161K0560J9678l6742
615a5914R373K6844l1324K463K9155k8551n529L1704j9107j1199K3905j4835n122
628h137K4279k1743r772L3869j6492k1053L2051p498k3968K9571j923k9235K4882
641D831Q398k6980J4343P133j9595J7937L007k7312K1432J3362l2369J2860J9646
654A6693k9732Q317K4036k9979o38K9475k0468q324K1801j4967k037K1071k2180
667f932n258L0366j8651j5063K9813j2272j8301L0303p564k6124K7101M423k5512
680a3671J5570M671j7513J7627J03k3505K1337Q336k8214J5028J3564k7409J2221
693a855J8976k9650L391K6209k1042n560J9757j4436m27J7712k0478j786K5512
$$ y = [-19922, 2939, 15010, -14175, 128, 10237, -13216, 5193, 12751, -19410, 1150, 20828, -15914, -6541, 20303, -11021, -8558, 20597, -7954, -13483, 18221, -886, -12085, 11820, -3015, -8137, 16142, -5601, -15373, 18496, 2004, -19049, 13002, 5504, -18464, 11107, 9184, -20051, 4831, 13229, -13751, 592, 7725, -11870, 6067, 9074, -18238, 3194, 16556, -15813, -2953, 16693, -13039, -4722, 19314, -10665, -11303, 18172, -2296, -10620, 11181, -3786, -5823, 15248, -6932, -12190, 18176, -475, -15538, 14275, 2003, -16298, 14005, 6441, -19683, 7418, 11841, -13671, 1899, 6570, -10943, 6684, 6787, -16718, 4619, 12955, -15259, -231, 13333, -14076, -1855, 17121, -12529, -9138, 17071, -3971, -9531, 10226, -4210, -4637, 13075, -7403, -9189, 16323]
706A6323j9026r479K6511j5114j3039K9111j1491k1929K7852K59k3478J7287K450
719F237j6538J7390j523k0253K0840L911k4655J7312Q438k5903J5469J4508k8970
732a3737P397K2220k2178j792J8245j5201N97J5455j8329N78K0329j8449m290
745i155K2668j6834q321K6466j3606j6927K6318l516j9904J8234J67j5266J6416
758F740k039j6603J8853K22k0158J8372L743k3571J7513J0232k7062J0621J7611
771A4474k2739K429J6615j6821J803J4239j6990K145J6142j7968R7J9341j8356
784e589m357K3944j5284j2153K4445p230j6017J9050k341j4129J5737k379j3195
797i498J6295k584j5285J8204l53k0096J8212O027k3895J3059J2587k2234O347
$$ y = [16323, -2703, -12182, 14329, -785, -13824, 15287, 3796, -18133, 9719, 9978, -13500, 3787, 6237, -10301, 7089, 5566, -14687, 6153, 10064, -14591, 2721, 11159, -14744, 725, 15233, -13737, -6340, 15880, -6298, -8090, 10155, -5046, -4449, 11006, -7323, -6745, 13584, -4865, -9155, 13513, -3321, -11642, 14824, 1218, -15709, 10609, 7093, -12811, 5423, 5590, -9676, 6740, 4701, -11902, 6951, 7173, -12985, 5387, 9130, -14441, 3072, 13304, -13758, -3137, 14474, -8265, -5836, 10779, -6042, -4239, 10000, -6990, -4845, 11297, -6671, -6574, 12767, -5589, -9946, 13998, -1286, -13439, 11006, 3776, -12241, 6809, 4468, -9661, 6076, 3697, -9498, 6797, 4213, -11072, 7132, 6779, -13317, 4895, 10922, -12973, 86, 12673, -9561, -3214]
810c214J4413j7894L105J2896j5622L507J2373j7227L650J6133j9233p60K1095
823A3222j6739p434K2457j1059j2198K0115n202j3239J5654k787j0842J4397m488
836A857j1677J7536k945j6923J7633K791k0001J4126P963k0652R178J2224j7914
849f804L634J1594j3519L906R057j5477N750J2998j8430J604J7549j6599l208
862g945J9545j3877q327K0464p908j2112J5705l560q941J3198o329q971J7272
875H214n236j4327J7272k93j6580J5400L349j9213J2379R676j8327M945J0451
888G710j2271M401O518j3794P181J0150j6977L361J3914j5495M17J5941j5358
901d302m346J9449j0035j0239J5198m267p173J1743p331o387J5975o920j1286
$$ y = [-3214, 11199, -6695, -3590, 9306, -6316, -2809, 9564, -7663, -4013, 12120, -7113, -7873, 13222, -3517, -10951, 11506, 447, -11751, 8364, 3162, -10077, 5577, 2790, -8052, 6345, 1857, -9820, 7716, 4771, -12152, 5481, 8272, -11729, 2397, 10360, -10292, -1114, 11110, -6804, -3170, 8424, -5095, -1189, 7868, -7609, -1859, 11139, -7291, -5687, 11862, -4737, -7945, 11600, -2277, -10604, 9860, 1952, -10160, 5545, 1985, -6956, 6242, -87, -9058, 8214, 2978, -11349, 5923, 5630, -10950, 4450, 7799, -11414, 965, 10641, -7686, -2741, 7710, -4561, -160, 6358, -7436, -255, 9895, -7082, -3721, 10193, -5302, -4885, 11056, -4302, -8648, 10801, 766, -9473, 5725, 1458, -5715, 6028, -1303, -7690, 8285, 1365, -9921]
914i921J6235l237j2934J6076j103j7124J5128O252j8233P243Q591j1984N644
927F33M604j2770Q372P595j5561N196J0403j4530L728J2544j6211o13J7707j1675
941e78p730J4348n226n477J0484p551m408J3854p370q086J3919n192r042J5329
955G274m402j4277J6070L101j6805Q708O301j1359O756L026j1928Q960N545j3964
969f994O518P162j3520O638R405j6833K879J5822j3347m910J3672o753l788J0043
983E994q134l101J2477p480n850J1996o318n882J4093o745j1360J6158L96j5068
997h824R679M352j0664P275K010j0779Q682L910j2004O918M487j1883Q253O290
1011G702j6179N746J3112j4435j733J2739q567k078R833q852j739J1323q090l664
$$ y = [-9921, 6314, 3077, -9857, 6219, 5116, -12008, 3120, 9372, -8861, -1618, 6973, -5011, 633, 5237, -7533, 839, 8434, -7127, -1931, 8472, -6058, -2330, 10214, -5997, -6610, 11097, -578, -8308, 6040, 814, -4663, 5821, -1730, -6138, 7716, 346, -7740, 6179, 987, -8055, 7274, 2872, -11405, 4665, 7766, -9039, -331, 5970, -5389, 1367, 4393, -7535, 1425, 6970, -6994, -476, 6686, -6834, -196, 9209, -7624, -4745, 11077, -2270, -7180, 6492, -261, -4049, 5994, -2140, -5241, 7236, -244, -6094, 5902, -416, -6298, 7795, 1050, -10310, 5848, 6244, -8824, 855, 5207, -5457, 1818, 3828, -6951, 1731, 5641, -6363, 555, 5042, -6841, 1412, 7702, -8477, -2731, 10381, -4054, -5787, 6952, -1615, -3693, 6140, -2712, -4451, 6872, -1218, -4882]
1025d882J0779p562l401J3045q608q329J5927k734j2873J1152J980j0317Q096
1038B273J249r783Q258K440j0115P080K486j0287Q636L951j4337P194R944j4193
1052e204J071J1288r838p94R528q762r72R755q083j640R447q444j460J1812r632
1067a928n430J4886n691j0014J2581j035r929R547K53r151Q280Q97q628P763O08
1082C009r273R132K062j2531Q274O665j3469L966R378j1011O88R180q606m58Q157
1097E163p537r2P904q547j04J0156r493k951J2794p526o862J2892l759q980J0572
1112C630p81q399Q173m89p211Q310j060q339R483L63j0717R150L461j2532O795
1127a63P161j2084K582Q648q878L91O966p416J186O845q490P20Q594q776j042
$$ y = [-4882, 5897, -1665, -5066, 7979, -629, -8958, 6969, 4235, -8638, 2514, 4494, -5823, 2273, 3522, -6261, 1997, 4437, -5678, 1402, 3888, -6399, 2237, 6188, -8149, -955, 8989, -5204, -4133, 7155, -2683, -3477, 6051, -2711, -3683, 6072, -2011, -3651, 5796, -2648, -4108, 7704, -1928, -7358, 7528, 1837, -8177, 4404, 3369, -6560, 2987, 3240, -5911, 2369, 3266, -5362, 2401, 3009, -6264, 2868, 4930, -7601, 673, 7338, -6131, -2165, 7213, -3798, -3110, 6070, -2536, -2994, 5163, -2374, -2466, 5438, -3109, -3213, 6943, -2550, -5501, 7293, -233, -7095, 5797, 2038, -6942, 3630, 2849, -5550, 2623, 2134, -5077, 3233, 2173, -6166, 3317, 3680, -7037, 2113, 5574, -6958, -163, 6998, -5086, -2504, 6144, -2734, -2343, 4623, -2793, -1607, 5238, -3252, -2532, 6062, -2714, -3756]
1142c756J0464q428m069J2383n528p881J0724j301p554P582j244o011Q165j819
1156A727p425Q844m90q704R012Q46j1108Q742N047j2596M216P875r118J421N901
1171D190p663K478O181q729J377P497q230N85Q482r248j523J1906p213o670J0885
1186D305k028o688P239j934n106P985k155o721P881p53o810Q121r74r300R518
1201B580L183j2239N150O920q872K052M946p583L240N538q612J764O472p613J839
1216a235O624r643Q58J0953q831m826J0991l533n473P494l159m258Q233k896n938
1231d639P498j454n229P655k614p556J0012J172j1336O210N447q654K921M050
1245C483p441L654M857q060J905N300o701K578M864r257K466R443r457k962J0352
$$ y = [-3756, 6708, -1720, -5789, 6594, 1066, -6815, 3909, 2608, -4946, 2636, 1392, -4619, 3546, 1727, -5698, 3146, 2656, -6048, 2964, 3810, -7298, 1444, 6491, -6105, -1889, 5986, -3132, -1711, 4190, -3473, -995, 5186, -3543, -2166, 5331, -2899, -2314, 6168, -3080, -4603, 7303, 90, -6580, 4305, 2277, -4411, 2828, 894, -4212, 3773, 1618, -5103, 2778, 2025, -4785, 3336, 2362, -6938, 2580, 5763, -6476, -1326, 5594, -3278, -1226, 3720, -3863, -623, 4915, -3697, -1933, 4539, -3074, -1235, 5389, -4254, -3396, 7557, -1274, -6100, 4891, 1358, -4115, 3379, 220, -4038, 4195, 1299, -4639, 2859, 1405, -3824, 3831, 1217, -6339, 3673, 4845, -6491, -281, 5166, -3488, -567, 3483, -3958, -304, 4553, -3507, -1602, 3698, -3003, -425, 4439, -4818, -2352, 7091, -2366, -5328, 5024]
1260E024m765m168P662m178l615Q311l385n144P124k169l934P426l902o098J0267
1275D456o04j0144P230L596q379M239L122p599M125M365p590K032M339n950K994
1290B32L515q532L353P789r262j422R180n490k920P430m747l103P955l439m468
1305c929O455k406k893O763m495m658R829k030q628P921J756p941N513K155p725
1320d313M848L715p400K618L526n702L548K578q011M133O223r115K41Q083o404
1335a432j692P294n323k614P606l612l863O016k525k425O027m377l467Q734k955
1350A392o922Q077K07p383O304J420p502N168K975o997L239K833n635L872K003
1365C051p261M607M563q728K089O833p457k68P243o013j957P217m095k951N894
$$ y = [5024, 259, -3909, 3753, -425, -4040, 4271, 886, -4258, 2866, 697, -3237, 4189, 287, -5811, 4456, 3852, -6292, 938, 4534, -3845, 394, 3516, -4083, 42, 4407, -3183, -1151, 3188, -2762, 232, 3747, -4785, -1432, 6357, -2905, -4327, 4853, -637, -3557, 3873, -874, -3977, 3978, 539, -3929, 2526, 120, -2773, 3990, -505, -5163, 4666, 2636, -5992, 1929, 3685, -4256, 1257, 3412, -4313, 535, 4250, -3150, -532, 2994, -2708, 840, 3418, -4593, -460, 5763, -3352, -3111, 4972, -1432, -3124, 4170, -1153, -3767, 3839, 227, -3636, 2380, -145, -2570, 3457, -920, -4387, 4347, 1392, -5530, 2547, 2754, -4629, 1675, 3095, -4407, 761, 3736, -3261, -22, 2811, -2824, 1048, 3051, -4210, 397, 4960, -3768, -1679, 5154, -2303, -2571, 4672, -1341, -3298, 3919, -176, -3127, 2767]
1380B767l147k148N762m102k740P497l509n222P869j101o836O664J122p174M828
1395E30K557o306L336K423n460L556K066o244M080L297p607L112N555p811P31
1410b185P032o207j451O634m349j970N719l796j788N629l961k048O385m102l445
1425c903P675k729n958P241J81o678N007J566n714L905J627n356L572J806n282
1440c040L716J889o347M071L893p704J828O240o203o40N803m537r47N379m188
1455g87j431N255l596j303N173m474j695P206m110m792P514r26n857N310K83n107
1471c337M703P17n411L823J508m614L516P02n388M819K536p563K682N446o077
1486a938M4M983m678j35N125m385j398M996k928j046M003m181n37O414m624l810
$$ y = [2767, -380, -2528, 3234, -868, -3608, 3889, 380, -4842, 3027, 1926, -4910, 1754, 2876, -4298, 530, 3087, -3219, 117, 2540, -2920, 636, 2702, -3542, 538, 3835, -3772, -660, 4895, -2916, -2185, 4847, -1360, -2811, 3823, -526, -2496, 3223, -573, -2361, 3268, -693, -2741, 3644, -458, -3903, 3772, 1043, -4915, 2326, 2507, -4171, 836, 2402, -3312, 593, 2220, -3136, 436, 2242, -3040, 676, 2565, -3782, 289, 4182, -3522, -1694, 4546, -1657, -2297, 3506, -1031, -1978, 3401, -787, -2218, 3037, -559, -1862, 3311, -1163, -2858, 4348, 238, -4554, 2960, 2034, -3823, 1487, 1770, -3337, 1366, 2083, -3328, 495, 2003, -2611, 905, 1607, -3781, 1038, 3574, -3989, -1307, 4139, -1938, -1894, 3089, -1589, -1724, 3401, -984, -2382, 2614, -314, -1360, 2643, -1538, -2075, 4339, -285, -4095]
1502d095P221j460m999N193n62m465N132Q7n359L922J338m040L230j80m471N287
1518A779J231p214L581M406o083J028M101n022Q79M753m864r58M775k784p12L177
1534B073l944L60N527m890k727O690j993m063N024j220l873N248l39n028L829
1549F74J195l535K861o01l551N129K51o362M082L147n801J996L179n265J820M202
1565C421n209k45M376l013j24K596l967J221M584n192j362O033k983k771N035
1580B400k257l119N442j007m545L890P57l069K679q43k822M700l84n287M152J984
1596B671n164K677K278n167K338L672n120J58L907k970J66K195l705J525L708
1611C169m996l06N114l627j520M833l166k327N483j742l919M069Q6k730K806j133
$$ y = [-4095, 3126, 1666, -3333, 1860, 1298, -3167, 1965, 2052, -3307, 615, 1953, -2087, 1143, 963, -3508, 1779, 3010, -4204, -623, 3783, -2300, -1272, 2829, -2193, -1314, 3439, -1425, -2383, 2392, -392, -1104, 2073, -1871, -1511, 4016, -874, -3601, 3089, 1096, -2967, 2057, 837, -3036, 2212, 1873, -3155, 674, 1869, -1666, 1195, 594, -2957, 2172, 2423, -3939, 143, 3290, -2511, -515, 2664, -2601, -781, 3421, -1788, -2033, 2343, -670, -794, 1802, -2165, -944, 3640, -1552, -2914, 3119, 136, -2635, 2400, 143, -2976, 2466, 1459, -3086, 804, 1561, -1508, 1171, 328, -2494, 2206, 1822, -3465, 687, 2671, -2493, 184, 2462, -2705, -367, 3305, -1815, -1657, 2250, -720, -554, 1641, -2064, -539, 3169, -1827, -2133, 2981, -646, -2166, 2667, -499, -2826, 2657, 915, -3004, 1065, 1151, -1579, 1227, 94]
1627I4k315M347r35m242M162Q57m525L265J490m985K747L131m955N93L496k997
1643g72K80K064l269J384K944m367L12M177l814o74M473l518j735N197k189l260
1659b767M142n57k538K978j201k010L886j354l242M217k60l994L863P21m753L197
1675C28K331m760J372K925l365O81K127l074J198K317l739Q94L280l936RM186
1691B774l604j365M715k362k554M056j067k476L155r51k010L215j302k318L902
1706A808j080l447M183J76m406L342J554m359K130K178l733J263K164l072J089
1721b10J782l228J531K390m132P84L874l786q85M238k607j735L951j722k290L416
1737A371q00k091K654j082j620L436j540k907M179j17m018L208J030l864K532
$$ y = [94, -2221, 2126, 1191, -3051, 1111, 1968, -2557, 708, 2198, -2787, -40, 3091, -1864, -1271, 2225, -772, -492, 1572, -1697, -313, 2631, -1736, -1424, 2753, -1061, -1735, 2738, -780, -2515, 2682, 493, -2767, 1375, 818, -1720, 1258, 57, -1953, 1933, 579, -2663, 1554, 1294, -2700, 1163, 1884, -2869, 328, 2659, -2101, -729, 2196, -1169, -488, 1639, -1435, -237, 2080, -1659, -765, 2515, -1421, -1412, 2774, -830, -2195, 2520, 158, -2396, 1660, 593, -1883, 1272, 321, -1689, 1526, 224, -2094, 1808, 728, -2719, 1464, 1640, -2766, 576, 2130, -2229, -99, 2079, -1654, -391, 1773, -1299, -210, 1572, -1656, -125, 2265, -1867, -1083, 2791, -995, -1880, 2358, -249, -1984, 1967, 245, -2045, 1371, 571, -1520, 1134, 52, -1568, 1868, 328, -2579, 1600, 1483, -2535, 673, 1703, -2161, 371]
1752C71J595l907J626K201l023R03J401k711J914J579m112J492L340l918j43L578
1768B186l015o68L769k590j779L699j115j905K380j231q93L131k105k253M123
1783A734o16l382L168K73l284K957R23l966J994K175k968P26J165k217J973J012
1799A667l839J808K791l701L41K880l157K08L452l209j264L804j392j687K161
1814H63j380l32K844k542j627M013j168k689L151n60k656L422R6l895K496J902
1830A938k977P95R74j924J986O38l502J913K350l404O08K355l060O34L163l387
1846i00j013L804j475j663K067j273k27K546k478j286L655j380k137L032j114
1861A58k173L631n27l643K876J390k953J148O87j840K116K55l143K138J689l175
$$ y = [371, 1966, -1941, -315, 1886, -1137, -234, 1167, -1544, 370, 1949, -2163, -671, 2669, -1249, -1392, 2186, -829, -1497, 2272, -318, -2097, 1602, 487, -1418, 962, -269, -1162, 1969, -136, -2389, 1734, 1118, -2264, 904, 1177, -2107, 850, 1773, -2193, -199, 1976, -992, -266, 899, -1318, 655, 1667, -2172, -364, 2427, -1274, -933, 1947, -1210, -1002, 2450, -759, -2023, 1781, 389, -1298, 863, -517, -849, 1995, -547, -2174, 1839, 671, -2018, 1133, 573, -2083, 1339, 1435, -2460, 36, 1938, -1039, -244, 730, -1194, 792, 1430, -2072, -159, 2191, -1213, -605, 1750, -1310, -676, 2487, -900, -1913, 1891, 416, -1247, 820, -453, -680, 1866, -612, -1898, 1757, 377, -1760, 1272, 158, -2015, 1616, 1089, -2554, 322, 1712, -1241, -93, 594, -1246, 870, 1125, -2018, 120, 1809, -1366]
1877a366J171J755l110J239K720l572m35L603j816j349K119j332k37K316k263
1892e57r26L148j525j581K845j453j793L571q84l279K992R24k842J445N16j907
1908a306K056J65k773K120J081k827J630J199l152J708K335l648J26L224k139
1923b01q28K165j597j69K220k085o80K725j625j066K681j716j495L469j071k933
1939b206K985N53k747J672M98k038J874L05k463J848P57k479J766Q28l017J881
1955A7J927l510N87K806k456l38K219j854j03K114j995l13K307j841m86K544k031
1972d06j028L278j463k303L086j36k543K105L04k135J777L18k128J744M15k268
1988a383J851O52k813J799J563l207R17K378k708%K362k005k87K033j728j41J963
$$ y = [-1366, -195, 1560, -1550, -311, 2409, -1163, -1598, 2005, 189, -1160, 959, -373, -610, 1706, -557, -1483, 1665, 140, -1441, 1404, -49, -1842, 1729, 845, -2434, 558, 1482, -1360, 85, 601, -1306, 750, 915, -1858, 262, 1343, -1484, 146, 1345, -1807, -99, 2236, -1412, -1286, 1938, -201, -1029, 1136, -461, -630, 1590, -495, -1175, 1550, -75, -1141, 1540, -176, -1671, 1798, 727, -2206, 779, 1332, -1415, 257, 755, -1283, 591, 896, -1567, 281, 1038, -1441, 325, 1153, -1864, 17, 1944, -1566, -979, 1827, -629, -967, 1252, -602, -705, 1409, -586, -899, 1408, -433, -919, 1625, -406, -1434, 1844, 381, -1922, 1164, 1028, -1515, 590, 894, -1241, 536, 854, -1274, 470, 885, -1383, 468, 1120, -1693, 106, 1669, -1538, -621, 1757, -951, -951, 1411, -594, -881, 1152, -576, -717, 1246]
2005A246j943j80K444k094p93K973j664j613L030q38k241K570K0k205J801K15
2021G28j769J767o7k034K089M12k655J807J123k838J331J787k917M73K422k222
2037e63m01K001j500q2J655j963j0K369k020p34K614j623j116K842j331j944K867
2054A061j91k275J804J66j477J728m21j805K274J41k420J863O30k449J794J096
2070A519l035J117K223k459j67J829j480K07J362k060K66K182j996n21K198j665
2086d80n68K604j776j619L047m25k279J799J26j301J654n60j671K255M1k153J736
2103D30K86k022K041N21k973J597J941k573J14J630j470M92J086k112N65J942
2119A495j992j99J786j733J0K284k181j129L062p92k050J810m1j170J628o79j542
$$ y = [1246, -697, -877, 1567, -527, -1320, 1653, -11, -1624, 1406, 568, -1673, 897, 917, -1288, 513, 728, -1041, 726, 659, -1375, 714, 1126, -1529, 278, 1401, -1437, -106, 1681, -1236, -763, 1659, -563, -964, 1037, -463, -545, 1110, -853, -863, 1506, -514, -1248, 1366, -257, -1373, 1469, 138, -1806, 1061, 870, -1405, 399, 565, -912, 816, 395, -1410, 864, 1005, -1415, 448, 1078, -1371, 423, 1519, -1516, -399, 1824, -635, -802, 1027, -453, -246, 1116, -944, -678, 1504, -492, -1013, 1185, -480, -1048, 1556, -220, -1839, 1208, 783, -1496, 303, 429, -872, 782, 222, -1449, 806, 847, -1306, 430, 716, -1306, 735, 1256, -1717, -120, 1821, -752, -638, 992, -478, 14, 1100, -1012, -447, 1495, -497, -696, 1090, -643, -633, 1651, -530, -1659, 1403, 611, -1439, 371, 330, -840, 788, 109, -1433]
2136a433K138L5j927J525J02j666K041J83k825J805J747k592K64J541j472N65
2152C1J025k043O12J763j845l0J468j677L85J967k375o51K940j157j719J894l60
$$ y = [-1433, 705, 740, -1187, 338, 440, -1226, 815, 998, -1827, -22, 1725, -867, -603, 938, -534, 31, 1056, -987, -375, 1388, -457, -487, 981, -696, -311, 1656, -719, -1370, 1570, 413, -1306, 588, 228]
$$ [...]
8191d0
##END NTUPLES=NMR FID
##END=
