##TITLE=1H_LY-DiX-o-PURP-mix
 CD3CN,8 sc, 
 9.02.2021
##JCAMPDX= 6.0         $$ Bruker NMR JCAMP-DX V2.0
##DATA TYPE= NMR FID
##DATA CLASS= NTUPLES
##ORIGIN= UXNMR, Bruker Analytische Messtechnik GmbH
##OWNER= root
$$ XWIN-NMR		Version 3.5
$$ Tue Feb  9 12:06:48 2021 Russian Standard Time (UT+4h)  she@DPX200
##.OBSERVE FREQUENCY= 200.1315066352
##.OBSERVE NUCLEUS= ^1H
##.DELAY= (6, 6)
##.ACQUISITION MODE= SIMULTANEOUS
##.ACQUISITION SCHEME= undefined
##.AVERAGES= 8
##.DIGITISER RES= 18
##SPECTROMETER/DATA SYSTEM= spect
##.PULSE SEQUENCE= zg30
##.SOLVENT NAME= CD3CN
##.SHIFT REFERENCE= (INTERNAL, CD3CN, 0, 15.7039)
##AUDIT TRAIL= $$ (NUMBER, WHEN, WHO, WHERE, WHAT)
$$ ##TITLE= Audit trail, XWIN-NMR		Version 3.5
$$ ##JCAMPDX= 5.01
$$ ##ORIGIN= Bruker BioSpin GmbH
$$ ##OWNER= she
$$ F:/spectra/data/she/nmr/H-F/1/audita.txt
$$ ##AUDIT TRAIL=  $$ (NUMBER, WHEN, WHO, WHERE, WHAT)
(   1,<2021-02-09 12:04:17.92 +0400>,<she>,<DPX200>,
      <created by zg, POWCHK disabled, PULCHK disabled
       configuration hash MD5:
       00 E9 B6 7A A2 85 ED C7 34 08 36 98 17 FE 4E 26
       data hash MD5: 16K
       87 FD E9 A8 4F 2D 80 39 38 2C 1F A3 D9 98 3F 76>)
$$ ##END=
$$ 
$$ hash MD5
$$ 7C 3F 2A 59 FC 9B 31 0B 98 6C DA A0 36 AD F4 D4
##$RELAX= 
##$RELAX= 
##$RELAX= 
##$RELAX= 
##$RELAX= 
##$RELAX= 
$$ Bruker specific parameters
$$ --------------------------
##$DU= <F:/spectra>
##$EXPNO= 1
##$NAME= <H-F>
##$PROCNO= 1
##$TYPE= <nmr>
##$USER= <she>
##$AMP= (0..31)
100 100 100 100 100 100 100 100 100 100 100 100 100 100 100 100 100 100 
100 100 100 100 100 100 100 100 100 100 100 100 100 100 
##$AQSEQ= 0
##$AQ_mod= 1
##$AUNM= <au_zg>
##$AUTOPOS= <>
##$BF1= 200.13
##$BF2= 200.13
##$BF3= 200.13
##$BF4= 200.13
##$BF5= 200.13
##$BF6= 200.13
##$BF7= 200.13
##$BF8= 200.13
##$BYTORDA= 1
##$CFDGTYP= 0
##$CFRGTYP= 5
##$CHEMSTR= <none>
##$CNST= (0..31)
1 1 145 1 1 1 1 1 1 1 1 1 1 1 1 1 1 1 1 1 1 1 1 1 1 1 1 1 1 1 1 1 
##$CPDPRG= <>
##$CPDPRG1= <>
##$CPDPRG2= <>
##$CPDPRG3= <>
##$CPDPRG4= <mlev>
##$CPDPRG5= <mlev>
##$CPDPRG6= <mlev>
##$CPDPRG7= <mlev>
##$CPDPRG8= <mlev>
##$CPDPRGB= <>
##$CPDPRGT= <>
##$D= (0..31)
0 1.2 0 0 0 0 0 0 0 0.06 0 0.03 0 0 0 0 0.0002 0 0 0 0 0 0 0 0 0 0 0 0 
0 0 0 
##$DATE= 1612857857
##$DBL= (0..7)
120 120 120 120 120 120 120 120 
##$DBP= (0..7)
150 150 150 150 150 150 150 150 
##$DBP07= 0
##$DBPNAM0= <>
##$DBPNAM1= <>
##$DBPNAM2= <>
##$DBPNAM3= <>
##$DBPNAM4= <>
##$DBPNAM5= <>
##$DBPNAM6= <>
##$DBPNAM7= <>
##$DBPOAL= (0..7)
0.5 0.5 0.5 0.5 0.5 0.5 0.5 0.5 
##$DBPOFFS= (0..7)
0 0 0 0 0 0 0 0 
##$DE= 6
##$DECBNUC= <off>
##$DECIM= 32
##$DECNUC= <off>
##$DECSTAT= 4
##$DIGMOD= 1
##$DIGTYP= 9
##$DL= (0..7)
0 120 120 120 120 120 120 120 
##$DP= (0..7)
150 150 150 150 150 150 150 150 
##$DP07= 0
##$DPNAME0= <>
##$DPNAME1= <>
##$DPNAME2= <>
##$DPNAME3= <>
##$DPNAME4= <>
##$DPNAME5= <>
##$DPNAME6= <>
##$DPNAME7= <>
##$DPOAL= (0..7)
0.5 0.5 0.5 0.5 0.5 0.5 0.5 0.5 
##$DPOFFS= (0..7)
0 0 0 0 0 0 0 0 
##$DQDMODE= 0
##$DR= 18
##$DS= 0
$$ [...]
##$SUBNAM2= <"">
##$SUBNAM3= <"">
##$SUBNAM4= <"">
##$SUBNAM5= <"">
##$SUBNAM6= <"">
##$SUBNAM7= <"">
##$SUBNAM8= <"">
##$SUBNAM9= <"">
##$SW= 16.9725356469052
##$SWIBOX= (0..15)
0 0 2 0 0 0 0 0 0 0 0 0 0 0 0 0 
##$SW_h= 3396.73913043478
##$TD= 16384
##$TD0= 1
##$TE= 0
##$TE2= 300
##$TE3= 300
##$TEG= 300
##$TL= (0..7)
0 120 120 120 120 120 120 120 
##$TP= (0..7)
150 150 150 150 150 150 150 150 
##$TP07= 0
##$TPNAME0= <>
##$TPNAME1= <>
##$TPNAME2= <>
##$TPNAME3= <>
##$TPNAME4= <>
##$TPNAME5= <>
##$TPNAME6= <>
##$TPNAME7= <>
##$TPOAL= (0..7)
0.5 0.5 0.5 0.5 0.5 0.5 0.5 0.5 
##$TPOFFS= (0..7)
0 0 0 0 0 0 0 0 
##$TUNHIN= 0
##$TUNHOUT= 0
##$TUNXOUT= 0
##$USERA1= <user>
##$USERA2= <user>
##$USERA3= <user>
##$USERA4= <user>
##$USERA5= <user>
##$V9= 5
##$VALIST= <valist>
##$VCLIST= <CCCCCCCCCCCCCCC>
##$VD= 0
##$VDLIST= <DDDDDDDDDDDDDDD>
##$VPLIST= <PPPPPPPPPPPPPPP>
##$VTLIST= <TTTTTTTTTTTTTTT>
##$WBST= 1024
##$WBSW= 4
##$XGAIN= (0..3)
0 0 0 0 
##$XL= 0
##$YL= 0
##$YMAX_a= 661931
##$YMIN_a= -599701
##$ZGOPTNS= <>
##$ZL1= 120
##$ZL2= 120
##$ZL3= 120
##$ZL4= 120
##$ABSF1= 10
##$ABSF2= 0
##$ABSG= 5
##$ABSL= 3
##$ALPHA= 0
##$AQORDER= 0
##$ASSFAC= 0
##$ASSFACI= 0
##$ASSFACX= 0
##$ASSWID= 0
##$AUNMP= <proc_1d>
##$AZFE= 0.1
##$AZFW= 0.1
##$BCFW= 1
##$BC_mod= 2
##$BYTORDP= 1
##$COROFFS= 0
##$CY= 11.3945322036743
##$DATMOD= 1
##$DC= 2
##$DFILT= <>
##$DTYPP= 0
##$F1P= 15.9154993809931
##$F2P= -4.1035820241983
##$FCOR= 0.5
##$FTSIZE= 0
##$FT_mod= 4
##$GAMMA= 1
##$GB= 0.15
##$INTBC= 1
##$INTSCL= 1
##$ISEN= 128
##$LB= 0.24
##$LEV0= 0
##$LPBIN= 0
##$MAXI= 10000
##$MC2= 0
##$MEAN= 0
##$ME_mod= 0
##$MI= 1.114404
##$NCOEF= 0
##$NC_proc= 0
##$NLEV= 6
##$NOISF1= 3.799351
##$NOISF2= 2.8
##$NSP= 1
##$NTH_PI= 0
##$NZP= 0
##$OFFSET= 15.70392
##$PC= 1
##$PHC0= -10755.9
##$PHC1= 10.80094
##$PH_mod= 1
##$PKNL= yes
##$PPARMOD= 0
##$PSCAL= 0
##$PSIGN= 0
##$REVERSE= no
##$SF= 200.130013532006
##$SI= 16384
##$SIGF1= 3
##$SIGF2= 2
##$SINO= 400
##$SIOLD= 16384
##$SREGLST= <1H.CDCl3>
##$SSB= 0
##$STSI= 0
##$STSR= 0
##$SW_p= 3612.71676300578
##$SYMM= 0
##$S_DEV= 0
##$TDeff= 0
##$TDoff= 0
##$TI= <>
##$TILT= no
##$TM1= 0
##$TM2= 0
##$TOPLEV= 0
##$USERP1= <user>
##$USERP2= <user>
##$USERP3= <user>
##$USERP4= <user>
##$USERP5= <user>
##$WDW= 1
##$XDIM= 8192
##$YMAX_p= 0
##$YMIN_p= 0
$$ End of Bruker specific parameters
$$ ---------------------------------
##NTUPLES= NMR FID
##VAR_NAME=  TIME,          FID/REAL,        FID/IMAG
##SYMBOL=    X,             R,               I
##VAR_TYPE=  INDEPENDENT,   DEPENDENT,       DEPENDENT
##VAR_FORM=  AFFN,          ASDF,            ASDF
##VAR_DIM=   8192,          8192,            8192
##UNITS=     SECONDS,       ARBITRARY UNITS, ARBITRARY UNITS
##FACTOR=    0.0002944,     1,               1
##FIRST=     0,             0,               0
##LAST=      2.4114304,     0,               0
##MIN=       0,             -599701,         0
##MAX=       2.4114304,     661931,          0
$$ Real data points
##PAGE= N=1
##DATA TABLE= (X++(R..R)), XYDATA
$$ plain form
0 0 0 0 0 0 0 0 0 0 0 8 -8 8 -8 16 -16 16 -24 32 -32 40 -50 60 -72 84 -98 113 -130 154 -175 200 -229 263
32 263 -296 335 -376 425 -476 533 -597 663 -735 821 -909 1003 -1110 1226 -1352 1491 -1643
49 -1643 1809 -1991 2194 -2421 2672 -2954 3276 -3643 4064 -4559 5147 -5858 6741 -7869 9365
64 9365 -11451 14573 -19735 29784 -56528 276918 661931 -146834 -447552 15926 514228
75 514228 369259 -185990 -409040 168660 624875 161382 -481528 -210291 437527 412959
85 412959 -191085 -438625 -16455 422674 184171 -369050 -413808 135019 418845 -79137
95 -79137 -561457 -192569 340298 175496 -303754 -395337 -32194 326456 116368 -413521
105 -413521 -341740 268807 353736 -169922 -362934 -9386 318559 226415 -178463 -291925
$$ packed form
0@%%%%%%%%%Qj6J6j6K4l2L2m0N6o4P2r0J10j32J56j82K11k43K84l29L75m29M92
32B63n59O31p11Q01r01J009j130J260j398J556j730J912k113K336k578K843l134
49a643L452l800M185m615N093n626O230o919P707q623R706j1005J2599j4610J7234
64I365k0816K6024l4308M9519q6312L33446L85013q08765l00718M63478M98302
75E14228j44969n55249k23050N77700M56215m63493o42910K71237O47818k4568
85D12959o04044k47540M22170M39129k38503n53221m4758N48827K83826m97982
95g9137m82320L68888N32867j64802m79250r1583L63143L58650k10088n29889
105d13521P1781O10547Q4929n23658j93012L53548L27945r2144m04878j13462
$$ plain form
115 -291925 149776 427298 74972 -289764 -92074 320285 304820 -89915 -239678 60781
125 60781 321204 158355 -184853 -204287 142545 307705 -20569 -314797 -82281 231345
135 231345 111316 -174799 -239272 -39951 189681 57493 -291487 -230546 132896 156754
145 156754 -134977 -248350 -67502 140876 100745 -147283 -215075 50290 220394 19578
155 19578 -188641 -76188 169879 182671 -44556 -138961 47002 202024 118971 -67378 -98067
166 -98067 106629 223928 25072 -140903 882 156517 95800 -44555 -97850 -5720 128810
177 128810 55530 -144544 -109505 77645 65448 -75282 -122977 -57296 39931 28545 -101253
188 -101253 -128670 -6467 56187 -25990 -109845 -62180 40677 41777 -46194 -64396 7823 53584
$$ packed form
115b91925M41701K77522l52326l64736J97690M12359j5465l94735j49763L00459
125F0781K60423j62849l43208j9434L46832J65160l28274k94228K32516L13626
135B31345j20029k86115o4473J99321K29632j32188l48980O0941L63442K3858
145A56754k91731j13373J80848K08378m0131k48028o7792K65365J70104k00816
155A9578k08219J12453K46067J2792k27227r4405J85963J55022q3053j86349l0689
166i8067K04696J17299j98856j65975J41785J55635o0717j40355n3295R2130J34530
177A28810p3280k00074L5039J87150j2197j40730m7695O5681R7227j1386j29798
188a01253k7417J22203O2654q2177q3855M7665J02857J100q7971j8202P2219M5761
$$ plain form
200 53584 35041 -12749 -28641 42843 91645 17117 -20296 48317 61010 32835 38595 21221
212 21221 13718 53285 41870 -4120 14776 32107 -1666 -343 21271 -7187 -28871 -12050
224 -12050 -4018 -7553 -30102 -54466 -29192 3308 -18336 -57492 -63223 -16099 26002 -25989 -90262
237 -90262 -34729 43497 16162 -47617 -53656 551 68017 41572 -67098 -50363 86488 96782
249 96782 -18162 -56797 16558 102928 85074 -38561 -69805 62306 133892 21549 -91452
260 -91452 -33089 100399 98719 -45694 -113869 4906 115721 37356 -109356 -107397 44847
271 44847 115114 -32062 -165401 -55609 102975 58944 -99528 -141476 -2428 128207 30294
282 30294 -154761 -105797 101953 125736 -54454 -147355 -19063 145649 98718 -102488 -132449
$$ packed form
200E3584j8543m7790j5892P1484M8802p4528l7413O8613J2693k8175N760j7374
212B1221p503L9567j1415m5990J8896J7331l3773J323K1614k8458k1684J6821
224a2050Q032l535k2549k4364K5274L2500k1644l9156n731M7124M2101n1991o4273
237i0262N5533P8226k7335o3779o039N4207O7466k6445j08670J6735J36851J0294
249I6782j14944l8635P3355Q6370j7854j23635l1244J32111P1586j12343j13001
260i1452N8363J33488j680j44413o8175J18775J10815p8365j46712J959J52244
271D4847P0267j47176j33339J09792J58584m4031j58472m1948J39048J30635r7913
282C0294j85055M8964K07750K3783j80190r2901J28292J64712m6931k01206k9961
$$ plain form
293 -132449 73847 183140 24693 -144737 -62752 147436 155748 -58926 -154890 17510 180606
304 180606 81796 -129924 -131056 88894 181801 -14904 -188105 -58582 153013 116416 -105962
315 -105962 -179827 9007 181567 44820 -191388 -137702 114431 160847 -60527 -202707
325 -202707 -48131 172487 111772 -141523 -181077 64588 205718 18977 -195332 -99980
335 -99980 162282 178007 -81475 -200906 8821 217121 100513 -161778 -159954 114360 222251
346 222251 -15133 -214041 -61131 189662 149928 -117042 -199143 34847 222353 53224
356 53224 -203678 -134883 140940 184969 -65342 -220198 -37281 197702 111391 -161430 -185766
367 -185766 77419 209406 4712 -214257 -98125 170125 165059 -104280 -206150 15438
$$ packed form
293a32449K06296J09293j58447j69430Q1985K10188Q312k14674r5964J72400J63096
304A80606r8810k11720j132K19950R2907j96705j73201J29523K11595l6597k22378
315a05962p3865J88834J72560j36747k36208N3686K52133M6416k21374j42180
325b02707J54576K20618o0715k53295l9554K45665J41130j86741k14309R5352
335i9980K62262J5725k59482j19431K09727K08300j16608k62291J824K74314J07891
346B22251k37384j98908J52910K50793l9734k66970q2101K33990J87506j69129
356E3224k56902O8795K75823M4029k50311j54856J82917K34983q6311k72821k4336
367a85766K63185J31987k04694k18969J16132K68250n066k69339j01870K21588
$$ plain form
377 15438 211324 75870 -180863 -151828 122782 204318 -38369 -213189 -45333 191204
387 191204 128835 -131290 -183805 54161 208243 29842 -194010 -106245 145315 163629 -72826
398 -72826 -191304 -9035 185941 87059 -146228 -145339 85194 180437 -7241 -178751 -63671
409 -63671 151478 127566 -91505 -158946 26136 170299 51567 -144297 -109433 101511 149737
420 149737 -39099 -159524 -29904 140543 88414 -103733 -136361 42164 146696 12314
430 12314 -145198 -78751 100514 110233 -58799 -139775 -10276 124914 56395 -105145 -104107
441 -104107 55204 122439 -3564 -120106 -43770 101842 89589 -53782 -101835 16514 116884
452 116884 44136 -84835 -65566 68479 104074 -10404 -91432 -16696 91279 65210 -52963
$$ packed form
377A5438J95886j35454k56733K9035K74610Q1536k42687j74820J67856K36537
387A91204o2369k60125n2515K37966J54082j78401k23852Q7765K51560J8314k36455
398g2826j18478J82269J94976r8882k33287Q89K30533R5243j87678j71510J15080
409f3671K15149k3912k19071o7441J85082J44163j18732j95864L4864K10944M8226
420A49737j88836j20425J29620J70447n2129j92147l2628J78525J04532j34382
430A2314j57512O6447J79265R719j69032q0976J29499J35190o8519j61540J038
441a04107J59311O7235j26003j16542P6336J45612j2253j43371m8053J18349J00370
452A16884p2748j28971J9269J34045L5595j14478q1028P4736J07975k6069j18173
$$ plain form
463 -52963 -80939 22583 90746 14250 -84171 -52442 52489 63379 -34412 -87114 -17285 61279
475 61279 26925 -65022 -70100 17046 56345 -9423 -72297 -34388 41356 39012 -30202 -54616
487 -54616 1573 52804 22226 -37249 -27399 32997 48999 3692 -27455 2242 43746 34320
499 34320 -5453 -13776 18607 39687 15908 -11842 -2386 20400 19430 -1175 -11828 -2625 6015
512 6015 -373 -10771 -13287 -9511 -10426 -13807 -10607 -12004 -22593 -22627 -8620 -2922 -17494 -29922 -15963
527 -15963 7650 4925 -21057 -27533 4750 30804 7154 -26467 -10665 35896 43120 -1153 -26148
540 -26148 13927 60197 39351 -19706 -22742 40853 68786 11347 -42249 -8963 59525 50813
552 50813 -28777 -56918 10020 64783 13355 -70786 -55741 34911 52718 -35722 -94690 -31679
$$ packed form
463e2963k7976J03522O8163p6496r8421L1729J04931J0890r7791n2702O9829P8564
475F1279l4354r1947n078Q7146L9299o5768o2874L7909P5744k344o9214k4414
487e4616N6189N1231l0578n9475R850O0396J6002m5307l1147K9697M1504r426
499C4320l9773q323L2383K1080k3779k7750R456K2786r70k0605j0653R203Q640
512F015o388j0398k516L776r15l381L200j397j0589l4J4007N698j4572j2428J3959
527a5963K3613k725k5982o476L2283K6054k3650l3621J5802M6561P224m4273k4995
540b6148M0075M6270k0846n9057l036O3595K7933n7439n3596L3286O8488q712
552E0813p9590k8141O6938N4763n1428q4141J5045R0652J7807q8440n8968O3011
$$ plain form
564 -31679 56636 27379 -77543 -91116 11589 70250 -8641 -100146 -54424 60834 66969 -42912
576 -42912 -93378 3023 100238 47254 -69434 -61052 64270 113568 8898 -83585 -14054 109769
588 109769 93577 -39666 -81350 36505 125686 41951 -86993 -60866 78451 105973 -28158
599 -28158 -116805 -23750 101063 56384 -95838 -118412 24081 103347 -9710 -139783 -82684
610 -82684 73881 81570 -73206 -144780 -17490 111980 40477 -116745 -106747 59091 124953
621 124953 -9907 -129735 -38621 125381 105996 -61334 -110418 40430 158034 57231
631 57231 -103210 -66726 109312 146539 -15054 -123129 -7912 146690 92303 -90223 -116481
642 -116481 52287 143956 6413 -147471 -79024 99896 102738 -82265 -165348 -14767 127231
$$ packed form
564c1679Q8315k9257j04922j3573J02705N8661p8891r1505M5722J15258O135j09881
576d2912n0466R6401R7215n2984j16688Q382J25322M9298j04670r2483O9531J23823
588A09769j6192j33243m1684J17855Q9181q3735j28944K6127J39317K7522j34131
599b8158q8647R3055J24813m4679j52222k2574J42493P9266j13057j30073N7099
610h2684J56565P689j54776p1574J27290J29470p1503j57222R998J65838O5862
621A24953j34860j19828R1114J64002j9385j67330m9084J50848J17604j00803
631E7231j60441L6484J76038L7227j61593j08075J15217J54602n4387j82526k6258
642a16481J68768R1669j37543j53884O8447J78920K842j85003q3083J50581J41998
$$ plain form
653 127231 34027 -147562 -131256 59274 123472 -40446 -169536 -55791 122682 87439 -100069
664 -100069 -139443 36222 154831 32800 -131513 -72004 120102 143546 -32628 -127026 10290
675 10290 164374 92749 -91292 -95130 84803 160633 12530 -126925 -42199 128154 110991
686 110991 -70712 -133122 17480 135292 30519 -133241 -103324 68842 107556 -52198
696 -52198 -158037 -44221 103713 53126 -113415 -133360 24699 112338 -6210 -137906 -71345
707 -71345 88265 93243 -54419 -117453 5818 124072 57669 -82430 -70656 75424 125648
718 125648 8693 -87727 -13831 114750 94869 -40546 -77323 37425 117057 37428 -76639
729 -76639 -52857 67777 88872 -25446 -97289 -20132 76181 37089 -75776 -90260 11176
$$ packed form
653A27231r3204j81589J6306J90530O4198j63918j29090J13745J78473l5243j87508
664a00069l9374J75665J18609j22031j64313N9509J92106K3444j76174r4398J37316
675A0290J54084p1625j84041l838J79933P5830j48103j39455Q4726J70353j7163
686A10991j81703o2410J50602J17812j04773j63760K9917J72166L8714j59754
696e2198j05839J13816J47934n0587j66541j9945J58059Q7639j18548j31696O6561
707g1345J59610M978j47662o3034J23271J18254o6403j40099J1774J46080N0224
718A25648j16955r6420P3896J28581j9881j35415l6777J14748P9632p9629j14067
729g6639K3782J20634K1095j14318p1843P7157R6313l9092j12865j4484J01436
$$ plain form
740 11176 66885 -14195 -102316 -60152 41459 43862 -51985 -93839 -15921 61073 19535 -68812
752 -68812 -60032 31110 66290 -1456 -61279 -16515 65548 59174 -19982 -42106 26150 77704
764 77704 36761 -29598 -17859 51973 68797 5701 -36443 3463 55607 38297 -22876 -37293
776 -37293 13189 42580 1723 -47065 -31484 15993 17952 -27504 -52459 -20685 15472 -3465
788 -3465 -43184 -41406 -4499 11055 -14839 -38004 -21387 9786 9822 -15546 -20533 2976 20100
801 20100 12350 -4207 439 19969 24881 13603 8782 15773 22664 21593 15838 13889 15533 14768
815 14768 12840 13225 11006 2465 -381 5984 7558 -3578 -15129 -12061 1363 388 -20927 -30433
829 -30433 -12012 3928 -10104 -35297 -32291 -1171 9791 -19516 -41551 -16203 20093 11942
$$ packed form
740A1176N5709q1080q8121M2164J01611K403r5847m1854P7918P6994m1538q8347
752f8812Q780R1142L5180o7746n9823M4764Q2063o374p9156k2124O8256N1554
764G7704m0943o6359J1739O9832J6824o3096m2144L9906N2144j7310o1173j4417
776c7293N0482K9391m0857m8788J5581M7477J959m5456k4955L1774L6157j8937
788c465l9719J778L6907J5554k5894k3165J6617L1173L6k5368m987K3509J7124
801B0100p750j6557M646J9530M912j1278m821O991O891j071n755j949J644p65
815A4768j928L85k219q541k846O365J574j1136j1551L068J3424r75k1315r506
829c0433J8421J5940j4032k5193L006L1120J0962k9307k2035K5348L6296q151
$$ plain form
841 11942 -26660 -32188 10020 39074 8535 -31540 -11891 40739 45552 -4162 -29499 13273
853 13273 60328 35759 -23910 -23437 37857 62020 7971 -42628 -10651 53399 44683 -28916 -52902
866 -52902 8684 55912 10180 -60843 -47988 29592 46068 -29469 -78672 -23793 48896 23982
878 23982 -61370 -71777 12632 60556 -4190 -78332 -41003 52103 56042 -33388 -72842 3167
890 3167 79909 37025 -56853 -49870 49014 85939 3845 -68486 -15252 81858 68072 -35554
902 -35554 -67020 22983 92358 28806 -70036 -49931 56421 78941 -21405 -88809 -18414 76697
914 76697 44385 -67610 -85048 20044 81143 -1553 -97760 -55343 59263 66235 -46828
925 -46828 -101226 -8198 86621 35162 -81431 -76361 45179 93164 -6545 -94585 -30327 87813
$$ packed form
841A1942l8602n528M2208K9054l0539m0075J9649N2630M813m9714k5337M2772
853A3273M7055k4569n9669M73O1294K4163n4049n0599L1977O4050q716p3599k3986
866e2902O1586M7228m5732p1023J2855P7580J6476p5537m9203N4879P2689k4914
878B3982q5352j0407Q4409M7924o4746p4142L7329R3106L939q9430l9454P6009
890C167P6742m2884r3878O983R8884L6925q2094p2331N3234R7110j3786j03626
902c5554l1466R0003O9375o3552r8842K0105J06352K2520j00346o7404P0395R5111
914G6697l2312j11995j7438J05092O1099q2696r6207M2417J14606O972j13063
925d6828n4398R3028R4819n1459j16593N070J21540M7985r9709q8040O4258J18140
$$ plain form
937 87813 75054 -48145 -85658 23530 107872 34566 -80221 -55807 70664 97496 -17300
948 -17300 -94196 -13065 97751 60683 -67431 -85482 33545 99776 6872 -99968 -52730
959 -52730 72486 76947 -48336 -106146 -3957 95191 32987 -91054 -80603 48912 91774
970 91774 -19126 -105980 -32003 86329 64064 -63060 -92087 24468 103062 19463 -91799
981 -91799 -53652 74161 89619 -30542 -94895 -2077 100694 50970 -71506 -72686 47315
992 47315 97465 -442 -91762 -33206 80261 68471 -48806 -86853 12166 89890 23590 -81114
1004 -81114 -59421 51506 75813 -24242 -89748 -18104 76242 43653 -61333 -73065 26192
1015 26192 79080 3165 -78457 -37851 59730 60716 -33540 -73719 3422 74167 29155 -58393
$$ packed form
937H7813j2759j23199l7513J09188Q4342p3306j14787K4414J26471K6832j14796
948a7300p6896Q1131J10816l7068j28114j8051J19027O6231r2904j06840M7238
959e2730J25216M461j25283n7810J02189R9148o2204j24041J0451J29515M2862
970I1774j10900q6854P3977J18332k2265j27124k9027J16555P8594q3599j11262
981i1799L8147J27813J5458j20161o4353R2818J02771m9724j22476j180J20001
992D7315N0150r7907r1320N8556J13467j1790j17277l8047R9019P7724o6300j04704
1004h1114K1693J10927K4307j00055o5506P1644R4346l2589j04986j1732R9257
1015B6192N2888p5915q1622M0606R7581R86r4256m0179P7141P0745m5012q7548
$$ plain form
1027 -58393 -50757 37999 67740 -6801 -66226 -19555 57778 45626 -36536 -57862 12527 61880
1039 61880 14343 -53286 -36746 36582 50855 -14273 -55244 -9662 49728 30225 -35781 -43889
1051 -43889 16481 50002 5726 -45587 -23450 35389 38032 -17424 -42936 -692 42314 18697
1063 18697 -32620 -31005 18293 37130 -2552 -37106 -14603 28643 24690 -19131 -33251 2219
1075 2219 29638 7836 -27311 -22288 13883 24306 -6389 -27837 -7724 20416 13686 -14626
1087 -14626 -19878 4904 21065 4892 -16311 -8929 13711 16492 -1649 -11346 748 15698 10173
1100 10173 -4978 -5079 6717 11114 3676 -3780 -1621 5187 5038 -735 -2398 -1269 -1606 -1070 -537
1115 -537 -3295 -6649 -6553 -2062 906 -4366 -12778 -8718 3741 3821 -9579 -15190 -3495 10825 4768
$$ packed form
1027e8393P636Q8756K9741p4541n9425M6671P7333j2152q2162k1326P0389M9353
1039F1880m7537o7629J6540P3328J4273o5128m0971M5582N9390j9503o6006q108
1051d3889O0370L3521m4276n1313K2137N8839K643n5456k5512M2244M3006k3617
1063A8697n1317J615M9298J8837l9682l4554K2503M3246l953m3821j4120L5470
1075B219K7419k1802l5147N023L6171J0423l0695k1448K0113K8140o730k8312
1087a4626n252K4782J6161j6173k1203P382K2640K781j8141r697J2094J4950n525
1100A0173j5151j01J1796M397p438p456K159O808j49n773j663J129l37N36N33
1115e37k758l354R6M491K968n272q412M060J2459Q0j3400n611J1695J4320o057
$$ plain form
1130 4768 -14554 -14360 9286 18864 -838 -17365 -4022 21992 20657 -8355 -17979 10844 32633
1143 32633 11669 -18982 -11134 24146 33163 -3579 -29477 -671 35910 19529 -24827 -29675
1155 -29675 12413 36094 -566 -43058 -22185 28330 25396 -26416 -47082 -4978 36536 9771
1167 9771 -46464 -39906 20592 38023 -13005 -52108 -17205 41187 32568 -32329 -46648 15526
1179 15526 55552 12675 -43290 -24793 43054 55554 -10511 -49139 4190 63387 34828 -35094
1191 -35094 -39138 30356 65336 5054 -57162 -20820 53093 45522 -31114 -60237 2137 59350
1203 59350 16670 -62602 -50945 30637 50510 -20678 -73285 -26614 50306 35035 -51778 -68876
1215 -68876 11741 61171 6925 -65481 -43219 45197 62044 -21189 -67958 -1571 71700 40950
$$ packed form
1130D768j9322J94K3646R578j9702j6527J3343K6014j335k9012r624K8823K1789
1143C2633k0964l0651P848L5280R017l6742k5898K8806L6581j6381m4356m848
1155b9675M2088K3681l6660m2492K0873N0515k934n1812k0666M2104M1514k6765
1167I771n6235O558O0498J7431n1028l9103L4903N8392q619o4897j4319O2174
1179A5526M0026m2877n5965J8497O7847J2500o6065l8628N3329N9197k8559o9922
1191c5094m044O9494L4980o0282o2216L6342P3913p571p6636k9123O2374N7213
1203E9350m2680p9272J1657Q1582J9873p1188n2607M6671P6920j5271q6813j7098
1215f8876Q0617M9430n4246p2406K2262Q8416J6847q3233m6769O6387P3271l0750
$$ plain form
1227 40950 -43034 -50456 35318 81685 11639 -62213 -20130 67684 63259 -24938 -62974 10029
1239 10029 80490 30551 -62720 -49537 43029 66797 -14619 -78801 -26719 62253 41165 -59371
1251 -59371 -77320 11473 64414 1874 -80087 -54415 44673 58385 -36412 -84169 -9435 67882
1263 67882 32303 -58640 -63259 32986 79892 867 -71528 -20743 69513 63091 -27542 -62584
1275 -62584 18072 89206 32789 -58006 -37258 55563 75165 -7851 -68566 -10777 74964 44997
1287 44997 -53208 -61792 23744 66263 1254 -75384 -44321 47375 47942 -44444 -78747 -7193
1299 -7193 55139 15508 -65376 -62062 26453 57609 -18022 -72070 -20595 51782 40308 -35021
1311 -35021 -57410 16296 69585 17327 -48929 -23461 48187 60103 -3937 -46801 3131 67689
$$ packed form
1227D0950q3984p422Q5774M6367p0046p3852M2083Q7814m425q8197l8036P3003
1239A0029P0461m9939r3271J3183R2566K3768q1416o4182N2082Q8972k1088j00536
1251e9371j7949Q8793N2941o2540q1961K5672R9088J3712r4797m7757P4734P7317
1263F7882l5579r0943m619R6245M6906p9025p2395N0785R0256o422r0633l5042
1275f2584Q0656P1134n6417r0795K0748R2821J9602q3016o0715N7789Q5741k9967
1287D4997r8205q584Q5536M2519o5009p6638L1063R1696N67r2386l4303P1554
1299g193O2332l9631q0884L314Q8515L1156p5631n4048N1475P2377j1474p5329
1311c5021k2389P3706N3289n2258o6256K5468P1648J1916o4040m2864M9932O4558
$$ plain form
1323 67689 38599 -32454 -31876 29873 57125 9429 -45402 -20653 44805 37752 -28515 -46811
1335 -46811 557 37780 9921 -46465 -43724 16184 30729 -21488 -52284 -20014 22250 15589
1347 15589 -31647 -46812 1423 33566 -802 -36672 -19835 19855 30289 -3978 -30374 975
1359 975 39485 22814 -12539 -11700 18614 38218 16441 -16213 -3384 32804 29442 -2823 -12301
1372 -12301 5790 25316 16778 -14960 -17765 11977 16461 -7910 -20897 -12814 3083 5605 -17318
1385 -17318 -29037 -7322 4593 -10160 -20729 -17729 -6588 2760 -7249 -20560 -7830 6027
1397 6027 64 -5150 -3998 -153 9517 9111 -529 4059 13014 9819 9993 11866 7071 10091 14832
1412 14832 10096 8740 9551 3902 6704 13639 3703 -5163 903 4002 2742 -2771 -14632 -9961 6059
$$ packed form
1323F7689k9090p1053N78O1749K7252m7696n4831K4749O5458p053o6267j8296
1335d6811M7368L7223k7859n6386K741N9908J4545n2217l0796L2270M2264o661
1347A5589m7236j5165M8235L2143l4368l5870J6837L9690J0434l4267k6396L1349
1359I75L8510j6671l5353Q39L0314J9604k1777l2654J2829L6188l362l2265r478
1372a2301J8091J9526q538l1738k805K9742M484k4371j2987Q083J5897K522k2923
1385a7318j1719K1715J1915j4753j0569L000J1141R348j0009j3311J2730J3857
1397F027n963n214J152L845R670m06r640M588Q955l195J74J873m795L020M741
1412A4832m736j356Q11n649K802O935r936q866O066L099j260n513j1861M671J6020
$$ plain form
1427 6059 -2267 -20885 -17208 -4511 402 -7579 -24467 -20594 5242 6121 -18890 -23708 -3628 12221
1441 12221 6138 -17274 -19776 13717 27328 -1575 -18852 987 26702 26465 -3716 -18658 15197
1454 15197 41622 14114 -17931 -6384 26584 34379 611 -28926 -1442 38788 18581 -27031
1466 -27031 -26972 11060 30483 -669 -43215 -25365 26328 21175 -30674 -44660 -6113 28493 6954
1479 6954 -43683 -40234 18529 34200 -15775 -46214 -13182 34841 29322 -26231 -42000 15500
1491 15500 52430 10569 -36545 -17838 37208 49490 -4947 -42436 4121 57696 30080 -29560
1503 -29560 -30686 24580 54226 7444 -48396 -19987 45690 37157 -28385 -49496 112 46391
1515 46391 15027 -52663 -45376 25925 41494 -19531 -59457 -21485 39109 29563 -41206 -57776
$$ packed form
1427F059q326j8618L677J2697M913p981j6888L873K5836Q79k5011m818K0080J5849
1441A2221o083k3412k502L3493J3611k8903j7277J9839K5715k37l0181j4942L3855
1454A5197K6425k7508l2045J1547L2968P795l3768k9537K7484M0230k0207m5612
1466b7031N9L8032J9423l1152m2546J7850N1693n153n1849j3986L8547L4606k1539
1479F954n0637L449N8763J5671m9975l0439L3032M8023n519n5553j5769N7500
1491A5500L6930m1861m7114J8707N5046J2282n4437l7489M6557N3575k7616n9640
1503b9560j126N5266K9646m6782n5840K8409O5677q533o5542k1111M9608M6279
1515D6391l1364o7690P287P1301J5569o1025l9926L7972O0594r546p0769j6570
$$ plain form
1527 -57776 11769 52161 3677 -52282 -32016 36304 51318 -15523 -56574 -324 60732 31320
1539 31320 -35860 -38900 27141 64461 9560 -52381 -17952 54980 47810 -23131 -50237 6199
1551 6199 61257 24138 -51357 -41546 35532 52048 -14340 -60182 -18832 48341 33817 -45372
1563 -45372 -59625 13645 52987 268 -59663 -37245 36235 46691 -26543 -63887 -3076 55765
1575 55765 22699 -45314 -44742 26251 59702 -755 -56967 -15304 53914 42962 -25666 -47280
1587 -47280 12079 62538 20739 -47698 -30256 40954 50940 -11335 -50901 -8070 52106 31295
1599 31295 -40391 -45209 20402 48427 -1542 -51128 -26518 36311 36352 -29188 -52437 2123 43677
1612 43677 10972 -42679 -36095 22754 42205 -10757 -48160 -9419 39544 25393 -26016 -36720
$$ packed form
1527e7776O9545M0392m8484n5959K0266O8320J5014o6841m1051N6250O1056k9412
1539C1320o7180l040O6041L7320n4901o1941L4429P2932p170p0941k7106N6436
1551F199N5058l7119p5495R811P7078J6516o6388m5842M1350O7173j4524p9189
1563d5372j4253P3270L9342n2719n9931K2418P3480J0456p3234l7344O0811N8841
1575E5765l3066o8013N72P0993L3451o0457n6212M1663O9218j0952o8628k1614
1587d7280N9359N0459m1799o8437J7442P1210R986o2275l9566M2831O0176k0811
1599C1295p1686m818O5611K8025m9969m9586K4610O2829M1o5540k3249N4560M1554
1612D3677l2705n3651O584N8849J9451n2962l7403L8741M8963j4151n1409j0704
$$ plain form
1624 -36720 11756 44713 7889 -37308 -17236 31704 33792 -10189 -33926 -490 39400 19823
1636 19823 -27064 -24686 18713 33176 -144 -30763 -12449 27186 23381 -18509 -29123 4601
1648 4601 26629 5734 -25127 -20632 14400 23320 -9009 -27789 -5567 19700 12017 -15544 -21751
1661 -21751 4550 22452 2058 -20364 -10248 13602 15482 -4731 -17771 -1832 18577 9813
1673 9813 -11534 -11103 7045 14802 2895 -12171 -6520 11020 11409 -5484 -10430 390 9410 5779
1687 5779 -6693 -8086 3911 8613 -1102 -7223 -2228 3757 4382 -1915 -6202 -589 4941 1319 -2786
1702 -2786 -1927 28 2188 2029 -1592 -1987 189 498 1534 1169 -2746 -3041 1754 3404 -703 -4660
1718 -4660 -3543 2543 5471 -2737 -8468 -1080 7067 3730 -6756 -9002 2151 10590 1297 -11391
$$ packed form
1624c6720M8476L2957l6824m5197K0072M8940K088m3981k3737L3436L9890j9577
1636A9823m6887K378M3399J4463l3320l0619J8314L9635l805m1890j0614L3724
1648D601K2028k0895l0861M495L5032Q920l2329j8780K2222K5267p683k7561o207
1661b1751K6301J7902k0394k2422J0116K3850J880k0213j3040J5939K0409q764
1673I813k1347M31J8148P757j1907j5066N651J7540L89j6893m946J0820R020l631
1687E779j2472j393J1997M702r715o121M995N985O25o297m287N613N530l622m105
1702b786Q59J955K160j59l621l95K176L09J036l65l915k95M795J650m107l957
1718d660J117O086K928q208n731P388Q147l337j0486k246J1153Q439r293j2688
$$ plain form
1732 -11391 -5965 9664 10361 -4668 -13092 -535 15819 8918 -11959 -11630 9837 17790 1196
1745 1196 -16449 -5857 17937 16517 -10103 -18555 4148 22001 6335 -19699 -15497 13754 21570
1758 21570 -6023 -26178 -6719 22138 12861 -19544 -26088 5742 25431 937 -29915 -16265
1770 -16265 19610 21808 -13271 -31286 -1992 29879 13562 -25188 -23672 16544 32870 -310
1782 -310 -30783 -8621 31367 26526 -16601 -29092 9484 37721 10684 -28854 -19722 25677 34529
1795 34529 -8970 -35238 -4400 34916 19992 -26420 -32410 11692 34969 -362 -39751 -21260
1807 -21260 25890 27554 -19720 -42190 -3672 35335 12501 -35767 -32498 17347 36441 -5127
1819 -5127 -41913 -14268 35392 28946 -21994 -36121 10374 45287 13272 -34048 -21847 31929
$$ packed form
1732a1391N426J5629O97j5029q424J2557J6354o901k0877L29K1467P953j6594
1745A196j7645J0592K3794j420k6620q452K2703J7853j5666k6034M202K9251P816
1758B1570k7593k0155J9459K8857r277l2405o544L1830J9689k4494l0852J3650
1770a6265L5875K198l5079j8015K9294L1871j6317l8750J516M0216J6326l3180
1782c10l0473K2162L9988m841m3127j2491L8576K8237k7037l9538R132M5399Q852
1795C4529m3499k6268L0838L9316j4924m6412n990M4102K3277l5331l9389J8491
1807b1260M7150J664m7274k2470L8518L9007k2834m8268L269M9845J9094m1568
1819e127l6786K7645M9660o446n0940j4127M6495L4913l2015m7320J2201N3776
$$ plain form
1831 31929 42234 -7633 -38380 -1866 44255 27278 -27457 -33251 18242 44973 3731 -41269
1843 -41269 -20544 33102 33643 -21136 -45687 -2546 39800 13357 -41112 -37556 17659 37394
1855 37394 -9376 -49308 -19028 34696 26653 -29602 -44251 6342 43942 9258 -41074 -26261
1867 -26261 31147 41521 -10142 -41519 -1190 46899 27792 -27486 -30595 23253 49015 5656
1879 5656 -37872 -13388 39503 36709 -18271 -38983 5909 44196 13693 -37580 -30262 22441
1891 22441 35886 -12389 -46805 -13983 32393 18949 -33357 -41319 6488 34596 -645 -43081
1903 -43081 -25354 24673 28398 -18148 -40203 -1915 36518 16246 -28900 -25073 21208 38101
1915 38101 938 -30184 -4898 36033 28741 -13999 -24229 13457 38520 11748 -24095 -13423
$$ packed form
1831C1929J0305m9867l0747L6514M6121j6977n4735n794N1493K6731m1242m5000
1843d1269K0725N3646N41n4779k4551M3141M2346k6443n4469L556N5215J9735
1855C7394m6770l9932L0280N3724q043n6255j4649N0593L7600l4684n0332J4813
1867b6261N7408J0374n1663l1377M0329M8089j9107n5278l109N3848K5762m3359
1879E656m3528K4484N2891k794n4980k0712M4892L8287l0503n1273P318N2703
1891B2441J3445m8275l4416L2822M6376j3444n2306p962M7807K8108l5241m2436
1903d3081J7727N0027L725m6546k2055L8288L8433k0272m5146L827M6281J6893
1915C8101l7163l1122K5286M0931p292m2740j0230L7686K5063k6772l5843J0672
$$ plain form
1927 -13423 24760 29303 -7482 -28199 -2064 27051 12718 -23052 -25450 7385 21358 -4948
1939 -4948 -30586 -16461 13337 11817 -18069 -29166 -4437 16540 2453 -23205 -19403 7746
1951 7746 16903 -4550 -20413 -5332 17840 14106 -7916 -11921 8727 21799 8742 -8214 -2502
1964 -2502 16465 19394 2147 -7224 4549 17751 11612 -4513 -6011 7028 13147 1847 -9922
1977 -9922 -5699 5186 4513 -7045 -12649 -5570 1852 -2455 -11724 -12064 -4241 -891 -6269 -11048 -8216
1992 -8216 -1744 -676 -4939 -6581 -2382 1735 1845 -430 -151 2625 5274 5364 4656 4642 5129 7133 8628
2009 8628 7306 4467 4335 7284 8979 6101 996 1364 6113 6741 -187 -5434 -1509 4142 1700 -8198
2025 -8198 -11143 -2614 2921 -4566 -14894 -11847 69 2358 -9507 -17706 -7392 6171 1865 -12978
$$ packed form
1927a3423L8183M543l6785k0717K6135K9115j4333l5770k398L2835J3973k6306
1939d948k5638J4125K9798j520k9886j1097K4729K0977j4087k5658L802K7149
1951G746R157k1453j5863J5081K3172l734k2022m005K0648J3072j3057j6956N712
1964b502J8967K929j7247r371J1773J3202o139j6125j498J3039O119j1300j1769
1977i922M223J0885o73j1558n604P079P422m307r269l40P823L350n378m779K832
1992h216O472J068m263j642M199M117J10k275K79K776K649R0p08j4M87K004J495
2009H628j322k839j32K949J695k878n105L68M749O28o928n247L925N651k442r898
2025h198k945Q529N535p487j0328L047J1916K289j1865q199J0314J3563m306j4843
$$ plain form
2039 -12978 -13820 2335 12267 517 -13802 -5646 14141 15668 -3285 -11498 5695 22628 12888
2052 12888 -8679 -6928 16249 24206 3401 -13789 -626 22233 17525 -9546 -16967 6803 22609
2065 22609 3709 -21538 -15010 12901 16787 -11681 -28990 -7653 17951 6156 -25060 -26955
2077 -26955 4174 19740 -5486 -31383 -15805 17906 17356 -15923 -28484 1492 28320 10452
2089 10452 -23133 -17442 20005 31051 -921 -24575 -1736 33060 24639 -14012 -21289 14510
2101 14510 36091 8997 -24719 -12672 25918 28916 -10119 -30149 -1162 30184 13043 -27168
2113 -27168 -27927 11056 27483 -6248 -37555 -17366 22049 18005 -22968 -36854 -831 29172
2125 29172 5720 -33393 -25295 18088 29123 -8171 -34550 -6959 32545 22700 -20373 -26925
$$ packed form
2039a2978q42J6155R932j1750j4319Q156J9787J527j8953q213J7193J6933r740
2052A2888k1567J751K3177P957k0805j7190J3163K2859m708k7071p421K3770J5806
2065B2609j8900k5247O528K7911L886k8468j7309K1337K5604j1795l1216j895
2077b6955L1129J5566k5226k5897J5578L3711n50l3279j2561K9976K6828j7868
2089A0452l3585N691L7447J1046l1972k3654K2839L4796q421l8651p277L5799
2101A4510K1581k7094l3716J2047L8590K998l9035k0030K8987L1346j7141m0211
2113b7168p59L8983J6427l3731l1307K0189L9415m044m0973j3886L6023L0003
2125B9172k3452l9113Q098M3383J1035l7294k6379K7591L9504r845m3073o552
$$ plain form
2137 -26925 13801 38458 8868 -27596 -13080 30473 33928 -8509 -29570 3870 37796 18632
2149 18632 -24231 -24096 18186 35040 -1986 -34563 -12797 27915 22079 -21639 -36245 1554
2161 1554 30413 3798 -34962 -26823 16508 26133 -12275 -38864 -10127 28672 17112 -26449
2173 -26449 -31608 9853 33908 3468 -32056 -16154 27459 30107 -11254 -29877 3925 36933
2185 36933 17947 -22717 -20920 20685 35543 325 -29078 -6898 30499 23497 -16861 -28050
2197 -28050 6989 31660 5936 -29585 -19069 18497 23668 -11912 -32908 -6600 24550 10655
2209 10655 -25394 -26571 8158 24160 -3343 -30214 -13794 20098 18380 -14690 -25891 2233
2221 2233 25569 8897 -20531 -15376 16277 24564 -2406 -20701 -1717 23966 16506 -11660 -15902
$$ packed form
2137b6925M0726K4657k9590l6464J4516M3553L455m2437k1061L3440L3926j9164
2149A8632m2863J35M2282J6854l7026l2577K1766M0712n836m3718j4606L7799
2161A554K8859k6615l8760Q139M3331R625l8408k6589K8737L8799j1560m3561
2173b6449n159M1461K4055l0440l5524J5902M3613K648m1361j8623L3802L3008
2185C6933j8986m0664J797M1605J4858l5218k9403K2180L7397p002m0358j1189
2197b8050L5039K4671k5724l5521J0516L7566N171l5580k0996K6308L1150j3895
2209A0655l6049j177L4729J6002k7503k6871J6420L3892j718l3070j1201K8124
2221B233K3336j6672k9428N155L1653Q287k6970j8295J8984K5683p460k8166m242
$$ plain form
2234 -15902 9642 23691 4269 -17337 -7798 16186 16623 -6774 -17934 -103 16867 6333
2246 6333 -15310 -14073 6179 12960 -3868 -17858 -7365 9813 7239 -10392 -14651 -256 10875
2259 10875 1771 -12232 -9202 6253 9773 -2699 -10482 -1899 9557 6916 -4902 -6538 4122
2272 4122 10197 3081 -4908 -2076 6602 7899 24 -4169 605 6625 4112 -2444 -3171 1551 4332
2287 4332 874 -3263 -2479 1233 1707 -1596 -3540 -2485 107 -229 -1718 -2502 -2356 -800 -33 -691 -2068
2304 -2068 -2375 -460 1461 309 -2002 -2192 1044 3337 877 -2876 -1573 3532 4809 -115 -3899
2319 -3899 -420 5623 4835 -2909 -5063 2049 7592 2141 -6331 -4422 5336 7349 -1967 -8560 -2037
2334 -2037 8235 5370 -6857 -9001 2578 10082 912 -10832 -6196 8083 10045 -4683 -12619
$$ packed form
2234a5902K5544J4049j9422k1606R539K3984M37k3397j1160J7831J6970j0534
2246F333k1643J237K0252O781j6828j3990J0493J7178k574j7631m259J4395J1131
2259A0875r104j4003L030J5455L520j2472p783Q583J1456k641j1818j636J0660
2272D122O075p116p989K832Q678J297p875m193M774O020k513o556p27M722K781
2287D332l458m137P84L712M74l303j944J055K592l36j489p84J46J556P67o58j377
2304b068l07J915J921j152k311j90L236K293k460l753J303N105J277m924l784
2319c899L479O043p88p744k154P112N543n451q472J909R758K013r316o593O523
2334b037J0272k865j2227k144J1579P504r170j1744M636J4279J962j4728p936
$$ plain form
2347 -12619 -1000 12525 6120 -10548 -11261 5882 14163 199 -15040 -6177 12724 12192 -8075
2360 -8075 -15957 1151 16820 5447 -15379 -12661 10014 16843 -3575 -19154 -4989 17171 11448
2373 11448 -12885 -17628 5806 19982 2721 -19290 -10889 15620 18090 -7402 -20660 -8
2385 -8 22241 10146 -16775 -16529 11351 22886 -424 -22384 -7721 20366 17394 -12457 -22428
2398 -22428 3374 24109 6397 -22045 -16816 14253 21868 -6600 -26291 -6178 22104 13386
2410 13386 -18611 -23531 6752 24391 1495 -25589 -13750 18718 20179 -10694 -25591 -230
2422 -230 25898 11463 -20216 -19041 13914 26588 -582 -24684 -7189 24017 20226 -13004 -22810
2435 -22810 5988 28241 8592 -22682 -16205 17602 24875 -6314 -27375 -5806 24216 15020
$$ packed form
2347a2619J1619J3525o405j6668p13J7143Q281j3964j5239Q863J8901n32k0267
2360h075p882J7108J5669j1373k0826K718K2675O829k0418j5579J4165K2160n723
2373A1448k4333m743K3434J4176j7261k2011Q401K6509K470k5492j3258K0652
2385hK2249j2095k6921K46K7880J1535k3310k1960J4663K8087k972k9851r971
2398b2428K5802K0735j7712k8442N229L1069P615k8468j9691K0113K8282q718
2410A3386l1997m920L0283J7639k2896k7084J1839L2468J461l0873j4897K5361
2422b30K6128j4435l1679J175L2955J2674k7170k4102J7495L1206l791l3230r806
2435b2810K8798K2253j9649l1274O477L3807P273l1189k1061K1569L0022r196
$$ plain form
2447 15020 -19679 -25447 6803 25474 930 -28061 -16141 18123 20446 -12827 -29081 -2569
2459 -2569 25074 10085 -22930 -21659 12330 26162 -1860 -26628 -8387 24027 20073 -13035
2471 -13035 -23001 6284 29130 9167 -21415 -14144 19766 25944 -4487 -24135 -2226 26484
2483 26484 16192 -17439 -21444 10061 25475 1273 -25796 -13329 18271 18494 -13728 -27271
2495 -27271 -1544 22011 6293 -23927 -20834 10089 20395 -6158 -26694 -8027 19423 13409
2507 13409 -15435 -21463 5961 23248 4388 -19668 -9803 17904 20170 -4909 -17916 1854
2519 1854 23584 12351 -13005 -12229 12656 21257 1199 -16387 -4602 17196 13833 -9849 -16306
2532 -16306 2902 16406 2809 -16677 -12830 7672 11676 -7470 -18822 -5285 10285 4209
$$ packed form
2447A5020l4699n768L2250J8671k4544k8991J1920L4264K323l3273j6254K6512
2459b569K7643j4989l3015J271L3989J3832k8022k4768J8241L2414l954l3108
2471a3035r966K9285K2846j9963l0582P271L3910O178l0431j9648K1909K8710
2483B6484j0292l3631m005L1505J5414k4202k7069J2467L1600K23l2222j3543
2495b7271K5727K3555j5718l0220L093L0923J0306k6553k0536J8667K7450o014
2507A3409k8844o028K7424J7287j8860k4056R865K7707K266k5079j3007J9770
2519A854K1730j1233k5356P76K4885Q601k0058j7586J1785K1798l363k3682o457
2532a6306J9208J3504j3597j9486L847K0502M004j9146j1352J3537J5570o076
$$ plain form
2544 4209 -13475 -15301 1509 10337 -2300 -14930 -7008 8087 8028 -5257 -10643 694 12061
2557 12061 5472 -6707 -4134 8109 11589 2404 -4701 624 11006 9033 -1298 -2671 4840 8986
2571 8986 4142 -3337 -2553 4592 5550 -1865 -5452 -2017 2069 511 -4558 -6582 -2530 180 -3083
2586 -3083 -6501 -5073 -2915 -2140 -3280 -4977 -3907 -843 -1294 -1978 -1324 -1382 -322 2077 1429 856 1283
2603 1283 2277 3911 4444 2267 1098 4446 6837 3633 1857 1500 4192 6684 2436 -1526 651 5248
2619 5248 3343 -1439 -4980 -1110 4050 659 -8017 -7288 593 2049 -4714 -10532 -6928 2270 2503
2634 2503 -8554 -11437 -1290 5313 -514 -9339 -7721 4929 9486 -2510 -9786 -30 11748 8226
2648 8226 -3867 -6677 6564 16301 5312 -8134 -1561 13475 13497 -643 -9277 1968 16672
$$ packed form
2544D209j7684j826J6810Q828j2637j2630P922J5095n9j3285n386J1337J1367
2557A2061o589j2179K573J2243L480r185p105N325J0382j973j0331j373P511M146
2571H986m844p479P84P145R58p415l587L435M086j558n069k024M052K710l263
2586c083l418J428K158P75j140j697J070L064m51o84O54n8J060K399o48n73M27
2603A283R94J634N33k177j169L348K391l204j776l57K692K492m248l962K177M597
2619E248j905m782l541L870N160l391q676P29P881J456o763n818L604R198K33
2634B503j1057k883J0147O603n827q825J618J2650M557j1996p276R756J1778l522
2648H226j2093k810J3241R737j0989j3446O573J5036K2j4140q634J1245J4704
$$ plain form
2661 16672 8188 -10431 -9086 7614 13086 -1274 -15867 -7665 11371 8625 -12778 -18580 -552
2674 -552 11962 427 -18470 -14939 7133 12897 -8466 -20553 -4441 13555 7415 -12918 -17148
2687 -17148 6462 19446 1112 -16654 -5670 17444 17906 -4210 -14833 4203 23977 10939
2699 10939 -13070 -9519 13949 21574 920 -17678 -4452 20802 14730 -13126 -18011 4614 19106
2712 19106 3075 -21425 -15329 12270 15923 -11024 -24979 -5689 15918 7103 -19352 -22155 5464
2725 5464 19129 -3385 -23546 -9956 15470 15463 -9760 -21253 2674 23957 8407 -16670 -11382
2738 -11382 14677 23152 871 -18326 -2097 23971 17124 -10940 -15027 8637 23624 6880
2750 6880 -18232 -11636 16688 18903 -8381 -21299 -3167 17792 9237 -18526 -21339 6328 18549
$$ packed form
2661A6672q484j8619J345J6700N472j4360j4593Q202J9036k746k1403n802J8028
2674e52J2514j1535j8897L531K2072N764k1363j2087J6112J7996o140k0333m230
2687a7148K3610J2984j8334j7766J0984K3114M62k2116j0623J9036J9774j3038
2699A0939k4009L551K3468P625k0654j8598J3226K5254o072k7856m885K2625J4492
2712A9106j6031k4500O096K7599L653k6947j3955J9290K1607q815k6455k803K7619
2725E464J3665k2514k0161J3590K5426pk5223j1493K3927K1283j5550k5077N288
2738a1382K6059Q475k2281j9197J6229K6068o847k8064m087K3664J4987j6744
2750F880k5112O596K8324K215k7284j2918J8132K0959q555k7763k813K7667J2221
$$ plain form
2763 18549 -4233 -24306 -12173 12772 13474 -12603 -24433 -612 20153 4689 -19344 -14553
2775 -14553 10490 19927 -2049 -20840 -3274 21632 14452 -10591 -14197 8118 23373 7283
2787 7283 -16007 -8319 18129 19424 -5269 -15902 979 19753 11274 -14399 -15526 9615 17879
2800 17879 -2639 -19054 -8426 12856 11405 -12458 -20740 427 15147 698 -18201 -13715
2812 -13715 7138 13337 -6022 -20050 -4003 15012 6702 -11936 -12816 4995 16388 2679 -14187
2825 -14187 -4847 14478 13028 -4153 -10248 2946 16110 8442 -9127 -6868 10155 13243 -761
2838 -761 -9319 -1974 10892 8481 -7535 -10203 3328 9241 -558 -10139 -7234 4048 6283 -5566
2852 -5566 -12054 -2499 6007 293 -7826 -8000 415 5670 -1118 -8701 -2805 5206 3121 -2527 -4107
$$ packed form
2763A8549k2782k0073J2133K4945P02k6077j1830K3821K0765j5464k4033M791
2775a4553K5043R437k1976j8791J7566K4906p180k5043l606K2315J5255j6090
2787G283k3290P688K6448J295k4693j0633J6881J8774q479k5673j127K5141Q264
2800A7879k0518j6415J0628K1282j451k3863q282K1167J4720j4449j8899M486
2812a3715K0853O199j9359j4028J6047J9015q310j8638q80J7811J1393j3709j6866
2825a4187R340J9325j450j7181o095J3194J3164p668j7569K259J7023L088j4004
2838g61q558P345J2866k411j6016k668J3531N913r799r581K905J1282K235j1849
2852e566o488R555Q506n714q119j74Q415N255o788p583N896Q011k085n648j580
$$ plain form
2867 -4107 372 6075 3530 -3382 -973 5025 4651 1681 -739 491 4511 4768 -328 -935 2903 2726
2883 2726 1390 205 -1227 146 1853 -746 -1936 -304 -1290 -1233 -23 -1931 -3175 -1267 -1348 -1593
2899 -1593 -1349 -2997 -2962 573 331 -2956 -2280 -314 989 1388 -1869 -3007 2429 4412 -50 -2111
2915 -2111 184 3646 4620 114 -3626 1747 6697 2643 -2745 -2037 3057 5722 1192 -5631 -2004
2930 -2004 6015 3781 -4068 -5786 -159 6025 2469 -7520 -6266 4100 6022 -2677 -8513 -3160 5787
2945 5787 5468 -5957 -9578 1728 8761 483 -8236 -5857 6438 9691 -2957 -11130 -673 10685
2959 10685 5111 -7289 -8452 4110 12553 1353 -10719 -4688 10473 9831 -5571 -11013 215
2972 215 13028 5354 -11152 -9853 7644 12275 -2184 -13702 -4653 11971 9387 -9716 -13864
$$ packed form
2867d107M479N703k545o912K409N998l74k970k420J230M020K57n096o07L838j77
2883B726j336j185j432J373J707k599j190J632r86N7J210j908j244J908q1k45
2899a593K44j648L5L535k42l287O76J966J303L99l257j138N436J983m462k061
2915b111K295L462R74m506l740N373M950m054n388P08N094K665m530o823L627
2930b004Q019k234p849j718N627O184l556r989J254J0366J922q699n836N353Q947
2945E787l19j1425l621J1306P033q278q719K379J2295L253j2648q173J0457J1358
2959A0685n574j2400j163J2562Q443j1200j2072O031J5161o42j5402n442J1228
2972B15J2813p674j6506J299J7497M631j4459j1518R049J6624k584j9103m148
$$ plain form
2985 -13864 3540 14648 2087 -13789 -9297 9940 14070 -5587 -16475 -1163 15313 7330
2997 7330 -11778 -13059 6275 16391 -58 -16816 -6465 13874 12028 -7696 -15818 1263 17154
3010 17154 5494 -15462 -11519 9925 15371 -3209 -16930 -4279 15704 10791 -11850 -15076 5448
3023 5448 17099 2618 -15793 -9344 12992 15318 -6482 -17355 -97 17452 8271 -12999 -13998
3036 -13998 7822 18281 -703 -17802 -6136 14767 12758 -9469 -17128 1877 18081 4601
3048 4601 -16295 -11573 9798 15307 -4324 -18447 -4975 15485 10022 -12052 -15429 4892 15927
3061 15927 1736 -16528 -9360 12603 14339 -6864 -16599 -131 17137 7936 -12484 -12486 8888
3074 8888 17581 -154 -16129 -4686 15160 12689 -8133 -15261 3416 18058 4536 -14764 -10261
$$ packed form
2985a3864J7404J1108j2561j5876M492J9237M130j9657j0888J5312J6476p983
2997G330j9108j281J9334J0116j6449j6758J0351K0339j846j9724q122J7081J5891
3010A7154j1660k0956L943K1444N446j8580j3721J2651J9983m913k2641l226K0524
3023E448J1651j4481j8411O449K2336K326k1800j0873J7258J7549r181k1270r99
3036a3998K1820J0459j8984j7099J1666K0903k009k2227p659J9005J6204j3480
3048D601k0896M722K1371N509j9631j4123J3472K0460n463k2074l377K0321J1035
3061A5927j4191j8264P168K1963J736k1203r735J6468J7268r201k0420kK1374
3074H888Q693j7735j5975J1443J9846k471k0822p128J8677J4642j3522j9300M503
$$ plain form
3087 -10261 10058 14295 -4374 -17041 -3680 14543 7968 -12553 -14749 4278 14216 -9 -16056
3100 -16056 -8712 10774 11225 -7761 -15069 -146 13686 5253 -11949 -10395 8089 13462 -1539
3113 -1539 -13095 -2612 13054 9714 -6914 -10601 4857 14758 3624 -10536 -5179 10055 11584
3126 11584 -3094 -11336 105 12299 5255 -9021 -8663 4639 9633 -1391 -11369 -4743 7142
3139 7142 5312 -7246 -10793 -412 7306 532 -8963 -6289 4094 5702 -3033 -8538 -1409 6041
3153 6041 3836 -5024 -5217 3517 7206 1397 -4284 -894 6094 5783 -303 -2740 2271 6617 3139
3168 3139 -2011 -998 3509 4486 476 -2258 -447 2805 1296 -1859 -2653 -535 792 -1130 -3038
3183 -3038 -2904 -1174 -1173 -2277 -2756 -2196 -1733 -1623 -1721 -1671 -1692 -1665 -828 301 -157 -1177 -403 1656 2372 967
$$ packed form
3087a0261K0319M237j8669j2667J3361J8223o575k0521k196J9027R938j4225j6047
3100a6056P344J9486M51j8986p308J4923J3832q433j7202J554J8484N373j5001
3113a539j1556J0483J5666l340j6628l687J5458R901j1134j4160N357J5234J529
3126A1584j4678q242J1441J2194p044j4276L58J3302M994j1024r978O626J1885
3139G142j830j2558l547J0381P718o774r495K674J0383J608q735n505P129P450
3153F041k205q860j93Q734L689n809n681L390O988l11o086k437N011M346l478
3168C139n150J013M507R77m010k734J811L252j509l155p94K118J327j922j908
3183c038J34J730Jj104m79N60M63J10r8N0k1K7Q37J129m58j020P74K059P16j405
$$ plain form
3203 967 -271 1290 3943 3598 747 -37 3092 5434 2647 -694 -21 4009 4603 9 -2756 267
3219 267 4225 2107 -3520 -4426 934 3250 -1561 -6542 -4626 1892 1751 -4899 -7909 -2249 3288 -125
3235 -125 -7026 -6474 1324 4666 -1602 -7531 -2669 5884 5163 -3092 -5771 2379 9259 3989 -4837 -2724
3251 -2724 7300 10227 933 -5970 672 10505 7517 -3908 -6240 3851 10749 1952 -9017 -4670
3265 -4670 7075 7504 -4751 -11278 -1662 7943 1994 -10589 -11272 2745 8269 -3194 -13925 -6731
3279 -6731 7308 6112 -8514 -12684 447 11099 2995 -10931 -7969 8189 12409 -1628 -10882
3292 -10882 -629 13967 9787 -6367 -8390 6900 15817 3986 -10249 -4399 12292 12963 -4036
3305 -4036 -12051 882 14210 6045 -11481 -10954 5951 12415 -2740 -15938 -6482 10013 7546
$$ packed form
3203I67j238J561K653l45k851p84L129K342k787l341O73M030N94m594k765L023
3219B67L958k118n627r06N360K316m811m981J916O518j41o650l010N660N537l413
3235a25o901N52P798L342o268n929M862Q553p21q255k679Q150O880n270q826K113
3251b724J0024K927r294o903O642R833k988j1425k332J0091O898q797j0969M347
3265d670J1745M29j2255o527R616R605n949j2583o83J4017N524j1463j0731P194
3279f731J4039j196j4626m170J3131J0652q104j3926K962J6158M220j4037r254
3292a0882J0253J4596m180j6154k023J5290Q917j1831j4235N850J6691O71j6999
3305d036q015J2933J3328q165j7526N27J6905O464j5155j3198R456J6495k467
$$ plain form
3318 7546 -10961 -15893 49 11588 776 -15383 -11150 7092 10906 -5378 -15294 -2702 13097
3331 13097 7783 -9805 -11062 6264 15358 2469 -11967 -4141 13396 13662 -3681 -11110 3318
3344 3318 16419 7548 -9747 -8482 9358 14645 -825 -13782 -3590 12722 8879 -9428 -13973
3357 -13973 1722 12377 1092 -15240 -10601 6600 9522 -6877 -16546 -4005 10563 4890 -11955
3370 -11955 -13037 3855 12369 -50 -13363 -5850 10317 11286 -5218 -11663 2262 14549 6797
3383 6797 -8397 -6836 9532 14421 663 -10263 -1158 13386 10069 -5908 -9755 3993 13450
3396 13450 2808 -11391 -6991 8033 9430 -5253 -13402 -2763 9557 3760 -10992 -11565 2818
3409 2818 8750 -2646 -13164 -6346 7006 6360 -7106 -11252 547 9678 2705 -8753 -6183 6620
$$ packed form
3318G546j8507m932J5942J1539j0812j6159M233J8242L814j6284r916J2592J5799
3331A3097n314j7588j257J7326R094j2889j4436P826J7537K66j7343p429J4428
3344C318J3101q871j7295J265J7840N287j5470j2957J0192J6312l843j8307m545
3357a3973J5695J0655j1285j6332M639J7201K922j6399r669J2541J4568n673j6845
3370a1955j082J6892Q514j2419j3313P513J6167R69j6504o445J3925J2287p752
3383F797j5194J561J6368M889j3758j0926R105J4544l317j5977l847J3748R457
3396A3450j0642j4199M400J5024J397j4683q149J0639J2320n797j4752n73J4383
3409B818N932j1396j0518O818J3352o46j3466m146J1799R131o973j1458K570J2803
$$ plain form
3423 6620 9642 -962 -7779 161 10447 7090 -3778 -5187 5411 10767 2287 -5854 -1667 7805
3437 7805 7136 -2641 -6465 938 7399 2638 -6131 -5510 2900 4536 -2766 -7695 -3542 3635 1609
3452 1609 -5648 -6811 -419 3043 -1228 -6122 -3882 1996 2542 -2532 -4287 -337 3340 1916 -1858
3467 -1858 -1844 2530 3806 1288 -813 1094 3534 3288 1248 139 1735 3436 2242 659 1014 1938
3483 1938 1402 606 -230 429 -273 -510 -439 -343 -1337 -1788 -1413 -771 -1293 -2691 -2476 -947 -231 -1654 -3360
3502 -3360 -1728 607 227 -2150 -2778 86 2057 844 -2019 -1368 2500 3823 330 -2069 606 4452
3518 4452 3471 -952 -1811 2861 5062 1819 -2642 -1178 3954 4381 -1256 -4238 -146 4384 2242 -4220
3534 -4220 -4909 1276 4272 -1121 -6525 -3380 3405 3216 -3922 -7046 -525 5506 1379 -6493 -5425
$$ packed form
3423F620L022j0604o817P940J0286l357j0868j409J0598N356q480q141M187R472
3437G805o69r777l824P403O461m761q769O21Q410J636p302m929M153P177k026
3452A609p257j163O392L462m271m894K240N878N46n074j755L950L677j424l774
3467a858J4M374J276k518k101J907K440k46k040j109J596J701j194j583L55R24
3483A938n36p96q36O59p02k37P1R6r94m51L75O42n22j398K15J529P16j423j706
3502c360J632K335l80k377o28K864J971j213k863O51L868J323l493k399K675L846
3518D452r81m423q59M672K201l243m461J464N132M27n637k982M092M530k142o462
3534d220o89O185K996n393n404L145O785j89p138l124O521O031m127p872J068
$$ plain form
3549 -5425 2752 5774 -1177 -7008 -2252 6122 5164 -4045 -6142 2658 8437 2774 -6141 -3846 5992
3564 5992 8281 -1283 -6939 -248 8661 5764 -4899 -7038 3129 9687 665 -8619 -4158 6888
3578 6888 7101 -4320 -10104 176 9734 3120 -8740 -8068 4907 8904 -2805 -11098 -3909 8949
3592 8949 6746 -6934 -9763 1932 9704 1618 -10051 -5652 7348 9965 -2987 -10666 -1101 11186
3606 11186 6350 -7634 -8595 5154 11443 648 -10859 -4425 9771 9056 -5507 -11004 1175
3619 1175 11720 3752 -10540 -8147 6789 10585 -2503 -12219 -3094 10530 6723 -8315 -10668
3632 -10668 3214 11493 1052 -11556 -6488 8367 9624 -4383 -11684 -500 11488 5191 -9052
3645 -9052 -8902 5477 11609 -396 -11089 -4095 9385 8500 -5681 -10702 1601 11430 3497 -9849
$$ packed form
3549e425Q177L022o951n831M756Q374r58r209k097Q800N779n663q915K295R838
3564E992K289r564n656O691Q909k897j0663k139J0167O558r022r284M461J1046
3578F888K13j1421n784J0280R558o614j1860O72J2975L997j1709q293P189J2858
3592H949k203j3680k829J1695P772q086j1669M399J3000K617j2952p679R565J2287
3606A1186m836j3984r61J3749O289j0795j1507O434J4196p15j4563n497J2179
3619A175J0545p968j4292K393J4936L796j3088r716R125J3624l807j5038k353
3632a0668J3882Q279j0441j2608N068J4855J257j4007p301J1184J1988o297j4243
3645i052J50J4379O132j2005j0693O994J3480q85j4181n021J2303R829p933j3346
$$ plain form
3659 -9849 -7511 6577 10324 -2356 -11445 -2368 10129 6657 -7587 -9492 3534 11253 1691 -10537
3673 -10537 -5678 8312 8989 -3958 -10690 70 10698 4967 -8478 -8195 5089 10373 -793
3686 -793 -10423 -3637 8528 7136 -5630 -9792 1395 9769 2260 -9341 -6288 5838 8345 -2905
3700 -2905 -9984 -2021 8594 4957 -6901 -8070 3142 8876 575 -8790 -4126 7264 6924 -3941
3714 -3941 -8095 912 9029 3474 -6398 -5230 5205 8124 -944 -7389 -1353 7496 5024 -4546 -6373
3729 -6373 2067 7153 1036 -6555 -3731 4705 4852 -3041 -6786 -945 5239 1914 -5295 -4958 1886
3744 1886 4719 -1293 -5733 -2116 3545 2953 -3279 -4122 1039 4350 914 -3527 -1874 3338 3743 -547
3760 -547 -2643 734 4053 2097 -1289 -1190 2325 3111 658 -1231 65 2459 1487 -717 -1075 157
$$ packed form
3659i849K338J4088L747j2680r089R077J2497l472j4244j905J3026P719r562j2228
3673a0537M859J3990O77j2947o732J0760J0628n731j3445K83J3284N284j1166
3686g93r630O786J2165j392j2766m162J1187Q374p509j1601L053J2126K507j1250
3700b905p079P963J0615l637j1858j169J1212N734q301r365M664J1390l40j0865
3714c941m154R007Q117n555r872J168J0435K919r068o445O036Q849k472r570j827
3729f373Q440N086o117p591K824Q436J47p893l745N841O184l325p209L37O844
3744A886K833o012m440L617N661n92o232q43N161L311l436m441J653N212M05m290
3760e47k096L377L319j956l386R9L515P86k453j889J296K394r72k204l58J232
$$ plain form
3776 157 942 -221 -1210 -1106 172 -43 -1371 -1084 -720 -890 -1418 -1186 -562 -977 -1361 -1112 -162 70 -1184
3795 -1184 -1323 38 1031 464 -1114 -599 1793 2269 225 -1025 983 3134 2031 -570 -547 2355 3467
3812 3467 786 -1894 44 3216 2550 -1609 -2716 777 3181 737 -3504 -2815 1282 2477 -2084
3827 -2084 -5112 -1648 2467 866 -4035 -5247 7 3233 -661 -5181 -3171 2598 3394 -2235 -5080
3842 -5080 81 5088 2623 -3484 -3231 3494 6376 1178 -4084 -562 6274 5547 -1782 -4261 2264
3857 2264 7476 2807 -4794 -3539 4442 6278 -1190 -6840 -1927 5452 3485 -5727 -7327 655 5768
3872 5768 -390 -8392 -5288 3649 4645 -4248 -8982 -1700 6429 2539 -6834 -6815 3126 7749 -466 -7861
3888 -7861 -2677 7753 7227 -3342 -6898 2320 10175 4097 -6181 -4072 7318 9422 -591 -7538
$$ packed form
3776A57P85j163r89J04J278k15j328K87L64j70n28K32O24m15l84K49R50K32j254
3795a184j39J361R93n67j578N15K392M76k044j250K008K151j103k601K3K902J112
3812C467k681k680J938L172o66m159j107L493K404k444m241O89M097J195m561
3827b084l028L464M115j601m901j212N254L226l894m520K010N769P96n629k845
3842e080N161N007k465o107K53O725K882n198n262L522O836p27p329k479O525
3857B264N212m669p601J255P981J836p468n650M913P379j967r212j600P982N113
3872E768o158q002L104Q937R96q893m734P282Q129l890r373J9R941M623q215p395
3888g861N184J0430n26j0569l556R218P855o078j0278K109J1390K104j0013o947
$$ plain form
3902 -7538 -499 9377 6170 -5925 -7613 3192 9155 814 -9195 -5295 6294 6863 -5076 -10591
3916 -10591 -1420 7761 2262 -9045 -8813 2826 7676 -2485 -10830 -3837 7165 5393 -5843 -9357
3930 -9357 1598 9751 2541 -8036 -4682 7219 9472 -1200 -8147 357 10839 6660 -5282
3943 -5282 -5945 5153 10882 1773 -8053 -3312 8306 7942 -4275 -9147 504 8928 2916 -8383
3957 -8383 -7779 3596 7295 -2539 -10820 -4314 5848 4189 -6895 -9936 82 7560 454 -9169
3971 -9169 -5951 4987 7171 -2584 -8540 -1125 8828 5103 -5376 -5400 4461 9466 1800 -6654 -2178
3986 -2178 8318 8409 -2515 -6191 2039 9147 4070 -5788 -4975 4920 7905 -1299 -7892 -2373 5904
4001 5904 4026 -5503 -8444 250 6177 -258 -8512 -5661 3145 4463 -3634 -8650 -2089 5858 2646
$$ packed form
3902g538P039R876l207j2095j688J0805N963q341j0009L900J1589N69j1939n515
3916a0591R171R181n499j1307K32J1639M850j0161q345O993J1002j772j1236l514
3930i357J0955Q153p210j0577L354J1901K253j0672o947Q504J0482m179j1942
3943e282o63J1098N729r109r826M741J1618l64j2217m872R651Q424o012j1299
3957h383O04J1375L699r834q281O506J0162j659j1084l041J0018P478p106r623
3971i169L218J0938K184r755n956P415R953l725j0479k4R861N005p666q454M476
3986b178J0496R1j0924l676Q230P108n077r858Q13R895K985r204o593N519Q277
4001E904j878r529k941Q694N927o435q254K851Q806J318q097n016O561P947l212
$$ plain form
4016 2646 -5710 -5929 2072 6386 233 -5864 -2050 6248 5513 -1945 -4046 2473 7224 3707 -3327
4031 -3327 -2129 5271 6807 -275 -3457 411 5301 3327 -2674 -3864 2089 4816 -505 -4607 -2326
4046 -2326 1912 2217 -2851 -5394 -1085 2248 -592 -4585 -3672 330 1665 -1509 -4295 -1686 2044
4061 2044 683 -2048 -1990 639 2076 1175 -1190 -54 2507 2000 403 295 1816 2341 2145 706 928
4078 928 1937 1571 374 971 731 494 -117 185 64 -61 -154 -1399 -518 75 -1911 -2048 -913 -852 -943
4097 -943 -2144 -3214 -193 115 -1969 -2672 -825 821 537 -1475 -2211 569 2659 24 -1925 66
4113 66 2612 2526 194 -1646 1250 4418 2066 -1717 -672 2948 3918 864 -2384 -615 3904 2602
4129 2602 -2402 -2864 1200 3188 337 -4084 -3421 2023 2661 -2631 -5185 -1444 2698 1250 -4057 -5066
$$ packed form
4016B646q356k19Q001M314o153o097L814Q298p35p458k101O519M751l517p034
4031c327J198P400J536p082l182L868M890j974o001j190N953K727n321m102K281
4046b326M238L05n068k543M309L333k840l993R13M002J335l174k786K609L730
4061B044j361k731N8K629J437r01k365J136K561n07j597j08J521N25j96j439K22
4078I28J009l66j197N97k40k37o11L02j21j25r3j245Q81N93j986j37J135O1r1
4097i43j201j070L021L08k084p03J847J646k84k012p36K780K090k635j949J991
4113F6K546q6k332j840K896L168k352l783J045L620R70l054l248J769M519j302
4129B602n004m62M064J988k851m421O63N444O38n292k554L741M142j448n307j009
$$ plain form
4145 -5066 970 3692 -855 -5019 -2165 2919 3697 -2025 -5140 360 5597 2302 -3888 -2973 3392
4160 3392 6084 693 -4897 -822 6366 4755 -2509 -4065 1937 6557 2505 -5037 -3631 4483 5967
4175 5967 -1701 -6153 -1349 5307 3524 -4885 -6841 1679 5841 -927 -7044 -4300 4143 5060 -3227
4190 -3227 -8131 -475 6706 2067 -6262 -5408 2997 7164 -336 -7974 -2010 7203 5400 -3629 -5976
4205 -5976 1782 8443 3234 -6533 -4300 6198 7314 -1953 -6788 -516 7651 4705 -5761 -6663 3075
4220 3075 7660 -185 -7702 -3891 5759 6046 -4069 -8366 304 7400 1885 -7745 -5479 3916 6882
4235 6882 -2346 -8331 -2261 6586 4441 -5180 -5817 1343 7932 566 -6895 -4149 5840 6235 -2339
4250 -2339 -6244 -656 7667 4423 -5600 -5617 3768 7305 26 -7040 -3154 5807 5814 -3886 -7022 1025
$$ packed form
4145e066O036K722m547m164K854N084P78n722l115N500N237l295o190R15O365
4160C392K692n391n590M075P188j611p264j556O002M620m052p542J406Q114J484
4175E967p668m452M804O656j783q409j956Q520M162o768o117K744Q443R17q287
4190c227m904P656P181m639q329Q54Q405M167p500p638N964R213j803r029k347
4205e976P758O661n209r767K233J0498J116r267m835O272Q167k946j0466r02R738
4220C075M585p845p517L811R650K87j0115m297Q670P096n515r630K266R395K966
4235F882r228n985O070Q847k145r621o37P160O589p366p461K746R989L95q574
4250b339l905N588Q323l244j0023j7R385L537p279p066L886Q961Pr700l136Q047
$$ plain form
4266 1025 6989 1835 -6403 -5009 3949 6132 -1151 -7336 -1563 6123 3503 -4722 -6081 1238 7087
4281 7087 1334 -6698 -3526 5081 5350 -1742 -6101 -166 5936 4242 -5064 -5095 3706 5485 -30 -5168
4297 -5168 -1823 5465 4785 -3613 -5440 1213 5571 1582 -5052 -3441 3385 5403 -1865 -5516 -902
4312 -902 4974 3069 -3792 -4690 1383 5029 632 -4951 -3387 2842 3131 -2723 -4707 181 5138 1654
4328 1654 -3704 -2904 2147 3580 -311 -4076 -1333 3458 2502 -2896 -4199 991 3675 266 -3210
4343 -3210 -2695 1854 2106 -2105 -3312 8 2565 772 -1956 -2256 1561 2296 -59 -2540 -288 2248
4359 2248 1332 -952 -1258 1022 2561 318 -1660 -112 1122 1370 -871 -869 -116 892 568 -1234 -936
4376 -936 99 -235 -293 -756 -144 288 -603 -1103 137 275 -1159 -376 107 192 -223 -1225 -503 898 -87
$$ packed form
4266A025N964n154q238J394Q958K183p283o185N773P686k620q225j359P319N849
4281G087n753q032L172Q607K69p092m359N935O102j694r306l1Q801J779n515n138
4297e168L345P288o80q398j827O653M358l989o634J611O826K018p268l651M614
4312i02N876j905o861q98O073L646m397n583J564O229K89n854j984M888M957l484
4328A654n358Q00N051J433l891l765K743M791r56n398j303N190K684l409l476
4343c210N15M549K52m211j207L320K557j793k728l00L817P35k355k481K252K536
4359B248r16k284l06K280J539k243j978J548J234K48k241KP53J008l24j802K98
4376i36J035l34n8m63O12M32q91n00J240J38j434P83M83Q5m15j002P22J401r85
$$ plain form
4395 -87 -1251 -1492 493 922 383 -739 -111 1235 1812 -540 -1349 1845 2296 815 -1195 -814 1776
4412 1776 2408 -188 -2330 -180 2860 1442 -1559 -2382 976 2853 -159 -3195 -1695 2042 1794 -1791
4428 -1791 -3788 -661 3320 170 -3834 -3104 1042 2555 -1550 -3210 -1583 2969 1927 -2382 -3873
4443 -3873 1767 4129 722 -3173 -1279 3849 3772 -595 -2921 114 4608 3196 -1938 -2822 2021 5386
4459 5386 552 -3919 -1708 3905 3698 -1807 -4957 -437 4347 1691 -4871 -4165 1912 4058 -1244
4474 -1244 -5837 -2303 3726 3130 -3894 -5768 270 4748 1038 -5457 -3923 3586 5251 -1517 -5263
4489 -5263 -338 5868 3704 -3585 -4321 2729 6863 1254 -4865 -1612 5369 5717 -1744 -5338 882
4504 882 6971 3023 -4956 -4578 3180 5875 -775 -6911 -2611 4952 3676 -4674 -7078 316 5595
$$ packed form
4395h7j164k41J985M29n39j122O28J346N77k352q09L194M51j481k010L81K590
4412A776O32k596k142K150L040j418l001q23L358J877l012l036J500L737k48l585
4428a791j997L127L981l150m004P30M146J513m105j660J627M552j042m309j491
4443c873N640K362l407l895J894N128p7m367k326L035M494j412n134q84M843L365
4459E386m834m471K211N613k07n505l150M520M784k656o562P06O077K146n302
4474a244m593L534O029n96p024j874O038M478l710o495J534P509J665o768l746
4489e263M925O206k164p289p36P050M134n609o119L253O981L48p461l594O220
4504H82O089l948p979L78P758K695o650o136M300P563j276q350k404P394N279
$$ plain form
4519 5595 489 -7079 -4984 3275 4552 -2705 -7355 -1513 5912 3131 -5197 -5463 2913 6553 426
4534 426 -5780 -2003 6070 5712 -1888 -5264 1572 7469 3339 -4342 -3357 4732 7021 -238 -5646 -1025
4550 -1025 6206 4486 -3790 -5639 1409 5934 869 -6479 -4336 3591 4375 -2891 -7174 -1722 4595
4565 4595 1796 -5660 -5829 1569 4999 -789 -6465 -3004 4404 4509 -2647 -5424 825 6141 2585
4580 2585 -4042 -3048 4004 6071 169 -4386 -210 5952 4410 -2308 -3846 2249 6071 1440 -4224
4595 -4224 -2592 3846 4386 -1753 -5257 -836 4248 1822 -4231 -4804 880 3782 -1149 -5738 -2968
4610 -2968 2590 2297 -3506 -5225 -126 3624 645 -4123 -3248 2372 3943 -590 -3550 -374 4150
4625 4150 3150 -1775 -2328 2249 5106 1362 -2543 -563 3488 3721 -377 -2228 1034 3589 1572
$$ packed form
4519E595n106p568K095Q259J277p257m650N842P425k781q328k66Q376L640o127
4534D26o206L777Q073l58p600l376O836N897m130p681R85Q089K289p259n408M621
4550a025P231j720q276j849P048M525n065p348K143P927P84p266m283N452O317
4565D595k799p456j69P398L430n788n676L461P408J05p156k777O249N316l556
4580B585o627R94P052K067n902m555M176O162j542o718j538O095L822m631n664
4595d224J632O438N40o139l504M421N084k426o053n73N684K902m931m589K770
4610b968N558k93n803j719N099L750k979m768Q75N620J571m533k960L176M524
4625D150j000m925n53M577K857l744l905J980M051K33m098j851L262K555k017
$$ plain form
4640 1572 -2070 -1992 1507 2595 -608 -3078 -1206 1364 664 -2391 -3008 -532 960 -865 -3069 -2140
4656 -2140 433 499 -1694 -2374 -540 1060 28 -1334 -859 852 1228 257 -444 697 1682 1162 432
4673 432 1005 1562 1610 1144 481 1010 1249 999 532 678 713 92 -153 -25 385 -68 -865 -731 180 -203 -1396
4694 -1396 -1833 -746 49 -752 -2184 -1644 -168 334 -1314 -2261 -714 1067 422 -1526 -1382 915 1957
4711 1957 264 -1285 225 2556 2052 -370 -1125 1438 3276 1594 -1177 -493 2381 2917 -138 -2194
4727 -2194 260 2990 1894 -1711 -2367 1182 2711 -90 -3336 -1931 1824 1353 -2502 -3943 -926
4742 -926 2144 423 -3672 -3366 1064 2396 -1172 -4000 -1511 2799 2420 -2148 -3459 1045 4097 1162
4758 1162 -3064 -1795 3439 4381 -336 -3115 434 4342 3020 -2106 -2415 2093 4856 943 -3593
$$ packed form
4640A572l642P8L499J088l203k470J872K570p00l055o17K476J492j825k204R29
4656b140K573O6k193o80J834J600j032j362M75J711L76r71p01J141R85n20p30
4673D32N73N57M8m66o63N29K39k50m67J46L5o21k45J28M10m53p97J34R11l83j193
4694a396m37J087P95q01j432N40J476N02j648r47J547J781o45j948J44K297J042
4711A957j693j549J510K331n04k422p55K563J838j682k771O84K874N36l055k056
4727b194K454K730j096l605o56L549J529k801l246J405L755m71l855j441L017
4742i26L070j721m095L06M430J332l568k828K489M310l79m568j311M504L052k935
4758A162m226J269N234R42m717k779L549L908j322n126l09M508K763l913m536
$$ plain form
4773 -3593 -1844 3456 3213 -1992 -3591 -509 4153 1515 -4218 -4496 1473 3554 -1070 -5651 -2475
4788 -2475 3346 2463 -3348 -4984 284 4415 1045 -4704 -3417 3151 4448 -1182 -4825 -470 5089
4803 5089 3478 -3037 -3710 2513 6214 1168 -4427 -1577 4653 4921 -1730 -4783 766 5345 1998
4818 1998 -4066 -3628 2562 4460 -438 -5454 -1987 4064 3202 -4321 -5350 362 4628 596 -5236
4833 -5236 -3511 2996 4427 -2130 -5946 -1140 4958 2612 -4007 -4184 2126 5649 297 -5127 -1651
4848 -1651 4498 4187 -2028 -4559 887 5843 2283 -3981 -3047 3231 5135 -612 -4725 -1089 4583
4863 4583 3180 -3033 -4379 1041 4545 413 -4900 -3322 3052 3613 -1783 -4871 -869 4025 1856
4878 1856 -3959 -4089 1599 4325 -114 -4483 -2150 3407 3247 -2255 -4017 273 4374 1406 -3344
$$ packed form
4773c593J749N300k43n205j599L082M662k638n733k78N969K081m624m581L176
4788b475N821q83n811j636N268M131l370n749J287O568J297n630l643M355N559
4803E089j611o515o73O223L701n046n595K850O230K68o651l053N549M579l347
4818A998o064M38O190J898m898n016L467O051q62p523j029N712M266m032n832
4833e236J725O507J431o557l816M806O098k346o619j77O310L523n352n424L476
4848a651O149l11o215k531N446M956l560o264R34O278J904n747m113L636N672
4863D583j403o213j346N420L504m132n313J578O374N61n396l088M002M894k169
4878A856n815j30N688K726m439m369K333N557j60n502j762M290M101k968m750
$$ plain form
4893 -3344 -2583 2719 4021 -297 -3480 -745 3816 2839 -2286 -3222 1119 4010 941 -3206 -1964 2641
4909 2641 3039 -1376 -3786 -325 3230 1490 -2745 -3008 1185 3003 -138 -3280 -1554 2243 1988 -1629
4925 -1629 -2972 189 2975 869 -2449 -1891 1803 2522 -832 -2741 -558 2531 1417 -1422 -1641 850
4941 850 2098 263 -2019 -934 1859 1628 -638 -1677 248 1597 720 -1532 -1056 988 993 -150 -1266
4958 -1266 -114 1267 731 -843 -694 357 931 50 -927 -57 776 629 -341 -561 241 342 45 -416
4976 -416 -42 98 128 -317 -24 298 206 -301 -10 453 184 -562 -427 158 335 -324 -758 -125 764 366 -1037
4997 -1037 -577 535 929 -69 -855 -457 1410 973 -860 -1099 314 1732 482 -1166 -698 1534 1856
5014 1856 -435 -1890 30 2141 939 -1478 -1461 1045 2004 -347 -2141 -751 1816 1347 -1484 -2432
$$ packed form
4893c344P61N302J302m318l183K735M561r77n125r36M341K891l069m147J242M605
4909B641L98m415k410L461L555j740m235k63M193J818l141l142J726L797k55l617
4925a629j343L161K786k106l318N58L694P19l354j909K183L089j114k839k19K491
4941H50J248j835k282J085K793k31k266j039J925J349q77k252M76K044Nj143j116
4958a266J152J381n36j574J49J051N74q81r77Q70Q33j47r70k20Q02J01k97m61
4976d16L74J40L0m45K93L22r2n07K91M63k69p46J35N85J77o59m34O33Q89l98j403
4997a037M60J112L94r98p86L98J867m37j833k39J413J418j250j648M68K232L22
5014A856k291j455J920K111j202k417J7K506R59k351j794J390K567m69k831r48
$$ plain form
5030 -2432 400 2403 360 -2530 -2033 1449 2151 -812 -2799 -423 2621 1529 -2010 -2428 935 2869
5046 2869 227 -2569 -1002 2445 2549 -1109 -2706 424 3130 1454 -2288 -2193 1871 3489 -211 -3230
5062 -3230 -1138 2830 2421 -1735 -3100 523 3334 759 -3490 -2820 1769 2870 -1200 -4049 -1194
5077 -1194 2777 1781 -2801 -3436 793 3597 89 -4039 -2176 2641 3373 -1187 -3816 -99 4251 2405
5093 2405 -2948 -2868 2175 4804 485 -3560 -1368 4005 3711 -1718 -3522 969 4754 1626 -3470 -2901
5109 -2901 2588 3940 -903 -4561 -1154 3682 2343 -3410 -4358 571 4055 -157 -4634 -3027 2596
5124 2596 3344 -2111 -4976 -385 3809 1730 -3822 -3527 2037 4515 -150 -4201 -1149 4281 3578 -1653
5140 -1653 -3769 1637 4891 1727 -3461 -2332 3359 4749 -738 -4140 -579 4440 2461 -2865 -3853
$$ packed form
5030b432K832K003k043k890M97L482P02k963j987K376L044j092l539m18L363J934
5046B869k642k796J567L447J04l658j597L130K706j676l742R5M064J618l700l019
5062c230K092L968m09m156j365L623K811k575m249O70M589J101m070k849K855
5077a194L971r96m582o35M229K804l508m128J863M817P32m560k629L717M350j846
5093B405n353Q0N043K629m319m045K192N373k94n429j804M491L785l128n096N69
5109b901N489J352m843l658L407M836j339n753r48M929L484m212m477J607N623
5124B596P48n455k865M591M194k079n552K95N564K478m665m051L052N430p03n231
5140a653k116N406L254l164n188J129N691J390n487l402L561N019j979n326r88
$$ plain form
5155 -3853 1805 3965 5 -4270 -2513 2910 2830 -2474 -4865 -335 3322 1100 -3692 -3472 1800 3289
5171 3289 -1274 -4485 -1452 2799 2099 -2376 -3723 992 3706 1174 -3113 -1637 2751 3839 -224
5186 -224 -2811 450 3804 2433 -1784 -2232 1544 4205 740 -2900 -1339 2467 2531 -1437 -3297 -118
5202 -118 2800 803 -3241 -2602 1078 2294 -1124 -3543 -1331 2014 1133 -2576 -2994 -21 2334 167
5218 167 -2436 -1860 1871 2484 -917 -2261 63 2510 1655 -1125 -1086 1470 2992 496 -1572 -295
5234 -295 2333 2026 -403 -1244 852 2380 754 -1268 -806 1129 1657 -687 -1801 -680 767 221
5250 221 -1728 -1727 -350 584 -720 -1921 -1279 143 85 -1253 -1453 -247 396 -54 -746 -369 408 541 -222
5269 -222 -142 592 1131 861 569 430 1084 1040 469 745 954 613 361 343 486 602 239 -263 154 615 -237
$$ packed form
5155c853N658K160l960m275J757N423q0n304k391M530L657k222m792K20N272J489
5171C289m563l211L033M251p00m475j347M715K714k532m287J476M388J088m063
5186b24k587L261L354j371m217m48L776K661l465l640J561L806O4l968j860L179
5202a18K918j997m044O39L680J216l418k419K212L345q81l709m18K973K355k167
5218A67k603N76L731O13l401j344K324K447q55k780L9K556J522k496k068J277
5234b95K628l07k429q41K096J528j626k022M62J935N28k344j114J121J447n46
5250B21j949JJ377R34j304j201O42J422n8j338k00J206O43m50o92L77P77J33p63
5269b22Q0P34N39k70k92j39O54m4n71K76K09l41k52j8J43J16l63n02M17M61q52
$$ plain form
5290 -237 -877 -535 19 -253 -1096 -1436 -497 314 -507 -1928 -1011 229 297 -943 -1578 -417 984 189 -1316
5309 -1316 -1109 682 1484 228 -1042 -20 2090 1641 -511 -738 1347 2247 789 -848 -218 1837
5325 1837 2095 -413 -1556 531 2352 925 -1577 -1823 1038 1873 -423 -2917 -1413 1399 1071 -1861
5341 -1861 -2899 -390 1732 119 -2972 -2029 879 1624 -991 -2770 -944 2059 1199 -2057 -2168 1152
5357 1152 2999 712 -2063 -939 2655 2760 -634 -2218 485 3486 1863 -1443 -1739 2128 3461
5372 3461 212 -2620 -1162 2573 2161 -1742 -3004 -221 2813 477 -3360 -2495 1301 2322 -1331
5387 -1331 -3799 -1463 2521 1418 -2819 -3394 399 2910 374 -3351 -1964 2327 2858 -1057 -3278
5402 -3278 339 3474 2059 -2235 -2258 2024 3926 193 -3315 -688 3253 3118 -1478 -3258 730 3894
$$ packed form
5290b37o40L42N54k72q43l40R39Q11q21j421R17J240O8j240o35J161J401p95j505
5309a316K07J791Q02j256j270J022K110m49k152k27K085R00j458j637O30K055
5325A837K58k508j143K087J821j427k502k46K861Q35k296k494J504K812l28k932
5341a861j038K509K122j613l091R43K908P45k615j779J826L003q60l256j11L320
5357A152J847k287k775J124L594J05l394j584K703L001j623l306k96L867J333
5372C461l249k832J458L735m12l903j262K783L034k336l837Q65L796J021l653
5387a331k468K336L984j103m237n75L793K511k536l725J387M291N31l915k221
5402c278L617L135j415m294k3M282J902l733l508K627L941j35m596j780L988L164
$$ plain form
5418 3894 1193 -2884 -2036 1894 3530 -822 -3986 -1216 3017 1889 -2965 -3627 508 2996 66
5433 66 -4060 -2495 2636 2553 -1811 -3858 -326 3379 1558 -2722 -2898 1915 3545 -153 -3242 -783
5449 -783 3210 2899 -1372 -2804 1060 3862 1167 -2591 -1430 1973 3567 -444 -3142 -229 3466
5464 3466 2144 -2221 -2800 842 3073 102 -3466 -1790 2288 2089 -1607 -3416 -541 2477 832
5479 832 -2757 -2861 1206 2643 -652 -2985 -1273 2192 2398 -1583 -2642 474 2968 758 -2133 -1114
5495 -1114 2064 2793 -304 -2175 -211 2921 1441 -1393 -1974 1075 2715 555 -2154 -1249 1861 1983
5511 1983 -979 -2033 -300 2100 812 -1889 -1758 739 1367 -430 -1818 -1164 1427 1113 -1487 -1920
5527 -1920 323 1622 -27 -1629 -1269 1049 1532 -240 -1500 235 1440 994 -680 -1016 647 1301
$$ packed form
5418C894k701m077Q48L930J636m352l164K770M233j128m854o62M135K488k930
5433F6m126J565N131q3m364k047L532L705j821m280j76M813J630l698l089K459
5449g83L993l11m271j432L864K802k695l758J161L403J594m011k698K913L695
5464C466j322m365n79L642K231k971l568J676M078j99l696j809K875L018j645
5479H32l589j04M067J437l295k333J712L465K06l981j059L116K494k210k891J019
5495a114L178P29l097j871J964L132j480k834n81L049J640k160k709R05L110J22
5511A983k962j054J733K400j288k701J31K497O28j797j388O54K591l14k600m33
5527a920K243J299j649j602L60K318M83j772j260J735J205m46j674l36J663O54
$$ plain form
5543 1301 375 -872 -83 1236 1020 -342 -935 99 1245 450 -765 -361 716 768 -133 -765 -280 422
5561 422 250 -713 -480 26 375 -350 -473 -397 93 113 -292 -89 185 -97 -66 -50 64 143 -234 -162 371 388
5583 388 -67 -330 255 497 114 31 -103 422 808 -100 -778 88 811 32 -481 -543 234 1179 137 -1257
5603 -1257 -417 925 970 -740 -1128 274 1302 162 -1429 -797 1318 1005 -642 -1213 -97 1417 759
5620 759 -1326 -1290 937 1414 -337 -1546 -412 1715 1144 -1216 -1730 500 1849 406 -1781 -1061 1328
5637 1328 1658 -801 -2185 -19 1981 1038 -1660 -1720 692 2327 103 -2367 -849 1872 1545 -1020
5653 -1020 -2190 145 2689 1009 -2067 -1637 1243 2297 -176 -2296 -820 2332 1641 -1506 -2068 934
5669 934 2455 219 -3016 -2592 1437 2398 -1171 -2679 -283 2369 908 -1982 -2389 1004 2655 -21
$$ packed form
5543A301r26j247P89J319k16j362n93J034J146p95j215M04J077N2r01o32M85P02
5561D22j72r63K33N06L49p25j23P6M90K0m05K03K74k82L1J6J14P9l77P2N33J7
5583C88m55k63N85K42l83q3j34N25L86r08o78Q66P23p79n13o2P77R45j042j394
5603a257Q40J342M5j710l88J402J028j140j591O32K115l13j647n71J116J514o58
5620G59k085L6K227M77j751j209J134K127n71k360n14K230J349j443k187P20K389
5637A328L30k459j384K166K000r43k698o0K412J635k224k470J518K721l27k565
5653a020j170K335K544j680l076M30K880J054k473k120J476L152o91l147n62L002
5669I34J521k236l235M24M029R61l569j508K396K652j461k890m07L393J651k676
$$ plain form
5685 -21 -2793 -1225 2003 2047 -1235 -2747 57 2918 1268 -2497 -1894 1510 2749 -228 -2441 -569
5701 -569 2660 2144 -1548 -2625 677 2832 818 -2690 -1812 1860 2617 -1089 -3143 -485 2537 1285
5717 1285 -2326 -2616 918 2519 -267 -3420 -1398 1864 2054 -1518 -3301 -262 2934 1177 -2766
5732 -2766 -2147 1789 2746 -465 -2991 -794 3017 2134 -1857 -2475 1105 3075 705 -2370 -1436 2230
5748 2230 2902 -783 -2764 -33 2594 1619 -1885 -2407 1106 2784 -324 -2921 -1128 1945 1693 -1561
5764 -1561 -2881 -215 2253 223 -2860 -2039 1418 2131 -600 -2760 -687 2071 1666 -1734 -2028 749
5780 749 2742 497 -1981 -1085 1849 2340 -374 -1861 143 2453 1578 -1263 -1384 1250 2439 49
5796 49 -1593 -693 1751 1589 -995 -2017 78 1813 223 -1894 -1279 649 1345 -546 -1988 -778
$$ packed form
5685b1k772J568L228M4l282j512K804K861j650l765O03L404J239k977k213J872
5701e69L229n16l692j077L302K155k014l508Q78L672P57l706k054K658L022j252
5717A285l611k90L534J601k786l153K022L262J90l572j783L039L196j757l943
5732b766O19L936R57l211k526K197L811q83l991o18L580J970k370l075R34L666
5748B230O72l685j981K731K627r75l504n22L513J678l108k597J793L073k52l254
5764a561j320K666K468k030l083Q21L457P13k731k160K073K758m05l400k94K777
5780G49J993k245k478Q96K934M91k714j487K004K310q75k841j21K634J189k390
5796D9j642R00K444j62k584j022K095J735j590k117O15J928O96j891j442J210
$$ plain form
5812 -778 1442 506 -1475 -1881 207 1348 102 -1883 -766 1106 1010 -729 -1630 32 1530 1101 -676
5829 -676 -488 995 1851 153 -652 72 1497 1214 -249 -561 482 1326 421 -783 -451 636 653 -326
5847 -326 -1127 -353 544 -76 -1086 -772 -128 102 -349 -1120 -768 314 -163 -560 -604 -159 313 -236 -99 7
5867 7 432 73 -218 -170 326 321 316 177 352 494 214 157 489 684 285 88 145 918 414 -307 -448 425 526
5890 526 -354 -956 -456 127 108 -699 -1051 -288 163 -344 -1148 -919 231 291 -708 -1319 -59 779 98 -1160
5910 -1160 -850 492 988 -196 -1198 -14 1572 1153 -707 -909 827 1788 668 -843 -387 1538
5926 1538 1818 -188 -1150 309 1696 727 -1067 -1189 589 1354 -429 -1761 -905 1118 835 -1550 -2210
5943 -2210 -206 1273 -276 -2098 -1347 755 1226 -953 -2185 -339 1505 836 -1279 -1568 860 2330
$$ packed form
5812g78K220r36j981m06K088J141j246j985J117J872r6j739r01J662J498m29j777
5829f76J88J483Q56j698q05P24J425k83j463l12J043Q44r05j204L32J087J7r79
5847c26q01P74Q97o20j010L14O44K30m51p71L52J082m77l97m4M45M72n49J37J06
5867GM25l59k91M8M96nnj39J75J42k80n7L32J95l99j97N7P73n04p21j41Q73J01
5890E26q80o02N00N83j9q07l52P63M51n07q04K29J150O0r99o11J260Q38o81j258
5910a160L10J342M96j184j002J184J586m19j860k02J736R61j120j511M56J925
5926A538K80k006r62J459J387r69j794j22J778P65j783j332Q56K023k83k385o60
5943b210K004J479j549j822P51K102M71k179j232J846J844o69k115k89K428J470
$$ plain form
5959 2330 381 -1805 -723 1978 2057 -546 -1764 367 2588 1375 -1152 -1035 1621 2490 83 -2008
5975 -2008 -414 2114 1622 -1308 -1908 383 2137 198 -2341 -1502 972 1441 -999 -2572 -712 1598
5991 1598 777 -2048 -2397 619 1678 -32 -2314 -1369 1641 1907 -650 -2090 143 2423 1290 -1541
6007 -1541 -1247 1575 2777 452 -1883 -175 2383 1816 -691 -1829 1040 2845 1099 -1791 -1199 1568
6023 1568 2131 -764 -2496 -724 1735 840 -2078 -2275 222 1964 -324 -2862 -1691 1366 1521 -1443
6039 -1443 -2515 -165 2208 771 -2088 -1574 1087 2320 -143 -1931 -393 2244 2155 -917 -1622 816
6055 816 2568 795 -1619 -902 2024 2569 -125 -1996 -35 2240 1432 -1302 -1895 794 1983 -265
6071 -265 -2116 -1038 1335 1289 -1026 -2110 -100 1337 369 -1845 -1715 733 1506 -501 -2155 -986
$$ packed form
5959B330j949k186J082K701P9k603j218K131K221j213k527J17K656Q69k407k091
5975b008J594K528m92k930o00K291J754j939k539Q39K474M69k440j573J860K310
5991A598q21k825l49L016J059j710k282R45L010K66k557j440K233K280j133k831
6007a541K94K822J202k325k335J708K558n67k507j138K869J805j746k890N92K767
6023A568N63k895j732J772K459q95k918j97K497J742k288k538J171L057J55k964
6039a443j072K350K373j437k859N14K661J233k463j788J538K637q9l072p05K438
6055H16J752j773k414P17K926N45k694j871J961K275q08k734n93K689J189k248
6071b65j851J078K373m6k315j084K010J437r68k214J30K448P73k007j654J169
$$ plain form
6087 -986 1350 1064 -1108 -1388 611 1634 488 -1569 -701 1574 1759 -311 -1400 170 1818 934
6103 934 -742 -1044 1000 1817 103 -1133 -425 1390 1096 -817 -1294 -335 1083 279 -1354 -1193 356
6120 356 736 -667 -1533 -515 658 591 -948 -1143 -2 920 -108 -902 -800 414 825 -564 -862 134
6138 134 927 608 -396 -309 685 981 29 -548 -93 577 699 -222 -346 133 622 370 -475 -451 446 229
6158 229 -153 -437 -284 253 -97 -228 -308 208 60 -325 -412 -19 27 -195 -253 -140 -155 -61 -320 -166 334 137
6180 137 44 123 307 390 -129 -214 116 675 218 -103 -61 556 470 -311 -552 208 793 435 -731 -387 347 721
6202 721 -157 -777 17 751 505 -777 -951 195 936 -255 -1066 -789 706 743 -551 -1078 6 1288
6220 1288 436 -934 -615 589 1129 -202 -1421 -219 1286 1026 -848 -1299 164 1502 231 -1361
$$ packed form
6087i86K336k86k172k80J999J023j146k057Q68K275J85k070j089J570J648q84
6103I34j676l02K044Q17j714j236P08J815k94j913m77R59J418q04j633J61J549
6120C56L80j403q66J018J173o7j539j95J141R22j028p94J02J214M11j389k98R96
6138A34P93l19j004Q7R94K96r52n77M55O70J22r21j24M79M89k52q45K4Q97k17
6158B29l82k84J53N37l50j31q0N16j48l85q7L93M6k22n8J13j5R4k59J54N00j97
6180A37r3P9J84Q3n19q5L30N59m57l21M2O17q6p81k41P60N85l58j166L44P34L74
6202G21q78o20P94P34k46j282j74J146P41j191q11K77J495L7j294n27J084J282
6220A288q52j370L19J204N40j331j219J202J505k60j874m51J463J338j271j592
$$ plain form
6236 -1361 -738 995 1319 -276 -1441 -73 1703 617 -1008 -1238 810 1391 -191 -1701 -754 1246
6252 1246 994 -1058 -1791 219 1898 596 -1345 -1122 975 1618 -467 -1792 -484 1442 1100 -1330
6268 -1330 -1625 635 1513 308 -1513 -1078 1401 1503 -749 -1798 -151 1816 892 -1335 -1472 883
6284 883 1727 -16 -1763 -644 1426 1344 -873 -1918 172 1839 489 -1643 -1030 1301 2028 -164
6300 -164 -1935 -398 1679 1177 -1052 -1612 614 2007 328 -1858 -985 1452 1624 -928 -1836 -83
6316 -83 2075 932 -1895 -1760 678 1694 -189 -2109 -881 1588 1629 -1187 -2204 268 2017 548
6332 548 -1946 -1491 1324 2111 -350 -2018 -428 1955 1180 -1171 -1278 705 2052 400 -1711 -885
6348 -885 1416 1752 -556 -1957 -20 2027 1033 -1427 -1162 816 1570 -294 -1844 -736 1353 969
$$ packed form
6236a361O23J733L24j595j165J368J776j086j625k30K048N81j582j510R47K000
6252A246k52k052p33K010J679j302j941K23K097O43k085j325J308J926l42k430
6268a330k95K260Q78j205j821M35K479J02k252j049J647J967r24k227j37K355
6284H83Q44j743j747J119K070q2k217j045K090J667j350k132O13K331P27k192
6300a64j771J537K077n02k229n60K226J393j679k186Q73K437J72k552r08J753
6316h3K158j143k827J35K438J016j883j920J228K469M1k816j017K472J749j469
6332E48k494M55K815P87k461j668J590K383p75k351j07J983J347j652k111Q26
6348h85K301L36k308j401J937K047r94k460K65J978P54j864j550J108K089l84
$$ plain form
6364 969 -1058 -1884 22 1594 273 -1623 -1178 975 1477 -481 -2020 -540 1433 998 -1182 -1105 678
6381 678 1697 185 -1271 -632 1290 1459 -400 -1180 113 1666 735 -993 -724 986 1520 132 -1172
6398 -1172 -286 942 780 -658 -1035 7 1306 217 -1267 -1000 819 625 -453 -1292 -423 684 224
6415 224 -1124 -1068 86 1009 -135 -1083 -556 745 1041 -333 -504 27 1040 631 -456 -602 397 826
6433 826 -125 -564 6 557 762 -186 -143 229 834 235 -439 -48 286 532 -293 -563 -414 386 76 -599
6453 -599 -447 -239 -102 -475 -530 -188 -56 -75 -383 -606 -288 -117 -70 -192 -75 -96 -18 201 236 246 60 -51
6475 -51 356 292 389 179 6 570 837 91 -66 459 482 381 -314 -173 90 340 -38 -622 -345 502 10
6496 10 -827 -774 -171 482 -431 -1189 -601 183 386 -677 -1113 -331 535 91 -998 -602 341 909 33 -727
$$ packed form
6364I69k027q26J906J572j321j896M45K153N02j958j539J480J973m35k180P7J783
6381F78J019j512j456O39J922J69j859p80J293J553r31j728K69J710N34j388j304
6398a172Q86J228j62j438l77J042J299j089j484K67J819j94j078q39Q69J107m60
6415B24j348N6J154R23j144r48N27J301K96j374j71N31J013m09j087j46R99M29
6433H26r51m39N70N51K05r48M3L72O05n99o74L91L34K46q25k70J49Q00l10o75
6453e99J52K08J37l73n5L42J32j9l08k23L18J71M7j22J17k1P8K19L5J0j86j11
6475e1M07o4R7k10j73N64K67p46j57N25K3j01o95J41K63K50l78n84K77Q47m92
6496A0q37N3O03O53r13p58N88P84K03j063m36P82Q66m44j089L96R43N68q76p60
$$ plain form
6516 -727 272 1189 1069 -572 -646 827 1460 367 -628 -127 1277 1111 -481 -944 118 1593 655 -1075
6534 -1075 -804 830 1430 -348 -1563 -436 1333 650 -1012 -1557 -53 876 -172 -1721 -1164 689
6550 689 1030 -587 -1609 -191 951 361 -1205 -1116 955 1702 91 -1348 -414 1490 1530 -524 -1187
6567 -1187 528 1635 842 -954 -519 1314 1886 -190 -1413 -278 1603 1036 -952 -1493 305 1526
6583 1526 306 -1699 -1121 1052 985 -866 -2082 -690 1355 379 -1737 -1798 404 1540 -133 -2107
6599 -2107 -878 1452 1238 -733 -1564 236 2017 788 -1321 -982 1272 2003 260 -1421 -207 1860
6615 1860 1513 -567 -1452 384 2105 778 -1168 -869 1575 1548 -445 -1815 -385 1534 707 -1621
6631 -1621 -1946 426 1355 -440 -2026 -1177 1061 1173 -1127 -1991 -201 1846 478 -1803 -1248 1198
$$ packed form
6516g27R99R17j20j641p4J473O33j093r95N01J404j66j592m63J062J475r38j730
6534a075K71J634O00j778j215J127J769o83j662n45J504R29j048j549N57J853
6550F89L41j617j022J418J142n90j566Q9K071P47j611j439R34J904M0k054o63
6567a187J715J107p93j796M35J833N72k076j223J135J881n67j988n41J798J221
6583A526j220k005N78K173o7j851j216J392K045r76k116o1K202J136j673j974
6599b107J229K330k14j971q31J800J781j229k109L39K254P31j743j681J214K067
6615A860l47k080q85J836J721j327j946K99K444k7j993j370J430J919q27k328
6631a621l25K372R29j795j586Q49K238J12k300q64J790K047j368k281N55K446
$$ plain form
6647 1198 1724 -216 -1657 -377 1575 1637 -918 -926 767 2115 683 -1322 -548 1476 1563 -411 -1420
6664 -1420 -109 1616 780 -1130 -1164 769 1511 -155 -1700 -1104 945 1021 -890 -1594 -185 1278 -36
6681 -36 -1629 -1334 767 1043 -587 -1588 -619 1206 605 -1008 -1139 680 1130 289 -1056 -654 1149
6698 1149 1112 -215 -629 327 1431 974 -625 -693 514 1458 58 -884 -362 726 1048 -706 -983 -8
6716 -8 965 130 -914 -586 53 454 -317 -1244 -596 242 521 -777 -574 -124 282 -32 -774 -398 342 465
6736 465 -279 -315 87 429 281 -182 -143 569 593 -12 -211 297 716 531 91 -272 396 357 228 -117 -28 193
6758 193 170 59 -446 -344 -168 -360 -190 -46 -416 -231 -153 -258 -133 -217 -425 -124 -104 -144 -322 -339 96 324
6780 324 -130 -151 -21 255 296 -86 -211 262 687 322 -285 31 660 474 -108 -246 126 867 289 -713
$$ packed form
6647A198N26j940j441J280J952O2k555qJ693J348j432k005P74K024Q7j974j009
6664a420J311J725q36j910l4J933P42j666j545N96K049P6j911p04J409J463j314
6681c6j593K95K101K76j630j001R69J825o01j613j31J819M50q41j345M02J803
6698A149l7j327m14R56J104m57j599o8J207R44j400r42N22J088L22j754k77R75
6716hR73q35j044L28O39M01p71r27O48Q38K79j298K03M50M06l14p42L76P40J23
6736D65p44l6M02L42j48m63L9P12K4o05j99N08M19j85m40l63O68l9j29l45Q9K21
6758A93k3j11n05J02J76j92J70J44l70J85P8j05J25q4k08L01K0m0j78j7M35K28
6780C24m54k1J30K76M1l82j25M73M25l65o07L16O29j86n82j38L72P41n78j002
$$ plain form
6800 -713 -367 456 618 -124 -1087 -293 724 470 -596 -838 178 590 -62 -638 -447 553 566 -613 -1139
6819 -1139 -106 1268 63 -925 -803 538 1046 1 -1140 -269 1038 666 -360 -892 376 1254 320
6836 320 -1166 -670 1230 918 -677 -1056 -103 1351 504 -1115 -1128 593 1228 -122 -1400 -572 1121
6853 1121 999 -899 -1432 166 1274 92 -1370 -1061 729 1209 -410 -1885 -320 1468 697 -1053
6869 -1053 -1040 752 1590 187 -1384 -644 1031 1139 -734 -1537 200 1736 465 -1272 -1224 1062 1397
6886 1397 -45 -1443 -209 1312 1140 -931 -1542 519 1634 468 -1499 -1155 955 1465 -253 -1638
6902 -1638 -185 1698 866 -1163 -1446 669 1261 6 -1528 -723 1333 1249 -650 -1590 -85 1724 709
6919 709 -1534 -1041 769 1449 -8 -1680 -652 1320 905 -874 -1626 248 1566 262 -1443 -960
$$ packed form
6800g13L46Q23J62p42r63P94J017k54j066k42J016M12o52n76J91J000J3j179n26
6819a139J033J374j205r88J22J341N08j045j141Q71J307l72j026n32J268Q78r34
6836C20j486M96J900l12j595l79R53J454q47j619j3J721O35j350j278Q28J693
6853A121j22j898n33J598J108j182j462L09J790M80j619j475J565J788p71j750
6869a053J3J792Q38j403j571P40J675J08j873q03J737J536j271j737M8K286L35
6886A397j442j398J234J521j72k071o11K061J115j166j967L44K110N10j718j385
6902a638J453J883q32k029k83K115N92j255j534Q05K056q4j899r40J505J809j015
6919G09k243M93J810O80j457j672J028J972m15j779p52J874J318j304j705M83
$$ plain form
6935 -960 1095 1520 -614 -1773 -150 1353 863 -1125 -1358 402 1841 202 -1665 -483 1258 1169
6951 1169 -606 -1686 132 1823 640 -1478 -1140 777 1293 -403 -1601 -557 1198 995 -863 -1413
6967 -1413 333 1423 1 -1423 -1073 931 1269 -643 -1354 -36 1200 532 -988 -828 664 1349
6983 1349 20 -1596 -541 1187 1019 -405 -936 112 1228 553 -1153 -467 933 1289 -4 -1061
6999 -1061 -172 1029 625 -922 -658 230 816 76 -1063 -660 656 599 -190 -938 -180 648 277 -847
7017 -847 -571 388 705 83 -882 -268 666 387 -346 -644 189 796 80 -298 -8 365 625 163 -470 1
7037 1 657 543 -185 -363 332 531 167 -438 144 453 420 -154 -592 -104 78 67 -345 -160 -71 -54 -465 -392
7059 -392 -253 -137 -165 -71 -213 -95 163 -13 20 38 -248 72 51 101 -86 383 204 477 218 264 228 -34 455
$$ packed form
6935i60K055M25k134j159J623J503m90j988k33J760J439j639j867J182J741q9
6951A169j775j080J818J691j183k118L38J917N16j696j198J044J755k03j858n50
6967a413J746J090j422j424L50K004L38j912p11J318J236o68j520J60J492O85
6983A349j329j616J055J728j68j424n31J048J116o75j706O86J400L56j293j057
6999a061Q89J201m04j547K64Q88N86p40j139M03J316n7p89p48P58Q28l71j124
7017h47K76R59L17o22r65O14R34k79p33k98Q33O07p16l78K90L73K60m62o33M71
7037AO56j14p28j78O95J99l64o05N82L09l3n74m38M88J82j1m12J85Q9J7m11P3
7059c92J39J16k8R4j42J18K58j76L3J8k86L20k1N0j87M69j79K73k59M6l6k62M89
$$ plain form
7082 455 660 330 -214 -276 62 52 -29 -450 216 602 -899 -103 -459 668 -513 -1040 -466 213 592 -312
7102 -312 -934 -574 550 104 -738 -811 133 361 231 -1072 -391 480 852 14 -611 103 1169 565 -540
7121 -540 -500 428 1233 129 -671 -62 1328 1027 -399 -863 582 1314 374 -1189 -520 944 1069 -425
7139 -425 -1417 -484 1017 364 -1281 -1129 488 1047 -573 -1505 -640 629 322 -1606 -939 204 1662
7156 1662 584 -1269 -956 1120 926 -1109 -1181 -191 1114 1366 -844 -1110 1234 1662 554 -1304 -714
7173 -714 857 1792 -658 -1107 236 1673 682 -1597 -1300 956 1409 -774 -1929 -813 1500 1348 -1501
7190 -1501 -1684 -137 1137 261 -1930 -1418 510 1199 -671 -1759 -633 1498 949 -1047 -1037 537 1580
7207 1580 118 -1400 -813 1666 1635 -283 -1063 432 1772 1509 -1238 -1207 856 1596 284 -1960 -261
$$ packed form
7082D55K05l30n44o2L38j0q1m21O66L86j501P96l56J127j181n27N74O79L79r04
7102c12o22L60J124m46q42p3R44K28j30j303O81Q71L72q38o25P14J066o04j105
7121e40M0R28Q05j104q00O09J390l01j426m64J445P32r40j563O69J464J25j494
7139d25r92R33J501o53j645J52J617N59j620r32Q65J269l07j928O67J143J458
7156A662j078j853L13K076j94k035p2R90J305K52k210k66K344M28j108j858N90
7173g14J571R35k450m49J343J437r91k279K97K256M53k183j155J116K313j52k849
7190a501j83J547J274q76k191N12J928O89j870j088J126K131n49j996J0J574J043
7207A580j462j518N87K479l1j918p80J495J340k63k747L1K063P40j312k244J699
$$ plain form
7224 -261 1917 1102 -651 -1472 -90 1654 145 -1752 -1077 163 769 -23 -2043 -756 1104 1526 -1147
7241 -1147 -1987 54 901 -95 -2319 -1247 1150 1437 -611 -1699 441 2304 1093 -1281 -1060 790
7257 790 1637 589 -1022 -300 1475 1431 -227 -1264 569 1480 341 -1157 -854 1180 1320 -682 -1667
7274 -1667 -455 1119 365 -1108 -1744 117 941 -359 -1482 -1078 595 884 -860 -1451 -215 1033
7290 1033 507 -1165 -927 568 1368 26 -647 -31 1110 995 -186 -695 345 1237 417 -678 -285
7307 -285 742 948 5 -671 125 683 462 -522 -620 268 527 -265 -852 -796 277 128 -618 -1058 -69 321
7327 321 -141 -712 -846 -88 464 -167 -772 66 1099 475 -164 -432 -218 332 209 -662 476 52 970
7346 970 640 -56 415 460 11 -381 180 356 190 151 305 -135 359 -384 246 -487 -167 -94 -247 -234 75
$$ packed form
7224b61K178q15j753q21J382J744j509j897O75J240O06p92k020J287J860M22k673
7241a147q40K041Q47r96k224J072K397K87k048j088K140J863j211k374K21J850
7257G90Q47j048j611P22J775m4j658j037J833R11j139j498L03K034J40k002r85
7274a667J212J574p54j473o36J861Q24j300j123M04J673K89j744n91J236J248
7290A033n26j672K38J495Q00j342o73O16J141j15j181n09J040Q92q20j095L93
7307b85J027K06r43o76P96N58k21r84r8Q88K59p92n87N6J073j49p46m40R89L90
7327C21m62n71j34P58N52o31o05Q38J033o24o39k68K14N50j23q71J138m24R18
7346I70l30o96M71M5m49l92N61J76j66l9J54m40M94p43O30p33L20P3j53J3L09
$$ plain form
7367 75 -491 -156 -525 -51 -160 -765 -303 195 116 -97 -520 -344 150 306 -315 -433 330 580 8 -322 -52
7388 -52 617 680 174 -216 254 914 431 -364 -378 639 813 119 -838 -60 822 688 -596 -902 -122 725
7408 725 19 -860 -712 376 595 -282 -1363 -763 622 330 -845 -905 408 1258 83 -937 -536 1021
7426 1021 1193 -532 -1431 233 1504 836 -1299 -664 1065 1511 -127 -1008 -184 1056 713 -930 -774
7443 -774 487 1330 126 -1388 -922 949 856 -846 -1930 120 948 830 -1498 -1476 848 1410 -719
7460 -719 -1734 -396 586 745 -847 -1414 113 1715 365 -1371 -909 1197 1293 -417 -1644 -121 1777
7477 1777 1018 -970 -1093 740 1431 174 -1347 -651 1224 1283 -642 -1311 14 1407 702 -1091 -1249
7494 -1249 744 1614 -45 -1752 -885 1259 1239 -848 -1630 -86 1213 378 -1396 -1220 887 1122 -376
$$ packed form
7367G5n66L35l69M74j09o05M62M98p9k13m23J76M94J56o21j18P63K50n72l30K70
7388e2O69O3n06l90M70O60m83p95j4J017J74o94r57P78Q82j34j284l06P80Q47
7408G25p06q79J48J088K19q77j081O00J385k92j175o0J313Q50j175j020M01J557
7426A021J72j725q99J664J271o68k135O35J729M46j638q81Q24J240l43j643J56
7443g74J261Q43j204j514M66J871r3j702j084K050Q28j18k328K2K324N62k129
7460g19j015J338R82J59j592n67J527J602j350j736M62K106R6j710j227J523J898
7477A777p59j988j23J833O91j257j521O96J875N9j925o69J325J393p05j793j58
7494a249J993Q70j659j707Q67K144k0k087p82J544J299q35j774J76K107K35j498
$$ plain form
7511 -376 -1588 -204 1365 885 -911 -1369 513 1572 499 -1383 -707 1311 1547 -542 -1516 -34
7527 -34 1551 941 -916 -1560 686 1612 49 -1456 -759 1332 1226 -785 -1590 349 1761 417 -1629
7544 -1629 -1022 785 1505 -489 -1613 -134 1414 824 -1075 -1269 379 1465 223 -1471 -701 1188
7560 1188 1362 -406 -1468 29 1208 437 -988 -1175 750 1420 -78 -1459 -704 1266 1026 -583
7576 -583 -1026 98 1239 245 -954 -916 934 1194 -200 -1290 -416 1017 750 -790 -958 301 1262
7593 1262 8 -1171 -610 921 1043 -547 -989 -211 709 310 -828 -600 268 827 -55 -814 -508 530
7611 530 473 -723 -502 379 678 -40 -775 -453 630 627 -432 -762 -167 632 350 -421 -706 221 604 49
7631 49 -443 -165 401 166 130 -431 81 629 -5 -199 -18 61 110 206 -115 -121 353 164 -152 -114 95 112 47
$$ packed form
7511c76j212J384J569m80j796m58J882J059j073j882O76K018K36k089r74J482
7527c4J585o10j857o44K246R26j563j505O97K091j06k011q05J939J412j344k046
7544a629O07J807P20j994j124J479J548n90j899j94J648J086j242j694P70J889
7560A188J74j768j062J497J179p71j425j87J925O70j498j381P55J970k40j609
7576e83m43J124J141r94j199L8J850K60j394j090Q74J433k67j540j68J259R61
7593A262j254j179N61J531J22j590m42P78R20l99j138K28Q68N59q82p59L06J038
7611E30n7j196K21Q81K99p18p35L22J083lj059l30N95P99k82p71k85R27L83n55
7631D9m92K78N66k35l6n61N12N48o34j94J81P9M9R6l21oM74j89l16L8K09J7o5
$$ plain form
7654 47 -361 -207 113 -126 134 -201 -117 -135 -47 226 -5 -215 -165 -141 112 -163 -196 -211 10 408 -45 -238 142
7677 142 384 432 1 -230 180 624 204 -194 17 375 575 -48 -379 -181 466 494 -607 -620 179 509 71
7698 71 -828 -377 434 492 -461 -1032 -12 824 143 -759 -913 206 747 -47 -551 -440 881 637 -588
7717 -588 -851 157 1340 518 -832 -428 967 1259 85 -1000 362 1460 1082 -750 -857 642 1491
7734 1491 184 -1215 -620 1054 1117 -823 -1550 -65 1140 220 -1539 -1154 803 1095 -511 -1692 -667
7751 -667 1036 752 -1223 -1537 450 1308 343 -1459 -708 1441 1575 -425 -1340 153 1677 884 -1126
7768 -1126 -1129 1104 1991 329 -1519 -287 1476 1602 -651 -1500 175 1592 652 -1567 -1037 1188 1481
7785 1481 -469 -2026 -709 1411 774 -1378 -1745 269 1396 -17 -1751 -871 1023 1268 -572 -1595
$$ packed form
7654D7m08J54L20k39K60l35Q4j8Q8K73k31k10N0K4K53k75l3j5K21L98m53j93L80
7677A42K42M8m31k31M10M44m20l98K11L58K00o23l31J98O47K8j101j3P99L30m38
7698G1q99M51Q11N8r53n71J020Q36o81r02j54J119N41p94n04J11J321k44j225
7717e88k63J008J183q22j350M04J395K92j174j085J362J098l78j832j07J499Q49
7734A491j307j399N95J674O3j940p27J485J205r20j759L85J957K92j606j181J025
7751f67J703k84j975l14J987Q58r65j802P51K149J34k000r15J493J524p93k010
7768a126lK233Q87j662j848J232J763J26k253q49J675J417r40k219N30K225K93
7785A481j950j557J317K120o37k152l67K014J127j413j734Q80J894K45j840j023
$$ plain form
7801 -1595 -248 1507 1026 -1342 -1462 883 1813 120 -1222 -361 1491 1732 -416 -1294 188 2059
7817 2059 900 -1196 -789 1232 1849 -91 -1653 -372 1532 824 -1298 -1370 185 1572 -17 -2002
7833 -2002 -1266 736 1091 -870 -2024 -645 1142 506 -1574 -1627 393 1183 -255 -1700 -981 1251 1357
7850 1357 -544 -1285 407 1670 755 -979 -680 1097 1987 275 -1138 40 1807 1268 -610 -1006
7866 -1006 416 1642 176 -1296 -675 827 1170 -501 -1612 52 1064 255 -1321 -1532 185 985
7882 985 -262 -1684 -856 617 406 -917 -1488 -427 973 411 -1007 -802 860 980 -60 -772 -106
7899 -106 1232 862 -133 -235 883 1169 382 -369 -223 938 800 2 -746 193 1041 376 -622 -607 74
7918 74 495 -216 -889 -424 263 -39 -786 -748 -212 266 -253 -488 -377 104 247 -164 -604 -163 220 390 -79
$$ packed form
7801a595J347J755m81k368j20K345R30j693j342Q61J852K41k148q78J482J871
7817B059j159k096M07K021O17j940j562J281J904p08k122p2J555J387j589j985
7833b002P36K002L55j961j154J379J787o36k080n3K020P90j438j445P19K232J06
7850A357j901p41J692J263r15j734K99J777Q90j712j413J178J767n39j878l96
7866a006J422J226j466j472O21J502L43j671j111J664J012q09j576k11J717Q00
7882I85j247j422Q28J473k11j323n71J061J400n62j418K05J662J20j040p12O66
7899a06J338l70r95j02J118K86p87p51J46J161j38p98p48R39Q48o65r98J5O81
7918G4M21p11o73M65O87l02p47L8N36M78n19k35J11M81J43m11m40M41L83J70m69
$$ plain form
7939 -79 -129 159 428 347 165 240 154 736 236 224 459 521 451 209 358 272 382 504 56 -21 -164 -33 -233
7962 -233 46 -366 -226 -210 -184 -445 -278 -532 -299 -23 -199 -400 -464 169 -90 -403 -452 -98 438 193 -304
7983 -304 -204 107 642 227 -392 265 950 967 10 -32 484 1061 525 -352 -165 917 767 -166 -570 -94
8003 -94 898 601 -719 -1027 373 750 -379 -1203 -549 653 578 -566 -1357 84 925 667 -1477 -873
8021 -873 416 735 -548 -1560 -605 1057 1237 -505 -637 190 1108 336 -732 -575 1613 1519 -284 -1220
8039 -1220 -141 1495 804 -764 -1053 1050 1731 290 -1487 -614 1287 949 -864 -1428 -50 1501
8055 1501 159 -1439 -1304 562 1270 -608 -1727 -591 1316 698 -1293 -1560 253 1671 207 -1479
8071 -1479 -826 1174 1546 -527 -1436 38 1926 1152 -1188 -1264 1019 1951 133 -1526 -610 1562 1371
$$ packed form
7939g9n0K88K69q1j82P5q6N82n00j2K35O2p0k42J49q6J10J22m48p7j43J31k00
7962b33K79m12J40J6K6k61J67k54K33K76j76k01o4O33k59l13m9L54N36k45m97
7983c04J00L11N35m15o19O57O85J7r57m2N16N77n36q77J87J082j50r33m04M76
8003i4R92k97j320l08J400L77j129q24O54J202p5j144p91J441Q41k58k144O04
8021h73J289L19j283j012R55J662J80j742j32Q27R18p72j068J57K188r4j803r36
8039a220J079J636o91j568k89K103O81j441j777Q73J901l38j813n64J378J551
8055A501j342j598J35J866P08j878j119J136J907o18j991k67J813J418j464j686
8071a479O53K000L72k073r09J474J888p74k340p6K283R32j818j659R16K172j91
$$ plain form
8088 1371 -718 -1627 267 1593 520 -1298 -1169 1074 1472 -481 -2165 -399 1300 658 -1615 -1865
8104 -1865 229 1453 70 -1582 -341 990 971 -730 -1592 -19 1812 889 -1470 -874 815 2171
8120 2171 -70 -974 -663 1226 1449 -712 -1768 582 1796 596 -1656 -1583 1386 1742 -245 -1354
8136 -1354 -302 924 480 -1232 -1698 351 937 -379 -1424 -932 1324 1240 -362 -1580 175 1446
8152 1446 310 -1283 -1110 503 1333 33 -1452 -855 1239 1228 -665 -1255 345 1775 739 -1006
8168 -1006 -973 826 1408 -71 -1403 23 1353 958 -669 -1235 410 1360 215 -1146 -1029 941 939
8185 939 -140 -1334 -69 1171 443 -908
$$ packed form
8088A371k089r09J894J326j073j818J29K243L98j953j684J766J699o42k273k50
8104a865K094J224j383j652J241J331j9j701q62J573J831r23k359N96J689J356
8120B171k241r04L11J889K23k161j056K350J214j200k252P3K969L56j987j109
8136a354J052J226m44j712m66K049N86j316j045M92K256q4j602j218J755J271
8152A446j136j593J73J613Q30j300j485N97K094j1j893n90J600J430j036j745
8168a006L3J799N82j479j332J426J330l95j627n66J645R50j145j361J17J970k
8185I39j079j194J265J240p28j351
8191i08
$$ Imaginary data points
##PAGE= N=2
##DATA TABLE= (X++(I..I)), XYDATA
$$ plain form
0 0 0 0 0 0 0 0 0 1 0 0 -8 8 -8 16 -18 24 -25 35 -42 50 -62 75 -88 103 -123 145 -166 193 -225 257 -292 335
32 335 -381 430 -487 549 -618 691 -775 865 -961 1068 -1187 1315 -1454 1608 -1775 1954
48 1954 -2156 2376 -2616 2882 -3178 3505 -3871 4282 -4751 5289 -5908 6639 -7512 8575
62 8575 -9904 11627 -13946 17264 -22429 31626 -52951 211812 -166073 -554665 141730 495281
74 495281 208928 -360951 -395470 157407 515385 -40548 -599701 -240669 423943 257352
84 257352 -375771 -499949 27005 375944 45051 -466928 -357440 204093 382177 -145214
94 -145214 -532155 -84204 450219 179807 -327055 -280263 155232 391225 110762 -341102
104 -341102 -193989 395932 408710 -173103 -312865 137243 398722 172537 -201560 -223398
$$ packed form
0@%%%%%%%Jj%qJ6j6K4l4M2m9O0p7R2j12J37j63J91k26K68l11L59m18M82n49O27
32C35p16Q11r17J036j167J309j466J640j826K029k255K502k769L062l383L729
48A954m110M532m992N498o060O683p376Q153r033J0040j1197J2547j4151J6087
62H575j8479K1531k5573L1210l9693N4055q4577K64763l77885l88592O96395L53551
74D95281k86353n69879l4519N52877L57978n55933n59153L59032O64612j66591
84B57352o33123j24178N26954L48939l30893n11979J09488N61533J78084n27391
94a45214l86941M47951N34423k70412n06862M6792M35495K35993k80463m51864
104c41102J47113N89921J2778n81813j39762M50108K61479k26185l74097k1838
$$ plain form
114 -223398 206666 405876 -9277 -345003 -69946 318596 206178 -214050 -291946 57292
124 57292 262667 21153 -293166 -224971 124780 216556 -128709 -366140 -81462 234633
134 234633 54081 -249960 -214705 35703 191578 32042 -261539 -158557 216246 202082
144 202082 -127430 -189298 56122 223813 117970 -110984 -125190 139735 265292 26126
154 26126 -168350 -7739 220761 169083 -75338 -137226 70359 192246 50306 -129023
164 -129023 -109248 83654 156831 -53396 -205258 -34637 126120 18036 -136381 -132703 -16803
175 -16803 78677 -3230 -176341 -120415 84217 60267 -105561 -115567 -9015 68875 36465
186 36465 -75291 -81023 55266 105185 4785 -66002 2889 102030 82444 -14346 -23532 59691
$$ packed form
114b23398M30064J99210m15153l35726K75057L88542j12418m20228p7896L49238
124E7292K05375k41514l14319O8195L49751R1776l45265k37431K84678L16095
134B34633j80552l04041L5255K50408J55875j59536k93581J02982L74803j4164
144B02082l29512o1868K45420J67691j05843k28954j4206K64925J25557k39166
154B6126j94476J60611K28500n1678k44421o1888K07585J21887j41940j79329
164a29023J9775J92902P3177k10227j51862J70621J60757j08084j54417L678J15900
175a6803R5480q1907j73111N5926K04632k3950j65828j0006J06552P7890l2410
186C6465j11756n732J36289M9919j00400p0787O8891R9141j9586r6790r186Q3223
$$ plain form
198 59691 94193 46038 -2667 -3698 53872 87146 8467 -42296 29033 50378 -4048 -10195
210 -10195 -9325 -23560 4427 -266 -50412 -36105 -5109 -35114 -44030 -15496 -32950 -54018 -27965
223 -27965 -12472 -22345 -34903 -42502 -14741 18313 -3910 -35937 -22606 22971 50981 4949
235 4949 -46348 12402 88062 46180 -24974 -10714 49608 86072 45227 -45552 -25135 100218
247 100218 94865 -37823 -63760 30289 89348 40299 -70907 -80824 47811 97498 -32219
258 -32219 -127339 -41251 81185 49009 -94059 -128916 5662 97865 -4381 -134249 -91566
269 -91566 62226 98697 -51299 -155124 -19540 133430 55271 -103874 -99489 55004 145113
280 145113 26223 -133115 -55665 145396 133847 -64780 -122322 34307 165468 75409 -112558
$$ packed form
198E9691L4502m8155m8705j031N7570L3274p8679n0763P1329K1345n4426o147
210a0195Q70j4235K7987m693n0146J4307L0996l0005q916K8534j7454k1068K6053
223b7965J5493r873j2558p599K7761L3054k2223l2027J3331M5577K8010m6032
235D949n1297N8750P5660m1882p1154J4260O0322L6464m0845r0779K0417J25353
247A00218n353j32688k5937R4049N9059m9049j11206r917J28635M9687j29717
258c2219r5120Q6088J22436l2176j43068l4857J34578R2203j02246j29868M2683
269i1566J53792L6471j49996j03825J35584J52970p8159j59145M385J54493R0109
280A45113j18890j59338P7450K01061j1549j98627n7542J56629J31161r0059j87967
$$ plain form
291 -112558 -105983 102148 171712 -17628 -161878 -39316 152091 112871 -106992 -162582 33430
302 33430 164399 24147 -167982 -119227 99902 147897 -65019 -202249 -34283 162499
312 162499 76900 -143897 -161463 49761 177808 13822 -194793 -96466 156000 153222 -87158
323 -87158 -181270 11062 197879 89003 -151628 -140251 115298 205982 -15962 -195537 -53008
334 -53008 191270 151369 -116647 -186607 52901 218970 49770 -191009 -131697 140407 193790
345 193790 -68157 -225972 -27005 201930 102045 -162366 -184183 72141 209536 4643
355 4643 -224212 -102174 171244 158687 -109612 -210100 10756 211988 75330 -183833
365 -183833 -151771 123108 202951 -36247 -215137 -50324 198505 137462 -137813 -187285 64273
$$ packed form
291a12558O575K08131O9564j89340j44250J22562J91407l9220k19863n5590J96012
302C3430J30969j40252j92129M8755K19129M7995k12916j37230J67966J96782
312A62499q5599k20797j7566K11224J28047j63986k08615R8327K52466k778k40380
323h7158r4112J92332J86817j08876k40631J1377K55549R0684k21944j79575J42529
334e3008K44278l9901k68016o9960K39508J66069j69200k40779N9312K72104N3383
345A93790k61947j57815J98967K28935r9885k64411k1817K56324J37395k04893
355D643k28855J22038K73418j2557k68299j00488K20856K01232j36658k59163
365a83833L2062K74879P9843k39198j78890J64813K48829o1043k75275m9472K51558
$$ [...]
8191i94
##END NTUPLES=NMR FID
##END=
