##TITLE=1H_LY-DiX-H2O
 CD3CN,8 sc, 
 12.02.2021
##JCAMPDX= 6.0         $$ Bruker NMR JCAMP-DX V2.0
##DATA TYPE= NMR FID
##DATA CLASS= NTUPLES
##ORIGIN= UXNMR, Bruker Analytische Messtechnik GmbH
##OWNER= root
$$ XWIN-NMR		Version 3.5
$$ Fri Feb 12 10:15:57 2021 Russian Standard Time (UT+4h)  she@DPX200
##.OBSERVE FREQUENCY= 200.1315066352
##.OBSERVE NUCLEUS= ^1H
##.DELAY= (6, 6)
##.ACQUISITION MODE= SIMULTANEOUS
##.ACQUISITION SCHEME= undefined
##.AVERAGES= 8
##.DIGITISER RES= 18
##SPECTROMETER/DATA SYSTEM= spect
##.PULSE SEQUENCE= zg30
##.SOLVENT NAME= CDCl3
##.SHIFT REFERENCE= (INTERNAL, CDCl3, 0, 15.7039)
##AUDIT TRAIL= $$ (NUMBER, WHEN, WHO, WHERE, WHAT)
$$ ##TITLE= Audit trail, XWIN-NMR		Version 3.5
$$ ##JCAMPDX= 5.01
$$ ##ORIGIN= Bruker BioSpin GmbH
$$ ##OWNER= she
$$ F:/spectra/data/she/nmr/H-F/1/audita.txt
$$ ##AUDIT TRAIL=  $$ (NUMBER, WHEN, WHO, WHERE, WHAT)
(   1,<2021-02-12 10:14:51.67 +0400>,<she>,<DPX200>,
      <created by zg, POWCHK disabled, PULCHK disabled
       configuration hash MD5:
       00 E9 B6 7A A2 85 ED C7 34 08 36 98 17 FE 4E 26
       data hash MD5: 16K
       78 A3 BE 7C 08 4D 60 81 73 24 29 02 33 16 A6 EA>)
$$ ##END=
$$ 
$$ hash MD5
$$ 3B 4F A4 3D C0 75 79 32 77 89 C2 BE 3B 7D 01 03
##$RELAX= 
##$RELAX= 
##$RELAX= 
##$RELAX= 
##$RELAX= 
##$RELAX= 
$$ Bruker specific parameters
$$ --------------------------
##$DU= <F:/spectra>
##$EXPNO= 1
##$NAME= <H-F>
##$PROCNO= 1
##$TYPE= <nmr>
##$USER= <she>
##$AMP= (0..31)
100 100 100 100 100 100 100 100 100 100 100 100 100 100 100 100 100 100 
100 100 100 100 100 100 100 100 100 100 100 100 100 100 
##$AQSEQ= 0
##$AQ_mod= 1
##$AUNM= <au_zg>
##$AUTOPOS= <>
##$BF1= 200.13
##$BF2= 200.13
##$BF3= 200.13
##$BF4= 200.13
##$BF5= 200.13
##$BF6= 200.13
##$BF7= 200.13
##$BF8= 200.13
##$BYTORDA= 1
##$CFDGTYP= 0
##$CFRGTYP= 5
##$CHEMSTR= <none>
##$CNST= (0..31)
1 1 145 1 1 1 1 1 1 1 1 1 1 1 1 1 1 1 1 1 1 1 1 1 1 1 1 1 1 1 1 1 
##$CPDPRG= <>
##$CPDPRG1= <>
##$CPDPRG2= <>
##$CPDPRG3= <>
##$CPDPRG4= <mlev>
##$CPDPRG5= <mlev>
##$CPDPRG6= <mlev>
##$CPDPRG7= <mlev>
##$CPDPRG8= <mlev>
##$CPDPRGB= <>
##$CPDPRGT= <>
##$D= (0..31)
0 1.2 0 0 0 0 0 0 0 0.06 0 0.03 0 0 0 0 0.0002 0 0 0 0 0 0 0 0 0 0 0 0 
0 0 0 
##$DATE= 1613110490
##$DBL= (0..7)
120 120 120 120 120 120 120 120 
##$DBP= (0..7)
150 150 150 150 150 150 150 150 
##$DBP07= 0
##$DBPNAM0= <>
##$DBPNAM1= <>
##$DBPNAM2= <>
##$DBPNAM3= <>
##$DBPNAM4= <>
##$DBPNAM5= <>
##$DBPNAM6= <>
##$DBPNAM7= <>
##$DBPOAL= (0..7)
0.5 0.5 0.5 0.5 0.5 0.5 0.5 0.5 
##$DBPOFFS= (0..7)
0 0 0 0 0 0 0 0 
##$DE= 6
##$DECBNUC= <off>
##$DECIM= 32
##$DECNUC= <off>
##$DECSTAT= 4
##$DIGMOD= 1
##$DIGTYP= 9
##$DL= (0..7)
0 120 120 120 120 120 120 120 
##$DP= (0..7)
150 150 150 150 150 150 150 150 
##$DP07= 0
##$DPNAME0= <>
##$DPNAME1= <>
##$DPNAME2= <>
##$DPNAME3= <>
##$DPNAME4= <>
##$DPNAME5= <>
##$DPNAME6= <>
##$DPNAME7= <>
##$DPOAL= (0..7)
0.5 0.5 0.5 0.5 0.5 0.5 0.5 0.5 
##$DPOFFS= (0..7)
0 0 0 0 0 0 0 0 
##$DQDMODE= 0
##$DR= 18
##$DS= 0
##$DSLIST= <SSSSSSSSSSSSSSS>
$$ [...]
##$SUBNAM2= <"">
##$SUBNAM3= <"">
##$SUBNAM4= <"">
##$SUBNAM5= <"">
##$SUBNAM6= <"">
##$SUBNAM7= <"">
##$SUBNAM8= <"">
##$SUBNAM9= <"">
##$SW= 16.9725356469052
##$SWIBOX= (0..15)
0 0 2 0 0 0 0 0 0 0 0 0 0 0 0 0 
##$SW_h= 3396.73913043478
##$TD= 16384
##$TD0= 1
##$TE= 0
##$TE2= 300
##$TE3= 300
##$TEG= 300
##$TL= (0..7)
0 120 120 120 120 120 120 120 
##$TP= (0..7)
150 150 150 150 150 150 150 150 
##$TP07= 0
##$TPNAME0= <>
##$TPNAME1= <>
##$TPNAME2= <>
##$TPNAME3= <>
##$TPNAME4= <>
##$TPNAME5= <>
##$TPNAME6= <>
##$TPNAME7= <>
##$TPOAL= (0..7)
0.5 0.5 0.5 0.5 0.5 0.5 0.5 0.5 
##$TPOFFS= (0..7)
0 0 0 0 0 0 0 0 
##$TUNHIN= 0
##$TUNHOUT= 0
##$TUNXOUT= 0
##$USERA1= <user>
##$USERA2= <user>
##$USERA3= <user>
##$USERA4= <user>
##$USERA5= <user>
##$V9= 5
##$VALIST= <valist>
##$VCLIST= <CCCCCCCCCCCCCCC>
##$VD= 0
##$VDLIST= <DDDDDDDDDDDDDDD>
##$VPLIST= <PPPPPPPPPPPPPPP>
##$VTLIST= <TTTTTTTTTTTTTTT>
##$WBST= 1024
##$WBSW= 4
##$XGAIN= (0..3)
0 0 0 0 
##$XL= 0
##$YL= 0
##$YMAX_a= 480232
##$YMIN_a= -530238
##$ZGOPTNS= <>
##$ZL1= 120
##$ZL2= 120
##$ZL3= 120
##$ZL4= 120
##$ABSF1= 10
##$ABSF2= 0
##$ABSG= 5
##$ABSL= 3
##$ALPHA= 0
##$AQORDER= 0
##$ASSFAC= 0
##$ASSFACI= 0
##$ASSFACX= 0
##$ASSWID= 0
##$AUNMP= <proc_1d>
##$AZFE= 0.1
##$AZFW= 0.1
##$BCFW= 1
##$BC_mod= 2
##$BYTORDP= 1
##$COROFFS= 0
##$CY= 11.3945322036743
##$DATMOD= 1
##$DC= 2
##$DFILT= <>
##$DTYPP= 0
##$F1P= 15.9154993809931
##$F2P= -4.1035820241983
##$FCOR= 0.5
##$FTSIZE= 0
##$FT_mod= 4
##$GAMMA= 1
##$GB= 0.15
##$INTBC= 1
##$INTSCL= 1
##$ISEN= 128
##$LB= 0.24
##$LEV0= 0
##$LPBIN= 0
##$MAXI= 10000
##$MC2= 0
##$MEAN= 0
##$ME_mod= 0
##$MI= 1.114404
##$NCOEF= 0
##$NC_proc= 0
##$NLEV= 6
##$NOISF1= 3.799351
##$NOISF2= 2.8
##$NSP= 1
##$NTH_PI= 0
##$NZP= 0
##$OFFSET= 15.70392
##$PC= 1
##$PHC0= -10919.61
##$PHC1= 15.20094
##$PH_mod= 1
##$PKNL= yes
##$PPARMOD= 0
##$PSCAL= 0
##$PSIGN= 0
##$REVERSE= no
##$SF= 200.130013532006
##$SI= 16384
##$SIGF1= 3
##$SIGF2= 2
##$SINO= 400
##$SIOLD= 16384
##$SREGLST= <1H.CDCl3>
##$SSB= 0
##$STSI= 0
##$STSR= 0
##$SW_p= 3612.71676300578
##$SYMM= 0
##$S_DEV= 0
##$TDeff= 0
##$TDoff= 0
##$TI= <>
##$TILT= no
##$TM1= 0
##$TM2= 0
##$TOPLEV= 0
##$USERP1= <user>
##$USERP2= <user>
##$USERP3= <user>
##$USERP4= <user>
##$USERP5= <user>
##$WDW= 1
##$XDIM= 8192
##$YMAX_p= 0
##$YMIN_p= 0
$$ End of Bruker specific parameters
$$ ---------------------------------
##NTUPLES= NMR FID
##VAR_NAME=  TIME,          FID/REAL,        FID/IMAG
##SYMBOL=    X,             R,               I
##VAR_TYPE=  INDEPENDENT,   DEPENDENT,       DEPENDENT
##VAR_FORM=  AFFN,          ASDF,            ASDF
##VAR_DIM=   8192,          8192,            8192
##UNITS=     SECONDS,       ARBITRARY UNITS, ARBITRARY UNITS
##FACTOR=    0.0002944,     1,               1
##FIRST=     0,             0,               0
##LAST=      2.4114304,     0,               0
##MIN=       0,             -530238,         0
##MAX=       2.4114304,     480232,          0
$$ Real data points
##PAGE= N=1
##DATA TABLE= (X++(R..R)), XYDATA
0@%%%%%%%%%%%%Mj2J6j6J6k0K8l2M0m8N2o2P4q8J01j17J36j53J73j98K22k48K81
$$ 0 0 0 0 0 0 0 0 0 0 0 0 0 4 -8 8 -8 8 -12 16 -16 24 -24 28 -34 40 -48 53 -64 72 -81 92 -106 116 -132 149
35A49l18L57l97M43m95N50o11O79p49Q25r12J006j109J221j343J480j632J801
$$ 149 -169 188 -209 234 -261 289 -322 357 -392 433 -479 527 -582 639 -704 776 -856 945
53I45j987K198k438K712l030L404l852M396n071N938p097Q724j1166J5210k3018
$$ 945 -1042 1156 -1282 1430 -1600 1804 -2048 2348 -2723 3215 -3882 4842 -6324 8886 -14132
68a4132M3135j83436l75805O20489L07919m92652k31101L16891J00273j21925
$$ -14132 29003 -154433 -530238 90251 398170 -94482 -325583 -8692 91581 -30344
78c0344L2760m4519j92149J93402L33733k78239m41192L32947N03417l24831m81205
$$ -30344 2416 -42103 -234252 -40850 292883 14644 -426548 -93601 409816 84985 -396220
89c96220L01172L92335k14702k31019J21337O3027r254J06769n5145k49523Q8673
$$ -396220 -95048 297287 82585 -148434 -27097 35930 26676 133445 78300 -171223 -82550
100h2550L69776q9879m45358P6468M57251o1632m10826L9921K95555l5461j50430
$$ -82550 287226 197347 -248011 -171543 285708 224076 -186750 -146829 148726 113265 -37165
111c7165K1518k7490k1420J67418J4235k73776l9210L21112O6435l39146r4945
$$ -37165 -15647 -43137 -64557 102861 117096 -156680 -195890 125222 191657 -147489 -242434
122b42434L13010R4556k51073o7296J57754K5601m3961L2490o2455p8337J59297
$$ -242434 70576 165132 -85941 -153237 4517 30118 -13843 18647 -43808 -122145 37152
133C7152J22009k07873j35444K23040J53163j93429j46745J59667J25278j08986
$$ 37152 159161 -48712 -184156 38884 192047 -1382 -148127 11540 136818 27832
143B7832p1876N8913J717j800P0076n1646j31169Q7850J65003j11640j77633J04534
$$ 27832 -44044 14869 16586 14786 84862 33216 -97953 -10103 154900 43260 -134373 -29839
155b9839J57177q7674j29412N2888Q2436l3320l4437J6004l0454j0517Q8724r81
$$ -29839 127338 39664 -89748 -36860 45576 12256 -22181 -6177 -36631 -47148 41576 40595
167D0595j34962J1746J54862j9949j47009K5098J21634k2349p7242K2438L7189
$$ 40595 -94367 -82621 72241 52292 -94717 -69619 52015 29666 -47576 -25138 12051
178A2051j7429O122K7211l7966l4663P3849M3850r4497l8317J07654K5215r7626
$$ 12051 -5378 744 27955 -10011 -44674 29175 73025 -21472 -59789 47865 73080 -24546
190b4546p220P4911j0174m5836K2825J4905l4872P796L9861k7716m8829L6880
$$ -24546 -31766 43145 32971 -12865 9960 24865 -10007 -2211 37650 9934 -38895 -2015
202b015M8964n0532m7810N6618K9745o1497p988N1686j5394l9784L2225K3809
$$ -2015 46949 -3583 -51393 5225 34970 -26527 -34515 17171 1777 -38007 -5782 18027
214A8027m0629q895M3280j49m0266J2013L6096j9306k7596L3652J8735m3143j595
$$ 18027 -22602 -31497 11783 11634 -28632 -16619 19477 171 -27425 6227 24962 -18181 -19776
227a9776N2184j2325m8706K5508M0232k7909k6257K5831J2014k0214K570J3802
$$ -19776 32408 20083 -28623 -3115 37117 9208 -17049 8782 20796 582 3152 16954
239A6954j7908j0869L1035P347m5700o882N3117J728n5618J241M4535n473k8083
$$ 16954 -954 -11823 19212 26559 -19141 -26023 27094 28822 -26796 -25555 18980 13507 -14576
252a4576L933O979m095J1288M905k7312r326L9326J5722m5794k0737M8003K4271
$$ -14576 -10643 -3664 -7759 3529 8434 -18878 -28204 11122 26844 -18950 -39687 8316 32587
265C2587m2242k0626L1504J4848j2291m648o501l409K4353J3398l4015k1831L8135
$$ 32587 -9655 -30281 1223 16071 3780 -868 -7369 -10778 13575 26973 -7042 -28873 9262
278I262L0522l5376l6225K8708L6025j9551k9667O920J6573M720k31j8138j6697
$$ 9262 39784 4408 -31817 -3109 32916 13365 -16302 -9382 7191 11911 11680 -6458 -23155
291b3155K5815K9052k8437l8850K3064M2047j4724m0995L894L3796M751k0693
$$ -23155 2660 31712 3275 -35575 -12511 29536 14812 -26183 -22289 11507 16258 -4435
303d435j1248L657J5540J4314j5604k9693J3716M0852q526m3269J218M0215P491
$$ -4435 -15683 -12026 3514 17828 2224 -27469 -13753 27099 18573 -24696 -23478 16737 24228
316B4228k9992j4271J7465J7285j399j5265j2742R283K6655k552l5954o023L8947
$$ 24228 -5764 -20035 -2570 14715 13316 -1949 -14691 -5408 21247 18695 -17259 -23282 15665
329A5665J2959l5440j8553K5568K0835j2715k0215j918J5450J4187p645k3846
$$ 15665 28624 -6816 -25369 199 21034 8319 -11896 -13814 1636 15823 8178 -15668
341a5668k974K8908J3745l0065k1897K6029K6164j8354k5489P393K1183M159j2846
$$ -15668 -18642 10266 24011 -6054 -27951 -1922 24242 5888 -19601 -12208 8975 13134 288
354B88j4390M279J9932P126k2217j6638K0685K4360j5614k7364Q069K6526j351
$$ 288 -14102 -9823 10109 17235 -4982 -21620 -935 23425 7811 -19553 -11484 15042 13691
367A3691j9978o251J1459J2154j967j5347r198J7061J6861j3567k2480P178K5979
$$ 13691 -6287 -12538 -1079 11075 9108 -6239 -15437 1624 18485 4918 -17562 -10384 15595
380A5595k236k3536m277J8155R807j0814j2328R18J2527Q338j0206j5801O479
$$ 15595 13359 -10177 -14454 3701 13508 2694 -9634 -8716 3811 12149 1943 -13858 -7379
393g379J9937j163k1428l419J9190P773j4095j0072P082J0801p62q976n942N681
$$ -7379 12558 11395 -10033 -13452 5738 13511 -584 -10656 -3574 7227 6465 -2511 -8453 -2772
407b772J1975j439j5427l255J5904O394j3697q944R726J0160m079r385r67O515
$$ -2772 9203 7764 -7663 -10918 4986 11380 -2317 -11261 -1535 8625 4546 -4839 -5806 709
421G09M888k946p600j835J0518N182j0572p691Q625R208n311r301K317P437P37
$$ 709 5597 2651 -4949 -6784 3734 8916 -1656 -9347 -722 8486 3175 -6126 -3809 3628 4365
436D365m010m008P74N387L147o104n702N056P559l778q586K480P197m59n537r36
$$ 4365 355 -3653 -2879 2508 5655 -449 -6151 -1095 6464 2686 -5900 -3420 3777 3318 -2219 -3155
452c155K738K112J47k466l183K605M389j397n652L67O807n75n012p56L934J129
$$ -3155 -417 1695 1842 -624 -3807 -1202 3187 1790 -3862 -3495 3312 2737 -2275 -3031 903 2032
468B032j846r58P8N40J979n26k973m65M045J175m030j524L612J740k722j328J561
$$ 2032 186 -772 -694 -154 1825 1299 -1674 -2139 1906 3081 -949 -2473 1139 2879 157 -1171 390
485C90l88R9Q99p96j770K446J85j823r02K269J443k474j419K440m96q62k25R41
$$ 390 2 101 1000 204 -1566 880 1065 -758 -1660 609 2052 -422 -1841 599 103 -759 -984 -43
503d3k1p47J426Ok336J349K022j222r72P00P64j195L14j85K09l63P4K323j668
$$ -43 -64 -811 615 621 -1715 -366 1656 434 -538 162 926 -269 45 -140 69 -294 -220 2103 435
522D35o95L65N82o65l70J537j34j854J169l80J08r85J975k84j690L57P73m55p47
$$ 435 -260 105 687 22 -348 1189 1055 -799 370 -10 98 -887 1088 804 -886 -529 244 -211 -958
541i58K34J139n73o64M87k40j22J084O3j957l14K592j22j379l18J463O23j059
$$ -958 -724 415 -158 -822 -335 -575 -697 387 450 -1507 -1821 771 649 -730 -1048 415 1038 -21
559b1q28J147j69L13M36j807k61K589l9j514q55J001J629j121j000j13J249k69
$$ -21 -849 298 129 442 878 -929 -1190 1399 1360 -154 -1009 -8 1621 500 -500 -613 636 367
577C67n25n86L74P14K05j297p13J649J011j062j736J230M61K44j656L47R29L04
$$ 367 -158 -744 -370 344 549 -748 -1461 188 1199 137 -1599 -369 92 336 -1320 -973 -44 260
595B60Q6p11m20Q01J465j585r84Q43J346m17j460o3J382P6m78p45O05L63P70o92
$$ 260 346 -365 -785 16 1481 -104 -1088 -245 1101 684 -776 -839 543 619 141 -604 1 364 1134 442
615D42j290P27J249l77j545j5J485J6r86l10M08M24J41l57o71J24J293l22j037
$$ 442 -848 -121 1128 751 -794 -809 676 692 -294 -604 -196 228 369 12 -659 -535 758 436 -601
634f01k92J291L50j070m85N10P71l74m56k28O24P06l89p36k39R89L42r48n95J046
$$ -601 -893 398 748 -322 -807 -297 474 100 -356 -584 40 746 357 -379 -618 371 713 -235 -830 216
654B16P28p41n97J67N48Q5k40m33R2N19L44o67o64N55P95n39p89L46O25j15m10
$$ 216 944 203 -394 -227 321 406 166 -267 -175 344 688 21 -643 -88 707 168 -621 -275 350 235 -175
675a75j41J75L39Q8m38l54L11N83j38q21K94O13q2n02j5L58L7r5j51o0J97K37
$$ -175 -316 -141 198 286 -152 -506 -195 388 250 -571 -277 336 254 -248 -263 95 132 37 -114 -174 23 260
697B60p1m81J13O08j06n23NM28K3k44p7P8L4J07r1k25Q6K66M0m88O4L62Q9l65
$$ 260 189 -292 -179 429 323 -200 -195 233 256 12 -65 13 47 154 63 -162 -76 190 230 -258 -194 168 257 -108
721a08r4K55oj42m8O6p2J59J58l00q0J50K56k12k26L52J27k78n0J17m4J2O3m9
$$ -108 -202 53 47 -95 -143 -77 -149 10 168 -132 -212 -62 194 -18 -244 108 235 -43 -93 24 -20 -8 55 6
745Fm0M0J38j14j44K3L20k22j65J93K1Kp3J67j64n7R0J3j36j0K68j38r0J6R8K0
$$ 6 -34 6 144 30 -114 -91 229 7 -158 35 56 58 -15 152 -12 -69 21 34 -102 -112 156 18 -72 -56 42 62
771F2k53K47P3j83k7O2O2p5J29J3j90j4M3J56j72J23l3M1K5k9j5l7q7N7J01j42
$$ 62 -191 56 129 -54 -81 -19 43 -32 97 110 -80 -94 -51 105 -67 56 23 64 89 60 45 8 -79 -22 79 -63
797f3O6J84k22J38j26R9mj13k0JJ72K3j7k90K71l0j14JJ75j4K5k06J1PK43n55
$$ -63 3 187 -35 103 -23 76 72 -41 -61 -60 112 135 118 -172 99 69 -45 -44 131 117 142 -64 -53 -46 197 -358
823c58K51k39O56j68p1l7n8ML14j98K69l01K3q7o9J87k07K86n68P29n50L34L68
$$ -358 -107 -346 310 142 71 34 -24 -20 294 96 365 64 87 0 -69 118 -89 197 -371 358 -192 142 510
846E10k75M14l75J84k20k38l92N59K49J97m00j61m1P84r44J28P5K9j61N2Q0kj13
$$ 510 235 649 274 458 238 0 -392 167 416 613 213 52 11 795 -149 -21 54 83 -78 -26 54 52 -61
869f1N0P9r2P8o0N2r2L3OL1o9j1R3K8j71J23pO1r7oP9j26J52o5Kk2p9J25m4J5
$$ -61 -11 68 -24 54 -6 46 -46 -13 -7 24 -45 -56 37 65 -106 17 10 71 -26 -32 47 -79 73 8 10 -12 -91 34 -10 5
899EO1M0j20J0Q3j34P9k4o3NK0Q0p1N3m7P9j28O1M9l1p0j4R3j02k0J29p2O4L3
$$ 5 66 106 -14 -4 79 -55 24 0 -63 -58 -38 42 -29 24 -23 56 -72 -11 38 7 -63 -77 16 -86 -106 23 -49 15 48
928D8r6N2L6l5m2J07j40J25m0j8Ml7Q7j20N5J0o1N4O3p3j3O9m1j22R2L6m5J2q4
$$ 48 -48 4 40 5 -37 70 -70 55 15 -3 1 -36 51 -69 -14 -4 -65 -11 52 -21 -34 35 -6 -128 -36 0 -45 -33 -117
957a17Q8rn7N4j8P6K1m6J00j73J5M3k7q6J71k3k7J1m3M2K5Q5k07N2Q8L8j33j4
$$ -117 -29 -38 -95 -41 -59 17 38 -8 92 -81 -66 -23 -50 -136 35 12 -15 -4 -47 -5 20 105 -102 -50 38 76 -57 -71
985g1R4R1j72N2k4K7J9r1P3L1k2l7k0pN0J8K9p9mO4N6r9oL0l7N2k4J0L5J9K0m3
$$ -71 23 114 -58 -6 -30 -3 16 -75 -2 29 7 -30 -50 -57 -7 11 40 -39 -43 21 77 -22 -28 2 -35 17 -7 3 38 57 77 34
1017C4k1J4n1l9O4o0O5j23J23o0q5J24J3N4j52J38n6l5O4O5q7M1M8j28N6K1n1
$$ 34 13 27 -24 -63 1 -59 6 -117 6 -54 -139 -15 -2 52 -100 38 -18 -53 11 76 -11 30 78 -50 6 27 -24
1044b4m1J25P5j41N9j65J28j29J55l0Rmkq1L4l1J15n9m2P1r2N2L7p0OK36j23O8
$$ -24 -65 60 135 -6 53 -112 16 -113 42 12 21 17 15 -66 -32 -63 52 -7 -49 22 -70 -18 19 -51 -45 191 68 136
1072A36n9r3O3L2j77K51K00m46L9L47k80l72o8J75j31O27m24J84n42O50l38L3
$$ 136 77 -16 47 79 -98 153 353 -93 -54 293 13 -359 -427 -252 -383 244 -180 4 -538 112 -226 -193
1094a93N08J47k63j2N13r24o8O17q44O83j50N4j35M1J00R2l5l2j05l1n0qP5L9
$$ -193 315 462 199 187 700 -224 -292 325 -519 164 14 68 -67 -26 74 166 131 99 -6 -37 -87 -95 -20 19
1118A9N5n1q8LM7L8p6O0m5j37K79j74K4L5J02q5N3r1L3n5N0p6Q3p6N5O7k7o7N9
$$ 19 74 23 -65 -62 -15 23 -53 7 -38 -175 104 -70 -46 -11 91 6 59 -32 1 -54 -4 -80 3 -73 -18 49 22 -45 14
1147A4q5M3Q0n61M56M30r00R44l25m4J38l65J81L26k26l24J45M74n59K14J09n02
$$ 14 -71 -28 52 -509 -53 377 -523 421 96 52 190 -175 6 332 106 -218 -73 401 -158 56 165 -337
1169c37N13j04qq8k73P4N06K08m85J27l8j75L67k18m46O42k23N4q5j47Q1j25o3
$$ -337 176 72 64 -24 -297 -223 283 491 6 133 95 -80 287 69 -377 265 42 96 11 -136 -55 -180 -243
1192b43k7J29R8l5k2R9j48j42Q9K62k09J16j7j50J38L2j46J66J78k34K1L4J7J03
$$ -243 -270 -141 -43 -78 -100 -1 -149 -291 -202 60 -149 -33 -50 -200 -62 -30 -176 -10 168 -66 -45 -11 6 109
1216A09j39o6m2k23M08m06K61N5K5o6K35k45J27R0k31J17j38J67Mmn8j7M9L3j08
$$ 109 -30 -96 -138 -361 47 -359 -98 -43 -18 -84 151 -94 33 123 -108 9 -129 38 42 38 -20 -37 12 45 -63
1241f3j16J79o9R3P1l14K31j99J54M6j11J23L64n67L90L01q05L70m06p4O29k53
$$ -63 -179 0 -69 24 95 -219 12 -187 -33 13 -98 25 389 -178 212 513 -292 78 -328 -402 227 -26
1263b6k7O8R2J7j13k52o1M78j19k3M0l31j61L35J61j77L05P7m65K37J84l91L38
$$ -26 -53 15 107 124 11 -241 -302 176 57 34 74 -257 -418 -83 78 -99 206 283 -182 55 239 -152 186
1286A86l00J40M1j89M64m46K14k70O04j023N42p2k21M62p44R84j67o40M60j75
$$ 186 -114 26 67 -122 342 -104 110 -160 444 -579 -37 -109 -330 132 -612 372 205 -435 25 -150
1306a50M46j38n6q1J15k05Q6l7j28K35j03j35K20j15J51k55Q9j3L74m15N48j96
$$ -150 296 158 102 21 136 -69 17 -20 -148 87 -16 -151 69 -46 105 -150 -61 -74 300 -115 433 237
1328B37l53P1J43J92j14l22J86l55N06l19J15k0K8j1J6J6r8Q5N7m3p1r0Q5L2l2
$$ 237 -116 -45 98 290 176 -146 40 -315 191 -128 -13 -33 -5 -16 0 16 -82 3 60 17 -54 -144 -59 -27 -59
1353e9P5q8P7o4O3K7N2j01l8J07n9M7j08P6Lj2O8l6m6m6KJ39j8o0L4m1l3K8K2
$$ -59 16 -72 5 -59 4 31 83 -18 -56 51 -8 39 -69 7 10 -2 66 30 -16 -62 -60 79 61 1 35 -6 -39 -11 11
1382A1r9J13m6l9n5J55KM8p5k1j0l0N7j36J37lo1J27j19O8k9K8m6N0p4M7M5p5
$$ 11 -88 25 -21 -60 -115 40 42 90 15 -6 -16 -46 11 -125 12 9 -52 75 -44 24 -5 23 -23 27 -47 0 45 -30
1410c0RQ5m3n7O2q3J32j20J6R1k9r1J04j06O5qj2P1l3j9n5Q6o7K9n9R4N9j26L6
$$ -30 -21 64 21 -36 26 -57 75 -45 -29 62 33 -58 46 -60 5 -3 -15 56 23 4 -51 35 -32 -3 -62 32 91 -35 1
1439Ap1J5L7L4k6K5L0q6J20k24P3RQ0m6J02r9J28n6n1R0n7j7pL0Jj08k4J8R1k6
$$ 1 -70 -55 -18 16 -10 15 45 -41 79 -145 -72 -63 17 -29 73 -26 102 46 -5 85 28 11 4 34 35 -73 -97 -79 12 -14
1469a4n2J40j14P3p6J43r3l5j4J11j45J67j4K7oK3j67P2m8mj4M2m0L2j03J10o
$$ -14 -66 74 -40 33 -43 100 7 -28 -42 69 -76 91 77 104 98 121 -46 26 -22 -26 -40 2 -38 -6 -109 1 -5
1496ej8l5K3L3j23J53j9p3L7K3K8rj3l9KLR9q9l5Q3n5J0l8N4Ml6J02j2k5m9K1
$$ -5 -23 -58 -35 -2 -125 28 9 -64 -27 -4 24 15 2 -37 -35 -32 67 -22 -57 26 -29 -19 -57 -3 1 -35 67 55 30 -19 2
1527BJ4o9J08k8qJ6j36K0Q4r3P0j1J4M1J7q2J02k2m7o6R9kn0MK0o3K9K3N9L8j29
$$ 2 16 -53 55 27 19 35 -101 -81 3 -90 -20 -31 -17 24 41 -41 61 39 -8 -74 25 23 -27 -23 -3 -66 -37 -14 45 83 -46
1558d6J56j20K2n8M7o3M3mj07J35Lk2J49j07l7Kl0K4R9j17%j14O0P6o1L8nQ3k8
$$ -46 110 -10 12 -46 1 -62 -19 -23 -130 5 8 -14 135 28 -9 -7 -37 -13 86 -31 -31 -145 -85 -9 -70 -32 -37 46 18
1587A8l6q0J44q6N0J2O1j51M5l4R4m2k0j9k3k2jJ01j6n9R4k5N5n5K2l6p8Q5N5
$$ 18 -18 -98 46 -40 10 22 83 -68 -23 -57 37 -5 -25 -44 -67 -89 -90 11 -5 -64 30 5 60 5 27 -9 -87 -2 53
1616E3n5K2O1j18J31q1l6lm5Q1J6n8M8rK5k6L0lJ9q9P9o8J07r1k9O8Kk2L0l4L7
$$ 53 -2 20 81 -37 94 13 -23 -26 -71 10 26 -32 16 7 32 6 36 33 52 -37 42 -26 81 -10 -39 29 31 9 39 5 42
1647D2q0J02j3q2L1JR0n9j23J43k4r1N2n8kK6N3M1o5J7L4n1n2M5j2M8j1K0m1O
$$ 42 -38 64 51 -31 0 1 91 32 -91 52 28 -63 -11 -69 -71 -45 8 49 -16 1 35 -16 -68 -23 -35 13 2 22 -19 -13
1677a3%j1R3j06K3J30m3rj08M9PNm1J22m5Kk6p3k7o8R9m8J12k1L1j20J49j26J14
$$ -13 -13 -24 69 -37 -14 116 73 64 -44 5 12 17 -24 98 53 55 29 -44 -71 -139 -40 -88 24 3 34 -86 63 -63 51
1706E1o9Km2QJ19k8q0k5J07j3r0M1j0Kmk1J24j00kK2J8l1L0KpN5q8o0J09j14N5
$$ 51 -18 -16 -58 -50 69 41 -39 -64 43 30 -60 -19 -29 -27 -31 -52 72 -28 -30 -8 10 -21 9 11 4 59 -29 -89 20 -94 -39
1737c9L9%M1o3N5k9j7l5J25n0L0k5r6J18J1j28Q9p5L2j4J3L1j8J2k0l7K3J35j47
$$ -39 0 0 41 -22 33 4 -13 -48 77 27 57 32 -64 54 65 -63 26 -49 -17 -31 -18 13 -5 7 -13 -50 -27 108 -39
1766c9O1r9O5M4j4n5k1Q2q9P6Nm1R9q6N3j6l9M5k7q6J02j16P5n2N9j5Q9j10J03
$$ -39 22 -77 -12 32 18 -37 -58 24 -65 11 16 -25 74 -12 41 25 -14 31 4 -82 20 -96 -21 -73 -14 -29 60 -50 53
1795E3j12LO7j8n7K33l08J03%J13m6l9M5l5o4J09r9N9J4k7Jn7J01R0k61kJ49o
$$ 53 -59 -56 11 -7 -64 169 -139 -36 -36 77 31 -8 37 2 -62 47 -52 7 21 -6 -5 -62 39 129 -132 -134 15 9
1823Ij0OK2k1o8N7j8J06k4q3PkK1L0j22J61j0p8P5k3k3r0J73j04Q4m5L2j70J94
$$ 9 -1 5 27 6 -62 -5 -23 83 59 -24 -17 -19 2 32 -90 71 61 -17 58 35 12 -78 95 -9 75 30 62 -108 86
1852H6m7k9M7r5K5O7k0q6M0Rm8P9n0O0l9j01J21n4N1J5o4%L7k9J2J1L2k8p1K5
$$ 86 39 10 57 -38 -13 54 34 -52 -12 -3 -51 28 -22 38 -1 -102 19 -35 16 31 -33 -33 4 -25 -13 -2 30 2 -69 -44
1882d4J15n3j9K5k4J9r5L2Q6n7q0J30j8k0k1M5J6m2%m0N8oK1M5j34J7L7O9n4j6
$$ -44 71 18 -1 24 0 19 -76 -44 42 -15 -95 35 17 -3 -24 21 37 -5 -5 -45 13 7 28 73 -61 -44 -7 62 8 -8
1912hN9j6r3J1K9K8k9N5J22k16J8O9Q5j77M0P9j26J09q1L4MM1l6Q1l5J0n9M4m
$$ -8 51 35 -58 -47 -18 10 -19 36 158 -58 -40 29 114 -63 -23 56 -70 39 -42 -8 -4 37 1 82 47 57 -2 42 38
1941C8j09M8J0K5p8J53n2j7k1O7m9n0jR0j2l1O5n0oNq8N3j6Q8JqN7r8No1O5n1
$$ 38 -71 -23 -13 12 -66 87 35 18 -3 64 15 -35 -36 54 42 11 76 26 20 25 -63 -10 -26 62 63 55 112 14 19 -42 23 -28
1973b8P8k6%J8j2m7J0k8J7R3q5N3m4rmj18J19kK7l9J23J8j64O4%q5L8K8l2O2n8
$$ -28 50 24 24 42 30 -17 -7 -35 -18 75 -10 43 -1 -10 -14 -132 -13 -15 12 -27 96 114 -50 14 14 -71 -33 -5 -37 25 -33
2004c3M8oqk5J3Q5l6K7j11O4O5j53M8r1O1M7%N3j87K4J72J6n8n3j7Q8K8j64Q1
$$ -33 15 9 1 -24 -11 74 38 65 -46 18 83 -70 -22 -113 -52 -5 -5 48 -139 -115 57 73 15 -38 -55 33 61 -103 -22
2033b2k0M6j2J0O4q6N9j64R0k4N9J82j7k23j00J56k1M1j9J5L4L2K0M4l89L50q7
$$ -22 -42 4 -8 2 66 -20 39 -125 -35 -59 0 182 165 -58 -158 -2 -23 18 -1 14 48 80 100 144 -245 105 18
2060A8j19J49N5J23l32m1K94l39P2K37j63p6J43P1j02J05M9j36q6Q2k49K41n7
$$ 18 -101 48 103 226 -106 -147 147 -192 -120 117 -46 -122 21 92 -10 95 144 8 -78 4 -245 -4 -61
2083f1j7m0J42k1p0R4M6J1L5M6l15M2j09K64j07L0J14k09J80j77J28k06J83o6
$$ -61 -78 -118 24 3 -67 27 73 84 119 165 -150 -108 -217 47 -60 -30 84 -125 55 -122 6 -200 -17 -83
2107h3K64j01o2J16j56R1l0K4j62K33o3K51l04k77M7J66N2j36K09l64J71L85k88
$$ -83 181 80 18 134 -22 69 39 63 -99 134 71 322 18 -259 -212 -46 6 -130 79 -285 -114 271 -17
2130a7L85k61J30l59K19j72j93L74k82j5q2j42M25M2J32k76J84J73l26L65m22
$$ -17 368 107 237 -122 97 -75 -268 106 -176 -191 -273 -415 10 52 184 -92 92 265 -61 304 -118
2151a18l92M00J85m19N74n1P5n91R2P2j09K95m1M50m13l2j92J58K49l1l09K40
$$ -118 -510 -110 75 -344 230 179 254 -337 -245 -173 -282 13 -28 422 9 -23 -215 -57 192 161 -148 92
2173I2k72M30j26p8n8K1l5O3Q1k17J41m1o2J79j30n7N3J27j98O7j21k9J08Q0P9
$$ 92 -180 250 124 46 -12 9 -26 37 118 -99 42 1 -61 118 -12 -69 -16 111 -87 -20 -141 -170 -62 18 97
2198I7r3lJ21j04M5q9K28k75J71q3N2Q2j75m3O6K41n10r0l56N49J72pj18K05j2
$$ 97 4 1 122 18 63 -26 202 -73 98 15 67 149 -26 -69 -3 238 -272 -362 -718 -169 3 -4 -122 83 71
2223G1l34K32L48l15l77O26j53q28O04L93K3k83L38k48j25J96k47NQ4q9j22J84
$$ 71 -263 -31 317 2 -375 251 98 -730 -126 267 290 7 345 97 -28 168 -79 -74 10 -79 -201 -17
2245a7J5N7j26J39M6p2K4J5p6J8p8R0qo8OM9j05J40j0m0Q7j25j54o3L57q2J04
$$ -17 -2 55 -71 68 114 42 66 81 5 23 -55 35 27 -41 -35 14 -91 49 39 -1 86 -39 -193 -256 101 19 123
2272A23j75LP1j1O3j2r8M1q2J45o2q8P0P1j21Q5j12J00l0mJ41j93J28rpK2j98
$$ 123 -52 -49 22 11 74 62 -36 5 -77 68 6 -82 -12 59 -62 23 -89 11 -19 -23 118 -75 53 44 37 59 -139
2299a39J04n0k18O37n65K1L42j69L16K26o04N32j93N5p74j45K16M83o1p27N64
$$ -139 -35 -85 -303 334 -231 -210 132 -37 279 505 -99 433 240 295 -479 -624 -408 75 14 -713 -149
2320a49l55Q73p68L89K73m95m8J08j6N00l06L66l15K16n47N92k05l04l7j30l8
$$ -149 -504 369 -399 -10 263 -232 -280 -172 -188 312 6 372 57 273 -274 318 113 -191 -228 -358 -396
2341c96M2Q07m48K74j31j77o4l77O70m3r5N4J0l27J84M7o5J89l37L06N5k69J89
$$ -396 -354 453 5 279 148 -29 -93 -470 200 157 62 116 126 -201 -17 30 -35 154 -183 123 178 -91 98
2364I8J53r9Q5j87p1k64P6L77j96o7J0K01p9j7J3J09k13J4R2J3r2m7R9K4J6j18
$$ 98 251 152 237 50 -21 -285 -209 168 -28 -95 -85 116 37 20 33 142 -71 -57 35 48 -44 -91 8 32 48 -70
2390g0L4p7J20n5J72n4o2K2o8N6nl4Q4r7ko1J07R3j09N3j4m4l1M0m2J0j18K16
$$ -70 -36 -113 7 -48 124 70 8 30 -38 18 13 -21 63 -34 -36 -97 10 103 -6 47 33 -11 -42 -2 -44 -34 -152 64
2418F4k3qo5r5J22J66Mq5j30j83J07J85j24J14j70K19j00J54q1j91K48m65N75
$$ 64 41 33 -32 -127 -5 161 165 80 -50 -233 -126 59 -65 49 -121 98 -2 152 71 -120 128 -337 238
2441B38j68j31o2O1n6N2J21J24l44N09n23K0J01j50nL11k12k9j30j21L06J47l49
$$ 238 70 -61 -123 -62 -118 -66 55 179 -165 344 -179 -159 -58 -208 -213 98 -114 -143 -273 -394 -88 59 -290
2464b90J77M85m26K57m72M1J57Po2J89n0J96k14k2K96L7k98k5l94K35r2K07M03
$$ -290 -113 372 -54 203 -269 -228 -71 -64 -126 63 13 209 -5 -27 269 306 8 -17 -411 -176 -268 -61 342
2487C42l58J8J25j39N6m3j04J08j03qK05j07O7j91lJ05K24k75J45n1l07N60k49
$$ 342 -16 2 127 -12 44 1 -103 5 -98 -106 99 -8 59 -132 -135 -30 194 -81 64 13 -294 266 17
2510A7j59M3J10p0j41J95R4j52nP7m0j10J0J10p2K1p8J71l4j7M9QPo8L9p5K9J74
$$ 17 -142 -99 11 -59 -200 -5 89 -63 -68 9 -31 -141 -131 -21 -93 -72 -150 21 -13 -30 19 27 34 -34 5 -70 -41 133
2538A33j59N7j08Q0m0N1o4M5N4k9k7M9p5l1PK9l6L0mP0j02Q0Ol7L7q4O1L7j1o7
$$ 133 -26 31 -77 3 -37 14 -50 -5 49 20 -7 42 -33 -64 -57 -28 -64 -34 -38 32 -70 10 16 -21 16 -68 -7 30 19 -48
2568d8J4R6j16M7R8j00m9k1J38j62J06P6p4o2R3j16M0J06o1p6M9J1Rl8N0N2q5
$$ -48 -34 62 -54 -7 91 -9 -58 -79 59 -103 3 79 5 -57 36 -80 -40 66 5 -71 -22 -11 -2 -40 10 62 -23
2595b3k9Q1k6loK2PK4l3J5K5m9ok1J6O6p7k1LQ5n9J2K8j0k7Q7r7K0j4OP8j04l4
$$ -23 -52 29 3 0 -6 16 23 47 14 29 54 5 -1 -22 -6 60 -17 -38 -35 50 -9 3 31 21 -6 81 -16 4 -10 -4 74 -30 -64
2628f4J03l4J7%L1q9M2N5n6j07J52j69J68q5K8k3M6j3ppQ6%r0J04j69R9k8K6j1
$$ -64 39 5 22 22 53 -36 6 61 5 -102 50 -119 49 -36 -8 -31 15 2 -5 -12 74 74 -16 88 -81 18 -10 16 5
2657Ej7J01l0qp2p4J08q5J4J36j09mJ9J7N9p6N4L4j91K17j09k1N4J7j8k9lk2O9
$$ 5 -12 89 59 51 -21 -95 13 -72 -58 78 -31 -35 -16 1 60 -16 38 72 -119 98 -11 -32 22 39 21 -8 -11 -33 36
2686C6r7J37j49K14j98P0j3j26O3n2J11p2K8P3r0L9l3l2J61j52J52r8R1m8K3j4
$$ 36 -61 76 -73 141 -57 13 0 -126 -63 -115 -4 -76 -48 25 -65 -26 -59 -91 70 -82 70 -28 63 15 38 24
2712B4oJL1j45J14L7J3j40R6Q5j32o2J45l3q8M3j2j3J22p7Qo5l5J28p3L6rk9k9
$$ 24 18 19 50 -95 19 56 69 -71 25 110 -22 -84 61 28 -60 -17 -29 -42 80 3 11 -54 -89 39 -34 2 -7 -36 -65
2741f5J63r2r5J90M2j82l4M0P2j08M9Q0r2j00J38J2KM6n3R0p9J4n7Q1q8Q9l4L7
$$ -65 98 6 -89 101 143 -39 -73 -33 39 -69 -20 60 -32 -132 6 18 20 66 13 103 24 38 -19 62 -26 63 29 66
2769F6jj27R8j32J2J00k7N6j7j8M2j8n8O6Ml9j0NJ7M8M8o8l9k6M8m7O2o7J7J1
$$ 66 65 -62 36 -96 -84 16 -11 45 28 10 52 34 -24 42 46 7 -3 2 19 67 115 47 8 -18 30 -17 45 -22 -5 6
2799FJ17j17LM3j22J25N3j11J9RJ7o4R4p7M8L7k7l8M5o2O9j02J2N0qn7J9N5p6
$$ 6 123 6 9 52 -70 55 108 -3 16 25 42 -22 72 -5 43 80 53 15 60 -2 67 -35 -23 27 19 -38 -19 36 -40
2828d0R8j6m1Pj7Q3j10M6l8J26q0K6j0l5K0N8k7q0mj0J18q6O1j16Q7j01O7j7J06
$$ -40 58 42 1 8 -9 74 -36 10 -28 98 18 44 34 -1 19 77 50 -30 -34 -44 74 -12 49 -67 20 -81 -14 -31 75
2857G5k2p0J21m1k1o3O9K1r8k7J2R6j04P0mp0K4Q7l1n8J20k5r5K4j32J56p8J41
$$ 75 53 -17 104 63 42 -21 48 69 -29 -56 -44 52 -52 18 14 -56 -32 55 24 -34 86 61 -34 -10 -142 14 -64 77
2885G7rk84K32j70J90lK64k28j16J6r6R0k6J04J74p65P95m95M68l3P16q61j126
$$ 77 68 -216 16 -154 36 33 297 69 -47 -31 -127 -37 -63 41 215 -550 245 -250 218 185 901 40 -1086
2908a086N53P63J92n54J80P8l66K55j25M19k87K79k41k7Mr8q%J8K1K5Kj3o8P3
$$ -1086 -533 230 422 -132 48 126 -240 15 -110 309 22 301 60 33 37 -61 -69 -69 -51 -30 -5 -3 -16 -84 -11
2933a1l0R5J0n0k5KJ2P6j19R7m0QM2oNo0K4n7J01Nn4K3j18M8J03p0o2P0j6L2o0
$$ -11 -41 54 64 14 -11 -9 3 79 -40 57 17 25 67 61 66 6 30 -27 74 79 25 48 -70 -22 81 11 -51 19 3 35 -25
2964b5N6Nm7k8Q8L2P1k09j09J78j48N1k6K01l02K18o3R2j86p6j98L75K58k65K93
$$ -25 31 36 -11 -39 49 81 152 -57 -166 12 -136 -85 -111 90 -212 6 -57 35 -151 -227 -425 -50 208 -57 236
2989B36j4j43N8K03Q8k67k23pl1J06p26J220r32O64j10n80L76R0K08p0k00J24
$$ 236 222 79 137 340 428 161 -62 -69 -100 6 -720 500 -432 232 122 -458 -82 8 216 146 -54 70
3011G0j17m5M1Q0rmr9L3J13j34k5Q4k7P8m6K2PK9L2r0Q2K1j29J18m3r7PN8P5j25
$$ 70 -47 -92 -51 29 20 16 -83 -50 63 -71 -96 -12 -39 39 -7 15 22 51 83 -7 75 96 -33 85 42 -55 -48 10 85 -40
3041d0Qp6N7J25o0l1J48k5j54Q2nk2LJJ9L8j3kj1K5K0j26k8Q0r0J61j8n5k3L0
$$ -40 -32 -108 -51 74 14 -17 131 106 -48 34 29 7 10 11 30 68 55 53 42 67 87 -39 -67 13 -77 84 66 11 -12 18
3071A8l5m4MO1NJ4n9jM3p9j9O2R8j32M6N1mj8L4Jj21M1P8l2q8K7j0J7J35l6j19
$$ 18 -17 -61 -57 4 9 23 -36 -37 6 -73 -92 -30 68 -64 -18 33 29 11 45 46 -75 -34 44 12 -76 -49 -59 -42 93 57 -62
3102f2O0KK5K6l6M1J7N4r6J1pO1k4o4L4j07M2j2K4k5k8J7O5M4m4o4N9o9M1J9j87
$$ -62 -2 0 25 51 15 56 73 127 31 42 35 96 72 8 42 -65 -23 -35 -11 -36 -64 -47 18 62 18 -46 13 -56 -15 4 -183
3133a83Q5N98l48o82K28L28k04k33J62K33O1k82K00Q2q0N1r5OJ22j4q4R0j6PM6
$$ -183 -98 500 152 -530 -302 26 -178 -411 -249 -16 45 -237 -37 45 -35 16 -79 -73 49 35 -49 41 25 32 78
3158G8j33M8J01o5n2K8kj9n5m5M4Q9k04J34K5M1P0q4j00P5qL3M2j9j00Q1l0L5
$$ 78 -55 -7 94 29 -23 5 3 -16 -71 -116 -72 17 -187 -53 -28 13 83 -1 -101 -26 -34 -1 41 22 -78 3 -27 8
3186Hj2L5k6q2L8Q1M8j33K5O0p9J0N8l5l8MJ05o3o6N2K8mn7Q4o7L1n0K2Lm2P9
$$ 8 -4 31 5 -77 -39 42 90 -43 -18 42 -37 -27 31 -4 -42 -38 67 4 -62 -10 18 14 -43 41 -26 5 -45 -23 -20 -62 17
3217A7M4Or8j2P7l9Mm4n7L3J11j4k6m5N1J2j7L2r2P3o2Q4j21P1M0n7M1M6l4p1
$$ 17 61 67 -31 -43 34 -5 -1 -45 -102 -69 42 28 2 -43 8 20 3 35 -57 16 -46 38 -83 -12 28 -29 12 58 24 -47
3247d7J2M1n9Q3l7J0Rl4J08j34m5L7N2k0K3l0k4J2R4K1m0j39J1Q0k6P5J2r6P4
$$ -47 -35 6 -53 30 -7 3 12 -22 86 -48 -93 -56 -4 -24 -1 -31 -55 -43 51 72 32 -107 -96 -16 -42 33 45 -51 23
3276B3K9K4J1j89M1J46j26J20l5r6nM3l2K8J5P3j58M4M6N8m6J1Jm8j1L0MPQL2
$$ 23 52 76 87 -102 -61 85 -41 79 44 -52 -57 -14 -46 -18 -3 70 -88 -44 2 60 14 25 26 -22 -33 -3 1 8 16 48
3306D8j14J29k3m2m2m2J29m0J7k9rJn1j8J04m6J40j54M8L9r4K4N2n2k4O5K2j18
$$ 48 -66 63 40 -2 -44 -86 43 3 20 -9 -18 -17 -68 -86 18 -28 112 -42 6 45 -49 -25 27 -25 -49 16 38 -80
3334h0R0L2j8o5J19m8n3M4p7Q9r9O6j4K7j23Q7oJ7m0O5k7l6k6J04j6jj9n8J9N4
$$ -80 10 42 24 -41 78 30 -23 21 -56 33 -66 0 -14 13 -110 -23 -29 -12 -52 13 -14 -50 -76 28 12 11 -8 -66 -47 7
3364GJ4q3p7J06J4O0K0n8r3M1P8O5o6n5%P7j30J31j21P5M3q4O7j5l0Q7l8o8l4
$$ 7 21 -62 -139 -33 -19 41 61 3 -90 -49 29 94 28 -27 -27 50 -80 51 -70 5 48 -36 31 16 -14 73 35 -33 -67
3393f7O4jr0J26k8K8m4n1K6L9M8n3j8L4N4o2N0j10L0J0Q8r2N4o2m6K9K1J8J9k6
$$ -67 -3 -4 -94 32 4 32 -12 -63 -37 2 50 -3 -21 13 67 5 55 -55 -25 -15 73 -19 35 -27 -73 -44 -23 -5 14 -12
3423a2J4N2j5q6R5or1m5OL7O1P3k0n9J4n9j32J92k7mn9J48j74O6m9M5J25m3j10
$$ -12 2 54 39 -47 48 42 -49 -94 -88 -51 10 83 63 4 18 -41 -173 19 -8 -12 -71 77 -97 -31 -80 -35 90 47 -63
3452f3j3J9J3o1J6J48mQM5q2j18O7P3r2J20o8p6O1%N4m0l9P1n3J18j35K2lQN4
$$ -63 -76 -57 -44 -105 -89 59 55 63 108 26 -92 -25 48 -44 76 8 -68 -7 -7 47 7 -32 39 -14 104 -31 -9 -12 -4 50
3482E0j40J29o8Kl5o4M9J06Rj0j23jR5J5r5J15n6k1PO6p5N5j8j6K4k8n6J06N6
$$ 50 -90 39 -29 -27 -62 -126 -77 29 38 28 -95 -96 -1 14 -81 34 -22 -43 -36 30 -45 10 -8 -24 0 -28 -84 22 78
3511G8j77J06n6K0n9P1m5O6j1J33j47l0K1L7R4MJ29k57j05J65j89J60k69L53L5
$$ 78 -99 7 -49 -29 -88 -17 -62 4 -7 126 -21 -51 -30 7 101 105 234 -23 -128 37 -152 8 -261 92 127
3536A27j02j78K44j94N3M43m95M13n28K51j41jJ85j16J20k40J36K2K0k0r3O9J12
$$ 127 25 -153 91 -103 -50 393 -102 311 -217 34 -107 -108 77 -39 81 -159 -23 -1 19 -1 -94 -25 87
3559H7p4o1JJ22r5n1J93j38o4Q5j13Q9l5R5n9jN4j9j03J10P0j1j09J25j49J36
$$ 87 13 -48 -47 75 -20 -71 122 -16 -80 5 -108 -19 -54 41 -18 -19 35 16 -87 23 93 82 -27 98 -51 85
3585H5q1P8j0m5k2j2O4j19jR4p2J11K2p1k2rnl4l5Q1L2m9O9nj36N7L6N1q1oL7
$$ 85 4 82 72 27 5 -7 57 -62 -63 31 -41 70 92 21 -1 -10 -15 -49 -84 -3 29 -20 49 44 -92 -35 1 52 -29 -35 2
3616Bm2N5r3J79k4r8j6Ok9R4Mpj9L0j0o1L6j7N3j38j2O8m7J89Lj50o0j39K25J01
$$ 2 -40 15 -78 101 77 -21 -37 -31 -60 34 38 31 12 42 32 -29 7 -10 43 -95 -107 -39 -86 103 106 -44 -104 -243 -18 83
3646H3r2J35j25k37O09p77M05M25k5l01j87K27o9k32n4J0M47L0m35l6J82r1l08
$$ 83 -9 126 1 -236 373 -404 1 426 401 100 -87 140 71 -161 -215 -205 242 272 -163 -199 -17 -108 -416
3669d16j29M30L49j43m71M41K50m3n53K90k1j99J33j5K50j52K00j64j59J3L95
$$ -416 -545 -115 234 91 -380 61 311 268 -285 5 -16 -215 -82 -97 153 1 201 37 -122 -109 286
3690B86l5l71M5K59k26J27N28p02JJ71q2N71m43J72n98P16l67j73J74k28p6K77
$$ 286 251 -120 -75 184 -42 85 613 -89 -88 83 1 572 129 301 -297 419 52 -121 53 -175 -251 26
3712B6j11J01j40K54j14r3o2K17j58N0m85N94j57j06J26j17K03j53K37M5J59l55
$$ 26 -85 16 -124 130 16 -77 -139 78 -80 -30 -515 79 -78 -184 -58 -175 28 -125 112 157 316 -39
3734c9L3K76k08K00l23j6NJ63l5j1P8j00l86L32O4r8J02j38K03j6m49K87M89l68
$$ -39 -6 270 62 262 -61 -77 -72 91 56 45 123 23 -363 -31 33 -65 37 -101 102 86 -363 -76 413 45
3758D5J68l43L13J61n40o0o5L56R0n05J1K41M55m40L16l89R3KN76m03K17Q9n18
$$ 45 213 -130 183 344 -196 -256 -321 35 125 -380 -369 -128 327 -113 203 -186 -93 -91 485 82 299 388 -130
3781a30r6N22l6K7%n51r2O61P2o58K75QM08j14j33m03m1J1M76k8K1k60L10K69
$$ -130 -226 296 260 287 287 -264 -356 305 377 -281 -6 2 410 296 163 -240 -281 -270 206 178 199 -61 249 518
3805E18p11M59m1K70l12l12q42R36N48r62P61j92ql92J03R4M41k16k44k62P67
$$ 518 -193 266 225 495 183 -129 -971 -35 513 -449 312 120 112 -280 -177 -83 358 142 -102 -364 403
3826D03k69J43j47j35q5R4N5Q7l1l12K40M3q6J13J76l36J2j10K66J83m10J31J44
$$ 403 134 277 130 -5 -90 4 59 146 115 -197 43 86 0 113 289 -47 -35 -145 121 304 -106 25 169
3849A69l7j75j01K1K55r5m49M44q9J48m33K76o5K44m47Q51j83k02k32J38l51L89
$$ 169 132 -43 -144 -123 132 37 -412 32 -57 91 -342 -66 -131 113 -334 517 334 132 -100 38 -313 76
3871G6k27o09Q79K70O16j266j12J19k2N52Jo42J098j64k39P3q31M86k52M97p1
$$ 76 -151 -760 119 389 1005 -261 -373 -254 -276 276 277 -365 733 569 330 403 -428 58 -194 303 232
3892B32n42N68K7n24k54L76J97j28L57j39J80o76J65L65k55J65j29J52jl70N37
$$ 232 -310 258 285 -239 -493 -117 80 -48 309 170 350 -326 -161 204 -51 114 -15 137 136 -234 303
3913C03k90Q0J2j80N07p01K23J03JOK31n08K80J7Q6k69L5L1q3J34k34K59j30l2
$$ 303 13 93 105 -75 432 -269 -46 57 58 64 295 -213 67 84 170 -99 -64 -33 -116 18 -216 43 -87 -119
3937a19M8K12nl15O1M44j87j61q3K08j85J18O3k3k45J21Q2j0r9J11Pr0n4M2L5
$$ -119 -71 141 136 -179 -118 326 139 -22 -105 103 -82 36 99 76 -169 -48 34 24 -75 36 43 -47 -101 -59 -24
3962b4O7p6K3P4j47J98j53K0Lk3J00q1p7Q7JL9j1p3P1n4R3l9n5LJ09K7k4o7l9
$$ -24 43 -33 -10 64 -83 115 -38 -18 -15 -38 62 -19 -96 -9 -8 31 20 -53 18 -36 57 18 -37 -34 75 102 78 11 -28
3991b8M5m1O1m0k2M0k5N6q2J4L5p3R4L8j37P0Nl0L0L3n0L3OkN8n9J14j04j57Q9
$$ -28 17 -24 37 -3 -25 15 -10 46 -36 -22 13 -60 34 72 -65 5 10 -20 10 43 -7 26 32 30 88 29 143 39 -118 -29
4021b9R9j37O2j8N9l1pJ5p8M0o8QQ9O6j73L16j89N7k62K06j6J02k14m1M4K28l18
$$ -29 70 -67 -5 -23 36 5 -2 13 -65 -25 -93 -85 4 70 -103 213 24 81 -181 25 9 111 -103 -144 -100 128 -190
4048a90Q8K9M7J43j82k2M2K0L39l24m39Q09J22p19Q0K55m36L33J06lj16r6L2J1
$$ -190 -102 -73 -26 117 -65 -87 -45 -25 314 -10 -449 360 482 -237 -157 98 -338 -5 101 98 -18 -114 -82 -71
4072g1J19P7j62K5N9l2RL3j82K04M5J88n82L76k67M04j04J67p65J34O29p7K48
$$ -71 48 125 -37 -12 47 15 24 57 -125 79 124 312 -270 106 -161 243 139 306 -459 -325 304 227 475
4095D75Q9k60k34m66J59J22n0M72j04J11m48R0k1K86n82K85k75J91k9k78L04L31
$$ 475 564 304 70 -396 -237 -115 -165 307 203 314 -134 -44 -65 221 -361 -76 -351 -160 -189 -467 -163 168
4117A68n00Q34J45m86K14m66O40n58K30q8M69k69j20n97N45m90M23N33k11k06
$$ 168 -332 502 647 161 375 -91 549 -9 221 133 602 333 213 -384 161 -329 94 627 416 210
4137B10l09Qm41L75K26k93L52m0l37j48P00p03O75l53J3J36J77l55L41j03m68
$$ 210 -99 -91 -532 -157 69 -224 128 88 -249 -397 303 -400 275 -78 -65 71 248 -107 234 131 -337
4158c37L54q4K8o1j3R5J26m75j13N26q4K85m57L01l52N39k69l38M35m58K16K64
$$ -337 17 -67 -39 -100 -113 -18 108 -367 -480 46 -38 247 -210 91 -261 278 9 -329 106 -352 -136 128
4180A28K67k66m68L74K52k41j38j73M95l01J17J78K2k50r4J41m63L63J92M3j40
$$ 128 395 129 -339 35 287 46 -92 -265 230 -71 46 224 246 -4 -98 43 -420 -57 135 178 38
4201C8N0j59J07k55L43k66R8J64q2l3O1j14K0O7o2P2k5q7J29o4O5p1p1J25k2k8
$$ 38 88 -71 36 -219 124 -142 -44 120 38 5 66 -48 -28 39 -23 49 24 -63 66 2 67 -4 -75 50 28 0
4227@oP8j41Q4J9J9o1j8P9p7m9N6j9J6K4q5J23n6p6J08L6M7l4j5q9J9lR0lm4l0
$$ 0 -6 72 -69 15 34 53 -8 -26 53 -24 -73 -17 -36 -20 4 -81 42 -14 -90 18 54 101 67 52 -37 -18 -21 69 66 22 -8
4258hqj8L0R1q8J2n0R0n6Q5l1M5r5n6O0r3O9m1R2l6k5Q2r4Q5M3j04O2nl1p5P2
$$ -8 -16 -34 -4 87 -1 11 -39 51 -5 80 49 94 -1 -57 3 -90 -21 -62 30 -6 -31 51 -43 42 85 -19 43 38 7 -68 4
4289DQ4j27Q9o9rk0L5mM2n8P2j39J04N4n0j4qk8L3o4O6J28r5J2K3p8P8p3nk4P4
$$ 4 88 -39 50 -19 -28 -48 -13 -17 25 -33 39 -100 4 58 8 -6 -14 -42 -9 -73 -7 121 26 38 61 -17 61 -12 -17 -41 33
4320C3J0j7l2l1N6qj04M7M8mJql1J25r2o2K1J29p0J4k9K6l2m8K6N3O0K0o7K3o6
$$ 33 43 26 -6 -37 19 11 -93 -46 2 -2 -1 -9 -40 85 -7 -69 -48 81 11 25 -4 22 -10 -58 -32 21 81 101 34 57 -9
4351iL9n1Kj5O9P8l8q3K6j6J5mJJ2q4m5K00q7n5j3jO0j22R7O7PJ7q5k9J01M8j81
$$ -9 30 -21 -19 -34 35 113 75 -8 18 2 17 13 14 26 -58 -103 97 10 -45 -58 -59 1 -121 -24 43 50 67 -18 -47 54 102 -79
4383g9J55l8j4j3k8o1rM1R4n5L1lj3P9p7mLl3l1J37j09K1L1JJ%o8J03K9o6m1j2
$$ -79 76 38 24 11 -17 -78 -87 -46 48 -7 24 21 8 87 10 6 9 -24 -55 82 -27 -6 25 26 27 27 -41 62 91 25 -16 -28
4415b8j0K6J8m1l1J44p7l3j1n5J06m4L5j7K3q5L6J47j71Q0q0K9o6J35n1P1n8l6
$$ -28 -38 -12 6 -35 -66 78 1 -32 -43 -98 8 -36 -1 -18 5 -80 -44 103 -68 12 -68 -39 -105 30 -21 50 -8 -44
4443d4M8n4J49q0p1RlP1%j16O8K3K0r0P3R5j18mN6Knk2R0k22P9O6K2O4q2o9K6
$$ -44 4 -50 99 19 -52 -43 -46 25 25 -91 -23 0 20 -70 3 98 -20 -24 32 34 29 7 97 -125 -46 20 42 106 24 -45 -19
4474a9q6J25J8j12J14o6Jo1P7qQ1k0q0O3m0rm5OJ4M0p5M3j2P6n1K6K7n8m2M6K7
$$ -19 -105 20 38 -74 40 -26 -25 -86 -9 -17 64 44 -36 27 -13 -22 -67 -61 -47 -7 -82 -39 -51 25 -26 0 27 -31 -73 -27 0
4505@l9rp5J17%j3j9J18p4oj2m1J05j33O3N9j19M4n5P4Qr6M4K2N6J7L5k9p7n1
$$ 0 -39 -48 -123 -6 -6 -19 -38 80 6 0 -12 -53 52 -81 -18 41 -78 -34 -89 -15 -7 -103 -59 -37 19 36 71 42 -35 -86
4535h6oJ45l2J4j02L5J06j48N0J13q6L4j42K13j32o4R8nl4j4P1L2p2m0R7l5l9
$$ -86 -92 53 21 35 -67 -32 74 -74 -24 89 3 37 -105 108 -24 -88 10 5 -29 -43 28 60 -12 -52 45 10 -29
4562b9Q7m5J1p9Q5r1R1KN4q6o3J1O9M5Lq3o2m0M0R7o3K7k13K28j32J21j23K25
$$ -29 58 13 24 -55 30 -61 30 32 86 0 -63 -52 17 62 65 -18 -80 -120 -80 17 -46 -19 -232 -4 -136 -15 -138 87
4590H7j84j83k5N68k03J35k85J04L53j77k05K7K75j69k6N4k01k28L52Ol79M88
$$ 87 -97 -280 -305 263 60 195 -90 14 367 190 -15 12 287 118 92 146 -55 -283 69 75 -304 184
4612A84k90J18k25K86K54k79q0oL17j29m0K4q9k00j4J49J39j1j29L0n4j0J77j22
$$ 184 -106 12 -213 73 327 48 -32 -38 279 150 110 134 45 -155 -169 -20 119 108 -21 9 -45 -55 122 0
4636@k9j6N1j13J3P0P7o8qM0m6K6k8q6J29p5R7r6M8Q8o5q4k9J86q8O6n6m6N7r7
$$ 0 -29 -45 6 -107 -94 -24 53 -15 -23 17 -29 -3 -31 -117 12 -63 34 -62 -14 74 9 -75 -104 82 -6 60 4 -42 15 -82
4666h2pP9N8J1M3j24K5J6q3R6J6K8k9r9N7P9n6l7j2P3n9P7j84R8q1J16q5J58o6
$$ -82 -89 -10 48 59 102 -22 3 19 -64 32 48 76 47 -52 5 84 28 -9 -21 52 -7 70 -114 -16 -97 19 -66 92 26
4695B6N2p2q8O4O0j5p8K4N5n9PN3P1j56J54n4n6L5j31J72r2JP8q8m7P3p8J39j24
$$ 26 78 6 -82 -18 42 27 -51 -27 28 -31 -24 29 100 -56 98 44 -12 23 -108 64 -28 -27 51 -37 -84 -11 -89 50 -74
4724g4P6j1O3j17N2j8K4P2K9m5n8PN0l7J6m9K2M7j02O0K7j01M2l3M8j35P0J11
$$ -74 2 -9 54 -63 -11 -29 -5 67 96 51 -7 0 50 13 29 -20 2 49 -53 7 34 -67 -25 -58 -10 -145 -75 36
4752C6j7j86P1J27m6K1M4j8n1M6n2l2O8k0MJn2M0N8q4K2%J03p0Rj6k9P7L8j7J3
$$ 36 19 -167 -96 31 -15 6 50 32 -19 27 -25 -57 11 -9 -5 -4 -56 -16 42 -42 -20 -20 83 13 22 6 -23 54 92 75 88
4783H8q3j9R5p7M7k2j49O0J22k0p3O2q8J15J9j09L7l9L4L0m9K7p0J31p9L4n9j9
$$ 88 5 -14 81 4 51 29 -120 -60 62 42 -31 31 -57 58 77 -32 5 -34 0 30 -19 8 -62 69 -10 24 -35 -54
4811e4J37m0K6k2q6jk1J45m6Lm4N1j08R8n8M7o6j4J02l1j9qP5n8l3O6q1J27j19
$$ -54 83 43 69 47 -39 -40 -61 84 38 41 -3 48 -60 38 -20 27 -39 -53 49 18 -1 -9 66 8 -25 41 -40 87 -32
4840c2M8J1m1J3n5M8o7J86m3j02N9k8J3o5%J81j13J4N1r7L9P8p7n0K7k6N1m4K2
$$ -32 16 27 -14 -1 -56 -8 -75 111 68 -34 25 -3 10 -55 -55 126 13 27 78 -19 20 98 21 -29 -2 -28 23 -21 1
4869Ak5l5P6j8%N9L4m0pj39O2K2O6L4k8j08J22p8j13J60o4J7L3o4P2o6R0j46O4
$$ 1 -24 -59 17 -1 -1 58 92 52 45 -94 -32 -10 56 90 62 -46 76 -2 -115 45 -19 -2 31 -33 39 -27 63 -83 -19
4898a9J69j16n5k6J42l9J22m39M18k17r8J20N3m5p7M3r0L44j83j77Q1k01LL27
$$ -19 150 34 -21 -47 95 56 178 -261 157 -60 -158 -38 15 -30 -107 -64 -154 190 7 -170 -89 -290 -287 40
4922D0O6j19m4J5k59K13j94J32O0K43P5k43o7K40l57K22j46l6M4J98m54L43j40
$$ 40 106 -13 -57 -42 -301 -88 -282 -150 -90 153 228 -15 -82 158 -199 23 -123 -159 -115 83 -371 -28 -168
4945a68J89m41O27K40p30J76O93q18Q93r38J60j74K32r2M08o5m03N87j36j089
$$ -168 21 -420 207 447 -283 -107 586 -232 661 -277 -117 -291 -59 -151 257 192 -211 376 240 -849
4965h49Q77L87m45MN6J11m14M10R4j79p1m9L67n79N51k87N4Q5k2l5j38J50J73
$$ -849 28 415 -30 -26 30 141 -273 137 231 52 -19 -68 299 -280 271 -16 38 123 101 66 -72 78 251
4988B51k28Q0j82J37q6rN5RRj1Pk9l4J7OLpJ13j09j5O7kn3P6q5J5P6Lj24K5J37
$$ 251 23 103 -79 58 -28 -37 18 27 36 25 32 3 -31 -14 -8 -5 -12 101 -8 -23 44 42 -11 65 -20 -5 71 74 -50 -25 112
5019A12j05R2j85J06n4Jl9J24l2o6qR8p4Nk4O9KpJ0j7KO8j03o9J62m1m4K5NR7
$$ 112 7 99 -86 20 -34 -33 -72 52 20 -46 -54 44 -30 -25 -49 20 22 15 25 8 10 78 -25 -94 68 27 -17 8 13 110
5049A10o1l7J7p4k2R2j22Q7kL9m2M8P8k01P1N9JR7k09K00K7O8Rn3K11l34j62K69
$$ 110 49 12 29 -45 -67 25 -97 -10 -12 27 -15 33 111 -90 -19 40 41 138 -71 129 156 224 233 180 391 57 -105 164
5077A64j79q0J93j52O3K15Pm5L25m72L21l62q0J64l86N73Q3k97K00m20n9M02O7
$$ 164 -15 -95 98 -54 9 224 231 186 511 39 360 -2 -82 82 -304 269 352 55 255 -165 -224 178 245
5100B45p42N61k08J97j54J25Q6O4k19Q0k87K56l4J06r5K0j4J28m3r1o6L5K4J05
$$ 245 -497 64 -144 53 -101 24 110 174 -45 35 -252 4 -30 76 -19 1 -13 115 72 -19 -85 -50 -26 79
5124G9o5J50j78R3k57K04r3P9L6J36q3n7m6J3p7Q9Lo7K8qK8n5L1P7N5j57N9j07
$$ 79 14 164 -14 79 -178 26 -67 12 48 184 101 44 -2 11 -66 23 26 -41 -13 -21 7 -48 -17 60 115 -42 17 -90
5152i0O6L1l4P9j03N9J2m8M1o5R1k9J0r8L1P4n7j0k9J35j11Q7MK7j11l3Q4P5j27
$$ -90 -24 7 -27 52 -51 8 20 -28 13 -52 39 10 20 -78 -47 27 -30 -40 -69 66 -45 42 46 73 -38 -71 13 88 -39
5181c9R8k1Jn2m7J01j12oO3L6m4L4nJ0n3J14l8l8Q2j41P3L74n82J13M41nJ4m42
$$ -39 59 38 39 -13 -60 41 -71 -77 -14 22 -22 12 7 17 -36 78 40 2 84 -57 16 390 -192 -79 362 357 371 -71
5209g1M4l89O98k84m9j78L29L33n33j33L27K5j15r9kM8m3N6j3K3L1k3N7n7J9j3
$$ -71 -27 -416 282 -2 -51 -229 100 433 -100 -233 94 119 4 -95 -97 -49 -92 -36 -49 -26 5 -18 39 -18 1 -12
5235a2JP1m3NK2l6O5p6m4K9N7%j12L8k2J01q0L9n5k5m1P4Kk7J11M5r3QM1j4k7
$$ -12 -11 60 17 22 44 8 73 -3 -47 -18 39 39 -73 -35 -57 44 -36 3 -52 -77 -118 -44 -42 -69 42 87 -6 2 43 29 2
5266BL8p4l8P3l9L7n6J29m0oj25J19J2L5K0j37K4l5K4P3J8p8n4P4N5N5r9j3lj7
$$ 2 40 -34 -72 1 -38 -1 -57 72 32 26 -99 20 32 67 87 -50 -26 -61 -37 36 54 -24 -78 -4 51 106 7 -6 -9 -26
5296b6o3j7J46p4P7o5O3o0R8j26Q2P5j05l7L7l9K6p6J67k4o5Q2j35J95j39Mm4
$$ -26 -89 -106 40 -34 43 -22 41 -19 79 -47 35 110 5 -32 5 -34 -8 -84 83 59 -6 76 -59 136 -3 1 -43
5323d3oM7P2Lok3j03M1L7j0P0p8P5l8J2l2L7r1N7j5q6L0R0Ro7N5q7%J19j39P4
$$ -43 -49 -2 70 73 67 44 -59 -18 19 9 79 1 76 38 50 18 55 -36 21 6 -80 -50 40 49 -18 37 -50 -50 69 -70 4
5354Dk3k5J01o6L0j4l4J39o2o0L5j0K6p1j5k7Q1R5j34J00j08k3M2Q1o2K7p7K2
$$ 4 -19 -44 57 -9 21 7 -27 112 50 -10 25 15 41 -30 -45 -72 9 104 -30 70 -38 -61 -19 62 0 27 -50 -28
5382b8O5k2j02KJ3L8P2k4j9l5Q4n6P8j8j0p6P6L0n2J6Ro1j3M3l1J00j48l0J50
$$ -28 37 15 -87 -85 -72 -34 38 14 -5 -40 44 -12 66 48 38 -38 38 68 16 32 41 -20 -33 10 -21 79 -69 -99 51
5411E1k5L8j13L6J2lj2pK0%m1O8M0l1pK5n2O6l0ln3l0Q3j43J53M1j00K8M4J2p3
$$ 51 26 64 -49 -13 -1 -4 -16 -23 -3 -3 -44 24 64 33 26 51 -1 65 35 32 -21 -51 32 -111 42 83 -17 11 55 67 -6
5442fj01J01j3Q1p3k5m2J21M9k12J07J20k8n0p5N6M0j04%P8P5r6O9p7jM1l0p0
$$ -6 -107 -6 -19 62 -11 -36 -78 43 92 -120 -13 107 79 29 -46 10 50 -54 -54 24 99 3 72 -5 -6 35 5 -65
5470f5J29m0lq6K7P7p4k2M1M5J2N3r4L1p6K5JJ04l7j16L3j3nJ57J9j53P7m2Nq0
$$ -65 64 24 21 -65 -38 39 -35 -57 -16 29 41 94 0 31 -45 -20 -19 85 48 -68 -35 -48 -53 104 123 -30 47 5 10 -70
5500g0j1M5nk2j4l5J21K2m1J7K5j45J83k9j7K6j01m0N4l0J2P5n8J3j8o0M5J10
$$ -70 -81 -36 -41 -63 -77 -112 9 31 -10 7 32 -113 70 41 24 50 -51 -91 -37 -67 -55 20 -38 -25 -43 -103 -58 52
5528E2%ok6om1k5P7j20Q7o7rJ25J9j20o4mJ99J3j15n3Q9Kj04J00oj4K8j03Q4L2
$$ 52 52 46 20 14 -27 -52 25 -95 -8 -75 -84 41 60 -60 -124 -128 71 84 -31 -84 5 7 -97 3 -3 -17 11 -92 -8 24
5558B4N2r1rj4lj9J11j19J49M9p4P7j38L4k2j30K5j4K42n5J7K21m71M35O0n76
$$ 24 76 -15 -24 -38 -41 -60 51 -68 81 130 56 133 -5 29 7 -123 -98 -112 130 75 92 313 -158 277 337 -239
5584b39K38l29L75l20n5N01L44n61L01l36J6qN16l49k04J47p6J24k00Q5rJ06o1
$$ -239 -1 -330 45 -275 -330 171 515 -46 255 -81 -65 -73 443 94 -110 37 -39 85 -115 -30 -39 67 6
5607FK8n6J08j39K7l3J7L1qN7r2J45m2j25J09L5p5o2N5R2j18K6L0q5K7M0k3O8
$$ 6 34 -22 86 -53 -26 -59 -42 -11 -19 38 -54 91 49 -76 33 68 -7 -69 -14 78 -40 -14 16 -69 -42 -2 -25 43
5635D3o5M9P9o6p1M0L7K0j3r2N0n2n9J58k4q3L5j5m0Q5k6l5L3%l0Q5n5K8k8j01
$$ 43 -22 27 106 40 -31 9 46 66 53 -39 11 -41 -100 58 34 -49 -14 -29 -69 16 -10 -45 -12 -12 -42 43 -12 16 -12 -113
5665a13R6l1Q6j72J36k6k1N3R7j13J5j22J11J1L2kO4k1j05KJ2K5j4Jj8K7L5o9
$$ -113 -17 -48 38 -134 2 -24 -45 8 105 -8 7 -115 -4 7 39 37 101 80 -25 -23 -11 14 0 1 -17 10 45 -24
5693b4J17K4j53L5N8o8M0pq7K7Q3n8o6O8o3O5n1O3m9J47r0J25r0m1J4k7O2j26
$$ -24 93 117 -36 -1 57 -11 29 22 -65 -38 45 -13 -79 -11 -74 -9 -60 3 -46 101 11 136 46 5 19 -8 54 -72
5721g2J32m0k3oj5O5o2J1j1k4N3k1M2n0Q4m6L0j7O3j30J4J6k4P9k9J7o6N8p6K1
$$ -72 60 20 -3 -9 -24 41 -21 -10 -21 -45 8 -13 29 -21 63 17 47 30 93 -37 -23 -7 -31 48 19 36 -30 28 -48 -27
5751b7O2j0o9L4LN5r9J30k5p1lJ13m8n8l7oJ03k1pJ11j76L7J4J4j17J31l0J9k0
$$ -27 35 25 -44 -10 -7 48 -51 79 54 -17 -20 93 45 -13 -50 -56 47 26 19 130 -46 -9 5 19 -98 33 3 22 2
5780Bl3J8k5kK2R1q7Q9j00o8R0r9J17L9m7L9L7j00jQ7o9O2k7Nm6J12r4K4%J5M1
$$ 2 -31 -13 -38 -40 -18 73 -14 75 -25 -93 -3 -102 15 54 7 46 83 -17 -18 69 0 62 35 40 -6 106 12 36 36 51 92
5811I2J0j8j54J69j73M8N3M5J1n1j25p4J13mK8L2l6j23J71K06k57pQ2j27J17k3
$$ 92 102 84 -70 99 -74 -26 27 72 83 32 -93 -167 -54 -58 -30 2 -34 -157 14 220 -37 -44 38 -89 28 5
5837Er3J97L2j12j3l2P5l1j10K39j58p9K06l2j6k43K9K15O8k42J08J80k74n5J70
$$ 5 -88 109 141 29 16 -16 59 28 -82 157 -1 -80 126 94 78 -165 -136 79 147 -95 13 193 -81 -136 34
5862C4K34m66M1j16K87j02j13J09K39R1l54J61k54K04K11oj11m04L41L18n93N39
$$ 34 268 -198 -157 -273 14 -88 -201 -92 147 238 -116 45 -209 -5 206 200 89 -315 26 344 -249 290
5884B90L0n08L13N23o19J29k92N82l46L4n6l9n46N13j32L53k78j5Q3K31n55J42
$$ 290 320 -188 125 648 29 158 -134 448 102 136 80 41 -505 8 -124 229 -49 -64 19 250 -305 -163
5906a63J99j25K46k4j51j32J98KO7j79j42j2N84l82N8k87L10r1Q7P3m33K09L67
$$ -163 36 -89 157 133 -18 -150 48 50 117 -62 -204 -216 368 -14 44 -243 67 -24 63 136 -297 -88 279
5929B79m16J72j84o7L24l7M07o57J9j8L5j58N85p52P03J91l38m94M32L47m45m72
$$ 279 -137 35 -149 -216 108 71 478 -179 -160 -178 -143 -301 284 -468 235 426 88 -406 26 373 -72 -544
5951e44J70J45P77K50m70k64l15O42J31j63p22P42m50N76o53j01P29n4j36m78
$$ -544 -374 -229 548 798 328 64 -251 391 522 359 -363 379 -71 505 -148 -249 480 426 290 -188
5971a88J48L55j44K08j36n0j93K68K8n42o5q5K07J06K71M7l38L18k69J30j54Q7
$$ -188 -40 315 171 379 243 193 0 268 296 -246 -311 -396 -189 -83 188 235 -103 215 -54 76 -78 9
5993Il8J30k18l9J50P9j10J21j35Q4r9j18K28j5P2j18J1J7J30p5o0m5%Q7qp0K2
$$ 9 -29 101 -117 -156 -6 73 -37 84 -51 33 -66 -184 44 29 101 -17 -6 11 141 66 6 -39 -39 48 40 -30 -8
6020hm7N9qr0R4n2J06m9o2N6Pl5pJ4J77j33q6J77q6l1J2n2M8k0l9J65j35J09o7
$$ -8 -55 4 -4 -94 0 -52 54 5 -57 -1 6 -29 -36 -22 155 22 -64 113 27 -4 8 -44 4 -16 -55 110 -25 84 17
6049A7l9pQ2k4LO1p2Q1j12Q6q0M1p3O7n2N3M4j85J09l3N0m2j09J82j6rk7k5R4
$$ 17 -22 -29 53 29 32 93 21 102 -10 76 -4 37 -36 31 -21 32 76 -109 0 -33 17 -25 -134 48 32 23 -4 -29 65
6078F5n4j2j2J50j36O8j0j6Nm4n0J31j30j9J44j33OM6N2j3pm2m4J36j34P5l7k3
$$ 65 11 -1 -13 137 1 69 59 43 48 4 -46 85 -45 -64 80 -53 -47 -1 51 38 31 -11 -55 81 -53 22 -15 -38
6106c8O0m9K2J08j22R1n8o8N4o1K1P0j24L3O9o3j0R6q2M0O1n1q4M4K5qJ17p1L5
$$ -38 22 -27 -5 103 -19 72 14 -54 0 -61 -40 30 -94 -61 8 -55 -65 31 -51 -11 50 -1 -85 -41 -16 -24 93 22 57
6135E7p1Lo0J03K6n8K4m8KQ7ko7L8J4j41R4j4K2M3j04O0M8o1m3J38r0J4j00N9
$$ 57 -14 -11 -71 32 58 0 24 -24 -22 65 63 -4 34 48 -93 1 -13 9 52 -52 8 56 -5 -48 90 0 14 -86 -27
6164b7J4J4j6mj12P1R4k9rj37J79p0lJ20q3P4q1Q7o1J6k1o2K6K05j19p4jk3L8
$$ -27 -13 1 -15 -19 -131 -60 34 5 -4 -141 38 -32 -35 85 2 76 -5 82 21 37 16 -46 -20 185 66 -8 -9 -32 6
6193Fq5R0j6J6o7J07L8p1J0kJ4n5p0J09J08k5j04K0n9Pn4J17m4M5l7j8M6q9L9
$$ 6 -79 11 -5 11 -56 51 89 18 28 26 40 -15 -85 24 132 107 3 23 -36 -29 -83 34 -10 35 -2 -20 26 -63 -24
6222b4Q1n3o4R6l4k2q6J99m8p5K1j09Q1pQ8p3j6L4n0j3K1J15M0j16ml8kM8L6o7
$$ -24 57 4 -60 36 2 -20 -106 93 45 -30 -9 -118 -37 -44 44 -29 -45 -11 -61 -74 -53 62 102 -14 -18 -56 -58 -10 26 -41
6252d1J53k23J46%ol1m0j7Q0J4ln5J10j56M1L2K1lj16J05k8K9p0J6J94j65J22
$$ -41 112 -111 35 35 29 -2 -42 -59 21 35 32 -23 87 -69 -28 4 25 22 -94 11 -17 12 -58 -42 152 -13 109
6279A09r4l1j5jJ22o2J6J0j01N2L3n0J84j93j46J67K9M7o0O4oj05J01M7k6k18
$$ 109 15 -16 -31 -32 90 28 44 54 -47 5 38 -12 172 -21 -167 0 29 76 16 80 74 -31 70 117 91 -127
6305a27J67K69J62n40l4K13j49j75L53J05J71l02l31K79l65L65j24l04L39k58
$$ -127 40 309 471 -69 -103 110 -39 -214 139 244 415 113 -218 61 -304 61 -63 -367 -28 -286
6325b86M24L9N6m82K8J36n5J90k77R6k81O27j82J06k02j2l89M32k85O52n1k93
$$ -286 138 177 233 -249 -221 -85 -140 50 -227 -131 -412 215 33 139 -63 -75 -464 -32 -317 335 284 -9
6347il24J99o9j5n5p8Q53n14mJ07l17J62J96q2J86k03k20K38k48j49L54k73L39
$$ -9 -333 -134 -203 -218 -273 -351 502 -12 -16 91 -226 -64 132 50 236 33 -187 51 -197 -346 8 -265 74
6370G4N5L69m63N4k74L45k55L12K5k59j93M50k14l32L72l9n7j28Q4q9P1K54k00
$$ 74 129 498 35 89 -185 160 -95 217 242 -17 -210 240 26 -306 66 27 -30 -158 -74 -163 -92 162 -38
6393c8O9j7M7r6n0J34j26P5k8J5j2Ml9L3K7O6m4qL6mj21O5m3L0M0J20j42n5R9
$$ -38 31 14 61 -35 -85 49 -77 -2 -30 -15 -27 -23 -62 -29 -2 64 20 12 48 44 -77 -12 -55 -25 15 135 -7 -62 37
6422C7K6q4J3m5K5K7L1L8m3Jj8N8p4O5r4L8J8K1L9j84J48n0L7j9J68k15J12q7
$$ 37 63 -21 -8 -53 -28 -1 30 68 25 26 8 66 -8 57 -37 1 19 40 79 -105 43 -7 30 11 179 -36 76 -11
6450a1k69K14K3m51P09j64K5p1L98o97K73J32k44N35m51n3l02L69k33L6L23N6
$$ -11 -280 -66 -43 -494 215 51 76 5 403 -294 -21 111 -133 402 -49 -102 -404 -35 -268 -232 91 147
6472A47j96P8k4M0J35m40J00o6K58M8j57J88k39M45j85n97O28l23J62K93k41K68
$$ 147 -49 29 5 45 180 -260 -160 -226 32 80 -77 111 -128 317 132 -465 163 -160 2 295 54 322
6494C22m00L5P8M5j00J64l96J66k37M81k07J75K5l52J89m9K2J28o8j06J13l3j97
$$ 322 -78 -43 35 80 -20 144 -252 -86 -323 158 -49 126 151 -201 -12 -61 -39 89 21 -85 28 -5 -202
6517b02K84m6o0J20j80N3L6l1N6L8j43%J75q1k2O2J0n8k4L2n0l2n8J43nj1Jl3
$$ -202 82 36 -24 96 -84 -31 5 -26 30 68 -75 -75 100 19 -3 59 69 11 -13 19 -31 -63 -121 22 17 6 7 -26
6545b6Q2n1m4n1O9OM3m4N3Np9Q3o2PJ13l4l6q2K9M1K6q3J32j07o1J11o0N0Oon2
$$ -26 56 5 -39 -90 -21 -15 28 -16 37 42 -37 46 -16 -9 104 70 34 -48 -19 22 48 -35 97 -10 -71 40 -20 30 36 30 -22
6576b2q0Q0qo6J53k0J8j47J45jm8l2P9L7n9Pq4Q9p9O7o3P3j89J97L4p0M0l5K2
$$ -22 -102 -22 -30 -96 57 37 55 -92 53 52 4 -28 51 88 29 36 -48 41 -38 29 -34 39 -150 47 81 11 51 16 38
6605C8m3l3l4N2N2J6j45J1J09l2P4p7M3j5J7l8L1m1N1j5l8lk8J1K5K2j9o6J15
$$ 38 -5 -38 -72 -20 32 48 -97 -86 23 -9 65 -12 31 16 33 -5 26 -15 36 21 -17 -20 -48 -37 -12 10 -9 -75 40
6634D0j4J1l1mN1p3j2J9k7Q8l2p8K1OR2J6r2RM6p0O3j8j4mQ5q2L9k7J9r6J73r6
$$ 40 26 37 6 2 53 -20 -32 -13 -40 48 16 -62 -41 -35 57 73 -19 -10 36 -34 29 11 -3 -7 78 -4 35 8 27 -69 104 8
6666Hk3N8J6n8M3r0P5n0P8j08L7Pl6J01j2l1N5j14R1q9J1LN6o7R5rl7k8k7M5M1
$$ 8 -15 43 59 1 44 -46 29 -21 57 -51 -14 -7 -43 58 46 15 70 -44 47 -42 -31 -28 28 -39 56 47 10 -18 -45 0 41
6697D1k4p2N6N9jj00M3J9L4pl3o4q6R5O2l9K7P2p2n4M1L4j41O1M3O5j08J71j64
$$ 41 17 -55 1 60 59 -41 2 21 55 48 15 -49 -135 -40 22 -17 10 82 10 -44 -3 31 -110 -49 -6 59 -49 122 -42
6726d2J2J10j28J27j02kN7k1j0j0L7j8j03J93K0j18J8Rp1Q8n9l6J3O6k8N5j08
$$ -42 -30 80 -48 79 -23 -25 32 11 1 -9 28 10 -93 100 120 2 20 29 -42 46 -13 -49 -36 30 2 57 -51
6753e1O5J03j59J11o2J4Qo8J10n3j1J3PJ3q0K2p4P3j1P6k0m3ojR2n0K6p4O1j8
$$ -51 14 117 -42 69 7 21 29 -39 71 18 7 20 27 40 -40 -18 -92 -19 -30 46 26 -17 -23 -24 68 18 44 -30 31 13
6783A3j52K24K6j90J08Jj6l8QnL0N1j05N7N9j93J17K8l3PP8p2j5NM7n4J10j28
$$ 13 -139 85 111 -79 29 30 14 -24 -16 -21 9 60 -45 12 71 -122 -5 23 -10 -3 75 3 -12 -7 40 -14 96 -32
6811c2N1R5J4q2j32jQ3k1P3M5J4p1qo9n6J03jn9O3r8N0P7n4P1j43lL8Q5m2L5l9
$$ -32 19 114 128 46 -86 -87 -4 -25 48 93 107 36 28 -41 -97 6 5 -54 9 -89 -39 38 -16 55 -88 -91 -53 32 -10 25 -14
6842a4L1m5N7m4j8LQ6j87J33j0pP2k4p0oR2JqM8rj55K6l3J96j59M2k4J9R4q2m5
$$ -14 17 -28 29 -15 -33 -30 56 -131 2 -8 -15 57 33 -37 -43 49 50 42 90 81 -74 -48 -81 115 -44 -2 -26 -7 87 5 -40
6873d0l0J86j07J0omNj15N5L4K5o8O6q8O1Q1p9O0l4L3K3J7o7o2Q4q7J48j39N5
$$ -40 -70 116 9 19 13 9 14 -101 -46 -12 13 -55 11 -77 -16 65 -14 46 12 45 68 85 18 -44 40 -47 101 -38 17
6902A7j33J31l6J11J8j48M0l1L7J42j97R9J50k42K09m37J87J63j0j86R2K36k07
$$ 17 -116 15 -21 90 108 -40 0 -31 6 148 -49 50 200 -42 167 -270 -83 80 70 -116 -24 212 5
6925EQ8J38m37n7L85j46j26L99k22J38k04M16n75M58o5l29N8M79j99k01o4O6K10
$$ 5 93 231 -206 -263 122 -24 -150 249 27 165 -39 377 -198 260 195 -134 -76 403 204 3 -61 5 215
6948B15k56n5n0K55j04K9m4J53j35K6ml0m6K9j8J16o1rj08P9m0J16j15J13q4O5
$$ 215 -41 -96 -146 109 5 34 -10 143 8 34 30 0 -46 -17 -35 81 20 11 -97 -18 -58 58 -57 56 -28 37
6974C7m0kRJ11j00j7j7J1L9j8k3k3P0j2P2r2O3l9o6Q3q0O1Lq1J51q9N5j23j2J51
$$ 37 -3 -5 4 115 15 -2 -19 -8 31 13 -10 -33 37 25 97 5 68 29 -37 46 -34 27 30 -51 100 11 66 -57 -69 82
7004H2j7J7j35R4j1K8o3j7Nn9N1J3J35o8rj00M4J0M9k1j9nq6O6n0N1K2k8O5j13
$$ 82 65 82 -53 41 30 58 -5 -22 -17 -76 -25 -12 123 55 46 -54 -10 0 49 28 9 4 -82 -16 -66 -15 7 -21 44 -69
7034f9O0n5J28m4J4k4L9r2J09n2nLl1P7K3m3j6M1n2o9J5J2M6l2P2j25J80j08N3
$$ -69 -9 -64 64 20 34 10 49 -43 66 14 9 12 -19 58 81 38 22 63 11 -58 -43 -31 15 -17 55 -70 110 2 55
7063E5Nk3l4n5J11j00k9P0K3n2J68j54P5J0p1j46O8P2jJ41K4j81O7j9K7l8K6m6
$$ 55 60 37 3 -52 59 -41 -70 0 23 -29 139 -15 60 70 -1 -147 -79 -7 -8 133 157 -24 43 24 51 13 39 -7
7091gJ34j25M3j9p2rR5j05N8k2q7N0k4P4K6M2L0j45P7p5P7j5k0N5l9p6O0L4l2
$$ -7 127 2 45 26 -46 -55 40 -65 -7 -29 -116 -66 -90 -16 10 52 82 -63 14 -61 16 1 -19 36 -3 -79 -19 15 -17
7120a7pl2J70j28j3mN0o5N6l7J50k84J76k9R6%m0M4j8q1J4RN8j35pQ9n9J7J5N3
$$ -17 -24 -56 114 -14 -27 -31 19 -46 10 -27 123 -161 15 -14 82 82 42 86 68 -13 1 10 68 -67 -74 15 -44 -27 -12 41
7150D1K5o6Q7j46N4k6K3L6o9P2j23K9M1%R0r4p3J14Kk2O3o6o3R6j7l8N4r6L7M7
$$ 41 66 0 87 -59 -5 -31 -8 28 -41 31 -92 -63 -22 -22 68 -26 -99 15 17 -5 58 -8 -71 25 8 -30 24 -72 -35 12
7180A2LNl6Q1r6P4j37J00oj8m6N9o6J74j38L9J21j67J36l1J3p7N5j71R4N5o4J51
$$ 12 15 20 -16 65 -31 43 -94 6 0 -18 -64 -5 -71 103 -35 4 125 -42 94 63 76 -1 54 -117 -23 32 -32 119
7208A19q7J0j1N7k25K94Pj47p5P8j81K20K5r1l89K35K36l06M44l53K74k65J2K68
$$ 119 32 42 31 88 -137 157 164 17 -58 20 -161 59 84 -7 -396 -161 75 -231 213 -140 134 -131 -119 149
7232A49P5o60K75K20j39L9j62K63K44q07L72k5k2K91K64m3m19M11n7k67j82K3
$$ 149 224 -436 -161 59 -80 -41 -203 60 304 -503 -131 -156 -178 113 377 334 -85 326 269 2 -180 -157
7254a57P9Q0j24K1J22J56k53J27o4q2J49q5P9k4n8J67j31Oj7K1o3J03l6j4l3n1
$$ -157 -78 2 -122 -101 21 177 -76 51 -13 -95 54 -31 48 24 -34 133 2 8 -9 12 -51 52 16 2 -31 -82
7280h2P1moN0Po4J08m7N3j48K2N7n9K3J03M1j32m9P0J3j1n4M2J43j27J0k7Kk3
$$ -82 -11 -15 -21 29 36 -28 80 33 86 -62 -40 17 -42 -19 84 125 -7 -56 14 27 16 -38 4 147 20 30 3 5 -18
7309a8O3p6o3K1r7Q0M2m5O8M6k7O2o3qrQ9j7K3N0n4j7J9J50j86p8J14j05nP1o6
$$ -18 45 -31 -94 -73 -170 -90 -48 -93 -25 21 -6 56 -7 -15 -24 65 48 71 121 67 50 69 219 33 -45 69 -36 -41 30 -36
7339c6L5k9L0r5J45p7J1l2p3J65q2j2J7J7ll1J3O5J2j6Q0j79OM3N8r5P3J9n6Q1
$$ -36 -1 -30 0 -95 50 -27 -16 -48 -121 44 -38 -50 -33 -16 -19 -50 -37 28 40 24 104 -75 -69 -26 32 -63 10 29 -27 54
7369E4l9K0J7Lo5J0j8N6p5N7Nq5O2J0n8M6lk0mJ6NK0m8k0P5K1j18L9K0j8K9j5
$$ 54 15 35 52 55 -10 0 -18 38 -37 20 25 -60 2 12 -46 0 -3 -23 -27 -11 -6 14 -34 -54 21 42 -76 -37 -17 -35 -6 -21
7401b1k7J90k6k16J23m10K99M60m55L12n30L19J43j22K8q6N6m6J09o8j4p5J69
$$ -21 -48 142 116 -100 23 -387 -88 372 -83 229 -301 18 161 39 67 -19 37 -9 100 32 18 -57 112
7424A12k24P3J4N8Qj36lN0P5p0M8k0J9M8m4k8J1n4J97j19n6M1K3k5M4l7P9Lm7
$$ 112 -112 -39 -25 33 41 -95 -98 -48 27 -43 5 -15 4 52 8 -20 -9 -63 134 15 -41 0 23 -2 42 5 84 87 40
7453D0k0O4q6p7K6L8m6L4k8R1j6K6j02O0K3j02J20p8O9l0M1j01J17k6j4o3J13
$$ 40 20 84 -2 -79 -53 -15 -61 -27 -55 36 20 46 -56 4 27 -75 45 -33 36 6 47 -54 63 37 23 -40 73
7480G3j49K5R8p1K1j0N4j25R8l9K5QK8pj9p4K02k04K4R2j6o6rN4J5j2O7j13qJ17
$$ 73 -76 -51 47 -24 -3 -13 41 -84 14 -25 0 8 36 29 10 -64 138 -66 -42 50 34 -32 -41 13 28 16 83 -30 -38 79
7510G9j38P2r3R6o6k9L3M7qL0P2j07M1l1P0K7p5l1qm6PJ32k6l7J4p9n0L8J8o7
$$ 79 -59 13 -80 16 -50 -79 -46 1 -7 23 95 -12 29 -2 68 95 20 -11 -19 -65 -58 74 48 11 25 -54 -104 -66 -48 -115
7540a15Q3J8J3O9k1j02J18p4L4LK3j18J5R5oj57M1J50k8n3M1p0j5NR6L1r8L1O
$$ -115 -32 -14 -1 68 47 -55 63 -11 23 26 49 -69 -54 41 35 -122 -81 69 41 -12 29 -41 -56 -51 45 76 -22 9 15
7569A5Jml6K3m7NP3o0m6J32p4M8O0o6j42J07o6J3P6J5J3n9q1P3j8qJ00m5K1N3
$$ 15 16 12 -24 -1 -48 -43 30 -30 -76 56 -18 30 90 24 -118 -11 -77 -64 12 27 40 -19 -100 -27 -45 -53 47 2 23 76
7599G6k2j03J35r8J6j1M1p5LQ8p6l7J1l3J18k7m8M5N9J2q6N2n2l2R0j35J04p5
$$ 76 54 -49 86 -12 4 -7 34 -41 -38 50 -26 -63 -52 -85 33 6 -42 3 62 74 -12 40 -12 -44 46 -89 15 -60
7627f0J6o4J49L9K8o1m4N8q4J1N0K8j17J6N5L4m5O1l4j33J05N0q6O7Jj23J02K3
$$ -60 -44 -108 41 80 108 47 3 61 -23 -12 38 66 -51 -35 20 54 9 70 36 -97 8 58 -28 39 40 -83 19 42
7655D2j4q3N2k9J7L1k5k7o1P0l1K1mL1J4m7K9K5N3j01q5P7K8Q3p7k4Q7j09Q3n2
$$ 42 28 -55 -3 -32 -15 16 -9 -36 -97 -27 -58 -37 -41 -10 4 -43 -14 11 64 -37 -122 -45 -17 66 -11 -35 52 -57 26 -26
7685b6J9n0J07Rj65M2R5J0n1J0L1j6r2O9J56j86M5p2p8J43n6J50n5j7o9J11k9
$$ -26 -7 -57 50 59 -106 -64 31 41 -10 0 31 15 -77 -8 148 -38 7 -65 -143 0 -56 94 39 22 -47 64 35
7712C5mO4p3L6j10K0jN1O5l0Or0N2L5o9j27J80r2J88k08P0K8j4L1m4J6k1K1r3
$$ 35 31 95 22 58 -52 -32 -33 18 83 53 59 -31 21 56 -13 -140 40 -52 136 -72 -2 26 12 43 -1 15 -6 15 -78
7741g8O0P5o5R5j55P7m4m1M2o1M7J01j42O7l6N3L6j66J92r8N8p9M8Q9r1K4l2n
$$ -78 -18 57 -8 87 -68 9 -35 -76 -34 -95 -48 53 -89 -22 -58 -5 31 -135 57 -41 17 -62 -14 75 -16 8 -24 -29
7769b9RMO0j1J2m5J33j62j2R2K8J2p5Jl9n3O3p4J70r3%m0RK4Q6j13N4N1p7M6j5
$$ -29 -20 -16 44 33 45 0 133 -29 -41 51 79 91 16 17 -22 -75 -12 -86 84 -9 -9 -49 -40 -16 70 -43 11 62 -15 31 16
7800A6n0m9K41j48mO7l3J2j46J17j35J55l2n7PN9j3jNj54J83q5J77p9p9L5n3O8
$$ 16 -34 -83 158 10 6 73 40 52 -94 23 -112 43 11 -46 -39 20 7 6 11 -143 40 -45 132 53 -26 9 -44 24
7828B4q6J07j86J67L3qJ0l0j16K7J05n3J09r7Q0j04Q0lL2j76K2P0K2k6j6o9L6
$$ 24 -62 45 -141 26 59 51 61 31 -85 -58 47 -6 103 6 86 -18 62 59 91 -85 -63 7 29 3 -13 -82 -46
7855d6P1o8J03p8L4m1M8L7l6m3l0J6kL3J8P9o8o1k1N4pm1J7j3Q0KK2j70P6J07
$$ -46 25 -43 60 -18 16 -25 23 60 24 -19 -49 -33 -35 -2 16 95 27 -34 -55 -1 -8 -49 -32 -45 35 37 59 -111 -35 72
7885G2m8o5P4J7j00J19r2n0jJ55j24P0J4n1O9oj3M9j78O7q8RO3k7J53j91K01q5
$$ 72 24 -41 33 50 -50 69 -23 -73 -74 81 -43 27 41 -10 59 53 40 89 -89 -22 -110 -101 -38 -65 88 -103 98 13
7913A3L2L7j18j4K0K7O3Oj33J08k4M3o8p1N6J5L4m0m9P1L9k8Ln0K9P7q4oJ0J17
$$ 13 45 82 -36 -50 -30 -3 60 66 -67 41 17 60 -8 -79 -23 -8 26 -14 -63 8 47 19 22 -28 1 78 -6 -12 -2 115
7943A15p8o0J6m0Q7o1o9P1K5l6l2Q8O0o9k0P3n1l8J04l6p4J9m4L8J29j74L6k8
$$ 115 37 -23 -7 -47 40 -21 -90 -19 6 -30 -62 26 86 17 -3 70 19 -19 85 49 -25 -6 -50 -12 117 -57 -21 -49
7971d9K5m3N9Pm4L9j3QKK2j6qpl4K0M9M3J7m2m1o1L4J1l2L9Q7r6M0Km5l1Q2J2
$$ -49 -24 -67 -8 -1 -45 -6 -19 -11 -9 13 -3 -11 -18 -52 -32 17 60 77 35 -6 -67 -33 -22 -54 -15 72 -24 16 18 -27 -58 24 36
8004C6k5l4j9K4J3N4n5L6p8n2PQ5K0n5J29P1l15K4L91k19k05J2M27j83q6J65j92
$$ 36 11 -23 -42 -18 -5 49 -6 30 -48 -100 -93 -8 12 -43 86 157 -158 -134 257 38 -167 -155 272 89 3 168 -24
8031b4j29r8K69j05K23k24N57l45k99L98p0l89l8M22L14o83M97P0n66J046j328
$$ -24 -153 -251 18 -87 136 -88 469 124 -175 223 153 -236 -274 148 462 -221 276 346 -220 826 -502
8052e02P63K65q16L46J09n89Q8O14n80K72j59L14j01l41L36j2j45L59N5j87k4
$$ -502 261 526 -290 56 165 -424 -336 278 -302 -30 -189 125 24 -317 19 7 -138 221 276 89 65
8073F5j10j12L12l50L45l3k31J14R8K65n12jJ48n79j84O08M84k12k23l50J68Q7
$$ 65 -45 -157 155 -195 150 117 -114 0 98 363 -149 -150 -2 -581 -765 -157 327 115 -108 -458 -290 -203
8095b03K60k00j79L93m51Kl30R57L29n89l01L97M28p08L04m39J6P88k3p38j54
$$ -203 57 -143 -322 71 -380 -378 -708 249 578 -11 -312 85 513 -195 109 -330 -314 474 451 -287 -441
8116d41n5P59l99K67p05Q22m19j01k62L34k5J90Q0r17P07kj67O37m49J43L20m90
$$ -441 -496 263 -136 131 -574 248 -171 -272 -534 -200 -225 -35 45 -872 -165 -167 -334 303 -146 -3 317 -173
8138a73J16k91N05m03N99j90l48k4M17N68q51L0l90L91O8K30o00L55k01m6L17
$$ -173 -57 -348 157 -246 353 163 -185 -209 208 776 -75 -45 -435 -44 24 254 -346 9 -192 -238 79
8159G9l46K08l7K63j07l3J42l46K32o6J14K3j74J7N9qjM6k06J07O3k30L47k20
$$ 79 -267 -59 -96 167 60 27 169 -177 55 -11 103 126 -48 -31 28 20 19 65 -141 -34 29 -201 146 -74
8183g4n7J44m5K0J75l28K11N9
$$ -74 -131 13 -32 -12 163 -165 46 105
8191A05
$$ Imaginary data points
##PAGE= N=2
##DATA TABLE= (X++(I..I)), XYDATA
0@%%%%%%%%%%Qj6J6k4L2m0N6o5P3q9J13j37J61j92K25k65L09l58M12m74N44o19
$$ 0 0 0 0 0 0 0 0 0 0 0 8 -8 8 -16 16 -24 32 -33 40 -49 64 -73 88 -104 121 -144 165 -193 219 -255 289 -330
32c30P06q02R07j022J148j288J443j611J794j995K216k456K718l005L319l662
$$ -330 376 -426 481 -541 607 -681 762 -849 945 -1050 1166 -1290 1428 -1577 1742 -1920
48a920M037m449M899n396N947o558P241q007Q877r870J1012j2352J3944j5870
$$ -1920 2117 -2332 2567 -2829 3118 -3440 3801 -4206 4671 -5199 5813 -6539 7405 -8465
62h465J8261k1323K5404l1139L9854n4826Q7389k80905K50234M55748o23247k26954
$$ -8465 9796 -11527 13877 -17262 22592 -32234 55155 -225750 24484 480232 -143015 -369969
74c69969L80138J98716k35781j3606K3741r4045J16249K80620k48491l80736L06574
$$ -369969 10169 208885 -26896 -40502 -16761 -110806 5443 286063 37572 -343164 -36590
85c6590M90070l38485m95257L13076M51761k66778l13971J64482J49248o7558
$$ -36590 453480 114995 -380262 -67186 384575 117797 -196174 -31692 117556 49998
95D9998K2893l3550j82492P1585L12714r7395m15779P8910M57160p3166m43868
$$ 49998 72891 39341 -143151 -71566 241148 143753 -272026 -193116 264044 190878 -252990
106b52990M6494L58893l9988k28168K7086O1422k1621J02272J6350k25069k2411
$$ -252990 -206496 152397 112409 -115759 -88673 -27251 -48872 53400 69750 -155319 -177730
117a77730L04298N5013l31731q0470L34282J00335k83904p9496K08128N1611r8344
$$ -177730 126568 181581 -150150 -230620 103662 203997 -79907 -159403 48725 100336 1992
128A992M517q169n5086J15909J03152j87606j30002K20043J45359k12309j52843
$$ 1992 6509 -1660 -56746 59163 162315 -25291 -155293 64750 210109 -2200 -155043
139a55043J75304J37929j37968j03452Q1928L5364l2638L2825k7857j04919O8759
$$ -155043 20261 158190 20222 -83230 -1302 34062 1424 34249 6392 -98527 -29768
150b9768J49977j04451j75657J09507J69881r8710j45638P0410J07486m0648n9285
$$ -29768 120209 15758 -159899 -50392 119489 20779 -124859 -54449 53037 12389 -46896
161d6896K4692M474j2052O2852O808j13256Q466J49842j4611j51956K4470J38377
$$ -46896 -22204 -17730 -29782 33070 39878 -73378 -64912 84930 70319 -81637 -57167 81210
173H1210k2977r9339K3358N8334j9041j4597K1189k2397l0551N5233L9186q6510
$$ 81210 58233 -41106 -17748 40586 21545 6948 28137 5740 -24811 30422 69608 -16902
185a6902m3565J02313L1287j06728j7546Q6478l405o2470J5487K8682k9501l609
$$ -16902 -60467 41846 73133 -33595 -51141 35337 31932 -30538 -15051 13631 -15870 -19479
197a9479L5956j8797m4857L1926M9730m4000m9015N4062M0244n8989j7919N8538
$$ -19479 16477 -2320 -47177 -15251 34479 -9521 -58536 -4474 35770 -23219 -41138 17400
209A7400l708m5046K6305L2358l5880j5095M3692M728m1306O655L9166j4363l1792
$$ 17400 13692 -31354 -5049 27309 -8571 -23666 20026 24754 -16552 -9897 29269 14906 -16886
222a6886K6154K3886l8627j0751M8701o542n1917J9354M4425k8391l4386K6637
$$ -16886 9268 33154 -5473 -16224 32477 25935 -25982 -6628 37797 9406 -24980 1657
234A657J8353k3934n535J6040j1040j2697K3858Q415l8976p572M9990M380n5645
$$ 1657 20010 -3924 -9459 6581 -4459 -17156 6702 15117 -23859 -31431 18559 22939 -32706
247c2706J3N1490l464l6734N358J8124l299L018M669j9016o197L4457J2865m2564
$$ -32706 -32693 18797 15333 -21401 -16043 2081 -1218 1800 6469 -12547 -18744 15713 28578 -13986
261a3986j7940M8228K3144m5563k2817L7984J8305k2473r888K714N57J5733Q065
$$ -13986 -31926 16302 39446 -6117 -28934 9050 27355 4882 -5006 -2292 -1735 13998 22063
274B2063l0193j8187L6421K6198l7974l4466L2281L6422k4980l3981J3117K3838
$$ 22063 -8130 -26317 10104 36302 -1672 -36138 -3857 32565 7585 -26396 -13279 10559
286A0559j620q863j1647q512K2126K3338k7429l4345K6505M0975j9001m2066J0111
$$ 10559 8939 76 -11571 -20083 2043 25381 -2048 -36393 -9888 31087 12086 -29980 -19869
299a9869L8256P36k7470q580J3352J4273N179j5674k2077J5200L6310j1973m2512
$$ -19869 18387 19123 -8347 -16927 -3575 10698 15877 203 -21874 -6674 29636 17663 -24849
312b4849N094M2392K429l5263j0148K3137J5993r791j7011n739J2649J9956o189
$$ -24849 -19755 22637 25066 -10197 -20345 2792 18785 8994 -8017 -13756 -1107 18849 12660
325A2660l2099k125L7947R500l7913j6321L1102J9863j9322k0976M983J8537Q593
$$ 12660 -19439 -21564 16383 25883 -12030 -28351 2751 22614 3292 -17684 -12701 5836 14429
338A4429j2068j9662K795K7226P832k9385j7696K8463K4463k2524k5850J2757
$$ 14429 2361 -17301 -14506 12720 20552 -8833 -26529 1934 26397 3873 -21977 -9220
350i220K3538j153j7050r383Q327J7805K072k2633j1123K1209K1058j9119k6060
$$ -9220 14318 13165 -3885 -13268 -4941 12864 14936 -7697 -18820 2389 23447 4328 -21732
363b1732J2576K7186m638k3938l567J7409R105o748j5133l166J6389J3265j4817
$$ -21732 -9156 18030 13392 -10546 -14113 3296 12401 5653 -9480 -12646 3743 17008 2191
376B191k0770J0509K5008m960k4875j856K1686P696j5289j0737N865J2353L633
$$ 2191 -18579 -8070 16938 11978 -12897 -14753 6933 14629 -660 -11397 -5532 6821 10454
389A0454j1182j2616P914J9219m111k1263j262K0493O401j7270r421J1381J0442
$$ 10454 -728 -13344 -5430 13789 9678 -11585 -12847 7646 14047 -3223 -12644 -1263 9179
402I179l818r738l397P246R453l342j3709j551J5767N125j5042p972J2405R452
$$ 9179 5361 -4377 -7774 -528 8925 5583 -8126 -9677 6090 11215 -3827 -11799 606 10058
416A0058p622r091J682Q083K824m749o965L06J0090L523j0095p323R457R691p821
$$ 10058 2436 -6655 -4973 3110 5934 1185 -5780 -5474 4616 8139 -1956 -9279 178 9869 2048
431B048r106L902Q134o33n775k434J986M759J311n885m294N437O696m445p922
$$ 2048 -7058 -3156 4978 4345 -1430 -3864 -1878 2881 4192 -1693 -5987 -550 6146 1701 -6221
446f221K678Q181j649o171m99M171J813j330k449j498K620M253k262n761J473
$$ -6221 -3543 4638 2989 -3182 -3681 490 2303 973 -1476 -2974 -354 3899 1637 -4124 -2651
461b651O603k39o461q5M499J147k736j059M90J020J221p17k870L23L481R66m734
$$ -2651 3952 3713 -2748 -2833 1666 2813 77 -982 -492 528 1749 1032 -1838 -1515 1966 2932 -1802
478a802j098M548Q02k976j531K528J003p54m47j727L10J394K408l798r52J808
$$ -1802 -2900 1648 2450 -526 -2057 471 1474 720 273 -1454 -1144 250 2658 -1140 -2092 -284
494b84J456k416q77K212M37p58k74k51l03O81J908m88j240K70J880j992j029R99
$$ -284 1172 -1244 -2121 91 528 -230 -504 -755 -1058 -377 1531 1043 -197 73 1953 -39 -1068 -69
512f9J362j315o57J308l34j837J968M10r48o10J044P90j713j79J211N34j384j96
$$ -69 1293 -22 -679 629 295 -1542 426 836 -112 -722 322 1112 -601 -780 431 965 -419 -615
530f15J047j794n25K888q23p97n37K037n52o34k93O25L11m69J41j28N0J022q0
$$ -615 432 -1362 -1887 1001 178 -619 -1156 881 329 -305 -598 27 338 -131 10 -118 -68 954 874
549H74j855q8K186P02k263k31J405M74p91n13q83J345M34k53p97m98J438L92j420
$$ 874 -981 -1069 1117 1819 -444 -675 730 1204 413 -100 -983 362 796 543 -254 -752 686 1078 -342
568c42j124J838J371j828p75N65J193m13p46o05M42P45O05j858k29J881P78j666
$$ -342 -1466 372 1743 -85 -860 -295 898 485 -261 -866 -424 321 926 -932 -1161 720 1498 -168
586a68j464Q32K035q48l30p24R98R1o49k71k37J283R49j873o47P68J775j025j141
$$ -168 -1632 -800 1235 387 57 -667 331 422 -227 -498 -735 548 1497 -376 -1023 -255 1520 495 -646
605f46J67Q90M68q30j95k39R16k14j58j094O30J293p50j317J97J334K66j334m24
$$ -646 -479 411 879 49 -146 -385 531 317 159 -935 -305 988 238 -1079 -882 452 718 -616 -1040
624a040Q42N36p0o49j75K50R67l99q06k67J398J99j291m34J025N84n76o02L00
$$ -1040 -198 338 268 -381 -556 -306 661 262 -544 -811 587 786 -505 -939 86 670 94 -508 -208
643b08M18M27k64o95j33R30L09r99n44R60O17p45n72K51O53r8l68l14J76M77J60
$$ -208 210 637 373 -322 -455 475 784 -215 -759 201 818 73 -499 -248 405 307 -61 -375 -199 278 438
664D38p66l24N88O70o15p20M60O97k00n55N5K25K68j37k19k28M41L88l27o34J88
$$ 438 -328 -652 -64 606 -9 -729 -269 428 228 -327 -272 -47 221 84 -135 -363 78 466 139 -495 -307
685c07Q66k23o13M6M28M5k52j8k5J29L43l41l18J9N22j27m45%N45k1l50q2J47
$$ -307 559 336 -277 -231 197 242 -10 -28 -53 76 419 78 -240 -221 301 174 -271 -271 274 253 -97 -179 -32
708c2O0k3p2r7L9K86J08n65J6L79R9l12j23L03N1j47l1%J10J1K3j59n7J77J35
$$ -32 28 5 -67 -164 -125 161 269 -296 -280 99 198 -114 -237 66 117 -30 -61 -61 49 60 83 -76 -133 44 179
733A79j78k90M35O7j17j68J81K2r9n7N4j42M8K55j54j37P2J56r9j98K21J07j21
$$ 179 1 -289 146 213 96 -72 109 131 32 -25 29 -113 -65 190 36 -101 -29 127 28 -170 51 158 37
756C7j18J33o3p6J15j8j3j33K09k2q5J2L1L2r4J07N4j94J32p8J83k48P4J13j08
$$ 37 -81 52 -11 -87 28 10 -3 -136 73 51 -34 -22 9 41 -53 54 108 -86 46 -32 151 -97 -23 90 -18
781a8JJ22k2k08P8k3J69l41K20l0N3N0%k0j86L4J70j75O6J65j78J42j29K04R3
$$ -18 -17 105 83 -125 -47 -70 99 -242 -22 -52 1 51 51 31 -155 -121 49 -126 -60 105 -73 69 -60 144 237
806B37j91r1K51j40m37N32J49m05L21j58K3k00m8J76O9L01m16k42Q8K26J65o70
$$ 237 46 -45 206 66 -371 161 310 -95 226 68 91 -109 -157 19 88 389 -27 -269 -181 45 210 -460
828d60O29j45k20K14K0K75o69j67L93m0L18k54jQ3m15K80J254j99q22R6j64J08
$$ -460 169 24 -196 18 38 313 -356 -523 -130 -170 148 -106 -107 -24 -439 -159 1095 896 74 170 6 114
850A14J64K55l77o61N06L11q7m16O41l63p8L34j96j57K59om83K07J9j3N0o3n3
$$ 114 278 533 156 -505 1 312 225 -191 450 87 9 343 147 -10 249 243 -240 -33 -14 -27 23 -40 -93
873i3Q7O8j03J01N7j76P2K2l2r9J36m2n1mN4N8p3KO8q2L0O6o0l9J4K4l2O7l9l
$$ -93 -6 62 -41 60 117 -59 13 35 3 -96 40 -2 -53 -57 -3 55 -18 -16 52 -30 0 66 6 -33 -19 5 -27 40 1 -2
903bn0M6N0o3M3j3Jn8J7M2L6j5j02J21o6m2M9J20j16k5oN2l5nJ02k8j17J15n2
$$ -2 -52 -6 44 -19 24 11 12 -46 -29 13 49 34 -68 53 -13 -55 -6 114 -2 -27 -33 19 -16 -21 81 53 -64 51 -1
932aq4J39l0R8q4r9L2k9J23j12P3n7j3P%r3K01NRq5JLk3j30M9J21K3l8kJ9j4n1
$$ -1 -85 54 24 122 38 -61 -29 -58 65 -47 26 -31 -44 -37 -37 -130 71 76 85 0 1 4 -19 -149 -100 21 44 6 4 23 9 -42
964d2O9m1j6K1n9M1Q8r4n8O5J4kJ8Q0m1q5N0n4K3J01o6J3K0q2kO8M9j27L8j9J20
$$ -42 27 -14 -30 -9 -68 -27 61 -33 -91 -26 -12 -14 4 84 43 -42 8 -46 -23 78 12 25 45 -37 -39 29 78 -49 -11 -30 90
995I0p0Q6j31Q2m0o3l9Q9R6p8m1n3K2L3J5O9q9p2J14q3J26N5j65R4m8K4K6l7P1
$$ 90 20 106 -25 57 17 -46 -85 4 100 22 -19 -72 -50 -17 -2 67 -22 -94 20 -63 63 118 -47 47 -1 23 49 12 83
1024H3m3n6M6K9j17Q6n2O3j9Nn5qJ02j24J9P2j01Q6m0l0m3R7k0n5P2L0J7%k9J5
$$ 83 40 -16 30 59 -58 28 -24 39 20 25 -30 -38 64 -60 -41 31 -70 16 -24 -54 -97 0 -20 -75 -3 27 44 44 15 30
1054C0j0l2l6L4o2J43K8r8k7K2j7R0K5L7l0k28N6N5K13k80M2M6M3J17r4K74m90
$$ 30 20 -12 -48 -14 -76 67 95 -3 -30 -8 -25 65 90 127 97 -131 -75 -20 193 -87 -45 1 44 161 67 341 -149
1081a49k36N83J8l01L65k09j8N4l13j40K98N02o95M91l95l42M45J91K5r7m05N15
$$ -149 -385 198 216 -85 280 71 53 107 -206 -346 -48 454 -241 250 -145 -487 -42 149 174 77 -328 187
1103A87J49n38J98K07l30J30K4k61J43N6k8%J12j54K9J27n5l0qJ8n0m6J09M6j61
$$ 187 336 -202 -4 203 -127 3 27 -234 -91 -35 -63 -63 49 -105 -76 51 -4 -34 -42 -24 -74 -120 -11 35 -126
1128a26J66q1R2Nj69J38n7O4n4k2J04K2p2M5k3J0j07R6K6N2j74O5L26j93j38l60
$$ -126 40 -41 51 56 -113 25 -32 32 -22 -44 60 82 10 55 32 42 -65 31 57 109 -65 0 326 133 -5 -365
1154c65P12m78n69J169l63m1o75N73j12j53K86k6m29O92j51j30o9L33r3l47j07
$$ -365 347 -131 -700 469 106 65 -610 -37 -149 -302 -16 -42 -471 221 70 -60 -129 204 111 -236 -343
1175c43J0J06K19l76Q1O62o11J77N4J84l54K19n5k3k46K73J23j6L4M8j24j12Q1
$$ -343 -333 -227 -8 -384 -303 359 -252 -75 -21 163 -191 28 -27 -50 -296 -23 100 84 118 166 42 -70 11
1198A1j49K74j31j31P5j1J10m7p3J71k77K64j13o0P3q5kj2K62r3k36J69q1O2K08
$$ 11 -138 136 5 -126 -51 -62 48 1 -72 99 -178 86 -27 -87 -14 -99 -101 -113 149 56 -180 -11 -92 -30 178
1223A78k95M38m99J40P5m0k03J36p8K16j64J07K8m7K21j42j00N6k05J00K12k08
$$ 178 -117 321 -178 -38 37 -3 -206 -70 -148 68 -96 11 39 -8 213 71 -29 27 -178 -78 134 -74
1245g4J87k31M55j91j48k44L14j71K34J2n92R98p29O66k82n58N30Q2j87m9K27
$$ -74 113 -118 337 146 -2 -246 68 -103 131 143 -449 549 -180 486 204 -354 176 258 71 22 249
1266B49j92k23l5N3J17J74q9j83K97L9l57K16ll5lj77L43l97O44L1o90K14l2R8
$$ 249 57 -166 -201 -148 -31 143 54 -129 168 207 -150 66 63 28 25 -152 191 -206 438 469 -221 -7 -39 59
1290E9j12k16P11l98m52J99K69J83l09k88L83l5L42Mn87J12j67N2N78r2m3l77
$$ 59 -53 -269 442 44 -408 -209 60 243 -66 -354 29 -6 336 340 -247 -135 -302 -250 328 236 193 -184
1312a84j38L44M4j97P2J07J14q3k5POk30J08O06o65M66j31L97o93J35J48k63P6
$$ -184 -322 22 66 -131 -59 48 162 79 54 61 67 -163 -55 551 -114 352 221 618 -75 60 208 -55 21
1335B1j23l1m05K45K57j17K36p8n3P6l8oO2l0k8L4rM7Or5j2P4L8j11L7m2pO4k
$$ 21 -102 -133 -538 -293 -36 -153 83 5 -48 28 -10 -16 46 16 -12 22 13 60 66 -29 -41 33 71 -40 -3 -45 -52 12 10
1364A0M1j7p6Q3l8N7o6m8J45J5r3pnk0lj7J38m5m3Op1P6k0ln3O0oJ22q6Po7Kn
$$ 10 51 34 -42 41 3 60 -6 -54 91 106 13 6 1 -19 -22 -39 99 54 11 17 -54 22 2 -1 -54 6 0 122 36 43 -24 -22 -27
1397b7P1p5M9QM6j66J47K7o3RK3j14K8o5Q7L5q6O9r5Q9Pk6p0J30p7J34n1n1N4
$$ -27 44 -31 18 26 72 -94 53 80 17 26 49 -65 -37 -102 -15 20 -66 3 -92 -3 4 -22 -92 38 -39 95 44 -7 47
1426D7m8j8J4n8O8nk7J0KL2lJ4K3q0ppk0R6j8k2k7J54o5o3O0j02O9l5o7R9K1l2
$$ 47 -1 -19 -5 -63 5 0 -27 -17 -15 17 14 28 51 -29 -36 -43 -63 33 15 -7 -34 120 55 -8 52 -50 19 -16 -83 16 37 5
1458EJ1j25J73p1M6nn3KqJ5r0J50l2K3j0l9l7O6rM4j68O1J20j08J31j41M4M4l7
$$ 5 16 -109 64 -7 39 34 -19 -17 -25 -10 -100 50 18 41 31 -8 -45 21 12 56 -112 -51 69 -39 92 -49 -5 39 2
1487BJ0n0Q6qj15J10j0Nj09N1N1o3M7n0J0RL3lQn0k2O2l8J14k0o0l2M1kL2m1o8
$$ 2 12 -38 48 40 -75 35 25 30 -79 -28 23 -40 7 -43 -33 -24 9 6 14 -36 -58 4 -34 80 60 0 -32 9 7 39 -2 -70
1519g0R9m5J6L5r4j1N1n7J10O4p2Q1j58N1l8P8J1r5O1Mm6N4j6q3K1L9o1J5L5j14
$$ -70 29 -16 0 35 -59 -70 -19 -76 34 98 26 107 -51 0 -38 40 51 -44 17 21 -25 29 13 -70 -49 -10 -71 -56 -21 -135
1549a35J74j37J62q1o7J1K3P8m2P1r4J4M1n4j6J1m8K4J3k6l3N7J28p6Ll8p7J55
$$ -135 39 -98 64 -17 -84 -73 -50 28 -14 57 -37 -23 18 -36 -52 -41 -89 -65 -52 -78 -111 -54 74 -2 1 -37 -114 41
1577D1m1Qp6N4L7j10M1j4o5M9j7O4N6J5l4Kj28M5Nl0J00O0k1K5j32O0L5l7j8n4
$$ 41 0 8 -68 -14 23 -87 -46 -60 -125 -76 -93 -29 27 42 8 10 -118 -73 -68 -98 2 62 41 66 -66 -6 29 -8 -26 -80
1607h0R5m3J7j8k4Q6l0k8M5k8J0K4q9J17p9m9J09J0l1j0O2q5Q9j20P5j51J63o3
$$ -80 15 -28 -11 -29 -53 33 3 -25 20 -8 2 26 -63 54 -25 -74 35 45 14 4 66 -19 70 -50 25 -126 37 -26
1635b6n5J42j45R5L4q0M9J8K7j07N3J02j22j2k1n0J50om1PR0p6LL4m0j7o4J04
$$ -26 -81 61 -84 11 45 -35 14 32 59 -48 5 107 -15 -27 -48 -98 52 46 5 12 102 26 29 63 23 6 -58 46
1663D6p0K8J1k0L0n5K7om4O7lN2m6o6J01j47M2k4M5n4Q3jnL7PJ6j03J1Q1lo9J07
$$ 46 -24 4 15 -5 25 -30 -3 -9 -53 14 11 63 17 -49 52 -95 -53 -77 -32 -86 -3 -4 -9 28 35 51 -52 -41 40 37 -32 75
1695G5l8m2j8RO8p0J7o5p3J38J0n9J19k02M6P1O5K0J0j11L5j3J1Q2j09Q4J9o0
$$ 75 37 -5 -23 -14 54 -16 1 -64 -137 1 11 -48 71 -131 -85 -14 51 71 81 -30 5 -8 3 85 -24 60 79 19
1723A9ql8N5K5l3m0J51j01%M0j21mP2k9N5j01M9L0q9j5J15k6K0l3L1K9Nj41M1
$$ 19 11 -27 28 53 20 -20 131 30 30 70 -51 -55 17 -12 43 -58 -9 21 -68 -83 32 6 26 -7 24 53 58 -83 -42
1752d2J3pR8j30M4M2l4M9mP8q1N2Pj63J21o5k6NQ6k2Lp0J43r5j3N7M2j33j0O2
$$ -42 -29 -36 62 -68 -24 18 -16 33 29 107 26 78 85 -78 43 -22 -48 -43 43 21 24 -46 97 2 -11 46 88 -45 -55 7
1782Gn3O8K6p9L1l5j2P0j28J14kl0QK4n3R5l6m9k1O9Nq0O1K4l6N3m0O5m9q6l1
$$ 7 -46 22 48 -31 0 -35 -47 23 -105 9 7 -23 -15 9 -44 51 15 -34 -55 14 19 -61 0 24 -12 41 1 66 17 -69 -100
1813a00J10j48J86q0l8n9M48m2l65Q4K7J1nP0j06KQl6j1L0kJ02j52J07J5nO5m0
$$ -100 10 -138 48 -32 -70 -129 319 277 -88 -4 23 34 29 99 -7 -5 3 -33 -44 -14 -16 86 -66 41 56 51 116 76
1841G6q2OK9M2m7m1O4n9M2j9J0l8K2ml5M6Kq6O4nL8m2j3j5j3L2R6j51N5M5r7J0
$$ 76 -6 0 29 71 24 -17 47 -12 30 11 21 -17 5 1 -34 12 14 -72 -8 -13 25 -17 -30 -45 -58 -26 70 -81 -26 19 -78 -68
1873f8J53j15j6M9J0m2M0J3%j3l3m4O9j9n6K2L5L2NlJ8JJ8o1L2L0o0k0M7ML4r6
$$ -68 85 -30 -46 3 13 -29 11 24 24 11 -22 -66 3 -16 -72 -50 -15 17 22 19 37 38 56 -5 27 57 -3 -23 24 28 62 -34
1905c4O6lj1Ql2K5j4p8M5j2J51j25R7j42KL1O5o0P8p7J11j4p7J6m1L7o9L9M7n
$$ -34 32 29 18 26 -6 19 5 -73 -28 -40 111 -14 83 -59 -57 -26 39 -21 57 -20 91 77 0 16 -25 12 -57 -18 29 24
1935B4n6J27r4K2L7j32O2P6m3K6l1j9M5k0N2Jpj52K4J03pnL3j11Lj5j8J44q2r
$$ 24 -32 95 1 23 60 -72 -10 66 23 49 18 -1 44 24 76 77 70 -82 -58 45 38 33 66 -45 -42 -57 -75 69 -13 -22
1965b2lM6n4M6q1J54l9l2l6M9j0l9M2j29Q7m6O2k9L3P3j2p6J8K05j84p5LOM8p2
$$ -22 -25 21 -33 13 -68 86 47 15 -21 28 18 -21 21 -108 -21 -67 -5 -34 -1 72 60 -16 2 207 23 -52 -49 -43 5 -67
1995f7Q9M8j5q5K2N6K5l0o3L8j22J08N0j02N5J27j25j5n9O1j7N1O4j3k8j35J69
$$ -67 22 70 55 -30 -8 48 73 43 -20 18 -104 4 54 -48 7 134 9 -6 -65 -4 -21 30 94 81 53 -82 87
2022H7j24O4k1P8n4j8J16k05m8K09q2l5k1Q6m5k4M3J01n8J4K8n8J17j55L1K2n
$$ 87 -37 27 6 84 30 12 128 -77 -125 84 2 -33 -54 32 -13 -37 6 107 49 63 91 33 150 -5 26 48 43
2049D3L6m7j1n4J10j8N6J44l03N0%j5j81O0J06L5K44k41j61K38n4J02j50k10R2
$$ 43 79 32 21 -33 77 59 115 259 -44 6 6 -9 -190 -130 -24 11 255 14 -147 91 37 139 -11 -221 -129
2074a29J08q9J26q5J10m1P0L6j52J61k26K17l79K39j33p5N75k8l56k09L60l79
$$ -129 -21 -110 16 -69 41 0 70 106 -46 115 -111 106 -273 -34 -167 -242 333 305 -51 -260 100 -279
2096b79L55J47k13OL5J24j35j08R7n0L9n5r2J56j99J53o7o3J99J80l21K36j9k14
$$ -279 76 223 10 16 51 175 40 -68 29 -21 18 -37 -129 27 -172 -19 -86 -149 50 230 -91 145 126 -88
2120h8R9Q2m96K50N09j57k54J25R8l37K28l12q9k54O77j92L30m67J98L1j55J68
$$ -88 11 93 -403 -153 356 199 -55 70 168 -169 59 -253 -342 -596 81 -111 219 -248 -50 -19 -174 -6
2142fM79n62Q4K27l74J72j84K77k46m80O56L92r35N64j39J20nK79l06N36k58j21
$$ -6 473 -89 -5 222 -152 20 -164 113 -133 -613 43 435 -500 64 -75 45 40 319 13 549 291 170
2164A70q1Q6J8j14N2j06r3k66L20j19P7O8j57J22J18k10J61j35Q3O5p9j70J28
$$ 170 89 175 193 79 131 25 -68 -334 -14 -133 -56 12 -145 -23 95 -115 46 -89 -6 59 -20 -190 -62
2187f2R3m9mK8K6Po1J23k9Nj6J0j28J88J48m01J64P9o4K15l35j35Q9j28K32J80
$$ -62 31 -18 -22 6 32 39 -22 101 72 77 61 71 -57 131 279 -122 42 121 57 272 -63 -198 -109 -237 -5 175
2213A75o82J150o51L4m22R9N10l19k0o0l96N83j68N39l46J52m36l22R66m58K81
$$ 175 -507 643 -8 26 -396 -297 213 -106 -126 -186 -582 1 -167 372 26 178 -258 -580 386 -72 209
2234B09pm55K88P3j61K30m3M1r8j53K0J35l6j00RL9Ll4N8j11J7J12k0N3j05N4
$$ 209 202 -253 35 108 -53 177 134 175 77 -76 -56 79 43 -57 -48 -9 -6 -40 18 -93 -76 36 16 69 -36 18
2260A8J33j77M5j01R8o1L0k9j9J06p8J44j14K0J50j94j00J33L6n9M6k4j3mO1l6
$$ 18 151 -26 19 -82 16 -45 -15 -44 -63 43 -35 109 -5 15 165 -29 -129 4 40 -19 27 3 -10 -14 47 11
2286A1r8J1J5R3n2n1J64o4O2k09J66j88O9J32l72J35K84K45j43o0R1m13L76k95
$$ 11 -87 -76 -61 32 -20 -71 93 29 91 -118 48 -140 -71 61 -311 -176 108 353 210 150 241 -172 204 -91
2310i1J46Kr07J371j96Q7J83l69M44n72J71n90N2M03k88L01P9K4n93J99J57J11
$$ -91 55 57 -850 521 325 412 595 226 670 98 269 -321 -269 134 -154 147 226 250 -343 -144 13 124
2332A24K07j45r4O4K3j08l3l49M86Q6k72K20l1l43R4K73j80N0j20N3K6r1J71j38
$$ 124 331 186 92 156 179 71 38 -311 175 261 -11 209 178 -165 -71 202 22 72 -48 5 31 -60 111 -27
2356b7K75m65L43r3J71k63rK27j79k60P0J46j6J28j67K22N0n6m7j12Q9L3nl5%
$$ -27 248 -217 126 33 204 -59 -68 159 -20 -280 -210 -64 -80 48 -119 103 153 97 50 -62 27 60 55 20 20
2381B0n8J32J7J08j62j0l8j36K05m8N7j55J35l6n6J34P8m6k52K64q8k7o8l8M8
$$ 20 -38 94 111 219 57 47 9 -127 78 30 87 -68 67 31 -25 109 187 141 -111 153 65 38 -30 -68 -20
2406b0m8K56k26L4o4O7N6l1L6k26J23O8l0J82m59K98NJ8J0k2J21j58o1Q0J21M5
$$ -20 -68 188 -38 -4 -68 -1 55 24 60 -166 -43 25 -5 177 -282 16 21 39 49 27 148 -10 -71 9 130 175
2432A75j94j40N4L4L43j55r7J45l7k50K40j09J08m61N06j11l36M12k42k1j9M23
$$ 175 -19 -159 -105 -71 272 117 20 165 128 -122 118 9 117 -344 162 51 -285 127 -115 -136 -155 268
2454B68m67K64j99J1J85Nj54N53p87L83J64l27R3q1m3L67n40J86r4m3L22J05j92
$$ 268 -199 65 -134 -123 62 67 -87 466 -321 62 226 -101 -8 -89 -132 235 -305 -119 -213 -256 66 171 -21
2477b1N7m8j54K96n2J10m48K69k38J76k47J68J52l9j60N7K8N2N0J81j26j17m2
$$ -21 36 -12 -166 130 78 188 -260 9 -229 -53 -300 -132 20 -19 -179 -122 -94 -42 8 189 63 -54 -96
2500i6K33l66J20K72p1r7q1p4P1R8K01l21Q0L2O7jm4J8n3n6K1J16j56J17l9o5
$$ -96 137 -229 -109 163 92 -5 -86 -160 -89 9 210 -111 -31 1 68 67 23 41 -12 -68 -47 69 -87 30 -9 -74
2526g4O2j1QQ6q7oQPk0k2%m5Q1P7l1j1q4J2Q0k4N3p0P2K0j17R7r4J08r3l9J40
$$ -74 -12 -23 -15 71 -16 -22 -14 -7 -27 -49 -49 -94 -13 64 33 22 -62 -50 30 6 59 -11 61 81 -36 61 -33 75 -18 -57 83
2557H3j33J1Mj5J58r0q1O9R7j48l9Q9M9J0r6m1P5Qr0Q5L2L0j01J4M3o2J15j15
$$ 83 -50 -39 -35 -50 108 18 -63 6 103 -45 -84 5 54 64 -32 -73 2 10 -80 5 37 67 -34 -20 23 -39 76 -39
2585c9l1J7K4P9j37J59j23J31j44J79n5j13J53r9j1K3K4j4JN1j32N9o3O5M5m9
$$ -39 -70 -53 -29 50 -87 72 -51 80 -64 115 60 -53 100 1 -10 13 37 23 24 75 -57 2 -61 4 49 0
2611@q4J17J2n6j8Q9n7nP0o7j7O2j19R1o2J16o4qQ6l1j28J05L0j37R8m5l0lnN0
$$ 0 -84 33 45 -11 -29 60 3 -2 68 1 -16 46 -73 18 -44 72 8 0 86 55 -73 32 62 -75 23 -22 -52 -55 -60 -10
2641a0l7Q7j4O2m8j30J50k1K0j8oP3p8j10L1J53oj63O6J43j80J46P5k04J8j7M7
$$ -10 -47 40 26 88 40 -90 60 39 59 41 35 108 30 -80 -49 104 98 -65 1 144 -36 110 185 -19 -1 -18 29
2668B9L2j21Q0Mk4N2r6j2J18m3K8j20J26l4k5L1K2ml9J36j46O0j00O4q2R8p5j7
$$ 29 61 -60 20 24 0 52 -44 -56 62 19 47 -73 53 19 -6 25 47 43 4 140 -6 54 -46 18 -64 34 -41 -58
2696e8J41j49K1Q6m8r3R1rJ5OJ7k6J2N6l0k8k8M9lo4J01j26P0lJ3J8j07J13j5
$$ -58 83 -66 -45 41 -7 -100 -9 -18 -3 3 20 -6 6 62 32 4 -24 25 22 -42 59 -67 3 0 13 31 -76 37 22
2725B2L1r7J33n9j28J60j18J07o0L1pn4J5j7J29Kj85J0NJ30l2jk9K6m2k1j0J0
$$ 22 53 -44 89 30 -98 62 -56 51 -9 22 15 -39 -24 -41 88 90 -95 -85 -80 50 18 17 -12 14 -28 -49 -59 -49
2753d9R0o1o9J04M3k1k0Jj2PL4j1N5q4l0R6o9K3k5Q5j08j5K0N1Q4r0lp2O7k9P7
$$ -49 41 -20 -89 15 58 37 17 18 6 13 47 36 91 7 -23 73 4 27 2 87 -21 -36 -16 35 119 29 26 -46 21 -8 69
2784F9j08m1Q5K0k6J24j64M9m6P6j4q1K8J27q1M3o3lk5J23p4J5Qr0P1R7o0n0J1
$$ 69 -39 -80 5 25 -1 123 -41 8 -38 38 24 -57 -29 98 17 60 -3 -6 -31 92 18 33 41 -49 22 119 59 9 20
2813B0r8L7L1ok3L3M7n8r0J24o9J12q1K9P3O1j06qo7k4J2N7O5m0j5Q8k2q0N3j50
$$ 20 -78 -41 -10 -16 -39 -6 41 -17 -107 17 -52 60 -21 8 81 142 36 28 -39 -63 -51 6 71 31 16 104 82 2 55 -95
2843i5J08l1p0J4N7j9K3M4pl4Q5N3j98Q0L4J8r6l2l1J21L7j34Q2L0j6K4Qj31O6
$$ -95 13 -18 -88 -74 -17 -36 -13 31 24 -10 75 128 -70 10 44 62 -34 -66 -97 24 61 -73 9 39 23 47 55 -76 -10
2872a0l5K07j57L3J8q5R6P9k01L02l68M07o2m43K06O5k02K14k07k5Oj4L31j32
$$ -10 -45 162 5 38 56 -29 67 146 -55 247 -121 286 224 -219 -13 52 -150 64 -143 -168 -162 -176 155 23
2896B3J09J24m31R2m7L09J71m04L38n3J29k34J81N52k32j101M55l19K57j26M05
$$ 23 132 256 -175 -83 -130 179 350 -54 284 231 360 126 307 859 627 -474 -19 -338 -81 -207 198
2917A98m56K97k79Q6K27p0J4n1M6m8QJl7N8Q9j47n0Q3R3o1pR1jl9m9j41K51q6
$$ 198 -258 39 -240 -154 73 3 17 -34 12 -36 -28 -27 -64 -6 83 -64 -114 -31 62 1 -6 85 84 45 -4 -145 106 20
2945B0Pj18J24r7q5J23OK5Lj7p1Q9l8J9N3j8k6k0kL5Qj3l7J72k13K5J18j27J65
$$ 20 27 -91 33 -64 -149 -26 -20 5 8 -9 -80 9 -29 -10 43 25 -1 -21 -23 12 20 7 -30 142 -71 -46 72 -55 110
2974A10Jj17j48q9J91K0l7O9k13L17J92k37m10L27J69j82l67p0R43l76P7l32J55
$$ 110 111 -6 -154 -243 -52 -32 -69 0 -213 104 296 59 -351 -24 145 -37 -404 -474 469 93 170 -162 -7
2997gM33l63r0M40q99L08p1K12l59K31K41j9K7k03K01k22J9J89k10Q0O7k5J7P7
$$ -7 426 63 -27 413 -486 -178 -249 -37 -396 -165 76 57 84 -119 82 -140 -121 68 -142 -62 5 -20 -3 74
3021G4p9jM5o7M5q1J21j56J52K0j07p7J82p4RL2nM6j09J07j07O1LPm6N8j62J08
$$ 74 -5 -6 39 -28 17 -64 57 -99 53 73 -34 -111 71 -3 6 38 33 79 -30 77 -30 31 34 41 -5 53 -109 -1
3049aN5l3j5r4L4J44q2K9P6j15j9Q1j19P3k7M8k2N2j09J05o1O5j09K3J5MQ4j01
$$ -1 54 21 6 -88 -54 90 8 37 113 -2 -21 60 -59 14 -13 35 13 65 -44 61 0 65 -44 -21 -6 -2 82 -19
3077a9O5n9%r0N3J6Q1o2p2k7K05q7l0J03l9j46J29k1K8n3M2O7p7j7J4J3J07j22
$$ -19 46 -13 -13 -103 -50 -34 47 -15 -87 -114 91 4 -26 77 38 -108 21 0 28 -25 17 84 7 -10 4 17 124 2
3105BL0r4N6N0ROj17N7P5r4J42o6L3j25n7QJ36n5j5j00K52l19L39k17M4p6K63
$$ 2 32 -62 -6 44 53 59 -58 -1 74 -20 122 56 89 -36 -93 -85 51 -4 -19 -119 133 -186 153 -64 -20 -96 167
3132A67m42N22l90q4L05l31N85m96k60J51L82m35L55j71K50k78K05j6J09k09J94
$$ 167 -275 247 -143 -227 78 -253 332 -164 -424 -273 109 -326 29 -142 108 -170 35 19 128 -81 113
3153A13l02K45m9P7j08P7r7m5pJ36m4M1Kr0L3N7r1qL2O5j14R9q2J03l5N5m7m2
$$ 113 -189 56 7 84 -24 53 -44 -89 -96 40 -4 37 39 -51 -18 39 -52 -60 -28 37 -77 22 -60 43 8 63 16 -26
3181b6K4n2M0m3N7l8J9n2M0Q1l2j4q4K1j0N4ol4L8Jk3n2K0J02Q2l0r9QJ37j55
$$ -26 -2 -54 -14 -57 0 -38 -19 -71 -31 50 18 4 -80 -59 -69 -15 -21 -55 -17 -16 -39 -91 -71 31 113 83 -16 -8 129 -26
3211b6P3m3m5N1m2J4M6n7J9pM2l3J1j6m2J14n2p8J61m5K6ko1r7Q5q3P3M2J5m6
$$ -26 47 4 -41 10 -32 -18 28 -29 -10 -17 25 -8 3 -13 -55 59 7 -71 90 45 71 69 8 -89 -4 -87 -14 28 43 -3
3241cj23K21o5m0p9J29q3M1%p9n4J50o5O2j7m7J27k5r8L1P3K3k9K6j4r3j3Q8r5
$$ -3 -126 95 30 -10 -89 40 -43 -2 -2 -81 -135 15 -50 12 -5 -52 75 50 -48 -17 56 79 50 76 62 -31 -44 44 -51
3270e1R9j13O1Kj1Q1j21M2k8m0Q3r6L9QJ29q8j4K3N3j08P5K4p2l4J29Np6Q3m4
$$ -51 48 -65 -4 -2 -13 68 -53 -11 -39 -79 4 -92 -53 -45 84 -4 -18 5 58 -50 25 49 -23 -57 72 77 1 84 40
3299D0n4K2nR2q0m6O9Ko1o9mQ1j4J9m2M7L3J0l5j1L7Qj7N2o9pj5J0J06K5j38p8
$$ 40 -14 8 3 95 15 -31 38 40 -21 -90 -94 -13 -27 -8 -50 -3 30 40 5 -6 31 39 22 74 5 -2 -17 -7 99 124 -14 -92
3331i2N3P0J02j70j0J02j12OL9J6p7N4M5J7n8L8K4p1O7m5M8k1j04k4J35n6R6j24
$$ -92 -39 31 133 -37 -47 55 -57 -51 -12 4 -73 -19 26 43 -15 23 47 -24 43 -2 46 25 -79 -103 32 -24 72 -52
3359e2J35m3q9M5J7olkQQ9j05kj8J5MJ5K9q5P7mn4N2l9N1n3P9m8K7q4N0n0K3%
$$ -52 83 40 -49 -4 13 7 4 2 10 99 -6 -8 -26 -11 -7 8 37 -48 29 25 -29 23 -16 35 -18 61 13 40 -44 6 -44 -21 -21
3392b1M0p7R2j2M4o4n7J5K2L5o6R3m0l4M2J5o8N3O5j16O3k1P6r4M2Jn0l8M4M1
$$ -21 19 -58 34 22 66 2 -55 -40 -18 17 -49 44 4 -30 12 27 -41 12 77 -39 24 3 79 -15 27 28 -22 -60 -16 25
3422B5L4o6K3K1M4j24O8m4J9L4j03O6l1O1j0K5r6m7J08q4K9J01l6p8N2p5R5P1
$$ 25 59 -7 16 37 81 -43 25 -19 0 34 -69 -3 -34 27 17 42 -54 -101 7 -77 -48 53 17 -61 -9 -84 11 82
3450H2j14l5K5J15r4M3j48O2P2n3J0L7j03J48l3j02K3k7K7J36p4Mj4o9J43p3l1
$$ 82 -32 -67 -42 73 -21 22 -126 -64 8 -45 -35 2 -101 47 14 -88 -65 -92 -65 71 -3 1 -13 -82 61 -12 -43
3477d3M0MMm6Pj2N4m0M3l3O7N8q3q9J25q6N3k5J8L0o7R0k4q7l3N9P1p2J27q3j4
$$ -43 -3 1 5 -41 -34 -46 8 -32 11 -22 45 103 20 -69 56 -30 23 -2 16 46 -21 69 45 -42 -75 -16 55 -17 110 27 13
3508A3p2O8j8K1k4k6J55j15O3r3J02m9L0j76J36Q4j05J01%RM9j65j05J37j6J6
$$ 13 -59 9 -9 12 -12 -38 117 2 65 -28 74 25 55 -121 15 99 -6 95 95 104 153 -12 -117 20 4 20
3534B0QK0j5k0LR9l3Q4j53LJ02k46L3O9mM0o7K1M5p9J3Q3j12P5k1N2k0l9J2P3
$$ 20 28 48 33 13 16 115 82 166 13 16 118 -128 -95 -26 -30 10 -57 -36 9 -70 -57 26 -86 -11 -32 20 0 -39 -27 46
3564D6q0J29j29K3j7J03n4l1o4OP3M8q4p8J40p4j3j0O2J7j14M1N1n6R4K0rK9j21
$$ 46 -34 95 -34 -11 -28 75 21 -10 -74 -68 5 53 -31 -109 31 -43 -56 -66 -4 13 -101 -60 -9 -65 29 49 40 69 -52
3593e2L9qk0J1k4l1J51r0n4M8P1r5JM8o7R7l3N1J0K9n9m4r3Q3M2l8O0L5L0r0j5
$$ -52 -13 -21 -41 -30 -54 -85 66 -24 -78 -30 41 -54 -53 -5 -72 25 -8 43 53 82 23 -21 -114 -31 11 -27 33 68 98 8 -7
3624gK9Nn5oN6m8o9Q6k2K3j04R1L7l6r1N4k37J27L89j27J8k14L7j1j67j17N53
$$ -7 22 27 -28 -34 22 -26 -95 -9 -31 -8 -112 -21 16 -20 -111 -57 -294 -167 222 95 113 -101 -64 -75 -242 -359 194
3651A94o25M26m40L24J00k43J4M2K96Pk78M82l01k56N48p17J79J1M15nm77M14
$$ 194 -431 -5 -445 -121 -21 -264 -250 -208 88 95 -183 299 -2 -258 290 -427 -248 -237 178 173 -304 110
3673A10n05J49L30l88L81L5J11r2m6o26M63J63j50L42j34J74m54Q6P4O7k36M02
$$ 110 -395 -246 84 -304 77 112 223 131 85 -541 -78 85 -65 277 143 317 -137 -51 23 90 -146 256
3695B56Rl47m90Q19k42J00k27k85L90l7K7nlM18n93M16m60O64o43O70R3m04k8
$$ 256 265 -82 -572 247 5 105 -122 -407 -17 -54 -27 -32 -35 383 -210 206 -254 410 -233 437 530 126 98
3718I8j33L01O9ml79R0j09J01Q9j81j48J48j10j35L87l39K99J72k03J40j36n0
$$ 98 -35 266 335 331 -48 42 -67 34 123 -58 -206 -58 -168 -303 84 -255 44 216 13 153 17 -33
3740c3J27l89L75j4mk7k4q2K69k72L05L53p70K23O7L9k11K75K9m88J84N27m71
$$ -33 94 -295 80 66 62 35 11 -71 198 -74 231 584 -186 37 104 143 -68 207 236 -252 -68 459 -12
3763a2l70K01R4J41j78J5J89q0J95j48l38J43K13k22L20p12N99J86l39K5L1J77
$$ -12 -382 -181 -87 54 -124 -109 80 0 195 47 -291 -148 65 -157 163 -549 50 236 -103 -78 -47 130
3785A30j63K8L7o0%m2J65J66m45k59O52l56J02J56k54M37l06K24j67m84o7M08
$$ 130 -33 -5 32 -28 -28 -70 95 261 -184 -443 209 -147 -45 111 -143 294 -12 212 45 -439 -506 -98
3807i8J38k9O7m0j10k12m58Q01m47K06%L58m01k34P49j38m42J77K03R9k08M67
$$ -98 40 11 78 38 -72 -284 -742 59 -388 -182 -182 176 -225 -459 290 152 -290 -113 90 189 -19 448
3829D48m20K0l2M4K05mk68l32L13L8Q7k83k41K50L39k07M6l59J43J71m4J00J20
$$ 448 28 48 16 60 265 261 -7 -339 -26 12 99 -184 -425 -175 164 -43 3 -356 -213 -42 -86 14 134
3852A34k57M17k17K2k12J82n8O0J75k53KJ08l2k17j48M14k76k9L1j70P03m5k75
$$ 134 -123 294 77 99 -113 69 11 71 246 -7 -5 103 71 -146 -294 120 -156 -185 -154 -324 379 334 59
3875E9o0K11p12J134p93p5L80n61K08L00l9O2j56r26J314Q7p91N79j30m50K62
$$ 59 -1 210 -502 632 -161 -236 144 -417 -209 91 52 114 -42 -968 346 433 -358 221 91 -359 -97
3896i7L90l00K92k6k27p3J51mQ7j90J60k53J25j18M60n15J35K06Jm22K25Q4k51
$$ -97 293 -7 285 259 32 -41 110 106 193 3 163 -90 35 -83 377 -138 -3 203 204 -218 7 91 -160
3919a60K87k15K29R2k25k13M00j8k61j83L05N5k25K51m12L11K43j57k57N9r7K91
$$ -160 127 -88 141 233 8 -205 195 177 -84 -267 38 93 -132 119 -293 18 261 104 -153 -94 -191 100
3941A00j56K55l6k36J03k35K53M8j35J40j3j77j11J23J15M8o7j1l5j6n8J67j29
$$ 100 -56 199 163 -73 30 -205 48 96 -39 101 88 -89 -200 -77 38 86 19 8 -27 -43 -101 66 -63
3964f3j0nO2J62k30L4R1l5p4K0M4R9rj05J19j2o8q2J13q7K3M8n4P8j30N8m0N8
$$ -63 -73 -78 -16 146 -84 -50 41 6 -68 -48 -4 95 86 -19 100 88 20 -62 51 -36 -13 35 -19 59 -71 -13 -53 5
3992EQ0j18o3M8J75j17q0L6Q4jq2P2j0k0J8o1M8p4O0MM4n1Q5m3o7R3L1r3k5M4
$$ 5 85 -33 -96 -48 127 10 -70 -34 50 49 -33 39 29 9 27 -34 14 -60 0 4 48 -3 82 39 -28 65 96 3 -22 22
4022B2L6j15N5j3P8j25O2k9P1Mj29R3j72L61j79M4l24L52j3j72K9M8r1Q9O2j14
$$ 22 58 -57 -2 -15 63 -62 0 -29 42 46 -83 10 -162 199 20 64 -260 92 79 -93 -64 -16 -107 -18 44 -70
4048g0P4L87n34J9J11r1m5l97q6J040m37k17M9J93k10L17j38m9J97j2j15O2n6
$$ -70 4 391 -143 -124 -13 -104 -149 -546 -632 408 -29 -246 -197 -4 -214 103 -35 -84 113 101 -14 48 -8
4071ho8J06q1Q0R1r6j41J09M1j2J35m8m94O01l22j46L06l2M8k19K04j49p43Q62
$$ -8 -76 30 -51 29 120 24 -117 -8 33 21 156 108 -386 215 -107 -253 53 21 69 -150 54 -95 -838 24
4095B4k46o9K13J35P1K2m77P69o20J49j06M05M1j93j15n90J012n16K42K40l80
$$ 24 -222 -291 -78 57 128 150 -327 442 -178 -29 -135 270 311 118 3 -587 425 -91 151 391 11
4116A1J03k1K34L60p64K01l58M23j45p5K88K82o1q66L80k78O2k48M15m63R47k76
$$ 11 114 93 327 687 -77 124 -234 189 44 -31 257 539 478 -388 -8 -286 -224 -472 -57 -520 427 151
4138A51k90M89R3m60M31o38l7N49K87o34j45k7K08N51m47l65K38j04K58m95L84
$$ 151 -139 350 443 -17 414 -224 -261 288 575 -59 -204 -231 -23 528 81 -284 -46 -150 108 -387 -3
4159cK1M2J86J20o33LM36k3l19j06K88k67M41j55k16J73J41q1p5J89k87O6L51
$$ -3 18 60 246 366 -267 -264 172 149 -170 -276 12 -255 186 31 -185 -12 129 48 -27 162 -125 -59 292
4182B92k36r2K17k70L15l71o4M78J67n04k83N9K05J64l85L63l3l01P8K84q7J71
$$ 292 56 -36 181 -89 226 -145 -209 269 436 -68 -351 -292 -87 77 -308 55 22 -279 -201 83 -4 167
4204A67r1L00j80j67k1k8L3L1L1N8j94R1n9Q3j12J20l3j2J5qJ02k12Q0m4O3m3
$$ 167 76 376 196 29 8 -20 13 44 75 133 -61 30 -29 54 -58 62 29 17 32 24 126 -86 -6 -50 13 -30
4230c0Q0j7l8L6m7K5M5Op8Q0r7J2LJ6k4O1k4J0l2O7j14PJ4O8Pp6N1m6R6k6r3m4
$$ -30 50 33 -5 31 -16 9 54 60 -18 62 -35 -23 -20 -4 -28 33 9 19 -13 54 -60 -53 -39 29 36 -40 11 -35 61 35 -58 -102
4262a02P3L7p6J3N5M2n8J21q8q6R5m5K7L9p9R8r8R8p1n1J12m8l5k1N8J4p7qO9
$$ -102 -29 8 -68 -55 0 42 -16 105 17 -69 26 -19 8 47 -32 66 -32 66 -5 -56 56 8 -27 -48 10 24 -53 -61 8
4291HN2r9J9O7j4l3l9mk5J23J8K0p2K1k7K4j09J06l4O2Ln5l9L4M8m2K2p2K5J9
$$ 8 60 -39 -20 47 33 0 -39 -43 -68 55 73 93 21 42 15 39 -70 36 2 64 67 12 -27 7 55 13 35 -37 -12 7
4321GR3j52R3j53R9nj9N2j7J3JJ1j00R1j4pK6Kk8L2r6N6R1m8Nn5L0P9o1j5L4o1
$$ 7 100 -52 41 -112 -13 -18 -37 15 -2 11 12 23 -77 14 0 -7 19 21 -7 25 -71 -15 76 28 33 -22 8 87 26 11 45 -16
4353a6LO9l8l3J6K3j0kl0J37q0p6J32j76J20l4J43r3j0M7j12K1P0p8K8k3N6j14
$$ -16 -13 56 18 -15 1 24 14 12 -18 119 39 -37 95 -81 39 5 148 55 45 92 -20 1 71 -7 21 -2 54 -60
4381f0m0J00M9m1j1n5M4O6j88J61l7n4M3j4N4j8j0JN0lOO7j31m5M3J2j4R3r8n
$$ -60 -100 0 49 8 -3 -58 -14 52 -136 25 -12 -66 -23 -37 17 -1 -11 -10 40 37 43 110 -21 -66 -23 -11 -25 68 -30 -35
4411c5J14j6M0n4l1j41J40k1l1J05j17J08j50J18K3j13P4j3R2j09J4K3qOjnr9
$$ -35 79 63 103 49 18 -123 17 -4 -35 70 -47 61 -89 29 52 -61 13 0 92 -17 -3 20 12 18 17 12 -87
4438h7P1P6O0k47J73L7n9L9j10M4K1j72J44n9QJ27n1L3j13R7j14J7J9O7q8M6P0
$$ -87 -16 60 120 -127 46 83 24 63 -47 -3 18 -154 -10 -69 -61 66 15 48 -65 32 -82 -65 -46 21 -67 -21 49
4465D9m6n4M4K1o0N8l0N7J3n1J7l1K2L8q1q4O9J2J13n3r0L7L9j0l2L8k3j1J8n
$$ 49 3 -51 -7 14 -46 12 -18 39 52 1 18 -13 9 47 -34 -118 -49 -37 76 23 -67 -30 9 -1 -33 5 -18 -29 -11 -16
4495a6N9l7nl3L1J22j46N2o1M5k0O2p8M7L3j50L2J01o4o4j1J04Q8n0J3j09J71
$$ -16 43 6 1 -32 -1 121 -25 27 -34 11 -9 53 -25 22 55 -95 -63 38 -26 -90 -101 3 91 41 54 -55 116
4522A16l9j80OJ93r4o3O2j0L2o6M2M7m4O3k0l6j9j16J69Oj2o0Q3q4K5p1J60l0
$$ 116 77 -103 -97 96 2 -61 1 -9 23 -43 -1 46 2 65 45 9 -10 -126 43 49 37 -23 60 -24 1 -70 90 60
4550F0j00J6oN4n5Q8j03l3L1P6M4j27R7J6o8q3K32n7n2q5j3K1L4j20l5M5l1Q3
$$ 60 -40 -24 -30 24 -31 57 -46 -79 -48 28 72 -55 42 58 -10 -93 139 82 30 -55 -68 -47 -13 -133 -168 -123 -154 -71
4578g1n4k70N21m89L86p0%L1m80N02o8MJ36k19J66l3j40R9j27M47j20j80o8J9
$$ -71 -125 -395 126 -363 23 -47 -47 -16 -496 6 -62 -58 78 -141 25 -8 -148 -49 -176 271 151 -29 -97 -78
4602g8j25J06K9k2m5L53l59j50K29J4j12M33m47L90k60K49j15N5l84J51L34j83
$$ -78 -203 -97 -68 -90 -135 218 -141 -291 -62 -48 -160 273 -174 216 -44 205 90 145 -239 -88 246 63
4624F3l8j25l9p6Q8K4J00J52j58J56j23p3O8L8o9L0p5m0L6J17j35J42o9J4O1Q
$$ 63 25 -100 -139 -215 -127 -103 -3 149 -9 147 24 -49 19 57 -12 18 -57 -97 -61 56 -79 63 -6 8 69 77
4650G7j05L9n4j7j0J05p1K1J20p0n7P4J1j35K1nM9L8QL6Oj39J84j46k0J31j44
$$ 77 -28 11 -43 -60 -70 35 -36 -15 105 35 -22 52 63 -72 -51 -56 -7 31 39 75 81 -58 126 -20 -40 91 -53
4677e3O7L4r7O5O1j1k4q0K0Ko3J1J43l0J5j6k17K73r9L1j8j7l3kk2M0L8Nmr2Q7
$$ -53 14 48 -49 16 77 66 42 -38 -18 -16 -79 -68 75 45 60 44 -173 100 1 32 14 -3 -36 -38 -60 -20 18 23 19 -73 14
4708A4n8l8M1oK3Q5p6M0L1j04k6J60j35K0O8k8K8o0j7QQn1J04l2Mk9M5m0jJ6m9
$$ 14 -44 -82 -41 -47 -24 61 -15 25 56 -48 -74 86 -49 -29 39 11 39 -21 -38 -30 -22 -73 31 -1 3 -26 19 -21 -22 -6 -55
4739e5J42j15J9JN5m7K4k2j9J38k9k3q6RP0q8R1o1J2L7ok0n4J61j21k4J9J7j2
$$ -55 87 -28 -9 -8 47 0 24 2 -17 121 92 69 -17 -8 62 -26 65 4 16 53 47 27 -27 134 13 -11 8 25 13
4768A3n1Q1r2J7j0J02l8r2O3p4R7m6oO3l2J8o6Jl1J60k1p5J2j07Q7J8o4O0K3K2
$$ 13 -38 43 -49 -32 -42 60 22 -70 -7 -81 16 -30 -36 27 -5 13 -53 -52 -83 77 56 -19 -7 -114 -27 -9 -73 -13 10 32
4798C2kj04O6P3r6l6K0J2P0l8p1J29kn3j24K17j04lJ03q0j5M2ql9k7L3J3N3j9
$$ 32 30 -74 -8 65 -31 -67 -47 -35 35 -3 -74 55 53 0 -124 93 -11 -14 89 9 -6 36 28 -11 -38 -5 8 61 42
4827D2J8j36J1lJ46q1oN9k1k4O4q9K8r2M1O6n3N4jj26J46o2J3m1J42j84J54q5
$$ 42 60 -76 -65 -68 78 -3 -9 50 29 5 69 -20 8 -84 -43 23 -30 24 23 -103 43 -19 -6 -47 95 -89 65 -20
4855b0M5k2j14J71j29O6R0l2k8qrn7R6K2r4j35J75Mk7Q4q7Q7j15N2PPp8J61j45
$$ -20 25 3 -111 60 -69 -3 87 55 27 19 10 -47 49 71 -23 -158 17 21 -6 78 -9 78 -37 15 22 29 -49 112 -33
4884c3j2n2P7o4J32j30J4j5J59j72K10j36J11j07QJ2L7J95k26Q1j2q6l39K41r2
$$ -33 -45 -97 -20 -84 48 -82 -68 -83 76 -96 114 -22 89 -18 -10 2 39 234 8 89 77 -9 -348 -107 -199
4909a99N67k92l48l6M83K5j96k8K30k75J60M52l12K0l43J81J07j13k86k10M85
$$ -199 368 76 -272 -308 175 200 4 -24 206 -69 91 543 231 251 -92 89 196 83 -203 -413 72
4930G2p6J4j9J18l88J66n6N21l23n68M03K43J10n61jK7p0M84k37M6J00N68p92
$$ 72 -4 10 -9 109 -279 -113 -169 352 29 -539 -136 107 217 -344 -345 -318 -388 96 -141 -95 5 573 -219
4953b19K58K51lp53J057l26o48O00q8m9q1L68j96k48l29P51o68L18J13j85l51
$$ -219 39 290 287 -466 591 265 -383 217 129 80 -1 367 171 -77 -406 345 -323 -5 108 -77 -428
4974d28O22k29R7r1J68j47j82J85J63j87oj37K42j31J68r2j18J40j0o6o9J67j74
$$ -428 194 -35 62 -29 139 -8 -190 -5 158 -29 -35 -172 70 -61 107 15 -103 37 27 -39 -108 59 -115
4997a15J0R8Qk7K8n1K6J0Kl9O8l4j5P2p6j8P0l7K7n6K3NL6M4p8N0Ol1n5O3n6R1
$$ -115 -105 -7 1 -26 2 -49 -23 -13 -11 -50 18 -16 -31 41 -35 -53 17 -20 7 -49 -26 -21 15 59 -19 31 37 6 -49 14 -42 49
5029D9k4k8L4r4K7M1m7nQ9q9Q1r3J04n8L3n3l2Q1p9R7o8R1m4jm5O0j6p9J59j20
$$ 49 25 -3 31 -63 -36 5 -42 -47 42 -47 34 -59 45 -13 20 -33 -65 16 -63 34 -34 57 13 12 -33 27 11 -68 91 -29
5059b9M3j4K3j3lp8L4m4J63j47L85n52J90O4M9k62L67j56k81N37m69L99k74k12
$$ -29 14 0 23 10 7 -71 -37 -81 82 -65 320 -232 -42 22 71 -191 176 20 -261 276 -193 206 -68 -280
5083b80K16L4r6K61k74J0m28N77J30O6O25r57j82l46M81L14j14N22o46K60q5l9
$$ -280 -64 -30 -126 135 -139 -129 -557 20 150 216 841 -116 -298 -644 -163 151 37 559 -87 173 88 49
5105D9k06r1K13K66j71J25j88j2l7Q8qj0j8R2q0o7P1L3m3Qr4l9J62J9l5O1k5n4
$$ 49 -157 -248 -35 231 60 185 -3 -15 -52 36 28 18 0 92 12 -55 16 49 6 14 -80 -119 43 62 27 88 63 9
5133Ip7L2r9J87j26N3K3mJ27k90K35p1o6O1R5j00L3k7l1N2k9O3j38J23r6J50k33
$$ 9 -68 -36 -135 52 -74 -21 2 -2 125 -165 70 -1 -67 -6 89 -11 22 -5 -36 16 -13 50 -88 35 -61 89 -144
5160a44N7J08j6O6j43J07n0K3l6K0O9j22J2q7K00k4%l5K0J8K5o1K9k2k4Kj1J32
$$ -144 -87 21 5 71 -72 35 -15 8 -28 -8 61 -61 -49 -136 64 40 40 5 25 43 68 7 36 14 -10 -8 -19 113
5188A13j15j08J78r2Q8j13J7M3j0J3q0M6l6M4l0l15L7N46l3Q0L37j201Q26k15
$$ 113 -2 -110 68 -24 64 -49 -32 11 1 14 -66 -20 -56 -12 -42 -357 -320 226 193 273 610 -591 235 20
5212B0P2n5l17M14J10l00l11L64j12M7J08n0p3K14J7j15K5p8L4j4m3O8mm6Q1j75
$$ 20 92 37 -280 134 244 -56 -367 -3 -115 -68 40 -10 -83 131 148 33 58 -20 14 0 -43 25 21 -25 56 -119
5238a19O0K4L8p0M3N3k2O1j15J68p7j57J38l6Q6q7j7O1m5L7j16Q6JL4qj55J57
$$ -119 -59 -35 3 -67 -24 29 7 68 -47 121 44 -113 25 -11 75 -12 -29 32 -13 24 -92 -6 -5 29 21 -134 23
5265B3o4P0j25Q8K6j10O5J06q8K5N3j59K2O2j1K0mj2p2R0o2nQ4j8m2k8J60q9P6
$$ 23 -41 29 -96 -8 18 -92 -27 79 -9 16 69 -90 -68 -6 -17 3 -1 -13 -85 5 -57 -62 22 4 -38 -66 94 5 81
5294H1q3p2R0j6k8K7rN0j5rL1Pr6O7p6M9P4o7m8K5O5n1L8m7R2m6K9j4l4m2Kk2
$$ 81 -2 -74 16 0 -28 -1 -10 40 25 16 47 54 -42 25 -51 -2 72 5 -43 -18 47 -4 34 -13 79 33 62 48 14 -28 -26 -48
5326d8R1j5q1N6l5N1jn5KK5M5o4N5j11J42l3n6m3P7O9o9r5L1O2K5M8j40Q5k9P3
$$ -48 43 28 -53 3 -32 19 18 -37 -35 -10 35 -29 26 -85 57 24 -32 -75 2 71 2 -93 -62 0 25 73 -67 18 -11 62
5356F2j17J26p3O5q9Q6mqq7RO1K5M3j36R0o7m7K8O0lm7K1J1J9n8K8qk5O6L8j59
$$ 62 -55 71 -2 63 -26 60 56 48 -39 -30 31 56 99 -37 53 -14 -61 -33 27 24 -23 -2 9 28 -30 -2 -10 -35 31 69 -90
5387i0M0Kj3J03p0J3Q9l8k0q4M9j8J52j04Q0j24K1N1p7l3J18j04P5o8M1o2R0O6
$$ -90 -50 -48 -61 42 -28 -15 74 36 16 -68 -19 -37 115 11 91 -33 -12 39 -38 -71 47 -57 18 -50 -9 -71 19 85
5415H5j23j9N2P3j34J9J2j7K0L4J06p7n9J7n1J75j76J29k9po2J49j28p8M1Q8q
$$ 85 -38 -57 -5 68 -66 -47 -35 -52 -32 2 108 31 -28 -11 -62 113 -63 66 37 30 -32 117 -11 -89 -48 40 32
$$ [...]
8191D6
##END NTUPLES=NMR FID
##END=
