##TITLE=1H_LY-DiX-40
 CD3CN,8 sc, 
 11.02.2021
##JCAMPDX= 6.0         $$ Bruker NMR JCAMP-DX V2.0
##DATA TYPE= NMR FID
##DATA CLASS= NTUPLES
##ORIGIN= UXNMR, Bruker Analytische Messtechnik GmbH
##OWNER= root
$$ XWIN-NMR		Version 3.5
$$ Thu Feb 11 13:48:46 2021 Russian Standard Time (UT+4h)  she@DPX200
##.OBSERVE FREQUENCY= 200.1315066352
##.OBSERVE NUCLEUS= ^1H
##.DELAY= (6, 6)
##.ACQUISITION MODE= SIMULTANEOUS
##.ACQUISITION SCHEME= undefined
##.AVERAGES= 8
##.DIGITISER RES= 18
##SPECTROMETER/DATA SYSTEM= spect
##.PULSE SEQUENCE= zg30
##.SOLVENT NAME= DMSO
##.SHIFT REFERENCE= (INTERNAL, DMSO, 0, 15.7039)
##AUDIT TRAIL= $$ (NUMBER, WHEN, WHO, WHERE, WHAT)
$$ ##TITLE= Audit trail, XWIN-NMR		Version 3.5
$$ ##JCAMPDX= 5.01
$$ ##ORIGIN= Bruker BioSpin GmbH
$$ ##OWNER= she
$$ F:/spectra/data/she/nmr/H-F/1/audita.txt
$$ ##AUDIT TRAIL=  $$ (NUMBER, WHEN, WHO, WHERE, WHAT)
(   1,<2021-02-11 13:47:24.70 +0400>,<she>,<DPX200>,
      <created by zg, POWCHK disabled, PULCHK disabled
       configuration hash MD5:
       00 E9 B6 7A A2 85 ED C7 34 08 36 98 17 FE 4E 26
       data hash MD5: 16K
       F5 BF 63 84 5F 1B A4 E7 3C 2A 32 0D 71 29 EB BA>)
$$ ##END=
$$ 
$$ hash MD5
$$ 1B 1A 19 62 CE F7 62 07 2E F1 55 D4 C4 F4 4E 76
##$RELAX= 
##$RELAX= 
##$RELAX= 
##$RELAX= 
##$RELAX= 
##$RELAX= 
$$ Bruker specific parameters
$$ --------------------------
##$DU= <F:/spectra>
##$EXPNO= 1
##$NAME= <H-F>
##$PROCNO= 1
##$TYPE= <nmr>
##$USER= <she>
##$AMP= (0..31)
100 100 100 100 100 100 100 100 100 100 100 100 100 100 100 100 100 100 
100 100 100 100 100 100 100 100 100 100 100 100 100 100 
##$AQSEQ= 0
##$AQ_mod= 1
##$AUNM= <au_zg>
##$AUTOPOS= <>
##$BF1= 200.13
##$BF2= 200.13
##$BF3= 200.13
##$BF4= 200.13
##$BF5= 200.13
##$BF6= 200.13
##$BF7= 200.13
##$BF8= 200.13
##$BYTORDA= 1
##$CFDGTYP= 0
##$CFRGTYP= 5
##$CHEMSTR= <none>
##$CNST= (0..31)
1 1 145 1 1 1 1 1 1 1 1 1 1 1 1 1 1 1 1 1 1 1 1 1 1 1 1 1 1 1 1 1 
##$CPDPRG= <>
##$CPDPRG1= <>
##$CPDPRG2= <>
##$CPDPRG3= <>
##$CPDPRG4= <mlev>
##$CPDPRG5= <mlev>
##$CPDPRG6= <mlev>
##$CPDPRG7= <mlev>
##$CPDPRG8= <mlev>
##$CPDPRGB= <>
##$CPDPRGT= <>
##$D= (0..31)
0 1.2 0 0 0 0 0 0 0 0.06 0 0.03 0 0 0 0 0.0002 0 0 0 0 0 0 0 0 0 0 0 0 
0 0 0 
##$DATE= 1613036844
##$DBL= (0..7)
120 120 120 120 120 120 120 120 
##$DBP= (0..7)
150 150 150 150 150 150 150 150 
##$DBP07= 0
##$DBPNAM0= <>
##$DBPNAM1= <>
##$DBPNAM2= <>
##$DBPNAM3= <>
##$DBPNAM4= <>
##$DBPNAM5= <>
##$DBPNAM6= <>
##$DBPNAM7= <>
##$DBPOAL= (0..7)
0.5 0.5 0.5 0.5 0.5 0.5 0.5 0.5 
##$DBPOFFS= (0..7)
0 0 0 0 0 0 0 0 
##$DE= 6
##$DECBNUC= <off>
##$DECIM= 32
##$DECNUC= <off>
##$DECSTAT= 4
##$DIGMOD= 1
##$DIGTYP= 9
##$DL= (0..7)
0 120 120 120 120 120 120 120 
##$DP= (0..7)
150 150 150 150 150 150 150 150 
##$DP07= 0
##$DPNAME0= <>
##$DPNAME1= <>
##$DPNAME2= <>
##$DPNAME3= <>
##$DPNAME4= <>
##$DPNAME5= <>
##$DPNAME6= <>
##$DPNAME7= <>
##$DPOAL= (0..7)
0.5 0.5 0.5 0.5 0.5 0.5 0.5 0.5 
##$DPOFFS= (0..7)
0 0 0 0 0 0 0 0 
##$DQDMODE= 0
##$DR= 18
##$DS= 0
##$DSLIST= <SSSSSSSSSSSSSSS>
$$ [...]
##$SUBNAM2= <"">
##$SUBNAM3= <"">
##$SUBNAM4= <"">
##$SUBNAM5= <"">
##$SUBNAM6= <"">
##$SUBNAM7= <"">
##$SUBNAM8= <"">
##$SUBNAM9= <"">
##$SW= 16.9725356469052
##$SWIBOX= (0..15)
0 0 2 0 0 0 0 0 0 0 0 0 0 0 0 0 
##$SW_h= 3396.73913043478
##$TD= 16384
##$TD0= 1
##$TE= 0
##$TE2= 300
##$TE3= 300
##$TEG= 300
##$TL= (0..7)
0 120 120 120 120 120 120 120 
##$TP= (0..7)
150 150 150 150 150 150 150 150 
##$TP07= 0
##$TPNAME0= <>
##$TPNAME1= <>
##$TPNAME2= <>
##$TPNAME3= <>
##$TPNAME4= <>
##$TPNAME5= <>
##$TPNAME6= <>
##$TPNAME7= <>
##$TPOAL= (0..7)
0.5 0.5 0.5 0.5 0.5 0.5 0.5 0.5 
##$TPOFFS= (0..7)
0 0 0 0 0 0 0 0 
##$TUNHIN= 0
##$TUNHOUT= 0
##$TUNXOUT= 0
##$USERA1= <user>
##$USERA2= <user>
##$USERA3= <user>
##$USERA4= <user>
##$USERA5= <user>
##$V9= 5
##$VALIST= <valist>
##$VCLIST= <CCCCCCCCCCCCCCC>
##$VD= 0
##$VDLIST= <DDDDDDDDDDDDDDD>
##$VPLIST= <PPPPPPPPPPPPPPP>
##$VTLIST= <TTTTTTTTTTTTTTT>
##$WBST= 1024
##$WBSW= 4
##$XGAIN= (0..3)
0 0 0 0 
##$XL= 0
##$YL= 0
##$YMAX_a= 787379
##$YMIN_a= -701252
##$ZGOPTNS= <>
##$ZL1= 120
##$ZL2= 120
##$ZL3= 120
##$ZL4= 120
##$ABSF1= 10
##$ABSF2= 0
##$ABSG= 5
##$ABSL= 3
##$ALPHA= 0
##$AQORDER= 0
##$ASSFAC= 0
##$ASSFACI= 0
##$ASSFACX= 0
##$ASSWID= 0
##$AUNMP= <proc_1d>
##$AZFE= 0.1
##$AZFW= 0.1
##$BCFW= 1
##$BC_mod= 2
##$BYTORDP= 1
##$COROFFS= 0
##$CY= 11.3945322036743
##$DATMOD= 1
##$DC= 2
##$DFILT= <>
##$DTYPP= 0
##$F1P= 15.9154993809931
##$F2P= -4.1035820241983
##$FCOR= 0.5
##$FTSIZE= 0
##$FT_mod= 4
##$GAMMA= 1
##$GB= 0.15
##$INTBC= 1
##$INTSCL= 1
##$ISEN= 128
##$LB= 0.24
##$LEV0= 0
##$LPBIN= 0
##$MAXI= 10000
##$MC2= 0
##$MEAN= 0
##$ME_mod= 0
##$MI= 1.114404
##$NCOEF= 0
##$NC_proc= 0
##$NLEV= 6
##$NOISF1= 3.799351
##$NOISF2= 2.8
##$NSP= 1
##$NTH_PI= 0
##$NZP= 0
##$OFFSET= 15.70392
##$PC= 1
##$PHC0= -10761.45
##$PHC1= 15.40095
##$PH_mod= 1
##$PKNL= yes
##$PPARMOD= 0
##$PSCAL= 0
##$PSIGN= 0
##$REVERSE= no
##$SF= 200.130013532006
##$SI= 16384
##$SIGF1= 3
##$SIGF2= 2
##$SINO= 400
##$SIOLD= 16384
##$SREGLST= <1H.CDCl3>
##$SSB= 0
##$STSI= 0
##$STSR= 0
##$SW_p= 3612.71676300578
##$SYMM= 0
##$S_DEV= 0
##$TDeff= 0
##$TDoff= 0
##$TI= <>
##$TILT= no
##$TM1= 0
##$TM2= 0
##$TOPLEV= 0
##$USERP1= <user>
##$USERP2= <user>
##$USERP3= <user>
##$USERP4= <user>
##$USERP5= <user>
##$WDW= 1
##$XDIM= 8192
##$YMAX_p= 0
##$YMIN_p= 0
$$ End of Bruker specific parameters
$$ ---------------------------------
##NTUPLES= NMR FID
##VAR_NAME=  TIME,          FID/REAL,        FID/IMAG
##SYMBOL=    X,             R,               I
##VAR_TYPE=  INDEPENDENT,   DEPENDENT,       DEPENDENT
##VAR_FORM=  AFFN,          ASDF,            ASDF
##VAR_DIM=   8192,          8192,            8192
##UNITS=     SECONDS,       ARBITRARY UNITS, ARBITRARY UNITS
##FACTOR=    0.0002944,     1,               1
##FIRST=     0,             0,               0
##LAST=      2.4114304,     0,               0
##MIN=       0,             -701252,         0
##MAX=       2.4114304,     787379,          0
$$ Real data points
##PAGE= N=1
##DATA TABLE= (X++(R..R)), XYDATA
$$ [...]
$$ plain form
2580 284 -2277 -3770 -2107 417 -871 -2009 -2322 -441 -238 -466 -1134 -1497 -452 42 -14 -37 912 641
2598 641 1023 265 589 1251 557 1925 2859 1335 981 877 2056 2781 750 655 1287 3162 1790 -1673
2616 -1673 -1310 428 1222 -1681 -2678 -1723 -31 247 -2964 -4651 -1055 1531 -785 -3692 -3327 -618
2632 -618 1706 -1672 -4468 -1421 2596 877 -2207 -2791 647 5026 1832 -2301 -661 4310 4953 356
2648 356 -2049 1486 5990 3786 -2211 -2860 3862 5713 658 -3407 -989 4163 4634 -2464 -5538 468
2664 468 4307 505 -5794 -4850 1525 4118 -1812 -8112 -3885 4306 1861 -5202 -6605 -226 5704
2679 5704 1612 -7100 -4345 4863 5605 -2425 -5841 10 7158 5255 -4278 -4111 4520 8368 1389
2694 1389 -5029 -1009 7765 7127 -2362 -6065 2120 8333 3180 -5519 -4272 4085 7290 -1842 -9044
$$ packed form
2580B84k561j493J663K524j288j138l13J881K03k28o68l63J045M94n6k3R49k71
2598F41L82p58L24O62o94J368R34j524l54j04J179P25k031r5O32J875j372l463
2616a673L63J738P94k903r97R55J692K78l211j687L596K586k316k907L65K709
2632f18K324l378k796L047M017j719l084n84L438M379l194m133J640M971O43m597
2648C56k405L535M504k204n997o49O722J851n055m065K418N152M71p098l074O006
2664D68L839l802o299R44O375K593n930o300M227Q191k445p063j403O379N930
2679E704m092q712K755R208P42q030l416N851P148j903r533J67Q631L848o979
2694A389o418M020Q774o38r489l703Q185O213n153q699J247Q357L205r132p202
$$ plain form
2709 -9044 -2182 5854 3327 -6148 -8698 341 6854 -671 -9220 -5070 4086 5077 -4609 -9089 -2022
2724 -2022 7728 3663 -6887 -6534 3507 8108 760 -7248 -2739 8166 6973 -3201 -6061 2723
2738 2723 9051 3887 -4997 -4070 6219 9373 -965 -6878 -590 7665 4744 -4904 -7656 1973 7808
2753 7808 157 -8509 -4003 4510 4960 -3996 -9671 -1885 6450 1285 -8130 -6916 3330 6504 -925
2768 -925 -8121 -3302 7115 5587 -4893 -6479 1992 8424 2785 -5881 -4089 5921 8183 -470
2782 -470 -5881 569 8289 5874 -4270 -5677 4036 8201 1392 -6388 -2141 5100 5443 -2769 -7404
2797 -7404 394 6655 2177 -7341 -4970 2330 4698 -1810 -8060 -3700 5523 2847 -5203 -6494 379
2812 379 5339 691 -6269 -3784 4651 5448 -2390 -4856 537 6080 3373 -3490 -3664 3971 6554 276
$$ packed form
2709i044O862Q036k527r475k550R039O513p525q549M150R156R91r686m480P067
2724b022R750m065j0550L53J0041M601p348q008M509J0905j193j0174k860Q784
2738B723O328n164q884R27J0289L154j0338n913O288Q255k921r648k752R629N835
2753G808p651q666M506Q513M50q956n675P786Q335n165r415J214J0246L174p429
2768i25p196M819J0417j528j0480j586Q471O432n639q666J792J0010K262q653
2782d70n411O450P720k415j0144j407R713M165o809p780M247P241L43q212m635
2797g404P798O261m478r518K371P300K368o508o250M360R223k676q050j291O873
2812C79M960m648o960K485Q435P97p838k466N393N543k707o863j74P635K583o278
$$ plain form
2828 276 -3990 -587 5216 4488 -1540 -4228 1738 5174 1413 -4247 -2046 2048 3610 -1077 -5276
2843 -5276 -1900 3307 855 -3914 -3666 -204 3301 -25 -4342 -3888 2790 1231 -3067 -2742 -76 2530
2859 2530 1143 -2295 -2027 2324 2566 -425 -1047 205 2656 2539 -544 -904 1717 2621 512 -22 445
2876 445 1082 2001 -69 -1401 199 908 41 -722 -423 -290 402 379 -986 -799 -13 -697 -337 -340 -1432
2895 -1432 -1109 -82 -606 -776 -818 -896 -464 588 -292 -1265 87 737 502 -117 -475 -132 2096 984 -958
2914 -958 -578 1339 1431 919 -867 -535 1893 1822 -959 -1175 139 1512 535 -1972 -1681 988 2097 -1331
2932 -1331 -3339 -528 1610 1573 -1949 -3189 699 2893 317 -3871 -1788 1807 1960 -786 -3661 -478
2948 -478 3022 1472 -2928 -2717 1497 3732 799 -3460 -2243 3408 3179 -1878 -3218 241 4056 2217
$$ packed form
2828B76m266L403N803p28o028k688N966L436l761n660K201M094J562m687m199
2843e276L376N207k452m769K48L462L505l326m317M54O678j559m298L25K666K606
2859B530j387l438K68M351K42k991o22J252K451j17l083l60K621R04k109n34M67
2876D45O37R19k070j332J600P09q67p63K99J33O92k3j365J87P86o84L60lj092
2895a432L23J027n24j70m2p8M32J052q80r73J352O50k35o19l58L43K228j112j942
2914i58L80J917R2n12j786L32K428p1k781k16J314J373r77k507K91K669J109l428
2932a331k008K811K138l7l522j240L888K194k576m188K083L595J53k746k875L183
2948d78L500j550m400K11M214K235k933m259J217N651k29n057j340L459L815j839
$$ plain form
2964 2217 -2964 -3033 2303 4273 -478 -4306 -1329 3833 3178 -2710 -4765 1001 4994 664 -4862 -2710
2980 -2710 3258 4355 -1672 -5507 -348 5358 2217 -4116 -4289 1757 5333 37 -5205 -2028 4747
2995 4747 4396 -2815 -5465 375 5961 1917 -5030 -4137 3509 5648 -1108 -6204 -1411 5503 4047
3010 4047 -3508 -5414 1921 6195 506 -5521 -3044 3992 5441 -2296 -6052 69 6027 2754 -4524
3025 -4524 -5049 3146 5687 -505 -6363 -1947 6166 4439 -2140 -6334 1208 6525 2233 -5727 -4521
3040 -4521 3772 5087 -1745 -6251 -2059 5833 3385 -4536 -5431 2043 6299 336 -6188 -3575 4087
3055 4087 4755 -2780 -5827 91 5884 3101 -5282 -3541 3301 5967 -222 -5462 -1232 5924 4377
3070 4377 -3030 -5015 2042 6327 2032 -5522 -2619 4488 4908 -1594 -5840 -23 5754 2142 -5121
$$ packed form
2964B217n181o9N336J970m751l828K977N162o55n888k055N766L993m330n526K152
2980b710N968J097o027l835N159N706l141o333j73O046L576n296n242L177O775
2995D747l51p211k650N840N586m044o947Q93P646K139o756n096M793O914j456
3010D047p555j906P335M274n689o027K477P036J449p737l756O121N958l273p278
3025d524n25Q195K541o192n858M416Q113j727o579m194P542N317m292p960J206
3040d521Q293J315o832m506M192P892k448p921q95P474M256n963o524K613P662
3055D087O68p535l047N918N793k783q383J741O842K666o189n240M230P156j547
3070D377p407j985P057M285m295p554K903P107M20o502m246N817N777l612p263
$$ plain form
3085 -5121 -5332 2091 5155 216 -5300 -2423 3990 4269 -3126 -5585 545 5500 1099 -5037 -4106 2261
3101 2261 4987 -1383 -4489 -946 4711 3792 -3150 -4656 2628 5374 693 -3545 -1314 3252 3995
3116 3995 -1447 -3988 1065 4440 1327 -2961 -3478 3338 3797 -235 -3347 -1630 3672 2905 -2111 -4552
3132 -4552 1028 2510 211 -4049 -2641 2877 2500 -1691 -4289 -466 2891 1148 -3250 -2906 1006
3147 1006 2098 -54 -3273 667 2055 967 -1093 -1808 1185 2552 1097 -1589 -624 738 3016
3162 3016 -416 -598 669 1759 1299 -320 -425 1307 1616 121 -776 -1184 546 46 -582 -1330 -621
3179 -621 -182 55 -1601 -1353 41 576 -384 -1629 -536 -145 -158 40 -233 -455 -298 121 333 457 -71
3198 -71 -30 1465 1194 1301 71 -430 1119 1347 827 -19 1071 1517 561 -471 -192 813 1062 -373
$$ packed form
3085e121k11P423L064m939n516K877O413K79p395k459O130M955m401o136R31O367
3101B261K726o370l106L543N657r19o942j506P284K746m681m238K231M566P43
3116C995n442k541N053L375l113m288n17O816M59m032l112J717N302p67n016k441
3132d552N580J482k299m260J408N518l77m191k598L823L357j743m398L44L912
3147A006J092k152l219L940J388j088k060p15K993J367j455k686R65J362K278
3162C016l432j82J267J090m60j619j05J732L09j495q97m08J730n00o28p48P09
3179f21M39K37j656K48J394N35r60j245J093L91j3J98k73k22J57M19K12J24n28
3198g1M1J495k71J07j230n01J549K28n20q46J090M46r56j032K79J005K49j435
$$ plain form
3216 -373 -1560 -1131 1341 551 -898 -2052 -764 454 -535 -2147 -2413 168 1198 -1080 -2948 -284
3232 -284 952 1276 -1504 -2095 1176 2162 529 -2130 -833 1709 2712 -341 -1469 1399 3009 2260
3248 2260 -956 -698 2007 3015 551 -2253 -324 3533 2866 -1822 -2523 704 3341 -45 -3510 -2534
3264 -2534 1496 2099 -1736 -4437 -1808 1818 1140 -3178 -4019 324 3250 -379 -4275 -2224 2082 3924
3280 3924 -1682 -3896 565 4143 1599 -2915 -1900 2628 4982 63 -2925 -539 4542 3735 -1455
3295 -1455 -3058 1687 5402 1781 -3404 -2064 3162 3974 -819 -4595 -477 3981 2153 -3627 -4696
3310 -4696 709 4080 -749 -5039 -2436 2904 3213 -2921 -5525 -714 4269 829 -4256 -3245 2427
3325 2427 4614 -672 -4516 -653 4506 2980 -2270 -3294 2137 5596 1508 -3356 -1413 4022 4552
$$ packed form
3216c73j187M29K472p90j449j154J288J218r89j612k66K581J030k278j868K664
3232b84J236L24k780n91L271R86j633k659J297K542J003l053j128K868J610p49
3248B260l216K58K705J008k464k804J929L857o67m688p01L227K637l386l465R76
3264b534M030O03l835k701K629L626o78m318q41M343K926l629l896K051M306J842
3280C924n606k214M461L578k544m514J015M528K354m919k988K386N081q07n190
3295a455j603M745L715l621n185J340N226Q12m793l776M118M458j828n780j069
3310d696N405L371m829m290K603N340L09o134k604M811M983l440n085J011N672
3325B427K187n286l844L863N159j526n250j024N431L459m088m864J943N435N30
$$ plain form
3340 4552 -131 -3958 498 5078 2573 -3617 -3361 2473 4114 445 -5233 -2127 3314 2325 -3065
3355 -3065 -5164 -44 3889 582 -5122 -4390 1787 3634 -1611 -5105 -1429 3984 1993 -2677 -4268
3370 -4268 1648 4656 1089 -3757 -1736 3327 4321 -1004 -3228 1122 4746 2439 -2272 -2647 2148
3385 2148 4591 176 -4067 -1189 4236 3244 -2331 -4086 527 3253 480 -4287 -2666 1433 2831
3400 2831 -1435 -4608 -1460 3136 1797 -3578 -4203 641 3254 -18 -4289 -1772 2694 2341 -1341
3415 -1341 -3518 191 3353 1809 -2094 -1440 2352 3824 533 -2360 118 3041 2972 -462 -1683 1094
3431 1094 2960 1328 -2183 -1209 1504 2344 -538 -2985 -792 1926 480 -2595 -2016 465 1274 -1336
3447 -1336 -2912 -891 1059 808 -1181 -2295 124 1381 150 -1686 -889 1714 1482 214 -1304 174
$$ packed form
3340D552m683l827M456M580k505o190K56N834J641l669n678L106N441r89n390
3355c065k099N120L933l307n704P32O177J847n245l494L676N413j991m670j591
3370d268N916L008l567m846K021N063R94n325k224M350L624k307m711l75M795
3385B148K443m415m243K878N425r92n575j755M613K726k773m767J621M099J398
3400B831m266l173L148M596j339n375o25M844K613l272m271K517M466l53l682
3415a341k177L709L162j544l903O54L792J472l291k893K478K923o9l434j221K777
3431A094J866j632l511R74K713Q40k882k447K193K718j446l075N79K481Q09k610
3447a336j576K021J950k51j989j114K419J257j231j836P97K603k32j268j518J478
$$ plain form
3463 174 1566 1227 -204 -35 1372 1126 635 3 364 999 1359 91 51 769 907 280 -563 -171 310
3482 310 479 -221 -337 -69 -322 -745 -89 -868 -996 -616 -576 -480 -392 -707 -686 -368 -139 92 -622 -134 515
3503 515 509 -122 -563 375 944 872 -102 -184 854 1459 258 -246 47 1514 1254 -152 -902 374 1670
3522 1670 174 -1107 -767 1235 987 -639 -1590 -408 1342 288 -1873 -1861 313 1130 -306 -2323
3538 -2323 -1277 1234 899 -1041 -2104 -337 1938 685 -1327 -1628 1037 2310 5 -1977 -613
3553 -613 1985 1739 -1198 -1643 876 2886 518 -1439 -1281 1775 2181 -473 -2181 -645 2714 1629
3569 1629 -1804 -2288 1044 2798 64 -2732 -1555 2032 2449 -1589 -2943 -517 2746 965 -2789
3584 -2789 -2702 1413 2844 -595 -3401 -1184 2904 2325 -1718 -3176 785 3332 907 -2913 -1842 2321
$$ packed form
3463A74J392l39j431J69J407k46m91o32L61O35L60j268m0P18J38o27q43L92M81
3482C10J69p00j16K68k53m23O56p79j28L80M0R6Q8l15K1L18K29K31p14M88O49
3503E15oo31m41R38N69p2r74q2J038O05j201n04K93J467k60j406p50J276J296
3522A670j496j281L40K002k48j626r51J182J750j054k161J2K174Q17j436k017
3538b323J046K511l35j940j063J767K275j253k012l01K665J273k305j982J364
3553f13K598k46k937m45K519K010k368j957J58L056M06k654j708J536L359j085
3569A629l433m84L332J754k734k796J177L587M17m038j354K426L263j781l754
3584b789Q7M115J431l439k806K217M088n79m043j458L961K547k425l820J071M163
$$ plain form
3600 2321 2918 -730 -2995 -450 3358 2267 -2196 -2851 1549 3680 150 -3319 -1665 2753 2588 -1706
3616 -1706 -3488 166 3526 1074 -2958 -2619 1860 3323 -666 -3665 -1103 2919 2307 -2402 -3267 903
3632 903 3658 484 -3456 -1882 2465 3172 -1319 -3330 -6 3474 1741 -2718 -2804 1417 3415 0
3648 0 -3387 -1246 2645 2618 -1689 -3460 435 3119 808 -2786 -2074 1793 3041 -870 -3381 -547
3664 -547 3079 2082 -2201 -2761 947 3191 631 -2996 -1830 2553 2821 -1268 -3072 5 3214 1613
3680 1613 -2412 -2477 1239 3112 -93 -3060 -1202 2381 2220 -1954 -2766 544 2863 732 -2600 -1809
3696 -1809 1738 2558 -841 -2857 -488 2614 1602 -1657 -2318 954 2798 75 -2234 -1091 2124
3711 2124 2364 -663 -2382 159 2386 1279 -2009 -1537 1675 2411 -201 -2379 -594 1821 1590 -1349
$$ packed form
3600B321N97l648k265K545L808j091m463o55M400K131l530l469J654M418j65m294
3616a706j782L654L360k452m032L39M479J463l989k999K562M022o12m709q65M170
3632I03K755l174l940J574M347P07m491k011L324L480j733m459q6M221J998l415
3648@l387K141L891k7m307j771L895K684k311l594P12L867J248l911k511K834
3664e47L626r97m283n60L708K244k560l627J166M383K68m089j804L077L209j601
3680A613m025o5L716J873l205k967J858L583j61m174q12L310K319k131l332P91
3696a809L547Q20l399k016K369L102j012l259o61L272J844k723k309J143L215
3711B124K40l027j719K541K227j107l288M72L212P36k612k178J785K415k31k939
$$ plain form
3727 -1349 -2259 263 2060 124 -2011 -1356 1281 1653 -825 -2036 -483 1455 677 -1405 -1655 669
3743 669 1680 -146 -1516 -643 1331 993 -696 -1095 646 1567 511 -797 -444 966 1496 -29 -824
3760 -824 119 1051 750 -570 -374 404 989 171 -760 -397 388 428 -422 -496 69 156 -371 -566 -508 -97 -77
3781 -77 -331 -646 -284 -198 -308 -208 -296 -250 -133 -99 27 468 -40 -132 65 502 258 -87 23 494 797 261
3803 261 -152 262 1030 655 -213 -237 310 928 48 -577 -456 599 619 -782 -827 -270 427 -121 -1294 -1037
3823 -1037 253 432 -571 -1596 -490 638 528 -1006 -1333 144 1027 -171 -1490 -613 1180 1258 -168
3840 -168 -860 351 1676 1058 -607 -773 1372 1995 510 -1243 -214 1814 1579 -641 -1407 288 1970
3857 1970 550 -1692 -1425 1235 1344 -659 -2266 -750 1358 683 -2009 -1996 272 1509 -282 -2704
$$ packed form
3727a349r10K522J797j936k135O55K637L72k478j211J553J938p78k082k50K324
3743F69J011j826j370Q73J974l38j689l99J741R21j056j308L53J410N30j525p95
3760h24R43R32l01j320J96P78N85q18r31L63P85M0q50p4N65Q7n27j95N8M11K0
3781g7k54l15L62Q6j10J00q8M6J17L4J26M41n08r2J97M37k44l45J10M71L03n36
3803B61m13M14P68l75q68k4N47O18q80o25J21J055K0j401m5N57O97n48j173K57
3823a037J290J79j003j025J106J128j10j534l27J477Q83j198j319Q77J793P8j426
3840a68o92J211J325o18j665j66K145O23j485j753J029K028k35k220p66J695J682
3857A970j420k242K67K660J09k003j607J516K108o75k692J3K268J237j791k422
$$ plain form
3873 -2704 -1328 1328 1324 -1055 -2171 -198 1998 951 -1373 -1512 1373 2273 177 -1719 -316 2182
3889 2182 1890 -601 -1495 966 2665 1035 -1546 -1410 2040 2326 -465 -2314 -350 2109 1094 -1988
3905 -1988 -2278 632 1996 -399 -2715 -1590 1380 1397 -1801 -2994 -122 2041 461 -2298 -2058 1109
3921 1109 2294 -476 -2710 -568 2318 1646 -1378 -2003 1121 3095 989 -1819 -999 2398 2533 -576
3937 -576 -1840 324 2596 1606 -1838 -1869 1274 2478 -140 -2283 -1100 1991 1801 -1497 -2629 -229
3953 -229 2025 254 -2316 -2261 716 1424 -1282 -2820 -981 2166 852 -1863 -2542 393 2214 322
3969 322 -1966 -770 1900 1974 -678 -1791 -3 2669 1550 -1382 -1322 1443 2537 328 -1520 -390
3985 -390 2114 2098 -921 -1955 437 2126 580 -1951 -1719 958 1664 -866 -2478 -754 1464 514
$$ packed form
3873b704J376K656mk379j116J973K196j047k324j39K885R00k096j896J403K498
3889B182k92k491q94K461J699j630k581J36L450K86k791j849J964K459j015l082
3905a988k90K910J364k395k316J125K970J7l198j193K872K163j580k759K40L167
3921A109J185k770k234K142K886o72l024o25L124J974k106k808Q20L397J35l109
3937e76j264K164K272r90l444l1L143J204k618k143J183L091j90l298j132K400
3953b29K254j771k570N5K977P08k706j538J839L147j314k715o79K935J821j892
3969C22k288J196K670P4k652j113J788K672j119k932O0K765J094k209j848J130
3985c90K504j6l019j034K392J689j546k531K32K677P06k530j612J724K218r50
$$ plain form
4001 514 -1719 -2262 185 1376 -241 -1950 -1188 1040 1243 -841 -1817 150 1666 865 -1355 -952 1159
4018 1159 1772 62 -1176 -188 1704 1766 -542 -1105 907 1750 580 -684 -752 1079 1291 -347 -1331
4035 -1331 412 766 206 -1110 -1293 123 787 -308 -1716 -580 -169 -135 -662 -1539 -536 1319 -128
4052 -128 -834 -816 305 624 288 -484 778 1023 1072 -181 -155 529 1030 387 -144 -297 690 588 60 104
4072 104 482 603 -6 163 401 -75 454 -223 50 -297 128 -182 -170 -617 -150 -878 -665 -290 -452 -536 -232
4093 -232 -169 -527 -195 -60 -8 -268 416 6 -701 129 402 477 -250 -242 281 1279 624 -140 27 537 55 -92
4115 -92 -390 -17 1424 573 -974 -158 1073 767 -135 -629 -948 8 625 -1140 -1198 -130 529 -152 -1134
4134 -1134 -505 839 818 -912 -1275 516 676 276 -916 -986 -47 1498 -305 -1363 -291 1098 580
$$ packed form
4001E14k233n43K447J191j617j709P62K228K03k084r76J967J516q01k220M03K111
4018A159O13j710j238R88J892O2k308n63K012Q43j170j264o8J831K12j638r84
4035a331J743L54n60j316j83J416O64j095j408J136M11L4n27q77J003J855j447
4052a28p06J8J121L19l36p72J262K45M9j253K6O84N01o43n31j53R87j02n28M4
4072A04L78J21o09J69K38m76N29o77K73l47M25l10J2m47M67p28K13L75j62q4L04
4093b32O3l58L32J35N2k60O84m10p07Q30K73P5p27QN23R98o55p64J67N10m82j47
4115i2k98L73J441q51j547Q16J231l06r02m94l19R56O17j765n8J068O59o81r82
4134a134O29J344k1j730l63J791J60m00j192p0R39J545j803j058J072J389n18
$$ plain form
4151 580 124 -554 -64 1659 725 -1405 -607 770 1391 -236 -963 -266 1473 779 -680 -1435 652 1442
4169 1442 -129 -1058 -617 804 1239 -997 -1478 199 655 397 -1343 -1326 126 1359 -564 -1540 -779
4186 -779 1130 667 -1069 -1568 -26 1514 334 -1677 -472 1382 1121 316 -1248 -413 2093 988
4202 988 -893 -1050 445 1733 127 -1104 -969 1444 821 -810 -1227 628 1655 751 -1310 -1196 862
4219 862 1541 60 -1194 -587 1242 781 -1037 -1695 137 1571 -37 -1207 -691 1213 1550 -998 -2089
4236 -2089 -87 1741 579 -1376 -1448 951 1435 499 -1431 -631 1350 1182 -1230 -1200 292 1597 388
4253 388 -1463 -1342 1046 1613 -278 -1430 -420 1365 710 -1201 -1714 632 1257 -243 -1551 -702 875
4270 875 1083 -791 -1697 -109 1742 410 -1265 -906 431 1185 -26 -1387 -395 1112 974 -782 -1252
$$ packed form
4151E80m56o78M90J723r34k130P98J377O21j627p27O97J739o94j459p55K087P90
4169A442j571r29M41J421M35k236m81J677M56k58j740J7J452J233j923r76P61
4186g79J909m63j736m99J542J540j180k011J205J854k61q05j564Q35K506j105
4202I88j881j57J495J288j606j231J35K413o23j631m17J855J027r04k061J14K058
4219H62O79j481j254O07J829m61j818o58J832J434j608j170N16J904L37k548j091
4236b089K002J828j162j955p2K399M84r36j930Q00J981j68k412L0J492J305j209
4253C88j851J21K388N67j891j152J010J785o55j911n13K346O25j500j308Q49J577
4270H75K08j874r06J588J851j332j675L59J337P54j211j361R92J507j38j756m70
$$ plain form
4287 -1252 226 1280 424 -1024 -785 862 1188 -151 -874 -376 1129 614 -890 -1173 655 1038 57
4304 57 -1039 -618 600 881 -648 -1112 69 1150 253 -826 -810 702 880 -178 -943 -339 1064 466
4322 466 -328 -768 382 954 130 -803 -331 829 585 -349 -797 -102 631 414 -614 -417 404 623 -59
4341 -59 -755 -284 462 635 -254 -571 135 654 4 -474 -423 419 772 -57 -441 146 474 67 -82 -348 444
4362 444 493 38 -258 432 232 44 -147 -165 -163 366 -113 -376 -328 95 -153 -189 -115 -174 148 99 -151 -281 -67
4385 -67 -104 4 166 144 -75 -195 -49 304 266 56 -189 260 224 -116 102 225 303 138 -272 -256 211 258 -323
4408 -323 -173 218 322 393 -323 -560 43 503 70 -605 -502 -68 493 -23 -645 -122 594 156 -524 -437 276
4429 276 337 140 -735 -305 574 248 -26 -514 138 960 374 -299 -231 692 878 145 -665 146 673 484 -188
$$ packed form
4287a252J478J054q56j448K39J647L26j339p23M98J505n15j504k83J828L83r81
4304E7j096M21J218K81j529m64J181J081q97j079J6J512J78j058p65O04J403n98
4322D66p94m40J150N72q24r33M72J160k44r34m48O95P33k17j028J97Q21K19o82
4341e9o96M71P46J73q89l17P06N19o50m78N1Q42L53q29l84N87L28m07j49k66P92
4362D44M9m55k96O90k00j88j91j8KN29m79k63M8M23k48l6P4n9L22m9k50j30K14
4385f7l7J08J62k2k19j20J46L53l8k10k45M49l6l40K18J23P8j65m10J6M67M7n81
4408c23J50L91J04P1p16k37O03M60m33o75J03M34N61n16o22N23P16m38o80Q7P13
4429B76O1j97q75M30Q79l26k74m88O52Q22n86o73O8R23J86p33q10Q11N27j89o72
$$ plain form
4450 -188 -570 317 598 72 -640 -466 391 713 -277 -819 -167 663 443 -732 -801 295 626 -298 -1039 -846
4470 -846 590 465 -824 -1124 -90 712 249 -898 -583 523 911 -198 -962 159 920 922 -437 -619
4488 -619 336 1003 235 -817 -270 1030 1185 -314 -1018 166 1024 372 -971 -804 574 764 -175 -1183
4506 -1183 -446 877 504 -786 -1310 74 900 -11 -1036 -915 667 897 -368 -874 -313 1016 830
4523 830 -750 -655 515 1191 204 -902 -200 991 986 -336 -861 376 1288 570 -1164 -520 567 971
4541 971 -179 -1026 -110 831 391 -749 -1121 158 1067 -3 -1509 -806 461 549 -679 -1432 -348 822
4559 822 112 -986 -1100 682 983 24 -1086 -596 837 779 -485 -756 461 999 513 -647 -272 714
4577 714 1078 -187 -566 498 1151 569 -231 -670 411 1155 -67 -889 -590 621 43 -682 -994 -118
$$ packed form
4450a88l82Q87K81n26p12J74Q57L22r90n42O52Q30k20j175o9J096L31r24p41J93
4470h46J436j25j289l00J034Q02m63j147L15J106L88j109p64J121P61Kj359j82
4488f19R55O67p68j052N47J300J55j499p04J184Q58o52j343J67J378J90r39j008
4506a183P37J323l73j290n24J384Q26r11j025J21J582K30j265n06N61J329j86
4523H30j580R5J170O76r87j106P02J191nj322n25J237R12p18j734O44J087M04
4541I71j150q47R16R41m40j140l72J279R09j070j506P03J267Q8j228p53J084J170
4559H22p10j098j14J782L01r59j110M90J433n8j264k71J217N38m86j160L75R86
4577G14L64j265l79J064O53n82q00m39J081P44j222q22K99J211n78p25l12Q76
$$ plain form
4595 -118 762 -44 -967 -845 -232 747 -376 -927 -414 633 461 -694 -743 -118 560 233 -517 -382 345
4614 345 674 117 -546 218 571 100 -153 -1 496 871 99 -690 10 588 664 -314 -356 -222 807 -352
4634 -352 -381 -456 208 191 16 -616 29 495 -127 -336 -573 -43 96 -322 -460 -224 43 118 -82 -190 -425
4655 -425 756 32 41 -186 64 671 -220 189 -132 526 436 135 303 63 280 262 13 -450 335 249 96
4676 96 -126 -368 -242 -102 5 -462 -253 -199 276 -215 -168 -319 35 -252 -55 -125 -111 -93 10 -355 -378 -35
4698 -35 262 256 223 -280 132 152 499 -87 -109 -69 384 -79 97 -48 -5 659 80 35 132 -153 -125 -47 -234 44
4722 44 161 -255 -759 -304 477 299 -501 -746 -414 436 373 -317 -705 -548 151 -416 -786 -440 163 482 65
4743 65 -308 212 1013 -54 -351 -647 750 214 -9 -226 -445 736 767 -26 -482 -28 541 616 -515 -129
$$ packed form
4595a18Q80q06r23J22O13R79j123n51N13J047j72j155m9O25O78l27p50J35P27
4614C45L29n57o63P64L53m71k53J52M97L75p72p89P00N78P6r78m2J34J029j159
4634c52k9p5O64j7j75o32O45M66o22k09k37N30J39m18j38K36K67P5k00j08k35
4655d25J181p24Rk27K50O07q91M09l21O58r0l01J68k40K17j8k49m63P85q6j53
4676I6k22k42J26J40J07m67K09N4M75m91M7j51L54k87J97p0J4J8J03l65k3L43
4698c5K97ol3n03M12K0L47n86k2M0M53m63J76j45M3O64n79m5R7k85K8P8j87K78
4722D4J17m16n04M55P81j78q00k45L32Q50o3o90l88J57O99n67l70L46O03L19m17
4743F5l73N20Q01j067k97k96J397n36k23k17k19J181L1p93m56M54N69P5j131L86
$$ plain form
4763 -129 664 518 -579 -215 -280 246 249 -622 -986 50 739 355 -748 -487 502 57 -112 -172 168 288
4783 288 -55 -983 -231 -150 165 101 -930 195 859 729 -366 -506 -11 475 279 -608 -145 771 352 122
4803 122 -374 288 944 347 -591 -200 347 697 88 -626 -475 1097 552 -441 -1410 549 490 83 -1024
4822 -1024 -499 811 821 -550 -1034 -233 263 317 -120 -722 548 748 165 -993 -423 887 715 -178 -1044
4841 -1044 300 763 587 -714 -300 364 531 -284 -496 -395 418 75 -256 -1022 77 523 -75 -740 -668
4860 -668 668 871 59 -335 464 1120 847 -722 -964 746 727 13 -832 102 711 462 -514 -561 -210 -27
4880 -27 390 -475 -288 573 328 -367 -124 565 869 535 -548 -358 129 882 -145 -960 -526 126 550 -288
4900 -288 -527 15 715 -557 -360 -361 332 404 123 -382 330 -130 -291 386 -302 477 654 195 4 -102 -144
$$ packed form
4763a29P93j46j097L64o5N26Lq71l64J036O89l84j103K61R89m45j69o0L40J20
4783B88l43r28P52Q1L15o4j031J125O64j30j095j40M95M86j96q87M63R16m19k30
4803A22m96O62O56n97r38L91N47L50o09p14J51J572n45r93r69J959n9m07j107
4822a024N25J310J0j371m84Q01M96N4m37o02J270K00n83j158N70J310j72q93q66
4841a044J344M63j76j301M14O64J67q15k12J01Q13l43l31p66J099M46n98o65P2
4860f68J336K03q12l94P99O56k73j569k42J710j9p14q45R34O09k49r76m7L51J83
4880b7M17q65J87Q61k45o95K43O89L04l34j083J90M87P53j027q15M34O52M24q38
4900b88k39N42P00j272J97jO93P2k81n05P12m60j61O77o88P79J77m59j91j06m2
$$ plain form
4921 -144 581 -450 -923 -118 888 1004 -185 369 -93 237 59 -934 58 -466 348 -423 -822 -102 -316
4940 -316 56 -445 -744 590 334 319 -432 -381 -14 -19 6 -324 202 579 193 -503 -530 386 -138 -672 -611 385
4962 385 124 -25 -210 -150 -740 -580 660 -141 236 436 -26 175 -554 50 60 -62 -184 -148 25 -657 -199
4983 -199 -150 276 -116 159 -266 35 -487 -409 246 -211 262 -26 -715 -13 250 165 -62 30 325 415 96 226
5005 226 -133 162 270 -99 -250 263 280 -265 -211 -146 26 102 -188 -286 229 277 -13 -293 -151 195 228 47
5027 47 -195 126 404 13 -468 -496 -74 457 76 -358 72 440 396 -249 -179 389 463 16 -189 -314 437 375
5049 375 -404 -501 -10 366 224 -332 -384 -88 488 -147 -469 -276 567 344 -323 -492 45 604 -70 -265 -490
5070 -490 410 566 -181 -662 38 554 518 -314 -657 305 799 13 -612 7 629 443 -375 -600 -173 618
$$ packed form
4921a44P25j031m73Q05J006J16j189N54m62L30j78r93R92n24Q14p71l99P20k14
4940c16L72n01k99J334k56j5p51N1L67nK5l30N26L77l86o96k7R16n24n34O1R96
4962C85k61j49j85O0n90J60J240q01L77K00m62K01p29O04J0j22j22L6J73o82M58
4983a99M9M26l92K75m25L01n22P8O55m57M73k88o89P02K63q5k27R2K95R0l19J30
5005B26l59K95J08l69j51N13J7n45N4O5J72P6k90r8N15M8k90k80J42L46L3j81
5027D7k42L21K78l91m81k8M22N31l81m34M30L68m4o45P0N68P4m47k05j25P51o2
5049C75p79r7M91L76j42n56n2K96N76o35l22J93Q43k23o67j69N37N59o74j95k25
5070d90R00J56p47m81P00N16l6q32l43R62M94p86o25O19O22j86q18k25M27P91
$$ plain form
5090 618 105 -420 -546 68 410 -2 -566 -306 381 310 -349 -476 90 509 196 -524 -358 114 457 -290
5110 -290 -730 -147 617 27 -409 -834 321 576 113 -443 -94 590 483 -148 -562 175 932 133 -505 -251
5130 -251 346 965 -88 -641 -82 668 396 -299 -365 2 593 348 -677 -457 593 543 -173 -834 -184 633
5150 633 459 -615 -595 124 413 134 -931 -273 720 331 -603 -583 -67 431 237 -541 -574 517 612 85
5170 85 -540 -88 620 225 -375 -508 375 538 148 -389 -161 493 349 59 -574 -15 479 75 -548 -514 270
5191 270 402 -197 -563 -154 449 257 -359 -535 32 237 130 -523 -287 388 282 -86 -309 -94 561 30
5211 30 -379 -126 256 499 364 103 -76 489 258 -29 -235 185 304 176 -411 -380 79 205 188 -312 -298
5232 -298 304 142 -128 -313 -91 312 -59 -247 -237 -127 169 -259 -376 -131 337 66 -324 -169 229 258 -115
$$ packed form
5090F18n13n25j26O14L42m12n64K60O87p1o59j27N66M19l13p20J66M72L43p47
5110b90m40N83P64n90m36m25J155K55m63n56L49O84j07o31m14P37P57p99o38K54
5130b51N97O19j053n53N59P50k72o95o6L67N91k45j025K20J050n0p16o61O50Q17
5150F33j74j074K0P19K89k79j065O58R93l89r34K0N16M98j94p78l3J091R5n27
5170H5o25M52P08l95o00j33Q83J63l90n37K28O54j44k90o33N59M94m04o23L4P84
5191B70J32n99l66M09O03j92o16j76N67K05j07o53K36O75j06l68k23K15O55n31
5211C0m09K53L82K43j35k61j79N65k31k87k06M20J19j28n87L1M59J26j7n00J4
5232b98O02j62k70j85K22M03l71j88J0J10K96m28j17K45M68k71l90J55L98K9l73
$$ plain form
5253 -115 -131 238 -7 98 124 -237 231 372 247 -115 217 175 58 193 -25 175 8 337 -68 206 110
5274 110 -259 -131 -137 -242 289 -153 -209 -388 -53 -185 -139 -165 -15 -176 -73 -126 -251 101 -249 -357 -11 284
5296 284 68 84 56 156 410 60 192 221 515 234 -125 293 266 -21 -103 -18 200 363 292 -26 -33 145 74
5319 74 -135 -353 -237 309 419 -531 -392 -40 193 8 -459 -196 12 293 -99 -343 -52 523 160 -350
5339 -350 -296 135 715 13 -359 70 419 185 -300 -22 116 606 191 -270 1 474 463 -80 -489 -182 263
5360 263 144 -163 -89 160 372 12 -671 -290 143 144 -331 -537 -125 488 187 -563 -291 46 355 -204 -484
5381 -484 -30 484 553 -273 -339 207 435 151 -629 -91 486 633 -302 -493 -53 569 510 -152 -247 314 636
5402 636 -288 -564 -274 396 293 -306 -655 103 621 -14 -480 -521 265 386 -273 -841 -173 544 331 -474
$$ packed form
5253a15j6L69k45J05K6l61M68J41j25l62L32m2j17J35k18K00j67L29m05K74r6
5274A10l69J28oj05N31m42n6j79L35j32M6k6J50j61J03n3j25L52l50j08L46K95
5296B84k16J6k8J00K54l50J32K9K94k81l59M18k7k87q2Q5K18J63p1l18pJ78p1
5319G4k09k18J16N46J10r50J39L52K33j85m67K63K08K81l92k44K91N75l63n10
5339c50N4M31N80p02l72M29L49k34m85K78J38M90m15m61K71M73j1n43m09L07M45
5360B63j19l07P4K49K12l60o83L81M33Jm75k06M12O13l01p50K72L37L09n59k80
5381d84M54N14O9q26o6N46K28k84p80N38N77J47r35j91M40O22n9o62r5N61L22
5402F36r24k76K90O70j03n99l49P58N18o35m66m1P86J21o59n68O68P17k13q05
$$ plain form
5422 -474 -475 -27 525 -74 -596 -489 411 614 -325 -331 -63 462 231 -324 -468 253 604 97 -309 157 515
5443 515 661 -372 -537 339 537 44 -745 -442 269 389 -127 -614 -138 242 173 -356 -587 26 529 38
5463 38 -312 -296 389 469 -139 -443 180 487 162 -504 -367 401 538 33 -442 -215 599 399 -520 -534 -97
5484 -97 504 104 -397 -195 48 148 -5 -61 280 279 -172 -499 -382 -201 488 50 -433 -389 146 125 -56 -452
5506 -452 -110 120 63 -335 11 296 25 137 -530 23 465 142 -165 -200 242 183 14 -42 -69 158 458 -156
5528 -156 -399 -124 301 196 -278 -141 161 137 58 -510 -174 82 -7 -221 -298 197 171 97 -221 -237 139 -165
5550 -165 6 -157 -75 95 -12 -103 -172 95 215 208 -67 -67 -155 289 182 -42 356 51 55 1 -38 87 -68 -15
5574 -15 -116 -98 21 73 -27 86 -162 3 -13 82 -84 79 -94 -20 61 -81 -21 -35 184 23 -83 -48 -271
$$ packed form
5422d74jM48N52n99n22J07R00K03r39oK68N25k31n55j44P21L51n07m06M66L58
5443E15J46j033j65Q76J98m93p89L03P11J20n16m87M76L80o9n29k31O13N03m91
5463C8l50J6O85Q0o08l04O23L07l25o66J37P68J37n05m75K27Q14k00r19j4M37
5484i7O01m00n01K02K43J00j53n6L41jm51l27J17J81O89m38m83M4N35k1j81l96
5506d52L42K30n7l98L46K85k71J12o67N53M42l23l07l5M42n9j69n6k7K27L00o14
5528a56k43K75M25j05m74J37L02k4p9n68L36K56q9k14p7M95k6p4l18j6L76l04
5550a65J71j63Q2J70j07r1o9K67J20pk75%q8M44j07k24L98l05Mn4l9J25j55N3
5574a5j01J8J19N2j00J13k48J65j6R5j66J63j73P4Q1j42O0j4K19j61j06L5k23
$$ plain form
5597 -271 -189 70 -120 -18 36 124 -83 -300 -81 280 -15 -107 -181 -429 193 -52 -210 22 144 325 110 -373
5619 -373 -171 170 165 -161 -296 125 307 61 -482 -102 272 276 29 -337 171 281 -53 -369 -410 236 305 -86
5641 -86 -547 64 310 -10 -139 -668 -45 354 113 -327 -294 218 276 -372 -532 -175 174 84 -322 -187 170
5662 170 338 -86 -401 -466 217 151 -448 -471 175 574 197 -214 -279 119 475 -296 -378 -170 556 463 -366 -367 49
5685 49 575 257 -527 -107 352 557 -113 -537 -128 323 307 -395 -367 425 384 184 -459 -326 378 315 -259 -532
5707 -532 38 266 149 -436 -428 247 531 -59 -507 -154 488 391 -365 -354 145 513 -176 -461 1 550 230
5728 230 -265 -542 246 552 539 -366 -328 252 509 -9 -326 -123 349 240 -449 -487 164 873 -95 -540 -623
5749 -623 127 329 -159 -913 208 703 94 -11 -216 214 331 -228 -667 190 478 -12 -278 -538 251 500
$$ packed form
5597b71Q2K59j90J02N4Q8k07k17K19L61k95r2p4k48O22k45j58K32J22J81k15m83
5619c73K02L41nl26j35M21J82k46n43L80L74Mk47l66N08J10l34l16m1O46O9l91
5641h6m61O11K46l20j29n29O23L99k41m40L3N12N8o48j60L57L49r0m06J35L57
5662A70J68m24l15o5O83o6n99k3O46L99l77m11o5L98L56p71q2K08P26r3q29jM16
5685D9N26l18p84M20M59K05o70m24M09M51j6p02K8P92m1k00o43J33P04o3n74k73
5707e32N70K28j17n85QO75K84n90m48L53O42r7p56J1M99L68o89k85M62N49l20
5728B30m95k77P88L06j3r05L8N80K57n18l17K03M72j09o89l8O51P09r68m45q3
5749f23P50K02m88p54J121M95o09j05k05M30J17n59m39Q57K88m90k66k60P89K49
$$ plain form
5769 500 114 -574 292 291 269 679 -1192 -165 161 187 -844 -337 576 -4 26 -327 -367 350 -175 113 -497
5790 -497 -377 645 -648 -278 -463 86 17 88 94 -372 -8 -709 280 -608 -102 247 73 -244 -545 -222 786
5811 786 -155 -358 -156 461 256 -425 -78 30 -206 362 346 -787 -107 397 -165 -782 -628 -114 -83 -121 -263
5832 -263 -112 428 -363 -432 -284 38 67 49 -255 373 477 -252 -193 -173 100 192 88 -108 -75 83 58 -119 16
5855 16 363 105 -96 182 83 -94 -40 171 40 92 143 -48 105 10 -32 -65 -144 -378 -167 -75 -91 48 65 -235
5879 -235 -148 -174 -139 -145 -240 -40 -155 67 33 -168 -6 -105 239 -192 163 30 234 53 38 -4 73 319 -73 -133
5903 -133 83 303 88 -140 -76 -154 266 233 -160 -203 129 213 -1 -184 -331 122 -76 -78 -105 -42 204 149 -4
5926 -4 -263 172 58 -352 -431 109 134 -98 -396 -68 400 289 -167 -379 -1 104 453 -272 -44 240 492
$$ packed form
5769E00l86o88Q66jk2M10j871J027L26K6j031N07R13n80L0l53m0P17n25K88o10
5790d97J20J022j293L70j85N49o9P1Om66L64p01R89q88N06L49j74l17l01L23J008
5811G86r41k03K02O17k05o81L47J08k36N68j6j133O80N04n62o17J54N14L1l8j42
5832b63J51N40p91o9J48L22K9j8l04O28J04p29N9K0K73R2j04j96L3J58k5j77J35
5855A6L47k58k01K78r9j77N4K11j31N2N1j91J53r5m2l3p9k34K11R2j6J39J7l00
5879b35Q7k6L5or5K00j15K22l4k01J62r9L44m31L55j33K04j81j5m2P7K46l92o0
5903a33K16K20k15k28O4p8M20l3l93m3L32Q4k14j83j47M53j98kk7O3K46n5j53
5926dk59M35j14m10p9N40K5k32k98L28M68j11m56k12L78J05L49p25K28K84K52
$$ plain form
5947 492 344 -452 -50 204 230 -73 -207 69 264 352 -241 -212 69 459 21 -635 -339 200 112 -225 -214 -67
5969 -67 250 -134 -574 -463 149 426 -129 -496 152 293 56 94 -440 43 402 147 -254 65 614 396 -21
5990 -21 -253 60 395 409 -301 -91 167 418 -190 -562 -164 393 -12 -333 -345 56 220 20 -333 -197 382
6011 382 166 -261 -462 -233 152 67 -401 -402 -14 213 223 -410 -87 515 285 -171 -312 119 415 252 -74
6032 -74 -39 537 377 234 -230 194 232 380 -112 -212 168 331 133 -224 -265 163 362 -217 -520 -45 131
6053 131 -12 -97 -537 270 380 -46 -505 -326 128 131 -212 -432 -47 166 375 -275 -385 -35 399 -70 -229
6074 -229 142 384 380 -335 -239 -33 452 247 -418 -172 296 379 135 -94 -256 152 -6 -133 -357 65 407
6095 407 -72 -511 -163 -375 592 -218 -116 -38 -292 260 -93 -57 252 -112 248 -274 -274 107 343 366 -54 436
$$ packed form
5947D92j48p96M02K54K6l03j34K76J95Q8n93K9K81L90m38o56K96N39q8l37J1J47
5969f7L17l84m40J11O12K77n55l67O48J41k37L8n34M83L59k55m01L19N49k18m17
5990b1k32L13L35J4p10K10K58K51o08l72L98N57m05l21j2M01J64k00l53J36N79
6011C82k16m27k01K29L85q5m68jL88K27J0o33L23O02k30m56j41M31K96j63l26
6032g4L5N76j60j43m64M24L8J48m92j00L80J63j98l57m1M28J99n79l03M75J76
6053A31j43q5m40Q07J10m26m59J79M54Ll43k20L85K13K09o50j10L50M34m69j59
6074b29L71K42mp15R6K06M85k05o65K46M68Q3k44k29j62M08j58j27k24M22L42
6095D07m79m39L48k12R67q10J02P8k54N52l53L6L09l64L60n22%L81K36K3m20M90
$$ plain form
6117 436 -225 -527 -108 903 -748 203 239 -221 -126 -236 12 368 433 101 422 -112 -75 -642 -615 -125 -500
6138 -500 28 -106 277 -46 -153 103 163 476 -122 -102 -15 64 103 271 -94 -6 -25 110 -442 85 -2 104 14
6161 14 2 66 119 228 -107 127 48 90 46 -162 -178 -16 62 -197 123 49 -13 -92 33 -130 -28 -203 -245 105
6185 105 100 -54 -194 65 79 -198 -147 -50 -109 137 -36 -73 163 -14 188 -354 -15 268 -122 4 -48 25 174
6208 174 313 -45 10 100 -19 -230 -110 361 180 66 -50 -20 127 123 128 -247 107 252 -27 -132 -412 -148
6230 -148 27 200 -137 -141 164 139 58 -135 -119 259 72 -189 -337 -50 73 211 14 -136 176 303 95 -377
6252 -377 103 321 104 -236 -335 241 176 41 -249 6 205 -181 -331 -92 -26 175 263 -418 62 334 327 13
6274 13 -387 -49 295 257 -69 -356 125 91 64 -242 -98 341 383 137 -327 179 308 155 -64 -269 213 53
$$ packed form
6117D36o61l02M19J011j651R51L6m60R5j10K48L56O5l32L21n34L7n67K7M90l75
6138e00N28j34L83l23j07K56O0L13n98K0Q7P9L9J68l65Q8j9J35n52N27q7J06r0
6161A4j2O4N3J09l35K34p9M2m4k08j6J62P8k59L20p4o2p9J25j63J02j75m2L50
6185A05nj54j40K59J4k77N1R7n9K46j73l7K36j77K02n42L39K83l90J26n2P3J49
6208A74J39l58N5R0j19k11J20M71j81j14j16L0J47mNl75L54J45k79j05k80K64
6230a48J75J73l37mL05k5q1j93J6L78j87k61j48K87J23J38j97j50L12J27k08m72
6252c77M80K18k17l40r9N76o5j35k90K55J99l86j50K39O6K01Q8o81M80K72pl14
6274A3m00L38L44l8l26k87M81l4k7l06J44M39M2k46m64N06J29j53k19k05M82j60
$$ plain form
6296 53 133 -48 -170 382 132 -298 41 101 260 217 -405 -349 383 345 -150 -220 -18 178 181 -422 -203 349 178
6319 178 -234 -164 48 231 359 -61 -316 3 615 -67 -203 -212 12 192 29 -582 -337 294 77 -203 -544
6340 -544 -35 55 -116 65 -137 219 327 -273 -326 166 337 206 -377 -201 165 274 87 -151 -211 210 425
6361 425 -35 -462 -129 124 -21 -74 -73 126 10 51 -228 -48 129 273 -103 -147 160 366 29 -404 -120 189
6383 189 196 -128 -556 74 314 386 -408 -42 -12 10 -142 -366 -138 60 150 -223 -488 100 207 -23 -105 -332
6405 -332 234 232 -27 -114 228 365 -58 -163 -57 -59 208 53 2 139 22 107 85 -139 163 -27 -26 39 -209 71
6429 71 142 359 -91 -90 -217 184 83 154 -63 -111 -39 -201 -189 88 -462 10 -271 248 -304 188 -169 -307 282
6452 282 -73 -287 -274 254 104 -20 432 -55 -250 -88 -340 60 -420 399 20 231 -301 54 -62 -84 -290
$$ packed form
6296E3Q0j81j22N52k50m30L39O0J59m3o22N6P32l8m95p0K02J96Lo03K19N52j71
6319A78m12P0K12J83J28m20k55L19O12o82j36rK24J80j63o11K45O31k17k80l41
6340e44N09R0j71J81k02L56J08o00n3M92J71j31n83J76L66J09j87k38o0M21K15
6361D25m60m27L33K53j45n3JJ99j16M1k79J80J77J44l76m4L07K06l37m33K84L09
6383A89Pl24m28O30K40P2p94L66L0K2j52k24K28J98R0l73k65N88J07k30q2k27
6405c32N66kk59q7L42J37m23j05J06kK67j55n1J37j17Q5k2k24L02j90JO5k48K80
6429G1P1K17m50Jj27M01j01P1k17m8P2j62J2K77n50M72k81N19n52M92l57j38N89
6452B82l55k14J3N28j50j24M52m87j95J62k52M00m80Q19l79K11n32L55j16k2k06
$$ plain form
6473 -290 1 -376 41 85 -92 -767 266 189 -80 312 -113 -263 -293 -25 -98 -587 -133 -216 -108 61 153 -260
6495 -260 79 -304 289 136 -13 -50 81 324 -68 626 -410 -345 -806 -681 -442 358 206 -671 -270 -723
6515 -723 353 236 -578 455 -481 19 -305 -154 552 -439 243 -222 71 251 -36 -571 -353 171 598
6534 598 -124 -155 76 87 443 60 -8 341 517 195 -6 -111 566 658 -115 -213 338 598 204 -160 -54 -115
6556 -115 81 -96 -533 -81 -49 -61 -261 -285 -5 67 -12 -307 -66 180 213 -313 -422 126 103 297 -456 -64
6578 -64 -155 270 27 -270 -132 211 51 -12 -267 163 529 61 -196 -98 -66 260 19 -176 14 239 180 -66
6600 -66 -236 -12 434 -110 -203 -127 -90 320 -14 -313 -84 90 35 -320 -252 51 118 -105 -136 125 83 167 -176
6623 -176 -151 57 251 197 68 -178 336 56 20 -261 -113 271 40 53 -218 -259 278 248 -239 -50 413 94
$$ packed form
6473b90K91l77M17M4j77o75J033p7k69L92m25j50l0K68p3m89M54q3J08J69R2m13
6495b60L39l83N93j53j49l7J31K43l92O94j036O5m61J25K39Q00j52q77M01m53
6515g23J076j17q14J033r36N00l24J51P06r91O82m65K93J80k87n35K18N24M27
6534E98p22l1K31J1L56l83o8L49J76l22k01j05O77R2p73r8N51K60l94l64J06o1
6556a15J96j77m37M52L2j2k00k4K80P2p9k95K41K46L3n26j09N48k3J94p53L92
6578f4r1M25k43k97J38L43j60o3k55M30L66m68k57R8L2L26k41j95J90K25n9k46
6600f6j70K24M46n44r3P6L7M10l34k99K29J74n5l55O8L03O7k23l1K61m2Q4l43
6623a76K5K08J94n4j29k46N14k80l6k81J48L84k31J3k71m1N37l0m87J89M63l19
$$ plain form
6645 94 -132 -214 -243 86 -89 -241 -72 356 187 -28 -392 -198 288 151 -194 -392 69 62 47 -102 -36 259
6667 259 155 9 -370 71 212 141 -250 -144 398 472 61 -263 -230 204 189 121 -159 -190 250 83 -296 -270
6689 -270 298 173 -2 -63 -123 -113 110 -75 -142 17 192 113 -400 -17 279 114 18 -167 93 5 21 -115 -73
6712 -73 54 189 4 -236 84 253 247 -24 -77 76 399 -8 -105 27 170 107 204 -97 -143 389 -145 -88 -301
6735 -301 -114 121 -76 31 -321 -181 -34 -284 -45 -52 -137 -8 -142 -84 26 140 -72 -224 -192 131 23 73
6757 73 -73 1 227 47 118 92 42 89 143 121 115 152 -126 196 203 -58 38 -119 -132 58 29 -282 -34 119 -25
6782 -25 39 -21 -189 263 165 98 151 29 -166 -29 -300 26 165 -141 -137 -135 -132 -34 -64 -26 -1 276 -241 84 119 72
6808 72 164 130 -127 -58 846 326 -17 -332 133 -140 269 141 -96 492 397 -458 -389 147 -188 274 -172 363
$$ packed form
6645I4k26q2k9L29j75j52J69M28j69k15l64J94M86j37l45j98M61pj5j49O6K95
6667B59j04j46l79M41J41p1l91J06N42P4m11l24L3M34j5o8k80l1M40j67l79K6
6689b70N68j25j75o1o0J0K23j85o7J59J75p9n13L83K96j65r6j85K60q8J6j36M2
6712g3J27J35j85k40L20J69ok71n3J53L23m07r7J32J43o3R7l01m6N32n34N7k13
6735c01J87K35j97J07l52J40J47k50K39pq5J29j34N8J10J14k12j52L2L23j08N0
6757G3j46P4K26j80P1k6n0M7N4k2oL7k78L22Pk61R6j57j3J90k9l11K48J53j44
6782b5O4o0j68M52r8o7N3j22j95J37k71L26J39l06MKLR8l0L8K5K77n17L25L5m7
6808G2R2l4k57O9R04n20l43l15M65k73M09j28k37N88r5q55O9N36l35M62m46N35
$$ plain form
6830 363 347 -155 -70 -234 399 -99 219 496 -44 -106 396 -109 67 267 567 858 -1503 -97 -358 440
6850 440 -294 -138 -554 173 348 -586 229 443 631 115 135 -318 -337 -193 84 -94 -328 324 -335 -444 -233
6871 -233 -145 -234 35 -238 157 423 -310 -429 -758 30 -290 310 -527 -41 -255 412 97 -529 133 515 -183
6892 -183 -213 232 -13 -76 356 611 380 -72 -330 -304 -794 -217 101 172 15 -255 -8 -289 -100 230 -118
6913 -118 119 222 69 165 -230 -83 404 447 -173 -33 60 294 -116 -27 259 -64 -2 -242 -48 413 144 77
6935 77 11 -83 46 159 44 178 152 241 302 -35 364 -4 -499 147 -61 35 228 -406 31 -502 -5 39 -115
6958 -115 -105 -13 81 -50 -173 -543 206 143 -133 -53 -62 103 474 -480 -283 119 -75 109 -486 -109 272 -213
6980 -213 -222 96 -148 95 21 -301 -195 -96 93 191 224 -73 22 -105 -315 124 185 249 -52 -211 98 216 -132
$$ packed form
6830C63j6n02Q5j64O33m98L18K77n40o2N02n05J76K00L00K91k361J406k61P98
6850D40p34J56m16P27J75r34Q15K14J88n16K0m53j9J44K77j78k34O52o59j09K11
6871b33Q8q9K69k73L95K66p33j19l29P88l20O00q37M86k14O67l15o26O62L82o98
6892a83l0M45k45o3M32K55k31m52k58K6m90N77L18P1j57k70K47k81J89L30l48
6913a18K37J03j53R6l95J47M87M3o20J40R3K34m10Q9K86l23O2k40J94M61k69o7
6935G7o6r4J29J13j15J34k6Q9O1l37L99l68m95O46k08R6J93o34M37n33M97M4j54
6958a15J0R2R4j31j23l70P49o3k76Q0rJ65L71r54J97M02j94J84n95L77L81m85
6980b13rL18k44K43p4l22J06R9J89R8L3k97R5j27k10M39O1O4l01j59L09J18l48
$$ plain form
7003 -132 -170 -103 101 29 198 -110 34 28 99 83 -106 -77 -169 93 55 -60 -221 147 70 98 -105 385 385 47 -131
7028 -131 -77 -326 45 -261 -201 229 10 58 -469 73 104 232 107 16 234 -220 425 174 31 600 352 -216
7050 -216 495 -166 -337 102 -239 -422 -557 160 -52 115 323 478 28 76 -262 312 818 -158 -138 46 607
7071 607 -318 -273 -552 228 20 -85 -248 -287 466 -136 205 -404 635 -402 -222 73 333 -40 19 130
7091 130 122 23 -289 -420 534 400 -637 -135 -50 345 393 -104 -158 252 -238 515 -529 -27 192 -12 51 419
7113 419 -294 133 183 263 -223 65 150 92 -330 213 100 42 7 -59 83 50 138 133 -47 65 287 61 -72 82
7137 82 51 -9 -8 158 131 67 34 7 52 -15 -228 157 -95 -123 78 385 10 -181 -61 -64 18 -25 -125 23 -13 -2
7163 -2 -176 -53 179 -217 -177 -333 45 174 -78 -47 -199 -49 199 6 52 39 185 331 -19 -371 314 328
$$ packed form
7003a32l8O7K04p2J69l08J44oP1j6j89K9r2K62l8j15j61L68p7K8k03M90%l38j78
7028a31N4k49L71l06O0M30k19M8n27N42L1J28j25r1K18m54O45k51j43N69k48n68
7050b16P11o61j71M39l41j83j35P17k12J67K08J55m50M8l38N74N06r76K0J84N61
7071F07r25M5k79P80k08j05j63l9P53o02L41o09J039j037J80K95K60l73N9J11
7091A30qr9l12j31R54j34j037N02Q5L95M8m97n4M10m90P53j044N02K19k04O3L68
7113D19p13M27N0Q0m86K88Q5n8m22N43j13n8l5o6J42l3Q8nj80J12K22k26j33J54
7137H2l1o0JJ66k7o4l3k7M5o7k13L85k52k8K01L07l75j91J20lQ2m3j00J48l6J1
7163bj74J23K32l96M0j56L78J29k52L1j52J50K48j93M6j3J46J46l50l52O85J4
$$ plain form
7185 328 -57 -96 -22 82 95 -64 -60 191 26 -244 -285 -295 66 219 136 -481 36 199 208 57 -253 -77 -142 0
7209 0 -50 -132 270 191 -241 -92 -7 261 -82 -116 -6 68 214 147 -261 43 39 -111 -54 68 -202 42 -101 -192
7233 -192 -22 142 -40 184 103 -96 131 41 -185 -54 -179 210 72 -152 -220 32 213 -2 -48 -17 55 17
7255 17 -148 -240 -9 126 -9 -60 69 16 68 22 46 253 53 8 -255 -93 277 154 -133 -39 -183 276 -161
7278 -161 -31 -107 119 293 76 27 121 213 107 -66 -196 -50 198 76 -101 -67 -228 70 55 61 -90 147 135
7301 135 7 -68 -80 79 -39 -235 2 11 122 -188 -46 -7 138 -106 -51 208 -3 205 174 2 -67 124 -89
7324 -89 -116 -52 130 32 -41 -74 -49 167 122 -208 -4 83 -185 63 -220 -32 180 -73 24 -40 -169 172 7 -51
7348 -51 46 38 -15 27 34 -97 239 47 -115 -99 -202 178 99 140 72 -101 -100 97 42 105 -112 -33 -41 -147 48 -174
$$ packed form
7185C28l85l9P4J04J3j59MK51j65k70m1j0L61J53q3o17N17J63Rj51l10J76o5J42
7209@n0q2M02p9m32J49Q5K68l43l4J10P4J46o7m08L04mj50N7J22k70K44j43r1
7233a92J70J64j82K24q1j99K27r0k26J31j25L89j38k24o8K52J81k15m6L1P2l8
7255A7j65r2K31J35j35n1J29n3N2m6K4K07k00m5k63J62L70j23k87R4j44M59m37
7278a61J30p6K26J74k17m9R4R2j06j73j30J46K48j22j77L4j61K98j5Oj51K37j2
7301A35j28p5j2J59j18j96K37RJ11l10J42L9J45k44N5K59k11K08l1j72o9J91k13
7324h9k7O4J82r8p3l3K5K16m5l30K04Q7k68K48k83J88K12k53R7o4j29L41j65n8
7348e1R7qn3M2Pj31L36j92j62J6j03L80p9M1o8j73JJ97n5O3k17P9qj06J95k22
$$ plain form
7374 -174 58 28 -133 -50 237 -113 -187 179 53 -140 -127 -159 478 -353 56 415 -535 -54 -33 11 231 177 140
7397 140 -19 185 128 -83 -84 -51 101 -96 -134 -59 -135 13 167 -53 -179 24 -107 -15 123 82 -196 -40 -124
7420 -124 -251 53 -39 267 -161 -156 131 227 -153 -156 25 179 41 -74 22 57 141 53 60 -9 66 161 24 -165 227
7445 227 139 -41 -184 -246 46 206 -14 96 -51 130 295 261 -192 283 110 -87 -85 -320 304 -48 6 -127
7467 -127 -90 84 -219 34 -250 212 113 -112 -26 -33 175 301 -284 -228 90 132 175 66 -182 180 453 -24 -50
7490 -50 51 121 -88 -181 102 296 129 -68 -298 -87 73 -151 130 -118 36 24 65 272 16 89 122 -195
7512 -195 -237 -172 53 121 39 -61 -158 232 -225 -284 -120 70 90 -141 -83 72 64 -46 55 -85 229 48 -117
7535 -117 -83 -69 260 18 -53 -339 93 141 62 -301 -50 142 -46 -195 -315 39 89 85 -93 -103 105 57 80 61
$$ packed form
7374a74K32l0j61Q3K87l50p4L66j26j93J3l2O37q31M09L59r50M81K1M4K20n4l7
7397A40j59K04n7k11jL3J52j97l8P5p6J48J54k20j26K03j31R2J38m1k78J56q4
7420a24j27L04r2L06m28NK87R6l80lJ81J54j38j15R6L5Q4q8Po9P5R5j37j89L92
7445B27q8j80j43o2K92J60k20J10j47J81J65l4m53M75j73j97Kk35O24l52N4j33
7467a27L7J74l03K53k84M62r9k25Q6pK08J26n85N6L18M2M3j09k48L62K73m77k6
7490e0J01P0k09r3K83J94j67j97k30K11J60k24K81k48J54j2M1K07k56P3L3l17
7512a95m2O5K25O8q2j00r7L90m57n9J64J90K0k31N8J55qj10J01j40L14j81j65
7535a17L4J4L29k42p1k86M32M8p9l63K51J92j88j49j20L54N0mj78j0K08m8K3j9
$$ plain form
7559 61 -17 246 16 -200 102 -152 139 -44 39 22 -93 274 133 -334 110 65 -8 -144 29 87 196 163 -271
7582 -271 66 169 -91 -22 -267 -96 78 261 -246 -151 425 69 -11 -155 54 117 156 88 -176 52 72 178
7604 178 -72 -18 33 31 90 -168 -7 318 16 -137 0 -60 164 189 -128 -318 -132 78 -55 -26 -107 -125 -77 -258
7628 -258 -55 -96 15 -102 -123 -23 303 -17 -61 -53 36 150 28 -103 -7 281 107 21 -2 40 -217 51 -147
7651 -147 74 81 58 60 213 227 -118 -39 -22 19 -117 -92 1 27 -100 -24 -101 137 -216 19 24 26 -135 182 -87 45
7677 45 80 85 -108 -77 -156 -41 109 -5 -74 83 103 167 115 88 20 -159 -134 -32 -41 -63 -30 17 -178 219 63 8
7703 8 99 13 -62 151 -207 -35 4 143 216 -17 -217 -76 -140 1 -114 -61 77 118 -5 -226 -37 228 116
7726 116 -175 -82 -108 49 260 -327 198 -164 190 -96 -48 14 36 135 189 -15 45 -102 77 -226 -178 279 -27
$$ packed form
7559F1p8K63k30k16L02k54K91j83Q3j7j15L67j41m67M44m5p3j36J73N8J09l3m34
7582b71L37J03k60O9k45J71J74J83n07R5N76l56q0j44K09O3L9o8k64K28K0J06
7604A78k50N4N1kN9k58J61L25l02j53J37o0K24K5l17j90J86K10j33K9q1j8M8j81
7628b58K03m1J11j17k1J00L26l20m4QQ9J14j22j31R6K88j74q6k3M2k57K68j98
7651a47K21Pk3KJ53J4l45P9J7M1j36K5R3K6j27P6p7K38l53K35NKj61L17k69J32
7677D5L5Nj93L1p9J15J50j14o9J57K0O4n2k7o8j79K5J02rk2L3M7j95L97j56n5
7703HR1q6p5K13l58J72L9J39P3k33k00J41o4J41j15N3J38M1j23k21J89K65j12
7726A16k91R3k6J57K11n87N25l62L54k86M8O2K2R9N4k04O0j47J79l03M8M57l06
$$ plain form
7749 -27 130 -58 -68 45 -260 88 222 99 277 -123 -173 -221 146 -98 -131 -34 76 131 -43 -207 59 -55
7771 -55 104 43 -3 -38 308 -57 -156 -72 74 210 69 -42 -200 76 71 81 -39 46 202 76 -204 -314 218
7794 218 15 182 -75 225 -32 102 -68 -174 47 38 -8 -17 -19 193 206 55 29 -8 154 25 -13 -312 104 270
7818 270 106 54 -99 -19 313 -2 171 -175 136 61 -213 -28 199 62 -149 98 -221 -45 10 4 -129 -128 -19
7841 -19 -13 -194 -51 279 -36 -101 -63 -106 -79 -133 -40 34 209 47 172 -128 -57 -200 -72 131 -114 -142 93 -219
7865 -219 -124 -230 -60 130 -196 -239 10 149 72 27 -152 -120 151 -168 -44 136 -107 59 -209 -239 38 -63
7887 -63 -216 -120 -31 32 42 57 -128 -201 96 177 -90 -138 38 -15 154 -141 -47 42 153 241 -247 57 123 39 76
7912 76 -167 -120 70 38 -263 -25 -69 -121 164 84 137 -22 -9 -242 -65 196 -8 -97 9 -61 -34 26 -75 -19
$$ packed form
7749b7J57j88j0J13l05L48J34j23J78m00n0m8L67k44l3R7J10N5j74j64K66j14
7771e5J59o1m6l5L46l65r9Q4J46J36j41j11j58K76nJ0j20Q5J56j26k80j10N32
7794B18k03J67k57L00k57J34j70j06K21rm6rkK12J3j51k6l7J62j29l8k99M16J66
7818B70j64n2j53Q0L32l15J73l46L11p5k74J85K27j37k11K47l19J76N5oj33JJ09
7841a9Oj81J43L30l15o5L8m3K7n4R3P4J75j62J25l00P1j43J28K03k45k8K35l12
7865b19R5j06J70J90l26m3K49J39p7m5j79L2K71l19J24J80k43J66k68l0K77j01
7887f3j53R6Q9O3J0J5j85p3K97Q1k67m8J76n3J69k95R4Q9J11Q8m88L04O6q4L7
7912G6k43M7J90l2l01K38m4n2K85q0N3j59J3k33J77K61k04q9J06p0K7O0j01N6
$$ plain form
7936 -19 -69 197 39 130 -220 21 -138 100 -21 170 124 83 -57 -69 154 26 -180 66 -57 -83 82 36 168
7959 168 59 -37 -40 -59 63 175 169 209 69 180 -69 10 -66 -182 68 -15 -76 6 151 -144 -22 -90 43 -128
7983 -128 23 -159 159 24 -150 -20 94 166 170 -130 -98 120 17 -194 -44 2 -76 69 178 53 -46 -137 -8
8006 -8 -114 -309 228 -100 -160 -49 -44 19 50 32 -10 -86 -20 75 -122 -4 -11 60 -42 -62 18 36 38 -165 170 -73 -108
8033 -108 -67 -236 136 -10 134 73 -178 44 272 25 -163 -107 210 71 -101 132 -29 128 106 349 -192
8054 -192 59 -13 -23 29 -77 -220 69 -197 -125 220 -68 -101 -205 -42 110 58 -144 -277 138 -134 132 -64
8076 -64 -7 63 74 -45 -104 -87 35 113 27 -179 -53 283 -50 -94 34 -196 190 44 185 -33 -50 224 -44
8099 -44 199 -4 13 53 75 94 84 263 -152 -223 35 -43 189 101 -252 45 116 -57 13 -4 383 -69 -98 -221
$$ packed form
7936a9n0K66j58R1l50K41j59K38j21J91m6m1j40j2K23j28k06K46j23k6J65m6J32
7959A68j09r6lj9J22J12oM0j40J11k49P9p6j16K50q3o1Q2J45k95J22o8J33j71
7983a28J51j82L18j35j74J30J14P2Ml00L2K18j03k11J50M6p8J45J09j25r9r1J29
8006hj06j95N37l28o0J11NO3L1j8m2p6O6R5j97J18pP1j02k0Q0J8Kk03L35k43l5
8033a08M1j69L72j46J44o1k51K22K28k47j88N6L17j39j72K33j61J57k2K43n41
8054a92K51p2j0N2j06j43K89k66P2L45k88l3j04J63J52n2k02j33M15k72K66j96
8076f4N7P0J1j19n9J7J22P8q6k06J26L36l33m4J28k30L86j46J41k18j7K74k68
8099d4K43k03J7M0K2J9j0J79m15p1K58p8K32q8l53K97P1j73P0j7L87m52k9j23
$$ plain form
8123 -221 53 148 85 68 221 201 425 289 76 69 -161 -84 414 -240 -334 -241 -722 194 -220 244 -311 -162 -98
8146 -98 24 24 59 -244 -158 147 -73 -6 -132 -112 56 -162 107 -173 114 35 22 -40 -92 108 154 -263 144 9
8170 9 135 -134 -64 297 143 128 -205 122 -9 8 82 64 92 -159 79 -134 -119 127 87 -101 -202
$$ packed form
8123b21K74R5o3j7J53k0K24j36k13pk30P7M98o54r4R3m81R16m14M64n55J49O4
8146i8J22%L5l03Q6L05k20O7j26K0J68k18K69k80K87p9j3o2n2K00M6m17M07j35
8170IJ26k69P0L61j54j5l33L27j31J7P4j8K8k51K38k13J5K46m0j88j01
8191b02
$$ Imaginary data points
##PAGE= N=2
##DATA TABLE= (X++(I..I)), XYDATA
$$ plain form
0 0 0 0 0 0 0 0 0 7 0 0 -8 8 -8 16 -23 24 -31 40 -48 56 -70 87 -100 118 -139 164 -186 218 -255 290 -331 380
32 380 -433 489 -553 624 -700 783 -879 981 -1092 1212 -1349 1492 -1651 1827 -2018 2221
48 2221 -2449 2703 -2976 3275 -3612 3986 -4399 4871 -5404 6013 -6718 7549 -8541 9748
62 9748 -11257 13211 -15842 19602 -25447 35845 -59906 237938 -209452 -665455 164590 627227
74 627227 245462 -494631 -464395 245720 587846 -92474 -701252 -288113 489183 333741
84 333741 -464245 -661283 57327 512144 3460 -621036 -377942 276515 410289 -174638
94 -174638 -611490 -133625 547729 272931 -430782 -392883 259374 517023 58579 -420071
104 -420071 -163832 464716 469596 -163997 -389721 127948 547517 241037 -320042 -271819
$$ packed form
0@%%%%%%%Pp%qJ6j6K4l9M7n5P1q8J04j26J57j87K18k57L03l50M04m73N45o21P11
32C80q13R22j042J177j324J483j662J860k073K304k561K841l143L478l845M239
48B221m670N152n679O251o887P598q385R270j0275J1417j2731J4267j6090J8289
62I748k1005K4468k9053L5444m5049O1292r5751K97844m47390m56003Q30045M62637
74F27227l81765p40093L0236P10115L42126o80320o08778M13139P77296j55442
84C33741p97986j97038P18610M54817n08684o24496K43094O54457J33774n84927
94a74638m36852M77865O81354k74798p03713L7899O52257K57649m58444m78650
104d20071K56239O28548M880o33593k25724N17669M19569l06480n61079M8223
$$ plain form
114 -271819 328111 477362 -61600 -390215 -70149 357404 271125 -245372 -410757 65670
124 65670 379727 5395 -421632 -252077 185473 227032 -173038 -426244 -121841 271345
134 271345 102721 -321493 -310551 76576 267006 -7065 -331368 -152853 255488 227930
144 227930 -131016 -233657 45796 301511 163913 -171127 -154315 210705 316930 10527
154 10527 -185376 -57 255190 216434 -80264 -187435 85537 264835 52349 -182767
164 -182767 -114584 117590 170046 -67242 -234775 -57318 147233 40989 -177092 -183653 -1980
175 -1980 103860 -30728 -212867 -129251 84406 64759 -110314 -150260 -26370 98360 48870
186 48870 -109841 -93076 80053 116965 -611 -65255 2550 111646 110384 -8201 -41362
$$ packed form
114b71819N99930J49251n38962l28615L20066M27553q6279n16497j65385M76427
124F5670L14057l74332m27027J69555M37550M1559m00070k53206L04403L93186
134B71345j68624m24214J0942L87127J90430k74071l24303J78515M08341k7558
144B27930l58946j02641K79453K55715j37598l35040J6812L65020J06225l06403
154A0527j95903J85319K55247l8756k96698j07171K72972J79298k12486k35116
164a82767O8183K32174N2456k37288j67533J77457K04551j06244k18081o561J81673
175a980J05840j34588j82139Q3616K13657j9647j75073l9946J23890J24730m9490
186D8870j58711J6765J73129L6912j17576o4644O7805J09096j262j18585l3161
$$ plain form
197 -41362 74140 128605 48339 -11200 11141 68313 89430 18045 -37253 20247 58807 11763
209 11763 -20756 -21552 -12401 5213 -15307 -50270 -35134 -21531 -42622 -38451 -26314 -48498 -53342
222 -53342 -32260 -26672 -22507 -34198 -59380 -18911 31273 -8269 -51163 -18758 33857 50302
234 50302 5100 -43638 9943 97835 63566 -30455 -21691 68397 107219 39472 -52686 -14900
246 -14900 112461 102025 -36421 -73355 29745 111549 47092 -93856 -89349 66994 104765
257 104765 -45887 -141167 -44566 88458 55620 -108778 -153678 10078 118257 -13563 -163581
268 -163581 -95513 78407 103687 -64678 -171296 -21020 153034 65629 -126090 -116135 77300
279 77300 169709 14456 -152740 -50500 167478 146743 -73930 -141378 43219 197602 81767
$$ packed form
197d1362J15502N4465q0266n9539K2341N7172K1117p1385n5298N7500L8560m7044
209A1763l2519p96R151J7614k0520l4963J5136J3603k1091M171J2137k2184m844
222e3342K1082N588M165j1691k5182M0469N0184l9542m2894L2405N2615J6445
234E0302m5202m8738N3581Q7892l4269r4021Q764R0088L8822o7747r2158L7786
246a4900J27361j0436j38446l6934J03100Q1804o4457j40948M507J56343L7771
257A04765j50652r5280R6601J33024l2838j64398m4900J63756J08179j31820j50018
268a63581O8068J73920K5280j68365j06618J50276J74054q7405j91719R955J93435
279G7300R2409j55253j67196J02240K17978k0735k20673o7448J84597J54383j15835
$$ plain form
290 81767 -139720 -112989 130267 189454 -31395 -180567 -37703 174205 124051 -128699 -186821
301 -186821 48146 192295 13954 -201538 -124492 122963 157982 -84416 -226400 -32712
311 -32712 187864 81878 -173513 -178696 72628 199476 -2166 -219256 -93409 178079
321 178079 162465 -103125 -198726 23320 225292 85918 -179894 -143335 140461 219788 -29462
332 -29462 -213256 -45934 215548 159033 -139634 -205830 71838 244371 38880 -219081
342 -219081 -131130 165029 203158 -86565 -246373 -19728 226487 104085 -189956 -196360 94312
353 94312 227302 -12632 -246521 -98922 193077 166667 -129322 -229127 24369 236420
363 236420 70132 -211681 -156026 147306 215808 -51656 -231533 -43022 220260 140332
$$ packed form
290H1767k21487K6731K43256N9187k20849j49172J42864K11908n0154k52750n8122
301a86821K34967J44149j78341k15492P7046K47455L5019k42398j41984J93688
311c2712K20576j05986k55391n183K51324J26848k01642k17090J25847K71488
321A78079j5614k65590r5601K22046K01972j39374k65812L6559K83796P9327k49250
332b9462j83794J67322K61482n6515k98667o6196K77668J72533k05491k57961
342b19081Q7951K96159L8129k89723j59808K26645K46215j22402k94041o404K90672
353I4312J32990k39934k33889J47599K91999k6410k95989r9805K53496K12051
363B36420j66288k81813N5655L03332O8502k67464j79877J88511K63282p9928
$$ plain form
373 140332 -159298 -198499 83302 235114 20779 -219014 -109253 178192 188089 -98079
383 -98079 -224477 7879 224849 85585 -185459 -163668 114162 209798 -27883 -219621
393 -219621 -61859 189742 138740 -126837 -189392 46395 208703 40364 -187849 -114536
403 -114536 136932 169920 -61983 -192497 -18553 182477 94438 -140521 -150387 74992 175454
414 175454 -2171 -175461 -76525 136820 127744 -89078 -167631 12319 161909 50220 -143559
425 -143559 -116085 87950 145923 -30767 -158341 -38268 136801 93817 -93634 -128915 40103
436 40103 146649 28202 -124424 -70035 100607 119709 -35435 -120889 -5014 127385 68288
447 68288 -84776 -91275 52032 118044 6007 -107514 -47463 86210 81683 -51786 -104780
$$ packed form
373A40332k99630l9201K81801J51812k14335k39793J09761K87445R897k86168
383i8079j26398K32356K16970j39264k71044K1791K77830R5636k37681j91738
393b19621J57762K51601n1002k65577o2555K35787J62308j68339k28213P3313
403a14536K51468L2988k31903j30514J73944K01030q8039k34959r866K25379J00462
414A75454j77625j73290R8936K13345r076k16822p8553J79950J49590j11689j93779
425a43559K7474K04035N7973j76690j27574J20073J75069m2984j87451l5281J69018
436D0103J06546j18447j52626N4389J70642J9102j55144q5454J15875J32399n9097
447F8288j53064o499J43307O6012j12037j13521O0051J33673m527j33469n2994
$$ plain form
458 -104780 284 93111 28336 -89596 -78966 39611 78476 -22752 -100807 -35701 66333
469 66333 47863 -58195 -82443 11527 74643 13417 -70307 -44147 49629 65583 -14758 -59485
481 -59485 -711 68986 43860 -31379 -36024 32859 66376 16688 -36583 -11422 47768 45380
493 45380 -10372 -32583 6954 41204 15955 -27452 -24640 11782 20890 -10326 -33814 -17677
505 -17677 5789 -1395 -23986 -28923 -13695 -3921 -12613 -21232 -17512 -10394 -8193 -8229 -5628 -5093 -9353
520 -9353 -3603 9475 11421 -739 -6801 11251 30354 20285 -4108 -1144 30527 42818 11780
533 11780 -14585 8001 46613 36964 -11759 -25583 19230 49805 11311 -42673 -28173 31753
545 31753 37704 -28197 -65072 -15481 40686 11051 -64273 -66684 10255 44407 -21735 -85645
$$ packed form
458a04780J05064R2827o4775j17932J0630J18577L8865j01228p8055O5106J02034
469F6333j8470j06058k4248R3970O3116o1226q3724K6160R3776J5954q0341m4727
481e9485N8774O9697k5126p5239m645O8883L3517m9688n3271K5161N9190k388
493D5380n5752k2211L9537L4250k5249m3407K812L6422R108l1216k3488J6137
505a7677K3466p184k2591m937J5228R774q692q619L720P118K201l6K601N35m260
520i353N750J3078J946j2160o062J8052J9103j0069k4393K964L1671J2291l1038
533A1780k6365K2586L8612r649m8723j3824M4813L0575l8494n3984J4500N9926
545C1753N951o5901l6875M9591N6167k9635p5324k411P6939L4152o6142o3910
$$ plain form
557 -85645 -42527 44388 38067 -52084 -81007 3461 74092 20359 -72220 -50376 58022 85683
569 85683 -9668 -74642 -568 100345 69643 -43432 -58863 51325 114806 27951 -73931
580 -73931 -29979 88608 91963 -29519 -89689 5016 101753 42923 -85901 -85254 41706 90131
592 90131 -21679 -122100 -54723 73497 57518 -82309 -125662 -3294 93181 10775 -121004
603 -121004 -91263 59484 95063 -38529 -126771 -25423 112262 72789 -79210 -98903 51243
614 51243 138406 27932 -103544 -44305 114824 124960 -28813 -105207 18193 147031 74552
625 74552 -86540 -84440 74269 137636 -372 -127279 -45856 111529 90709 -80237 -136691
636 -136691 7466 120329 19316 -140129 -108850 62854 101440 -56270 -160446 -45127
$$ packed form
557h5645M3118Q6915o321r0151k8923Q4468P0631n3733r2579K1844J08398K7661
569H5683r5351o4974P4074J00913l0702j13075j5431J10188O3481q6855j01882
580g3931M3952J18587L355j21482o0170R4705R6737n8830j28824O47J26960M8425
592I0131j11810j00421O7377J28220j5979j39827m3353J22368R6475q2406j31779
603a21004K9741J50747L5579j33592q8242J01348J37685l9473j51999j9693J50146
614E1243Q7163j10474j31476N9239J59129J0136j53773p6394J23400J28838p2479
625G4552j61092K100J58709O3367j38008j26907Q1423J57385k0820j70946n6454
636a36691J44157J12863j01013j59445L1279J71704L8586j57710j04176J15319
$$ plain form
646 -45127 108895 60964 -112717 -134225 36443 132465 5097 -138852 -67283 112011 120901
657 120901 -51497 -127389 17926 157681 73308 -97550 -82452 95427 155731 4200 -120633
668 -120633 -21854 141995 107614 -70920 -114868 38993 143558 30426 -127375 -83036 86164
679 86164 108106 -54710 -146821 -29183 108434 46320 -118873 -127312 32989 106849 -21898
690 -21898 -145361 -69339 87318 80252 -76005 -130283 7867 121123 35047 -105774 -75202
701 -75202 79681 120102 -12969 -103830 -5692 125221 86130 -56645 -75578 56365 130551
712 130551 31001 -84555 -37088 93610 96834 -31788 -92232 2515 98727 40525 -82355
723 -82355 -79900 36554 77965 -21563 -106383 -47581 56846 41761 -68407 -99681 -4865 65404
$$ packed form
646d5127J54022m7931j73681k1508J70668R6022j27368j43949P1569J79294Q890
657A20901j72398p5892J45315J39755q4373j70858J5098J77879O0304j51531j24833
668a20633R8779J63849l4381j78534m3948J53861J04565j13132j57801M4339J69200
679H6164K1942j62816r2111J17638J37617o2114j65193q439J60301P3860j28747
690b1898j23463P6022J56657p066j56257n4278J38150J13256q6076j40821L0572
701g5202J54883M0421j33071r0861R8138J30913l9091j42775j8933J31943P4186
712A30551r9550j15556M7467J30698L224j28622o0444R4747R6212n8202j22880
723h2355K455J16454M1411r9528q4820N8802J04427j5085j10168l1274R4816P0269
$$ plain form
735 65404 2715 -89069 -63690 37862 60261 -27220 -81927 -14372 71092 44319 -43725 -51106
747 -51106 33855 82328 21322 -48049 -13692 67475 69228 -6086 -41345 16705 74770 40744
759 40744 -31871 -31279 35156 59162 2180 -47884 -19201 37835 30675 -32895 -53979 -5960 30078
772 30078 -3013 -52682 -45431 4929 18284 -25567 -55209 -24391 16700 7275 -32803 -38845 654
785 654 25921 1334 -27989 -12766 23573 27773 69 -12213 10373 34863 25152 904 1914
798 1914 24806 32294 16410 960 8130 22324 20021 4227 -1246 5709 9139 2468 -4751 -6731
812 -6731 -5938 -6756 -9608 -10635 -13069 -17836 -17117 -10207 -10348 -18675 -22666 -13559 -3166 -6140 -20683 -19067
828 -19067 75 10382 -5062 -18872 -5365 20409 20136 -5942 -14258 14781 37954 18816 -11417
$$ packed form
735F5404o2689r1784K5379J01552K2399q7481n4707O7555Q5464k6773q8044p381
747e1106Q4961M8473o1006o9371L4357Q1167J753p5314l5259N8050N8065l4026
759D0744p2615N92O6435K4006n6982n0064K8683N7036p160o3570k1084M8019L6038
772C0078l3091m9669P251N0360J3355m3851k9642L0818M1091r425m0078o042L9499
785F54K5267k4587k9323J5223L6339M200k7704j2282K2586K4490r711k4248J010
798A914K2892P488j5884j5450P170J4194k303j5794n473O955L430o671p219j980
812f731P93q18k852j027k434m767P19O910j41q327l991R107J0393k974j4543J616
828a9067J9142J0307j5444j3810J3507K5774k73k6078q316K9039K3173j9138l0233
$$ plain form
841 -11417 -3646 32546 40157 5154 -19663 7889 43365 28046 -16715 -23527 18685 40814 3226
854 3226 -40199 -20884 28175 26234 -26521 -51298 -8334 33901 5704 -51308 -47037 14010 34637
867 34637 -18943 -61402 -24309 36505 26582 -39819 -53290 10958 53466 9978 -50045 -29336
879 -29336 45843 56562 -11990 -51259 4199 68487 40737 -35948 -38536 36871 71781 9229
891 9229 -55078 -18814 59859 53936 -28361 -60425 6858 66429 19468 -61162 -51400 33651 57796
904 57796 -18782 -77529 -26329 52323 35385 -54152 -73609 9011 63692 5233 -74541 -47098
916 -47098 45736 60119 -27734 -76623 -6456 73204 39196 -54378 -58025 37040 82335 6556
928 6556 -70158 -24620 71751 67079 -32359 -68870 14559 86975 32431 -64490 -51950 49423
$$ packed form
841a1417P771L6192P611l5003k4817K7552L5476j5319m4761o812M2212K2129l7588
854C226m3425J9315M9059j941n2755k4777M2964M2235k8197n7012M271O1047K0627
867C4637n3580m2459L7093O0814r923o6401j3471O4248M2508m3488o0023K0709
879b9336P5179J0719o8552l9269N5458O4288k7750p6685k588P5407L4910o2552
891I229o4307L6264P8673n923q2297l2064O7283N9571m6961q0630R762Q5051K4145
904E7796p6578n8747N1200P8652j6938q9537j9457Q2620N4681n8459p9774K7443
916d7098R2834J4383q7853m8889P0167P9660l4008r3574l647R5065M5295p5779
928F556p6714M5538R6371m672r9438l6511Q3429P2416n4544r6921J2540J01373
$$ plain form
940 49423 78206 -12865 -82088 -21535 72106 48572 -55975 -77570 15965 77621 8054 -83144
952 -83144 -52767 51386 63838 -34522 -88919 -11557 76144 35587 -67548 -69368 34571 80755
964 80755 -3199 -83594 -30398 72067 63448 -42053 -75724 16081 88434 27327 -69627 -49224
976 -49224 56981 79686 -16670 -79047 -10218 79899 48848 -55064 -67354 29157 80480 5875
988 5875 -77688 -38762 59513 60177 -36665 -78267 -517 72543 25690 -66279 -57553 36128 66567
1001 66567 -12961 -75812 -22276 61808 44160 -44363 -63795 16678 69613 11880 -62788 -36245
1013 -36245 48366 57766 -21254 -62612 -1674 63516 31143 -46108 -46958 28267 60130 -990
1025 -990 -57039 -21538 48066 41783 -28655 -52139 6455 53071 15811 -45587 -35095 29244
$$ packed form
940D9423K8783r1071o9223O0553R3641k3534j04547k1595R3535O1656o9567r1198
952h3144L0377J04153J2452r8360n4397P7362Q7701m0557j03135j820J03939M6184
964H0755q3954q0395N3196J02465q619j05501l3671R1805P2353o1107r6954K0403
976d9224J06205K2705r6356o2377O8829R0117l1051j03912j2290R6511N1323p4605
988E875q3563L8926R8275O64r6842m1602P7750P3060m6853r1969Q726R3681L0439
1001F6567p9528o2851N3536Q4084j7648q8523j9432Q0473N2935n7733p4668K6543
1013c6245Q4611R400p9020m1358O0938O5190l2373p7251q50P5225L1863o1120
1025i90n6049L5501O9604o283p0438k3484N8594M6616l7260o1398J0492O4339
$$ plain form
1037 29244 45254 -10412 -48923 -11260 41708 28048 -29126 -39629 11298 43026 6679 -39142
1049 -39142 -22843 28396 33785 -13112 -38351 -3236 35655 17192 -27619 -28443 13905 32516
1061 32516 -925 -32642 -13624 24345 21804 -15469 -28902 1471 26840 8907 -23187 -19259
1073 -19259 13408 23144 -3516 -22863 -6320 19655 15301 -11205 -17487 5228 20466 5943
1085 5943 -13661 -8298 11945 16408 -1360 -12521 -771 14365 8644 -6816 -8882 3735 10512
1098 10512 1659 -8930 -5296 4444 3939 -3791 -7262 -3593 753 -752 -4950 -5243 -3118 -2528 -2139
1113 -2139 -1869 -4005 -4984 -2157 1733 1572 -2563 -5473 350 8484 4575 -4975 -3596 7636 13054
1128 13054 3340 -7520 -1059 15510 14257 -3827 -9732 5996 19208 8306 -12553 -10798 12515
$$ packed form
1037B9244J6010n5666l8511L7663N2968j3660n7174j0503N0927L1728l6347m5821
1049c9142J6299N1239N389m6897k5239L5115L8891j8463m4811q24M2348J8611
1061C2516l3441l1717J9018L7969k541l7273j3433L0373K5369j7933l2094L928
1073a9259L2667R736k6660j9347J6543K5975m354k6506o282K2715J5238j4523
1085E943j9604N363K0243M463j7768j1161J1750J5136n721j5460k066J2617O777
1098A0512q853j0589L634R740n05p730l471L669M346j505m198k93K125N90L89
1113b139K70k136r79K827L890j61m135k910N823Q134l909r550J379J1232N418
1128A3054r714j0860O461J6569j253j8084n905J5728J3212j0902k0859J755K3313
$$ plain form
1141 12515 19091 -4445 -20982 -5117 17759 10913 -18337 -25080 3259 21228 -2614 -30373
1153 -30373 -18303 14420 17508 -16063 -33767 -4847 26321 9325 -28325 -25026 14498 30446
1165 30446 -1596 -32415 -10308 33061 27671 -16626 -27914 11265 41505 15654 -27606 -18718
1177 -18718 31108 40474 -5796 -33756 -1471 40196 25652 -26271 -34093 15625 41615 482
1189 482 -42745 -22172 28828 30116 -23697 -49504 -3859 38944 9454 -44521 -38381 17338 37249
1202 37249 -10781 -52351 -18100 38545 27181 -30997 -43017 9842 48563 13350 -41712 -25818
1214 -25818 38038 47825 -8559 -41636 -318 52539 35195 -28369 -35950 25579 55929 7683
1226 7683 -42685 -19134 40917 43455 -20265 -50886 986 49824 15840 -45745 -42168 20182
$$ packed form
1141A2515O576k3536j6537J5865K2876o846k9250o743K8339J7969k3842k7759
1153c0373J2070L2723L088l3571j7704K8920L1168j6996l7650L299L9524J5948
1165C0446l2042l0819K2107M3369n390m4297j1288L9179L0240k5851m3260Q888
1177a8718M9826R366m6270k7960L2285M1667j4544n1923p822M9718K5990m1133
1189D82m3227K0573N1000J288n3813k5807M5645M2803k9490n3975O140N5719J9911
1202C7249m8030m1570L4251N6645j1364n8178j2020N2859L8721l5213n5062J5894
1214b5818O3856R787n6384l3077M1318N2857j7344o3564p581O1529L0350m8246
1226G683n0368K3551O0051K538o3720l0621N1872M8838l3984o1585L577O2350
$$ plain form
1238 20182 43811 -12281 -61122 -22850 39670 25917 -38913 -54399 3428 47333 6891 -54504
1250 -54504 -35184 34818 44514 -16848 -51286 -5288 53376 33204 -35202 -39686 28381 58945
1262 58945 7766 -43011 -16245 48984 50434 -17769 -45909 11305 58351 22052 -39575 -34311
1274 -34311 29409 50987 -8991 -55720 -14690 43872 25704 -38536 -51462 5715 44777 -226
1286 -226 -58365 -34170 30140 32401 -26509 -54723 -8509 43484 18093 -43855 -38970 24075 44961
1299 44961 -2766 -42970 -12796 44147 38720 -21046 -35845 17637 51727 17617 -29600 -19080
1311 -19080 34742 46642 -5600 -36795 1463 42559 23678 -24972 -32019 12731 38376 -712
1323 -712 -42332 -19635 24141 20097 -22636 -41094 -7136 27506 4003 -39120 -30017 11938 21031
$$ packed form
1238B0182K3629n6092m8841L8272O2520j3753o4830j5486N7827M3905m0442o1395
1250e4504J9320P0002R696o1362l4438M5998N8664k0172o8406m484O8067L0564
1262E8945n1179n0777K6766O5229J450o8203k8140N7214M7046l6299o1627N264
1274c4311O3720K1578n9978m6729M1030N8562j8168o4240j2926N7177L9062m5003
1286b26n8139K4195O4310K261n8910k8214M6214N1993k5391o1948M885O3045K0886
1299D4961m7727m0204L0174N6943n427n9766j4799N3482L4090l4110m7217J0520
1311a9080N3822J1900n2242l1195L8258M1096j8881m8650p047M4750K5645l9088
1323g12m1620K2697M3776m044m2733j8458L3958L4642k3503m3123R103M1955R093
$$ plain form
1336 21031 -11250 -35650 -13937 24592 17689 -21848 -25530 9898 28666 8025 -19020 -10838
1348 -10838 23306 30397 -2231 -17254 7459 29451 18433 -6697 -11288 14129 28217 4976
1360 4976 -16309 -2851 16170 14601 -6774 -18327 -2382 15922 2168 -20054 -15433 1275
1372 1275 5541 -7961 -20936 -14191 5544 1963 -16695 -16478 -3292 3856 -372 -12265 -11635 5488
1386 5488 9541 -3212 -6805 2716 8969 9520 2768 -1230 8223 14888 6936 2654 6968 8677 10186
1401 10186 8150 1874 3827 8566 4449 1134 2528 -745 -935 1612 -2193 -5316 -4350 -6110 -5231
1416 -5231 -2367 -8800 -12696 -5059 -2528 -7064 -9597 -10902 -5132 2803 -3980 -13196 -4908 5567 3602
1431 3602 -3407 -7168 857 13983 8706 -7070 -2795 13923 16411 5177 -4794 1178 19179 18116
$$ packed form
1336B1031l2281k4400K1713L8529o903l9537l682L5428J8768k0641k7045Q182
1348a0838L4144P091l2628j5023K4713K1992j1018k5130m591K5417J4088k3241
1360D976k1285J3458J9021j569k1375j1553J5945J8304j3754k2222M621J6708
1372A275M266j3502j2975O745J9735l581j8658K17J3186P148m228j1893O30J7123
1386E488M053j2753l593R521O253N51o752l998R453O665p952m282M314J709J509
1401A0186k036o276J953M739m117l315J394l273j90K547l805l123R66j760Q79
1416e231K864o433l896P637K531m536k533j305N770P935o783r216Q288J0475j965
1431C602p009l761Q025J3126n277j5776M275J6718K488j1234r971N972J8001j063
$$ plain form
1445 18116 -4402 -8574 10143 19346 6748 -10806 -9512 12029 17435 -7602 -21322 -2864 14257
1458 14257 4497 -18010 -23128 1103 16571 -6635 -29586 -14015 11959 9604 -15268 -27379
1470 -27379 -3859 22145 5186 -25226 -16474 15012 22078 -2604 -22940 -4441 28944 21710
1482 21710 -14793 -18028 14716 31865 10015 -19364 -11114 26066 30848 -7516 -24744 3589
1494 3589 29929 15746 -20289 -24322 12536 30149 -4107 -33335 -13262 21133 17037 -19507
1506 -19507 -35540 -2359 28175 3468 -34623 -24274 14464 23649 -9619 -36028 -10259 29830
1518 29830 18002 -24652 -27049 11781 33279 7083 -28366 -15244 29935 32892 -10141 -28102
1530 -28102 4955 36532 20163 -21391 -23948 20164 38109 -168 -31590 -9533 28806 25649
$$ packed form
1445A8116k2518m172J8717R203j2598j7554J294K1541N406k5037j3720J8458J7121
1458A4257r760k2507n118K4231J5468k3206k2951J5571K5974k355k4872j2111
1470b7379K3520K6004j6959l0412Q752L1486P066k4682k0336J8499L3385p234
1482B1710l6503l235L2744J7149k1850k9379Q250L7180M782l8364j7228K8333
1494C589K6340j4183l6035m033L6858J7613l4256k9228K0073L4395m096l6544
1506a9507j6033L3181L0534k4707l8091J0349L8738R185l3268k6409K5769M0089
1518B9830j1828m2654k397L8830K1498k6196l5449J3122M5179K957m3033j7961
1530b8102L3057L1577j6369m1554k557M4112J7945l8277l1422K2057L8339l157
$$ plain form
1542 25649 -17074 -34963 3082 34246 6436 -34137 -24495 16736 27464 -10647 -40292 -11448
1554 -11448 30115 15738 -28669 -32092 8462 31394 1900 -35930 -19169 27628 27697 -15985 -32105
1567 -32105 2412 35375 16855 -25872 -23627 22400 36883 -2063 -30612 -6439 32175 26489
1579 26489 -16801 -29802 10360 37002 7220 -29755 -18169 21590 28942 -10294 -35082 -5118
1591 -5118 30513 13035 -26922 -27659 9689 28423 -2329 -34572 -15340 24197 19581 -18565 -29617
1604 -29617 2055 27762 8480 -27257 -19913 19238 26176 -7099 -25796 -3343 26536 18083
1616 18083 -17003 -21850 11899 28176 2551 -21424 -9378 19991 21671 -8719 -22672 2106
1628 2106 24058 8198 -18377 -15568 10533 20033 -2478 -22723 -7236 17293 11009 -13801 -18357
$$ packed form
1542B5649m2723j7889L8045L1164k7810m0573R642M1231J0728l8111k9645K8844
1554a1448M1563j4377m4407l423M0554K2932k9494l7830J6761M6797O9m3682j6120
1567c2105L4517L2963j8520m2727K245M6027J4483l8946k8549K4173L8614n686
1579B6489m3290j3001M0162K6642k9782l6975J1586L9759P352l9236k4788K9964
1591e118L5631j7478l9957p37L7348J8734l0752l2243J9232L9537m616l8146j1052
1604b9617L1672K5707j9282l5737P344L9151O938l3275j8697K2453K9879q453
1616A8083l5086m847L3749J6277k5625k3975J2046K9369J680l0390j3953K4778
1628B106K1952j5860k6575K809K6101R500k2511k0245J5487K4529o284k4810m556
$$ plain form
1641 -18357 1308 17242 2953 -19215 -11994 11720 13185 -6279 -16525 -2314 13389 8823
1653 8823 -11092 -11905 6609 14200 -80 -11189 -5493 10339 11132 -4661 -10756 1584 11698
1666 11698 4459 -7287 -6865 5482 10465 -275 -9552 -2500 7082 5311 -4214 -7388 75 7431
1680 7431 2260 -7014 -4885 3669 4823 -1214 -5499 -2151 3982 3297 -3250 -3868 1179 3240 797
1695 797 -2193 -2355 1331 2508 -315 -2003 -30 652 590 478 -1209 -1066 194 855 422 -312 -1565
1712 -1565 -1081 1921 1232 -1858 -2380 423 2824 1657 -3109 -3334 2320 4385 -289 -4416 -1405 4616
1728 4616 4991 -2112 -5718 1262 7760 2783 -5667 -4483 4603 8126 -686 -8789 -2351 8530 5682
1743 5682 -6214 -8946 2145 9650 1217 -11184 -7233 7011 8842 -5066 -13448 -2572 10861
$$ packed form
1641a8357J9665J5934j4289k2168P221K3714J465j9464j0246J4211J5703m566
1653H823j9915q13J8514P591j4280j1109N696J5832P93j5793o095J2340J0114
1666A1698p239j1746M22J2347M983j0740r277P052R582j771r525l174P463P356
1680G431n171r274K129Q554J154o037m285L348O133o85o547o18N047K061k443
1695G97k990j62L686J177k823j688J973O82o2j12j687J43J260O61m33p34j253
1712a565M84L002o89l090n22K803K401j167m766k25N654K065m674m127L011O021
1728D616L75p103l606O980O498m977q450J184R086L523q812q103O438J0881k848
1743E682j1896k732J1091P505q433j2401L951J4244J831j3908q382J0876J3433
$$ plain form
1756 10861 5266 -10577 -11913 4967 12863 -545 -14128 -6195 11510 11743 -6931 -14200 2602
1769 2602 16327 5956 -11988 -9791 10687 16716 -1758 -15214 -2178 17030 11805 -10225 -14438
1782 -14438 6383 18631 2848 -17444 -9804 13851 14499 -8431 -19457 -1937 16934 6485
1794 6485 -17126 -16322 7282 17304 -3455 -21522 -9032 15501 12673 -12501 -19992 2607 19950
1807 19950 4836 -18381 -12730 13590 19825 -3997 -19155 -1766 21404 13732 -12724 -15906 9147
1820 9147 23665 3870 -18373 -8422 18179 18477 -8625 -19842 837 21262 8339 -18593 -16588
1833 -16588 9988 19437 -4051 -24160 -8888 17061 12245 -15594 -22719 1676 19344 2270
1845 2270 -22599 -15004 12619 17799 -7742 -22893 -3712 21420 12331 -14686 -17728 9274 23744
$$ packed form
1756A0861n595j5843j336J6880P896j3408j3583P933J7705K33j8674p269J6802
1769B602J3725j0371j7944K197K0478O029j8474j3456J3036J9208n225k2030m213
1782a4438K0821J2248j5783k0292P640K3655O48k2930j1026J7520J8871j0449
1794F485k3611Q04K3604J0022k0759j8067J2490K4533k828k5174p491K2599J7343
1807A9950j5114k3217N651K6320O235k3822j5158J7389K3170p672k6456l182K5053
1820I147J4518j9795k2243R951K6601K98k7102j1217K0679K0425j2923k6932K005
1833a6588K6576R449k3488k0109J5272K5949m816k7839p125K4395J7668j7074
1845B270k4869P595K7623N180k5541j5151J9181K5132r089k7017l042K7002J4470
$$ plain form
1858 23744 3068 -19238 -7938 19777 20560 -7025 -18752 3191 24848 10409 -16240 -13806
1870 -13806 13262 22257 -2636 -21246 -6299 18473 13064 -14278 -20829 3663 19231 1017
1882 1017 -22688 -14637 11579 14423 -10464 -23460 -4439 17325 7143 -18417 -17917 7205 18106
1895 18106 -1572 -20133 -7623 16980 15424 -8710 -16631 4508 21959 8278 -13576 -8515
1907 -8515 14729 19878 -1174 -15051 -611 19234 12143 -9840 -12702 6522 17143 970 -16435
1920 -16435 -8369 11752 11120 -9129 -17290 -1598 11942 1513 -15557 -13016 4675 9954 -5276
1933 -5276 -16407 -6096 9613 5963 -10194 -12622 2555 11614 2258 -10758 -5464 9142 11512
1946 11512 -1019 -8574 1998 13237 8592 -4151 -4713 6907 12008 3079 -5467 -788 9546
$$ packed form
1858B3744k0676k2306J1300K7715P83k7585j1727K1943K1657j4439k6649K434
1870a3806K7068Q995k4893j8610J4947K4772n409k7342o551K4492J5568j8214
1882A017k3705Q051K6216K844k4887j2996J9021K1764j0182k5560N00K5122J0901
1895A8106j9678j8561J2510K4603j556k4134p921K1139J7451j3681k1854N061
1907h515K3244N149k1052j3877J4440J9845p091k1983k862J9224J0621j6173j7405
1920a6435Q066K0121o32k0249q161J5692J3540j0429j7070K541J7691N279j5230
1933e276j1131J0311J5709l650j6157k428J5177R059r356j3016N294J4606K370
1946A1512j2531p555J0572J1239m645j2743n62J1620N101q929q546M679J0334
$$ plain form
1959 9546 7443 -2961 -6272 1036 7166 1511 -6854 -6541 1854 3869 -3457 -9178 -4802 1888 -156
1974 -156 -7068 -8263 -2542 1466 -2103 -6523 -4654 346 2207 -2077 -4806 -565 3081 2809 -398
1989 -398 -300 2969 4271 3805 1566 2431 4475 5248 3186 2614 2702 3343 2944 1873 722 612 780 600
2007 600 795 -200 -2875 -1268 -733 -221 -3258 -3895 -2304 -1016 -2498 -5677 -4121 -1665 -193 -3628
2023 -3628 -5670 -3399 1215 1192 -3929 -4158 332 4724 2193 -3849 -1366 5778 6973 853 -2643 1991
2039 1991 8338 7045 -874 -2555 4559 10047 3586 -5499 -1567 7612 7186 -2518 -7838 -847 6507
2054 6507 2407 -8857 -7810 2208 6036 -3863 -11616 -5596 5160 3371 -8830 -12337 -1055 7990
2068 7990 366 -11047 -8148 6211 9131 -3369 -11161 -1129 11750 7897 -6401 -8142 7075
$$ packed form
1959I546k103j0404l311P308O130n655q365L13Q395K015p326n721M376O690k044
1974a56o912j195N721M008l569m420J869N000J861m284k729M241L646k72l207
1989c98R8L269J302m66k239Q65K044P73k062n72Q8O41l99j071j151j10J68j80
2007F00J95r95k675J607N35N12l037o37J591J288j482l179J556K456J472l435
2023c628k042K271M614k3n121k29M490M392k531o042K483P144J195o120l496M634
2039A991O347j293p919j681P114N488o461r085L932R179m26r704n320O991P354
2054F507m100j1264J047J0018L828r899p753O020J0756j789j2201l507J1282R045
2068G990p624j1413K899J4359K920j2500p792J0032J2879l853j4298j741J5217
$$ plain form
2081 7075 14725 3247 -9366 -3087 12555 13203 -2976 -9747 2980 14511 6164 -9893 -9084 7636
2095 7636 13504 -2882 -14776 -5010 10785 6955 -11091 -14571 1599 10834 -490 -16764 -11002
2108 -11002 7135 9237 -7834 -15868 -2399 11975 5292 -11455 -12116 6254 14505 67 -13484
2121 -13484 -5000 13249 13088 -5795 -12253 4185 17863 6732 -10490 -7784 11323 17112 -792
2134 -792 -13264 -1958 15760 10351 -9357 -12964 4380 14940 1463 -15125 -8998 9561 10159
2147 10159 -8089 -16688 -2498 12471 4547 -14254 -14014 4817 12431 -2626 -16292 -6898 11896
2160 11896 10252 -9192 -14621 2852 15632 4694 -12046 -7666 11123 15326 -2097 -13003 -584
2173 -584 16458 10293 -8223 -11075 6928 16615 2355 -13116 -5882 11695 12008 -6586 -14307 10
$$ packed form
2081G075P650j1478j2613O279J5642O48j6179o771J2727J1531q347j6057Q09J6720
2095G636N868j6386j1894R766J5795l830j8046l480J6170R235j1324j6274N762
2108a1002J8137K102j7071q034J3469J4374o683j6747o61J8370Q251j4438j3551
2121a3484Q484J8249j61j8883o458J6438J3678j1131j7222K706J9107N789j7904
2134g92j2472J1306J7718n409j9708l607J7344J0560j3477j6588O127J8559N98
2147A0159j8248q599J4190J4969p924j8801K40J8831P614j5057j3666R394J8794
2160A1896j644j9444n429J7473J2780j0938j6740M380J8789M203j7423j0906J2419
2173e84J7042o165j8516k852J8003R687j4260j5471P234J7577L13j8594p721J4317
$$ plain form
2187 10 13338 4141 -12819 -11959 5834 10876 -4121 -15463 -6415 10146 7085 -10036 -13387 2323
2201 2323 12143 1773 -12777 -7678 8122 10999 -4042 -12333 247 12646 6612 -8303 -8092
2214 -8092 6135 13410 1308 -10320 -2858 11181 9405 -4007 -9189 2789 11571 3610 -8801
2227 -8801 -6526 6927 8828 -2762 -10574 -2585 7427 4609 -7447 -9097 2250 6916 -1313 -9704
2241 -9704 -5296 5134 3962 -5163 -7696 -1048 6586 2178 -6031 -4623 3508 6259 -844 -5488 -525
2256 -525 5789 4465 -3044 -4117 1824 6035 1758 -3941 -2037 3536 4937 -949 -3871 68 3917
2271 3917 2092 -2341 -3288 660 2715 -347 -3245 -1619 1184 1604 -1847 -2927 -632 1257 161
2286 161 -2295 -1796 -550 436 -713 -1777 -681 213 344 227 -221 -131 765 507 575 353 -63 210 892
$$ packed form
2187A0J3328r197j6960Q60J7793N042j4997j1342R048J6561l061j7121l351J5710
2201B323R820j0370j4550N099J5800K877j5041q291J2580J2399o034j4915K11
2214h092J4227P275j2102j1628P462J4039j776j3412n182J1978Q782p961j2411
2227h801K275J3453J901j1590p812P989J0012k818j2056j650J1347M666q229q391
2241i704M408J0430j172r125k533O648P634m408q209J408Q131K751p103m644M963
2256e25O314j324p509j073N941M211m277n699J904N573J401n886k922L939L849
2271C917j825m433r47L948K055l062k898J626K803M20l451j080K295J889j096
2286A61k456M99J246R86j149j064J096Q94J31j17m48R0Q96k58O8k22m16K73O82
$$ plain form
2305 892 1110 202 -488 515 1403 1414 -835 -1381 273 2334 683 -1691 -1269 1193 1932 -625 -2812
2322 -2812 -1102 2292 1372 -2042 -3040 646 3161 357 -3854 -2951 2827 2562 -1552 -4328 -911 4171
2338 4171 2638 -3077 -4093 1881 5336 278 -4600 -2089 4986 4611 -2802 -5429 591 6003 2413
2353 2413 -4820 -4853 3443 6279 -967 -6943 -2049 6075 4770 -4010 -6681 1776 7650 1540 -6944
2368 -6944 -4333 5298 7051 -2408 -8273 -760 8081 4431 -5966 -6444 4029 8097 43 -8811 -3665
2383 -3665 7452 6865 -4991 -9122 855 9123 2779 -8979 -6501 5428 8248 -2137 -10013 -3128
2397 -3128 8192 5828 -7091 -9282 2914 10247 905 -9846 -5342 7502 9146 -3827 -9432
2410 -9432 -247 11040 4974 -7894 -7230 4791 10957 321 -9815 -3673 9954 7687 -5504
$$ packed form
2305H92K18r08o90J003Q88J1k249n46J654K061j651k374M22K462P39k557k187
2322b812J710L394r20l414r98L686K515k804m211R03N778k65m114k776L417N082
2338D171j533n715j016N974L455n058m878K511P075l75p413k627O020N412l590
2353B413p233l3Q296K836p246n976M894Q124j305q780k671Q457N874o110q484
2368f944K611R631J753r459n865P513Q841l650j0397m78J0473M068q054q854N146
2383c665J1117n87j1856m131R977Q268o344j1758K478J1929K820j0385p876O885
2397c128J1320k364j2919k191J2196P333r342j0751M504J2844J644j2973n605
2410i432R185J1287o066j2868O64J2021O166j0636j0136O142J3627k267j3191
$$ plain form
2423 -5504 -9687 1912 10752 3359 -9237 -7079 6302 9152 -3290 -11060 -2351 10066 6258 -7788
2437 -7788 -10624 2558 10316 -6 -10846 -6210 7364 8440 -5047 -10720 -434 10371 4452
2450 4452 -8181 -8692 5517 10962 -324 -10269 -3693 10482 8856 -5034 -9380 2899 11785 3511
2464 3511 -8794 -6253 7503 10447 -2022 -10774 -1123 10322 6085 -7426 -8996 2964 8988
2477 8988 173 -10573 -5837 6779 6528 -5231 -11396 -741 8408 2867 -9964 -8729 4916 9878
2491 9878 -1466 -9842 -3168 8866 7040 -5461 -7916 2533 11211 1944 -6964 -5276 7116 9223
2505 9223 -1973 -8021 -118 9948 5024 -5946 -6229 4536 9028 317 -7969 -2868 5686 6022
2519 6022 -4587 -8774 375 6884 1852 -7657 -6704 3098 5093 -2515 -8422 -3083 5059 3418 -5713
$$ packed form
2423e504m183J1599Q840p393j2596K158J3381K850j2442p770Q709J2417l808j4046
2437g788k836J3182P758j0322j0840M636J3574J076j3487n673J0286J0805n919
2450D452j2633n11J4209N445j1286r945O576J4175j626j3890m346J2279Q886q274
2464C511j2305K541J3756K944j2469q752R651J1445m237j3511j570J1960O024
2477H988q815j0746M736J2616k51j1759o165J0655R149n541j2831J235J3645M962
2491I878j1344q376O674J2034j826j2501k455J0449Q678r267q908J688J2392K107
2505I223j1196o048P903J0066m924j0970k83J0765M492q711q286N101Q554L36
2519F022j0609m187R149O509n032r509R53R802J995p608n907N339Q142j641r131
$$ plain form
2534 -5713 -5674 1645 5371 322 -7325 -3708 5560 5161 -2738 -4571 1408 6820 2813 -3852 -1685 5649
2550 5649 5362 1669 -3584 161 5305 3476 -392 -2951 965 4744 527 -2175 -2170 1834 2619 -582
2566 -582 -4030 -1462 1601 -788 -3880 -4517 -758 830 -1370 -4844 -1379 232 403 -1643 -1098 -492
2582 -492 1138 735 -1058 -558 1784 1366 1108 100 309 2321 2198 1916 305 1664 1076 1935 2246 1380
2600 1380 836 620 488 1029 -84 -99 115 220 533 -1107 -1851 -523 -106 -570 -2834 -3276 117 -100
2618 -100 -2368 -3071 -2125 584 -410 -2012 -3499 656 2684 -572 -2491 -761 2559 3895 845 -1375
2634 -1375 946 4235 3208 -1181 -624 3246 5595 2207 -2776 -562 4306 4759 -1300 -3384 1036
2649 1036 4390 2388 -4347 -3706 2635 2567 -2361 -6473 -2279 3072 1769 -4817 -6780 -690 4249 -782
$$ packed form
2534e713L9P319L726n049p647L617R268l99p899j833N979N412m007o665K167P334
2550E649k87l693n253L745N144j829l868k559L916L779m217k702NM004P85l201
2566e82l448K568L063k389l092o37L759J588k200l474L465J611J71k046N45O06
2582d92J630m03j793N00K342m18k58j008K09K012j23k82j611J359n88Q59L11q66
2600A380n44k16j32N41j113j5K14J05L13j640p44J328M17m64k264m42L393k17
2618a00k268p03R46K709r94j602j487M155K028l256j919J730L320J336l050k220
2634a375K321L289j027m389N57L870K349l388m983K214M868M53o059k084M420
2649A036L354k002o735O41O341o8m928m112M194N351j303o586j963O090M939n031
$$ plain form
2665 -782 -6406 -4126 1954 4286 -2266 -7018 -447 6641 2792 -3662 -4758 3098 7426 2062 -5199
2680 -5199 -691 7596 6587 -1828 -5112 1411 7866 3905 -4852 -3256 5390 7244 -1073 -7600 -1142
2695 -1142 6741 3558 -6235 -7343 1629 6338 -800 -7239 -5665 3484 5008 -3889 -9589 -1273 6404
2710 6404 1335 -6892 -6547 2718 7422 -1101 -8300 -2128 7650 6355 -3576 -6443 2239 9638 3432
2725 3432 -6813 -3484 6853 8212 -334 -6920 -214 8763 5562 -4954 -6542 3921 7978 520
2739 520 -7343 -3899 5477 5577 -4377 -8628 -228 6941 1288 -7956 -7342 1495 6395 -3109 -9575 -3398
2755 -3398 5526 4081 -5195 -7931 1358 8778 2128 -7043 -4179 6055 7714 -1263 -6419 250 9114
2770 9114 5962 -4892 -4542 4540 8608 1610 -5983 -2312 6624 6711 -2969 -7310 915 6943 1918
$$ packed form
2665g82n624K280O080K332o552m752O571P088l849o454j096P856M328n364p261
2680e199M508Q287j009q415l284O523O455l961q757J596Q646J854q317o527O458
2695a142P883l183r793j108Q972M709p138o439J574R149J524q897n700Q316P677
2710F404n069q227L45R265M704q523p199O172R778j295r931k867Q682P399o206
2725C432j0245L329J0337J359q546o586O706Q977l201j0516j588J0463M057p458
2739E20p863L444R376J00r954m251Q400P169n653r244O14Q837M900r504o466O177
2755c398Q924j445r276k736R289P420o650r171K864J0234J659q977n156O669Q864
2770I114l152j0854L50R082M068o998p593L671Q936Q7r680m341Q225O028n025
$$ plain form
2785 1918 -5999 -6125 2921 6464 -1953 -8515 -2589 4840 3648 -4982 -7726 583 6047 -25 -7474
2800 -7474 -3977 4547 5345 -2792 -6392 -723 7548 3343 -5223 -4512 3709 6892 730 -5244 -1601
2815 -1601 6581 5649 -2698 -4706 1472 6201 2308 -4185 -3396 4601 5189 -2018 -4721 -852 4013 2302
2831 2302 -4330 -4836 1554 4506 -1046 -5515 -2594 2205 1817 -3020 -4848 -719 4328 366 -3945
2846 -3945 -2447 1483 2876 -220 -3569 -1509 4114 2519 -1845 -1670 2059 3235 1387 -2222 -732
2861 -732 3139 3116 -369 -1335 790 1688 1271 -1012 -1567 747 2055 -275 -1608 -261 564 39 -530
2878 -530 -1543 -860 790 -1037 -1565 -602 -840 -833 -368 -853 -382 190 -395 -582 -390 -58 105 465 576 41
2898 41 138 442 650 1204 832 -293 560 970 1248 61 -478 382 1577 600 -1539 -586 1089 926 -681
$$ packed form
2785A918p917j26R046L543q417o562N926P429j192q630k744Q309N464o072p449
2800g474L497Q524P98q137l600N669Q271m205q566P11Q221L183o162n974L643
2815a601Q182r32q347k008O178M729l893o493P89P997N88p207k703L869M865j711
2831B302o632n06O390K952n552m469K921M799l88m837j828M129N047l962m311
2846c945J498L930J393l096l349K060N623j595m364J75L729J176j848l609J490
2861g32L871k3l485r66K125Q98m17k283n55K314J308k330j333J347Q25n25n69
2878e30j013O83J650j827n28R63k38PM65m85M71N72n85j87J92L32J63L60J11n35
2898D1R7L04K08N54l72j125Q53M10K78j187n39Q60J195r77k139R53J675j63j607
$$ plain form
2917 -681 -1024 -817 1396 838 -2017 -2033 514 1237 -259 -2500 -2002 714 1695 -1628 -3035 127 1884
2934 1884 1178 -1832 -2486 698 3105 -137 -2530 -542 2111 2613 -900 -3024 240 3788 1336 -2882
2950 -2882 -998 2452 3639 -66 -3251 -1223 3975 2327 -2859 -2512 1053 3679 832 -3669 -2690
2965 -2690 3325 3469 -1950 -4294 -226 4123 2266 -3507 -4555 1789 4699 -140 -4937 -1860 3823
2980 3823 3516 -2366 -4804 730 5256 1926 -4291 -3511 3352 4678 -919 -5404 -1328 5506 3236
2995 3236 -4277 -4697 1928 5924 1060 -5626 -3229 4699 4703 -2397 -5373 -318 5659 2816 -4462 -4537
3011 -4537 3004 5864 -669 -6133 -1873 4929 4007 -3108 -5870 1079 6165 1312 -5883 -3754 3331
3026 3331 6064 -1618 -6578 -815 6024 3127 -4863 -5667 1853 5902 566 -6537 -2599 5129 4922
$$ packed form
2917f81l43K07K213n58k855j6K547P23j496k241M98K716R81l323j407L162J757
2934A884p06l010o54L184K407l242k393J988K653N02l513k124L264L548k452m218
2950b882J884L450J187l705l185K028N198j648n186L47L565K626k847m501R79
2965b690O015J44n419k344M068M349j857n773j048O344K910m839m797L077N683
2980C823l07n882k438N534M526l330o217P80O863J326n597m485M076O834k270
2995C236p513m20O625L996m864o686K397P928Mp100k976N055N977k843p278p5
3011d537P541K860o533n464M260O802r22p115k762O949N086m853p195K129P085
3026C331K733p682m960N763O839k897p990q04P520M049n336p103L938P728k07
$$ plain form
3041 4922 -2628 -6735 -281 5597 2047 -4540 -4211 3300 5528 -1156 -5262 -808 4271 3917 -4402
3056 -4402 -5818 867 6583 1528 -5097 -2710 3717 5868 -1782 -5472 -518 5632 2652 -4908 -4261
3071 -4261 1911 5777 256 -5759 -2255 4936 3923 -3005 -6002 -822 5426 1869 -4838 -4454 3121
3086 3121 4534 -1695 -5908 -939 5426 3732 -4068 -4460 2040 5271 -69 -4896 -2171 4308 5272
3101 5272 -938 -4348 797 5036 3698 -3129 -2950 3592 5128 -38 -4159 -391 3259 2551 -2433
3116 -2433 -4225 146 4140 195 -4568 -3234 2482 3020 -1372 -4821 -664 2853 880 -3233 -4599
3131 -4599 1700 3167 -98 -4514 -2374 2157 3536 -2073 -2708 1023 3452 340 -2487 -1108 2767
3146 2767 3704 408 -3094 57 3613 2079 -912 -2020 958 2189 20 -2035 -1159 2017 1241 -1380
$$ packed form
3041D922p550m107O454N878l550o587L29P511K228o684m106M454N079l54q319
3056d402j416O685N716n055o625K387O427K151p650l690M954O150k980p560O47
3071d261O172L866n521o015L504P191j013o928k997N180O248l557o707L84P575
3086C121J413o229m213M969O365j694p800l92O500L231n340m827K725O479R64
3101E272o210l410N145M239j338o827J79O542J536n166m121L768L650p08m984
3116b433j792M371L994l945m763J334N716N38m392l449M157L517j973m113j366
3131d599O299J467l265m416K140M531J379n609o35L731K429l112k827J379L875
3146B767R37l296l502L151L556j534k991j108K978J231k169k055Q76L176p76k621
$$ plain form
3162 -1380 -2554 -414 542 -563 -2019 -1608 100 1164 -1116 -2212 -1106 112 80 -1245 -1801 -834
3178 -834 140 -213 687 -593 961 836 847 -182 680 1691 1152 767 -137 1713 1036 1009 863 433 455
3197 455 1159 583 1274 1052 -477 -380 1048 52 -681 -1005 -390 736 -43 -1025 -1103 -160 925 -944 -1488
3216 -1488 -1048 963 -928 -1438 -1861 485 1371 -476 -2186 -497 1628 1668 -93 -1122 642 2653
3232 2653 1992 -1078 -648 2131 3174 155 -816 -135 3243 2205 -326 -1382 860 2752 533 -2036
3248 -2036 -1451 1630 2218 -1413 -3599 -1376 2208 1534 -3259 -2623 -62 2355 -929 -3578 -2432 1965
3264 1965 1851 -2207 -3947 -461 3074 1641 -3016 -2180 2405 4049 341 -2949 -175 3924 3157 -1189
3280 -1189 -2363 2005 5063 2046 -2946 -1485 4214 3923 -820 -4525 -173 4201 2120 -3145 -3798
$$ packed form
3162a380j174K140R56j105j456M11J708J064k280j096J106J218l2j325n56R67
3178h34R74l53R00j280J554j25J1j029Q62J011n39l85r04J850o77k7j46m30K2
3197D55P04n76O91k22j529R7J428r96p33l24O15J126p79r82p8R43J085j869n44
3216a488M40K011j891n10m23K346Q86j847j710J689K125M0j761j029J764K011
3232B653o61l070M30K779J043l019r71O81L378j038k531j056K242J892k219k569
3248b036N85L081N88l631k186K223L584o74m793O36K561K417l284k649J146M397
3264A965j14m058j740L486L535j433m657Q36M585J644l708l290K774M099p67m346
3280a189j174M368L058l017m992J461N699k91m743l705M352M374k081n265o53
$$ plain form
3295 -3798 1723 3698 -338 -5093 -2016 2806 2206 -2898 -5607 -322 3053 758 -4937 -3768 2006
3310 2006 3435 -986 -5160 -1529 4795 3034 -3142 -3681 1609 5083 1189 -3778 -1261 3776 5025
3325 5025 -662 -3580 755 5795 3219 -3289 -2984 2917 5003 -362 -4574 -1869 3856 3342 -2294
3340 -2294 -4501 -139 4704 530 -5420 -3290 2112 3297 -2134 -5688 -1483 3451 1789 -4053 -3857
3355 -3857 1111 4348 575 -4160 -2587 3983 3779 -1403 -3450 452 5648 2609 -2687 -2399 3113
3370 3113 5147 689 -3059 -673 3996 2869 -1850 -2829 1349 4018 1142 -3774 -3078 2529 2880 -977
3386 -977 -4825 -1617 3536 1380 -2781 -4119 423 3520 -517 -4161 -2267 2154 2378 -2192 -4015
3401 -4015 103 3862 1693 -3471 -2568 2251 4156 506 -2704 -230 3534 3333 -1207 -2196 1797 3925
$$ packed form
3295c798N521J975m036m755L077M822o00n104k709N285L375k295n695J169N774
3310B006J429m421m174L631O324j761o176n39N290L474l894m967K517N037J249
3325E025n687k918M335N040k576o508L05N901K086n365m212K705N725n14n636
3340b294k207M362M843m174n950K130N402J185n431l554M205M934j662n842J96
3355c857M968L237l773m735J573O570k04n182k047L902N196l039n296K88N512
3370C113K034m458l748K386M669j127m719r79M178K669k876m916O96N607L51l857
3386i77l848L208N153k156m161j338M542L097m037l644J894M421K24m570j823
3401d015M118L759k169n164R03M819J905l650l210K474L764k01m540r89L993K128
$$ plain form
3417 3925 1000 -2416 -1334 1855 2837 -911 -2595 -226 3203 1471 -2661 -2112 399 2294 -891
3432 -891 -3173 -1383 1229 1256 -1681 -2883 -316 2461 676 -2185 -1957 1200 1742 -496 -2088 -188
3448 -188 1809 1332 -1336 -1320 1607 2135 1089 -637 -43 1975 2070 102 -311 1074 1513 1211 -902 -370
3466 -370 1073 894 65 -1031 -308 961 56 -983 -539 159 -349 -413 -914 -792 -32 -435 -936 -661 -607
3485 -607 38 -613 -640 -309 -306 -78 -156 141 40 -454 156 193 827 277 276 587 1151 873 164 162 472 1279 469
3508 469 -357 -402 864 951 -180 -850 -150 872 381 -1062 -1226 181 950 -254 -1799 -1138 742 529
3526 529 -1058 -2116 -298 1442 118 -1746 -1427 646 1611 -377 -1999 -464 1821 1305 -974 -1901
3542 -1901 686 2176 1103 -1242 -1232 1985 2068 -440 -1678 -27 2444 1253 -1172 -1843 851 2422
$$ packed form
3417C925k925l416J082L189R82l748j684K369L429j732m132N49K511J895l185
3432h91k282J790K612K7k937j202K567K777j785k861K28L157N42k238j592J900
3448a88J997m77k668J6K927N28j046j726N94K018R5j968m13J385M39l02k113N32
3466c70J443j79q29j096P23J269r05j039M44O98n08o4n01J22P60m03n01K75N4
3485f07O45o51k7L31LK28p8K97j01m94O10L7O34n50jL11N64k78p09kL10Q07q10
3508D69q26m5J266Q7j131o70P00J022m91j443j64J407P69j204j545O61J880k13
3526E29j587j058J818J740j324j864L19K073R65j988j622J535K285n16k279r27
3542a901K587J490j073k345J0L217Q3k508j238J651K471j191k425o71K694J571
$$ plain form
3558 2422 243 -2452 -1072 1798 1796 -1498 -2816 -242 2251 489 -3157 -2377 897 2230 -535 -3255
3574 -3255 -842 2796 1376 -1731 -2912 170 2827 849 -2931 -1685 2123 2812 -848 -2915 -122
3589 -122 3277 2009 -2152 -2461 1375 3541 300 -3222 -1153 2763 2951 -1266 -3024 119 3363 1112
3605 1112 -2900 -2435 1441 3053 -775 -3782 -828 2858 2121 -2389 -3237 849 3328 710 -3643 -2022
3621 -2022 2584 2900 -1148 -3376 -264 3248 1788 -2810 -2835 1895 3485 -24 -3763 -1140 2882 2850
3637 2850 -1577 -3166 631 3432 1129 -3087 -2050 2045 3176 -694 -3390 -809 3287 1570 -2262
3652 -2262 -2978 1044 3469 537 -3416 -1747 2584 2755 -1184 -3365 -231 3109 1680 -2621 -2728 1650
3668 1650 3100 -338 -3231 -1018 2731 2178 -1763 -2851 619 3269 867 -2750 -2057 1899 2767 -827
$$ packed form
3558B422k179k695J380K870kl294j318K574K493j762l646P80L274J333k765k720
3574c255K413L638j420l107j181L082K657j978l780J246L808O89l660k067K793
3589a22L399j268m161l09L836K166l241l522K069L916J88m217j758L143L244k251
3605A112m012M65L876J612l828l007K954L686p37m510q48M086K479k618m353J621
3621b022M606L16m048k228L112L512j460m598k5M730J590l509l739K623M022l2
3637B850m427j589L797K801k303m216J037M095J131l870k696K581M096j717l832
3652b262p16M022K425k932l953J669M331J71l939k181L134L340j429m301j07M378
3668A650J450l438k893K213L749n53l941j088L470K650k402l617O93L956Q68l594
$$ plain form
3684 -827 -3112 -564 2844 1713 -1923 -2276 976 2994 301 -2763 -1434 2003 2492 -918 -2683 389
3700 389 2704 1133 -2192 -1878 1206 2774 -286 -2502 -413 2369 1825 -1318 -2255 676 2432 539
3716 539 -2095 -1607 1640 2102 -971 -2318 -402 1938 957 -1864 -1759 644 1987 -338 -2141 -782
3732 -782 1608 1352 -1089 -1773 251 1791 642 -1291 -861 1249 1779 -323 -1241 83 1513 1076 -717
3749 -717 -864 744 1758 223 -989 -404 875 1002 -670 -959 148 1108 266 -934 -665 254 672
3766 672 -630 -925 -381 -5 175 -704 -979 -78 472 -268 -581 -232 154 224 -53 -209 37 480 255 28
3786 28 320 330 159 -232 491 428 276 78 388 588 319 -147 -21 400 381 -361 -167 -203 496 55 -904 -615
3808 -615 207 108 -424 -1265 -534 378 14 -816 -1187 -190 653 -230 -1143 -779 617 925 -383 -1096 216
$$ packed form
3684h27k285K548L408j131l636l53L252K018k693l064J329L437M89l410j765L072
3700C89K315j571l325L14L084J568l060k216K089K782n44l143r37K931J756j893
3716E39k634M88L247M62l073j347J916K340r81k821J05K403J343k325j803J359
3732g82K390k56k441o84K024J540j149j933M30K110N30k102r18J324J430m37j793
3749g17j47J608J014j535j212N85J279J27j672k89J107R60q42j200K69R19M18
3766F72j302k95N44L76J80q79k75R01N50p40l13L49L86P0k77j56K46M43k25k27
3786B8K92J0j71l91P23o3j52j98L10K00k69m66J26M21j9p42J94l6O99m41r59K89
3808f15Q22r9n32q41P31R12l64q30l71R97Q43q83r13L64J396L08j308p13J312
$$ plain form
3827 216 1245 588 -710 -653 929 1526 267 -895 5 1442 1217 -344 -760 604 1979 442 -1159
3844 -1159 -933 978 1376 -474 -1745 -11 1278 535 -1322 -1835 149 1160 -352 -2350 -1238 902
3860 902 1061 -1356 -2150 -376 1417 654 -1887 -1665 776 1994 -20 -1617 -366 2030 1582 -894
3876 -894 -1367 780 2627 1030 -1371 -907 1684 2545 -194 -2022 -72 2406 1278 -1646 -1783 957
3892 957 1875 170 -2339 -1361 1373 1632 -1547 -2654 -127 1990 128 -2457 -2357 675 1700 -787
3908 -787 -2723 -1049 2132 1295 -1558 -2330 976 2777 445 -1968 -1158 2227 2638 -205 -2147 468
3924 468 2980 1641 -1375 -1393 1589 2570 143 -2484 -955 2148 1759 -1298 -2412 91 2018 548
3940 548 -2610 -1940 1216 1848 -1093 -2985 -815 1851 1048 -2228 -2518 860 2031 -109 -2579 -1091
$$ packed form
3827B16J029o57j298N7J582N97j259j162R00J437k25j561m16J364J375j537j601
3844a159K26J911L98j850j271J734J289p43j857n13J984J011j512j998J112K140
3860I02J59k417p94J774J793p63k541K22K441J218k014j597J251K396m48k476
3876h94m73K147J847j597k401M64K591Q61k739j828J950K478j128k924j37K740
3892I57R18j705k509R78K734K59l179j107K527K117j862k585J00L032J025k487
3908g87j936J674L181q37k853p72L306J801k332k413Q10L385M11k843j942K615
3924D68K512j339l016j8K982R81k427k627J529L103l89l057j114K503J927j470
3940E48l158O70L156O32k941j892K170K666q03l276k90L378J171k140k470J488
$$ plain form
3956 -1091 807 1273 -506 -1976 231 2808 1841 -1562 -1227 1692 2544 449 -1920 -250 2554 1587
3972 1587 -863 -1695 599 2316 829 -1830 -1396 1420 1925 -685 -2303 -624 1599 1127 -1822 -2236
3988 -2236 498 1459 -224 -2237 -1373 1119 1240 -1276 -2216 99 1621 399 -1611 -1297 1116 2142
4004 2142 86 -1640 32 1925 1553 -605 -888 630 2299 691 -1171 -572 1621 1560 -44 -934
4020 -934 -7 1830 851 -1209 -1017 676 889 -309 -1437 -867 806 550 -1178 -1952 -289 713 -103
4037 -103 -1351 -1431 262 1119 -197 -1244 -619 1344 375 -398 -701 147 1541 154 -568 216 918 1549
4055 1549 1423 -601 190 824 39 1 339 444 429 67 -226 -339 643 694 -507 -316 161 -131 -47 -524
4075 -524 -834 5 -38 -637 -754 -523 -235 -252 -50 -459 -404 -87 -262 30 12 -265 -271 374 595 522 336 264 442
$$ packed form
3956a091J898M66j779j470K207K577r67l403L35K919Q52k095k369J670K804r67
3972A587k450q32K294J717j487k659M34K816N05k610j618J679K223m72k949m14
3988b236K734R61j683k013Q64K492J21k516r40K315J522j222k010L14K413J026
4004B142k056j726J672J893l72k158k83J518J669j608j862N99K193o1j604q90
4020i34R27J837r79k060J92J693K13j198j128N70J673k56j728p74J663J002q16
4037a03j248q0J693Q57j316j047O25J963r69p73l03Q48J394j387p22P84P02O31
4055A549j26k024P91O34p85l8L38J05j5l62k93j13R82N1j201J91M77k92Q4m77
4075e24l10Q39m3n99j17K31K88j7K02m09N5L17j75K92j8k77oO45K21p3j86p2J78
$$ plain form
4098 442 529 578 263 906 164 635 -171 28 638 799 743 -276 -36 678 -159 -500 -444 440 751 -410 -1442
$$ packed form
4098D42Q7M9l15O43p42M71q06J99O10J61n6j019K40P14q37l41N6Q84L11j161j032
$$ [...]
8191f2
##END NTUPLES=NMR FID
##END=
