##TITLE=1H_LY-DiX-24
 CD3CN,8 sc, 
 10.02.2021
##JCAMPDX= 6.0         $$ Bruker NMR JCAMP-DX V2.0
##DATA TYPE= NMR FID
##DATA CLASS= NTUPLES
##ORIGIN= UXNMR, Bruker Analytische Messtechnik GmbH
##OWNER= root
$$ XWIN-NMR		Version 3.5
$$ Wed Feb 10 12:33:55 2021 Russian Standard Time (UT+4h)  she@DPX200
##.OBSERVE FREQUENCY= 200.1315066352
##.OBSERVE NUCLEUS= ^1H
##.DELAY= (6, 6)
##.ACQUISITION MODE= SIMULTANEOUS
##.ACQUISITION SCHEME= undefined
##.AVERAGES= 8
##.DIGITISER RES= 18
##SPECTROMETER/DATA SYSTEM= spect
##.PULSE SEQUENCE= zg30
##.SOLVENT NAME= CD3CN
##.SHIFT REFERENCE= (INTERNAL, CD3CN, 0, 15.7039)
##AUDIT TRAIL= $$ (NUMBER, WHEN, WHO, WHERE, WHAT)
$$ ##TITLE= Audit trail, XWIN-NMR		Version 3.5
$$ ##JCAMPDX= 5.01
$$ ##ORIGIN= Bruker BioSpin GmbH
$$ ##OWNER= she
$$ F:/spectra/data/she/nmr/H-F/1/audita.txt
$$ ##AUDIT TRAIL=  $$ (NUMBER, WHEN, WHO, WHERE, WHAT)
(   1,<2021-02-10 12:32:36.57 +0400>,<she>,<DPX200>,
      <created by zg, POWCHK disabled, PULCHK disabled
       configuration hash MD5:
       00 E9 B6 7A A2 85 ED C7 34 08 36 98 17 FE 4E 26
       data hash MD5: 16K
       E5 66 7F 8B 63 B1 0C C5 27 80 CD 0D 39 08 E8 31>)
$$ ##END=
$$ 
$$ hash MD5
$$ 34 F8 B7 E3 DD E9 75 37 9E 4F 6D 3F 09 C7 64 3B
##$RELAX= 
##$RELAX= 
##$RELAX= 
##$RELAX= 
##$RELAX= 
##$RELAX= 
$$ Bruker specific parameters
$$ --------------------------
##$DU= <F:/spectra>
##$EXPNO= 1
##$NAME= <H-F>
##$PROCNO= 1
##$TYPE= <nmr>
##$USER= <she>
##$AMP= (0..31)
100 100 100 100 100 100 100 100 100 100 100 100 100 100 100 100 100 100 
100 100 100 100 100 100 100 100 100 100 100 100 100 100 
##$AQSEQ= 0
##$AQ_mod= 1
##$AUNM= <au_zg>
##$AUTOPOS= <>
##$BF1= 200.13
##$BF2= 200.13
##$BF3= 200.13
##$BF4= 200.13
##$BF5= 200.13
##$BF6= 200.13
##$BF7= 200.13
##$BF8= 200.13
##$BYTORDA= 1
##$CFDGTYP= 0
##$CFRGTYP= 5
##$CHEMSTR= <none>
##$CNST= (0..31)
1 1 145 1 1 1 1 1 1 1 1 1 1 1 1 1 1 1 1 1 1 1 1 1 1 1 1 1 1 1 1 1 
##$CPDPRG= <>
##$CPDPRG1= <>
##$CPDPRG2= <>
##$CPDPRG3= <>
##$CPDPRG4= <mlev>
##$CPDPRG5= <mlev>
##$CPDPRG6= <mlev>
##$CPDPRG7= <mlev>
##$CPDPRG8= <mlev>
##$CPDPRGB= <>
##$CPDPRGT= <>
##$D= (0..31)
0 1.2 0 0 0 0 0 0 0 0.06 0 0.03 0 0 0 0 0.0002 0 0 0 0 0 0 0 0 0 0 0 0 
0 0 0 
##$DATE= 1612945956
##$DBL= (0..7)
120 120 120 120 120 120 120 120 
##$DBP= (0..7)
150 150 150 150 150 150 150 150 
##$DBP07= 0
##$DBPNAM0= <>
##$DBPNAM1= <>
##$DBPNAM2= <>
##$DBPNAM3= <>
##$DBPNAM4= <>
##$DBPNAM5= <>
##$DBPNAM6= <>
##$DBPNAM7= <>
##$DBPOAL= (0..7)
0.5 0.5 0.5 0.5 0.5 0.5 0.5 0.5 
##$DBPOFFS= (0..7)
0 0 0 0 0 0 0 0 
##$DE= 6
##$DECBNUC= <off>
##$DECIM= 32
##$DECNUC= <off>
##$DECSTAT= 4
##$DIGMOD= 1
##$DIGTYP= 9
##$DL= (0..7)
0 120 120 120 120 120 120 120 
##$DP= (0..7)
150 150 150 150 150 150 150 150 
##$DP07= 0
##$DPNAME0= <>
##$DPNAME1= <>
##$DPNAME2= <>
##$DPNAME3= <>
##$DPNAME4= <>
##$DPNAME5= <>
##$DPNAME6= <>
##$DPNAME7= <>
##$DPOAL= (0..7)
0.5 0.5 0.5 0.5 0.5 0.5 0.5 0.5 
##$DPOFFS= (0..7)
0 0 0 0 0 0 0 0 
##$DQDMODE= 0
##$DR= 18
##$DS= 0
##$DSLIST= <SSSSSSSSSSSSSSS>
$$ [...]
##$SUBNAM2= <"">
##$SUBNAM3= <"">
##$SUBNAM4= <"">
##$SUBNAM5= <"">
##$SUBNAM6= <"">
##$SUBNAM7= <"">
##$SUBNAM8= <"">
##$SUBNAM9= <"">
##$SW= 16.9725356469052
##$SWIBOX= (0..15)
0 0 2 0 0 0 0 0 0 0 0 0 0 0 0 0 
##$SW_h= 3396.73913043478
##$TD= 16384
##$TD0= 1
##$TE= 0
##$TE2= 300
##$TE3= 300
##$TEG= 300
##$TL= (0..7)
0 120 120 120 120 120 120 120 
##$TP= (0..7)
150 150 150 150 150 150 150 150 
##$TP07= 0
##$TPNAME0= <>
##$TPNAME1= <>
##$TPNAME2= <>
##$TPNAME3= <>
##$TPNAME4= <>
##$TPNAME5= <>
##$TPNAME6= <>
##$TPNAME7= <>
##$TPOAL= (0..7)
0.5 0.5 0.5 0.5 0.5 0.5 0.5 0.5 
##$TPOFFS= (0..7)
0 0 0 0 0 0 0 0 
##$TUNHIN= 0
##$TUNHOUT= 0
##$TUNXOUT= 0
##$USERA1= <user>
##$USERA2= <user>
##$USERA3= <user>
##$USERA4= <user>
##$USERA5= <user>
##$V9= 5
##$VALIST= <valist>
##$VCLIST= <CCCCCCCCCCCCCCC>
##$VD= 0
##$VDLIST= <DDDDDDDDDDDDDDD>
##$VPLIST= <PPPPPPPPPPPPPPP>
##$VTLIST= <TTTTTTTTTTTTTTT>
##$WBST= 1024
##$WBSW= 4
##$XGAIN= (0..3)
0 0 0 0 
##$XL= 0
##$YL= 0
##$YMAX_a= 656804
##$YMIN_a= -615202
##$ZGOPTNS= <>
##$ZL1= 120
##$ZL2= 120
##$ZL3= 120
##$ZL4= 120
##$ABSF1= 10
##$ABSF2= 0
##$ABSG= 5
##$ABSL= 3
##$ALPHA= 0
##$AQORDER= 0
##$ASSFAC= 0
##$ASSFACI= 0
##$ASSFACX= 0
##$ASSWID= 0
##$AUNMP= <proc_1d>
##$AZFE= 0.1
##$AZFW= 0.1
##$BCFW= 1
##$BC_mod= 2
##$BYTORDP= 1
##$COROFFS= 0
##$CY= 11.3945322036743
##$DATMOD= 1
##$DC= 2
##$DFILT= <>
##$DTYPP= 0
##$F1P= 15.9154993809931
##$F2P= -4.1035820241983
##$FCOR= 0.5
##$FTSIZE= 0
##$FT_mod= 4
##$GAMMA= 1
##$GB= 0.15
##$INTBC= 1
##$INTSCL= 1
##$ISEN= 128
##$LB= 0.24
##$LEV0= 0
##$LPBIN= 0
##$MAXI= 10000
##$MC2= 0
##$MEAN= 0
##$ME_mod= 0
##$MI= 1.114404
##$NCOEF= 0
##$NC_proc= 0
##$NLEV= 6
##$NOISF1= 3.799351
##$NOISF2= 2.8
##$NSP= 1
##$NTH_PI= 0
##$NZP= 0
##$OFFSET= 15.70392
##$PC= 1
##$PHC0= -10758.47
##$PHC1= 10.00095
##$PH_mod= 1
##$PKNL= yes
##$PPARMOD= 0
##$PSCAL= 0
##$PSIGN= 0
##$REVERSE= no
##$SF= 200.130013532006
##$SI= 16384
##$SIGF1= 3
##$SIGF2= 2
##$SINO= 400
##$SIOLD= 16384
##$SREGLST= <1H.CDCl3>
##$SSB= 0
##$STSI= 0
##$STSR= 0
##$SW_p= 3612.71676300578
##$SYMM= 0
##$S_DEV= 0
##$TDeff= 0
##$TDoff= 0
##$TI= <>
##$TILT= no
##$TM1= 0
##$TM2= 0
##$TOPLEV= 0
##$USERP1= <user>
##$USERP2= <user>
##$USERP3= <user>
##$USERP4= <user>
##$USERP5= <user>
##$WDW= 1
##$XDIM= 8192
##$YMAX_p= 0
##$YMIN_p= 0
$$ End of Bruker specific parameters
$$ ---------------------------------
##NTUPLES= NMR FID
##VAR_NAME=  TIME,          FID/REAL,        FID/IMAG
##SYMBOL=    X,             R,               I
##VAR_TYPE=  INDEPENDENT,   DEPENDENT,       DEPENDENT
##VAR_FORM=  AFFN,          ASDF,            ASDF
##VAR_DIM=   8192,          8192,            8192
##UNITS=     SECONDS,       ARBITRARY UNITS, ARBITRARY UNITS
##FACTOR=    0.0002944,     1,               1
##FIRST=     0,             0,               0
##LAST=      2.4114304,     0,               0
##MIN=       0,             -615202,         0
##MAX=       2.4114304,     656804,          0
$$ Real data points
##PAGE= N=1
##DATA TABLE= (X++(R..R)), XYDATA
$$ [...]
$$ plain form
2490 -7982 -786 6130 2416 -6614 -6323 2727 5923 -1417 -7870 -2900 5531 4781 -4624 -6665 1520
2505 1520 6792 1777 -5465 -3355 4883 6207 -1204 -5285 241 6571 4217 -3520 -3904 2980 6363
2520 6363 777 -4807 -1668 4901 4329 -2728 -5040 159 4726 1180 -5078 -3784 2238 3496 -1634
2535 -1634 -5315 -2076 3195 1408 -3819 -4584 488 3400 -276 -4122 -2571 2366 3178 -1459 -3529
2550 -3529 146 3596 1980 -1740 -1777 2152 3838 849 -1847 39 3324 2848 -334 -1374 984 3243
2566 3243 1383 -1583 -815 1173 1744 -185 -2254 -938 1050 261 -2018 -2128 -611 -5 -749 -2172
2582 -2172 -1892 -435 68 -1438 -1925 -1161 -357 124 -492 -1111 -153 530 71 460 507 588 949 1306 790 742
2602 742 1076 1327 1357 1386 367 516 1568 1308 407 27 62 955 1220 -726 -1411 -191 608 -425 -1656
$$ packed form
2490g982P196O916l714r030K91R050L196p340o453M970Q431p50r405k041Q185
2505A520N272n015p242K110Q238J324p411m081N526O330k354p737l84O884L383
2520F363n586n584L139O569n72p057k312N199M567l546o258J294O022J258n130
2535a634l681L239N271j787n227p65N072K912l676l846J551M937Q12m637k070
2550c529L675L450j616l720l7L929J686k989k696J886L285m76l182j040K358K259
2566C243j860k966P68J988N71j929k069J316J988p89k279j10J517O06p44j423
2582b172K80J457N03j506m87P64Q04M81o16o19R58O83m59L89M7Q1L61L57n16m8
2602G42L34K51L0K9j019J49J052k60r01l80L5Q93K65j946o85J220P99j033j231
$$ plain form
2621 -1656 -1968 -700 741 -1240 -3177 -1796 252 14 -2026 -2891 -720 1407 172 -2876 -1789 1414
2637 1414 1844 -463 -1992 -180 3433 2652 -1308 -1539 2177 3815 1348 -1424 -551 3328 4133 -768
2653 -768 -2423 1138 3878 1785 -2312 -2804 1735 4002 -921 -4753 -1661 2605 1747 -3021 -5019 -865
2669 -865 3558 -144 -5480 -3617 1874 2728 -2073 -5368 -1573 4079 2459 -3881 -4137 2077 4895 1017
2685 1017 -3994 -2072 4906 5258 -1494 -3569 1877 6132 3012 -3115 -3076 4076 6411 -437 -4944 -770
2701 -770 4940 3503 -3079 -5257 757 5353 150 -6084 -3672 2902 3598 -2597 -6863 -1810 4740
2716 4740 1611 -5849 -5292 1420 4723 -441 -6212 -2992 4879 4389 -3165 -5269 1071 6152 2686
2731 2686 -4129 -3515 4799 6648 -642 -4647 11 5896 4828 -2643 -4587 2384 7004 1003 -5299
$$ packed form
2621a656l12J268J441j981j937J381K048k38k040q65K171K127j235l048J087L203
2637A414M30k307j529J812L613p81l960k31L716J638k467k772Q73L879Q05m901
2653g68j655L561K740k093m097m92M539K267m923l832L092M266q58m768j998M154
2669h65M423l702n336J863N491Q54m801l295L795N652j620o340k56O214K818l878
2685A017n011J922O978L52o752k075N446M255l120o127L9P152K335o848m507M174
2701g70N710j437o582k178O014M596n203o234K412O574O96o195m266N053O550
2716D740l129p460N57O712L303n164n771L220P871m90p554k104O340N081l466
2731B686o815O14Q314J849p290m005M658N885j068p471j944O971M620o001o302
$$ plain form
2746 -5299 -2251 3959 4617 -2142 -6659 -970 5434 1787 -5734 -5121 1606 4427 -1031 -7043 -3611
2761 -3611 4470 3122 -4232 -6071 310 5242 1612 -5132 -4276 3893 5716 -1373 -5197 -459 5701
2776 5701 4335 -2921 -4282 2957 6820 936 -4060 -1529 4717 5409 -1045 -5020 602 6012 2177
2791 2177 -4414 -3483 2028 4752 -485 -6067 -2283 4343 2308 -3984 -5133 -254 4026 500 -5701
2806 -5701 -3743 2834 3417 -2548 -4963 -787 3968 2404 -3379 -3707 2123 4619 142 -3291 -705
2821 -705 3531 4088 -1254 -3488 1518 4616 1469 -2249 -1510 2375 3877 -93 -3530 -432 3497 1252
2837 1252 -2263 -2567 216 2481 119 -3720 -1945 1730 1143 -1905 -2882 -962 1570 743 -2891 -2535
2853 -2535 933 1668 -443 -1783 -521 1544 1445 -1130 -1617 827 1843 730 -267 -298 1117 2029 537
$$ packed form
2746e299L048O210O58o759m517N689O404l647p521O13O727K821n458o012L432
2761c611Q081j348p354j839O381M932l630o744Q56Q169J823p089l824M738O160
2776E701j366p256j361P239L863n884m996K531O246O92o454l975N622N410l835
2791B177o591R31N511K724n237n582L784O626k035o292j149M879M280l526o201
2806e701J958O577N83n965k415M176M755j564n783l28N830K496m477l433K586
2821g05M236N57n342k234N006L098l147l718P39L885J502l970l437L098L929k245
2837A252l515l04K783K265k362l839J775L675n87l048r77J920K532q27l634L56
2853b535L468P35k111j340J262K065r9k575m87K444J016j113r97l1J415R12j492
$$ plain form
2870 537 -1165 886 1775 929 160 -388 450 1032 393 -969 -385 576 -32 -156 -702 -791 218 20 -1137
2889 -1137 -710 -399 -613 -526 -334 -798 -573 86 -304 -350 -91 -759 -133 655 42 -407 222 301 735 538 -93
2910 -93 -264 1140 996 -357 -134 502 1362 707 -558 -642 1090 1501 -337 -1047 -308 830 1153 -770
2928 -770 -1904 159 1464 -219 -1888 -1121 728 1423 -527 -2233 -555 1620 977 -1619 -1677 489
2944 489 2136 278 -2214 -1279 1984 1957 -935 -1963 -147 2687 1915 -1883 -2025 1764 2841 -168
2960 -168 -2518 -1067 2410 2509 -1526 -3257 644 3239 669 -2923 -2180 1942 2966 -501 -3596 -335
2976 -335 3178 1614 -2316 -3108 749 3650 393 -3798 -1863 2705 2714 -1712 -3777 -220 3855 1952
2992 1952 -3612 -3099 2439 3904 -297 -4022 -1302 3752 2721 -2670 -4005 1139 4162 1010 -3428
$$ packed form
2870E37j702K051Q89q46p69n48Q38N82o39j362N84R61o08j24n46q9J009j98j157
2889a137M27L11k14Q7J92m64K25O59l90m6K59o68O26P88o13m49O29P9M34j97o31
2910i3j71J404j44j353K23O36Q60o55j265q4J732M11j838p10P39J138L23j923
2928g70j134K063J305j683j669P67J849O95j950j706J678K175o43k596n8K166
2944D89J647j858k492R35L263k7k892j028J816K834p72l798j42L789J077l009
2960a68k350J451L477R9m035j731L901K595k570l592P43M122J024l467l095L261
2976c35L513j564l930p92L857K901l257m191J935M568Rm426k065L557M075j903
2992A952n564N13N538J465m201l725K720N054j031n391j335N144L023l152m438
$$ plain form
3007 -3428 -2611 2740 3995 -1426 -4351 -363 4090 2092 -2999 -3560 1620 4415 238 -4506 -1678
3022 -1678 3578 3265 -1821 -4237 11 4490 1773 -3963 -2732 2696 3851 -617 -4425 -1104 4078
3037 4078 2872 -3233 -4310 1380 4427 481 -4293 -2765 2993 3804 -1890 -4691 -230 4234 2000
3052 2000 -3517 -3773 1780 4417 -301 -4683 -1454 3762 3289 -2282 -4154 582 4680 1590 -3780
3067 -3780 -2580 2962 4210 -724 -3991 -489 4115 2657 -2633 -3539 1640 4066 301 -3895 -2259
3082 -2259 3244 3231 -2066 -4242 -379 3626 1362 -3519 -3584 1695 3561 -781 -4260 -1414 3248 2182
3098 2182 -2271 -3742 662 3575 933 -3422 -2088 2537 3359 -873 -3317 -222 3554 2159 -2198
3113 -2198 -2186 1949 3838 334 -2803 -1329 2983 2481 -1555 -2813 438 2662 931 -2398 -2224 1625
$$ packed form
3007c428Q17N351J255n421k925L988M453j998n091n61N180K795m177m744K828
3022a678N256l13n086k416M248M479k717n736J231N428J155m468l808L321N182
3037D078j206o105j077N690L047l946m774J528N758Q11n694k801M461M464k234
3052B000n517k56N553K637m718m382L229N216m73n571j872M736M098l090n370
3067c780J200N542J248m934l267L502M604j458n290r06N179K426l765m196J636
3082b259N503j3n297k176L863M005k264m881o5N279J866m342l479K846M662j066
3098B182m453j471M404K913k642m355J334M625Q22m232k444L095L776j395m357
3113b198J2M135J889l504l137J474M312n02m036j258L251K224j731l329J74L849
$$ plain form
3129 1625 2381 -1056 -3297 -676 1981 998 -1948 -2464 468 2014 -74 -2472 -1372 1296 1473 -988
3145 -988 -2034 161 2304 898 -1444 -929 1143 1997 549 -1128 -28 1920 1394 -300 -426 611
3161 611 1534 818 -791 -342 1293 1006 -282 -1046 -245 615 274 -981 -1138 -260 233 -409 -925 -898 -61
3180 -61 150 -700 -881 -616 38 -21 -322 -397 -206 68 -40 -36 181 52 410 591 539 306 366 578 711 807 -21
3203 -21 283 744 1077 267 96 322 997 693 -211 -667 112 390 81 -1074 -980 262 194 -639 -1687 -959
3223 -959 313 166 -1431 -1753 -493 708 -105 -1495 -869 608 1107 -478 -1328 -201 1825 1061 -683
3240 -683 -991 1155 2236 740 -954 -291 1904 2063 -85 -1300 476 2607 1208 -1267 -1188 946
3256 946 1644 -163 -2166 -1348 1503 1218 -1492 -2692 -239 1898 91 -2851 -2535 853 1421 -1058
$$ packed form
3129A625P56l437k241K621K657r83k946n16K932J546k088k398J100K668J77k461
3145i88j046K195K143j406k342N15K072Q54j448j677J100J948n26j694j26J037
3161F11R23p16j609M49J635k87j288p64Q01Q60l41j255j57Q78M93o42n16K7Q37
3180f1K11q50j81K65O54n9l01p5J91K74j08MK17j29L58J81n2k33O0K12J33R6q28
3203b1L04M61L33q10j71K26O75l04r04m56P79K78l09j155R4J242o8q33j048P28
3223i59J272j47j597l22J260J201q13j390O26J477M99j585q50J127K026p64j744
3240f83l08K146J081j496j694O63K195J59k148j215J776K131j399k475P9K134
3256I46O98j807k003Q18K851k85k710j200K453K137j807k942L16L388N68k479
$$ plain form
3272 -1058 -3003 -1077 2260 1360 -2053 -2483 537 2489 424 -2451 -1012 2264 2978 -726 -2417 493
3288 493 3537 1692 -1765 -1360 1943 3594 322 -2329 -620 2869 2616 -1778 -2655 633 3229 508
3304 508 -3107 -2369 1832 2285 -1468 -3719 -1064 2389 877 -3018 -3219 696 2772 -348 -3566 -1884
3320 -1884 2286 2406 -1632 -3136 252 3513 1227 -2245 -2048 2418 3402 167 -2701 -71 3573 2730
3336 2730 -1527 -2291 1028 3911 1115 -2541 -1694 2219 3029 -799 -3232 -480 2781 1404 -2741 -3023
3352 -3023 915 2715 -660 -3857 -2122 2023 1733 -2188 -3500 -300 2878 567 -2893 -2306 1634
3367 1634 2726 -568 -2825 -830 3071 2256 -1702 -2240 967 3630 856 -2165 -1094 2836 3089 -400
3383 -400 -2229 223 2951 1409 -1985 -2189 1371 2671 -564 -3061 -1316 2071 1436 -2093 -3197 -122
$$ packed form
3272a058j945J926L337r00l413m30L020J952k065k875J439L276P14l704j691K910
3288D93L044j845l457M05L303J651l272k651J709L489k53m394q77L288K596k721
3304E08l615P38M201M53l753k251K655L453j512l895k01L915K076l120l218J682
3320a884M170J20m038j504L388L261k286l472J97M466R84l235k868K630L644q43
3336B730m257p64L319K883k796l656Q47L913Q10l828k433K752L261j377m145k82
3352c023L938J800l375l197J735M145k90l921j312L200L178k311l460N87L940
3367A634J092l294k257J995L901q15l958n38L207K663k774l021J071L930K53l489
3383d00j829K452K728j542l394k04L560J300l235k497J745L387o35l529j104L075
$$ plain form
3399 -122 2364 337 -2882 -2140 1059 1873 -992 -3139 -636 2053 1159 -1840 -2090 1087 2364 -56
3415 -56 -2070 -680 2364 2006 -505 -1528 359 2670 1443 -1024 -841 1619 2262 35 -1578 -386
3431 -386 2030 1396 -1042 -1543 532 1585 87 -1764 -1309 706 919 -893 -1903 -683 987 -16
3447 -16 -1557 -1804 126 879 -291 -1577 -632 1001 605 -789 -969 58 1150 424 -328 -307 567 1060
3465 1060 312 -343 384 1056 690 -52 -146 423 730 303 -63 -245 294 427 -50 -295 -294 -26 -245 -261 -538
3486 -538 -496 -86 -309 -321 -301 -546 -248 -195 -250 -194 -318 -110 15 -137 -444 -13 257 542 133 -370 149 724
3508 724 887 101 -36 562 976 598 -206 -160 699 756 159 -736 -143 821 441 -365 -662 114 743 -47 -1062
3529 -1062 -749 602 731 -355 -1220 -598 614 497 -1046 -1327 45 1276 125 -1185 -605 893 1051
$$ packed form
3399a22K486k027l219P42L199Q14k865k147K503K689q94k999k50L177J277k420
3415e6k014J390L044l58k511j023J887K311j227k467J83K460O43k227j613J192
3431c86K416o34k438n01K075J053j498j851M55K015K13j812j010J220J670j003
3447a6j541k47J930P53j170j286R45J633l96j394j80J027J092p26p52K1Q74M93
3465A060p48o55P27O72l66p42r4N69L07m27l66j82N39J33m77k45JK68k19j6k77
3486e38M2M10k23j2K0k45K98N3n5N6j24K08J25j52l07M31K70K85m09n03N19N75
3508G24J63p86j37N98M14l78q04M6Q59N7n97q95N93R64l80q06k97P76O29p90j015
3529a062L13J351J29j086q65O22J212j17j543k81J372J231j151j310N80J498J58
$$ plain form
3546 1051 -494 -1300 283 1518 727 -994 -977 976 1472 187 -1413 -357 1417 1253 -822 -1429 332
3563 332 1840 478 -965 -1015 1042 1458 -626 -1944 -548 1508 1168 -1578 -1735 349 1728 281
3579 281 -2170 -1421 1412 1439 -987 -2421 -170 2025 730 -1869 -1672 1087 2196 184 -2212 -569
3595 -569 2131 1489 -1230 -2157 545 2395 763 -1907 -1428 1606 2219 -582 -1982 -321 2271 1341
3611 1341 -1533 -2142 968 2328 -191 -2475 -1135 1987 1589 -1112 -2354 -61 2257 716 -2070
3626 -2070 -1832 1276 2342 -666 -2430 -531 2018 1497 -1419 -2290 655 2347 205 -2136 -1142 1596
3642 1596 2239 -755 -2501 -139 2442 1172 -1761 -1812 1001 2346 -138 -2231 -1063 2072 2021 -1112
3658 -1112 -2248 385 2236 776 -1981 -1643 1195 2110 -441 -2258 -493 1931 1492 -1393 -2009 537
$$ packed form
3546A051j545q06J583J235p91j721J7J953M96j285j600J056J774j64k075o07J761
3563C32J508j362j443n0K057M16k084j318J396K056l40k746j57K084J379j447
3579B81k451P49K833K7k426j434K251K195j295k599J97K759J109k012k396J643
3595e69K700o42k719r27K702J850j632k670M79L034O13k801j400J661K592r30
3611A341k874o09L110J360k519k284J340L122l98k701j242K293K318j541k786
3626b070K38L108J066l008j764J899K549n21k916q71K945J692k142k341R94K738
3642A596O43k994j746K362K581j270k933n1K813J345k484k093J168L135n1l133
3658a112j136K633J851j460k757L38K838R15k551j817J765K424m39k885o16K546
$$ plain form
3674 537 2210 62 -2175 -998 1417 1753 -801 -1808 -240 2079 883 -1667 -1579 852 1976 -422
3690 -422 -2204 -467 1696 1444 -946 -1876 458 1790 396 -1647 -1153 1318 1613 -562 -1840 -129
3706 -129 1831 1078 -1143 -1401 743 1810 315 -1812 -580 1274 1429 -530 -1230 194 1622 643
3722 643 -1400 -1232 1058 1161 -419 -1563 -476 1154 645 -918 -1411 287 903 -98 -1192 -429 533
3739 533 790 -493 -925 -121 863 323 -633 -762 326 992 -14 -670 -93 1086 552 -524 -321 220
3757 220 905 539 -112 -308 552 341 36 -158 116 464 237 -412 -343 153 43 163 -540 -380 -42 5 -441
3778 -441 -392 -162 24 -79 -301 -116 -200 -74 56 158 -129 -41 207 -61 212 58 3 227 519 371 -114
3799 -114 287 131 473 226 -22 -63 426 584 -235 -185 -14 490 217 -599 -432 43 280 -262 -777 -353 230
$$ packed form
3674E37J673k148k237J177K415L36k554j007J568K319j196k550Q8K431J124k398
3690d22j782J737K163k52k390r30K334J332j394k043M94K471K95k175j278J711
3706a29J960p53k221k58K144J067j495k127J232J854J55j959p00J424J428r79
3722F43k043J68K290J03j580j144J087J630n09j563m93J698O16j001j094P63R62
3739E33K57j283m32Q04R84n40r56j29J088O66j006o56N77J179n34j076K03N41
3757B20O85l66o51j96Q60k11l05j94K74L48k27o49O9M96j10J20p03J60L38M7m46
3778d41M9K30J86j03k22J85q4J26J30J02k87Q8K48k68K73j54n5K24K92j48m85
3799a14M01j56L42k47k48m1M89J58q19N0J71N04k73q16J67M75K37n42n15M24N83
$$ plain form
3820 230 286 -620 -866 -98 184 -66 -811 -619 293 336 -383 -973 -299 561 537 -642 -460 395 963 420 -531
3841 -531 -14 1090 922 -332 -550 178 1229 599 -614 -632 868 1177 -79 -835 -470 756 578 -797
3859 -797 -1335 -10 1069 -23 -1271 -946 298 757 -883 -1696 -261 956 788 -1338 -1182 315 1245
3876 1245 -36 -1475 -566 1208 1562 -804 -1114 289 1789 999 -961 -746 1037 1699 208 -1309
3892 -1309 -510 1443 1180 -669 -1350 472 1361 48 -1481 -1113 1102 1397 -727 -1819 -338 1313
3908 1313 544 -1453 -1453 295 1316 -421 -1966 -703 1434 961 -923 -1503 83 1806 550 -1379
3924 -1379 -1038 1253 1705 -46 -1508 -253 1959 1526 -695 -1180 862 1920 282 -1250 -875 1584
3940 1584 1528 -670 -1672 -97 1457 739 -1279 -1403 559 1346 -354 -1903 -907 1205 664 -1154 -1947
$$ packed form
3820B30N6r06k46P68K82k50p45J92R12M3p19n90O74Q60k4j179J82Q55N68n43r51
3841e31N17J104j68j254k18P28J051o30j213j8J500L09j256p56L65J226j78j375
3859g97n38J325J079j092j248L25J244M59j640q13J435J217j68k126J56J497R30
3876A245j281j439R09J774L54k366l10J403J500p90j960K15J783O62j491j517
3892a309P99J953k63j849o81J822Q89j313j529L68K215K95k124j092J481J651
3908A313p69j997%J748J021j737j545J263K137m73j884n80J586J723j256j929
3924a379L41K291M52j751j462J255K212m33k221m85K042J058j638j532L75K459
3940A584n6k198j002J575J554p18k018j24J962P87j700j549R96K112n41j818p93
$$ plain form
3957 -1947 -255 1280 53 -1684 -1263 1272 1489 -449 -1372 -159 1578 911 -870 -890 764 1687 371
3974 371 -1202 -629 1441 1444 -343 -1114 23 1554 901 -1007 -783 782 1321 -161 -1490 -386 883
3991 883 951 -1031 -1494 -60 1150 39 -1291 -1092 505 918 -626 -1602 -476 1174 531 -1060 -935
4008 -935 460 1136 68 -1081 -490 1053 1052 -442 -743 245 1244 602 -505 -431 777 1291 -91 -450
4026 -450 18 1050 821 -434 -960 367 1014 -64 -1081 -424 302 475 -618 -889 -426 391 -151 -966
4044 -966 -686 54 367 -233 -675 -394 537 72 -318 -372 124 572 424 -277 -269 584 715 -64 -32 265 703
4065 703 213 -42 -110 578 427 -279 -16 167 125 379 98 -211 134 65 -139 -474 -164 -235 -93 -146 -255 -137
4087 -137 -395 -157 -259 61 -306 -621 -122 -33 -114 -113 -253 -118 473 50 -102 305 244 275 11 -202 155 598
$$ packed form
3957a947J692J535j227j737M21K535K17j938r23J213J737o67j781k0J654R23j316
3974C71j573N73K070Lj787p71J137J531o53j908K24J565N39j482j329J104J269
3991H83O8j982m63J434J210j111j330J99J597M13j544r76J126J650o43j591J25
4008i35J395O76j068j149N91J543jj494l01R88R99o42j107P4J208N14j382l59
4026d50M68J032k29j255n26J327O47j078j017O57P26J73j093k71M63Q17n42q15
4044i66K80P40L13o00m42K81R31m65l90n4M96M48j48p01QQ53J31p79L2K97M38
4065G03m90k55o8O88j51p06K63J83m2K54k81l09L45o9k04l35L10p1J42n3j09J18
4087a37k58K38j02L20l67l15M99Q9q1Jj40J35N91m23j52M07o1L1k64k13L57M43
$$ plain form
4109 598 -46 -246 191 411 247 101 -384 -214 804 441 -289 -131 199 232 -91 -367 -166 426 205 -323
4129 -323 -786 -6 243 217 -556 -792 63 777 -185 -640 -92 215 209 -142 -447 92 856 148 -518 -261 469
4150 469 643 270 -404 -214 693 751 -482 -462 268 1069 33 -618 -857 468 691 -567 -768 -118 510
4169 510 483 -792 -1103 295 957 -311 -1250 -240 491 532 -554 -1326 164 1122 457 -1102 -738 634
4187 634 1185 -56 -1125 -357 1379 755 -533 -676 647 1154 461 -687 -502 1325 843 -362 -1112
4204 -1112 36 1135 456 -1030 -1178 547 1118 -271 -1453 -405 749 593 -883 -1218 145 988
4220 988 132 -1097 -652 552 886 -472 -1407 -182 1286 595 -862 -709 497 924 249 -1138 -402
4237 -402 1194 934 -406 -1017 200 1204 620 -1090 -746 491 1050 -171 -1220 -332 989 613 -693
$$ packed form
4109E98o44k00M37K20j64j46m85J70J018l63p30J58L30L3l23k76K01N92k21n28
4129c23m63P80K49k6p73k36Q55P14r62m55N48L07ol51l05N39P64p08o66K57P30
4150D69J74l73o74J90R07N8j233K0P30Q01j036o51k39J325K23j258k01O50O28
4169E10k7j275l11J398O62j268r39J010P31M1j086p72J490R58o65j559L64J372
4187F34N51j241j069P68J736o24j288j43J323N07o93j148J85J827m82j205p50
4204a112J148J099o79j486j48J725N71j389j182J048J154j56j476l35J363Q43
4220I88q56j229M45J204L34j358r35J225J468o91j457J53J206M27o75j387P36
4237d02J596k60j340o11J217J004n84j710L44J237N59j221j049Q88J321l76j306
$$ plain form
4254 -693 -1107 541 1083 24 -954 -585 783 858 -440 -1166 10 857 329 -885 -858 475 1050 -67
4272 -67 -1112 -579 789 715 -693 -976 205 1241 199 -1087 -613 618 884 -320 -898 -94 686 456
4290 456 -584 -985 376 1257 116 -654 -632 713 903 -248 -1223 -60 1012 226 -672 -898 258 682
4308 682 -95 -1037 -135 577 429 -400 -855 225 962 240 -960 -478 581 577 -340 -724 -170 799 344 -532
4328 -532 -455 190 530 -129 -505 -113 269 634 -202 -682 59 511 166 -454 -269 340 685 -426 -494 -210
4348 -210 468 472 56 -314 75 607 -87 -260 -32 379 162 -27 -103 -35 91 108 -394 32 -71 159 133 -240
4370 -240 13 247 -230 21 -20 11 -164 159 -109 244 -112 -127 -186 17 13 -188 36 222 302 385 49 -31 146
4393 146 -96 -23 -35 459 132 -33 -146 109 147 337 -54 -165 192 299 206 -129 -169 78 303 170 -518 -65
$$ packed form
4254f93m14J648N42j059r78L69J368P5j298p26J176Q47n28j214K7J333N75j117
4272f7j045N33J368p4j408k83J181J036j042j286M74J231K66j204n78Q04P80k30
4290D56j040m01J361Q81j141p70K2J345J90j151r75J163J072p86q98k26J156M24
4308F82p77r42R02P12j48q29m55J080P37p22j200M82J059mr17l84N54R69m55q76
4328e32P7O45L40o59l76L92L82L65q36m80P41M52l45o20J85O09L45j111o8K84
4348b10O78Mm16l70L89N32o94j73K28M11k17j89p6O8J26J7n02M26j03K30k6l73
4370b40K53K34m77K51m1L1j75L23k68L53l56j5n9K03mk01K24J86Q0Q3l36q0J77
4393A46k42P3j2M94l27j65j13K55L8J90l91j11L57J07r3l35m0K47K25j33o88M53
$$ plain form
4415 -65 145 140 -252 -621 45 267 -84 -520 -517 321 272 -427 -306 -306 265 -12 -467 -490 352 550 -2 -351 -135
4438 -135 630 535 -207 -306 219 512 258 -390 -93 273 579 -229 -424 -51 626 209 -408 -628 173 541 -54
4459 -54 -760 -308 559 476 -397 -888 -113 436 187 -842 -682 307 951 -285 -605 -154 595 439 -412 -770
4479 -770 251 772 294 -535 -326 488 873 -47 -603 143 972 583 -487 -519 250 821 -173 -902 -517 796
4499 796 680 -609 -1069 -314 810 285 -952 -963 254 893 -231 -1279 -466 956 257 -517 -930 247
4517 247 1066 150 -615 -400 666 1117 -211 -735 212 1086 226 -707 -398 389 923 9 -647 -117 777
4536 777 945 -345 -964 99 676 160 -823 -584 358 608 -304 -963 -397 797 320 -955 -1003 72 800
4555 800 130 -664 -695 824 785 -516 -969 -299 845 204 -751 -656 397 1125 83 -593 -57 953 1045
$$ packed form
4415f5K10nl92l69O66K22l51m36LQ38m9o99J21%N71k77m55k3Q42J98n52l49K16
4438a35P65r5p42r9N25K93k54o48K97L66L06q08j95L73O77m17o17k20Q01L68n95
4459e4p06M52Q67q3q73m91P75N49k49j029J60R89O44j236l20M51P49j56q51l58
4479g70J021N21m78q29K09Q14L85r20n56P46Q29l89j070l2P69N71r94p29L85J313
4499G96j16j289m60P55J124n25j237j1J217O39j124j048Q13J422o99p74m13J177
4517B47Q19r16p65K15J066M51j328n24R47Q74q60r33L09P87N34r14o56N30Q94
4536G77J68j290o19J063N77n16r83K39R42K50r12o59N66J194m77j275m8J075P28
4555H00o70p94l1J519l9j301m53O70J144o41r55R5J053P28j042o76N36J010R2
$$ plain form
4574 1045 -310 -644 639 927 245 -715 -704 664 618 -278 -824 -21 934 332 -751 -911 198 456 15
4593 15 -779 -389 372 317 -436 -1010 -192 626 204 -708 -367 462 698 -242 -785 -132 653 844 -302 -381 398
4614 398 866 531 -236 -128 620 913 -116 -453 314 827 344 -506 -322 162 502 -2 -633 -106 381 160
4634 160 -588 -563 -177 -4 -11 -595 -447 76 40 -207 -567 -111 269 30 -6 -279 -153 547 -164 -117 -43 383
4656 383 469 92 -29 76 224 329 -203 3 -26 49 149 -49 6 292 -36 -199 -109 49 67 -108 -110 -225 -90
4679 -90 -36 -334 -215 -116 -217 -44 -213 -155 -352 -183 -35 42 -16 -181 -99 211 98 51 -288 -104 28 401 26
4702 26 159 -103 258 107 -37 80 176 173 166 -156 -145 288 -67 -248 -255 47 276 -115 -388 -247 107 340 -450
4725 -450 -519 -95 277 82 -490 -183 173 256 -107 -576 -256 513 212 -275 -347 27 654 124 -313 102 614
$$ packed form
4574A045j355l34J283K88o82r60J1J368m6q96n46Q03R55o02j083j60J109K58m41
4593A5p94L90P61n5p53n74Q18Q18m22r12L41Q29K36r40n43O53P85J91j146p9P79
4614C98M68l35p67J08P48K93j029l37P67N13m83q50J84M84L40n04o31N27M87k21
4634A60p48K5L86J73pn84J48N23l6k47l60M56L80k39l6k73J26P00p11M7P4M26
4656C83Q6l77j21J05J48J05n32K06k9P5J00j98N5K86l28j63R0J58J8j75kj15J35
4679i0N4k98J19R9j01J73j69N8j97J69J48P7n8j65Q2L10j13m7l39J84J32L73l75
4702B6J33k62L61j51j44J17R6lpl22J1M33l55j81pL02K29l91k73J41L54K33p90
4725d50o9M24L72j95n72L07L56Q3l63m69L20P69l01m87p2L74O27n30m37M15N12
$$ plain form
4746 614 378 159 -443 103 678 248 -1 -217 432 505 -68 -457 -109 624 317 -271 -496 -144 482 -132
4766 -132 -370 -403 23 408 -371 -800 -175 533 432 -538 -943 67 626 8 -731 -457 426 581 -239 -760
4786 -760 -85 800 446 -648 -509 423 601 280 -509 -44 738 759 -264 -676 -23 778 443 -452 -483 552
4806 552 596 -409 -819 -315 466 387 -681 -876 178 569 -283 -767 -468 527 483 -440 -772 -4 930 251
4826 251 -707 -442 260 889 -12 -860 -264 868 428 -370 -603 313 784 304 -481 -247 451 614 -221 -875
4846 -875 -114 718 358 -622 -612 367 667 -67 -818 -444 494 402 -422 -774 -56 679 126 -917 -570 468
4866 468 562 -14 -563 -312 773 522 -378 -608 153 619 95 -627 -211 667 774 -26 -841 90 557 383
4886 383 -281 -462 399 536 -83 -610 -304 523 446 -218 -839 -12 553 65 -475 -589 277 640 -179 -613
$$ packed form
4746F14k36k19o02N46N75m30k49k16O49P3n73l89L48P33l07n88k25L52O26o14
4766a32k38l3M26L85p79m29O25P08j01r70m05J010N59o18p39K74Q83J55q20n21
4786g60O75Q85l54j094J39R32J78l21p89M65P82K1j023m12O53Q01l35q95l1J035
4806E52M4j005m10N04P81p9j068j95J054L91q52m84K99R95m4r23l32P68R34o79
4826B51r58K65P02O29r01q48N96J132m40p98k33R16M71m80p85K34O98J63q35o54
4846h75P61Q32l60r80J0R79L00p34p51L74R38r2q24l52P18P35n53j043L47J038
4866D68R4n76n49K51J085k51r00k30P61M66n24p22M16Q78J07q00q15R31M67j74
4886C83o64j81Q61J37o19n27L06Q27p7o64o21Q27N65m88n40j14Q66L63q19m34
$$ plain form
4906 -613 -368 454 93 -480 -674 150 535 -30 -480 -321 429 436 -48 -570 -110 661 326 -419 -181 307 667
4927 667 -26 -485 136 377 81 -198 -67 -91 598 -41 -137 -383 338 482 -232 -381 127 260 268 -228 -74
4948 -74 -66 236 -181 -225 -72 0 96 -87 -115 -52 112 -58 -267 -242 131 111 -129 -425 85 93 120 -140 -156 -14 169
4973 169 20 55 -112 -105 2 32 -154 -71 61 80 41 74 -143 -135 61 287 -16 47 30 -186 354 -67 -99 -74 232
4998 232 -43 -119 -171 397 274 -18 -121 -253 372 340 -115 -319 -27 340 188 -299 -267 45 315 5 -241
5019 -241 -134 381 -31 -236 -315 -52 638 129 -555 -307 308 357 -56 -266 120 107 340 -11 -292 322 531
5040 531 -32 -475 -101 392 332 39 -432 -306 555 165 -375 -486 215 429 -143 -531 -175 510 382 -365
5060 -365 -498 -49 401 472 -388 -386 455 513 5 -390 -349 549 415 -342 -477 406 600 129 -285 -128 459 794
$$ packed form
4906f13K45Q22l61n73j94Q24L85n65m50J59P50Pm84n22M60P71l35p45K38M88L60
4927F67o93m59O21K41k96k79J31k4O89o39r6k46P21J44p14j49N08J33Qm96J54
4948g4QL02m17m4J53P2R6j83k8O3J64j70k09K5L73k0k40k96N10QK7k60j6J42J83
4973A69j49L5j67PJ07L0j86Q3J32J9l9L3k17QJ96K26l03O3j7k16N40m21l2K5L06
4998B32k75p6n2N68j23k92j03j32O25l2m55k04K92L67j52m87L2L12K70l10k46
5019b41J07N15m12k05p9K63O90n09o84K48O15M9m13k10L86j3K33l51k81O14K09
5040E31n63m43L74M93o0k93m71J26Q61l90n40j11P01K14n72l88L56O85j28p47
5060c65j33M49M50P1q60KQ41N8n08l95M1Q98j34p57j35Q83J94m71m14J57N87L35
$$ plain form
5082 794 -112 -471 -2 791 448 -526 -468 472 780 -6 -411 -131 616 355 -475 -738 109 564 161 -862
5102 -862 -468 225 694 -352 -862 -216 484 313 -425 -798 114 725 234 -718 -80 612 594 -524 -472 46
5122 46 614 499 -662 -155 518 795 23 -582 -10 630 571 -390 -617 660 792 188 -640 -341 517 427
5142 427 -538 -848 -115 549 251 -422 -484 84 405 -188 -923 -298 534 319 -414 -656 -170 838 248 -460
5162 -460 -495 475 713 19 -585 -254 771 585 -274 -527 161 940 354 -500 -376 395 746 -275 -558 -50
5182 -50 592 422 -500 -596 69 412 -270 -768 -488 357 354 -415 -307 -47 521 -72 -623 -487 381 308 -26 -420
5204 -420 -130 585 603 -348 -200 324 448 45 -338 -113 480 603 -119 -356 188 465 159 -58 -219 375
5224 375 314 72 -261 -107 321 212 -210 -228 43 593 -90 -374 -326 138 188 -243 -439 -195 64 11 -407 -366
$$ packed form
5082G94r06l59M69P93l43r74N8R40L08p86m05K80P47k61q30k63Q47M55m03j023
5102h62L94O93M69j046n10O46P00j71p38l73R12O11m91r52O38O92j8j118N2N18
5122D6N68j15j161N07O73K77p72o05N72O40n9r61k27J277J32o04q28K99Q58r0
5142D27r65l10P33O64k98o73o2N68L21n93p35O25Q32k15p33k42M86J008n90p08
5162d60l5R70K38o94o04L31J025j86q59k53O88P79n86q54J24P71L51j021k83N08
5182e0O42j70r22r6O65L43o82m98K80Q45lp69J08K60N68n93n51J36Q68p3l34l94
5204d20K90P15J8r51J48N24J24m03l83K25N93J23p22k37N44K77l06k17j61N94
5224C75o1k42l33J54M28j09m22j8K71N50o83k84M8M64N0m31j96K44K59n3m18M1
$$ plain form
5246 -366 113 102 87 8 33 214 303 -179 -112 236 462 439 -18 -20 218 299 124 -53 -34 347 135 47 -33 169
5270 169 -141 -219 45 298 20 -302 -40 -289 77 -348 -80 -290 -200 -77 -69 -216 59 124 -239 -211 242 -103
5292 -103 -110 12 89 287 24 -169 -44 173 211 88 64 -67 167 248 32 -13 79 188 137 -58 -270 18 373
5315 373 -170 -521 -87 199 -99 -464 -253 -239 61 60 -553 -182 -46 129 -417 -522 -221 12 223 -163 -474
5336 -474 245 258 67 -239 -155 520 506 -79 -104 -30 302 364 -207 -209 216 418 -109 -380 19 300 404 -208 -468
5359 -468 -119 566 124 -475 -357 389 195 -183 -631 -287 347 -160 -400 -694 -4 315 21 -477 -249 409
5379 409 458 -133 -673 -73 524 408 -298 -448 413 1097 -27 -527 -297 483 414 98 -355 258 976 268
5399 268 -645 -316 317 551 -131 -686 -195 575 429 -454 -718 133 571 -96 -1014 -301 290 333 -462 -443 -20
$$ packed form
5246c66M79j1j5p9K5J81Q9m82O7L48K26k3m57kK38Q1j75j77J9L81k12q8q0K02
5270A69l10p8K64K53k78l22K62k49L66m25K68k10R0J23Qj47K75O5l63K8M53l45
5292a03pJ22P7J98k63j93J25K17L8j23k4j31K34Q1k16m5R2J09n1j95k12K88L55
5315C73n43l51M34K86k98l65K11J4L00jo13L71J36J75n46j05L01K33K11l86l11
5336d74P19J3j91l06Q4O75j4n85k5P4L32O2n71kM25K02n27k71L99K81J04o12k60
5359d68L49O85m42n99J18P46j94l78m48L44O34n07k40k94O90L19k94m98K28O58
5379D09M9n91n40O00N97j16p06j50Q61O84j124n00K30P80o9l16m53O13P18p08
5399B68r13L29O33K34o82n55M91P70j46q83k64Q51M38o67r18P13N91M3p95J9M23
$$ plain form
5420 -20 464 246 -575 -803 400 888 -155 -693 -26 726 568 -295 -577 163 629 108 -492 -36 294 553
5440 553 20 -552 15 619 280 -227 -353 292 658 -275 -625 -367 282 258 -429 -765 -149 211 159 -894
5460 -894 -938 260 75 -252 -637 -127 628 404 -252 -413 139 766 122 -575 -147 207 605 53 -487 14
5480 14 553 192 -305 -312 186 594 67 -494 -102 302 224 -117 -289 -189 263 -163 -431 -169 204 187 -158 -495
5502 -495 -81 398 302 -374 -488 410 224 169 -219 -406 282 377 -50 -239 -20 496 185 -204 96 281 368
5523 368 176 -298 -56 397 73 -40 -108 162 354 158 -396 -309 167 184 18 -403 -33 73 44 -240 -111
5544 -111 9 6 -80 -168 -46 195 1 74 -126 20 96 -39 -72 -416 20 -140 37 -205 24 58 5 -126 -33
5567 -33 -41 247 179 -72 -149 -135 147 72 148 188 -142 -149 146 -13 44 -137 83 115 -74 -203 -54 -89 272 -169 41
$$ packed form
5420b0M84k18q21k28J203M88j043n38O67P52j58q63k82P40M66n21o00M56L30K59
5440E53n33n72N67O04l39n07j26O45L66r33l50K58O49k4o87l36O16L60n2j053
5460h94m4J198j85l27l85N10P55k24o56j61N52O27o44o97M28L54L98n52n40N01
5480A4N39l61m97pM98M08n27n61L92M04p8l41j72J00M52m26k68K62L73j7l45l37
5502d95M14M79r6o76j14Q98j86n5l88j87O88R5m27j89K19N16l11l89L00J85Q7
5523C68j92m74K42M53l24j13o8K70J92j96n54Q7M76J7j66m21L70J06k9k84J29
5544a11J20lq6q8J22K41j94P3k00J46P6j35l3l44M36j60J77k42K29L4n3j31R3
5567c3qK88o8k51p7J4K82p5P6M0l30pK95j59N7j81K20L2j89j29J49l5L61m41K10
$$ plain form
5592 41 -197 -44 74 -224 -345 113 282 26 41 -454 205 -21 -132 -54 -257 143 192 -90 -245 194 181 -1
5614 -1 -157 -248 -25 227 -334 -255 91 -21 54 -308 -203 38 119 -13 -499 -168 495 273 91 -319 245 286
5636 286 -50 -303 -235 183 294 -108 -251 -3 384 117 -281 -241 67 352 -409 -433 -108 406 240 -93 -671
5657 -671 148 488 157 -203 -214 93 212 -7 -282 -29 504 164 -354 -343 118 673 28 -417 -398 293 269
5678 269 -139 -507 -216 448 291 -414 -293 263 480 -247 -277 14 441 349 -229 -756 -37 567 -160 -88 -325
5699 -325 122 570 -242 -578 -139 366 104 -267 -419 28 586 108 -428 -227 439 327 -284 -587 -351 491
5719 491 308 -561 -647 276 598 282 -364 -114 456 391 -49 -482 268 553 -11 -576 -433 498 697 -224 -710
5740 -710 -119 513 234 -629 -556 3 420 -261 -446 -346 550 324 -218 -396 37 501 63 -575 -267 218
$$ packed form
5592D1k38J53J18k98j21M58J69k56J5m95O59k26j11P8k03M00M9k82j55M39j3j82
5614aj56r1K23K52n61P9L46j12P5l62J05K41Q1j32m86L31O63k22j82m10N64M1
5636B86l36k53O8M18J11m02j43K48L87k67l98M0L08K85p61k4L25N14j66l33n78
5657f71Q19L40l31l60j1L07J19k19k75K53N33l40n18J1M61N55o45m45J9O91k4
5678B69m08l68K91O64j57p05J21N56K17p27l0K91M27r2n78n27P19O04p27P2k37
5699c25M47M48q12l36M39N05k62l71j52M47N58m78n36K01O66j12o11l03K36Q42
5719D91j83q69q6R23L22l16o46K50N70o5m40m33P50K85n64n65J43R31J99r21m86
5740g10N91O32k79q63P3N59M17o81j85J00Q96k26n42j78M33M64m38o38L08M85
$$ plain form
5760 218 226 62 -364 -349 489 432 -324 -505 262 487 -89 -206 -156 326 267 -320 -381 -132 366 432 -274 -179 156
5783 156 424 72 -308 -250 153 304 -500 -416 -13 223 -46 -281 -450 133 120 -20 -402 -360 431 14 -145
5804 -145 -290 108 284 269 -122 -147 183 380 4 -313 160 211 226 -195 -158 170 295 -49 -124 -66 197 297
5826 297 -225 -350 37 242 -133 -398 -143 106 -67 -44 -230 -277 -13 121 -135 -142 -25 308 90 -217 -184 197
5848 197 385 -196 -171 104 353 50 -207 -173 161 287 -16 39 119 158 289 92 -44 88 130 -61 -75 3 132
5871 132 -245 -152 -103 59 -54 -310 -93 1 -5 -132 -193 -3 -5 94 -60 -130 100 30 119 -183 114 208 86 -115
5895 -115 77 444 -100 1 66 147 369 -74 -127 -110 264 225 -90 -135 64 153 72 82 -9 36 266 -200 -269 -111
5919 -111 -207 277 -261 -146 -109 174 -409 -314 -6 318 -4 -165 -436 38 95 -72 -98 -187 294 363 -101 -172 30
$$ packed form
5760B18Qj64m26J5Q38n7p56j81P67K25n76j17N0M82n9n87o1K49M98O6p06R5L35
5783A56K68l52l80N8M03J51q04Q4M03K36k69k35j69N83j3j40l82M2P91m17j59
5804a45j45L98J76j5l91k5L30J97l76l17M73N1J5m21L7L28J25l44p5N8K63J00
5826B97n22j25L87K05l75k65K55K49j73K3j86m7K64J34k56pJ17L33k18l07L3L81
5848A97J88n81K5K75K49l03k57L4L34J26l03N5Q0L9J31j97j36J32M2j91j4P8J29
5871A32l77R3M9J62j13k56K17R4oj27o1J90kR9j54p0K30p0Q9l02K97R4j22k01
5895a15J92L67n44J01O5Q1K22m43n3J7L74l9l15m5J99Q9q1J0r1M5K30m66o9J58
5919a11r6M84n38J15L7K83n83R5L08L24l22j61k71M74N7j67k6q9M81O9m64p1K02
$$ plain form
5942 30 367 101 -96 -67 211 358 195 -136 -32 259 206 117 -276 125 435 324 -199 -325 254 198 -85 -601
5964 -601 -99 373 197 -360 -398 82 349 40 -353 -219 -6 217 -143 -602 29 418 42 -307 -219 99 281
5985 281 -56 -178 -14 487 404 -82 -150 139 522 48 40 -411 312 377 -186 -311 -137 192 330 -163 -452 -144
6007 -144 421 34 -518 -336 211 296 -174 -271 89 147 314 -345 -93 284 241 -6 -215 -182 698 264 -405 -330
6029 -330 286 643 204 -359 -244 322 454 92 -343 -93 330 263 -86 -373 66 633 101 -375 -87 251
6049 251 179 -210 -650 66 353 -277 -371 -356 89 233 -123 -558 -216 109 327 -101 -242 32 563 224 -181
6070 -181 -89 395 458 10 -387 -70 277 334 -216 17 278 402 154 -530 -321 129 354 -77 -323 -24 191
6091 191 -102 -467 -411 50 296 -136 -391 -61 325 248 -212 -69 -49 182 236 -202 -206 4 177 -72 -107 69
$$ packed form
5942C0L37k66j97K9K78J47j63l31J04K91n3q9l93M01L10j11n23j26N79n6k83n16
5964f01N02M72j76n57l8M80K67l09l93J34K13K23l60m59O31L89l76l49Q8L18J82
5985B81l37j22J64N01q3m86o8K89L83m74qm51P23O5n63j25J74L29J38m93k89L08
6007a44N65l87n52J82N47Q5m70r7L60N8J67o59K52L77m3k47k09L3Q80m34o69P5
6029c30O16L57m39n63J15N66J32l62m35K50M23o7l49k87M39N67n32m76K88L38
6049B51p2l89m40P16K87o30r4J5M45J44l56m35L42L25K18m28j41K74N31l39m05
6070a81R2M84O3m48l97L17L47N7n50K33K61J24k48o84K09M50K25m31k46K99K15
6091A91k93l65N6M61K46m32k55L30L86p7m60J43K0K31N4m38mK10J73k49l5J76
$$ plain form
6113 69 281 316 18 -214 118 213 217 41 156 213 16 -85 -156 -143 298 133 -324 -270 -57 16 130 -91 -118 142
6137 142 50 163 -76 208 -109 -67 -129 -252 254 109 61 -68 -76 -55 -63 -202 -3 36 93 -17 9 192 170 147 -190
6162 -190 -76 -31 115 7 28 120 207 98 107 -163 61 -37 -126 44 127 -81 43 217 11 -20 -1 -41 -99 48
6186 48 -69 -124 -85 99 -10 119 -48 86 145 -21 -91 -169 273 151 -201 -112 23 145 60 -57 -63 377 188
6209 188 -10 46 -125 117 37 -133 -43 -167 104 176 -67 -77 40 117 28 -399 -349 208 337 -94 -73 106 226
6232 226 34 -166 5 210 -137 -56 -243 -119 202 -80 -239 -377 33 166 86 -236 29 158 256 -115 -424
6253 -424 -63 384 -20 -244 -366 16 -14 -159 -292 -140 291 145 -189 -400 55 91 142 -30 -155 172 436
6274 436 -68 -320 -120 227 109 -158 -321 27 300 -167 -162 -278 330 381 -46 -280 91 351 200 -198 -129
$$ packed form
6113F9K12L5k98k32L32R5Mj76J15N7j97j01p1J3M41j65m57N4K13P3J14k21k7K60
6137A42r2J13k39K84l17M2o2j23N06j45m8j29qK1qj39J99L9N7j10K6J83k2k3l37
6162a90J14M5J46j08K1R2Q7j09Rk70K24r8q9J70Q3k08J24J74k06l1J9m0n8J47
6186D8j17n5L9J84j09J29j67J34N9j66p0p8M42j22l52Q9J35J22q5j17oM40j89
6209A88j98N6j71K42q0j70R0j24K71P2k43j0J17P7q9m27N0N57J29m31K1J79J20
6232B26j92k00J71K05l47Q1j87J24L21k82j59j38M10J33q0l22K65J29R8l71l09
6253d24L61M47m04k24j22L82l0j45j33J52M31j46l34k11M55L6N1j72j25L27K64
6274D36n04k52K00L47j18k67j63L48K73m67Nj16O08N1m27k34L71K60j51l98O9
$$ plain form
6295 -129 -20 252 -42 -319 -230 160 120 -209 -278 45 306 46 -278 -309 199 241 -211 -456 -87 274 117 -341
6317 -341 -278 120 149 108 -633 -348 364 212 -173 -212 208 369 -16 -98 -270 153 246 112 -489 -69 257 62
6339 62 -173 -305 -152 196 -103 -317 -409 166 389 101 -205 116 176 108 -123 -471 43 249 -111 -489 -167
6360 -167 238 248 -283 -198 263 340 191 -309 -64 375 336 202 -243 156 360 373 -96 -271 -54 99 -139 -237
6382 -237 -294 234 163 -108 -172 -253 -80 61 117 -138 60 254 -65 -212 -88 -7 201 -101 -156 231 193 48 -268
6405 -268 23 -8 140 -9 -247 13 156 92 3 134 196 105 104 -144 15 127 214 -205 -30 -3 12 -188 111
6428 111 -177 169 21 -124 4 -188 52 -160 -155 82 -134 -47 -121 -108 16 176 69 58 60 58 26 78 195 29
6452 29 -23 -81 32 25 -16 98 107 203 -6 197 116 46 -167 -52 -247 204 63 -114 132 -41 37 2 19 -61 -271
$$ packed form
6295a29J09K72k94k77Q9L90m0l29o9L23K61k60l24l1N08M2m52k45L69L61j57m58
6317c41O3L98K9m1p41K85P12j52l85l9M20J61l85q2j72M23R3j34o01M20L26j95
6339F2k35j32J53L48k99k14r2N75K23k88l06L21O0o8k31l48N14K06l60l78L22
6360a67M05J0n31Q5M61P7j49n00K45M39l9j34m45L99K04J3m69j75K17J53k38r8
6382b37n7N28p1k71o4q1J73J41N6k55J98J94l19j47J24Q1K08l02n5L87l8j45l16
6405b68K91l1J48j49k38K60J43o4q9J31O2r1jk48J59J12Q7m19J75K7J5k00K99
6428A11k88L46j48j45J28j92K40k12NK37k16Q7p4J3J24J60j07j1Kkl2N2J17j66
6452B9n2n8J13pm1J14RR6k09K03q1p0k13J15j95M51j41j77K46j73P8l5J7q0k10
$$ plain form
6477 -271 -223 -88 184 -26 -111 23 224 21 215 -67 29 -65 -15 -61 44 156 237 179 -84 533 163 -22 123
6500 123 -141 214 47 39 -42 67 215 -6 28 79 -302 -69 -136 -302 -168 175 100 -101 -216 -110 175 -130
6522 -130 -262 -190 73 89 -178 -323 56 391 87 -92 -225 69 98 -93 -305 -69 225 48 -95 -6 63 412
6544 412 29 47 -169 262 129 -181 -64 -7 386 105 -206 -62 -63 133 -32 -189 -133 128 230 -380 -9 25
6566 25 191 59 -157 -251 76 85 -49 -204 -44 338 111 -116 -25 131 261 141 -378 -32 155 -3 -19 -188
6588 -188 104 289 47 -138 -46 5 233 -94 -154 13 297 -234 68 -40 -105 375 115 -88 -257 -75 43
6609 43 -155 -244 -207 153 92 -366 -160 21 102 7 -264 -112 129 66 -137 -352 67 260 297 -148 53 77 244
6632 244 -219 -409 -7 93 190 -247 -17 -130 421 191 -337 -58 68 412 -14 -257 104 245 98 -409
$$ packed form
6477b71M8J35K72k10q5J34K01k03J94k82R6r4N0m6J05J12Q1n8k63O17l70j85J45
6500A23k64L55j67qq1J09J48k21L4N1l81K33o7j66J34L43p5k01j15J06K85l05
6522a30j32P2K63J6k67j45L79L35l04j79j33K94K9j91k12K36K94j77j43Q9O9L49
6544D12l83J8k16M31j33l10J17N7L93k81l11J44jJ96j65j57N6K61J02o10L71L4
6566B5J66j32k16r4L27Rj34j55J60L82k27k27R1J56J30j20n19L46J87j58j6j69
6588a88K92J85k42j85R2N1K28l27o0J67K84n31L02j08o5M80k60k03j69J82J18
6609D3j98q9L7L60o1m58K06J81Q1r5k71J52K41o3k03k15M19J93L7m45K01K4J67
6632B44m63j90M02J00R7m37K30j13N51k30n28K79J26L44m26k43L61J41j47n07
$$ plain form
6652 -409 -31 -86 -13 -185 -251 -9 89 193 -36 -200 206 453 136 -239 -110 218 104 -253 -355 -136 208
6673 208 127 53 -301 168 121 39 -33 -41 252 338 74 -254 -40 322 44 -222 44 1 -133 -26 -83 -287 102
6696 102 94 98 -204 35 28 -95 -201 -98 187 10 11 -243 -45 42 81 -72 280 34 -13 54 -366 90 168 -18
6720 -18 -120 -208 42 -17 254 -97 -259 112 175 -227 -96 148 -41 212 93 -124 247 -58 51 119 -166 92
6742 92 -63 -54 76 15 108 0 -166 -9 -149 155 -61 93 -104 68 -241 -301 158 -65 -149 288 269 59 38
6765 38 26 -17 228 62 98 165 -80 86 348 52 119 23 39 83 -169 38 41 80 -14 3 91 -295 -14 11 -271
6790 -271 -131 -4 45 -410 26 -55 -9 -111 122 -207 222 -84 7 -99 -11 146 252 100 -23 100 -172 6
6812 6 11 46 220 -248 54 100 84 -48 -366 194 171 309 -291 -192 120 234 152 82 159 127 -1 -123 -174 96 51
$$ packed form
6652d09L78n5P3j72o6K42R8J04k29j64M06K47l17l75J29L28j14l57j02K19L44
6673B08q1p4l54M69m7q2p2qK93Q6k64l28K14L62k78k66K66m3j34J07n7k04L89
6696A02qMl02K39pj23j06J03K85j77Jk54J98Q7L9j53L52k46m7O7m20M56P8j86
6720a8j02q8K50n9K71l51j62L71O3m02J31K44j89K53j19k17L71l05J09O8k85K58
6742I2j55RJ30o1R3j08j66J57j40L04k16J54j97J72l09o0M59k23q4M37j9k10k1
6765C8j2m3K45j66L6O7k45J66K62k96O7r6J6M4k52K07LL9r4J7Q8l86K81K5k82
6790b71J40J27M9m55M36q1M6j02K33l29M29l06R1j06Q8J57J06j52j23J23k72J78
6812FNL5J74m68L02M6j6j32l18N60k3J38o00R9L12J14q2p0P7l2j28j22n1K70m5
$$ plain form
6837 51 239 -62 34 29 -2 588 -154 -8 87 -21 10 90 -103 212 63 -128 -23 144 -17 111 -1 7 211
6860 211 -147 118 -85 141 321 72 -227 -74 21 115 -134 -363 -211 101 127 -240 -151 59 185 48 -94
6881 -94 -202 57 104 -37 -95 -132 77 54 51 -159 11 -38 -122 -252 -69 149 93 15 -221 -118 130 129 -116 152
6905 152 -32 201 -125 -362 98 246 207 -327 -276 -65 323 7 -180 -237 285 165 126 27 -291 150 24 -80
6927 -80 -199 -74 113 0 -266 -166 70 23 -154 -193 252 267 43 -157 -132 162 326 17 -234 -65 84 19
6949 19 -345 -29 62 133 66 -330 -423 347 216 -163 -38 68 145 184 -161 -260 -73 176 143 -29 -65 81 306
6972 306 61 -174 111 233 -29 -66 -49 31 105 20 -51 -29 -113 56 -9 -243 -176 120 -237 -339 156 76 360 -271
6996 -271 246 173 -57 -51 -37 107 35 99 112 -44 157 259 -125 -280 24 224 -44 -104 128 -151 53 67 -305
$$ packed form
6837E1J88l01R6nl1N90p42J46R5j08L1Q0j93L15j49j91J05J67j61J28j12QK04
6860B11l58K65k03K26J80k49k99J53R5R4k49k29J52L12K6l67Q9K10J26j37j42
6881i4j08K59M7j41n8l7K09k3lk10J70m9q4j30J83K18n6p8k36J03K48jk45K68
6905A52j84K33l26k37M60J48l9n34N1K11L88l16j87n7N22j20l9r9l18M41j26j04
6927h0j19J25J87j13k66J00K36m7j77l9M45J5k24k00K5K94J64l09k51J69J49o5
6949A9l64L16R1P1o7l96r3P70j31l79J25J06P7L9l45r9J87K49l3j72l6J46K25
6972C06k45k35K85J22k62l7J7Q0P4q5p1K2q4J69o5k34O7K96l57j02M95q0K84o31
6996b71N17p3k30OJ4J44p2O4J3j56K01J02l84j55L04K00k68o0K32k79K04J4l72
$$ plain form
7019 -305 149 -34 -127 9 -137 14 -51 68 150 -283 193 71 -41 -88 -77 -158 -277 -215 30 -37 5 54 -83
7042 -83 85 -41 79 -47 -151 -238 47 42 -17 98 -91 -132 197 119 -99 10 244 152 27 -98 207 48 -48
7065 -48 -94 229 13 -54 30 -154 9 -16 -87 -85 79 84 -246 60 -31 2 -179 -285 -143 -105 -131 -116 165 92 38 -109
7091 -109 -97 70 4 5 89 229 -5 36 -33 -241 -18 296 -208 -187 -55 168 119 83 -319 -307 1 10 -159 -217 55
7116 55 -18 -3 31 -189 125 -6 -190 -147 195 -33 36 0 187 2 84 -294 -119 -42 185 45 119 -180 -153 305
7140 305 152 -111 53 123 221 47 -216 188 92 -8 -215 -59 220 99 130 -168 -134 -117 36 56 -144 181
7162 181 -89 68 -153 -28 109 99 49 -260 -83 323 -84 -94 -297 28 295 38 48 -62 286 -32 -25 -98
7184 -98 214 278 140 110 -111 107 125 276 -210 -45 442 -56 -5 -289 -100 75 173 -170 -57 170 32 -211
$$ packed form
7019c05M54j83r3J36j46J51o5J19Q2m33M76j22j12m7J1q1j19O2K45o7M2M9j37
7042h3J68j26J20j26j04q7K85nn9J15j89m1L29p8k18J09K34r2j25j25L05j59r6
7065d8m6L23k16o7Q4j84J63k5p1KJ64Nl30L06r1L3j81j06J42L8k6J5K81p3n4j47
7091a09J2J67o6JQ4J40k34M1o9k08K23L14n04K1J32K23m9l6m02J2L08Rj69n8K72
7116E5p3J5L4k20L14j31j84M3L42k28O9l6J87j85Q2l78J75P7K27j40P4k99K7M58
7140C05j53k63J64P0R8j74k63M04r6j00k07J56K79j21L1k98L4J7J53K0k00L25
7162A81k70J57k21J25J37j0n0l09J77M06m07j0k03L25K67k57J0j10L48l18Pp3
7184i8L12O4j38l0k21K18J8J51m86J65M87m98N1k84J89J75R8l43J13K27j38k43
$$ plain form
7206 -211 -161 -39 -110 159 -207 -191 90 -30 -55 -29 -202 228 98 -6 -182 -8 319 288 -113 -269 -116 75
7228 75 -324 -300 178 57 171 -87 -217 64 38 54 -83 -254 152 170 -144 -295 336 87 -16 106 89 -15
7250 -15 -122 -82 -139 -254 245 235 -97 -78 -170 109 -138 -143 79 138 99 -41 -59 -116 81 -139 56 -77 -112 251
7274 251 -23 -2 10 103 194 -30 -45 -90 -120 132 -188 171 78 191 -100 -298 -138 98 11 -120 18 108 169 62
7298 62 -64 -96 -58 181 221 -8 -47 72 -4 199 -304 -132 233 23 -295 -81 246 -62 -110 287 1 102
7320 102 17 -23 -126 -60 137 129 107 63 223 -114 14 -326 -60 0 427 -27 200 88 206 -129 70 88 31
7343 31 -57 43 111 -80 51 167 44 65 -28 -16 -351 -97 164 171 111 -119 -116 194 -68 -154 166 -75 168 201
7367 201 193 -143 -79 45 76 177 137 -222 -68 -189 -62 237 -133 -45 -37 32 -57 189 -72 -164 60 -2 -128 0
$$ packed form
7206b11N0J22p1K69l66J6K81j20k5K6j73M30j30j04j76J74L27l1m01j56J53J91
7228G5l99K4M78j21J14k58j30K81k6J6j37j71M06J8l14j51O31k49j03J22j7j04
7250a5j07M0n7j15M99j0l32J9r2K79k47nK22N9l9j40j8n7J97k20J95j33l5L63
7274B51k74K1J2R3R1k24j5m5l0K52l20L59r3J13k91j98J60K36q7j31J38R0O1j07
7298F2j26l2L8K39M0k29l9J19p6K03n03J72L65k10l18K14L27l08m8L97k86J01
7320A02q5m0j03O6J97qk2m4J60l37J28l40K66O0M27m54K27j12J18l35J99J8n7
7343C1q8J00O8j91J31J16j23K1r3J2l35K54K61Po0k30LL10k62q6L20k41K43L3
7367B01ql36O4J24L1J01m0l59J54j21J27K99l70Q8QO9q9K46k61r2K24o2j26J28
$$ plain form
7391 0 35 -96 1 52 180 57 39 124 49 89 32 -58 -99 116 -102 -61 199 -281 -35 -37 -182 10 46 -19 96 116
7417 116 -296 85 71 -223 -61 47 -45 136 29 -210 -12 195 -194 76 -50 62 -64 -116 -105 40 -39 166
7439 166 -50 146 152 178 -148 164 199 304 69 -34 -159 -2 93 158 -51 -9 -38 -32 -68 -293 28 -15 146 -298
7463 -298 107 -30 113 -141 -11 -228 -59 32 -7 -56 -146 102 3 117 192 -55 -27 -96 -175 -82 91 -44 -357
7486 -357 88 51 95 -94 113 -25 -7 5 -46 -53 -138 15 95 227 24 198 132 25 -274 93 93 -230 101 98 100
7511 100 -10 27 -143 89 60 48 59 -204 204 97 105 -51 -88 34 78 154 -126 149 -178 115 -185 30 -195
7534 -195 5 101 -101 -184 4 -100 -266 44 -161 115 205 117 116 158 94 -137 -58 5 -184 154 -38 164 85 -50
7558 -50 -101 -49 -147 102 212 -193 134 118 137 115 -86 234 124 -13 20 -72 94 203 -103 23 -138 -22 114
$$ packed form
7391@L5j31R7N1J28j23j8Q5p5M0n7r0m1K15k18M1K60m80K46kj45J92L6o5J15K0
7417A16m12L81j4k94J62J08r2J81j07k39J98K07l89K70j26J12j26n2J1J45p9K05
7439A66k16J96OK6l26L12L5J05k35j03j25J57R5O5k09M2k9Ol6k25L21m3J61m44
7463b98M05j37J43k54J30k17J69R1l9m9r0K48r9J14P5k47K8o9p9R3J73j35l13
7486c57M45l7M4j89K07j38J8J2n1pq5J53Q0J32k03J74o6j07k99L67%l23L31lK
7511A00j10L7j70K32k9j2J1k63M08j07Qj56l7J22M4P6k80K75l27K93l00K15k25
7534a95K00R6k02q3J88j04j66L10k05K76R0q8jM2o4k31P9O3j89L38j92K02p9j35
7558e0n1N2r8K49J10m05L27j6J9k2k01L20j10j37L3r2J66J09l06J26j61J16J36
$$ plain form
7581 114 107 126 -96 -148 22 -174 -17 22 56 292 -176 13 -91 168 -71 20 -104 49 -23 97 15 66 122 89
7605 89 -58 -9 -59 -99 -60 -117 6 -160 88 -69 -104 143 9 -12 87 173 -4 -70 103 68 118 78 -73 205 7
7630 7 -47 36 -83 -59 93 -161 -105 -13 -202 185 77 -35 -121 238 73 -153 57 134 137 -3 181 -60 -63 -54 98
7655 98 -51 -321 -177 -17 -35 -146 -85 -230 3 -170 13 -29 -212 155 -170 -117 -2 15 -172 22 190 49
7677 49 148 -46 64 -350 118 -67 -120 19 -56 114 66 42 45 -269 -143 -105 27 206 74 38 -43 -206 -38 155
7701 155 139 64 175 14 -162 -160 109 -26 -24 175 75 92 -84 112 248 199 18 -244 -36 109 51 140 -177
7724 -177 -184 -35 317 -124 -150 -26 95 165 118 -58 230 -97 139 200 53 -86 -26 -33 -22 -30 14 -250 -328 -34 -110
7749 -110 -132 210 -67 -15 167 -60 157 143 113 -55 -193 -211 -90 -2 112 -11 107 100 160 -86 -102 80 106 -105
$$ packed form
7581A14pJ9k22n2J70j96J57L9L4K36m68J89j04K59k39R1j24J53p2J20q2N1N6l3
7605H9j47M9n0m0L9n7J23j66K48j57l5K47j34k1R9Q6j77o6J73l5N0m0j51K78j98
7630Gn4Q3j19K4J52k54N6R2j89L87j08j12q6L59j65k26K10P7Lj40J84k41lRJ52
7655I8j49k70J44J60j8j11O1j45K33j73J83m2j83L67l25N3J15J7j87J94J68j41
7677D9R9j94J10m14M68j85n3J39p5J70m8k4Ll14J26L8J32J79j32l6q1j63J68J93
7701A55j6p5J11j61j76KK69j35KJ99j00J7j76J96J36m9j81k62K08J45n8Q9l17
7724a77pJ49L52m41k6J24J21P0m7j76K88l27K36O1j47j39O0pJ1qM4k64p8K94p6
7749a10k2L42k77N2J82k27K17j4l0j68j38j8J21Q8J14j23J18pO0k46j6J82K6k11
$$ plain form
7773 -105 131 -272 -120 8 151 -123 -30 53 168 -94 163 6 -70 285 -131 -135 216 285 -6 -158 2 -21
7795 -21 152 19 95 -334 151 135 54 -29 86 111 -110 -11 -96 152 76 33 7 108 -16 -196 181 162 223 160 123
7820 123 -42 -49 -20 189 -93 -72 195 -7 138 -83 -190 110 80 -315 -123 119 -114 17 -18 -43 -120 187 251
7843 251 -238 -7 39 218 -129 -113 -158 164 180 39 14 -71 103 -121 47 -189 -146 112 -29 -141 -87 101 109
7866 109 18 -98 309 120 -27 -175 88 68 -127 -107 -81 131 -109 140 -84 -123 311 2 -114 41 -101 13
7888 13 226 100 -186 1 129 -53 -79 29 42 -126 -57 -88 -68 111 71 8 -85 -38 105 88 18 92 -23 139
7912 139 -112 -63 -64 -115 83 134 -80 101 14 -141 -198 63 -112 -97 -32 -59 -189 -75 15 -152 -164 28 12 21 -231
7937 -231 2 152 138 -231 -68 11 20 -80 -35 -27 -94 -207 -39 -139 -15 150 108 -4 46 79 -5 -49 -73 43 232
$$ packed form
7773a05K36m03J52J28J43k74R3Q3J15k62K57j57p6L55m16mL51O9k91j52J60k3
7795b1J73j33P6m29M85j6q1q3J15K5k21R9q5K48p6m3k6J01j24j80L77j9O1o3l7
7820A23j65pK9K09k82K1K67k02J45k21j07L00l0l95J92K42k33J31l5k5p7L07O4
7843B51m89K31M6J79l47J6m5L22J6j41k5q5J74k24J68k36M3K58j41j12N4J88Q
7866A09r1j16M07j89j47j48K63k0j95K0K6K12k40K49k24l9M34l09j16J55j42J14
7888A3K13j26k86J87J28j82k6J08J3j68O9l1K0J79m0o3r3M7J43j7p0P4j15J62
7912A39k51M9jn1J98N1k14J81q7j55n7K61j75J5O5k7j30J14R0j67j2J92j6Rk52
7937b31K33J50j4l69J63P9Rj00M5Qo7j13J68j00J24J65m2j12N0L3q4m4k4J16J89
$$ plain form
7962 232 -162 -29 183 141 27 218 -41 -67 9 -16 -341 121 137 114 199 -141 -148 91 276 125 -132 -237 -381
7985 -381 -177 293 153 179 -137 54 -84 -108 -169 -78 -168 -70 -45 72 108 22 -82 -98 232 215 -34 -99 -51 308
8009 308 26 76 -18 113 104 -131 178 72 113 -135 31 -168 -46 -54 -17 143 -128 71 -151 -13 197 82 -167
8032 -167 260 44 17 -111 14 -79 367 96 -78 39 -118 258 -145 -90 -106 112 -116 -96 22 18 189 -69
8054 -69 130 11 126 246 -281 -182 177 -126 62 -91 28 68 -47 -233 -67 -83 34 -147 -250 -99 -201
8075 -201 -72 -169 -159 112 240 -5 -132 127 130 59 -18 -161 -33 104 22 -92 150 -150 116 -67 -31 11 9 139
8099 139 251 -76 -47 35 -66 -141 -90 -56 367 -25 -229 -244 264 136 -51 -73 -40 142 -195 142 19 31 -112
8122 -112 -59 -227 -215 -59 -62 -131 6 48 304 97 -82 -128 225 -75 -126 -45 12 125 178 -173 -149 124 194 -48
$$ packed form
7962B32l94J33K12m2j14J91k59k6P6k5l25M62J6k3Q5l40pK39J85j51k57j05j44
7985c81K04M70j40K6l16J91j38k4o1R1r0R8K5J17L6q6j04j6L30j7k49o5M8L59
8009C08k82N0r4J31rk35L09j06M1k48J66j99J22qL7J60k71J99k22J38K10j15k49
8032a67M27k16k7j28J25r3M46k71j74J17j57L76m03N5j6K18k28K0J18mJ71k58
8054f9J99j19J15J20n27R9L59l03J88j53J19M0j15j86J66j6J17j81j03J51j02
8075b01J29r7J0K71J28k45j27K59Lp1p7j43J28J37q2j14K42l00K66j83L6M2kJ30
8099A39J12l27K9Q2j01p5N1L4M23l92k04j5N08j28j87k2L3J82l37L37j23J2j43
8122a12N3j68J2J56lo9J37M2K56k07j79m6L53l00n1Q1N7J13N3l51K4K73P0k42
$$ plain form
8146 -48 -164 -150 -30 -182 -22 -192 -71 21 -174 6 -164 27 143 13 -40 -115 133 -99 16 38 -64 -21
8168 -21 -204 36 33 156 -170 43 -67 -58 98 145 112 -14 -110 60 23 -238 -51 158 107 33 -29 -16 -34
$$ packed form
8146d8j16J4J20j52J60j70J21R2j95J80j70J91J16j30n3p5K48k32J15K2j02M3
8168b1j83K40lJ23l26K13j10RJ56M7l3j26r6J70l7k61J87K09n1p4o2J3j8
8191c4
$$ Imaginary data points
##PAGE= N=2
##DATA TABLE= (X++(I..I)), XYDATA
$$ plain form
0 0 0 0 0 0 0 0 0 0 0 0 -8 8 -8 16 -17 24 -24 33 -41 49 -59 73 -86 101 -120 142 -160 189 -218 249 -285 327
32 327 -373 421 -475 536 -602 673 -756 844 -938 1043 -1158 1284 -1418 1568 -1733 1909
48 1909 -2103 2320 -2555 2815 -3101 3422 -3780 4180 -4637 5161 -5766 6478 -7326 8362
62 8362 -9653 11327 -13577 16788 -21775 30617 -50971 202334 -193667 -547403 161504 492999
74 492999 189796 -381063 -395182 185054 515399 -85968 -615202 -206250 431301 228037
84 228037 -390651 -500074 34408 394772 32395 -507779 -346617 251570 372206 -186229
94 -186229 -523176 -55166 454676 181568 -333936 -295408 184506 432653 81730 -376140
104 -376140 -151314 434225 384478 -186008 -298229 142354 418976 187654 -238329 -239537
$$ packed form
0@%%%%%%%%%%qJ6j6K4l3M1m8N7p4R0j08J32j59J87k21K62l02L49m07M67n34O12
32C27p00P94q96J011j138J275j429J600j782J981k201K442k702K986l301L642
48A909m012M423m875N370n916O523p202P960q817R798j0927J2244j3804J5688
62H362j8015K0980k4904L0365l8563N2392q1588K53305l96001l53736P08907L31495
74D92999l03203n70859j4119N80236L30345o01367n29234M08952O37551k03264
84B28037o18688j09423N34482L60364l62377n40174J61162N98187J20636n58435
94a86229l36947M68010N09842k73108n15504L8528M79914K48147l50923m57870
104c76140K24826N85539m9747n70486j12221M40583K76622k31322m25983j208
$$ plain form
114 -239537 258634 419489 -61224 -354755 -39973 317111 196752 -219964 -320557 56153
124 56153 299664 6193 -349869 -218948 162060 198626 -161238 -363894 -78433 234110
134 234110 64974 -267349 -241675 63169 223181 -302 -284362 -122446 233165 185510
144 185510 -122959 -183546 51395 248108 134531 -142160 -129334 184211 267969 -4153
154 -4153 -157437 10173 212335 172784 -71797 -158769 74129 220928 34298 -159090 -93367
165 -93367 100965 137348 -64892 -197824 -43090 121714 28178 -150225 -152828 -54 89223
176 89223 -28381 -182633 -101205 78542 48642 -93611 -117428 -20453 83484 46153 -94069
187 -94069 -77149 76426 98538 -5593 -50430 7052 92084 92128 -5756 -35945 63013 108948
$$ packed form
114b39537M98171J60855m80713k93531L14782L57084j20359m16716j00593L76710
124E6153K43511k93471l56062J30921L81008L6566l59864k02656K85461L12543
134B34110j69136l32323K5674L04844J60012k23483k84060J61916L55611m7655
144A85510l08469o0587K34941J96713j13577k76691J2826L13545Q3758k72122
154d153j53284J67610K02162l9551k44581q6972K32898J46799j86630j93388O5723
165i3367J94332L6383k02240j32932J54734J64804r3536j78403k603J52774Q9277
176H9223j17604j54252Q1428J79747k9900j42253k3817R6975J03937l7331j40222
187i4069J6920J53575K2112j04131m4837N7482Q5032M4r7884l0189R8958M5935
$$ plain form
199 108948 37260 -11939 10352 55956 72324 12074 -33988 17209 46533 5812 -17383 -20853
211 -20853 -14099 5554 -14839 -46367 -28230 -17435 -38757 -31366 -20373 -42731 -43241 -22519 -23396
224 -23396 -18839 -24376 -48416 -14399 30067 -6727 -42042 -10333 29897 41203 6395 -34736
236 -34736 10058 83348 51297 -26234 -15158 57465 86916 31461 -44465 -12127 93910 81060
248 81060 -34624 -60203 24805 89205 35939 -80227 -75106 56983 84306 -43745 -116117
259 -116117 -34246 71139 43501 -91266 -126616 11508 98395 -15407 -134704 -73810 66594
270 66594 84800 -53448 -140332 -13197 129535 52298 -104704 -91445 67200 140130 10809
281 10809 -126149 -38581 141511 119228 -63241 -114800 37683 162824 65945 -117540 -93260
$$ packed form
199A08948p1688m9199K2291M5604J6368o0250m6062N1197K9324m0721k3195l470
211b0853O754J9653k0393l1528J8137J0795k1322P391J0993k2358n10K0722q77
224b3396M557n537k4040L4017M4466l6794l5315L1709M0230J1306l4808m1131
236c4736M4794P3290l2051p7531J1076P2623K9451n5455p5926L2338J06037j2850
248H1060j15684k5579Q5008O4400n3266j16166N121J32089K7323j28051p2372
259a16117Q1871J05385k7638j34767l5350J38124Q6887j13802j19297O0894J40404
270F6594J8206j38248q6884J27135J42732p7237j57002J3259J58645P2930j29321
281A0809j36958Q7568J80092k2283j82469n1559J52483J25141r6879j83485K4280
$$ plain form
292 -93260 109503 155085 -29558 -149514 -30773 142847 101764 -108261 -156780 40613 158931
303 158931 8822 -167467 -102532 101003 130958 -70299 -188826 -25331 157021 66993
313 66993 -143798 -146810 61543 166524 -1718 -182402 -75734 150432 135541 -86641 -166395
324 -166395 19831 189920 74281 -152476 -122857 120255 185636 -25516 -179346 -39078
334 -39078 180533 133463 -117686 -172289 60422 203076 30920 -183053 -109670 136912 169298
345 169298 -73148 -206270 -16185 189135 85164 -158896 -163068 78859 189361 -10777
355 -10777 -205822 -81484 161521 138095 -107696 -189895 20409 197034 58372 -176445
365 -176445 -129122 123028 179292 -42571 -192304 -36323 182922 117943 -131237 -165573 68578
$$ packed form
292i3260K02763M5582j84643j19956J18741J73620m1083k10025m8519J97393J18318
303A58931j50109j76289O4935K03535K9955k01257j18527J63495J82352r0028
313F6993k10791l012K08353J04981j68242j80684J06668K26166j4891k22182p9754
324a66395J86226J70089j15639k26757K9619K43112O5381k11152j53830J40268
334c9078K19611m7070k51149n4603K32711J42654j72156k13973P3383K46582L2386
345A69298k42446j33122J90085K05320j03971k44060m172K41927J10502k00138
355a0777j95045J24338K43005k3426k45791q2199K10304J76625j38662k34817
365a76445M7323K52150N6264k21863j49733J55981K19245o4979k49180l4336K34151
$$ plain form
376 68578 194892 18532 -180844 -92214 146381 157467 -79861 -186612 4949 185639
386 185639 72597 -152063 -136947 92456 174475 -20879 -181686 -53484 155299 116291
396 116291 -102457 -157627 35338 172111 36388 -153992 -97003 110693 141324 -47824
406 -47824 -158632 -19016 149403 80898 -113669 -125856 58038 144780 2424 -143494 -67204
417 -67204 110041 108185 -69525 -139065 5815 132745 46075 -115114 -98705 68686 122250
428 122250 -20279 -130001 -35968 110511 81146 -72992 -107846 28216 121232 27998 -100584
439 -100584 -61547 79758 100902 -25095 -100298 -8681 103540 59637 -67616 -77980 38884
450 38884 97814 8463 -88462 -42708 68826 69119 -40452 -87816 -3080 76376 26036 -72708
$$ packed form
376F8578J26314j76360j99376Q8630K38595J1086k37328j06751J91561J80690
386A85639j13042k24660J5116K29403Q2019j95354j60807J28202K08783l9008
396A16291k18748n5170J92965J36773j35723j90380N6989K07696L0631j89148
406d7824j10808J39616J68419o8505j94567j2187J83894Q6742j42356j45918P6290
417f7204J77245j856j77710o9540J44880J26930q6670j61189J6409J67391N3564
428A22250j42529j09722R4033J46479k9365j54138l4854J36062R3016r3234j28582
439a00584L9037J41305K1144j25997p5203R1617J12221m3903j27253j0364J16864
450C8884N8930q9351r6925M5754J11534K93j09571m7364Q4736P9456n0340r8744
$$ plain form
462 -72708 -67266 30675 66050 -16092 -83361 -31183 54624 41885 -45980 -68492 8247 62587
474 62587 13163 -57068 -37161 40752 55681 -10163 -49176 -1322 57493 37613 -25244 -30680
486 -30680 25930 55270 14364 -30851 -11097 38506 37419 -8782 -28347 4161 33441 12839
498 12839 -23566 -21620 8417 16956 -9006 -29153 -15102 4681 -1041 -19733 -24161 -10768 -2686
511 -2686 -9744 -16985 -14049 -7577 -5544 -6338 -4101 -3175 -6438 -1983 8415 10808 859 -4181 9707
526 9707 25387 17613 -2819 -725 24907 35564 10278 -12398 5915 36919 29684 -9634 -22145
539 -22145 13580 39757 9038 -35496 -25432 23711 30640 -22544 -54141 -15213 32209 9942
551 9942 -51635 -55726 6876 36757 -15155 -68565 -36023 35695 33341 -39204 -65413 1081 60798
$$ packed form
462g2708N442R7941L5375q2142o7269N2178Q5807j2739q7865k2512P6739N4340
474F2587m9424p0231J9907P7913J4929o5844l9013M7854N8815j9880o2857n436
486c0680N6610K9340m0906m5215J9754M9603j087m6201j9565L2508K9280k0602
498A2839l6405J946L0037Q539k5962k0147J4051J9783n722j8692m428J3393Q082
511b686p058p241K936O472K033p94K237R26l263M455J0398K393r949n040J3888
526I707J5680p774k0432K094K5632J0657k5286k2676J8313L1004p235l9318j2511
539b2145L5725K6177l0719m4534J0064M9143O929n3184l1597L8928M7422k2267
551I942o1577m091O2602K9881n1912n3410L2542P1718k354p2545k6209O6494N9717
$$ plain form
564 60798 20592 -56101 -41925 45967 72039 -3999 -59815 -3081 80668 59760 -32181 -49671
576 -49671 37438 93551 26316 -59423 -28526 68336 77077 -20830 -75371 -1707 81507 38355
588 38355 -68199 -74114 29354 74622 -13145 -99663 -49832 57130 50382 -62443 -104067 -7053
600 -7053 76173 14419 -95512 -77362 45583 81062 -24967 -102340 -24425 91013 65104
611 65104 -59589 -82188 37812 114451 28768 -82400 -40442 90259 105213 -18811 -87650
622 -87650 8475 118499 65674 -68183 -74381 54123 113302 4947 -104699 -44876 86787
633 86787 77946 -61461 -115637 -1558 97425 22189 -112213 -95297 46097 87135 -38753
644 -38753 -131483 -43771 87606 57307 -86397 -113280 24424 111343 12915 -110856 -60878
$$ packed form
564F0798m0206p6693J4176Q7892K6072p6038n5816N6734Q3749k0908r1941j7490
576d9671Q7109N6113o7235q5739L0897R6862Q741r7907n4541P3664Q3214m3152
588C8355j06554n915J03468M5268q7767q6518M9831J06962o748j12825m1624R7014
600g053Q3226o1754j09931J8150J22945L5479j06029p7373P7915J15438k5909
611F5104j24693k2599J20000P6639q5683j11168M1958J30701J4954j24024o8839
622h7650R6125J10024n2825j33857o198J28504N9179j08355j09646N9823J31663
633H6787q841j39407n4176J14079R8983p5236j34402J6916J41394M1038j25888
644c8753r2730Q7712J31377l0299j43704k6883J37704Q6919r8428j23771M9978
$$ plain form
655 -60878 88667 105150 -34511 -106455 7869 129338 68235 -75845 -73097 71742 131091
666 131091 11279 -99460 -26430 112387 93962 -53221 -99249 23845 117700 31426 -102911
677 -102911 -75595 65119 91631 -39621 -123205 -31810 87027 44262 -93801 -109191 21355
688 21355 89821 -10805 -118185 -62189 69026 71539 -55685 -108091 1410 100517 36503
699 36503 -82728 -65982 61695 102703 -4163 -85209 -10643 101895 76429 -41660 -65730
710 -65730 39537 107561 31429 -68973 -37029 72148 82404 -21673 -78283 -5211 78462
721 78462 38180 -65164 -71242 24024 65189 -12898 -86800 -45664 42982 38771 -51586 -84449
733 -84449 -9308 53743 8585 -69356 -56634 27554 53816 -15457 -66596 -15536 57714 41822
$$ packed form
655f0878J49545J6483j39661p1944J14324J21469o1103j44080K748J44839N9349
666A31091j19812j10739P3030J38817j8425j47183m6028J23094R3855q6274j34337
677a02911K7316J40714K6512j31252q3584R1395J18837m2765j38063j5390J30546
688B1355O8466j00626j07380N5996J31215K513j27224n2406J09501R9107o4014
699C6503j19231J6746J27677M1008j06866q1046P4566J12538k5466j18089k4070
710f5730J05267O8024p6132j00402L1944J09177J0256j04077n6610P3072Q3673
721G8462m0282j03344o078R5266M1165p8087p3902M1136Q8646m211r0357l2863
733h4449P5141O3051m5158p7941J2722Q4188K6262o9273n1139N1060P3250j5892
$$ plain form
745 41822 -31123 -43942 23985 69066 23589 -37978 -16208 52430 60479 -723 -35441 7856
757 7856 59777 37557 -24521 -30293 24525 48967 5220 -40125 -20902 28538 27537 -24422 -47057
770 -47057 -9010 24057 1065 -41647 -40308 1470 17432 -17188 -45365 -22315 13674 9388
782 9388 -24303 -32717 -1323 22991 5181 -21860 -12081 19009 25081 2746 -10438 6841 29093
795 29093 22666 1253 608 19014 26532 13944 930 5072 17442 16500 3072 -2224 3659 6796
809 6796 2039 -4604 -6627 -5344 -5429 -8244 -9186 -10227 -13987 -14425 -9125 -8231 -14475 -18153 -12224 -2489
825 -2489 -3628 -15484 -16164 -384 9389 -1295 -14445 -5954 15690 19085 -2126 -11653 9766 30778
839 30778 18037 -8100 -5309 24204 34847 7359 -16389 2512 33869 25677 -11716 -22040
$$ packed form
745D1822p2945j2819O7927M5081m5477o1567K1770O8638Q049o1202l4718M3297
757G856N1921k2220o2078n772N4818K4442m3747m5345J9223M9440j001n1959k2635
770d7057L8047L3067k2992m2712J339M1778J5962l4620k8177K3050L5989m286
782I388l3691q414L1394K4314j7810k7041R779L1090O072k2335j3184J7279K2252
795B9093o427k1413o45J8406P518j2588j3014M142J2370r42j3428n296N883L137
809F796m757o643k023J283q5k815r42j041l760m38N300Q94o244l678N929R735
825b489j139j1856o80J5780R773j0684j3150Q491K1644L395k1211r527K1419K1012
839C0778j2741k6137K791K9513J0643k7488k3748J8901L1357q192l7393j0324
$$ plain form
851 -22040 10483 33678 6586 -31779 -21855 19652 24884 -17713 -43380 -12095 26819 9459
863 9459 -39072 -42061 6382 29560 -9640 -48984 -25430 27246 26856 -26668 -46372 2842 44727
876 44727 15430 -37795 -28804 32196 50609 -2389 -42039 -3429 54136 39618 -24020 -36198
888 -36198 22631 60486 16259 -42552 -22907 42894 49741 -15199 -52157 -3766 52762 25668
900 25668 -44639 -49019 18411 50310 -5616 -62809 -31680 38766 36681 -35425 -64254 -3087
912 -3087 51974 14515 -55768 -47401 28894 54498 -11802 -62979 -16003 56328 41820 -36593
924 -36593 -53657 20021 69262 16819 -54129 -30750 51338 62445 -15446 -59210 -211 68486
936 68486 38041 -45533 -50721 29705 67340 1423 -65802 -29215 52856 48698 -35785 -68661
$$ packed form
851b2040L2523K3195k7092l8365R924M1507N232m2597k5667L1285L8914j7360
863I459m8531k989M8443K3178l9200l9344K3554N2676l90n3524j9704M9214M1885
876D4727k9297n3225Q991O1000J8413n2998l9650L8610N7565j4518o3638j2178
888c6198N8829L7855m4227n8811J9645O5801O847o4940l6958M8391N6528k7094
900B5668p0307m380O7430L1899n5926n7193L1129P0446k085p2106k8829O1167
912c087N5061l7459p0283Q367P6295K5604o6300n1177M6976P2331j4508p8413
924c6593j7064P3678M9241n2443p0948K3379Q2088J1107p7891m3764N8999O8697
936F8486l0445q3574n188Q0426L7635o5917o7225L6587Q2071m158q4483l2876
$$ plain form
948 -68661 915 62767 18499 -63194 -52809 32655 58233 -16395 -72970 -21011 57748 39079
960 39079 -46180 -63006 16792 68051 9879 -64526 -35461 51071 59331 -23213 -64984 1321
972 1321 70112 33689 -50004 -48407 35787 69045 -1843 -63680 -19913 59315 48428 -35293
984 -35293 -59994 11943 65406 15951 -58460 -41001 39741 54579 -18929 -64604 -11795 55196
996 55196 30305 -46172 -52987 19371 56285 533 -58902 -27729 43462 43136 -26647 -55028 2609
1009 2609 54894 19937 -45323 -37225 30587 50851 -7296 -50815 -11511 47163 33167 -29809
1021 -29809 -42754 13999 49523 8697 -42974 -25115 32487 39125 -14986 -43577 -3680 40905
1033 40905 20575 -31536 -33751 16039 38712 -389 -37870 -16413 29354 28096 -17368 -34730
$$ packed form
948f8661O9576O1852m4268q1693J0385Q5464K5578p4628n6575N1959P8759j8669
960C9079q5259j6826P9798N1259n8172p4405K9065Q6532Q260q2544m1771O6305
972A321O8791l6423q3693J597Q4194L3258p0888o1837M3767P9228j0887q3721
984c5293k4701P1937N3463m9455p4411J7459Q0742J4838p3508m5675N2809O6991
996E5196k4891p6477o815P2358L6914n5752n9435L1173P1191l26o9783k8381N7637
1009B609N2285l4957o5260Q098O7812K0264n8147m3519L9304N8674j3996o2976
1021b9809j2945N6753L5524m0826n1671J7859N7602O638n4111k8591L9897M4585
1033D0905k0330n2111k215M9790K2673l9101l7481K1457M5767j258m5464j7362
$$ plain form
1045 -34730 2040 34511 12305 -28236 -23590 17551 30161 -4463 -31203 -8841 26691 19104
1057 19104 -18169 -26366 5739 27263 4771 -25383 -16011 16402 21055 -7839 -24558 -3681
1069 -3681 20957 11602 -16332 -18728 7086 20080 1199 -18400 -8990 14159 15452 -6246 -15863
1082 -15863 1306 16675 8012 -9822 -9262 7778 14447 1210 -10770 -2860 10649 8678 -4102
1095 -4102 -8161 1148 8735 2543 -7110 -5476 2938 3934 -2309 -6088 -3542 784 160 -4113 -4356 -2464
1111 -2464 -1791 -1850 -1542 -2617 -3698 -2012 673 1539 -829 -4058 -665 6286 4926 -2719 -3842 4439
1127 4439 10345 4896 -5395 -2896 10484 12877 -940 -8407 1798 14590 9439 -7969 -10620
1140 -10620 7298 15987 -488 -16577 -7837 11835 11334 -11056 -21807 -1389 16955 1983 -22457
$$ packed form
1045c4730L6770L2471k2206m0541M646M1141J2610l4624k6740K2362L5532p587
1057A9104l7273q197L2105K1524k2492l0154R372L2413M653k8894j6719K0877
1069c681K4638r355k7934k396K5814J2994j8881j9599R410K3149J293k1698r617
1082a5863J7169J5369q663j7834N60J7040O669j3237j1980P910J3509j971j2780
1095d102m059R309P587o192r653J634Q414R96o243l779K546M326o24m273k43J892
1111b464O73n9L08j075j081J686K685Q66k368l229L393O951j360p645j123Q281
1127D439N906n449j0291K499J3380K393j3817p467J0205J2792n151j7408k651
1140a0620J7918Q689j6475j6089Q740J9672n01k2390j0751K0418J8344j4972k4440
$$ plain form
1153 -22457 -18155 8219 16367 -7737 -27452 -8715 19753 11728 -18699 -22739 6535 25406 4489
1166 4489 -24487 -13007 23084 25808 -7964 -23722 3047 31906 18578 -18773 -19535 19069 34512
1179 34512 1475 -26601 -7791 28155 25689 -14932 -30622 5048 32990 7226 -31166 -23657
1191 -23657 17108 27803 -11468 -40739 -11019 28920 14564 -30148 -35317 6166 31643 161
1203 161 -39706 -21755 26374 27719 -17024 -36502 -546 37867 19023 -28620 -26697 23624 41463
1216 41463 1340 -32726 -8522 37629 34897 -16003 -33222 11808 45140 14470 -30826 -23467
1228 -23467 25344 39493 -7941 -42732 -8663 36965 20676 -30856 -39371 7453 37565 121
1240 121 -47452 -26818 26739 27609 -22742 -46354 -6583 37440 15426 -38656 -35309 20513 39718
$$ packed form
1153b2457M302K6374Q148k4104j9715J8737K8468q025l0427m040K9274J8871k0917
1166D489k8976J1480L6091K724l3772j5758K6769K8859j3328l7351p62L8604J5443
1179C4512l3037k8076J8810L5946k466m0621j5690L5670K7942k5764l8392P509
1191b3657M0765J0695l9271k9271K9720L9939j4356m4712n169M1483K5477l1482
1203A61l9867J7951M8129J345m4743j9478L5956L8413j8844m7643J923N0321J7839
1216D1463m0123l4066K4204M6151k732n0900j7219M5030L3332l0670m5296P359
1228b3467M8811J4149m7434l4791L4069M5628j6289n1532q515M6824L0112l7444
1240A21m7573K0634N3557Q70n0351k3612L9771M4023k2014n4082L347N5822J9205
$$ plain form
1253 39718 -3689 -40841 -13831 38746 34965 -21099 -36462 13907 48192 15846 -31337 -21283
1265 -21283 32169 45663 -5438 -38852 -462 44104 25299 -25905 -33458 14555 43124 2084
1277 2084 -43579 -20656 29834 26787 -22404 -44343 -5183 35504 9590 -42355 -34244 17378
1289 17378 29991 -11711 -43523 -15755 31303 22726 -28186 -35658 11487 37127 6476 -31237
1301 -31237 -18101 29419 36921 -9030 -30553 5825 39301 21297 -18548 -21054 19685 39838
1313 39838 3317 -28879 -6455 29400 23572 -13469 -28498 1882 30158 6601 -30789 -21609
1325 -21609 13637 19163 -10626 -33027 -13048 19737 9802 -26247 -27419 3513 17622 -1821
1337 -1821 -26143 -17133 15319 19120 -11532 -22111 2048 21830 11893 -11336 -13154 14034 26641
$$ packed form
1253C9718m3407l7152K7010N2577l781n6064j5363N0369L4285l2346m7183J0054
1265b1283N3452J3494n1101l3414L8390M4566j8805n1204p553M8013K8569m1040
1277B084m5663K2923N0490l047m9191k1939L9160M0687k5914n1945Q111N1622
1289A7378J2613m1702l1812K7768M7058q577n0912p472M7145K5640l0651l7713
1301c1237J3136M7520P502m5951k1523L6378L3476j8004l9845k506M0739K0153
1313C9838l6521l2196K2424L5855n828l7041j5029L0380K8276k3557l7390R180
1325b1609L5246N526k9789k2401J9979L2785r935l6049j172L0932J4109j9443
1337a821k4322R010L2452L801l0652j0579K4159J9782r937k3229j818K7188J2607
$$ plain form
1350 26641 3368 -13730 1136 20664 18527 -1379 -11769 6068 23477 8610 -11873 -6623
1362 -6623 10215 13627 -709 -15803 -6895 11725 5391 -14059 -14784 -1548 5023 -2025 -16552
1375 -16552 -14536 2722 4314 -10870 -13891 -4782 2711 1998 -7488 -11060 2555 9373 -370 -5025
1389 -5025 818 6801 9169 3650 -2229 5032 12318 6587 1935 4376 5994 8370 6933 1005 2081
1404 2081 6630 3482 576 1825 -1146 -1430 1213 -2267 -4851 -2856 -5421 -5182 -1505 -5889 -10108
1419 -10108 -5037 -2627 -4861 -5913 -8536 -5541 2684 -902 -9823 -4746 4013 3900 -300 -5017 -1462
1434 -1462 10459 9820 -4085 -3540 8920 13138 6377 -3098 -2073 13179 16306 -1354 -8149 5128
1448 5128 14077 7686 -6725 -10578 6061 15196 -3024 -17312 -5645 8968 6061 -11088 -19979
$$ packed form
1350B6641k3273j7098J4866J9528k137j9906j0390J7837J7409j4867k0483N250
1362f623J6838L412j4336j5094Q908J8620o334j9450p25J3236O571p048j4527
1375a6552K016J7258J592j5184l021R109P493p13r486l572J3615O818r743m655
1389e025N843N983K368n519n879P261P286n731m652K441J618K376j437n928J076
1404B081M549l148k906J249k971k84K643l480k584J995k565K39L677m384m219
1419a0108N071K410k234j052k623K995Q225l586q921N077Q759j13m200m717L555
1434a462J1921o39j3905N45J2460M218o761r475J025J5252L127j7660o795J3277
1448E128Q949o391j4411l853J6639R135j8220j4288J1667J4613k907j7149q891
$$ plain form
1461 -19979 -3447 13561 -1148 -22185 -14167 6675 9714 -7716 -21829 -7262 16897 8661
1473 8661 -16748 -15628 8359 18797 3285 -16605 -8086 20299 21132 -7236 -15796 6713 24534
1486 24534 12833 -12498 -13371 15919 26385 -1429 -20107 -2714 20596 16027 -11975 -22718
1498 -22718 4091 24317 1856 -25177 -15376 12076 16751 -9686 -29358 -7869 21245 7950
1510 7950 -23780 -22725 6692 20582 -948 -27190 -13827 21069 19338 -13992 -23230 3609 26137
1523 26137 11938 -19078 -17031 19018 29014 -2163 -22401 -2344 26132 21386 -12784 -22940
1535 -22940 9710 31092 5285 -23706 -12994 18045 23467 -8101 -29633 -4151 26224 10376
1547 10376 -23870 -24073 7744 23619 -1852 -31235 -15041 21163 17290 -17554 -27468 869 25347
$$ packed form
1461a9979J6532J7008j4709k1037Q018K0842L039j7430j4113J4567K4159q236
1473H661k5409J120K3987J0438j5512j9890Q519K8385Q33k8368q560K2509J7821
1486B4534j1701k5331q73K9290J0466k7814j8678J7393K3310m569k8002j0743
1498b2718K6809K0226k2461k7033R801K7452M675k6437j9672K1489K9114j3295
1510G950l1730J055K9417J3890k1530k6242J3363L4896j731l3330r238K6839K2528
1523B6137j4199l1016K047L6049R996l1177k0238K0057K8476m746l4170j0156
1535b2940L2650K1382k5807k8991J0712L1039N422l1568k1532K5482L0375j5848
1547A0376l4246k03L1817J5875k5471k9383J6194L6204l873l4844r914K8337K4478
$$ plain form
1560 25347 8295 -25632 -19939 17999 25908 -6529 -25639 -3760 26191 19187 -16527 -22529 12642
1573 12642 30278 3989 -22702 -10455 21714 24929 -8478 -25792 2442 28313 10472 -20945
1585 -20945 -18637 11753 24441 -2474 -28256 -9587 21332 14203 -17349 -24034 2272 22411
1597 22411 3921 -25423 -16440 15584 18355 -9758 -23798 -3332 20909 11708 -17909 -18262 11243
1610 11243 22214 -328 -19212 -6894 18395 18050 -9428 -18736 4853 22026 6659 -15068
1622 -15068 -11142 11637 19057 -2724 -18827 -2658 17168 9482 -11374 -14847 3555 16236 1995
1635 1995 -17105 -9255 11257 10768 -7063 -15380 -2366 12790 6229 -12519 -11703 6237 11534 -1674
1649 -1674 -12542 -5214 9807 9222 -6438 -11108 2549 11683 3316 -7879 -6302 5964 10530 -1194
$$ packed form
1560B5347j7052l3927N693L7938P909l2437j9110K1879K9951p004l5714o002L5171
1573A2642J7636k6289k6691J2247L2169L215l3407j7314K8234K5871j7841l1417
1585b0945K308L0390J2688k6915k5782J8669L0919p129l1552o685K6306K0139
1597B2411j8490k9344Q983L2024K771k8113j4040K0466K4241r201k9617l53K9505
1610A1243J0971k2542j8884J2318K5289l45k7478r308K3589J7173j5367k1727
1622a5068L926K2779P420k1781j6103J6169J9826p686k0856l473J8402J2681j4241
1635A995j9100P850K0512m89j7831q317J3014J5156o561j8748Q16J7940N297j3208
1649a674j0868P328J5021n85j5660m670J3657R134q367j1195J577J2266M566j1724
$$ plain form
1663 -1194 -9535 -913 9005 5634 -4654 -6807 1757 8742 2202 -7011 -3931 4999 5464 -1843 -6487
1678 -6487 -1688 5868 3286 -5025 -5031 1774 4349 422 -4286 -2908 2860 3356 -2027 -3866 308 2651
1694 2651 1384 -1583 -2452 926 2774 -106 -1919 -543 726 684 101 -1348 -769 824 307 -62 -76
1711 -76 -1042 -1041 948 1098 -1040 -1433 -229 1849 1954 -1394 -3069 1020 3579 871 -2617 -2000 2475
1728 2475 4524 -357 -4406 -685 5621 3524 -3294 -4393 1900 6335 1384 -6442 -3559 5595 5757
1743 5757 -3323 -7616 -790 6947 3421 -7448 -7316 3517 7460 -1502 -9971 -4533 7386 6417 -6174
1758 -6174 -10433 1447 10287 2271 -9658 -7199 7010 10622 -2620 -11476 -988 11897 7622
1771 7622 -7695 -9617 5356 13949 2183 -11566 -4929 11285 11566 -4948 -12303 730 14069
$$ packed form
1663a194q341Q622R918l371j0288k153Q564O985o540r213L080Q930M65p307m644
1678f487M799P556k582q311oO805K575l927m708J378N768M96n383j839M174K343
1694B651j267k967q69L378J848k880j813J376J269m2n83j449N79J593n17l69j4
1711g6r66JJ989J50k138l93J204K078J05l348j675M089K559k708l488O17M475
1728B475K049m881m049L721O306k097o818j099O293M435m951p826K883R154J62
1743E757r080m293O826P737l526j0869J32J0833L943q962q469N438J1919r69j2591
1758f174m259J1880Q840q016j1929K459J4209L612j3242q856J0488J2885m275
1771G622j5317j922J4973Q593j1766j3749O637J6214K81j6514p355J3033J3339
$$ plain form
1784 14069 5880 -11927 -10477 7378 13005 -2604 -15328 -5264 12024 8381 -10669 -14985 2051
1797 2051 13842 1676 -15547 -10405 9158 12613 -5590 -16402 -2032 14867 8168 -11193 -12723
1810 -12723 6435 16972 1558 -14977 -5959 14389 14353 -5800 -14512 2364 18145 7607 -12479
1823 -12479 -10683 10077 16844 -1791 -16354 -4586 15083 10949 -11128 -16209 3200 15557 1809
1836 1809 -17474 -11470 9975 13170 -7570 -19160 -3647 14661 7150 -14694 -15691 5661 16281
1849 16281 -352 -17570 -7662 14407 13907 -7678 -16016 2308 19027 7846 -13055 -10483 11636
1862 11636 18727 -524 -15433 -2493 17738 12698 -9511 -14418 5350 18478 3036 -16104
1874 -16104 -9357 11749 13399 -7002 -18140 -2327 14658 5482 -15104 -14999 5448 13647 -3449
$$ packed form
1784A4069q189j7807J450J7855N627j5609j2724J0064J7288l643j9050m316J7036
1797B051J1791j2166j7223N142J9563L455j8203j0812J4370J6899o699j9361j530
1810a2723J9158J0537j5414j6535R018K0348l6k0153q712J6876J5781j0538k0086
1823a2479J796K0760O767j8635j4563J1768J9669m134k2077n081J9409J2357j3748
1836A809j9283O004K1445L195k0740j1590J5513J8308p511k1844r97K1352J0620
1849A6281j6633j7218R908K2069n00k1585q338J8324J6719j1181k0901K572K2119
1862A1636P091j9251j4909J2940K0231n040k2209m907J9768J3128j5442j9140
1874a6104O747K1106J650k0401j1138J5813J6985r176k0586J05K0447Q199j7096
$$ plain form
1887 -3449 -18431 -7722 11851 9630 -10506 -16137 1884 15208 3962 -14061 -9217 10662 14609
1900 14609 -2622 -13269 -316 15766 10147 -8187 -9759 7301 16520 2992 -11321 -4144 12818
1913 12818 12082 -4861 -11954 1097 13278 4081 -11194 -9361 5858 9699 -3773 -13979 -4935
1926 -4935 8128 4475 -9694 -12441 683 8460 -759 -11936 -7431 5439 6998 -4363 -10235
1939 -10235 -932 9059 4586 -5945 -5922 5035 9939 1746 -6084 -1089 8767 8429 -1106 -4330 2850
1954 2850 9215 4490 -3750 -2958 5147 6807 -488 -5589 -1565 4780 2931 -4324 -6121 -440 2851
1969 2851 -988 -6423 -5270 465 1243 -3815 -6570 -2803 1330 -114 -4159 -4315 -252 2356 118
1984 118 -2736 -1181 2428 2950 427 -190 1654 4054 3182 1302 997 2833 3857 2596 1171 1514
$$ packed form
1887c449j4982J0709J9573k221k0136n631J8021J3324j1246j8023M844J9879L947
1900A4609j7231j0647J2953J6082n619j8334j572J7060R219j3528j4313P177J6962
1913A2818p36j6943p093J3051J2181r197j5275J833J5219L841j3472j0206R044
1926d935J3063l653j4169k747J3124P777r219j1177M505J2870J559j1361n872
1939a0235R303R991m473j0531K3J0957M904q193p830M995R856l38r535l224P180
1954B850O365m725q240P92Q105J660p295n101M024O345j849p255j797N681L291
1969B851l839n435J153N735P78n058k755L767M133j444m045j56M063K608k238
1984A18k854J555L609N22k523o17J844K400q72j880l05J836J024j261j425L43
$$ plain form
2000 1514 2177 2611 1494 801 350 463 441 91 -848 -1479 -1594 -1097 -873 -2373 -3477 -2776 -968 -1460 -3635
2019 -3635 -3963 -1673 -65 -1482 -3946 -2889 366 1704 -1146 -3482 -633 3818 3189 -1329 -1897 2723
2035 2723 5991 2855 -1885 -185 5741 6451 698 -2773 1776 7169 4236 -2463 -3244 3391 6297
2050 6297 236 -6276 -3147 4360 3746 -4787 -7732 -1107 4874 117 -8348 -6995 2175 4640 -3925
2065 -3925 -9611 -3228 5469 3219 -6512 -8061 2196 8218 853 -7620 -3580 7583 8561 -1957
2079 -1957 -7387 1901 11108 5908 -5277 -4899 6848 11414 1050 -7970 -1724 10036 7945 -4770
2093 -4770 -8868 1884 10205 1912 -10192 -7337 5708 7647 -4694 -12207 -3316 8111 3480 -9891
2107 -9891 -10924 2089 8718 -1460 -12118 -6223 7218 7520 -5412 -11026 545 11433 4630
$$ packed form
2000A514O63M34j117o93m51J13k2l50r39o31j15M97K24j500j104P01J808m92k175
2019c635l28K290J608j417k464J057L255J338k850k336K849M451o29m518n68M620
2035B723L268l136m740J700N926P10n753l471M549N393k933o699p81O635K906
2050F297o061o512L129P507o14q533k945O625N981m757q465J353R170K465q565
2065c925n686O383Q697k250r731j549J0257O022p365q473M040J1163R78j0518
2079a957n430R288R207n200j1185L78J1747M566j0364r020O246J1760k091j2715
2093d770m098J0752Q321q293j2104K855J3045J939j2341p513Q891J1427m631j3371
2107i891j033J3013O629j0178j0658N895J3441L02j2932n614J1571J0888o803
$$ plain form
2120 4630 -8583 -6818 7502 12068 -33 -9656 -1382 11898 9437 -4755 -8539 4163 13084
2133 13084 3898 -9538 -5869 8753 10667 -3283 -11404 -1519 10679 5436 -9345 -10622 3451
2146 3451 10051 -1400 -12978 -6631 7597 7268 -7432 -12764 -536 10211 2347 -10831 -8782
2159 -8782 6028 10587 -1869 -11786 -2190 11053 8008 -6290 -9063 4464 12994 3177 -9274
2172 -9274 -4705 9831 11164 -2507 -9904 619 11938 6016 -8216 -8497 5526 10820 -629
2185 -629 -11128 -4461 8310 6980 -7108 -11223 833 9213 1282 -10557 -7658 4914 7635 -3898
2199 -3898 -11465 -2105 8583 4528 -7431 -8352 3543 9676 659 -8617 -3420 7989 7682 -3244
2213 -3244 -7411 1483 9685 4094 -6016 -4620 5782 8855 -513 -7042 -1349 7847 5342 -4666
$$ packed form
2120D630j3213J765J4320M566j2101r623Q274J3280k461j4192l784J2702Q921
2133A3084r186j3436L669J4622J914j3950q121R885J2198n243j4781j277J4073
2146C451O600j1451j1578O347J4228l29j4700n332J2228J0747p864j3178K049
2159h782J4810M559j2456r917R596J3243l045j4298k773J3527Q530r817j2451
2172i274M569J4536J333j3671p397J0523J1319n922j4232k81J4023N294j1449
2185f29j0499O667J2771j330j4088m115J2056Q380p931j1839K899J2572K721j1533
2199c898p567R360J0688m055j1959r21J1895O133r017r276N197J1409l07j0926
2213c244m167Q894Q202n591j0110J396J0402L073r368o529N693R196k505j0008
$$ plain form
2227 -4666 -6381 2107 7146 407 -7301 -4132 4112 4752 -3435 -7309 -1150 4954 1623 -5653 -5363
2242 -5363 1773 4910 -1325 -6015 -2338 4055 3292 -2888 -4433 1121 5326 1613 -3437 -2276 3234
2257 3234 4513 -360 -3483 -75 4187 3147 -1715 -2547 1747 3779 1163 -2433 -1682 2280 2470 -1075
2273 -1075 -2761 -437 2075 650 -2145 -2083 172 1395 -274 -2220 -1338 606 488 -836 -1541 -475
2289 -475 837 256 -810 -959 253 524 226 -404 66 502 593 442 264 -13 505 904 926 238 -206 -126
2309 -126 830 1186 121 -1064 -51 1219 667 -699 -1103 487 1328 193 -1826 -1176 910 1485 -789
2326 -789 -2412 -505 2098 1092 -1925 -2226 848 2430 -64 -2819 -1507 2294 2531 -1381 -3402 -98
2342 -98 3496 1567 -2783 -2691 1910 4073 -228 -4213 -1503 3700 3145 -2374 -4603 833 4740 1344
$$ packed form
2227d666j715Q488N039o739p708L169Q244O40q187l874O159O104l331p276K90
2242e363P136L137o235m690L677O393p63o180j545N554M205l713n050J161N510
2257C234J279m873l123L408M262j040m862q32M294K032k616l596P51L962J90l545
2273a075j686K324K512j425k795O2K255J223j669j946Q82J944j18j324p05J066
2289d75J312n81j066j49J212K71k98o30M70M36R1j51j78k77N18L99K2o88m44Q0
2309a26R56L56j065j185J013J270n52j366m04J590Q41j135k019O50K086N75k274
2326g89j623J907K603j006l017l01L074J582k494k755J312L801K37l912k021L304
2342i8L594j929m350R2M601K163m301l985K710N203n55n519k229N436L907l396
$$ plain form
2358 1344 -4277 -3075 3203 4710 -1060 -5204 -870 5123 3109 -3786 -4745 2033 5925 432 -5564
2373 -5564 -2622 4930 4785 -2655 -5764 408 6317 2387 -5265 -4611 3323 6052 -1002 -6544 -1857
2388 -1857 5782 4171 -4502 -6612 1416 6790 1060 -6803 -4319 4833 5859 -2441 -7555 -1029 6862
2403 6862 3528 -5516 -6090 3102 7637 290 -7282 -2789 6264 6162 -3545 -6949 945 7944 3094
2418 3094 -5943 -5017 4745 7504 -1154 -7602 -1798 7192 4851 -4862 -6966 1914 7605 953 -7771
2433 -7771 -4629 5149 6167 -3325 -8420 -949 6994 3173 -6519 -6725 3035 7379 -394 -8141 -3588
2448 -3588 6505 6078 -4063 -7133 1233 8530 2847 -6488 -4853 5527 8266 -1102 -7245 -1056
2462 -1056 7761 5478 -4560 -6255 2770 8266 1227 -7220 -3851 5742 6407 -3342 -8260 -545 6978
$$ packed form
2358A344n621J202O278J507n770m144M334N993k014o895r59O778L892n493n996
2373e564K942P552j45p440l109O172N909l930p652O54P934K729p054n542M687
2388a857P639j611q673k110Q028N374n730p863K484R152J026q300n114O526P891
2403F862l334r044n74R192M535p347p572M493R053j02r707l404P894O999m850
2418C094r037R26R762K759q658o448N804Q990k341r713k104Q880N691o652q724
2433g771L142R778J018r492n095P471P943l821r692k06R760M344p773p747M553
2448c588J0093m27j0141l070Q366P297n683r335J635J0380K739r368o143O189
2462a056Q817k283j0038j695R025N496p039q447L369R593O65r749m918P715P523
$$ plain form
2477 6978 2597 -6984 -6357 2898 6447 -1604 -8474 -3316 5866 4249 -5036 -7307 710 6973 1531
2492 1531 -6974 -4480 4959 6558 -1594 -6642 -399 7214 4581 -4363 -4907 3490 7633 1084 -5402
2507 -5402 -2082 5964 5605 -2429 -5499 902 6307 1863 -5129 -4088 3090 4896 -1550 -6493 -1948
2522 -1948 4306 2366 -4578 -5853 760 4229 -261 -6045 -3433 2910 3260 -2348 -4886 -572 4347
2537 4347 2246 -3552 -3074 2714 4622 346 -2909 -580 4254 3788 -1280 -2368 1839 4598 1754
2552 1754 -1995 -1000 2671 3514 -308 -2842 21 2829 1250 -1881 -2374 279 1484 -542 -3176 -2011
2568 -2011 617 208 -1950 -2833 -1440 418 81 -2433 -1654 136 632 -277 -1318 -678 932 1377 -208
2585 -208 -517 601 1604 1242 809 305 1085 1800 1287 697 888 1120 1101 1229 393 168 511 553 281 144
$$ packed form
2477F978m381r581O27R255L549q051o870N158R182j617r285k271Q017O263n442
2492A531q505K494R439J599q152n048O243P613k633q944n44Q397M143o549o486
2507e402L320Q046l59q034l070O401N405m444o992J041P178J806o446m943M545
2522a948O254j940o944j275O613L469m490n784K612O343L50n608k538M314M919
2537D347k101n798M78N788J908m276l255K329M834m66n068j088M207K759k844
2552A754l749R95L671Q43l822k534K863K808j579l131m93K653J205k026k634J165
2568b011K628m09k158q83J393J858l37k514P79J790M96r09j041O40J610M45j585
2585b08l09J118J003l62m33n04P80P15n13n90J91K32j9J28q36k25L43M2k72j37
$$ plain form
2605 144 -584 -740 225 -320 -1450 -1513 -911 -522 -402 -1954 -2242 -633 11 -1035 -1865 -1565 77 745 -925
2624 -925 -2222 -265 1856 867 -922 -812 1243 2908 1394 -1212 211 3204 3048 -24 -1057 919
2640 919 3560 2327 -1583 -1422 2365 3232 -9 -2350 -1058 2589 2026 -2390 -3949 -81 2490 -289
2656 -289 -3826 -3346 1045 2354 -2273 -5239 -1335 2959 826 -3649 -3884 670 4002 176 -4492 -1674
2672 -1674 4025 3659 -1405 -3549 832 5758 3217 -3216 -2495 4335 5691 297 -3581 -448 5301
2687 5301 4435 -3050 -4256 1842 5161 801 -4902 -3382 3067 4074 -2843 -6619 -970 4490 1157
2702 1157 -5024 -5420 991 4706 -1302 -7001 -2795 4032 3310 -3173 -5642 156 6133 1702 -5064
2717 -5064 -3430 4104 5629 -128 -4781 -591 6415 4800 -3169 -3969 3331 6573 1468 -4510 -2472
$$ packed form
2605A44p28j56R65n45j130o3O02L89J20j552k88J609O44j046q30L00J642O68j670
2624i25j297J957K121r89j789J10K055J665j514k606J423K993j56l072j033J976
2640I19K641j233l910J61L787Q67l241k341J292L647n63m416j559L868K571k779
2656b89l537M80M391J309m627k966L904M294k133m475k35M554L332l826m668K818
2672a674N699l66n064k144M381M926k541o433P21O830J356n394l878L133N749
2687E301q66p485j206O098L319m360n703J520O449J007o917l776N649N460l333
2702A157o181l96O411L715o008n699M206O827p22o483k469N798N977m431o766
2717e064J634P534J525n757m653M190P006j615p969q00P300L242n105n978K038
$$ plain form
2732 -2472 5081 5843 -2223 -5405 554 5643 2078 -4523 -5060 1779 5307 -1571 -6860 -2543 3955
2747 3955 2757 -4063 -6537 -403 5460 628 -6398 -4181 3176 4652 -1434 -5771 -1194 5991 3860
2762 3860 -3872 -4089 2996 6528 1619 -4649 -2337 5790 6119 -1834 -4628 1534 6034 2944 -3774
2777 -3774 -3814 3249 6171 -1108 -5643 -1320 4285 2939 -3145 -5799 245 4945 86 -5928 -3650
2792 -3650 2523 3463 -2333 -6244 -1500 4713 1653 -4639 -4173 1726 4411 626 -4843 -1787 4706
2807 4706 4274 -2060 -3776 1159 4819 2486 -2956 -2321 3555 4957 -695 -3325 111 3951 2924
2822 2924 -2135 -3819 1539 3943 -46 -3790 -1694 1898 2227 -1860 -4265 -651 2925 159 -3578
2837 -3578 -2533 506 1923 -750 -3782 -1548 2533 1328 -1981 -1983 569 2446 1092 -2054 -1203 2311
$$ packed form
2732b472P553P62q066l182N959N089l565o601n37O839L528o878n289M317O498
2747C955j198o820k474O134N863m832p026K217P357J476o086m337M577P185k131
2762C860p732k17P085L532m909o268K312Q127L29p953k794O162M500l090o718
2777c774m0P063K922p279m535M323N605j346o084k654O044M700m859o014K278
2792c650O173R40n796l911M744O213l060o292M66N899K685l785n469L056O493
2807D706m32o334j716M935L660k333n442O35N876J402n652k630L436L840j027
2822B924n059j684N358K404l989l744K096L592L29m087k405L614L576k766l737
2837c578J045L039J417k673l032K234M081j205l309kK552J877j354l146Q51L514
$$ plain form
2853 2311 2628 -583 -1354 528 2342 1921 -569 -1228 1423 2491 259 -968 -162 1168 1257 -234 -1450
2870 -1450 -86 1314 158 -1189 -913 -247 228 -346 -1718 -784 330 -265 -842 -837 -844 -40 143 -915 -484
2889 -484 91 122 -147 183 -292 315 755 327 -21 507 25 421 1026 575 69 463 955 539 207 -144
2909 -144 -226 1257 368 -754 -424 269 495 -29 -862 -1063 666 882 -1191 -1666 -93 709 393 -1087
2927 -1087 -1705 354 1541 -499 -1930 -570 1058 1180 -494 -1984 -134 2419 1037 -1444 -830 1164
2943 1164 2096 404 -1932 -703 2432 1963 -1278 -1666 833 2754 1122 -2339 -1732 1985 2511 -998
2959 -998 -2610 -508 2484 1469 -2217 -3112 1033 3208 -172 -3133 -1395 1949 2687 -1426 -3774 185
2975 185 3703 1080 -2994 -2363 1710 3461 -520 -3693 -1078 3543 2432 -2290 -3209 640 3708 1053
$$ packed form
2853B311L17l211p71J882J814m21k490o59K651J068k232j227Q06J330Q9j491j216
2870a450J364J400j156j347K76O66M75n74j372R34J114n95n77NpQ04J83j058M31
2889d84N75L1k69L30m75O07M40m28l48N28m82L96O05m51n06L94M92m16l32l51
2909a44q2J483q89j122L30O93K26n24q33k01J729K16k073m75J573Q02l16j480
2927a087o18K059J187k040j431J360J628J22j674j490J850K553j382k481O14J994
2943A164R32j692k336J229L135m69l241l88K499J921j632l461O07L717N26l509
2959i98j612K102K992j015l686q95M145K175l380k961J738L344P38m113k348L959
2975A85L518k623m074O31M073J751l981l173K615M621j111m722r19L849L068k655
$$ plain form
2991 1053 -3823 -2510 3116 3540 -1511 -3978 -560 3691 2337 -3384 -3489 1854 3937 -91 -4037
3006 -4037 -1794 3432 3379 -2155 -4145 772 4422 1150 -3609 -2860 2304 4006 -496 -4549 -957 4091
3022 4091 2627 -2907 -3744 949 4462 610 -4274 -2285 3520 3653 -1967 -4143 -427 4215 1779
3037 1779 -3690 -3556 2112 4514 -492 -4235 -1811 3580 3193 -2490 -4505 673 4588 1273 -3793
3052 -3793 -2925 2751 4223 -782 -4473 -624 4521 2447 -2724 -3718 1557 4627 751 -4270 -1769
3067 -1769 3390 3101 -1848 -4213 -324 4264 1801 -3600 -3462 2105 3639 -744 -4411 -1753 3656
3082 3656 2582 -2911 -4236 668 3903 835 -3680 -2440 2566 3749 -1169 -3708 -257 4058 2159
3097 2159 -2575 -2745 1910 4055 403 -3354 -1270 3511 3088 -1410 -3279 573 3712 1454 -2911
$$ packed form
2991A053m876J313N626M24n051k467L418M251j354n721j05N343K083m028l946
3006d037K243N226n3n534j990M917L650l272m759P49N164J702m502m053L592N048
3022D091j464n534q37M693L513l852m884J989N805J33n620k176L716M642k436
3037A779n469J34N668K402n006l743K424N391l87n683k015N178L915l315n066
3052c793Q68N676J472n005l691L849N145k074n171r94N275L070l876n021K501
3067a769N159k89m949k365L889M588k463n401J38N567J534m383l667K658N409
3082C656j074n493j325M904L235l068m515J240N006J183m918k539L451M315j899
3097B159m734j70M655K145l652l757K084M781m23m498j869L852L139k258m365
$$ plain form
3112 -2911 -2164 2049 2735 -702 -3285 -1015 2660 1796 -2423 -3026 601 2806 24 -3070 -1748 1776
3128 1776 1913 -1614 -2936 -90 2425 854 -2239 -1662 1444 2283 -52 -2408 -487 2285 1588 -737
3144 -737 -1415 826 2450 936 -1320 -733 1699 1708 -111 -1322 21 1588 820 -1051 -1272 354 1027
3161 1027 -279 -1701 -1079 483 260 -1191 -1621 -451 183 -318 -1308 -1075 14 495 -502 -1037 -274 287
3179 287 239 -71 -482 242 540 610 221 212 710 684 576 478 64 282 614 557 439 372 209 495 272 467 -63
3202 -63 -172 281 137 -422 -766 -520 -68 -166 -941 -1135 -529 269 -384 -1266 -990 295 130 -448 -1215 -356
3222 -356 843 368 -697 -838 668 1456 325 -851 -109 1671 1809 72 -575 596 1968 922 -635
3239 -635 -588 1240 1926 440 -1460 -323 1631 1266 -1180 -1847 110 1477 -38 -2334 -1849 799 1217
$$ packed form
3112b911P47M213O86l437k583K270L675q64m219o03L627K205k782l094J322L524
3128A776J37l527j322K846K515j571l093N77L106Q39k335k356J921K772o97k325
3144g37o78K241J624j514k256N87K432Rj819j211J343J567p68j871k21J626O73
3161A027j306j422O22J562k23j451m30J170O34n01r90K33J089M81r97n35P63N61
3179B87m8l10m11P24K98P0l89rM98k6j08r8m14K18L32n7j18o7j63K86k23J95n30
3202f3j09M53j44n59l44K46M52r8p75j94O06P98o53q82K76J285j65n78p67Q59
3222c56J199m75j065j41J506P88j131j176P42J780J38j737o47J171J372j046j557
3239f35M7J828O86j486j900J137J954l65k446o67J957J367j515k296M85K648M18
$$ plain form
3256 1217 -1051 -2627 -1076 1548 710 -2011 -2470 508 2020 -130 -2393 -1330 1779 1919 -770 -2393
3272 -2393 60 3262 1713 -1632 -1286 1929 3452 310 -1981 -281 2902 2422 -1074 -2167 1037
3287 1037 3303 735 -2522 -1724 1852 2585 -1081 -3400 -743 2582 1088 -2628 -3298 733 2354 -582
3303 -582 -3616 -2124 1981 1996 -1768 -3471 -66 3041 1034 -2808 -2368 1851 3225 -175 -3372 -373
3319 -373 3333 2751 -1481 -2470 1620 3849 1142 -2615 -1073 2612 3210 -749 -3032 107 3398 1589
3335 1589 -2577 -2780 1164 2857 -408 -3624 -1698 2238 1873 -2175 -3521 -251 2682 414 -3444
3350 -3444 -2650 1506 2660 -999 -3599 -923 2971 1917 -2168 -2718 1347 3415 1003 -2485 -1304
3365 -1304 2833 3073 -543 -2414 505 3583 1975 -1852 -1929 2152 3178 -301 -3031 -1320 2397 2234
$$ packed form
3256A217k268j576J551K624q38k721m59K978J512k150k263J063L109J40k689j623
3272b393K453L202j549l345L46L215J523l142k291J700L183m80l496j093L204
3287A037K266k568l257P98L576P33l666k319K657L325j494l716o70M031J621k936
3303e82l034J492M105J5l764j703L405L107k007l842M40M219J374l400l197K999
3319c73L706n82m232r89M090K229k707l757J542L685N98l959k283L139L291j809
3335A589m166k03L944J693l265l216J926L936l65m048j346L270K933k268l858
3350c444P94M156J154l659k600K676L894j054m085n50M065K068k412l488J181
3365a304M137K40l616j871K919L078j608l827p7M081J026l479k730J711L717j63
$$ plain form
3381 2234 -1789 -3152 130 2618 235 -3129 -2459 1237 1974 -1260 -3106 -1262 2153 712 -2367
3396 -2367 -2645 621 2663 67 -2800 -938 2082 2229 -871 -2244 594 2931 1526 -1576 -1162 1916
3412 1916 2661 43 -1524 -206 2353 1960 -1080 -1503 903 2470 235 -1892 -1289 1221 1363 -924
3428 -924 -2353 -496 1283 195 -2124 -1896 198 1140 -558 -2032 -1101 877 756 -1023 -1616 75
3444 75 1256 370 -943 -700 1176 1412 36 -815 331 1607 989 -137 -358 992 1388 388 -411
3461 -411 -169 1062 714 -161 -457 40 508 32 -607 -695 -49 247 -565 -657 -496 -176 90 -455 -956 -474
3481 -474 -408 -269 -307 -215 -85 -77 -34 108 -168 -58 -104 96 150 45 329 494 506 302 156 345 800 463 132
3504 132 -75 277 615 520 -282 -87 500 739 72 -463 -472 270 245 -370 -816 -353 639 -95 -746 -790 124 653
$$ packed form
3381B234m023j363L282K488k383l364O70L696P37l234j846J844L415j441l079
3396b367k78L266K042k596k867J862L020J47l100j373K838K337j405l102M14L078
3412A916P45k618j567J318K559l93l040m23K406J567k235k127O03K510J42k287
3428i24j429J857J779j088k319K28K094R42j698j474R31J978j21j779n93J691
3444G5J181q86j313K43J876K36j376q51J146J276o18j126k21J350L96j000p99
3461d11K42J231l48q75k96M97M68m76o39q8O46K96q12r2J61L20K66n45n01M82
3481d74O6J39l8R2J30QM3J42k76J10m6K00N4j05K84J65J2k04j46J89M55l37l31
3504A32k07L52L38r5q02J95N87K39o67n35rP42k5o15m46M63R92p34o51m4R14N29
$$ plain form
3526 653 -263 -1248 -707 544 697 -211 -1046 128 1047 455 -688 -638 779 1083 216 -1008 -7 1557
3544 1557 1229 -317 -1185 472 1791 383 -862 -892 1058 1206 -445 -1397 -485 1523 774 -1424 -1331
3561 -1331 488 1330 -88 -1762 -990 1001 1044 -1034 -1980 -290 1687 738 -1733 -1701 1126 1841 -30
3578 -30 -1913 -619 1503 1177 -1214 -1831 491 2262 553 -1722 -1317 1510 1846 -485 -2180 -248
3594 -248 2084 1314 -1252 -1554 1057 2314 255 -2312 -892 1722 1655 -998 -2394 149 1859 779
3610 779 -1936 -1742 1148 2109 -571 -2401 -737 2102 1711 -1696 -2130 691 2466 421 -1952 -1221
3626 -1221 1686 2012 -713 -2380 -158 2345 1193 -1835 -1876 1251 2423 -118 -2345 -674 1990 1949
3642 1949 -1170 -2098 237 2465 648 -2264 -1575 1177 2014 -490 -2540 -344 2015 1403 -1857 -2020
$$ packed form
3526F53r16r85N41J251J53r08q35J174R19n92j143N0J417L04q67j224J001J564
3544A557l28j546q68J657J319j408j245l0J950J48j651r52R12K008p49k198R3
3561a331J819Q42j418j674P72J991M3k078r46J690J977r49k471L2K827P15j871
3578c0j883J294K122l26k391o17K322J771j709k275M05K827L36k331j695J932
3594b48K332p70k566l02K611J257k059k567J420K614o7k653j396K543J710j080
3610G79k715J94K890R61k680j830J664K839l91l407m34K821J775k045k373P31
3626a221K907L26k725j667K222K503j152l028m1L127J172k541k227J671K664m1
3642A949l119r28K335K228j817k912O89K752Q37k504k050K196K359o12l260j63
$$ plain form
3658 -2020 731 2239 144 -2199 -1152 1614 1977 -807 -2012 -16 2141 926 -1879 -1661 1106
3673 1106 2134 -114 -2142 -658 1971 1482 -1364 -1992 116 2038 650 -1640 -1473 1487 1773 -580
3689 -580 -2125 -377 1793 975 -1547 -1718 797 2148 288 -1677 -775 1416 1638 -961 -1872 228
3705 228 1749 657 -1682 -1170 1029 1440 -245 -1563 -450 1490 1043 -1021 -1346 340 1503 98
3721 98 -1821 -991 782 914 -909 -1554 -235 1580 520 -960 -897 625 1162 86 -1103 -444 1228
3738 1228 815 -643 -904 149 1344 575 -592 -398 749 707 -185 -807 -75 1011 703 -565 -668 312
3756 312 703 29 -725 -366 561 137 -662 -662 -74 365 -114 -656 -638 -107 368 -307 -476 -161 218 303 -59
3777 -59 -57 42 187 70 -200 376 354 194 400 245 122 27 277 302 2 257 14 -92 371 117 -147 -331
$$ packed form
3658b020K751J508k095k343J047K766L63k784j205J996K157j215k805K18K767
3673A106J028k248k028J484K629m89k846o28K108J922j388k290J67K960K86k353
3689e80j545J748K170q18k522j71K515J351j860j965R02K191K22k599r11K100
3705B28J521j092k339N12K199M11j685j318J113J940m47k064l25J686J163j405
3721I8j919Q30J773J32j823o45J319J815j060j480O3J522N37j076j189O59J672
3738A228m13j458k61J053J195p69j167J94J147m2q92o22P32J086l08j268j03R80
3756C12L91o74p54L59R27m24p99%N88M39m79n42J8N31M75o75j69L15L79Q5l62
3777e9KR9J45j17k70N76k2j60K06j55j23r5K50K5l00K55k43j06M63k54k64j84
$$ plain form
3799 -331 277 264 112 -443 -43 88 98 -541 -178 -137 22 -176 -642 -434 112 372 -415 -525 -103 283 257
3820 257 -822 -446 134 728 207 -526 137 653 762 -79 -508 79 1088 385 -482 -261 774 912 -16
3839 -16 -548 -120 941 790 -556 -1029 179 864 138 -1089 -722 812 649 -488 -1377 -513 616 382
3857 382 -970 -1204 62 743 -103 -1383 -872 1050 1116 -231 -1173 245 1436 737 -1076 -874 1022
3874 1022 1644 231 -1045 -50 1468 1205 -786 -952 380 2019 264 -1413 -814 1150 1334 -591
3890 -591 -1578 -281 1231 612 -1730 -1801 480 1416 -419 -1942 -1024 866 852 -1109 -1750 119 1824
3907 1824 354 -1374 -1011 968 1496 -256 -1549 -123 1884 1159 -798 -1001 669 2141 367 -1271
3923 -1271 -553 1512 1758 -434 -1259 -130 1578 733 -1317 -1167 789 1543 -253 -1751 -822 956 643
$$ packed form
3799c31O08j3j52n55M00J31J0o39L63M1J59j98m66K08N46K60p87j10M22L86k6
3820B57j079L76N80N94n21p33O63N16J09q41m29N87J009p03q67K21J035J38r28
3839a6n32M28J061j51j346m73J208O85p26j227L67J534j63j137q89Q64J129k34
3857C82j352k34J266O81q46j280N11J922O6j347r42J418J191o99j813K02J896
3874A022O22j413j276R95J518k63j991j66J332J639j755j677N99J964J84j925
3890e91r87J297J512o19k342p1K281R36j835j523R18J890j4j961o41J869J705
3907A824j470j728L63J979N28j752j293J426K007p25j957k03J670J472j774j638
3923a271P18K065K46k192q25J129J708q45k050J50J956P54j796j498R29J778l13
$$ plain form
3940 643 -1322 -1915 51 1070 -27 -1536 -1466 732 1210 -441 -1750 -382 1445 822 -1318 -1135 719
3957 719 1947 396 -1556 -309 1409 1382 -175 -1111 520 1694 846 -947 -898 1195 1365 -167 -1350
3974 -1350 -384 1373 971 -1029 -1397 173 1266 82 -1586 -838 677 894 -976 -1473 -350 1083
3990 1083 308 -1168 -1137 219 1114 -262 -1445 -431 903 917 -488 -991 358 1493 540 -812 -525
4007 -525 1005 1186 -46 -787 -85 1210 1029 -663 -656 684 957 177 -729 -445 927 776 -579 -1157
4025 -1157 -63 751 4 -1030 -1111 231 560 -426 -1186 -293 425 421 -516 -904 -47 618 253 -611 -318 583
4045 583 618 105 -265 -46 942 514 -391 -223 531 662 482 -136 2 573 624 -349 -140 307 374 6 -112
4066 -112 -426 -67 283 -330 -101 -372 -135 -231 12 -484 -261 -21 -180 -465 -111 -19 -54 8 -24 -27 82 -69
$$ packed form
3940F43j965n93J966J019j097j509P0K198M78j651j309J368J827o23k140J83J854
3957G19J228j551j952J247J718k7j557r36J631J174q48j793M9K093J70j532j183
3974a350R66J757m02k000l68J570J093j184j668P48J515K17j870m97J123J433
3990A083p75j476L1J356Q95j376j183J014J334J4j405n03J349J135r53j352K87
4007e25J530J81j232p41P02J295j81j692PJ340K73p80r06K84J372j51j355n78
4025a157J094Q14p47j034q1J342L29r86p60Q93P18mr37l88Q57O65l65q64K93R01
4045E83L5n13l70K19R88m28r05J68P54J31j80o18J38N71N1r73K09M47O7l68j18
4066a12l14L59L50o13K29k71K37r6K43m96K23K40j59k85L54R2l5O2l2lJ09j51
$$ plain form
4088 -69 56 431 -31 236 317 203 72 149 114 209 436 286 6 333 391 -7 -357 -237 357 253 -36 -293
4110 -293 -209 218 103 -340 -446 -473 207 -98 -621 -545 229 224 -329 -542 -482 18 234 -481 -709 23 550 218
4132 218 -214 -409 265 564 -2 -550 88 883 658 -220 -329 292 905 160 -781 -314 613 479 -117 -634
4152 -634 172 922 172 -1012 -404 514 432 -170 -940 -568 509 561 -874 -945 216 759 79 -839 -1021 600
4172 600 910 -454 -1087 -227 959 855 -749 -717 529 1185 214 -962 -337 878 1010 -167 -1015 -49
4190 -49 1514 392 -806 -580 833 1083 -43 -1328 -612 933 835 -817 -1242 109 1217 206 -1143
4207 -1143 -987 788 1134 -495 -1419 -105 843 372 -865 -1192 547 1100 -365 -1351 -482 1167 862
4224 862 -465 -1307 309 1470 651 -992 -763 552 882 -96 -1355 -373 992 800 -949 -773 337
$$ packed form
4088f9J25L75m62K67Q1j14j31P7l5R5K27j50k80L27N8l98l50J20N94j04k89k57
4110b93Q4M27j15m43j06k7O80l05n23P6P74nn53k13O0N00K16p15k28P32N27l32
4132B18m32j95O74K99n66n48O38P95k25q78j09O21O13p45r41M67R27j34n96n17
4152f34Q06P50p50j184O08R18q2o02p70L72J077N2j435p1J161N43o80r18j82J621
4172F00L10j364o33Q60J186j04j604L2J246O56r71j176O25J215J32j177q48R66
4190d9J563j122j198K26J413K50j126j285P16J545r8j652m25J351J108j011j349
4207a143J56J775L46j629r24J314R48m71j237l27J739N53j465r86Q69J649l05
4224H62j327q42J616J161q19j643K29J315L30r78j259R82J365j92j749J76J110
$$ [...]
8191a90
##END NTUPLES=NMR FID
##END=
