##TITLE=1H_LY-D.M.A.A.PER.2
 CDCl3,8 sc, 
 3.9.2021
##JCAMPDX= 6.0         $$ Bruker NMR JCAMP-DX V2.0
##DATA TYPE= NMR FID
##DATA CLASS= NTUPLES
##ORIGIN= UXNMR, Bruker Analytische Messtechnik GmbH
##OWNER= root
$$ XWIN-NMR		Version 3.5
$$ Fri Sep  3 10:09:02 2021 Russian Standard Time (UT+4h)  she@DPX200
##.OBSERVE FREQUENCY= 200.1313
##.OBSERVE NUCLEUS= ^1H
##.DELAY= (6, 6)
##.ACQUISITION MODE= SIMULTANEOUS
##.ACQUISITION SCHEME= undefined
##.AVERAGES= 8
##.DIGITISER RES= 18
##SPECTROMETER/DATA SYSTEM= spect
##.PULSE SEQUENCE= zg30
##.SOLVENT NAME= CDCl3
##.SHIFT REFERENCE= (INTERNAL, CDCl3, 0, 15.7039)
##AUDIT TRAIL= $$ (NUMBER, WHEN, WHO, WHERE, WHAT)
$$ ##TITLE= Audit trail, XWIN-NMR		Version 3.5
$$ ##JCAMPDX= 5.01
$$ ##ORIGIN= Bruker BioSpin GmbH
$$ ##OWNER= she
$$ F:/spectra/data/she/nmr/H-F/1/audita.txt
$$ ##AUDIT TRAIL=  $$ (NUMBER, WHEN, WHO, WHERE, WHAT)
(   1,<2021-09-03 10:08:01.65 +0400>,<she>,<DPX200>,
      <created by zg, POWCHK disabled, PULCHK disabled
       configuration hash MD5:
       00 E9 B6 7A A2 85 ED C7 34 08 36 98 17 FE 4E 26
       data hash MD5: 16K
       DC 31 15 05 6D 8B A0 7C BD 0D 66 DF 6E 3C 9C E2>)
$$ ##END=
$$ 
$$ hash MD5
$$ 98 24 EC 4A 8A 4D 39 2C 9D 5C 89 AD 56 9C DF 10
##$RELAX= 
##$RELAX= 
##$RELAX= 
##$RELAX= 
##$RELAX= 
##$RELAX= 
$$ Bruker specific parameters
$$ --------------------------
##$DU= <F:/spectra>
##$EXPNO= 1
##$NAME= <H-F>
##$PROCNO= 1
##$TYPE= <nmr>
##$USER= <she>
##$AMP= (0..31)
100 100 100 100 100 100 100 100 100 100 100 100 100 100 100 100 100 100 
100 100 100 100 100 100 100 100 100 100 100 100 100 100 
##$AQSEQ= 0
##$AQ_mod= 1
##$AUNM= <au_zg>
##$AUTOPOS= <>
##$BF1= 200.13
##$BF2= 200.13
##$BF3= 200.13
##$BF4= 200.13
##$BF5= 200.13
##$BF6= 200.13
##$BF7= 200.13
##$BF8= 200.13
##$BYTORDA= 1
##$CFDGTYP= 0
##$CFRGTYP= 5
##$CHEMSTR= <none>
##$CNST= (0..31)
1 1 145 1 1 1 1 1 1 1 1 1 1 1 1 1 1 1 1 1 1 1 1 1 1 1 1 1 1 1 1 1 
##$CPDPRG= <>
##$CPDPRG1= <>
##$CPDPRG2= <>
##$CPDPRG3= <>
##$CPDPRG4= <mlev>
##$CPDPRG5= <mlev>
##$CPDPRG6= <mlev>
##$CPDPRG7= <mlev>
##$CPDPRG8= <mlev>
##$CPDPRGB= <>
##$CPDPRGT= <>
##$D= (0..31)
0 1.2 0 0 0 0 0 0 0 0.06 0 0.03 0 0 0 0 0.0002 0 0 0 0 0 0 0 0 0 0 0 0 
0 0 0 
##$DATE= 1630649281
##$DBL= (0..7)
120 120 120 120 120 120 120 120 
##$DBP= (0..7)
150 150 150 150 150 150 150 150 
##$DBP07= 0
##$DBPNAM0= <>
##$DBPNAM1= <>
##$DBPNAM2= <>
##$DBPNAM3= <>
##$DBPNAM4= <>
##$DBPNAM5= <>
##$DBPNAM6= <>
##$DBPNAM7= <>
##$DBPOAL= (0..7)
0.5 0.5 0.5 0.5 0.5 0.5 0.5 0.5 
##$DBPOFFS= (0..7)
0 0 0 0 0 0 0 0 
##$DE= 6
##$DECBNUC= <off>
##$DECIM= 32
##$DECNUC= <off>
##$DECSTAT= 4
##$DIGMOD= 1
##$DIGTYP= 9
##$DL= (0..7)
0 120 120 120 120 120 120 120 
##$DP= (0..7)
150 150 150 150 150 150 150 150 
##$DP07= 0
##$DPNAME0= <>
##$DPNAME1= <>
##$DPNAME2= <>
##$DPNAME3= <>
##$DPNAME4= <>
##$DPNAME5= <>
##$DPNAME6= <>
##$DPNAME7= <>
##$DPOAL= (0..7)
0.5 0.5 0.5 0.5 0.5 0.5 0.5 0.5 
##$DPOFFS= (0..7)
0 0 0 0 0 0 0 0 
##$DQDMODE= 0
##$DR= 18
##$DS= 0
##$DSLIST= <SSSSSSSSSSSSSSS>
$$ [...]
##$SUBNAM2= <"">
##$SUBNAM3= <"">
##$SUBNAM4= <"">
##$SUBNAM5= <"">
##$SUBNAM6= <"">
##$SUBNAM7= <"">
##$SUBNAM8= <"">
##$SUBNAM9= <"">
##$SW= 20.0189088683792
##$SWIBOX= (0..15)
0 0 2 0 0 0 0 0 0 0 0 0 0 0 0 0 
##$SW_h= 4006.41025641026
##$TD= 16384
##$TD0= 1
##$TE= 0
##$TE2= 300
##$TE3= 300
##$TEG= 300
##$TL= (0..7)
0 120 120 120 120 120 120 120 
##$TP= (0..7)
150 150 150 150 150 150 150 150 
##$TP07= 0
##$TPNAME0= <>
##$TPNAME1= <>
##$TPNAME2= <>
##$TPNAME3= <>
##$TPNAME4= <>
##$TPNAME5= <>
##$TPNAME6= <>
##$TPNAME7= <>
##$TPOAL= (0..7)
0.5 0.5 0.5 0.5 0.5 0.5 0.5 0.5 
##$TPOFFS= (0..7)
0 0 0 0 0 0 0 0 
##$TUNHIN= 0
##$TUNHOUT= 0
##$TUNXOUT= 0
##$USERA1= <user>
##$USERA2= <user>
##$USERA3= <user>
##$USERA4= <user>
##$USERA5= <user>
##$V9= 5
##$VALIST= <valist>
##$VCLIST= <CCCCCCCCCCCCCCC>
##$VD= 0
##$VDLIST= <DDDDDDDDDDDDDDD>
##$VPLIST= <PPPPPPPPPPPPPPP>
##$VTLIST= <TTTTTTTTTTTTTTT>
##$WBST= 1024
##$WBSW= 4
##$XGAIN= (0..3)
0 0 0 0 
##$XL= 0
##$YL= 0
##$YMAX_a= 129591
##$YMIN_a= -127740
##$ZGOPTNS= <>
##$ZL1= 120
##$ZL2= 120
##$ZL3= 120
##$ZL4= 120
##$ABSF1= 10
##$ABSF2= 0
##$ABSG= 5
##$ABSL= 3
##$ALPHA= 0
##$AQORDER= 0
##$ASSFAC= 0
##$ASSFACI= 0
##$ASSFACX= 0
##$ASSWID= 0
##$AUNMP= <proc_1d>
##$AZFE= 0.1
##$AZFW= 0.1
##$BCFW= 1
##$BC_mod= 2
##$BYTORDP= 1
##$COROFFS= 0
##$CY= 11.3945322036743
##$DATMOD= 1
##$DC= 2
##$DFILT= <>
##$DTYPP= 0
##$F1P= 2.36226072786647
##$F2P= -0.459571619588291
##$FCOR= 0.5
##$FTSIZE= 0
##$FT_mod= 4
##$GAMMA= 1
##$GB= 0.15
##$INTBC= 1
##$INTSCL= 1
##$ISEN= 128
##$LB= 0.24
##$LEV0= 0
##$LPBIN= 0
##$MAXI= 10000
##$MC2= 0
##$MEAN= 0
##$ME_mod= 0
##$MI= 1.114404
##$NCOEF= 0
##$NC_proc= 0
##$NLEV= 6
##$NOISF1= 3.799351
##$NOISF2= 2.8
##$NSP= 1
##$NTH_PI= 0
##$NZP= 0
##$OFFSET= 15.70392
##$PC= 1
##$PHC0= -13797.29
##$PHC1= 14.20097
##$PH_mod= 1
##$PKNL= yes
##$PPARMOD= 0
##$PSCAL= 0
##$PSIGN= 0
##$REVERSE= no
##$SF= 200.130013532006
##$SI= 16384
##$SIGF1= 3
##$SIGF2= 2
##$SINO= 400
##$SIOLD= 16384
##$SREGLST= <1H.CDCl3>
##$SSB= 0
##$STSI= 0
##$STSR= 0
##$SW_p= 3612.71676300578
##$SYMM= 0
##$S_DEV= 0
##$TDeff= 0
##$TDoff= 0
##$TI= <>
##$TILT= no
##$TM1= 0
##$TM2= 0
##$TOPLEV= 0
##$USERP1= <user>
##$USERP2= <user>
##$USERP3= <user>
##$USERP4= <user>
##$USERP5= <user>
##$WDW= 1
##$XDIM= 8192
##$YMAX_p= 0
##$YMIN_p= 0
$$ End of Bruker specific parameters
$$ ---------------------------------
##NTUPLES= NMR FID
##VAR_NAME=  TIME,          FID/REAL,        FID/IMAG
##SYMBOL=    X,             R,               I
##VAR_TYPE=  INDEPENDENT,   DEPENDENT,       DEPENDENT
##VAR_FORM=  AFFN,          ASDF,            ASDF
##VAR_DIM=   8192,          8192,            8192
##UNITS=     SECONDS,       ARBITRARY UNITS, ARBITRARY UNITS
##FACTOR=    0.0002496,     1,               1
##FIRST=     0,             0,               0
##LAST=      2.0444736,     0,               0
##MIN=       0,             -127740,         0
##MAX=       2.0444736,     129591,          0
$$ Real data points
##PAGE= N=1
##DATA TABLE= (X++(R..R)), XYDATA
$$ plain form
0 0 0 0 0 0 0 0 0 0 0 0 0 0 0 0 0 0 0 0 0 0 5 -8 8 -8 8 -8 8 -13 16 -16 16 -21 24 -24 30 -32 37 -40 45 -49 56 -61
42 -61 69 -77 85 -93 101 -111 124 -134 149 -165 182 -199 221 -245 275 -307 346 -393 450 -521 615
63 615 -745 929 -1213 1706 -2735 5710 -31833 -127740 -14972 110421 51091 -75759 -65083
76 -65083 31664 58805 6944 -31965 -33117 -4910 39919 44417 -29099 -76165 2848 94696 31317
89 31317 -94399 -65651 75071 88146 -42398 -92153 7817 76351 18121 -47123 -27987 13497
101 13497 20839 14614 -443 -30665 -25032 33519 48975 -25477 -66873 9665 75772 9853 -73688
114 -73688 -27801 61223 38408 -42613 -38671 23591 28517 -10074 -11384 6232 -6184 -11683 18428
127 18428 22004 -22958 -31501 21964 37573 -18344 -39631 14551 38496 -12265 -35720 11759
$$ packed form
0@%%%%%%%%%%%%%%%%%%%%Nj3J6j6J6j6J6k1K9l2L2l7M5m8N4o2O9p7Q5r4J05j17
42f1J30j46J62j78J94k12K35k58K83l14L47l81M20m66N20n82O53p39Q43r71J136
63F15j360J674k142K919m441Q445l7543r5907J12768J25393n9330j26850J0676
76f5083R6747K7141n1861l8909j152K8207M4829M498p3516m7066P9013R1848o3379
89C1317j25716K8748J40722J3075j30544m9755R9970O8534n8230o5244J9136M1484
101A3497P342o225j5057l0222N633N8551J5456p4452m1396P6538O6107o5919q3541
114g3688M5887Q9024k2815q1021L942O2262M926l8591j310J7616j2416n499L0111
127A8428L576m4962q543N3465J5609n5917k1287N4182K3945n0761k3455M7479
$$ plain form
139 11759 32505 -12823 -29696 14922 27635 -18018 -27591 20452 29685 -19900 -31663 15776
151 15776 30538 -9865 -24290 5960 13947 -7100 -2439 14856 -5714 -27540 6941 40683
163 40683 -922 -49978 -10036 52877 22512 -48840 -33391 38325 39517 -23114 -38084 6858
175 6858 28112 6233 -10333 -11442 -11430 5816 31400 10580 -42869 -33144 41787 54515 -28961
188 -28961 -68334 8477 70422 13192 -60565 -30017 41350 37298 -17763 -33054 -4515 18078
200 18078 20366 4996 -25252 -30722 17288 52316 1926 -63206 -26599 60305 49194 -44757
212 -44757 -62795 21562 63427 2060 -51317 -19427 30307 26311 -6028 -21560 -15718 6801
224 6801 30367 14725 -34308 -37595 26733 55977 -9697 -64684 -11770 61257 31061 -46932
$$ packed form
139A1759K0746m5328j6873M4618J2713m5653r573M8043R233m9585j1763M7439
151A5776J4762m0403j4425L0250P987k1047M661J7295k0570k1826L4481L3742
163D0683m1605m9056L9942O2913l0365p1352J5449P1716J192o2631j4970M4942
175F858K1254k1879j6566j109J2J7246K5584k0820n3449R725P4931J2728q3476
188b8961l9373P6811O1945n7230p3757L0548P1367m052n5061j5291K8539K2593
200A8078K288j5370l0248n470M8010L5028n0390o5132L6607Q6904j1111r3951
212d4757j8038Q4357M1865o1367n3377L1890M9734l996l2339j5532N842K2519
224F801K3566j5642m9033l287O4328K9244o5674n4987N2914P3027l0196p7993
$$ plain form
236 -46932 -42282 26198 41941 -5802 -30956 -8651 12986 13853 6630 -9666 -23201 -1786 33378
249 33378 17244 -35362 -32469 29576 43839 -17865 -48209 3984 44578 7738 -34212 -13637
261 -13637 20634 12099 -8338 -4458 630 -6117 1285 16179 1574 -23245 -7042 26466 12934
274 12934 -26060 -17400 23312 19726 -19331 -19492 15464 16897 -12978 -12857 12727 8849 -14688 -6617
288 -6617 17327 6548 -18987 -7904 18394 8901 -15667 -7783 12371 3964 -10382 1884 11478
301 11478 -7545 -15452 11331 21335 -12000 -27408 9352 32037 -3869 -33598 -3170 30976
313 30976 9644 -24205 -13376 14210 12295 -3408 -5401 -4794 -6171 7469 19532 -3208 -30528
326 -30528 -6722 36051 19430 -34484 -31211 26205 38426 -13684 -39009 231 32383 10470
$$ packed form
236d6932M650O8480J5743m7743k5154K2305K1637Q67p223j6296j3535K1415L5164
249C3378j6134n2606K893O2045J4263o1704l0344N2193M0594l6840m1950K0575
261a3637L4271q535k0437L880N088o747P402J4894j4605k4819J6203L3508j3532
274A2934l8994Q660M0712l586l9057j61L4956J433k9875J21K5584l878k3537Q071
288f617K3944j0779k5535J1083K6298r493k4568P884K0154q407j4346J2266R594
301A1478j9023p907K6783J0004l3335j5408L6760K2685l5906k9729L0428L4146
313C0976k1332l3849J0829K7586j915j5703j993O07j377J3640J2063k2740k7320
326c0528K3806M2773j6621n3914L273N7416J2221n2110k5325L9240L2152k1913
$$ plain form
338 10470 -19970 -15635 4169 13173 11082 -2952 -21494 -12634 23995 29434 -17630 -42516 4421
351 4421 48223 11879 -44701 -26074 33264 34027 -17407 -33704 1393 25272 10727 -10705 -16008
364 -16008 -6592 12783 22180 -2042 -32105 -13352 33924 29224 -27269 -41012 14227 45257 1043
377 1043 -40795 -13659 29445 20126 -14843 -19219 705 11336 9257 1048 -13027 -14667 10096
390 10096 26037 -1918 -32744 -9159 33361 20176 -27755 -27612 18015 29417 -7335 -25243
402 -25243 -941 16854 4839 -6667 -3598 -2391 -1896 7987 9342 -9618 -16591 7719 21942
415 21942 -3518 -24542 -1674 23867 6052 -20528 -8173 16022 7651 -11863 -4912 9249
427 9249 997 -8844 2600 10301 -4591 -12266 4718 13244 -4058 -12879 3569 11412 -4007 -9478
$$ packed form
338A0470l0440M335J9804R004k091j4034j8542Q860L6629N439m7064k4886M6937
351D421M3802l6344n6580J8627N9338P63n1434j6297L5097K3879j4545k1432n303
364a6008R416J9375R397k4222l0063J8753M7276m700n6493j3743N5239L1030m4214
377A043m1838K7136M3104r319l4969m376J9924J0631k079q209j4075j640K4763
390A0096J5941k7955l0826K3585M2520j3185m7931J43M5627J1402l6752j7908
402b5243K4302J7795j2015j1506L069J207M95R883J355j8960o973K4310J4223
415B1942k5460k1024K2868K5541j7815k6580J2355K4195q371j9514O951J4161
427I249q252r841J1444P701j4892p675J6984Q526j7302q821J6448P843j5419n471
$$ plain form
441 -9478 5735 8071 -8497 -7944 11480 9459 -13515 -11976 14174 15053 -12829 -17656 9398 18502
455 18502 -4582 -16402 70 11301 2236 -4398 -1329 -2724 -3384 7770 10874 -9035 -19059
468 -19059 5863 25378 654 -28073 -8655 26386 16080 -20359 -20574 11355 20384 -1826 -15162
481 -15162 -5577 5885 8684 5309 -6278 -15585 -1445 21834 12335 -22150 -23051 16786 30638
494 30638 -7358 -32921 -3349 29339 12386 -20670 -16968 9407 15922 1599 -9477 -9708 -1023
507 -1023 12708 12973 -9743 -23252 1515 28858 9286 -28562 -19686 22541 26621 -12671 -28104
520 -28104 1901 23746 6643 -14948 -10723 4161 9590 5973 -3618 -13071 -5653 15360 15654 -12471
534 -12471 -23637 5597 27590 3098 -26594 -11013 21184 15803 -13084 -16031 5022 12108 895
$$ packed form
441i478J5213K336j6568N53J9424k021k2974J539K6150Q79k7882m827K7054R104
455A8502k3084j1820J6472J1231r065o634L069j395o60J1154L104j9909j0024
468a9059K4922J9515k4724k8727J9418L5041j0306l6439k15L1929R029k2210j3336
481a5162R585J1462K799l375j1587r307J4140K3279r499l4485r01L9837J3852
494C0638l7996k5563K9572L2688j6953l3056L702K6375O515j4323j1076k31Q685
507a023J3731K65k2716j3509K4767K7343j9572l7848Q876M2227M080l9292j5433
520b8104L0005K1845j7103k1591M225J4884N429l617r591r453P418K1013K94k8125
534a2471j1166K9234K1993k4492k9692J5581L2197n381k8887k947K1053P086j1213
$$ plain form
547 895 -5340 -3349 -2224 2200 8749 1898 -12810 -7507 13707 12856 -11856 -16683 8038 18024 -3697
562 -3697 -16745 162 13338 1373 -9181 -676 5596 -1664 -3424 4705 2951 -7386 -3743 8974
576 8974 5027 -9286 -5914 8790 6014 -8088 -5327 7666 4065 -7907 -2756 8980 1997 -10506
590 -10506 -2186 11906 3448 -12363 -5240 11482 6913 -9050 -7331 5706 5842 -2607 -2429 934
604 934 -2230 -1546 6704 4318 -9935 -8850 10737 13730 -8898 -17603 4782 19204 468 -17844
618 -17844 -5343 13604 8356 -7296 -8239 616 4659 4638 1696 -6838 -9248 5235 15953 -208
632 -208 -19906 -6842 19973 13863 -16162 -18799 9507 20225 -1814 -17518 -4776 11294 8427
645 8427 -2934 -7967 -5335 3399 11346 4153 -13483 -12641 11165 19627 -5257 -23286 -2585 22520
$$ packed form
547H95o235J991J125M424O549o851j4708N303K1214q51k4712m827K4721R986k1721
562c697j3048J6907J3176j1965j0554Q505O272p260j760Q129j754j0337L643J2717
576H974l947j4313L372J4704k776j4102K761J2993l601j1972N151J1736o983j2503
590a0506Q320J4092q458j5811P123J6722m569j5963J719J3037J36q449J78L363
604I34l164O84Q250k386j4253J085J9587K993k2628q705K2385J4422j8736j8312
618a7844J2501J8947n248j5652r43Q855M043k1k942q534k410J4483J0718j6161
632b08j9698J3064K6815o110l0025k637K8306J0718k2039j5704J2742J6070k867
645H427j1361n033K632Q734P947p193j7636Q42K3806Q462k4884j8029K0701K5105
$$ plain form
659 22520 9853 -17778 -14560 10428 15387 -2541 -12173 -3786 5823 7011 2094 -6320 -9454 2116
673 2116 14495 4429 -15979 -11384 13773 16842 -8653 -19260 2320 18098 3288 -13892 -6616
686 -6616 7961 6946 -1904 -4280 -2739 -446 4944 5964 -4370 -10798 1566 13840 2565 -14468
700 -14468 -6759 12664 9682 -9268 -10551 5392 9198 -2395 -6343 884 2890 -1205 218 2949
714 2949 -2101 -5219 2593 7309 -1985 -8580 903 8951 251 -8349 -814 7297 607 -6302 318
729 318 5882 -1440 -6116 2316 6842 -2583 -7715 2020 8078 -878 -7440 -143 5843 421 -3729
744 -3729 406 1675 -2390 -372 5142 380 -8012 -1957 10027 4537 -10624 -7552 9458 10040 -6700
759 -6700 -11123 2928 10087 669 -6908 -2861 2440 2967 2422 -571 -6153 -3694 7790 8847 -6665
$$ packed form
659B2520j2667k7631L218K4988M959j7928r632Q387R609J188m917q414l134J1570
673B116J2379j0066k0408M595K5157L069k5495j0607K1580J5778j4810j7180P276
686f616J4577j015q850k376J541K293N390J020j0334o428J2364J2274j1275j7033
700a4468P709J9423k982j8950j283J5943L806j1593l948P227K006m095J423K731
714B949n050l118P812M716r294o595R483Q048q700q600P535Q111o690o909O620
729C18N564p322m676Q432M526r425n132R735O058q956o562P297N986n422m150
744c729M135J269m065K018N514m762q392O055J1984n490j5161L072J7010N82j6740
759f700m423J4051P159r418p577M047N301N27n45k993n582K459J1484J057j5512
$$ plain form
774 -6665 -13225 3246 15753 1570 -15627 -6433 12735 9880 -7803 -10774 2150 8689 2618
787 2618 -4154 -5252 -1753 4981 7595 -1730 -11705 -3559 12911 9306 -11068 -13910 6768 16124
801 16124 -1249 -15322 -3968 11611 7244 -6108 -7739 289 5336 4401 -642 -6748 -5173 6158
815 6158 10572 -2796 -13900 -2094 14564 7199 -12388 -10967 8189 12397 -3130 -11064 -1188
828 -1188 7437 3608 -2705 -3725 -2023 1543 5469 2254 -6895 -6508 6029 9969 -3444 -11777 82
843 82 11608 3103 -9649 -5089 6569 5309 -3472 -3927 1195 1523 -176 1246 506 -3596 -1869 4941
859 4941 3745 -5166 -5347 4517 6319 -3345 -6431 2220 5785 -1469 -4583 1535 3503 -2179 -2824 3100
875 3100 2744 -3851 -3089 4144 3596 -3876 -3887 3117 3479 -2383 -2491 2056 1069 -2417 333 3486 -1315
$$ packed form
774f665o560J6471J2507j4183j7197R194J9168k855j7683k971J2924O539o071
787B618o772j098L499O734K614r325r975Q146J6470l605k0374k842K0678R356
801A6124j7373j4073J1354J5579m367j3352j631Q028N047r35n043o106J575J1331
815F158M414j3368j1104J1806J6658p365j9587J421J9156M208j5527p934R876
828a188Q625l829o313j020J702L566L926l215r149L87J2537L940j3413q333J1859
843H2J1526q505j2752M560J1658j260q781m55N122L28j699J422p40m102J727O810
859D941j196q911j81R864J802r664l086Q651L565p254l114O118J968n682o45N924
875C100l56o595P62P233n48p472j1P004L62n862j08M547r87l486K750L153m801
$$ plain form
892 -1315 -5102 1428 6819 -526 -8036 -1145 8238 3052 -7249 -4596 5183 5111 -2546 -4211 139
907 139 1944 1280 1186 -1148 -4259 -498 6591 3368 -7383 -6603 6455 9342 -3945 -10682 649
922 649 10225 2597 -7945 -4814 4283 5170 -262 -3530 -3095 139 4750 4070 -4356 -8081 1917 10702
938 10702 1881 -11287 -5918 9593 9007 -6212 -10274 2026 9294 1753 -6276 -4075 2027 4248
952 4248 2340 -2277 -5673 -1304 7113 5521 -6337 -9132 3695 11202 19 -11149 -3579 9158
966 9158 6085 -5766 -6775 2041 5528 1102 -2769 -2858 -854 2756 4221 -1030 -6650 -1802 7445
981 7445 4864 -6636 -7285 4506 8407 -1847 -8010 -556 6290 2025 -3810 -2227 1284 1153 659
996 659 814 -1565 -3031 1316 4844 -233 -5917 -1284 6018 2679 -5269 -3480 4072 3492 -2839 -2797
$$ packed form
892a315l787O530N391p345p510O891R383n186j0301K653R779p2p657j665M350
907A39J805o64r4k334l111L761P089l223j0751P80J3058K887j3287o737J1331
922F49R576p628j0542L131R097Q87n432l268M35L234M611o80q426l725R998Q785
938A0702q821j3168N369J5511n86j5219m062J2300P268p541q029K201O102K221
952D248j908m617l396M369Q417j592j1858k795J2827P507j1183j1168P570J2737
966I158l073j1851j009Q816L487m426l871q9K004L610J465n251n620M848R247
981G445k581j1500o49J1791L901j0254o163P454O846m265n835J583L511j31m94
996F59J55k379j466M347L528n077n684M633P302l339p948J789P552n80o331M2
$$ plain form
1012 -2797 2107 1706 -1905 -566 2320 -205 -3015 477 3676 -291 -3972 -121 3798 380 -3322
1027 -3322 -375 2608 -173 -2113 1024 1987 -2070 -2456 2819 3317 -3042 -4371 2633 5203 -1571 -5408
1043 -5408 237 4772 923 -3355 -1429 1505 996 347 415 -1574 -2491 1793 4690 -839 -6397 -958
1059 -958 7121 3200 -6557 -5165 4871 6274 -2364 -6023 -115 4391 1917 -1768 -2462 -1264 1484
1074 1484 3797 746 -5212 -3706 5037 6437 -3451 -8296 861 8710 1989 -7554 -4278 5089 5289
1089 5289 -1968 -4700 -875 2715 2832 298 -3223 -3466 2081 5996 360 -7172 -3292 6795 5911
1104 5911 -4992 -7538 2353 7692 458 -6324 -2552 3836 3383 -886 -2782 -1737 880 3408 1781
1119 1781 -3676 -4483 2572 6397 -575 -7188 -1759 6648 3662 -5060 -4720 2879 4513 -824 -3251
$$ packed form
1012b797M904m01l611J339K886k525k810L492L199l967l681L851L919l418l702
1027c322K947K983k781j940L137R63m057l86N275M98o359j329P004K570o774l837
1043e408N645M535l849m278J926K934n09o49O8j989r17M284K897n529n558N439
1059i58Q079l921r757J392J0036J403q638l659N908M506k474l685o94J198K748
1074A484K313l051n958J506Q743J400r888m845R157P849o721r543L276R367K00
1089E289p257k732L825L590J17k534l521k43N547L915n636p532L880J0087q84
1104E911j0903k546R891N339p234o782L772O388m53m269j896J045K617K528j627
1119A781n457q07P055L825o972o613N429Q407k986q722L40P599J634n337k427
$$ plain form
1134 -3251 -579 1330 995 746 -403 -2421 -932 3302 2592 -3175 -4006 2398 4814 -1176 -4885 25
1150 25 4265 777 -3188 -941 2032 450 -1181 398 828 -1325 -905 2082 1379 -2438 -1954 2321
1166 2321 2305 -1941 -2314 1520 1953 -1306 -1400 1370 745 -1871 -374 2563 419 -3211 -896 3519 1559
1183 1559 -3358 -2193 2732 2516 -1716 -2206 742 1306 -122 27 157 -1378 -834 2485 2084 -2898 -3575
1200 -3575 2505 4822 -1358 -5432 -151 5198 1639 -4055 -2643 2287 2740 -317 -1802 -1271 10
1215 10 1998 2127 -1684 -4116 301 5376 1678 -5573 -3799 4590 5319 -2752 -5914 531 5267 1484
1231 1484 -3526 -2660 1141 2621 1317 -1321 -3108 -792 3825 3270 -3241 -5369 1619 6543 631
1246 631 -6437 -2752 5177 4202 -3095 -4561 783 3711 1131 -1839 -2103 -511 1915 2680 -663 -4153
$$ packed form
1134c251K672J909l35k49j149k018J489M234p10n767q31O404K416n990l709M910
1150B5M240l488l965K247K973j582j631J579M30k153M20K987p03l817M84M275
1166B321j6m246l73L834M33l259r4K770o25k616J497K937k144l630K315M415j960
1183A559m917J165M925k16m232m90K948N64j428J49J30j535N44L319m01m982o77
1200c575O080K317o180m074N281N349l559n694J412M930M53l057j485N31J281
1215A0J988J29l811k432M417N075l698p251J774Q389P29q071l162O445M736l783
1231A484n010Q66L801J480j304k638j787K316M617n55o511k128O988M924n912
1246F31p068L685P929r75p297j466N344K928k580k970k64J592K426P65l343l490
$$ plain form
1262 -4153 -1273 4567 3298 -3886 -4911 2347 5564 -523 -5248 -1136 3993 2133 -2225 -2251 393
1277 393 1385 981 96 -1557 -1787 1288 3241 -293 -4020 -1007 4087 2281 -3400 -3046 2332 3196 -1175
1294 -1175 -2688 323 1714 -5 -600 259 -341 -958 824 1763 -841 -2477 490 2837 26 -2804
1310 -2804 -497 2416 630 -1904 -439 1449 -78 -1301 640 1438 -1128 -1878 1281 2358 -1088
1325 -1088 -2682 608 2667 -62 -2245 -301 1514 348 -622 154 -66 -1009 394 2081 -129 -2984
1341 -2984 -624 3505 1681 -3390 -2737 2653 3375 -1464 -3414 128 2671 873 -1340 -1271 -297 826
1357 826 1745 361 -2627 -1999 2632 3577 -1797 -4758 335 5083 1335 -4484 -2715 3072 3367 -1227
1373 -1227 -3067 -517 1836 1694 50 -1932 -2035 1212 3637 363 -4350 -2210 4115 3924 -2918 -4964
$$ packed form
1262d153K880N840j269p184j025P258L217o087m725M112N129j860m358k6K644
1277C93R92m04q85j653k30L075J953l534l727L013N094j806n681L54N378Q64m371
1294a175j513L011J391j719n95Q59o00o17J782R39k604j636K967K347k811k830
1310b804K307K913j786k534J465J888j527j223J941P98k566p50L159J077l446
1325a088j594L290K059k729k183J944J815j166r70P76k20r43J403J687k210k855
1341b984K360M129j824n071O53N390P22m839j950L542K543j798k213O9R74J123
1357H26R19j384k988O28M631R45n374k961N093M748l748n819J769N787K95m594
1373a227j840K550K353j42j644j982j03L247K425l274m713K140O325j91o842k046
$$ plain form
1389 -4964 1208 5057 648 -4151 -2040 2482 2579 -497 -2135 -1320 753 2395 1115 -2550 -3035 1682
1405 1682 4363 -184 -4908 -1571 4453 3013 -3222 -3807 1569 3672 55 -2674 -1131 1126 1429
1420 1429 571 -884 -1936 -304 2626 1788 -2512 -3066 1742 3825 -578 -3909 -527 3389 1354 -2351
1436 -2351 -1566 1217 1189 -302 -359 -167 -660 115 1564 351 -2118 -1075 2201 1704 -1914 -2122 1366
1453 1366 2113 -848 -1793 493 1218 -490 -630 812 261 -1307 -199 1780 423 -2054 -800 2040
1469 2040 1203 -1675 -1351 1119 1156 -611 -597 372 -134 -460 882 976 -1375 -1776 1418 2605 -967 -3135
1487 -3135 189 3217 696 -2770 -1426 1820 1662 -658 -1274 -412 269 963 985 -958 -2317 222 3252
1504 3252 960 -3522 -2327 3029 3399 -1925 -3896 506 3674 897 -2592 -1768 1006 1851 689 -1041
$$ packed form
1389d964O172L849m409m799K111M522R7l076j638Q15K073J642j280l665m85M717
1405A682K681m547m724L337O024j440o235n85N376K103l617k729J543K257L03
1420A429q58j455j052J632K930q38m300n54M808K083m403l331L382L916k035l705
1436b351P85K783k8j491n7J92m93P75J449j213k469J043L276m97l618k08L488
1453A366P47k961r45K286P25j708j40J442n51j568J108J979j357k477J254K840
1469B040q37k878L24K470L7j767J4R69n06l26J342R4k351m01L194J187l572k168
1487c135L324L028k521l466J344L246j58k320o16Q62O81O94K2j943j359K539L030
1504C252k292m482J195N356L70n324j971M402L168k777l489Q24K774Q45j162j730
$$ plain form
1520 -1041 -1979 -363 2596 2103 -2261 -3626 1161 4553 467 -4551 -2066 3709 3198 -2184 -3575 421
1536 421 3003 1084 -1603 -1872 -220 1727 1912 -742 -3103 -834 3418 2496 -2859 -3834 1568 4383
1552 4383 -56 -4122 -1345 3114 2216 -1597 -2270 20 1514 1151 -164 -1610 -1335 1370 2635 -438
1568 -438 -3419 -821 3460 2041 -2807 -2860 1766 3057 -605 -2641 -326 1679 765 -515 -601 -540 -105
1585 -105 1140 1034 -1263 -1955 876 2561 -203 -2745 -537 2415 1008 -1835 -1148 1155 855 -628
1601 -628 -324 422 -355 -607 866 1043 -1051 -1505 949 1852 -568 -1923 159 1679 160 -1140 -134
1618 -134 571 -220 -142 834 41 -1516 -298 2052 884 -2247 -1586 1973 2138 -1339 -2338 498 2051
1635 2051 248 -1321 -692 244 560 792 82 -1566 -1154 1747 2278 -1361 -3257 386 3656 810 -3371
$$ packed form
1520a041r38J616K959m93m364j365M787L392m086n018K485N775n11n382j391L996
1536D21K582j919k687k69J652J947J85k654k361K269M252r22n355r75N402K815
1552D383m439m066K777M459q98l813o73K290J494l63j315j446K75K705J265l073
1568d38k981K598M281j419m848n3M626J291l662k036K315K005r14j280q6O1M35
1585a05J245j06k297o92K831J685k764k542K208K952j407k843O87K303l00j483
1601f28L04P46p77k52J473J77k094m54K454R03k420j355K082J520j519j300J006
1618a34P05p91P8R76p93j557J218K350j168l131O61L559J65l477r99K836J553
1635B051j803j569O29R36L16K32p10j648M12K901N31l639j896L643L270k846m181
$$ plain form
1652 -3371 -1901 2457 2534 -1136 -2450 -205 1685 1225 -300 -1535 -1229 1084 2527 69 -3214 -1523
1668 -1523 3125 2915 -2257 -3856 883 4010 595 -3367 -1796 2052 2305 -437 -1992 -1084 872 2025
1684 2025 694 -2165 -2323 1472 3525 -184 -4015 -1363 3665 2650 -2585 -3405 1110 3316 339
1699 339 -2460 -1360 1071 1688 534 -1152 -1788 48 2468 1386 -2327 -2656 1578 3477 -361 -3586
1715 -3586 -839 3034 1721 -1966 -2024 759 1674 257 -803 -821 -325 746 1358 -198 -2046 -680 2177
1732 2177 1556 -1835 -2183 1153 2359 -396 -2084 -191 1454 406 -722 -216 99 -286 231 932 -186
1749 -186 -1477 -153 1772 660 -1693 -1051 1372 1246 -850 -1066 459 637 -246 -28 401 -485 -853
1766 -853 777 1435 -684 -1956 252 2204 329 -2100 -926 1569 1218 -822 -1116 37 541 453 317
$$ packed form
1652c371J470M358P7l670j314K245J890m60j525j235L06K313J443k458l283J691
1668a523M648k10n172j599M739L127l415l962J571L848K53k742j555R08J956J153
1684B025j331k859j58L795K053l709l831K652N028j015n235q20M515K206k977
1699C39k799J100K431O17j154j686o36J836K420j082l713l29M234J899l838l225
1715c586K747L873j313l687n8K783R15j417j060j8M96J071O12j556j848J366K857
1732B177o21l391l48L336J206k755j688J893J645j048j128N06L15l85N17P01j118
1749a86j291J324J925j112k353O42K423j26k096k16J525J78q83K18M29q86l68
1766h53J630O58k119j272K208J952j875k429J174K495l51k040k94J153N04q8j36
$$ plain form
1783 317 -516 -1256 87 1970 722 -2217 -1727 1914 2518 -1163 -2902 138 2731 840 -1969 -1471
1799 -1471 826 1507 418 -885 -1331 -189 1744 1512 -1466 -2665 578 3347 676 -3305 -1912 2601
1815 2601 2779 -1402 -2996 17 2467 1113 -1315 -1684 -157 1466 1500 -625 -2430 -737 2625 2121
1831 2121 -2086 -3207 943 3613 402 -3320 -1592 2365 2271 -1024 -2250 -344 1494 1300 -239 -1599
1847 -1599 -1091 1234 2232 -274 -2816 -930 2740 2077 -2027 -2754 971 2873 146 -2367 -989 1409
1863 1409 1323 -280 -1061 -726 283 1260 698 -1317 -1674 837 2291 -71 -2503 -814 2159 1418 -1481
1880 -1481 -1637 706 1406 -27 -809 -302 31 187 663 273 -1023 -869 1045 1424 -722 -1763 218
1897 218 1746 281 -1381 -525 866 472 -361 -105 38 -430 -38 977 349 -1310 -874 1299 1357 -983
$$ packed form
1783C17q33p40J343J883j248k939M90L641O04l681j739L040K593j891k809M98
1799a471K297O81j089j303m46J142J933k32k978j199L243K769k671l981J393M513
1815B601J78m181j594L013K450j354k428l69J527J623L4k125j805J693L362n04
1831B121m207j121M150K670l211l722J728L957r4l295j226J906J838j94j539j360
1847a599N08K325R98k506k542J886L670o63m104p27L725J902k727k513J378K398
1863A409q6j603p81L35J009R77n62k015l57K511J454k362k432J689K973p41k899
1880a481j56K343P00j433p82N07L33J56M76l90j296J54J914L79k146j041J981
1897B18J528j465j662Q56J391l94q33K56J43m68L92J015o28j659M36K173N8k340
$$ plain form
1915 -983 -1663 449 1616 96 -1265 -522 572 516 141 -153 -698 -527 905 1318 -702 -2009 95
1932 95 2352 739 -2203 -1489 1615 1938 -721 -1897 -200 1364 905 -380 -1084 -715 698 1627 154
1949 154 -2074 -1231 1956 2269 -1263 -2915 176 2931 926 -2354 -1740 1280 1998 -67 -1632 -1030
1965 -1030 632 1559 607 -1513 -1835 765 2628 338 -2867 -1591 2376 2561 -1371 -2952 128 2692
1981 2692 972 -1829 -1635 605 1672 670 -1035 -1595 -60 1943 1313 -1626 -2337 795 2913 342
1997 342 -2831 -1407 2149 2085 -1111 -2172 23 1681 824 -756 -1183 -373 922 1284 -201 -1830 -764
2014 -764 1784 1625 -1328 -2232 497 2292 317 -1924 -909 1201 1097 -390 -842 -261 263 602 496
2031 496 -496 -1138 56 1493 545 -1462 -1073 1148 1402 -618 -1399 94 1058 219 -517 -249 -37 -62
$$ packed form
1915i83o80K112J167j520j361P43J094n6l75k94n45J71J432M13k020j307K104
1932I5K257j613k942P14L104L23k659j176J697J564m59j285p04L69J413R29j473
1949A54k228Q43L187L13l532j652L091K755k005l280O14L020P18k065j565O02
1965a030J662R27r52k120l22K600J863k290l205J276L967J85l932j581L080K564
1981B692j720k801J94K240J067j002j705n60J535K003o30k939p11L132K118k571
1997C42l173J424L556o4l196j061K195J658q57j580m27Q10J295L62j485j629J066
2014g64K548j59k953r04K729J795j975k241J015K110j04j487m52N81N24L39j06
2031D96r92o42J194J437r48k007L89K221K54k020p81J493R64q39p36K68K12k5
$$ plain form
2049 -62 395 544 -493 -1073 261 1432 179 -1509 -674 1243 991 -777 -1079 192 760 211 -211 -375
2067 -375 -471 115 976 420 -1225 -1089 1087 1680 -591 -1961 -94 1877 781 -1339 -1177 595 1192
2084 1192 259 -722 -838 -51 1063 991 -765 -1760 68 2159 848 -2027 -1715 1432 2244 -508 -2286
2101 -2286 -470 1768 1191 -853 -1450 -236 1132 1168 -335 -1707 -758 1639 1765 -1043 -2487 64
2117 64 2627 984 -2214 -1799 1327 2150 -209 -1891 -750 1121 1335 -4 -1324 -1048 798 1859
2133 1859 165 -2076 -1207 1786 2070 -994 -2468 7 2322 901 -1698 -1460 733 1496 234 -1041
2149 -1041 -972 204 1228 749 -1006 -1540 369 1954 470 -1925 -1252 1423 1726 -691 -1797 -84
2165 -84 1431 646 -745 -843 -27 616 673 -42 -947 -628 889 1238 -460 -1562 -89 1568 659 -1185
$$ packed form
2049f2M57J49j037n80J334J171j253j688Q35J917k52j768l02J271N68n49m22j64
2067c75r6N86Q61n56j645J36K176N93k271j370J867J971j096k120J62J772N97
2084A192r33r81j16P87J114p2j756r95J828K091j311k875L12L147Q12k752j778
2101b286J816K238n77k044n97J214J368L6j503j372R49K397J26k808j444K551
2117F4K563j643l198M15L126Q23k359j682J141J871K14j339j320K76J846J061
2133A859j694k241Q69K993K84l064j474K475K315j421k599K38K193P63j262j275
2149a041O9J176J024m79j755n34J909J585j484k395O73K675L03k417j106J713
2165h4J515p85j391r8Q16O43N7p15r05L19J517L49j698j102J473J657r09j844
$$ plain form
2183 -1185 -954 675 953 -127 -641 -243 118 292 422 -66 -843 -421 924 877 -741 -1240 349 1324
2201 1324 124 -1149 -521 679 614 -138 -411 -309 -50 489 612 -383 -1122 -14 1408 593 -1320 -1118
2219 -1118 946 1444 -345 -1413 -256 1077 727 -389 -807 -326 523 934 101 -1176 -843 1054 1551
2236 1551 -518 -1943 -252 1892 994 -1419 -1509 639 1557 189 -1210 -878 426 1151 482 -951 -1302
2253 -1302 323 1757 543 -1770 -1421 1294 2024 -471 -2174 -420 1814 1143 -1062 -1467 137 1333
2269 1333 762 -681 -1283 -206 1366 1151 -930 -1803 185 2093 733 -1847 -1499 1188 1895 -321
2285 -321 -1809 -527 1272 1053 -458 -1201 -455 818 1128 -116 -1432 -740 1245 1447 -708 -1845 -40
2302 -40 1823 771 -1381 -1236 668 1286 49 -947 -592 352 811 379 -625 -964 130 1270 505 -1190
$$ packed form
2183a185K31J629K78j080n14L98L61J74J30m88p77M22J345m7j618m99J589R75
2201A324j200j273O28J200o5p52k73J02K59N39J23r95p39J108J422q15j913K02
2219a118K064M98j789j068J157J333l50j116m18M81Q49M11q33j277L33J897M97
2236A551k069j425J691K144q98k413r0K148R18j368j399L32J304P25o69j433l51
2253a302J625J434j214k313L49K715P30k495j703J754K234o71k205m05J604J196
2269A333n71j443o02J077J572k15k081q73J988J908j360k580L48K687P07k216
2285c21j488J282J799k19j511p43P46J273L10j244j316O92J985K02k155j137J805
2302d0J863j052k152J45J904O18j237r96L55R44M59m32j004l39J094J140p65j695
$$ plain form
2320 -1190 -1030 848 1377 -294 -1363 -250 1053 604 -497 -642 -42 385 419 56 -580 -610 390 999
2338 999 -27 -1178 -469 1018 823 -680 -1030 185 891 225 -524 -450 1 351 470 -10 -735 -488 748
2357 748 989 -444 -1296 -47 1336 575 -1004 -909 505 986 91 -714 -541 188 733 492 -526 -1024
2375 -1024 64 1319 586 -1259 -1191 844 1572 -207 -1603 -492 1202 956 -581 -1119 -195 854 810
2392 810 -275 -1159 -514 1058 1233 -588 -1693 -119 1764 907 -1402 -1467 733 1680 97 -1408 -752
2409 -752 814 1155 28 -1074 -810 595 1352 185 -1452 -993 1142 1625 -468 -1865 -330 1681
2425 1681 1021 -1097 -1406 303 1331 450 -883 -993 102 1078 648 -801 -1286 171 1542 552 -1407
2442 -1407 -1206 918 1557 -226 -1538 -430 1135 878 -473 -954 -174 720 726 -148 -932 -483 831 1062
$$ packed form
2320a190J60J878N29j671j069J113J303m49j101j45O00M27L4l63o36l0J000O09
2338I99j026j151P09J487j95j503l50J215P06o66p49P4M51L50J19m80p25K47J236
2357G48K41j433q52J249J383p61j579R5J414M81q95q05J73P29N45k41j018m98
2375a024J088J255p33j845O8K035P28j779j396J111J694k46j537n38R24J049m4
2392H10j085q84O45J572J75j821j105J574J883q57k309o5K200R47j583j505O56
2409g52J566L41j127j102K64J405P57j167j637M59K135M83k093j397J535K011
2425A681o60k118l09J709J028q81j333j10J095R76m30j449m85J457J371r90j959
2442a407K01K124O39j783j312J108J565k57j351m81P80Q94Oq74p84M49J314K31
$$ plain form
2460 1062 -378 -1337 -180 1304 728 -945 -1054 425 1078 113 -786 -482 286 599 278 -380 -685 -54
2478 -54 832 541 -707 -970 311 1117 133 -1042 -543 668 721 -206 -653 -236 301 459 163 -454 -627
2497 -627 192 926 273 -942 -715 727 1055 -282 -1083 -176 904 575 -434 -687 -105 524 546 -118 -782
2516 -782 -429 724 948 -363 -1267 -178 1256 724 -958 -1109 409 1160 169 -948 -681 398 860
2533 860 243 -720 -837 253 1138 377 -1129 -1002 745 1430 -156 -1495 -501 1208 1015 -629 -1179 -31
2551 -31 1031 670 -494 -983 -174 982 859 -575 -1307 -31 1430 711 -1178 -1241 620 1471 54 -1316
2569 -1316 -663 838 989 -199 -1007 -491 629 942 -32 -1112 -640 857 1149 -376 -1423 -276 1302
2586 1302 837 -885 -1146 275 1131 312 -794 -712 256 840 376 -599 -830 125 1042 455 -894 -927 530
$$ packed form
2460A062j440r59J157J484n76j673j09J479O53r65q99L04P68L13l21o58l05O31
2478e4Q86k91j248k63J281Q06r84j175M99J211N3r27m47M17N37J58k96o17j73
2497f27Q19P34o53j215K27J442L28j337q01R07J080l29j009k53N82O29K2o64o64
2516g82L53J153K24j311r04J089J434n32j682j51J518P51r91j117K67J079M62
2533H60o17r63j17J090Q85p61j506J27J747O85j586j339R94J709j93j644n50J148
2551c1J062l61j164m89Q09J156j23j434p32J276J461p19j889o3J861Q51j417j370
2569a316O53J501J51j188q08N16J120L13r74j080M72J497K92j525j047J147J578
2586A302m65j722k61J421Q56q19j106Q2R68N84m64r75k31R55R17n87j349l3J457
$$ plain form
2605 530 1171 -20 -1140 -484 794 766 -320 -803 -172 541 512 -115 -653 -401 480 764 -109 -955 -345
2624 -345 828 707 -560 -914 112 857 282 -587 -543 133 519 290 -265 -575 -123 642 565 -443 -878
2643 -878 68 982 371 -792 -688 453 825 14 -685 -391 335 589 160 -504 -591 176 829 272 -841
2662 -841 -744 571 1049 -108 -1112 -381 847 739 -422 -880 -109 701 559 -292 -810 -276 734 777 -416
2681 -416 -1103 -116 1150 666 -882 -1059 414 1204 176 -1002 -640 595 917 35 -820 -584 479 984
2699 984 114 -1018 -705 754 1147 -238 -1317 -353 1144 853 -694 -1131 85 1030 470 -667 -850
2716 -850 86 884 517 -618 -987 98 1124 490 -960 -978 538 1224 26 -1146 -536 810 872 -255
2734 -255 -891 -284 643 702 -137 -822 -362 705 846 -287 -1041 -203 1006 676 -674 -926 226 961 252
$$ packed form
2605E30O41j191j120O56J278k8j086m83O31P13k9o27n38K52Q81K84q73q46O10
2624c45J173j21j267l54J026P45n75q69M4O76L86k29n55l10M52P65p7j008m35
2643h78R46R14o11j163J04J141L72q11o99K94P26K54m29o64q7P67O53n57j113
2662h41R7J315M78j157j004P31J228j08j161m58P71Q10j42q51n18N34J010M3j193
2681d16o87R87J266m84j548j77J473P90j028j178L62J235L22q82q55K36J063N05
2699I84q70j132L13J459L93j385j079R64J497k91j547m37J216R45n60j137j83
2716h50R36P98l67j135l69J085J026o34j450j8J516O86j198j172O10J346O2j127
2734b55o36O07R27N9q39o85M60J067J41j133p54Q38J209l30j350k52J152P35p09
$$ plain form
2753 252 -699 -602 256 671 222 -502 -608 96 744 327 -669 -754 335 926 86 -883 -484 597 706 -183
2773 -183 -691 -222 454 510 -41 -534 -353 352 683 14 -757 -407 636 739 -289 -868 -95 777 477 -433
2793 -433 -630 55 591 360 -298 -598 -115 615 536 -384 -827 -14 882 433 -727 -781 351 877 83 -773
2813 -773 -503 398 681 64 -628 -511 325 797 151 -810 -607 592 963 -128 -1034 -345 869 748 -447
2832 -447 -901 -45 807 523 -421 -762 -71 771 589 -457 -908 9 1012 528 -788 -919 363 1074 148
2851 148 -965 -612 583 844 -81 -829 -439 518 756 -50 -855 -482 643 869 -231 -1045 -284 945
2869 945 722 -564 -955 90 933 386 -615 -687 178 767 342 -540 -706 143 848 361 -718 -735 386
2888 386 964 79 -895 -498 600 748 -169 -757 -265 502 551 -142 -664 -324 481 647 -138 -794 -277 683
$$ packed form
2753B52r51R7Q58M15m49p24j06P04O48m17r96q5J089N91q40r69L99J081J09q89
2773a83n08M69O76N6n51m93J81P05L31o69p71L50J043J03j028n79P73Q72l00r10
2793d33j97O85N36k31o58l00M83P30p9r20m43Q13Q96m49j160n4J132N26p94q56
2813g73K70R01K83o17o92J17Q36M72o46r61K03J199L71j091r06O89J214j21j195
2832d47m54Q56Q52k84r44l41O91Q42j82j046m51R17J003m84j316j31J282P11r26
2851A48j113L53J195K61r25p48L90R57K38q06q05L73J125K26j100q14P61J229
2869I45k23j286l91J045Q43n47j001p2Q65N89m25q82j66Q49P05m87j079j7J121
2888C86N78q85r74L97J098J48r17n88M92P67M9o93n22L40Q05J66p85o56N17R60
$$ plain form
2908 683 605 -408 -814 6 764 363 -495 -576 128 578 266 -371 -515 49 593 363 -439 -634 136 772
2928 772 255 -654 -541 383 707 9 -651 -332 393 552 7 -523 -382 306 620 51 -667 -446 494 713
2948 713 -161 -821 -252 657 551 -352 -716 -61 602 418 -317 -651 -95 608 494 -351 -752 -25 816 445
2968 445 -617 -763 262 883 206 -721 -541 407 729 40 -669 -438 405 704 43 -720 -482 510 795
2987 795 -141 -910 -300 760 669 -434 -865 -48 773 440 -486 -706 32 701 401 -489 -744 75 825 387
3007 387 -670 -747 313 912 137 -809 -514 525 768 -57 -733 -336 500 653 -75 -690 -320 539 692
3026 692 -162 -815 -261 712 600 -408 -783 24 756 365 -503 -619 123 635 251 -450 -554 97 636 271
3046 271 -517 -601 217 744 155 -668 -484 405 651 -57 -648 -306 418 531 -32 -542 -298 371 573 -27
$$ packed form
2908F83p8j013m06Q20P58m01q58q1P04M50l12o37j44N64N44k30q02j95P70O36
2928G72n17r09J13R24L24o98o60L19P25J59n45n30J41O88L14n69p18K21R40K19
2948G13q74o60N69R09j06r03l64O55O63j84p35l34N56P03j14q45m01P27Q41l71
2968D45j062j46J025O21o77r27J80R48L22o89p09K31Q43K99o61p63K38R92K85
2987G95r36p69O10J060r1j103m31Q17Q21l33r26k20P38O69l00q90k55Q19P50m38
3007C87j057p7J060N99p75r46K95J039K43q25o76L97Q36J53p28o15L70Q59J53
3026F92q54o53N54R73j12j008l75Q07P32l91q68j16P42N12l84p01j04O51N39l65
3046B71p88q4Q18N27n89q23J84Q89K46p08n91L42P24J13n63n10K44O69K02o00
$$ plain form
3066 -27 -606 -293 508 605 -185 -696 -149 600 461 -323 -594 -22 542 356 -291 -548 -66 528 391 -324 -628
3087 -628 2 652 334 -514 -613 196 686 154 -582 -455 295 590 60 -542 -395 289 589 68 -587 -432
3107 -432 396 682 -52 -712 -287 590 621 -236 -688 -105 607 463 -287 -603 -70 588 446 -332 -666 -37
3127 -37 702 425 -498 -705 139 766 218 -652 -569 320 692 66 -629 -455 331 634 22 -631 -416 415 673
3148 673 -79 -744 -311 593 617 -261 -737 -104 658 449 -372 -616 17 617 368 -370 -581 34 643 341
3168 341 -477 -614 164 716 206 -616 -520 326 657 23 -613 -388 359 535 -21 -575 -349 348 550 -57
3188 -57 -638 -304 470 542 -203 -655 -146 573 432 -304 -574 -25 526 323 -296 -513 5 524 326 -350 -536
3209 -536 80 604 261 -458 -491 208 600 103 -505 -354 276 515 35 -474 -337 280 487 26 -526 -333
$$ packed form
3066b7n79L13Q01R7p90n11N47P49j39p84k71N72N64j86o47k57M82N94j37p15l04
3087f28O30O50l18q48r9Q09M90n32p36J27P50K95n30o02J47O84L00n21o55J55
3107d32Q28K86p34o60M25Q77L1q57m52N83P12j44p50l16N33O58j42p78l34O29
3127c7P39k77r23k07Q44O27n48q70Q3Q89L72o26o95J74P86L03o12o53K15Q31K58
3148F73p52o65M33R04K4q78m76O33P62k09q21k44O33O00k49p38k11O15O09l02
3168C41q18j37P78N52n10q22R6Q46L31o34o36K25P47J76n56n54K26O97K02o07
3188e7n81L34P74P2p45m52N09P19j41p36k70N49N51k03o19k17N18N19j98o76j86
3209e36O16N24l43p19l3O99L92m97o08J51O30K39m80n09J37O17K07m61n52J93
$$ plain form
3229 -333 357 530 -78 -611 -241 450 467 -208 -566 -116 479 384 -250 -529 -52 499 379 -270 -547 -21 574
3250 574 328 -393 -543 122 635 224 -490 -445 249 583 103 -500 -373 277 549 52 -525 -370 342 552
3270 552 -44 -604 -289 467 514 -194 -631 -152 511 398 -280 -567 -62 504 358 -317 -551 -7 572 340
3290 340 -391 -547 112 622 230 -502 -469 243 611 107 -513 -372 312 540 29 -509 -322 349 549 -34
3310 -34 -568 -268 440 509 -169 -589 -147 504 396 -272 -550 -58 484 310 -305 -509 -13 491 261 -375 -508
3331 -508 86 547 205 -440 -436 220 535 87 -465 -340 278 500 30 -454 -277 302 479 -14 -499 -246 383
3352 383 490 -101 -526 -177 438 420 -191 -505 -71 441 332 -247 -482 -49 451 296 -279 -482 -6 491
3372 491 240 -381 -471 117 508 163 -429 -400 186 481 87 -423 -328 248 475 42 -454 -298 312 479 -33
$$ packed form
3229c33O90J73o08n33L70O91J7o75l58M50N95r5o34k79M77N51j20o49k77N26N95
3250E74k46p21j50O65N13m11p14M5O94L34m80o03J27O50K72m97n77J55P12K10
3270E52n96n60L15P56M7p08m37M79O63j13o78k87N05N66j46o75k34N44N79k32
3290C40p31j56O59N10l92p32L3P12L68n04o20J41O84K28n11n38J87O71K00n83
3310c4n34L00P08O9o78m20M42O51j08o68k78M92N42j74o15k04M96N04k30o36j33
3331e08N94M61l42o45MO56L15m48n52J25O18K22m70m84J77N79J77m93m85K53O29
3352C83J07n91m25L49O15j8o11l14M34N12j09n79k35M33N00j55n75k03M76M97
3372D91k51o21r0N88L91l45n92K9N86K95l94n10R5N76K27m33m96J56O10J67n12
$$ plain form
3393 -33 -492 -212 398 444 -141 -504 -116 425 365 -208 -473 -59 437 314 -253 -480 -11 482 273 -329 -477
3414 -477 79 507 179 -423 -431 173 496 89 -440 -368 221 467 37 -458 -309 284 478 -17 -501 -246 371
3435 371 450 -115 -506 -133 445 371 -200 -457 -47 453 314 -238 -437 16 458 255 -330 -440 84 482 171
3456 171 -387 -399 162 455 79 -420 -325 229 432 24 -430 -288 262 427 -23 -449 -252 321 414 -100 -465
3477 -465 -152 388 369 -160 -446 -80 416 310 -211 -426 -12 432 281 -251 -390 51 448 205 -323 -376 131
3498 131 462 132 -374 -327 174 425 56 -401 -281 223 400 -10 -424 -251 280 386 -64 -442 -178 336
3518 336 352 -131 -438 -110 369 296 -178 -425 -49 392 272 -223 -400 9 425 241 -284 -389 81 443 176
3539 176 -331 -342 157 430 95 -357 -304 197 420 37 -397 -265 250 389 -44 -418 -215 302 358 -108 -417
$$ packed form
3393c3m59K80O10M6n85l63L88N41o0n73k65M14M96j23n67k27M69M93k09o02j48
3414d77N56M28l28o02qO04L23m07n29P2N89K46m30m95J49N93J94m95m84K55O17
3435C71P9n65l91L73N78p4n71k57M10N00j39n52j99M53M42k03n85j10N24L98l11
3456A71n58j2N61K93l76m99R5N54K03m08m54J42N50J65m50m26J97N73R3n14l65
3477d65L13N40j9n29k86L66M96j06n21k15M14M44j51n32j39M41L97k43n28n3N07
3498A31L31l30n06M7N01K51l69m57J20N04J77m10m14J73N31J06m50l78K64N14
3518C36J6m83l07L28M79p3m74k47L76M41j20m95j77M09M16j84n25j05M70L62k67
3539A76n07j1M99K73l35m52N3N01K23l83m34J32N15J39m33l74K03N17N6m66l09
$$ plain form
3560 -417 -144 332 314 -172 -418 -76 350 274 -209 -404 -12 385 221 -273 -367 76 410 162 -312 -324 145
3581 145 401 104 -323 -279 179 391 49 -350 -249 232 384 -4 -386 -206 282 340 -75 -398 -147 306 300
3602 300 -136 -404 -84 327 258 -183 -387 -33 360 225 -239 -354 34 365 158 -278 -327 103 356 112 -301
3623 -301 -276 159 379 74 -317 -238 202 362 20 -344 -192 253 334 -41 -357 -150 281 302 -109 -367 -106
3644 -106 311 264 -160 -373 -61 326 227 -218 -358 4 336 186 -266 -340 60 358 139 -285 -315 107 357
3665 357 85 -310 -260 184 360 41 -338 -201 233 345 -28 -335 -142 275 304 -81 -344 -105 304 265 -127
3686 -127 -341 -45 321 233 -193 -337 3 334 170 -231 -330 49 325 119 -269 -294 101 338 84 -294 -263
3707 -263 147 326 39 -310 -211 203 329 -19 -324 -164 242 294 -65 -320 -105 268 274 -100 -309 -77 298
$$ packed form
3560d17K73M76j8m86k46L42M26p6m83j95L92L97j64m94r4M43L34k48m74j2M69
3581A45K56k97m27M4M58K12l42l99J01M81J52l88l82J80M88N8m15l23K51M53o
3602C00m36k68L20M11o9m41k04L54L93j35m64j15L88L31k07m36m9M30K53k44m13
3623c01K5M35K20l05l91P9M40J60l42l64J52M45Q1l75l16K07M31K1m11k58K61
3644a06M17m7m24k13L12L87r9m45j40L62L32j50m52p4M00K98k19m24l0M22K50
3665C57k72l95N0M44J76l19l79J37M34J12l73l07J93M17K9l85k63K39M09l9l92
3686a27k14K96L66q8m26j44L40L31j64m01r9L79K76k06l88k5L95K37k54l78L1
3707b63M10J79k87l49R9M14J26l48l05J60M06N2l59k55K15L73Ol74k09K32L75
$$ plain form
3728 298 243 -150 -309 -13 321 184 -195 -293 38 319 131 -227 -275 57 296 86 -268 -251 107 293 63
3749 63 -300 -229 143 295 4 -308 -173 206 272 -44 -300 -128 228 268 -65 -300 -103 257 244 -117 -297 -45
3771 -45 308 221 -155 -293 20 311 159 -194 -273 55 304 127 -217 -259 78 304 87 -267 -232 132 306 28
3793 28 -312 -199 173 281 -24 -308 -150 197 253 -66 -304 -112 238 246 -93 -311 -67 282 215 -144 -290 15
3815 15 304 177 -173 -258 64 306 126 -206 -242 91 302 94 -242 -240 115 296 34 -287 -194 177 283 -11
3837 -11 -300 -151 193 247 -56 -279 -114 211 226 -88 -276 -73 241 211 -141 -273 0 267 148 -170 -242 54
3859 54 273 108 -192 -210 83 263 106 -204 -183 111 276 58 -241 -178 151 261 -11 -253 -135 182 221 -51
3881 -51 -252 -105 184 201 -70 -264 -75 208 191 -113 -271 -44 230 154 -159 -250 14 255 124 -167 -208 46
$$ packed form
3728B98n5l93j59K96L34j37l79r8L31K81j88l58m8L32K39k10l54J7L58J86k30
3749F3l63P1L72J52k91l12J35L79O6l16k56J72L56M0l33k35J97L60j3l61j80K52
3771d5L53q7l76j38L13K91j52l53p9L28K49j77l44m2L37K26k17l54L5L64J74k78
3793B8l40J13L72J08l05k84J58L47N6l19k38J92L50Ql39k18K44L49o7l59j46L05
3815A5K89j27l50q5L22K42j80l32l6L33K11k08l36KL55J81k62l21R3L71J06k94
3837a1k89J49L44N4l03k23J65L25J5l14j88K03L14l0l52j32K73K67j19l18p2K96
3859E4K19j65l00j8K93J80j57l10K1K94J65k18k99O3L29J10k72k42J18L17L9k72
3881e1k01J47K89J7k71j94J89K83j7l04j58K27K74p6l13r1K64K41j31k91m1K54
$$ plain form
3903 46 242 96 -175 -192 76 248 82 -209 -182 128 260 41 -229 -146 157 226 -33 -220 -109 172 201 -53
3925 -53 -242 -93 181 192 -73 -259 -65 218 165 -145 -265 -13 234 120 -167 -231 26 229 91 -175 -211 72
3947 72 254 78 -198 -193 115 262 51 -224 -164 168 251 -14 -238 -119 183 216 -56 -237 -70 189 191 -73 -237
3970 -237 -56 204 173 -136 -240 -15 235 126 -171 -224 33 216 73 -188 -196 58 215 63 -197 -183 82 225
3992 225 27 -213 -154 143 235 -15 -218 -99 173 211 -40 -203 -60 180 183 -58 -209 -47 192 163 -85 -220
4014 -220 -16 208 135 -150 -198 18 196 78 -155 -180 38 182 51 -162 -170 56 193 41 -185 -159 92 191
4036 191 -3 -191 -116 134 180 -23 -193 -70 149 157 -36 -185 -68 162 157 -57 -195 -38 206 168 -97 -200
4058 -200 18 209 105 -134 -185 26 189 73 -139 -181 29 190 60 -178 -187 67 204 24 -209 -154 110 184
$$ packed form
3903D6J96j46k71j7K68J72j66k91K7L10J32k19k70Q3L03O9k59j87J11K81K9k54
3925e3j89J49K74J1k65j86J94K83n3l10j20K52K47j14k87o4K57K03j38k66l6K83
3947G2J82j76k76NL08J47k11k75O0L32Q3k65k24J19L02L3k72j81J67K59Kk64j64
3970b37J81K60l1l09j04K25K50j09k97n3K57J83j43k61qK54J57j52k60J4K65J43
3992B25j98k40N9K97R2k50k03J19K72L8k51j63J43K40Lk41j51J62K39k9k48j35
4014b20K04K24p3k85m8K16J78j18k33k5K18J44j31k13qK26J37j52k26K6K51R9
4036A91j94j88P5K50M6k03j70J23K19Qj93j49J17K30nk14j38J57K44l8k65j03
4058b00K18J91j04k39n1K11J63j16k12m2K10J61j30k38rK54J37j80k33N5K64P4
$$ plain form
4080 184 -13 -202 -117 132 160 -42 -196 -80 158 174 -48 -192 -42 174 169 -92 -199 5 215 110 -133 -170
4102 -170 54 210 89 -140 -152 64 198 68 -159 -152 74 202 21 -209 -142 129 188 -27 -215 -107 141 151
4124 151 -59 -206 -71 139 139 -74 -201 -52 175 148 -88 -197 0 200 108 -110 -163 51 199 70 -136 -131
4146 -131 66 179 53 -138 -118 82 183 32 -161 -105 111 171 -15 -168 -69 129 137 -63 -158 -58 126 110 -58
4169 -58 -169 -45 146 103 -84 -166 -15 171 100 -108 -163 20 178 77 -114 -119 57 157 53 -124 -118 63 172
4192 172 38 -137 -109 89 174 8 -151 -90 121 159 -31 -155 -48 117 125 -45 -148 -52 117 120 -69 -166 -34
4215 -34 157 107 -117 -170 0 165 71 -119 -146 29 160 56 -119 -120 53 174 51 -134 -122 99 191 28 -156
4238 -156 -85 131 173 -18 -171 -55 160 143 -52 -160 -29 149 127 -75 -168 -25 162 103 -108 -174 7 163
$$ packed form
4080A84j97j89Q5K49K8k02j54J16K38J6k22j44J50K16nk61j07K04K10j05k43l7
4102a70K24J56j21k29j2K16J34j30k27PK26J28j81k30O7K71N9k15j88J08K48J0
4124A51k10j47J35K10%k13j27J49K27k7k36j09J97K00r2k18n3K14J48j29k06N
4146a31J97J13j26j91K0K00J01j51j93N6K16O0j86j53R9J98Qk00r5J00J84j6j68
4169e8j11J24J91m3j87q2J51J86p1k08n5J83J58j01j91nJ76J00j04j77OJ81J09
4192A72j34j75K8J98Q5j66j59O1K11L8j90j24J07J65Qj70j03R6J69Lj89r7J32
4215c4J91n0k24n3J70J65r4j90k7J75J31j04j75jJ73J21j23j85J2K21R2j63j84
4238a56P1K16M2j91j53J16K15j7j95j08J31J78k2k02r3J43J87n9k11o6J81J56
$$ plain form
4260 163 67 -145 -157 55 163 34 -160 -121 69 154 22 -143 -98 93 152 2 -179 -80 140 161 -36 -157 -35
4283 -35 159 134 -60 -140 0 155 100 -65 -149 -1 155 104 -111 -138 22 175 70 -123 -128 61 165 18 -143
4306 -143 -113 61 134 -2 -147 -99 86 126 -9 -141 -83 91 129 -42 -161 -40 133 117 -55 -133 -12 137 95
4329 95 -63 -113 7 132 91 -67 -121 21 154 81 -117 -126 63 157 38 -142 -107 67 136 16 -135 -93 70 130
4353 130 -7 -150 -99 81 140 -34 -171 -66 118 114 -58 -156 -31 138 103 -68 -145 -10 143 101 -71 -131 29
4376 29 174 89 -95 -126 47 169 59 -129 -112 79 145 14 -134 -88 72 136 -12 -150 -90 98 133 -24 -176
4399 -176 -73 121 125 -79 -178 -41 133 86 -98 -158 9 146 72 -114 -145 11 151 64 -116 -143 42 166 46
4422 46 -137 -106 99 158 19 -146 -76 103 136 -17 -133 -56 102 128 -31 -143 -49 114 110 -78 -154 -24 133 75
$$ packed form
4260A63r6k12j2K12J08j29j94L9J90Q5j32j65M5J91N9j50j81R9K20K1j97j21J22
4283c5J94k5j94q0J40J55n5j65q4J48J56n1k15k7J60J53j05j93nJ89J04j47j61
4306a43L0J74P3j36j45M8J85M0j35j32N8J74L8j71j19J21J73j6j72p8J21J49m2
4329I5j58n0J20J25m1j58n4J42J33p3j98rJ89R4j19j80L5J74O9j20j51M2J63O0
4353A30j37j43N1J80N9j74j37J05J84mj72r8J25J69l5j71p7J35J53m2j72o0J60
4376B9J45q5j84l1J73J22j10j88J7J91O6j31j48M6J60O4j48j38O0J88L5j57j52
4399a76J03J94Mk04r9J37J74m7j84o0J67J37p4j86l1J56J40q7j80k7J85J24j20
4422D6j83L1K05N9j39j65P0J79L3j53j16P7J58K6j59j12R4J63mj88p6J30J57n8
$$ plain form
4446 75 -96 -144 12 121 48 -111 -127 10 121 51 -122 -115 51 154 37 -125 -111 68 140 9 -127 -68 102
4469 102 122 -11 -121 -58 109 132 1 -124 -38 120 130 -31 -131 -29 132 84 -70 -126 6 117 59 -91 -128
4492 -128 13 112 53 -111 -121 10 124 37 -121 -117 44 138 22 -126 -93 68 141 -16 -123 -57 97 126 -11 -136
4516 -136 -55 106 130 -31 -148 -30 136 117 -63 -147 -8 152 84 -84 -138 21 143 68 -110 -141 24 137 52
4539 52 -119 -134 40 138 6 -156 -113 78 125 -25 -157 -70 97 120 -25 -133 -51 125 124 -29 -137 -27 145
4562 145 113 -64 -132 7 156 102 -91 -110 46 150 71 -96 -102 34 141 38 -113 -114 50 132 31 -132 -106 86
4586 86 134 -22 -149 -69 95 114 -23 -142 -64 93 92 -45 -132 -51 115 108 -61 -142 2 140 82 -78 -117 35 134
4611 134 70 -73 -107 40 145 63 -84 -91 42 150 51 -120 -93 68 138 -2 -134 -80 72 108 -22 -130 -64 73
$$ packed form
4446G5j71m8J56J09p3j59j6J37J11p0j73PJ66J03j17j62J4J79P2j31j36N9J70
4469A02K0j33j10O3J67K3j31j25Q6J58J0j61j00J02J61m8j54n6J32J11n8j50l7
4492a28J41R9n9j64j0J31J14q7j58MJ61R4j16j48L3J61P3j57j07O6J54K9j37j25
4516a36Q1J61K4j61j17J18J66j9j80q4J39J60o8j68n4J59J22p5j78l1J65J13q5
4539E2j71j5J74R8j32j62M3J91M7j50j32Q7J67K3j45j08Q2J76jj53j08J10J72
4562A45l2j77o8J39J49n4j93j9J56J04p9j67oJ36J07j03j51jJ64Q2j01j63K6J92
4586H6M8j56j27Q0J64J9j37j19P8J57jj37q7Q1J66pj69q1J44J38n8j60l9J52R9
4611A34o4j43l4J47J05q2j47pJ33J08r9j71K7J61P0j40j32N4J52L6j30j08O6J37
$$ plain form
4635 73 92 -25 -134 -64 97 110 -51 -148 -31 130 86 -67 -142 6 144 82 -78 -115 12 133 56 -87 -116 41
4659 41 151 63 -98 -111 68 152 35 -116 -91 84 141 -8 -124 -59 101 120 -25 -137 -82 98 103 -54 -162 -65
4683 -65 118 93 -75 -164 -23 127 72 -103 -145 12 138 65 -103 -117 32 148 64 -106 -110 63 164 33 -129
4706 -129 -89 95 160 6 -129 -59 108 126 -27 -131 -50 111 120 -39 -133 -41 119 108 -76 -151 -25 123 63 -100
4730 -100 -143 2 125 51 -109 -120 25 119 28 -111 -121 54 130 17 -115 -95 86 122 -4 -121 -42 94 123 -22
4754 -22 -116 -46 106 116 -28 -117 -28 105 95 -60 -140 -22 119 73 -82 -130 3 117 40 -104 -126 14 103 46 -105
4779 -105 -110 30 107 21 -122 -121 45 118 11 -131 -92 75 116 -11 -114 -49 100 124 -14 -118 -45 93 119 -22
4803 -22 -109 -25 108 98 -63 -121 -12 134 78 -84 -125 12 115 53 -95 -120 13 121 29 -119 -117 43 137 11
$$ packed form
4635G3J9j17j09P0J61J3j61r7J17J61m4j53p5J48J38o2j60l7J27J21p7j43k9J57
4659D1J10q8j61j3J79Q4j17j51K5J75N7j49j16O5J60J9j45j12N5J80Nj57j08R7
4683f5J83k5j68q9J41J50n5j75m2J57J26p3j68j4J49J16q4j70mJ73J01j31j62
4706a29M0J84O5j54j35P0J67J8j53j04Q1J61Rj59r4R2J60j1j84p5J26J48o0j63
4730a00m3J45J23p4j60j1J45R4r1j39j0J75P6j13j32K0J81L6j26j17P9J36K9j45
4754b2r4P0J52J0j44q9Q9J33j0j55q0J18J41m6j55m8J33J14p7j44k2J40Q9n7j51
4779a05nJ40P7q6j43JJ66P3j07j42L9J67M1j27j03O5J49K4j38j04P3J38K6j41
4803b2q7Q4J33j0j61n8J09J46n6j62m1J37J03o2j48k5J33J08r2j48KJ60R4j26
$$ plain form
4827 11 -128 -110 70 127 -12 -136 -67 88 109 -20 -126 -49 101 119 -44 -133 -22 122 107 -46 -116 10 135
4850 135 84 -78 -114 23 146 69 -79 -95 20 124 42 -109 -105 42 126 15 -137 -105 57 109 -24 -139 -77 83
4874 83 111 -32 -123 -55 94 102 -38 -130 -42 118 102 -47 -137 -16 130 79 -73 -108 22 130 68 -86 -99 41 112
4899 112 55 -75 -94 30 123 48 -97 -93 54 110 6 -125 -77 68 92 -16 -114 -64 58 87 -41 -120 -49 77 85
4924 85 -49 -135 -34 95 80 -61 -117 -3 122 70 -67 -95 25 125 64 -73 -93 31 139 60 -87 -95 48 141
4948 141 26 -107 -86 77 114 8 -122 -75 70 96 -26 -137 -70 74 85 -43 -143 -56 99 88 -68 -140 -24
4971 -24 115 70 -72 -124 -6 111 60 -89 -106 12 118 45 -91 -100 46 138 41 -110 -84 75 135 8 -115 -61
4995 -61 96 118 -13 -114 -57 95 99 -39 -136 -53 96 91 -62 -144 -19 113 72 -90 -136 0 111 43 -84 -112 19
$$ packed form
4827A1j39J8J80N7j39j24O9J55K1j29j06P7J50J8j63q9J11J44j5j53p0J26J25
4850A35n1j62l6J37J23p7j48j6J15J04q2j51MJ47Q4j11j52L2J62N2j33j15O2J60
4874H3K8j43r1O8J49Qj40r2Q8J60j6j49r0J21J46n1j52l5J30J08o2j54j3J40P1
4899A12n7j30j9J24R3p5j45MJ47N6j04j31M8J45K4j08r8N0J22K9j28p9P1J26Q
4924H5j34q6J01J29j5j41n6J14J25n2j37k8J20J00o1j37k0J24J08p9j47qJ43R3
4948A41j15j33K1J63L7j06j30M7J45K6j22j11O7J44J1j28j00Q7J55j1j56p2J16
4971b4J39m5j42n2J18J17n1j49j7J18J06p3j36rJ46R2r7j51K6J59O0j27j23N4
4995f1J57K2j31j01N7J52Mj38r7Q3J49nj53q2J25J32m1j62m6J36J11o8j27k8J31
$$ plain form
5020 19 107 46 -90 -93 26 121 36 -93 -91 65 125 -1 -108 -62 83 118 4 -92 -49 97 106 -17 -102 -40 89 89 -40
5047 -40 -127 -17 99 85 -61 -118 -8 101 44 -90 -116 -7 89 30 -91 -104 13 107 52 -104 -95 42 112 30 -97
5072 -97 -72 63 92 -1 -97 -44 77 104 5 -81 -45 81 109 -14 -100 -44 84 91 -34 -109 -9 109 74 -54 -107 -7
5098 -7 87 55 -78 -113 -1 107 53 -95 -119 12 106 25 -125 -102 34 110 -1 -121 -76 80 109 -12 -98 -64 86
5123 86 113 -14 -116 -49 96 102 -20 -121 -11 106 78 -63 -120 5 111 57 -66 -117 4 102 46 -85 -103 24
5147 24 116 31 -111 -102 50 98 9 -117 -78 46 96 -31 -119 -64 71 96 -21 -106 -44 98 98 -42 -115 -21 103 84
5173 84 -57 -91 12 124 65 -68 -82 34 121 47 -75 -94 31 101 28 -98 -104 41 101 11 -114 -71 60 84 -16
5198 -16 -100 -58 52 60 -35 -102 -49 58 77 -21 -102 -46 88 78 -39 -94 -15 101 68 -52 -84 10 106 58 -53 -83 19
$$ packed form
5020A9Q8o1j36lJ19R5q5j29KJ56O0j26j07M6J45L5j14r6M3J46Rj23q5O2J29%j29
5047d0q7J10J16j4j46n7J10J09n7j34k6J09R6n9j21j3J17R4n5j56RJ37P0q2j27
5072i7K5J35K9r3r6N3J21K7r9q6L6J26K8j23q6N6J28Pj25p5J00J18l5j28n3J00
5098gR4l2j33l5J12J08n4j48k4J31R4q1j50K3J36P6j11j20M5J56K9j21q6L4J50
5123H6K7j27j02O7J45Oj22j01J10J17k8j41n7J25J06n4j23n1J21R8n6j31j8J27
5147B4R2q5j42RJ52M8q9j26L9J24N0j27q8N5J35K5j17q5O2J42%j40p3R4J24j9
5173H4j41l4J03J12n9j33j4J16Q7p4j22j9J25P0p3j26oJ45O0r0j25M3J31K4j00
5198a6q4M2J10Qr5o7N3J07J9r8q1N6J34j0j17n5P9J16l3j20l2R4R6m8j11l0J02
$$ plain form
5225 19 119 71 -63 -88 29 119 41 -79 -75 56 92 6 -110 -72 50 87 -4 -98 -65 43 89 -17 -118 -63 83
5250 83 93 -43 -123 -42 90 77 -60 -103 5 96 71 -53 -91 0 105 71 -64 -84 33 123 48 -95 -83 46 119
5275 119 17 -90 -60 62 98 -13 -108 -63 62 94 -7 -116 -65 67 82 -44 -122 -45 94 69 -64 -125 -12 90
5299 90 44 -76 -109 -2 90 45 -56 -88 18 109 41 -72 -65 42 124 25 -91 -58 63 110 -11 -80 -34 62 89 -6
5325 -6 -88 -38 65 74 -33 -101 -39 79 56 -49 -92 -14 82 43 -65 -94 4 77 34 -59 -80 3 74 35 -70 -77 13 95 31
5354 31 -80 -56 40 99 3 -79 -45 57 87 1 -55 -32 56 83 18 -63 -36 61 86 -10 -86 -36 78 62 -38 -92 -26 53
5382 53 33 -43 -96 -24 68 49 -40 -101 -18 85 49 -69 -95 15 99 32 -86 -70 42 91 12 -77 -51 58 97 18 -74
5409 -74 -45 66 98 -1 -90 -37 89 104 -30 -100 -7 96 65 -40 -90 -9 78 54 -58 -96 -11 81 38 -74 -106 16
$$ packed form
5225A9J00m8j34k5J17R0p8j20MJ31L6q6j16L8J22L7r1r4L3J08M6j06j01N5J46
5250H3J0j36q0Q1J32j3j37m3J08R1k5j24l8R1J05l4j35k0J17R0p5j43J2J29P3
5275A19j02j07L0J22L6j11r5M5J25L2j01j09N1J32J5j26p8P7J39k5j33o1J13J02
5299I0m6j20l3J07R2m5j01l2J06R1o8j13PJ07Q2r9j16L3J21M7j21o9M6R6K7r5
5325fq2N0J03Rj07o8O2J18k3j05m3P8R6l9j08k9R8P3m3r3k1Q3P1l9j05pR0Q2o4
5354C1j11K4R6N9r6q2L4J02L0q6n6K3Q8K7o5q1K7R7K5r6p6N0J14j6j00n4O6P9
5382E3k0p6n3P2R2j9q9o1Q3J03l6j18k6J10Q4o7j18J6J12M9p9q9K6J09L9p9r2
5409g4K9J11L2r9q9N3J26J5j34p0R3J03l1j05n0Q1Q7k4j12l8Q5R2m3j12l2J22
$$ plain form
5435 16 87 17 -99 -84 48 83 1 -88 -43 49 73 -2 -84 -37 61 86 -16 -77 -25 87 82 -34 -84 3 90 60 -43 -60
5463 -60 11 85 40 -45 -61 7 84 28 -62 -74 15 82 11 -88 -69 35 62 -5 -83 -54 44 46 -9 -73 -36 44 64 3 -71 -40
5493 -40 64 75 -21 -63 -15 78 60 -31 -46 8 73 56 -21 -42 5 67 62 -18 -63 3 75 39 -50 -59 22 82 10 -70 -58 25 55
5524 55 3 -70 -44 14 51 12 -73 -58 39 68 -18 -82 -62 47 62 -38 -87 0 64 57 -19 -62 -7 72 69 -28 -54 2 85 61
5554 61 -31 -76 21 93 29 -75 -61 33 67 13 -60 -58 28 57 7 -78 -74 25 60 -9 -111 -53 50 64 -51 -95 -24 62 50
5583 50 -44 -72 10 53 42 -43 -60 -3 76 42 -51 -64 25 87 41 -62 -54 41 84 -1 -65 -29 42 57 -12 -65 -33 45 67 -6
5613 -6 -77 -39 41 49 -40 -88 -13 51 19 -57 -65 5 40 23 -35 -45 -3 46 28 -29 -43 22 69 36 -43 -39 41 69 10 -44 -27 46
5645 46 69 12 -30 -15 28 46 9 -48 -33 36 50 -11 -60 -33 44 45 -35 -56 -5 33 23 -28 -56 -14 23 15 -33 -69 -20 51 45 -45
$$ packed form
5435A6P1p0j16J5J32L5q2q9M5R2K4p5q2M7R8K5j02o1N2J12nj16n0Q7Q7l0j03j7
5463f0P1P4m5q5j6O8P7n6r0j2Q9O7p1r9J9J04K7o7p8K9R8Kn5o4L7Q0K0o1p4L1
5493d0J04J1r6m2M8R3j8r1j5N4O5j7p7k1M7O2nq0m5O6P2l6q9rQ1O0p2q0J2Q3L0
5524E5n2p3K6N8L7l9q5J5R7K9q6o4K0J09J5j00m9Q7O4pp6m3N5P9lr7k6N6Q3k4
5554F1r2m5R7P2o4j04J4R4L4n4p3KQ6K9n0q5MR9L5o9j02N8J03J4j15m4P1Q6j2
5583E0r4k8Q2M3j1q5j7N7P9l4r3j3Q9O2m6j03QR5M3q5o4L6P1J5o9n3L2P8K2p3
5613fp1L8Q0Qq9m8P5O4l2p6qP0L5j7n8j0M2M9j8n7j4O5M7l3p9MQ0K8n9n4J7P3
5645D6K3n7m2J5M3J8l7n7J5O9J4o1m9K7P7Jq0k1N1L8j0n1k8M2L7qm8l6M9P1or0
$$ plain form
5677 -45 -69 13 63 43 -41 -49 22 69 19 -44 -26 35 71 18 -43 -32 36 78 15 -69 -37 65 68 -11 -75 -25 65 50 -34 -65 -12
5708 -12 43 33 -50 -59 -19 61 35 -59 -81 0 68 22 -67 -75 41 74 -1 -70 -41 42 64 0 -60 -21 51 69 -1 -54 -18 81 75
5739 75 -16 -63 14 82 45 -36 -50 11 64 15 -49 -46 2 50 18 -50 -55 9 61 4 -67 -47 39 54 -24 -77 -18 41 37 -18 -29 -7
5771 -7 34 46 -4 -36 -15 53 46 0 -42 3 54 38 -22 -38 34 62 29 -14 -14 11 36 30 -12 -31 0 37 22 -39 -45 16 46 8 -55
5804 -55 -33 26 21 -9 -34 -20 1 8 -6 -46 -34 17 46 2 -55 -29 49 44 -17 -40 -10 50 36 -11 -37 7 41 34 -12 -39 -4 64
5836 64 58 -14 -34 10 71 17 -40 -45 29 61 -3 -54 -34 16 44 6 -58 -51 9 49 -10 -77 -48 41 53 -23 -84 -21 52 36 -37 -53
5868 -53 3 53 36 -30 -42 -1 60 46 -33 -53 15 73 30 -49 -43 52 75 5 -59 -28 43 40 -18 -49 -25 31 38 -11 -52 -27 29 36
5900 36 -36 -71 0 55 21 -48 -53 7 40 0 -40 -33 18 30 11 -24 -22 10 58 32 -21 -32 33 59 -2 -38 5 49 33 2 -22 5
$$ packed form
5677d5k4Q2N0k0q4qP1M7n0o3J8O1L6n3o1J1O8M2o3q4L2J02Lp9o4N0R0j5q4l1N3
5708a2N5j0q3rM0Q0k6r4k2Q1O8m6q9qJ16L3p5o9K9Q3K2o4o0L9P2J8p0n3L6R9o
5739G5r1m7P7O8l7q1j4O1N3m9o4LM8M8l2o8nO4N2n7p1K0Q6J5p8n3N9N9mn5j1K2
5771gM1J2n0l2K1O8pm6m2M5N1j6o0j6P2K8l3m3%K5K5om2j9L1L7j5o1oO1L0l8o3
5804e5K2N9nl0k5J4K1Pj4m0J2N1K9m4n7K6P8no1k3L0O0j4m7k6M4L4pm6k7L5O8
5836F4op2k0M4O1n4n7nP4L2o4n1K0N0K8l8o4PO0M0n9o7K9Q9J2p6o1O3P3j6p3j6
5868e3N6N0j7o6j2M1O1j4p9k0O8N8m3p9OR5K3p0o4L1P1ln8l1K4N6Pm9m1K5N6P
5900C6p2l5P1N5l4o9nO0L3m0m0PN1J2j9l5KL2M8k6n3j1O5K6o1l6M3M4j6l1k4K7
$$ plain form
5932 5 27 19 -3 -22 -18 19 29 -11 -39 -24 27 25 -34 -44 -13 26 12 -15 -21 -12 5 11 -7 -33 -16 25 31 -16 -33 2 41 23 -27 -18 34
5967 34 45 17 -21 -18 19 39 31 2 -20 1 43 33 -38 -22 27 63 2 -62 -17 41 21 -24 -55 -12 30 21 -17 -58 -36 34 42 -26
5999 -26 -67 -19 58 31 -44 -61 13 61 20 -39 -21 39 51 12 -26 -15 24 64 23 -40 -35 48 75 -5 -53 -6 67 51 -20 -35 13
6030 13 55 24 -31 -33 2 36 17 -40 -58 -4 50 14 -59 -56 29 48 -10 -58 -22 41 28 -15 -43 -1 31 33 -6 -19 -1 36 49 8
6062 8 -29 6 50 57 -23 -32 23 41 6 -22 -11 8 23 6 -5 -22 -2 15 9 -28 -38 -2 22 -5 -40 -33 16 14 -24 -30 -9 -3 0 0 -3 -29
6098 -29 -6 23 4 -20 -26 22 43 -2 -17 -1 44 40 2 -1 3 26 25 10 -15 -11 27 45 -3 -49 -13 24 35 -32 -43 -3 38 1 -43
6131 -43 -32 -7 15 7 -21 -53 -18 23 24 -47 -44 17 48 8 -54 -29 32 40 -7 -48 -9 39 35 -11 -25 -5 47 42 1 -46 -7 66 35
6164 35 -43 -41 32 66 8 -58 -26 31 41 -14 -51 -36 15 37 -12 -54 -37 24 32 -22 -64 -27 40 33 -41 -43 13 42 9 -39 -15 17
$$ packed form
5932EK2qk2j9ML7J0m0k8J5N1kn9j0L1L9j4k7oRJ7Oj8k6J7M1Om7j7L5L9j8n0RN2
5967C4J1k8l8LL7K0qk9k2K1M2j0p1J6M9L6o1o4M5N8k0m5l1M3M2rl8m1K2P0Qo8
5999b6m1M8P7k7p5j7P4M8m1n9J8O0J2l9l8J1L9M0m1o3NQ3K7q0m8M7P3j6p1j5M8
6030A3M2l1n5kL5L4j9n7j8N4N4l6p3LQ5J9n8m8L6O3j3m3k8M2L2Kl9j3J8L7J3m1
6062Hl7L5M4Pq0rN5J8l5k8J1J9J5j7j1j7K0J7ol7j0L6K4k7l5PM9kl8oK1OL%lk6
6098b9K3K9j9k4oM8K1m5j5J6M5ml8lMK3jj5k5ML8J8m8m6L6L7J1o7j1M0M1l7m4
6131d3J1K5K2qk8l2L5M1Jp1LO1L1m0o2K5O1Qm7m1L9M8mm6j4K0N2nm1m7L9P3l1
6164C5p8KP3L4n8o6L2N7J0n5l7J5N1K2m9m2J7O1Qn4m2L7O7pp4kN6K9l3m8K4L2
$$ plain form
6196 17 38 19 -7 -18 6 43 30 -22 -34 37 58 13 -23 3 46 22 -7 -17 3 30 9 -1 -10 -3 12 14 -3 -31 -27 13 15 -35 -43
6229 -43 -5 22 -3 -33 -26 1 -10 -12 -1 -9 -1 7 37 16 -10 -2 35 33 -10 -7 27 27 11 3 8 16 16 31 9 -20 -8 12 34 -3 -39 -4 44
6266 44 6 -33 -21 20 22 -16 -25 -20 9 14 0 -27 -40 4 32 4 -56 -28 35 35 -18 -56 -3 58 20 -30 -13 19 46 14 4 -10 10
6299 10 50 34 -15 -29 30 65 16 -52 -26 47 53 -20 -41 5 45 17 -38 -33 1 31 19 -34 -42 -18 36 18 -45 -56 14 52 4 -48
6331 -48 -28 45 43 -13 -36 1 33 23 -11 -25 -8 26 38 -4 -28 4 52 45 -18 -17 28 56 22 -23 -9 20 18 -9 -16 -9 17 7 1 -18
6365 -18 -26 -1 22 -7 -31 -13 14 -5 -36 -19 1 16 -14 -1 5 -11 -6 14 12 -3 -2 19 28 7 -22 -3 24 7 7 7 15 13 18 21 12 -20 -3
6402 -3 25 14 -12 -15 15 30 -8 -39 -11 20 -2 -17 -24 -20 -2 1 -15 -35 -21 12 27 -22 -54 -13 43 28 -40 -30 29 47 -4 -21 -6
6435 -6 36 33 5 -30 -12 22 50 17 -40 -19 49 39 -30 -51 3 45 15 -39 -43 22 39 -3 -33 -21 0 21 4 -35 -45 4 32 -9
$$ packed form
6196A7K1j9k6j1K4L7j3n2j2P1K1m5l6K6M3k4k9j0K0K7k1j0rPJ5Kj7k8MM0Kn0q
6229d3L8K7k5l0PK7j1kJ1qQQL0k1k6QL7km3LL4%j6qNQ%J5k2k9J2K0K2l7l6L5M8
6266D4l8l9J2M1Kl8rNK9Nj4k7j3M4K8k8o0K8O3%n3l8N3O1l8n0J7L2K7l2j0j4K0
6299A0M0j6m9j4N9L5m9o8K6P3Op3k1M6M0k8n5NL4L0j2n3qK4N4j8o3j1P0L8m8n2
6331d8K0P3kn6k3L7L2j0l4j4J7L4J2m2k4L2M8po3JM5K8l4m5J4K9kk7pPK6j0oj9
6365a8qK5K3k9k4J8K7j9l1J7K0J5l0J3Oj6NK0kj5JK1Rk1k9J9K7j7%%QkNLrl2J7
6402cK8j1k6lL0J5l8l1K8L1k2j5pMJ8Lj6k0J4L3J5m9l2M1N6j5o8J0N9J8n1j7J5
6435fM2lk8l5J8L4K8l3n7K1O8j0o9k1N4M2l0n4mO5J7m2l0J2K1K1j7l9j0M9K8m1
$$ plain form
6467 -9 -55 -38 38 33 -49 -59 -17 46 15 -45 -22 16 39 13 -12 -18 16 39 23 -13 -26 29 57 2 -35 -2 45 36 -20 -31 2 22
6499 22 6 -26 -18 -9 -5 -2 -23 -21 -15 7 9 -33 -36 9 23 -9 -33 -5 9 -2 -20 -18 8 -5 -3 14 6 2 -2 20 21 -2 -1 29 15 7 -2 17 11
6538 11 -8 12 17 3 -15 10 27 -1 -34 -19 10 -8 -31 -26 2 -4 -14 -22 -19 -4 -12 0 -9 -42 -24 11 11 -31 -43 9 28 -3 -38 -3
6572 -3 41 25 0 -24 13 22 10 5 -11 0 30 27 -7 -29 9 49 24 -35 -33 35 48 -8 -49 -6 36 12 -24 -32 -9 7 4 -26 -48 -26
6606 -26 21 16 -30 -48 -1 41 -3 -66 -48 17 28 -20 -30 -3 29 21 -3 -13 3 25 20 3 -28 -3 42 22 -24 -29 18 49 3 -35
6638 -35 -6 20 19 -16 -27 -6 -7 7 -11 -16 -22 3 14 -12 -38 -17 22 9 -26 -31 5 10 -11 -12 -2 10 2 -2 14 5 -1 10 17 11 3 11 22 -3
6676 -3 -17 3 17 3 -2 2 20 -3 -17 8 17 -7 -25 -6 15 -7 -31 -12 -8 2 -2 -14 -3 1 -8 -2 -18 -29 -4 22 -2 -28 -15 29 23
6711 23 -16 -33 10 17 8 -6 -3 21 29 17 4 -7 11 34 21 -20 -19 21 29 -6 -34 -9 36 15 -34 -28 1 26 -16 -35 -23 -9 8 -7
$$ packed form
6467im6J7P6nq2j0M2O3l1o0K3L8K3k6k5oL4K3j6l6j3N5K8n5l7L3M7rn6j1L3K0
6499B2j6l2QRMLk1KOK2Km2lM5J4l2k4K8J4j1j8KK6j3KJ7qmmK2Jk3JL0j4qrJ9o
6538A1j9K0Nj4j8K5J7k8l3J5K9j8k3NK8oj0qLJ5qJ2rl3J8L5%m2j2N2J9l1l5L5
6572cM4j6k5k4L7Rj2nj6J1L0ll4k2L8M0k5n9KO8J3n6m1M3M2k4l6qK3J6ll0k2K2
6606b6M7nm6j8M7M2m4o3J8O5J1m8j0K7L2qk4j0J6K2nj7l1K5M5k0m6nM7L1m6l8
6638c5K9K6jl5j1K1jJ4j8noK5J1k6k6K1L9j3l5nL6Nk1jJ0J2qmJ6roJ1PoqQJ1k5
6676cj4K0J4j4nMJ8k3j4K5Rk4j8J9K1k2k4J9MJ0mj2J1MrOj6j1K5K6k4k6J3M4o
6711B3l9j7M3Prj4LK4Qj2j3j1J8K3j3m1JM0Ql5k8K5M5k1m9OK9K5m2j9J2J4J7j5
$$ plain form
6745 -7 -24 -40 -1 29 10 -39 -27 18 36 -24 -40 -2 27 17 -35 -18 8 19 10 -8 -6 3 33 24 -5 -18 26 37 4 -36 -8 42 27
6778 27 -24 -28 11 18 -7 -13 -22 -11 -3 -12 -29 -35 -23 -6 -7 -34 -43 -8 6 -5 -31 -6 19 11 -28 -21 10 7 -7 2 12 0 9 19 12 -1 -3 29
6816 29 18 -10 -4 23 14 -11 -14 13 16 -23 -18 11 10 -18 -25 13 11 -9 -18 -9 -1 -11 -7 -15 -23 -17 -3 -1 -20 -24 -1 18 -7 -24 1 32 12 -23 -19
6855 -19 19 31 7 -4 12 15 20 8 2 -3 20 21 3 -23 -14 27 27 -23 -37 2 29 -4 -47 -25 18 7 -17 -21 -19 -6 5 -9 -35 -30 -3
6890 -3 18 -14 -44 -6 28 19 -34 -30 16 30 -6 -22 -15 28 18 2 -6 -7 25 18 9 -14 -4 24 21 -9 -39 3 23 5 -28 -15 15 9 -16
6925 -16 -29 -8 1 8 -7 -22 -22 -6 2 -11 -41 -31 14 4 -29 -31 -6 18 -13 -24 -2 5 -3 -9 -3 1 2 17 4 -10 -2 10 16 9 -2 9 13 -2
6963 -2 -18 -6 11 -1 -37 -8 6 15 -21 -19 -7 -6 -15 -15 -6 -23 -16 -11 -7 -26 -14 3 -8 -15 -21 14 5 -12 -25 14 36 3 -10 5 16 9 5 -2
7001 -2 -1 16 11 -3 2 -1 30 29 -5 -15 7 23 8 -16 -22 15 18 -17 -25 -17 16 -7 -24 -31 -17 6 -1 -14 -33 -19 24 6 -35 -26 15 24 -2
$$ packed form
6745gj7j6L9L0j9m9J2M5J8o0j6L8K9j0n2J7K6J1rj8KRL0rk9j3M4J1l3m0K8N0j5
6778B7n1mL9Pk5orJ1Qrj7oJ2J7jk7rL5J4j1k6K5K5ql9PL1lj4RJ0j2RJ0pj3kL2
6816B9j1k8OK7rk5lK7Ll9NK9jk8pL8kk0rRQj0MqqOJ4Kj9mK3J9k5j7K5L1k0l5M
6855a9L8J2k4j1J6LNj2onK3Jj8k6RM1%n0j4L9K7l3m3K2M3j1k4mKJ3J1j4k6NK7
6890cK1l2l0L8L4rn3MM6J4l6j6PM3j0j6qjL2prk3J0K8ll0l0M2K0j8l3J3L0ok5
6925a6j3K1RPj5j5%J6Qj3l0J0M5j0l3kK5K4l1j1K2PqoOMJJ5j3j4QJ2Opj1J1Mj5
6963bj6J2J7j2l6K9J4Rl6KJ2Jr%Rj7PNMj9J2J7j1poL5rj7j3L9K2l3j3J5J1pmp
7001bJJ7nj4NlL1jl4j0K2J6j5k4oL7Ll5qQL3k3j7pJ4K3pj3j9J4M3j8m1RM1Rk6
$$ plain form
7038 -2 -31 -13 35 26 0 -7 23 46 16 4 -6 9 31 36 5 -23 12 36 14 -22 -16 28 28 -11 -24 -3 13 1 -16 -14 -8 0 -2 -12 -20 -17
7074 -17 0 10 -25 -32 -7 15 3 -36 -13 23 10 -14 -17 11 27 7 9 19 17 19 11 6 -7 12 33 23 -5 8 11 21 -3 -31 10 5 -3
7109 -3 -19 -17 1 -18 -27 -11 -7 -16 -16 -14 -6 -21 -6 -2 -11 -8 -2 19 -11 -12 -9 13 6 -2 -6 11 15 3 -6 7 16 9 -6 11 9 9 8 16 -5 -2 23 11 -20
7152 -20 -13 20 24 -2 -30 -10 20 -6 -25 -17 -1 7 -12 -25 -18 -11 9 3 -21 -29 -3 11 -7 -35 -15 28 30 -21 -23 8 28 12 -19 1 15
7187 15 24 12 5 -5 13 17 11 -9 -20 18 22 0 -38 -5 27 3 -27 -16 11 5 -17 -34 -25 5 8 -8 -26 -24 -2 6 -8 -31 -20 4 7 -25
7223 -25 -30 6 17 6 -26 -12 20 7 1 0 5 14 18 13 4 2 16 15 5 -14 5 17 11 -12 -7 20 16 -10 -20 -10 4 -13 -28 -10 -15 -12 -11 -7 -9
7262 -9 -6 -8 -8 -19 -11 12 3 -20 -28 7 23 -6 -16 2 19 -1 -12 5 25 22 13 9 4 16 11 10 4 -10 8 15 6 -14 -6 16 15 -23 -25 3 15 -18
7302 -18 -21 -8 3 3 -16 -22 -19 -4 3 -4 -28 -24 13 9 -8 -29 0 19 12 -17 -2 22 26 -7 -14 6 20 19 8 4 3 15 23 -2 -13 8 27 10
$$ packed form
7038bk9J8M8rk6pL0K3l0j2j0J5K2Nl1k8L5K4k2l6OM4%l9j3K1J6j2j7KOQkj0qL
7074a7J7J0l5pK5K2j2l9K3L6j3k4lK8J6k0KJ0kKqnj3J9K1j0k8J3LJ0k4k8M1nq
7109cj6KJ8j9rJ6Mr%KQj5J5MrLOK1l0jLK2pqmJ7Mj2rJ3Rpj5J7k%jQk1LK5j2l1
7152b0PL3Mk6k8K0L0k6j9QJ6Qj9j3PPK0ok4qK6J4j8k8K0M3Kn1kL1K0j6l1K0J4
7187A5Rj2pj0J8Mok0j1L8Mk2l8L3L2k4l0J1K7ok2j7RL0Lj6j8KK2Qj4k3J1K4Ll2
7223b5nL6J1j1l2J4L2j3ojNRMnrkJ4jj0j9J9J2ok3NK7mk6j0J0J4j7j5J8nLJMk
7262iLk%j1QK3rk3qL5J6k9j0J8J7k0j1J7K0lrmnJ2njoj4J8Prk0QK2jl8kK8J2l3
7302a8lJ3J1%j9oLJ5Ppk4ML7mj7k1K9J9pk9J5K4Ml3pK0J4jj1mjJ2Qk5j1K1J9j7
$$ plain form
7340 10 -15 -16 14 32 -10 -51 -1 7 0 -24 -24 -2 -8 -14 -27 -27 -27 -2 3 -20 -35 -5 10 2 -36 -5 27 19 -19 -18 9 19 9 -4 6 11 7
7377 7 4 -8 -15 7 25 9 -10 -15 3 13 -5 -20 3 23 -2 -23 -20 2 0 -22 -21 -16 -8 -12 -11 -24 -17 -19 -4 -8 -29 -15 7 10 -20 -18 19 19 5
7416 5 -20 11 28 13 6 13 17 19 4 2 5 9 16 5 -16 -7 11 16 -12 -22 -1 15 1 -25 -8 13 0 -18 -28 -3 5 -10 -15 -24 -16 3 -6 -9 -25
7455 -25 -12 13 11 -20 -12 20 24 -7 -23 7 22 14 -12 -7 13 30 7 -3 2 17 22 14 -13 -23 0 26 1 -31 -15 18 26 -22 -28 -3 6 -15
7491 -15 -30 -26 -10 -11 -13 -16 -29 -9 19 1 -27 -13 4 22 -8 -17 6 21 5 -22 -7 22 25 1 2 -3 11 32 6 -8 5 8 13 3 -14
7526 -14 -5 22 7 -21 -18 8 10 -14 -23 -4 0 -3 -14 -7 -10 -8 -15 -18 -20 -14 10 -4 -9 -9 7 22 1 -22 9 27 7 -1 -9 6 18 -6 -5 14 10 17
7566 17 6 -2 -9 4 17 15 -16 -2 11 15 -10 -29 10 9 -13 -26 -10 8 -14 -21 -20 -4 -4 -15 -13 -13 -18 -1 2 -20 -21 0 22 -6 -17 -12 25
7603 25 14 -19 -14 13 30 13 -10 1 20 13 7 7 6 10 14 -5 -18 -4 14 21 -16 -30 2 19 1 -29 -7 7 8 -15 -22 -8 6 2 -15 -18
$$ packed form
7340A0k5jL0J8m2m1N0Qpk4%K2ooj3%%K5Nk3j5L0J5ql8L1L2ql8JK7J0j0j3J0Nm
7377Glj2pK2J8j6j9nJ8J0j8j5K3K0k5k1LK2kk2JNQmJj3PkJ5mk1J4K2Ll0KL7%j4
7416Ek5L1J7j5pPMKj5kLMPj1k1RJ8Nk8j0K1J6j4k6J7K1j3j8j0K5Qj5nrQJ9rlj6
7455b5J3K5kl1QL2Ml1j6L0J5qk6NK0J7k3j0NJ5Nqk7j0K3K6k5l2J6L3Qm8oK5Rk1
7491a5j5MJ6jklj3K0K8j8k8J4J7J8l0rK3J5j6k7J5K9Lk4JnJ4K1k6j4J3LNj0j7
7526a4RK7j5k8LK6Kk4rJ9Mlj1PlKplkOK4j4n%J6J5k1k3L1J8k0qqJ5J2k4JJ9mP
7566A7j1qpJ3J3kl1J4J3Mk5j9L9jk2j3J6J8k2pJJ6%j1K%nJ7Lk2jK1K2k8j1NL7
7603B5j1l3NK7J7j7k3J1J9po%jMMj9j3J4J8Pl7j4L2J7j8l0K2J4Jk3pJ4J4mj7l
$$ plain form
7639 -18 -20 8 11 -14 -26 -12 23 8 -27 -24 17 17 6 -20 13 23 16 -4 -7 8 24 24 4 -11 -10 20 21 -12 -22 12 24 1 -17 -14 10
7674 10 -5 -32 -26 -10 5 -6 -21 -20 -12 0 4 -10 -15 -14 3 6 -26 -13 12 25 -10 -13 11 20 14 -8 2 21 18 14 -5 10 19 8 11 5 12 16 8
7713 8 -3 -9 -2 22 -3 -22 -14 9 -5 -19 -31 -7 -1 -13 -24 -9 -2 -16 -4 -21 -4 -20 1 7 -25 -18 2 8 -7 -20 5 29 9 -11 8
7748 8 32 18 -15 -10 16 14 15 -1 -11 -1 17 15 -3 -15 -5 18 1 -23 -24 17 17 -29 -36 -10 6 1 -18 -26 -3 3 -10 -23 -17 -17 4 6 -30
7785 -30 -28 12 26 -9 -27 -7 31 28 -8 0 22 24 16 6 -2 11 19 14 -2 -14 4 23 2 -27 -5 18 12 -17 -30 5 6 -6 -36 -14 8
7820 8 -4 -10 -26 -4 7 0 -5 -20 -24 -2 6 -17 -28 2 20 2 -23 -19 27 29 5 1 11 30 9 -4 1 4 9 11 -2 -12 15 29 11 -8 -11
7857 -11 12 12 -17 -27 -5 19 -9 -22 -18 3 4 -17 -20 -5 3 -13 -13 -16 -12 -4 5 -6 -17 -3 29 15 -24 -4 21 25 -16 -10 2 27 21 -1 -2
7894 -2 24 20 16 5 -7 -3 18 9 -15 -14 15 36 -11 -32 -20 14 5 -33 -31 2 6 -16 -33 -20 -6 3 -13 -21 -22 2 20 -4 -23 -21 18 21 -16
$$ packed form
7639a8kK8Lk5j2J4L5j5l5LM1%j1k6L3J0pk0lJ5J6%k0j5JL0Jl3j0L4J2k3j8LK4
7674A0j5k7OJ6J5j1j5JQJ2Mj4nJJ7Ll2J3K5J3l5lK4Rok2J0J9lmj9J5Rj1LoPMq
7713Hj1oPK4k5j9QK3j4j4j2K4Oj2j1J5Pj4J2j7J7j6K1Ol2PK0Oj5j3K5K4k0k0J9
7748HK4j4l3NK6kJj6j0J0J8kj8j2J0K3j7k4jM1%m6pK6J6nj9qK3Oj3j3O%K1Kl6
7785c0KM0J4l5j8K0L8ll6QK2Kqj0qJ3Qnj6j2J8J9k1k9K2K3ok9j3L5Jj2l0K2K2
7820Hj2oj6K2J1pnj5mK2Qk3j1L0J8j8k5MM6Kk4mJ0J9k1j3NLNKj3j0K7J4j8j9l
7857a1K3%k9j0K2K4k8j3MK1Jk1lJ5Qj6%lMQRj1j1J4L2j4l9K0K5Mm1OJ2K5ok2j
7894bK6mmj1j2MK1rk4JK9K1m7k1J2L4rl8KL3Mk2j7J3J4Rj6qjK4J8k4j9KL9Ll7
$$ plain form
7931 -16 -24 17 29 17 -5 2 32 26 0 -10 6 13 13 7 -13 -18 12 27 -8 -28 8 30 14 -33 -31 16 9 -14 -34 -10 3 -7 -14 -31 -20
7966 -20 -7 -11 -19 -20 -10 16 16 -25 -18 10 26 14 -26 6 32 21 -1 2 25 20 9 4 2 9 5 18 -4 -9 -12 19 -1 -13 -10 19 5 -19 -17 -6
8004 -6 13 -20 -25 -4 -4 -7 -17 -15 -13 -14 -5 -4 -21 -8 -1 7 -20 -17 4 26 -1 -31 -4 37 17 -9 0 16 23 9 9 11 15 12 11 -6 -7 8 21 -3
8044 -3 -27 -17 23 16 -33 -38 -3 9 -1 -28 -20 3 2 -21 -19 -14 -6 10 -5 -12 -12 9 16 -3 -30 -9 21 4 -22 -29 20 30 1 -23 2 27
8080 27 26 9 -6 6 21 20 -3 -10 -13 21 20 -13 -31 6 24 1 -43 -21 21 0 -30 -33 -19 -4 -22 -23 -17 -20 6 3 -27 -32 -11 25 5 -15
8116 -15 -20 23 11 -14 -26 4 15 17 -15 10 13 9 4 0 5 4 25 9 -12 -16 8 17 -4 -37 -8 20 6 -17 -17 13 0 -16 -21 -13 -4 -13 -33 -19
8154 -19 -10 -10 -12 -14 -26 -16 18 10 -20 -17 23 20 -13 -15 9 32 4 -7 1 28 19 3 -10 4 9 13 -2 -11 -19 5 19 -5 -36 -13 17 3 -30
$$ packed form
7931a6qM1J2j2k2PL0ok6j0J6P%ok0nL0J5l5k0L6K2j6m7KM7pk3k0K4J3j0pj7J1
7966b0J3mqjJ0K6%m1PK8J6j2m0L2K6j1k2LK3nj1nkPmJ3k2nlL1k0j2LK9j4k4KJ1
8004fJ9l3nK1%lj0KKjRJj7J3PQk7LK1K2k7l0K7M1k0k6RJ6Pj4%KMljj7jJ5J3k4
8044ck4J0M0pm9nL5J2j0k7QK3jk3KNQJ6j5p%K1Pj9k7K1L0j7k6pM9J0k9k4K5K5
8080B7jj7j5J2J5jk3plL4jl3j8L7J8k3m4K2M2k1l0lJ4J5j8jOlK6ll0nK1L6k0k0
8116a5nM3j2k5j2L0J1Kl2K5LmnmNjK1j6k1mK4Rk1l3K9K8j4k3%L0j3j6nQRrk0J4
8154a9R%kkj2J0L4ql0LM0ll3kK4K3k8j1QK7rj6j3J4NMj5rqK4J4k4l1K3L0j4l3
8191c0
$$ Imaginary data points
##PAGE= N=2
##DATA TABLE= (X++(I..I)), XYDATA
$$ plain form
0 0 0 0 0 0 0 0 0 0 0 0 0 0 0 0 1 -8 8 -8 8 -8 16 -16 16 -24 24 -32 33 -40 48 -56 62 -72 80 -89 102 -113 129
37 129 -145 161 -177 199 -221 245 -272 299 -332 367 -404 444 -490 539 -595 655 -724 800 -885
56 -885 981 -1094 1225 -1378 1558 -1783 2067 -2435 2936 -3661 4812 -6915 12001 -50146 -6826
71 -6826 129591 30006 -91121 -63861 56334 62567 -9386 -48916 -20738 13166 40102 24117
83 24117 -35700 -62384 18247 86875 14267 -97566 -48738 86484 79311 -60176 -92458 24276
95 24276 86668 6522 -62724 -25494 30362 26262 1909 -11896 -24203 -12184 33778 37507 -30541
108 -30541 -58901 18416 72603 2 -76165 -19386 68521 34277 -52401 -39950 32707 34745
120 34745 -15854 -20482 6801 2201 -8042 13220 16623 -21578 -27075 23001 35080 -20277 -39021
$$ packed form
0@%%%%%%%%%%%%%%JrJ6j6J6j6K4l2L2m0M8n6O5p3Q8j04J18j34J52j69J91k15K42
37A29k74L06l38L76m20M66n17N71o31O99p71Q48r34J029j134J250j379J524j685
56h85J866k075K319k603K936l341L850m502N371o597Q473j1727J8916o2147M3320
71f826J36417r9585j21127K7260J20195O233p1953l9530K8178L3904K6936j5985
83B4117n9817k6684Q0631O8628p2608j11833M8828J35222p173j39487l2282J16734
95B4276O2392q0146o9246L7230N5856m100k4353j3805j2307J2019M5962L729o8048
108c0541k8360P7317N4187p2601p6167N6779Q7907l4244q6678J2451P2657K038
120C4745n0599m628K7283m600j0243K1262L403l8201n497N0076J2079n5357j8744
$$ plain form
133 -39021 16386 39430 -13151 -37209 11798 34096 -12153 -31063 13702 28457 -16452 -27353
145 -27353 19412 28409 -20695 -30919 18213 31670 -12781 -28024 7466 19525 -5708 -8036
157 -8036 10216 -2284 -20785 7328 34371 -4736 -46046 -4175 52265 16258 -51770 -28394
169 -28394 44278 37211 -31140 -39885 14854 34171 390 -20020 -10022 -331 10105 22138 1269
182 1269 -38512 -21488 43989 44447 -36640 -62705 19291 70914 2580 -66949 -22595 51804 35005
195 35005 -29782 -36648 6113 26795 13555 -7249 -24351 -17922 22906 42552 -8755 -59357
207 -59357 -14008 63557 38652 -53869 -57465 33678 64813 -9365 -58827 -11889 41560 24280
219 24280 -18242 -25373 -5497 15250 24197 3408 -33801 -26344 31937 47739 -19103 -61745 -857
$$ packed form
133c9021N5407K3044n2581k4058M9007K2298m6249j8910M4765J4755m4909j0901
145b7353M6765Q997m9104j0224M9132J3457m4451j5243L5490J2059k5233k328
157h036J8252j2500j8501K8113K7043l9107m1310M1871N6440l6007o8028K3376
169b8394P2672p067o8351q745N4739J9317l3781k0410R998R691J0436J2033k0869
182A269l9781J7024O5477M58q1087k6065Q1996N1623o8334o9529M4354P4399j6799
195C5005o4787o866M2761K0682j3240k0804j7102O429M0828J9646n1307n0602
207e9357M5349P7565k4905r2521l596R1143L1135p4178m9462M6938N3449j7280
219B4280m2522p131J9876K0747Q947k0789l7209P457N8281J5802o6842m2642O0888
$$ plain form
232 -857 64546 22115 -55229 -37962 36966 43607 -15580 -37625 -2480 22478 12449 -3092 -12868
245 -12868 -15556 4661 29228 9266 -35414 -25126 33384 38893 -24222 -46970 10963 47402
257 47402 2433 -40034 -11574 27558 13795 -14076 -8891 3772 -708 986 11364 -369 -20213
270 -20213 -4161 25345 10055 -26647 -15402 24912 18890 -21359 -19902 17329 18484 -13940 -14943
283 -14943 12555 10742 -13485 -7455 16010 6314 -18414 -7169 18971 8543 -17256 -8705 13952
296 13952 6187 -11078 -1163 10547 -4848 -13121 9804 18293 -12065 -24439 11095 30027 -6880
309 -6880 -33276 425 32841 6616 -28114 -12015 19467 13506 -8751 -9582 -1268 35 6968
322 6968 12886 -6186 -25553 -1188 34127 12987 -36154 -25668 31096 35594 -20269 -39624 6848
$$ packed form
232h57O5403m2431p7344J7267P4928O641n9187k2045L5145K4958j0029j5541r776
245a2868k688K0217K4567j9962m4680J0288N8510N509o3115k2748N7933L6439
257D7402m4969m2467K8460L9132j3763k7871N185J2663m480J694J0378j1733j9844
270b0213J6052K9506j5290l6702J1245M0314o022m0249J457L7231J155l2424j003
283a4943K7498j813k4227O030K3465r696k4728J1245K6140j0428k5799Q551K2657
296A3952p765j7265R915J1710j5395q273K2925Q489l0358j2374L5534J8932l6907
309f880k6396L3701L2416k6225l4730J6099L1482n961k2257q31Q314J303O933
322F968N918j9072j9367K4365L5315k1140m9141J0486N6764M498n5863j9355M6472
$$ plain form
335 6848 36538 5627 -26804 -13920 12252 15399 3772 -8962 -17152 -4433 23843 21195 -21856
348 -21856 -36696 11702 46489 3677 -47598 -19516 39817 31044 -25589 -34932 9152 30419
360 30419 5376 -18581 -14387 2100 15435 14856 -8247 -28075 -5347 34093 21511 -31605 -35902
373 -35902 21333 44247 -6526 -44043 -7926 35809 17814 -22298 -20600 7472 16049 4971
385 4971 -5510 -12010 -7941 12310 20781 -6561 -30115 -3444 33860 14893 -31259 -24526 23204
398 23204 29322 -12562 -27991 2774 21472 3541 -11779 -4825 1870 1287 5676 5519 -9294 -13118
412 -13118 9011 19542 -5853 -23660 911 24593 4063 -22472 -7475 18312 8232 -13808
424 -13808 -6499 10311 3035 -8740 972 9419 -3818 -11322 4836 12934 -4416 -13230 3718
$$ packed form
335F848K9690l0911l2431J2884K6172L147j1627j2734q190J2719K8276k648m3051
348b1856j4840M8398L4787m2812n1275K8082N9333q773n6633r343M4084K1267
360C0419k5043k3957M194J6487J3335n79k3103j9828K2728L9440j2582n3116m297
373c5902N7235K2914n0773l7517L6117M3735j7995m0112J698K8072Q577j1078
385D971j0481o500M069K0251Q471k7342k3554K6671L7304j8967m6152O733M7730
398B3204O118m1884j5429L0765J8698j7931j5320O954O695n83M389j57j4813l824
412a3118K2129J0531k5395j7807K4571K3682k0530k6535J4997K5787j0080k2040
424a3808P309J6810p276j1775R712Q447j3237p504J6158Q098j7350q814J6948
$$ plain form
437 3718 12226 -3666 -10477 4691 8636 -7049 -7806 10024 8529 -12659 -10626 14063 13510 -13747
451 -13747 -16462 11375 18413 -7058 -17838 2187 14181 1436 -7993 -2234 729 -610 5610
464 5610 6870 -8977 -15081 7936 22573 -2931 -27254 -4590 27813 12609 -23853 -18814 16114
477 16114 21145 -6461 -18353 -2283 10915 7779 -361 -8217 -10786 2967 19369 6689 -22775
490 -22775 -17940 20091 27387 -12433 -32532 1965 31875 8295 -25508 -15338 15221 17191 -3667
503 -3667 -13304 -6156 4611 11948 7010 -11975 -18540 6143 26750 3733 -29490 -14775 26162
516 26162 23731 -17943 -28131 7185 26621 2824 -19772 -9320 9658 10853 1165 -7125 -10042
529 -10042 -741 14877 10756 -14503 -20054 9402 26200 -1333 -27729 -7337 24346 13919 -17318
$$ packed form
437C718Q508j5892o811J5168L945j5685p57J7830j495k1188K033K4689n53k7257
451a3747k715K7837P038k5471j0780K0025J1994j2745r429N759K963j339O220
464E610J260j5847o104K3017J4637k5504k4323K2664L2403j5204l6462N039L4928
477A6114N031k7606j1892J6070J3198l136q140p856k569J3753J6402j2680k9464
490b2775M835L8031P296l9820k0099L4497K9910k3580l3803J0170L0559J970k0858
503c667r637P148J0767P337m938j8985o565K4683K0607k3017l3223J4715M0937
516B6162k431m1674j0188L5316J9436k3797k2596J0452J8978J195r688q290k917
529a0042R301J5618m121k5259n551K9456J6798k7533k6396K0392L1683j0427l1237
$$ plain form
542 -17318 -16497 8890 14515 -1694 -8945 -2590 1593 3238 5723 -433 -11149 -4610 13670 10316
556 10316 -13068 -15014 10101 17675 -5874 -17730 1723 15231 877 -11291 -1293 7241 -356
569 -356 -4310 3171 2983 -6131 -3216 8354 4404 -9248 -5540 9104 6080 -8423 -5750 7817
583 7817 4740 -7699 -3398 8347 2272 -9730 -1972 11246 2689 -12282 -4318 12111 6170 -10430
597 -10430 -7319 7455 6871 -4024 -4320 1553 202 -920 4565 2668 -8573 -6456 10661 11307 -10156
612 -10156 -15902 7036 18732 -2223 -18922 -3065 16066 7190 -10631 -8728 3904 6871 2341
625 2341 -1745 -6159 -5412 6521 12848 -3065 -18361 -3185 20442 10497 -18518 -16709 13078 20008
639 20008 -5658 -19396 -1753 14768 7060 -7243 -8735 -1359 6157 8757 130 -12952 -8408
$$ packed form
542a7318Q21K5387N625j6209p251O355M183J645K485o156j0716O539J8280l354
556A0316k3384j946K5115P574k3549j1856J9453J3508j4354j2168R998Q534p597
569c56l954P481j88r114K915J1570l950j3652L708J4644l024j4503K673J3567
583G817l077j2439M301J1745o075j2002P758J3218q557j4971P964J6429n941j6600
597a0430L111J4774n84j0895k96N873j351j122N485j897j1241K117J7117O46k1463
612a0156n746K2938J1696k0955j6699J5857J9131q876j7821J903J2632K967m530
625B341m086m414P47J1933O327j5913j5296J5176K3627r945k9015J809K9787O930
639B0008k5666j3738J7643J6521p708j4303j492P376P516K600q627j3082M544
$$ plain form
652 -8408 12869 16464 -8577 -21973 1422 23458 6419 -20599 -12654 14297 15493 -6422 -14269
665 -14269 -944 9304 5865 -1922 -7148 -5954 4608 12360 993 -15707 -7971 15323 14421 -11467
679 -11467 -18483 5535 19134 682 -16312 -5316 11038 7157 -4857 -5949 -687 2122 4179
692 4179 3199 -4990 -8543 3200 12605 430 -14454 -4733 13846 8464 -11078 -10385 7303 10121
706 10121 -3732 -7908 1417 4598 -839 -1249 1921 -1359 -4059 2512 6350 -2402 -8062 1483 8889
721 8889 -272 -8736 -614 7855 823 -6742 -197 6021 -875 -5915 1934 6424 -2552 -7302 2397
736 2397 7998 -1487 -7916 293 6734 409 -4806 -152 2652 -1247 -863 3736 201 -6616 -993
751 -993 9169 3159 -10517 -6058 10263 8908 -8267 -10825 4848 10879 -1022 -8751 -2003 4774
$$ packed form
652h408K1277L595k5041j3396K3395K2036j7039k7018P945K6951J196k1915p847
665a4269J3325J0248l439p787n226J194J0562P752j1367j6700P736K3294r02k5888
679a1467p016K4018J3599j8452j6994J0996J6354l881j2014j092N262K809K057
692D179r80q189l553J1743R405j2175j4884R721J8579n382j9542O93J7688K818
706A0121j3853m176R325L181n437m10L170l280k700O571L838q752n660R545P406
721H889r161q464Q122Q469p032p565O545O218o896n040P849M490q976m750R699
736B397N601r485o429Q209O441o325n215M654K804l899L84M599l535o817N623
751i93J0162o010j3676M459J6321j355j7175k558J5673O031j1901p729O748O777
$$ plain form
765 4774 3199 32 -2079 -4474 -1363 7296 6268 -7556 -11216 5191 14801 -914 -16036 -4072
779 -4072 14514 8417 -10473 -10696 4947 10076 419 -6692 -4267 1277 5476 4790 -3686 -9953 -749
794 -749 12711 6511 -12347 -11840 9167 15376 -4064 -16108 -1509 13773 5924 -9001 -7872 3135
808 3135 6875 2287 -3230 -5932 -2233 6839 8033 -4771 -12564 459 14603 4747 -13799 -9305
822 -9305 10483 12045 -5652 -12060 790 9469 2682 -5139 -3969 251 2884 3967 225 -6486
836 -6486 -4415 6708 8405 -4917 -11105 1789 11944 1617 -10818 -4282 8200 5440 -4968
849 -4968 -4776 2194 2818 -518 -147 180 -2518 -1094 4394 2789 -5211 -4629 4905 5935 -3955 -6491
865 -6491 2730 6197 -1759 -5209 1400 4009 -1793 -3092 2656 2725 -3505 -2876 4065 3366 -4107 -3813
$$ packed form
765D774j575l167k111k395L111Q659j028j3824l660J6407R610j5715j5122J1964
779d072J8586o097j8890k23J5643N129r657p111K425N544M199o86q476o267R204
794g49J3460o200j8858N07K1007O209j9440j2044J4599J5282p849j4925J129J1007
808C135L740m588n517k702L699R072J194j2804p793J3023J4144r856j8546M494
822i305J9788J562j7697o408J2850Q679o787p821J170M220K633J083l742o711
836f486K071J1123J697j3322o188J2894J0155j0327j2435O536J2482k760j0408
849d968J92O970O24l336L71L27k698J424N488j605q000N82R534J030r890k536
865f491R221L467p956l450O609K609n802j299N748O9o230O29O941o99p473K94
$$ plain form
881 -3813 3525 3761 -2723 -3065 2137 1787 -2159 -347 2872 -919 -4236 1494 5988 -1089 -7535 -254
897 -254 8286 2118 -7897 -3903 6342 5037 -3890 -4840 1264 3234 735 -434 -1405 -2797 483
912 483 5574 1814 -7216 -4995 7135 8106 -5350 -10214 2352 10695 1068 -9289 -3886 6224
926 6224 5253 -2262 -4586 -1573 2004 4159 1915 -4829 -6190 3337 9621 -118 -11287 -3935 10705
941 10705 7643 -8076 -9897 4155 10082 -5 -8002 -3149 4236 4455 221 -3523 -4183 623 6655
956 6655 3407 -6995 -7477 5196 10409 -1904 -11452 -1887 10366 5020 -7591 -6657 3886 6403
970 6403 -323 -4294 -2170 1002 3042 2637 -2057 -5610 -305 7258 3348 -7251 -6196 5690 8036
985 8036 -3189 -8404 557 7283 1462 -5095 -2278 2513 1835 -199 -240 -1241 -1924 1581 4014 -844
$$ packed form
881c813P338K36o484l42N202l50l946J812L219l791l317N730M494p077o446P281
897b54Q540o168j0015L994J0245j305q927r50O104J970k499j169r71j392L280
912D83N091l760r030K221J2130R71j3456m864J2566Q343r627j0357N403J0110
926F224r71p515k324L013L577K155k244o744j361R527O284r739j1169P352J4640
941A0705l062j5719j821J4052N927j0087p997M853P385K19m234l744o60M806O032
956F655l248j0402m82J2673N213j2313r548R565J2253n346j2611R34J0543K517
970F403o726l971K124L172K040m05m694l553N305P563l910j0599J055J1886K346
985H036j1225n215Q961O726n821o557K817M791o78k034m1j001o83L505K433m858
$$ plain form
1001 -844 -5497 -512 6079 2035 -5731 -3176 4696 3584 -3434 -3226 2397 2285 -1932 -1116 2066 135
1017 135 -2643 418 3387 -414 -3869 100 3947 290 -3593 -439 2971 160 -2330 549 1969
1032 1969 -1556 -2163 2486 2849 -3021 -3837 2917 4840 -2164 -5386 924 5204 405 -4145 -1263 2459
1048 2459 1353 -537 -393 -1064 -1392 1834 3605 -1468 -5649 18 6892 2074 -7010 -4247 5839
1063 5839 5867 -3678 -6325 1091 5370 1163 -3178 -2375 251 2156 2650 -494 -4684 -2182 5309 5145
1079 5145 -4417 -7525 2233 8702 577 -8319 -3251 6453 4983 -3558 -5208 464 3884 2002 -1281
1094 -1281 -3223 -1903 2842 4872 -964 -6785 -1823 7177 4694 -6050 -6882 3727 7807 -932 -7192
1109 -7192 -1636 5176 3145 -2377 -3267 -483 1970 2727 410 -3723 -3160 3276 5571 -1663 -6954 -607
$$ packed form
1001h44m653M985O591m044p766K555P872j112p018K08N623j12m217Q16L182j931
1017A35k778L061K969l801l455L969L847l657l883L154L410k811k490K879J420
1032A969l525o07M649L63n870q16O754J923p004l222O310M280m799m550K882L722
1048B459j106j890J44o71l28L226J771n073m181N667O874m818r084K763J0086
1063E839K8r545k647P416M279m207m341Q03K626J905M94l144m190K502P491j64
1079E145r562l108R758O469q125q896N068R704j470q541j650N672L420j882l283
1094a281j942J320M745K030n836n821M962R000k483j0744q32J0609M080q739o260
1109g192N556O812k031n522q90K784K453P57k317m133N63O436K295p234n291O347
$$ plain form
1125 -607 7065 2789 -5970 -4327 3989 4765 -1796 -4006 8 2338 918 -274 -808 -1663 -189 2982
1141 2982 1780 -3361 -3342 2871 4507 -1801 -4943 574 4656 447 -3768 -957 2569 767 -1552
1156 -1552 -61 943 -882 -809 1738 1112 -2314 -1665 2431 2166 -2139 -2357 1721 2170 -1377 -1687 1301
1173 1301 1062 -1576 -521 2197 339 -2928 -632 3419 1218 -3500 -1895 3093 2404 -2245 -2450 1204
1189 1204 1830 -354 -663 70 -717 -408 2007 1419 -2791 -2828 2800 4258 -2006 -5227 626 5420 915
1206 915 -4735 -2230 3234 2819 -1290 -2396 -562 986 1753 1047 -1969 -3179 1109 4874 630 -5630
1222 -5630 -2762 5211 4664 -3751 -5756 1634 5757 557 -4537 -2205 2391 2812 121 -2119 -2332 332
1238 332 3626 2053 -3688 -4399 2550 6129 -514 -6652 -1737 5933 3609 -4217 -4534 1938 4269 255
$$ packed form
1125f07P672m276q759J643Q316P76o561k210M014K330j420j192n34q55J474L171
1141B982j202n141J9O213J636o308l142N517M082m209m215K811L526j802k319
1156a552J491J004j825P3K547o26l426O49M096k65m305k18M078M49l547l10K988
1173A301k39k638J055K718j858l267K296M051k201m718J605M988o89m649k05L654
1189A204O26k184l09P33p87L09K415n88m210l7N628J458o264l221N853M794m505
1206I15n650K505N464m15m109j106J834J548P67p06l016j210M288L765m244o260
1222e630K868P973n47q415k005P390M123n200n094K332M596M21k691k240k13K664
1238C32L294j573n741p11O949L579o643o138M915P670k324p826l17O472K331m014
$$ plain form
1254 255 -2875 -1779 685 2152 1643 -1397 -3545 -252 4493 2307 -4352 -4189 3192 5354 -1438 -5532
1270 -5532 -358 4721 1759 -3152 -2318 1285 1917 374 -699 -1376 -952 1519 2546 -870 -3747 -335
1286 -335 4154 1673 -3816 -2726 2884 3203 -1741 -3005 701 2238 -84 -1155 63 79 -574 632
1302 632 1348 -903 -2149 710 2708 -236 -2881 -297 2628 589 -2162 -578 1649 206 -1334
1317 -1334 349 1320 -916 -1633 1264 2123 -1233 -2555 870 2725 -345 -2511 -167 1898 359 -1069
1333 -1069 -160 229 -538 302 1540 -323 -2562 -191 3320 1142 -3528 -2220 3091 3122 -2083 -3494
1349 -3494 782 3133 428 -2068 -1172 522 1144 1081 -312 -2288 -1146 2750 2834 -2319 -4250 1122
1365 1122 5037 499 -4902 -2099 3846 3176 -2176 -3355 313 2551 1208 -950 -1956 -1061 1678
$$ packed form
1254B55l130J096K464J467n09l040k148L293M745k186o659J63P381K162o792m094
1270e532N174N079k962m911Q34L603O32j543j073o77M24K471J027l416k877L412
1286c35M489k481n489J090N610L19m944j264L706J537k322j071J218J6o53J206
1302F32P16k251j246K859J998k944k645K584K925k039k751J584K227j443j540
1317a334J683R71k236p17K897Q59l356j322L425J855l070k166K344K065j539j428
1333a069R09L89p67Q40J238j863k239K371L511k178m670J308N311L1n205j411
1349c494M276K351k705k496Q96J694O22o3j393j976J142L896Q4n153j931N372
1365A122L915m538n401K803N945o70n352j179L668K238j343k158j006Q95K739
$$ plain form
1380 1678 2903 -502 -4113 -1285 4343 3127 -3623 -4544 2102 5134 -265 -4722 -1425 3388 2424
1395 2424 -1500 -2485 -472 1530 1956 137 -2615 -2107 2214 3788 -995 -4761 -712 4780 2368 -3934
1411 -3934 -3517 2419 3856 -708 -3259 -682 1937 1399 -251 -1257 -1307 359 2379 1044 -2671 -2481
1427 -2481 2187 3517 -1184 -3946 13 3712 1003 -2902 -1543 1764 1447 -713 -817 8 -153 206
1443 206 1140 71 -1905 -698 2225 1410 -2099 -1962 1646 2155 -1112 -1997 633 1522 -454 -917 616
1460 616 417 -1062 -170 1565 284 -1933 -590 2089 1011 -1888 -1313 1409 1284 -855 -911 457 239
1477 239 -372 519 679 -1173 -1343 1459 2200 -1252 -2904 616 3246 258 -3058 -1101 2348 1604 -1247
1494 -1247 -1544 90 827 749 328 -1047 -1670 664 2839 315 -3494 -1661 3357 2906 -2543 -3741 1238
$$ packed form
1380A678J225l405l611K828N628j216o750r21O646L032n399m457L297M813r64
1395B424l924r85K013K002M26j819k752N08M321J574m783l766M049N492k412o302
1411c934M17N936J437m564k551K577K619n38j650j006n0J666K020j335l715J90
1427b481M668J330m701k762L959L699k709l905J359L307l17k160j04Q25j61L59
1443B06R34j069j976J207K923q15l509J37L608N09l267q85K630Q89j976m63J533
1460F16j99j479Q92J735j281k217J343K679j078k899N75K722j25k139n6J368k18
1477B39o11Q91J60j852j70K802P41l452j652L520K630k988l316J957L449p44k851
1494a247k97J634P37p8m21j375o23K334K175k524l809J833N018m51n449j198M979
$$ plain form
1511 1238 3881 223 -3215 -1403 1846 1926 -133 -1543 -1397 417 2384 1222 -2547 -2921 1800 4194
1527 4194 -386 -4661 -1296 4215 2722 -3001 -3494 1297 3424 394 -2381 -1583 713 1899 1109 -1324
1543 -1324 -2588 2 3385 1693 -3243 -3220 2273 4216 -831 -4357 -688 3683 1855 -2383 -2341 776
1559 776 1973 639 -890 -1477 -584 1588 2049 -965 -3119 -153 3546 1470 -3210 -2514 2336 3043
1575 3043 -1181 -2923 86 2214 626 -1103 -750 -41 280 890 564 -1272 -1517 1138 2303 -567
1591 -567 -2701 -168 2624 819 -2135 -1125 1490 1054 -870 -616 488 -28 -473 636 796 -1013
1607 -1013 -1262 1036 1704 -773 -1923 370 1848 38 -1414 -187 848 14 -318 514 47 -1170
1623 -1170 -126 1815 553 -2209 -1230 2156 1889 -1693 -2302 930 2257 -107 -1743 -531 805 707
$$ packed form
1511A238K643l658l438J812L249Q0k059j410J46J814J967j162l769l74M721K394
1527D194m580m275L365N511j493n723m93M791K127l030k775P98K296J186p90k433
1543a324j264K590L383j692m936K3N493J943n047l526L669M371j828m238M2L117
1559G76J197j334j529n87Q93K172M61l014k154K966L699k076m680O96M850P07
1575C043m224j742L009K128j588j729L53P09L21O10l26j836k45K655J165k870
1591e67k134K533K792j805k954J010K615m36j924K54J104n16m45J109J60j809
1607a013k49K298O68k477j150K293J478j810j452J227J035q34l32Q32m67j217
1623a170J044J941j262k762R79L386k67l582o09L232J327k364j636J212J336r8
$$ plain form
1639 707 299 -311 -1234 -561 1730 1724 -1633 -2815 931 3533 201 -3610 -1397 2993 2289 -1834 -2586
1656 -2586 453 2150 793 -1031 -1468 -451 1411 1929 -567 -2955 -781 3275 2258 -2778 -3461 1609
1672 1609 4026 -130 -3788 -1268 2774 2140 -1262 -2243 -376 1505 1647 -116 -2206 -1539 1912 2997
1688 2997 -873 -3854 -572 3950 2074 -3196 -3116 1889 3466 -348 -2985 -921 1805 1611 -252 -1519
1704 -1519 -1207 663 2221 665 -2480 -2056 2016 3144 -1002 -3628 -251 3394 1357 -2543 -1967 1357
1720 1357 1926 -207 -1285 -616 251 864 887 -536 -1763 -225 2174 1139 -2059 -1913 1525 2334 -780
1737 -780 -2264 83 1809 364 -1082 -348 380 -4 118 606 -258 -1215 49 1665 393 -1780 -870
1754 -870 1565 1180 -1117 -1183 648 888 -301 -337 284 -249 -584 684 1136 -778 -1721 509 2131 27
$$ packed form
1639G07m08o10r23O73K291ol357j182L746K602l332l811K213M390p04m123p52
1656b586L039J697j357j824m37J017J862N18k496k388K174M056j017n036o83N070
1672A609K417m156l658K520M042o34l402r81J867J881J42j763k090O67L451J085
1688B997l870k981L282M522j876n270Q0N005J577l814k637K064K726j94j863j267
1704a519L12J870J558j556l145M24M072J128m146k626L377L645k037l900N76L324
1720A357N69k133j078O69Q67O13K3j423j227J538K399j035l198J46L438Q09l114
1737g80j484K347J726j445j446P34P28l84J22M88q64r57J264J616j272k173R10
1754h70K435l85k297o6J831K40j189l6O21n33l35J268M52j914r43K230J622k104
$$ plain form
1772 27 -2209 -652 1876 1122 -1225 -1217 405 862 242 -137 -546 -794 366 1646 291 -2148 -1217 2151
1790 2151 2154 -1581 -2775 659 2890 380 -2410 -1229 1429 1575 -187 -1273 -924 398 1625 850
1806 850 -1687 -2123 1089 3095 37 -3406 -1316 3035 2400 -2045 -2965 707 2835 589 -1956 -1484
1822 -1484 594 1679 858 -1123 -2047 -22 2610 1429 -2429 -2734 1568 3500 -268 -3555 -1028 2922
1838 2922 2025 -1701 -2346 326 1949 888 -903 -1539 -436 1500 1708 -808 -2599 -304 2870 1546
1854 1546 -2444 -2490 1518 2898 -401 -2679 -610 1943 1237 -844 -1257 -265 740 1061 190 -1356 -1196
1871 -1196 1140 2035 -480 -2482 -400 2382 1145 -1853 -1579 1103 1572 -334 -1128 -174 431 301 349
1888 349 8 -881 -557 1081 1159 -907 -1625 492 1806 43 -1586 -445 1129 540 -589 -313 170
$$ packed form
1772B7k236J557K528p54k347QJ622M57o20l79m09k48J160J280j355k439R31L368
1790B151Ll735j194L434K231k510k790J181K658J46j762j086L49J322J227p75
1806H50k537m36L212K006l058l443K090M351o35m445r20L672K128k246k545M72
1822a484K078J085q21j981r24K025K632j181l858l05M302J932l768l287K527L950
1838B922q97l726o45K672J623j061j791o36J103J936K08k516j791K295L174j324
1854A546l990m6M008J380l299k278K069K553p06k081m13R92J005L21q71j546J60
1871a196K336Q95k515k002K082K782j237k998K74K682M69j906p94R54O05j30M8
1888C49l41q89L24J638P8k066p18K117J314j763j629J141J574n89j129K76M83
$$ plain form
1905 170 -149 -18 716 153 -1178 -591 1353 1140 -1168 -1528 744 1679 -174 -1475 -339 945 560
1922 560 -211 -375 -467 -165 849 914 -854 -1681 439 2252 332 -2328 -1146 1965 1769 -1172 -1971 264
1940 264 1698 590 -901 -1055 -174 963 1219 -316 -1906 -684 2094 1782 -1679 -2649 749 3018
1956 3018 403 -2713 -1382 1862 1942 -669 -1882 -514 1202 1375 -26 -1626 -1261 1199 2286 -257
1972 -257 -2839 -981 2693 2115 -1928 -2837 764 2893 453 -2313 -1357 1250 1749 67 -1424 -1191
1988 -1191 527 1850 699 -1845 -1860 1263 2700 -238 -2941 -908 2558 1805 -1650 -2208 536 1998
2004 1998 445 -1269 -1081 200 1110 871 -615 -1604 -267 1875 1216 -1600 -1978 926 2329 -95
2020 -95 -2172 -665 1585 1053 -790 -1013 31 592 476 111 -587 -842 313 1367 226 -1527 -817
$$ packed form
1905A70l19J31P34n63j331N87J944k13k308l60K272R35j853j301J136J284l85
1922E60p71j64r2L02J014O5j768q27K120J813j920k660J182L111j96k941p99K235
1940B64J434j108j491j54Q81J137K56j535j590J222K778l12l461r70L398K269
1956C018k615l116J331L244Q0k611j213J368J716J73j401j600L65K460J087k543
1972b57k582J858L674n78m043r09L601K129k440k766R56K607M99j682j491K33
1988a191J718J323j151k544j5L123J437k938k703K033L466p53l455n58K744J462
2004A998j553j714J88J281R10k39j486r89J337K142o59k816l78K904J403k424
2020i5k077J507K250n32j843k23J044N61j16l65o98k55J155J054j141j753P10
$$ plain form
2037 -817 1348 1277 -886 -1427 347 1260 101 -795 -277 239 116 251 288 -502 -818 409 1286 -52 -1510
2056 -1510 -442 1413 859 -1018 -1074 493 954 33 -501 -334 -116 281 749 133 -1151 -748 1211 1396
2074 1396 -867 -1854 266 1980 466 -1658 -1016 998 1245 -155 -995 -574 372 1010 535 -966 -1407
2091 -1407 467 2025 394 -2160 -1305 1788 2041 -1004 -2330 -1 2088 873 -1343 -1389 322 1364
2107 1364 751 -783 -1497 -177 1748 1279 -1392 -2189 588 2630 469 -2490 -1440 1806 2042 -763
2123 -763 -2088 -291 1561 1119 -571 -1403 -529 1136 1502 -350 -2025 -686 2005 1696 -1424 -2333 510
2140 510 2476 462 -2048 -1239 1241 1551 -251 -1333 -649 649 1166 274 -1187 -1158 740 1816 57
2157 57 -1994 -880 1732 1540 -1061 -1812 294 1661 408 -1108 -789 363 769 365 -352 -846 -285
$$ packed form
2037h17K165p1k163n41J774R13j159q96N18N16j23J35L7p90l16J227Q77j338j458
2056a510J068J855n54j877n6J567M61r21n34J67K18L97M68o16j284M03J959J85
2074A396k263r87K120J714j514k124O42K014K47j400q40M21R46O38m75j501m41
2091a407J874J558j631k554Q55L093K53l045j326K329K089j215k216m6J711J042
2107A364o13j534p14J320J925m69k671p97K777K042k161k959J050L246K36k805
2123g63j325J797J852m42j690q32Q74J665L66j852j675J339K691l09l120r09K843
2140E10J966k014k510Q09K480L10j802j082O84J298N17q92j461K9J898J076j759
2157E7k051J114K612j92k601p51K106J367j253j516L19J152M06m04p17m94N61
$$ plain form
2174 -285 974 966 -710 -1440 204 1625 405 -1397 -826 952 1002 -369 -827 -76 404 306 161 -223 -653
2193 -653 -162 926 645 -864 -1084 554 1317 -101 -1264 -343 927 596 -397 -531 -99 208 451 331
2211 331 -479 -879 216 1305 289 -1406 -873 1175 1315 -661 -1481 37 1289 532 -750 -831 27
2228 27 716 665 -239 -1084 -461 1181 1212 -832 -1789 142 1972 646 -1695 -1296 1055 1578 -224 -1443
2246 -1443 -571 862 1068 26 -1110 -923 674 1582 112 -1818 -994 1584 1774 -905 -2160 24
2262 24 2054 819 -1475 -1354 618 1477 325 -1063 -1083 255 1387 666 -1202 -1518 582 2003 267
2279 267 -2035 -1139 1573 1757 -766 -1899 -115 1586 837 -887 -1174 2 1055 822 -499 -1332 -309
2296 -309 1386 1121 -1017 -1705 355 1889 413 -1630 -1036 1041 1313 -305 -1158 -349 682 739 15
$$ packed form
2174b85J259qj676p30J644J421j220j802N71J778N0j371m58P51M80r8j45l84m30
2193f53M91J088k81j509k20J638P63j418j163R21J270l31r93j34M32L07K43j20
2211C31q10m00J095J089j016j695N33K048J40j976q20J518J252p57j282q1Q58
2228B7O89n1r04q45O23J642L1k044r57J931J830j326k341L99K351N23j802j219
2246a443Q72J433K06j042j136J87J597R08j470j930Q24K578J90k679j255K184
2262B4K030j235k294J21J972Q59j152j388k0J338J132p21j868l16K100J421j736
2279B67k302Q96K712J84k523j133J784J701p49j724k87J176J053k33j321q33J023
2296c09J695k65k138o88K060J534j476k043N94K077K72j618q53Q09J031N7p24
$$ plain form
2313 15 -759 -704 405 1174 186 -1261 -767 1052 1236 -575 -1404 1 1231 457 -779 -654 229 563
2331 563 255 -172 -529 -334 533 831 -222 -1128 -226 1135 674 -885 -963 445 997 21 -733 -366 260
2350 260 433 247 -210 -628 -218 787 753 -631 -1161 229 1364 322 -1190 -763 794 991 -200 -886
2368 -886 -336 487 684 148 -682 -792 330 1213 268 -1319 -894 1093 1421 -542 -1622 -147 1442 758
2386 758 -915 -1075 202 1027 523 -606 -1033 -111 1167 901 -862 -1490 249 1788 524 -1628 -1220
2403 -1220 1103 1632 -310 -1592 -453 1161 1005 -400 -1141 -434 893 1133 -226 -1463 -600 1354
2419 1354 1341 -839 -1802 74 1843 697 -1433 -1262 713 1429 100 -1140 -760 523 1102 272 -989
2436 -989 -998 522 1456 180 -1526 -906 1201 1423 -581 -1591 -101 1380 696 -828 -957 145 886
$$ packed form
2313A5p74N5J109P69r88j447M94J819J84j811q29J405J230p74j236J25Q83L34
2331E63l08m27l57J95Q67K98j053r06R02J361m61j559p8J408N52r76p54L67O26
2350B60J73j86m57m18M10J005l4j384n30J390J135j042j512M27J557J97j191o86
2368h86N50Q23J97n36q30j10J122Q83r45j587M25J987L28j963j080J475J589o84
2386G58j673j60J277Q25n04j129m27R22J278k66j763o28J739J539j264k152M08
2403a220K323N29j942j282J139J614j56j405p41P07J327K40j359j237Q63J954
2419A354j3k180r63J876J769j146k130J71J975P16j329j240L80J283N79q30j261
2436i89rJ520R34j276j706O20K107K22k004j010J490J481o84j524j29J102P41
$$ plain form
2453 886 490 -452 -867 -168 931 795 -627 -1244 112 1379 481 -1159 -919 703 1102 -144 -971 -336
2471 -336 555 579 7 -506 -483 198 783 297 -797 -764 534 1071 -99 -1112 -346 884 660 -449 -722
2490 -722 -34 503 375 -69 -492 -400 346 803 34 -959 -495 865 907 -502 -1091 60 1029 412 -672
2509 -672 -667 172 651 342 -352 -696 -164 789 704 -573 -1142 109 1309 467 -1137 -929 702 1184 -118
2528 -118 -1084 -449 700 816 -72 -831 -556 520 1030 51 -1182 -703 989 1252 -465 -1502 -171 1399
2546 1399 770 -944 -1134 299 1160 385 -791 -851 172 1046 533 -812 -1097 307 1416 372 -1343
2563 -1343 -1008 917 1408 -288 -1442 -380 1126 865 -544 -1050 -147 867 755 -346 -1058 -301 1020
2580 1020 932 -631 -1318 57 1415 575 -1119 -1027 596 1192 33 -998 -537 541 808 64 -743 -621
$$ packed form
2453H86l96r42m15O99J099j36j422o17J356J267q98j640K40J622L99j246q27O35
2471c36Q91K4n72n13K3O81N85m86j094L3J298N37j170j013P66J230k24j109k73
2490g22O88N37j28m44m23R2P46M57p69r93M64J360M2j409n89J151R69o17j084
2509f72NQ39M79l09o94l44N32R53q5j277n69J251J200q42j604K08J631M82j302
2528a18r66O35J149J16q88p59K75J076N10r79j233M79J692K63j717j037J331J570
2546A399o29j714j90J433Q61p75j176o0J023Q74n13j345k85J404J109j044j715
2563a343L35J925M91j696j154J062J506k61j409n06R03J014j12j101p12P57J321
2580A020q8j563o87J375J358q40j694R2J623N96j159j031M61J078K67p44q07J22
$$ plain form
2598 -621 385 980 166 -991 -699 756 1080 -274 -1173 -234 1020 653 -567 -810 66 695 364 -333
2616 -333 -612 -141 590 608 -319 -894 -114 930 541 -713 -847 333 920 109 -739 -441 364 560 93
2635 93 -405 -447 88 636 350 -562 -748 276 968 157 -903 -546 638 784 -216 -772 -206 542 532 -83
2655 -83 -568 -384 374 733 37 -862 -514 730 918 -365 -1109 -139 1008 584 -645 -840 157 823 358
2674 358 -529 -727 21 814 534 -597 -959 160 1168 389 -1057 -889 682 1178 -116 -1147 -429 817
2692 817 808 -282 -903 -321 692 819 -203 -1031 -423 924 966 -513 -1265 -46 1271 630 -943 -1035 379
2711 379 1130 218 -887 -690 368 900 231 -803 -780 389 1089 200 -1082 -750 774 1127 -261 -1221
2729 -1221 -294 1007 740 -529 -925 -15 803 515 -417 -790 -109 797 620 -511 -982 31 1048 459
$$ packed form
2598f21J006N95q14j157K92J455L24j354q99R39J254l67j220k43Q76O29l31o97
2616c33k79M71P31J8r27n75P80J044l89j254j34J180N87q11q48K98Q05J96m67
2635I3m98m2N35N48k86r12j86J024O92q11j060L57J184J46j000n56N66P48j0o15
2655h3m85J84P58L59o96q99L48J244J88j283p44R70J147m24j229j95R97O66m65
2674C58q87j98P48P93k80j131l62J119J008p79j446J68J571M96j294j031P18J246
2692H17rj090o21N82J013J27j022q28O08J347M2j479p52J219J317o41j573r2J414
2711C79P51r12j105J97J058N32o69j034K3J169P00q89j282L32J524L53j388r60
2729a221R27J301k67j269l96R10Q18k88r32l73O81R06j77j131m71J013J017n89
$$ plain form
2747 459 -857 -837 461 981 26 -866 -445 498 660 -20 -609 -441 314 698 105 -749 -560 516 870
2766 870 -127 -927 -309 769 619 -395 -726 -31 605 390 -253 -546 -150 472 538 -182 -740 -199 719 604
2786 604 -478 -836 103 846 299 -630 -577 254 642 173 -454 -511 104 643 336 -511 -710 194 889 217
2806 217 -832 -617 544 858 -133 -851 -305 609 612 -181 -691 -298 502 673 -113 -835 -374 731 809 -377
2826 -377 -1028 -104 993 563 -678 -864 203 893 306 -645 -667 180 801 341 -640 -775 238 1005 272
2845 272 -933 -744 607 1047 -106 -1052 -389 798 759 -351 -868 -190 702 625 -289 -839 -223 767 685
2864 685 -456 -991 -34 1016 510 -781 -861 340 971 160 -799 -551 411 768 92 -678 -544 361 810
2883 810 110 -808 -570 564 869 -163 -959 -289 774 656 -393 -781 -52 663 433 -331 -626 -103 592
$$ packed form
2747D59j316K0J298N20r55q92M21R43J62o80n89J68P55L84n93q54J89J076L54
2766H70r97q00O18J078j50j014l31O95O36k15o43k93L96O22O6p20n58N41R18j15
2786F04j082l58R39P43n47r29N3Q31L88m69o27n7O15N39l07q47j99R04O95o72
2806B17j049K15J161L14r91p18N46R14Lp93n10L93Q00J71p86p22M61J105P8j186
2826c77o51R24J097m30j241j86J067O90n87r51k2Q47O21m60r81j35J013P67p33
2845B72j205J89J351M40j153r46O63J187l9j110n17O78Q92p7r14n50O16R90q2
2864F85j141n35R57J050n06j291q0J201O31q11r59K48R62L57o76p70J34R05M49
2883H10p00r18K38J134L05j032p96O70J063j18j049l88P29P15k30p64k95N23O95
$$ plain form
2902 592 494 -325 -739 -65 768 457 -565 -724 218 813 182 -643 -490 320 613 89 -501 -398 221 583
2922 583 175 -536 -504 328 735 62 -709 -411 533 643 -185 -694 -174 538 457 -190 -553 -198 432 510 -136
2943 -136 -669 -233 607 586 -334 -795 -41 777 424 -522 -650 161 696 246 -481 -543 123 661 323 -499 -643
2964 -643 177 817 241 -727 -634 454 843 -29 -827 -380 589 666 -182 -715 -249 554 599 -171 -754 -269 656
2985 656 655 -334 -875 -84 860 499 -626 -795 201 848 259 -646 -587 273 727 191 -616 -593 300 822 163
3006 163 -762 -587 505 850 -83 -891 -338 695 671 -300 -762 -148 640 518 -294 -693 -115 655 534 -366
3026 -366 -772 -47 794 438 -580 -718 231 810 189 -655 -510 341 646 87 -566 -427 292 622 94 -615
$$ packed form
2902E92r8q19m14O74Q33l11j022j59R42N95o31q25J53Q10K93n24n90J03O19L62
2922E83m08p11L2Q32M07o73p71K98R44J10q28n09N20P12q1o47l63L55O30P8o46
2943a36n33M36Q40k1r20m61P54Q18l53r46j28Q11N35m50p27o2O66N38l38q22j44
2964f43Q20O40n76r68R3J088L89q72p98M47R69P7q48n33M66Q03M5p70n83M85R25
2985F56jr89n41P91R44l61j125j69R96O47n89r05N9Q60M54n36q07K3Q93N22o59
3006A63r25J75J092L45r33q08N53J033k4r71m62O14P88j22q12l99N78P70j21r00
3026c66m06P25Q41l56j018j38R49N79o21q44J45Q51L05n59o53J39P19L30n28p09
$$ [...]
8191b0
##END NTUPLES=NMR FID
##END=
