##TITLE=1H_LY-D.M.A.A.PER3
 CDCl3,8 sc, 
 3.9.2021
##JCAMPDX= 6.0         $$ Bruker NMR JCAMP-DX V2.0
##DATA TYPE= NMR FID
##DATA CLASS= NTUPLES
##ORIGIN= UXNMR, Bruker Analytische Messtechnik GmbH
##OWNER= root
$$ XWIN-NMR		Version 3.5
$$ Fri Sep  3 10:03:45 2021 Russian Standard Time (UT+4h)  she@DPX200
##.OBSERVE FREQUENCY= 200.1313
##.OBSERVE NUCLEUS= ^1H
##.DELAY= (6, 6)
##.ACQUISITION MODE= SIMULTANEOUS
##.ACQUISITION SCHEME= undefined
##.AVERAGES= 8
##.DIGITISER RES= 18
##SPECTROMETER/DATA SYSTEM= spect
##.PULSE SEQUENCE= zg30
##.SOLVENT NAME= CDCl3
##.SHIFT REFERENCE= (INTERNAL, CDCl3, 0, 15.7039)
##AUDIT TRAIL= $$ (NUMBER, WHEN, WHO, WHERE, WHAT)
$$ ##TITLE= Audit trail, XWIN-NMR		Version 3.5
$$ ##JCAMPDX= 5.01
$$ ##ORIGIN= Bruker BioSpin GmbH
$$ ##OWNER= she
$$ F:/spectra/data/she/nmr/H-F/1/audita.txt
$$ ##AUDIT TRAIL=  $$ (NUMBER, WHEN, WHO, WHERE, WHAT)
(   1,<2021-09-03 10:02:44.18 +0400>,<she>,<DPX200>,
      <created by zg, POWCHK disabled, PULCHK disabled
       configuration hash MD5:
       00 E9 B6 7A A2 85 ED C7 34 08 36 98 17 FE 4E 26
       data hash MD5: 16K
       06 1F 2A A0 7E C6 B7 0F 66 87 20 3D 67 EB E5 01>)
$$ ##END=
$$ 
$$ hash MD5
$$ C7 76 36 71 87 28 B6 7E 99 7E 1A B7 62 C0 7D D7
##$RELAX= 
##$RELAX= 
##$RELAX= 
##$RELAX= 
##$RELAX= 
##$RELAX= 
$$ Bruker specific parameters
$$ --------------------------
##$DU= <F:/spectra>
##$EXPNO= 1
##$NAME= <H-F>
##$PROCNO= 1
##$TYPE= <nmr>
##$USER= <she>
##$AMP= (0..31)
100 100 100 100 100 100 100 100 100 100 100 100 100 100 100 100 100 100 
100 100 100 100 100 100 100 100 100 100 100 100 100 100 
##$AQSEQ= 0
##$AQ_mod= 1
##$AUNM= <au_zg>
##$AUTOPOS= <>
##$BF1= 200.13
##$BF2= 200.13
##$BF3= 200.13
##$BF4= 200.13
##$BF5= 200.13
##$BF6= 200.13
##$BF7= 200.13
##$BF8= 200.13
##$BYTORDA= 1
##$CFDGTYP= 0
##$CFRGTYP= 5
##$CHEMSTR= <none>
##$CNST= (0..31)
1 1 145 1 1 1 1 1 1 1 1 1 1 1 1 1 1 1 1 1 1 1 1 1 1 1 1 1 1 1 1 1 
##$CPDPRG= <>
##$CPDPRG1= <>
##$CPDPRG2= <>
##$CPDPRG3= <>
##$CPDPRG4= <mlev>
##$CPDPRG5= <mlev>
##$CPDPRG6= <mlev>
##$CPDPRG7= <mlev>
##$CPDPRG8= <mlev>
##$CPDPRGB= <>
##$CPDPRGT= <>
##$D= (0..31)
0 1.2 0 0 0 0 0 0 0 0.06 0 0.03 0 0 0 0 0.0002 0 0 0 0 0 0 0 0 0 0 0 0 
0 0 0 
##$DATE= 1630648963
##$DBL= (0..7)
120 120 120 120 120 120 120 120 
##$DBP= (0..7)
150 150 150 150 150 150 150 150 
##$DBP07= 0
##$DBPNAM0= <>
##$DBPNAM1= <>
##$DBPNAM2= <>
##$DBPNAM3= <>
##$DBPNAM4= <>
##$DBPNAM5= <>
##$DBPNAM6= <>
##$DBPNAM7= <>
##$DBPOAL= (0..7)
0.5 0.5 0.5 0.5 0.5 0.5 0.5 0.5 
##$DBPOFFS= (0..7)
0 0 0 0 0 0 0 0 
##$DE= 6
##$DECBNUC= <off>
##$DECIM= 32
##$DECNUC= <off>
##$DECSTAT= 4
##$DIGMOD= 1
##$DIGTYP= 9
##$DL= (0..7)
0 120 120 120 120 120 120 120 
##$DP= (0..7)
150 150 150 150 150 150 150 150 
##$DP07= 0
##$DPNAME0= <>
##$DPNAME1= <>
##$DPNAME2= <>
##$DPNAME3= <>
##$DPNAME4= <>
##$DPNAME5= <>
##$DPNAME6= <>
##$DPNAME7= <>
##$DPOAL= (0..7)
0.5 0.5 0.5 0.5 0.5 0.5 0.5 0.5 
##$DPOFFS= (0..7)
0 0 0 0 0 0 0 0 
##$DQDMODE= 0
##$DR= 18
##$DS= 0
##$DSLIST= <SSSSSSSSSSSSSSS>
$$ [...]
##$SUBNAM2= <"">
##$SUBNAM3= <"">
##$SUBNAM4= <"">
##$SUBNAM5= <"">
##$SUBNAM6= <"">
##$SUBNAM7= <"">
##$SUBNAM8= <"">
##$SUBNAM9= <"">
##$SW= 20.0189088683792
##$SWIBOX= (0..15)
0 0 2 0 0 0 0 0 0 0 0 0 0 0 0 0 
##$SW_h= 4006.41025641026
##$TD= 16384
##$TD0= 1
##$TE= 0
##$TE2= 300
##$TE3= 300
##$TEG= 300
##$TL= (0..7)
0 120 120 120 120 120 120 120 
##$TP= (0..7)
150 150 150 150 150 150 150 150 
##$TP07= 0
##$TPNAME0= <>
##$TPNAME1= <>
##$TPNAME2= <>
##$TPNAME3= <>
##$TPNAME4= <>
##$TPNAME5= <>
##$TPNAME6= <>
##$TPNAME7= <>
##$TPOAL= (0..7)
0.5 0.5 0.5 0.5 0.5 0.5 0.5 0.5 
##$TPOFFS= (0..7)
0 0 0 0 0 0 0 0 
##$TUNHIN= 0
##$TUNHOUT= 0
##$TUNXOUT= 0
##$USERA1= <user>
##$USERA2= <user>
##$USERA3= <user>
##$USERA4= <user>
##$USERA5= <user>
##$V9= 5
##$VALIST= <valist>
##$VCLIST= <CCCCCCCCCCCCCCC>
##$VD= 0
##$VDLIST= <DDDDDDDDDDDDDDD>
##$VPLIST= <PPPPPPPPPPPPPPP>
##$VTLIST= <TTTTTTTTTTTTTTT>
##$WBST= 1024
##$WBSW= 4
##$XGAIN= (0..3)
0 0 0 0 
##$XL= 0
##$YL= 0
##$YMAX_a= 55065
##$YMIN_a= -56415
##$ZGOPTNS= <>
##$ZL1= 120
##$ZL2= 120
##$ZL3= 120
##$ZL4= 120
##$ABSF1= 10
##$ABSF2= 0
##$ABSG= 5
##$ABSL= 3
##$ALPHA= 0
##$AQORDER= 0
##$ASSFAC= 0
##$ASSFACI= 0
##$ASSFACX= 0
##$ASSWID= 0
##$AUNMP= <proc_1d>
##$AZFE= 0.1
##$AZFW= 0.1
##$BCFW= 1
##$BC_mod= 2
##$BYTORDP= 1
##$COROFFS= 0
##$CY= 11.3945322036743
##$DATMOD= 1
##$DC= 2
##$DFILT= <>
##$DTYPP= 0
##$F1P= 2.36226072786647
##$F2P= -0.459571619588291
##$FCOR= 0.5
##$FTSIZE= 0
##$FT_mod= 4
##$GAMMA= 1
##$GB= 0.15
##$INTBC= 1
##$INTSCL= 1
##$ISEN= 128
##$LB= 0.24
##$LEV0= 0
##$LPBIN= 0
##$MAXI= 10000
##$MC2= 0
##$MEAN= 0
##$ME_mod= 0
##$MI= 1.114404
##$NCOEF= 0
##$NC_proc= 0
##$NLEV= 6
##$NOISF1= 3.799351
##$NOISF2= 2.8
##$NSP= 1
##$NTH_PI= 0
##$NZP= 0
##$OFFSET= 15.70392
##$PC= 1
##$PHC0= -13795.38
##$PHC1= 14.20097
##$PH_mod= 1
##$PKNL= yes
##$PPARMOD= 0
##$PSCAL= 0
##$PSIGN= 0
##$REVERSE= no
##$SF= 200.130013532006
##$SI= 16384
##$SIGF1= 3
##$SIGF2= 2
##$SINO= 400
##$SIOLD= 16384
##$SREGLST= <1H.CDCl3>
##$SSB= 0
##$STSI= 0
##$STSR= 0
##$SW_p= 3612.71676300578
##$SYMM= 0
##$S_DEV= 0
##$TDeff= 0
##$TDoff= 0
##$TI= <>
##$TILT= no
##$TM1= 0
##$TM2= 0
##$TOPLEV= 0
##$USERP1= <user>
##$USERP2= <user>
##$USERP3= <user>
##$USERP4= <user>
##$USERP5= <user>
##$WDW= 1
##$XDIM= 8192
##$YMAX_p= 0
##$YMIN_p= 0
$$ End of Bruker specific parameters
$$ ---------------------------------
##NTUPLES= NMR FID
##VAR_NAME=  TIME,          FID/REAL,        FID/IMAG
##SYMBOL=    X,             R,               I
##VAR_TYPE=  INDEPENDENT,   DEPENDENT,       DEPENDENT
##VAR_FORM=  AFFN,          ASDF,            ASDF
##VAR_DIM=   8192,          8192,            8192
##UNITS=     SECONDS,       ARBITRARY UNITS, ARBITRARY UNITS
##FACTOR=    0.0002496,     1,               1
##FIRST=     0,             0,               0
##LAST=      2.0444736,     0,               0
##MIN=       0,             -56415,          0
##MAX=       2.0444736,     55065,           0
$$ Real data points
##PAGE= N=1
##DATA TABLE= (X++(R..R)), XYDATA
0@%%%%%%%%%%%%%%%%%%%%%%%%%%Pj5J6j6J6j6J6j6J7k5L2l2L2l6M4m8M9n7O4p0
$$ 0 0 0 0 0 0 0 0 0 0 0 0 0 0 0 0 0 0 0 0 0 0 0 0 0 0 0 7 -8 8 -8 8 -8 8 -8 9 -16 16 -16 16 -20 24 -24 25 -32 32 -38
46c8P8q5R4j04J13j23J38j53J68j86K08k31K58k95L38l89M56n43O66q55J166j778
$$ -38 40 -45 49 -55 58 -65 73 -80 88 -98 110 -121 137 -158 180 -209 247 -296 370 -485 681 -1097
68a097L403j5398m3323L9704N9829o353n5456j9691L2214L0391n485k0085j3417
$$ -1097 2306 -13092 -56415 -16711 43118 36765 -18691 -38382 -6168 24223 18738 -1347 -14764
81a4764k284J3662K5688L139l6434k9667K9121N1998n473n9823k3548M8721M5582
$$ -14764 -17048 -3386 22302 25441 -10993 -40660 -11539 40459 34986 -24837 -48385 336 45918
94D5918k4353n1132k168L9885J8860j8812j9820m87O849Q594J1577k159k5157
$$ 45918 21565 -29567 -31735 8150 27010 8198 -11622 -12109 -5260 3334 14911 12752 -12405
107a2405j5010K6458L4229j4400m6186o001M5394K5841l2507l7019J3874L6080
$$ -12405 -27415 -957 33272 18872 -27314 -33315 12079 37920 5413 -31606 -17732 18348
119A8348K081k5556r058J2285N921l439L426L082j2669j0520J6336K1344j2308
$$ 18348 20429 -5127 -14185 -1900 4021 582 4008 7090 -5579 -16099 237 21581 9273
132I273l0173K330L3070R316k9319j8207K1258K1857j2718k0586O968J6984n047
$$ 9273 -20900 -18570 14500 23816 -5503 -23710 -2452 19405 6687 -13899 -6931 10053 5006
145E006j4115N715J3799o526j5700N661J8048k841j9206p45J8636L597j7220n111
$$ 5006 -9109 -3394 10405 3879 -11821 -6160 11888 9047 -10159 -10904 7732 11329 -5891 -11002
159a1002J6290N968j6677p620J7817J1206j8020j6599J5531K2112r624k5175J520
$$ -11002 5288 11256 -5421 -13041 4776 15982 -2038 -18637 -3106 19006 9382 -15793 -14273
172a4273K3850N904j8278r477J0919P710n660j966N682m004j1459N767K0250p53
$$ -14273 9577 15481 -2797 -12274 -1355 6355 695 -1271 4411 407 -11052 -5285 14965 14212
186A4212k7127j0235K7577K3055j9891l2009O314L2825P762k4956j6277J2087
$$ 14212 -12915 -23150 4427 27482 7591 -24418 -18104 14721 22483 -2473 -18750 -6663
198f663J5694n43o924l779m962j521J3076J3903j2184k7010J358L3804J5226l0013
$$ -6663 9031 8488 1564 -2215 -7177 -8698 4378 18281 6097 -20913 -19555 14249 29475 -538
212e38l0297J6343L7050J648l2479j6101J8829K0904k915j4458p393P02P003J2624
$$ -538 -30835 -14492 22558 24206 -8273 -24374 -5545 15359 12444 -2014 -9407 -8705 -1702 10922
226A0922M017j8041j9993J1747L2725M124l5331k2671K5837L5490q067l6917j0101
$$ 10922 14939 -3102 -23095 -11348 21377 25501 -9830 -32501 -6664 28826 20759 -16158 -26259
239b6259K6735K0750j0301j9649m146Q433R521O397l498j6628j0666J6561K5630
$$ -26259 476 21226 10925 -8724 -12870 -4437 5084 11481 7983 -8645 -19311 -2750 22880
252B2880n631l3760j1395L0831K6885j7999l4147J050L0499J2637j8548j7510
$$ 22880 17249 -16511 -27906 2925 29810 11811 -22336 -21286 9213 21850 3302 -14208
264a4208M558J2499M622j296m881r626l424J4314J5733j0003k5670j580K8212
$$ -14208 -9650 2849 7471 6175 1294 -8332 -11756 2558 18291 8288 -17382 -18962 9250
277I250J5238k2051k4981J0044K6996K408k1354j0086J1602J0547k891m981o26
$$ 9250 24488 2437 -22544 -12500 14496 16904 -4450 -14536 -2934 7613 4722 -259 -885
290h85k713k239P919R520p684j7128J850K1194O966j9796j4928J3733J8999n892
$$ -885 -3598 -5837 2082 11602 3918 -13210 -11360 9834 16800 -2996 -17924 -4191 14808 8916
304H916j8344m12J4344L220r781k571P107K16p285J570R545j271j2165j187J3469
$$ 8916 -9428 -9840 4504 7724 -2057 -4628 2479 2695 -4590 -3020 6525 5254 -6911 -8098 5371
319E371M767j2868p907J0805R811q471j0510O708J0877n610j1698M468J3077k412
$$ 5371 10138 -2730 -10637 168 9979 1508 -9002 -2294 8583 2973 -8725 -4257 8820 6408
333F408j4328p82J4328M419j2428p154R108P799n800o223M196L641n307j965Q453
$$ 6408 -7920 -8702 5626 10045 -2383 -9537 -429 7370 1570 -4653 -457 3184 -2123 -4088 4365
348D365L137j1823p514J2828J3768r854j9137L123K0891N050j7712j1407J0761
$$ 4365 7502 -4321 -11835 993 14761 4907 -14230 -11107 9784 14834 -2878 -14285 -3524
361c524J3124l099r658j561L009R34L017M743m728j2503M32J8047Q573j7891j8420
$$ -3524 9600 6501 -3157 -4718 -1709 -775 2242 6985 2257 -10246 -9814 8233 16806 -1085 -19505
376a9505J1142K4582k02k3973j0411J6728J6115o202j4610k607P099N488K201
$$ -19505 -8363 16219 16017 -7956 -18367 -1639 14476 8274 -6336 -8943 -1844 3644 5845
389E845j135q161q114P206J7391R01k1684j2699J8161K2873p838k6679n002K2338
$$ 5845 4710 -3451 -11565 -4359 13032 13933 -7751 -20450 -2289 20584 12746 -13933 -18935 3403
403C403J4767j1968j7370N43J2166O477k273n936o854j670J0291J2262n866k0294
$$ 3403 18170 6202 -11168 -10625 1541 8018 5745 -191 -7045 -8715 1576 13838 7972 -12322
417a2322m668K1419J6570j4648k4364K822K4604Q860j7499j5354O730J4349K403
$$ -12322 -16990 4429 20999 6351 -18013 -15191 9413 18273 774 -14580 -7850 6499 8902
430H902p168n683j915J936P858O514p440j5045O15J9141R517j6640j8223Q456
$$ 8902 1734 -3949 -5864 -3928 3930 10444 3004 -12041 -11426 7715 17232 592 -17631 -9175
444i175K1766J698j8903r446J1497J1868l428q722j503K495J290L020L348m746
$$ -9175 12591 14289 -4614 -14060 -2563 9305 5877 -2845 -4348 -1853 -563 2457 5805 1059
458A059r562J672J3916M798j4070j1633R813J5922l116j6041l173J2532O710p563
$$ 1059 -8503 -6831 7085 11883 -2187 -13820 -4007 11915 8799 -7242 -10415 2117 8827 1264
472A264o646L600M136k339j195L759k35o486q28Q755L791r179p241P496R761m572
$$ 1264 -5382 -1782 2354 15 -1180 2579 2344 -4142 -4970 3785 7576 -1603 -8844 -1348 8413 3841
488C841j0580J647R943L71q779j316P940J732p728k349P805L584p583n094O514
$$ 3841 -6739 -5092 4851 5222 -3557 -4873 3067 4799 -2929 -5278 2527 6111 -1472 -6566 -52
503e2O286m856o563L283N932k564n052K987M919m014o223M530Q759l392j1416
$$ -52 6234 1378 -5185 -1902 4030 1466 -3586 -599 4320 306 -5917 -1387 7372 3980 -7436
518g436K38J2670M213j1470q251P819J0203l116r158o18N694J694j790M85l63
$$ -7436 -7198 5472 9685 -1785 -10036 -2217 7986 4870 -4288 -4906 788 2482 692 1177 814
533H14m614q68Q290N379r136j1243N903J5660N94j6263p767J2333J2578n505j2876
$$ 814 -3800 -4668 3622 9001 -135 -11378 -5475 10185 10779 -5484 -13251 -918 11660 6155 -6721
548f721j216Q752M710k498l381k566j808L455Q133N57j1918p833J0726J4986m564
$$ -6721 -7937 815 5525 3027 -354 -2920 -4728 -1273 6860 7417 -4501 -12334 -1608 13378 8814
563H814j8477m124J6464J1616r770j4618J430J2090M692n612n892j323J847N058
$$ 8814 -9663 -13787 2677 14293 4523 -10095 -8665 3425 8117 2505 -3387 -4710 -2863 2195
577B195N079l460j1158k924J2988J1124r195j7206J148J8250P641j3713j3346
$$ 2195 7274 3814 -7344 -10268 2720 13844 4649 -12557 -11409 6841 14482 769 -12577
590a2577N713J3690J972q974n840J920M409L639J191m769p783Q31J1761O287j0889
$$ -12577 -6864 6826 8798 -176 -6016 -4096 313 3952 5143 374 -7409 -6578 5183 11470 581
605E81j3144N332J6569K457j5059r078R494J1895k643j0113k374N194L542K2p05
$$ 581 -12563 -7231 9338 11795 -3264 -12342 -2848 9047 6404 -3709 -6083 -889 2653 2675 1970
620A970k796m219J649Q470K804r771q412P228J2643j987j3587l715J1057P578
$$ 1970 -826 -5045 -3396 5074 7878 -1893 -10305 -3077 9566 7579 -6008 -9723 1334 8912
634H912o533q278K168O211J61l018K71N71k650k76N303K260o638n455N829Q361
$$ 8912 2379 -5899 -3731 2480 2641 -377 -106 465 -2185 -2461 2842 5102 -1536 -6991 -1162 7199
650G199l204r702j08R158K803p340m089N272M110l942l516L611L179l885l506
$$ 7199 3995 -5707 -5815 3343 6146 -1194 -5283 -11 4099 157 -3359 252 3431 -454 -3960
665c960M036M459l632n427K579N914j363n769N08N334k32n197K60N717M1o694
$$ -3960 76 4535 903 -4524 -1945 3969 2606 -3163 -2655 2679 2447 -2750 -2490 3227 3268 -3426
681c426j259P480L386p253n831N601P574k888p745Q5O281J569l912j312J925n70
$$ -3426 -4685 2795 6181 -1072 -6903 -1302 6272 3384 -4361 -4276 2005 3574 -338 -1650 275 -295
697b95j659K921L511m060o781K822R900P50j1000n503R175R431m902j0698j60
$$ -295 -1954 967 4478 418 -6363 -3541 6359 7109 -3891 -9394 -219 9212 4310 -6388 -6548
712f548Q797L731m671m243M34J608J603K661k27o076m077O539R216l314j2608
$$ -6548 2249 5980 1309 -2934 -2500 -892 711 3372 3145 -2931 -7008 -469 8747 5433 -7175
727g175k483J2369Q398q359j1800K229J1248L272p183n668J703M108K342L78k753
$$ -7175 -9658 2711 11109 2750 -9050 -6821 4427 7699 516 -5152 -3449 659 3001 3379 626
742F26n378o93Q021O429o681j1629J571J3768N124j1577j0531N987J2289M80r820
$$ 626 -4752 -5445 2576 9005 2324 -9305 -7734 6034 11158 -419 -10950 -4963 7326 7806 -2014
757b014m920M553N519O99k232l331k927J907P175K859q152q616N046J2593Q42
$$ -2014 -6934 -2381 3138 3837 1605 -1726 -4653 -2746 4429 7288 -864 -9480 -4434 8159 9001
772I001j2821o951R163J0656l358j0499j962O966M473k096l357j526m14K057M584
$$ 9001 -3820 -10771 -1608 9048 5690 -4809 -6771 195 4668 2572 -785 -2311 -2725 -668 3916
787C916O81o771n269N752R410j869j1104l148R612P159n780q592J466P212J483
$$ 3916 4597 -2174 -7443 -1691 7719 5850 -5254 -8402 1210 8369 2589 -6003 -4537 2675 4158
802D158m178k006J281K63OK382R72m291l587M313O482k373q220p45Q078L705o307
$$ 4158 -20 -2026 -745 -482 -476 1906 2878 -1413 -5000 -687 5795 3422 -4798 -5543 2535 6240 -67
819f7n365L811N460j779m432Q67L230j102k654J832L028k262m033J906N010q01
$$ -67 -5432 -1621 3839 2060 -2372 -1505 1725 623 -2031 -199 2829 567 -3466 -1560 3450 2649
835B649n439n30N164J564m478k087L920K206l751k391L875L073l915m174L311
$$ 2649 -2790 -3320 1844 3408 -1070 -3157 763 2969 -782 -3173 702 3775 -140 -4314 -1003
850a003N341j966n908J73N497J382m226k021K721J476j813k19K168q58l682P91
$$ -1003 4338 2372 -3536 -3363 2134 3516 -710 -2731 -10 1466 -347 -566 1602 744 -2938 -2147
866b147N554Q61o738l631O222O471l880q055N08P561K525n213l895K122L049J74
$$ -2147 3407 4268 -2470 -6101 121 6592 2712 -5343 -4835 2726 5251 38 -3857 -1735 1314 1488
882A488n36l89k190j666L477M971k292p832j139Q647N407o679q628K641R284J800
$$ 1488 952 563 -1627 -3293 184 5155 2863 -4969 -6108 2539 7946 1267 -7361 -4720 4564 6364
898F364p134m659L256M722M23k201j981j490O50M194K886m298o842J521R125L048
$$ 6364 -770 -5429 -2173 2549 2972 771 -1210 -2700 -2050 2144 5030 732 -6110 -4589 4536 7584
914G584q463p368M972R509k00q530l808N096N274r29l756j919K60K007L296O54
$$ 7584 -879 -8247 -3275 6234 6034 -2496 -6304 -1208 4066 3137 -619 -2538 -2278 -271 3025 3679
930C679m866m748L564Q134K43r135m844P142Q243l035q953j376O860M142l141
$$ 3679 -1187 -5935 -2371 5763 6006 -3129 -7973 -831 7412 4377 -4576 -5952 908 5050 1909
945A909m234k73J869J710J475n10l864k595L977N950j635p894k131P426N608m744
$$ 1909 -2325 -2598 -729 981 2456 1946 -1918 -4513 -536 5414 3779 -4115 -6246 1180 6788 2044
961B044p360J158O776J777m436k937J718K047L6N5Nk042j669K743L944j705n687
$$ 2044 -5316 -4158 2618 4395 -41 -2978 -1260 787 823 878 883 -1159 -2828 -85 3859 2154 -3533
978c533n48O028L040m801m796K714N149o26m311o07K948P13j860mJ600q14k203
$$ -3533 -4081 1947 4987 186 -4610 -1896 3253 2627 -1684 -2291 657 1370 -490 -494 1106 292 -1911
995a911J103L176n94l956m86M093J675l582k503K736K769j972k700J609K594j527
$$ -1911 -808 2368 1774 -2182 -2668 1425 3100 -482 -2985 -249 2520 548 -2152 -543 2051 524
1011E24k774J458L243j050l739K27L870Q10l463j611K626J840j779j455J380Q32
$$ 524 -2250 -792 2451 1401 -2338 -2111 1759 2569 -894 -2505 121 1961 182 -1273 107 939
1027I39j707m83K517R24l313k140L413L709k436m967O51N188J367m202k781K416
$$ 939 -768 -1251 1266 2190 -1123 -3263 150 3859 1423 -3544 -2893 2295 3662 -540 -3321 -905
1043i05K944o32j844k50J49l01J151K005j177l970l44N078K879m560n351K414
$$ -905 2039 1407 -437 -687 -538 -839 312 2317 1140 -2830 -3174 1904 4783 223 -5128 -2714
1059b714O555N42n861l085L636M050q93l104j023Q24J133J516O43k547l326J543
$$ -2714 3841 4383 -1478 -4563 -927 3123 2230 -874 -1897 -1073 60 1576 2219 -328 -3654 -2111
1075b111N518J165n980m421M337O696j167o935k166N115M131k074m045o23K031
$$ -2111 3407 4572 -1408 -5829 -1492 5204 4037 -2898 -5064 51 4182 2108 -1937 -2560 -529
1090e29J736P12p23k661j839K697M586o71o084k536N499N458k974o830l76O044
$$ -529 1207 1919 1196 -1465 -3304 -607 3979 3308 -2776 -5312 187 5645 2671 -4159 -4535 1509
1106A509L086l571m054O83K977J250o15j272j717m77K683L063j740n097p45N559
$$ 1509 4595 1024 -3030 -2347 630 1880 1265 -7 -1724 -2201 482 3545 1805 -3292 -4037 1522
1122A522L610m129n587J465N853J229m433k825K166K774k10j340n23m97k73J670
$$ 1522 5132 1003 -4584 -3119 2734 3963 -470 -3295 -1129 1645 1435 95 -428 -925 -1198 472
1138D72K024j478l737mM500K070l902l850K294M541l45m051j112K800J565j492
$$ 472 2496 1018 -2719 -2723 1777 3847 -55 -3905 -1611 2930 2585 -1466 -2578 222 1787 295
1154B95j101P96K09r67M57J751m31k608l33L056J433k793k423K004K898j015k825
$$ 295 -806 -10 199 -768 -311 1440 1009 -1599 -1932 1124 2557 -236 -2659 -655 2243 1228 -1597
1171a597K96K410Pk050J2J996o2k207j54K477O65k501j315K169J796j557j919
$$ -1597 -1301 1109 1116 -934 -922 1074 1012 -1195 -1349 1128 1793 -708 -2023 146 1942 385 -1534
1188a534R98J648p55j328R56J236j322j650J515K457j190l261K32L615J060l215
$$ -1534 -536 1112 357 -971 -15 1221 -101 -1751 -236 2221 1031 -2230 -1998 1617 2677 -538
1204e38k177K135K624q44k217p2J210J65k07O10j64j769m45K625J883k578l469
$$ -538 -2715 -580 2044 1200 -1017 -1089 121 286 79 689 525 -1244 -1689 936 2819 241 -3228
1221c228J430M430M79m261k343K939L370j046l082n93J729J150l8l90j066j231
$$ -3228 -1798 2632 3111 -1150 -3493 -554 2816 1770 -1312 -1905 -176 974 936 546 -520 -1751
1237a751Q74K870N81l545k690K781M445q30m976j537M031L252k031l591j14K538
$$ -1751 -877 1993 2574 -971 -3661 -880 3565 2735 -2241 -3778 253 3505 1474 -2117 -2231 307
1253C07J330o42j121r97l50J502K253n33l562j456L515L528k017m738k53M520
$$ 307 1637 995 -126 -1123 -1473 29 2282 1749 -1813 -3269 246 3774 1757 -2981 -3234 1286
1269A286K301k956l342Q65K954Q00j440j288l33M46J375J226j148k810k90L445
$$ 1286 3587 631 -2711 -1846 1108 1908 468 -820 -1153 -707 668 1894 746 -2064 -2354 1091
1285A091K237k732l831R96M305J027l496k490J876K757j88j911p45N13N52O55
$$ 1091 3328 596 -3235 -2239 2066 3093 -403 -2893 -1017 1740 1552 -359 -1104 -591 -39 616
1301F16N38r26j891J74K735J248k607k669J569L430p5l220j234K282J819j111
$$ 616 1154 228 -1663 -1489 1246 2494 -113 -2782 -1213 2217 2142 -1078 -2312 -30 1789 678
1317F78j575K75Q32j41p7O27k06j369j52J909R70j914j841J351K376n07k383k87
$$ 678 -897 -622 210 69 -8 619 413 -956 -1108 801 1771 -143 -1984 -633 1743 1236 -1147 -1434
1335a434J973P11j436p35J063N36j005l88J187M85j398q34J399J271j096j573
$$ -1434 539 1250 -186 -921 142 678 -327 -715 472 957 -441 -1275 124 1395 299 -1274
1351a274O41J589k04j393K5J124q8j048K47J283k86j652m4J982O61j952j375J502
$$ -1274 -633 956 752 -641 -616 508 420 -628 -381 902 616 -1036 -1080 902 1563 -389 -1764 -262
1369b62J846p36j871PJ420L49p51j86K78m09l06J010R26j243j833P97K598K03
$$ -262 1584 848 -1023 -1016 404 753 2 -184 94 -315 -621 389 1315 72 -1761 -964 1634 1837
1387A837k749j398K138K283j011k427j75J788Q76p19p62k16o0N01J128J09j838
$$ 1837 -912 -2310 -172 2111 1100 -1327 -1502 286 1162 443 -319 -535 -595 -94 1034 1143 -695
1404f95j342J730K583o83l251q50K932K225j732k822J88K402R88j204j276j16
$$ -695 -2037 -307 2276 1593 -1658 -2508 424 2649 917 -1905 -1717 685 1673 469 -807 -923
1420i23N58Q66P15o12j872n25K215K051j548l167N5L353J573k492k626R79K673
$$ -923 -365 501 1216 604 -1268 -1793 422 2473 925 -2242 -2187 1166 2739 247 -2379 -1400 1273
1437A273M56j742j213M21R16O60J55q65j442J34K199J224k030k535R53L188N65
$$ 1273 1729 -13 -1226 -805 111 771 926 61 -1381 -1247 952 2176 146 -2389 -1436 1752 2317
1454B317k879j845J764K381l94k003o13J007Q37O1k36o52p79M18J632M98j864
$$ 2317 -562 -2407 -643 1738 1344 -659 -1272 -265 572 633 397 -255 -1034 -616 1016 1514 -350
1471c50j638J325K443k33k586q83J990J618j037j654J40J142K55m13o5j14m97
$$ -350 -1988 -663 1780 1547 -1039 -1922 68 1686 649 -1005 -865 277 532 119 54 -60 -557
1488e57J03J106L87j343j139J114J730m67j919k67J681P72j160r34O96P59m65
$$ -557 -454 652 1039 -304 -1443 -329 1401 934 -985 -1252 429 1201 41 -893 -197 562 97
1505I7m77N20L34p42m50R25P65q86j111O11J297k11j285j06J052K61q36j93P47
$$ 97 -380 140 474 -268 -718 207 972 86 -1025 -414 883 672 -613 -719 333 594 -242 -435 312
1524C12P5q84q2J140L04j285p47J194J189p91j440K45J344K20r40m01M94J92k26
$$ 312 387 -497 -579 561 865 -420 -1167 27 1216 425 -1015 -770 574 794 -146 -547 -53 139 -87
1543h7K26L70o00q45O02J447j41j834o26J725J413j121j828K42J678N09j030q06
$$ -87 139 509 -91 -936 -334 1113 972 -862 -1488 237 1650 529 -1299 -1057 621 1130 100 -706
1561g06K65M82K37K39j82r35m61J189J360p86k088j39K233J200j660j971O44K063
$$ -706 -441 41 278 517 335 -600 -1061 128 1488 702 -1386 -1525 708 1908 248 -1723 -1079 984
1579I84L92j456r86M75Q96L44j52o20p95J87J406Q12j377j819O10K386N51k170
$$ 984 1376 -80 -1066 -591 305 649 497 -123 -918 -731 675 1487 110 -1709 -1099 1287 1838 -332
1597c32j625J292K098j28j794p84R15J032N9n37o40l82N02J224K68j521j319J101
$$ -332 -1957 -665 1433 1305 -489 -1273 -358 674 733 196 -444 -826 -324 900 1168 -353 -1672 -571
1615e71K105j06k270j011J733J728p31j824k16J251P51l87o25l29j7N20Q09q2
$$ -571 1534 1428 -842 -1853 -120 1608 877 -947 -1163 88 839 452 -173 -502 -519 1 810 728
1633G28j329p35J271J555o34j993k56J829J067j194j425L94J231K04o84l43J03
$$ 728 -601 -1336 -65 1490 856 -1137 -1393 436 1503 309 -1116 -722 509 713 29 -314 -211
1650b11K8J91M98l7r34m59J006J032o70j423R3J436M73j114q04O60P90k83n44
$$ -211 -183 8 506 469 -465 -924 82 1114 444 -979 -886 550 1023 -91 -895 -235 555 272 -272
1669b72J56K75k76j66N21K80o74n93O61Q61l92j021P3R64J82p60k83N66K15m93
$$ -272 -116 159 -117 -283 238 518 -156 -749 -88 773 381 -640 -567 397 579 -181 -464 102 317 -176
1689a76j03O01P4p54k63Q93N42q07q77N40J031j28r65j81O68K83l49j30J86j61
$$ -176 -279 322 396 -358 -621 272 814 7 -870 -330 701 573 -392 -573 95 378 29 -101 85 -76
1709g6l17L89O72l48j085j4J297N87j145j108O53J322j2j145m59O26O01j00k87
$$ -76 -393 -4 668 320 -765 -779 518 1105 -40 -1148 -495 827 815 -330 -789 -163 438 338 51
1728E1j89k62N3P26M54p87j111M01J572L03j519j106J044J525k42j434m94R06
$$ 51 -138 -400 -347 379 833 46 -1065 -664 908 1211 -308 -1414 -370 1155 913 -521 -1015 -109
1746a09P94j60n91l66n2M35P22L6j103p86R21J489k45j792o53J514J362p51j596
$$ -109 685 525 -66 -432 -484 -49 673 709 -394 -1180 -259 1230 985 -807 -1460 54 1416 665 -931
1765i31j13J235P23n10p68k19K89N49M49l14j030l63J129J162o74j665j60J644
$$ -931 -1044 191 914 404 -364 -583 -294 255 704 390 -640 -1003 126 1288 614 -1051 -1211 433
1783D33R85j097j424L04J299M06p57o77P7M27L69J61l76p50p9J027P43p99j335
$$ 433 1418 321 -1103 -799 500 906 149 -528 -451 -24 345 506 130 -620 -699 328 1071 272 -1063
1802a063K18J512M91j228j021O35J144j4q55l48L47L09Q7K5j75m97m9P88M96p25
$$ -1063 -845 667 1158 -70 -1091 -456 688 674 -181 -529 -182 127 214 239 64 -433 -482 306 802 77
1822G7r52L74J174J36j078n59P25P42l33o31P0L69l1j37J85P7m14k19N32M78m66
$$ 77 -875 -501 673 809 -269 -828 -103 639 306 -325 -255 114 83 -54 131 208 -206 -425 107 585 119
1843A19p08K28Q05N1p16k53N27K98l50k28K97J15l68j02N12K06n80m41N32O53
$$ 119 -589 -361 444 495 -221 -474 53 351 1 -227 70 185 -183 -285 227 433 -147 -588 -56 597
1863E97l10p47K1O68J83m51k14K20R0j23J29K35k69n16K25P99N2r23m73Q06Q22
$$ 597 287 -460 -439 229 412 -39 -253 -33 57 -66 63 298 29 -487 -262 537 589 -334 -807 -1 821
1884H21m49r34k1P94L37m17l80K1J44J58K44m2n53l50O00Q26l14j127k38J119
$$ 821 372 -562 -583 211 548 131 -249 -228 -84 74 318 276 -277 -627 -27 799 485 -642 -880 239
1904B39P52p28j059J61R80L55n95n42N3L66L22J09l37n93l3Q19O27o78j093J43
$$ 239 991 263 -796 -635 345 700 105 -437 -384 -18 304 413 76 -517 -550 269 896 218 -875 -732
1924g32J278N16j029j020M69J110J77q16n53K57N33K47j44m31m24K20Q15L06q29
$$ -732 546 1062 33 -987 -518 592 769 -47 -600 -343 190 437 293 -138 -562 -342 473 779 -50
1943e0r05M49J252J69j168p58P29J025j13r14l61M63M93N6k40l55k05K82O29J07
$$ -50 -955 -506 746 915 -253 -1011 -282 743 630 -284 -645 -182 311 367 127 -228 -433 -151 478 585
1963E85p84o20N83J005j07j086m18Q23P68l70p92p5N48K83j61k00j47q1J90M13
$$ 585 -199 -819 -236 769 662 -424 -842 -19 749 379 -413 -488 60 343 182 -18 -165 -246 -56 357
1983C57J6n89l97N28P21k45q39j49P52M33m72n32J64M25J7k14k1M1j27kL09J36
$$ 357 373 -216 -613 -85 636 391 -448 -597 155 588 116 -416 -252 173 190 -24 -45 -4 -131 -133 176 312
2005C12m15l46L56N39j64n99o1N25K12l54k39K10J81j85p6K46M5l51j42M06L16
$$ 312 -103 -449 -93 446 282 -317 -378 147 359 5 -234 -24 157 -28 -104 142 187 -164 -306 100 416
2026D16l73m51J97N18J3m54j52K98J58j43o6J09j05j75J67L68r6n54j21O01L93
$$ 416 43 -408 -211 307 320 -134 -286 12 170 27 -39 70 -35 -210 -43 325 229 -325 -446 155 548
2047E48m56o03J82O55J03m79k91K05K69K4n7r8j93n4L87L28l18o45N0P76L38o47
$$ 548 92 -511 -329 326 429 -50 -341 -136 133 157 100 2 -191 -245 142 470 152 -493 -443 333 671 24
2069B4o69L08P64Q6o07l50K59L87P4j65k35j95J34M81J83n13n91K66Q51J48q15
$$ 24 -645 -337 427 513 -94 -444 -185 202 276 111 -124 -319 -185 296 479 -34 -625 -359 492 640 -175
2090a75n67N07Q15r3p18l14M21M49pl10k66l3K73M08k7n66m01M67P50j09q56l52
$$ -175 -742 -235 580 487 -231 -545 -124 325 318 8 -258 -291 -18 390 363 -203 -604 -137 613 504 -352 -704
2112g04O88O80k82p51j47N47L86j75l58j58Q7K80K64j21n06k39N16N77k44p71
$$ -704 -16 664 382 -369 -516 31 417 242 -116 -274 -187 93 357 236 -270 -509 7 584 340 -431
2132d31j51P13M85m28o35O4N44J87k56k62j2J06J53J61j03l83j10M29M10k91n95
$$ -431 -582 131 616 188 -447 -383 161 348 92 -170 -182 -76 77 238 135 -248 -358 71 481 190 -405
2153d05J3O12K68m45m37J94M26J3k70r6Q6L1K4J26%k64j64L15L26j98m58J7M62
$$ -405 -392 220 488 43 -394 -200 226 239 -31 -127 -41 -10 14 140 140 -124 -288 27 353 155 -303 -286 176
2176A76J49l43k42J95K20q3j54Q8M9j43n0K39J30k82k56K24L89j16m01m3L31J53
$$ 176 325 -18 -260 -65 155 72 -82 6 55 -88 -138 101 231 -51 -307 -83 306 190 -211 -254 77 230
2198B30k00j51R9N1o4M8J57j00k99L1M12J50m16l61K78M91n5m70j62L05K53q9
$$ 230 30 -121 -22 29 -35 13 170 70 -229 -198 214 364 -52 -413 -135 356 301 -169 -331 -26 227 138
2220A38j88o9MP8J82Q0k65l24J75N27O1n67l54M10N65j24n80j68M02L31j26k76
$$ 138 -50 -119 -115 -37 145 225 -40 -364 -189 338 399 -168 -522 -112 453 329 -251 -419 -17 314 188 -88
2242h8j17N7J95K14m8l61k66L46N38r3o71k57N62N56k79o38r0N14L41k22l55r9
$$ -88 -205 -148 47 261 213 -148 -414 -68 470 377 -294 -551 11 567 288 -350 -440 74 415 193 -162 -261
2264b61J50K57J49j72l97j07M36M57k88o64p4O76M33m33o26O4N86K47l44l64K0
$$ -261 -111 146 295 123 -274 -381 55 512 224 -440 -514 162 595 162 -464 -400 186 433 89 -275 -255
2285b55K54K22Mk23k88K5M31K87l50n52P7O53K55n18m98K19N49Q0l81k54J12K33
$$ -255 -1 221 225 2 -286 -261 170 457 107 -445 -368 285 540 22 -476 -257 292 372 -9 -263 -151 82
2307H2J20n3j72k05L1L74J87l30m20J25N49J23m79l31K63L99k9l27j22J58J11
$$ 82 202 149 -23 -228 -197 177 364 34 -386 -261 288 411 -68 -399 -136 263 234 -93 -215 -57 54
2328E4K0ln3j61k4K52K04k40l34Q6M14Q7l56k34K34K59p1k07pJ07j3j9R8J4j79
$$ 54 74 71 18 -143 -167 85 289 49 -285 -199 215 302 -54 -288 -54 205 134 -73 -80 27 14 -5 93 107 -72
2353g2j33K19K47j48l32JL45J22k45j98J14J62qr2M0l1j24M6K50L9l16k07K77
$$ -72 -205 14 261 113 -219 -218 127 249 4 -194 -80 82 74 -18 22 -9 -133 -87 163 202 -114 -321 -44
2376d4L66j27m21o8L57K15j97k37J1J46Q0K5l0j65j35J84L23k7m51j78L95M16
$$ -44 322 195 -226 -294 63 278 81 -156 -145 1 81 106 76 -89 -224 -40 283 256 -195 -373 22 438
2398D38k35n18l9M48K61k42l26qK16J57K1j53k14o4L07L26j95n08p6N19L75l48
$$ 438 203 -315 -354 94 355 113 -213 -221 -5 152 173 20 -194 -258 49 375 180 -328 -404 115 490 142
2420A42n50M7N19K49l17l60J7L02J77m1k10k20L9L63K29k89m81L7N79K72m49n05
$$ 142 -408 -361 158 407 90 -270 -253 49 226 185 -25 -245 -206 157 386 97 -384 -347 232 504 55 -450
2442d50J56N69J42m03l27J11L19J29j17k31j36J19L18J25l39l73J36N36J35m83
$$ -450 -294 275 417 14 -313 -202 117 246 129 -102 -238 -119 199 324 -15 -388 -252 284 419 -64
2462f4l92K48N10K0m22k28J99K82M8j52j63p1J20K54O9l01k97J77M40N9m36k75
$$ -64 -456 -208 302 322 -100 -328 -129 153 201 49 -114 -185 -65 189 258 -43 -340 -163 277 336 -100 -375
2484c75K88L99o8l67j30K21J83l4j11p7l7O4J60P7k34k19J44L41K7l58j87K39
$$ -375 -87 312 244 -123 -253 -32 151 117 6 -71 -108 -44 116 193 -41 -260 -116 225 252 -106 -293 -54
2506e4K88j10k47l2J55P8m5k7pr2j7J73J30j74k36O8L17M9k73j64J58K23m5j62
$$ -54 234 124 -123 -155 0 78 33 6 -1 -93 -110 63 193 19 -217 -149 168 217 -56 -220 -62 161 116 -46
2530d6k5N2K3J2Q6k4j81o4K25K05j74l14K2L32J29k39k26Q4K12N2j10r7l3J8J22
$$ -46 -71 -19 4 16 102 78 -103 -167 58 263 89 -225 -203 129 258 19 -207 -123 89 141 31 -66 -99 -81 41
2555D1J32r8k65n2L26K17k26l72O4L87J48k80k76R4K68Q1j29j57o0P5K04J11j93
$$ 41 173 75 -190 -242 84 301 75 -297 -233 154 302 22 -254 -160 108 189 60 -97 -157 -82 122 233 40
2578D0k97K7M10J99l45l84J30M59R6l43l03J45L18R4k00j90n6J54K26N3k72k85
$$ 40 -257 -230 180 379 34 -350 -220 239 335 -8 -311 -166 152 246 46 -144 -200 -46 180 233 -39 -324
2600c24J39M18J13l97l62K06M92M7m06k71K13L29L5k20j98K2J74K03k8k74k07
$$ -324 -185 233 346 -51 -413 -207 285 332 -74 -345 -132 197 232 12 -186 -164 10 213 185 -89 -296
2621b96J83L98J2m10k61K76M32n2m16j92K66K96m7k25j40O6J61J35n4k36j44J99
$$ -296 -113 285 297 -113 -374 -98 334 282 -134 -326 -60 236 189 -36 -176 -110 51 186 132 -104 -248 -49
2643d9L10m5l65j78K96L30j25l46r8K58K08p9j95o4O8J15R3l9j73j21J73K47m7
$$ -49 261 216 -149 -327 -31 299 174 -172 -270 -12 196 117 -78 -142 -74 41 134 95 -78 -199 -26 221 174
2666A74l16j12K49K57j11k63o1K09J18p9j06j3kM3J15K0j51j45J05K42Lk64j43
$$ 174 -142 -254 -5 252 141 -122 -183 26 144 65 -41 -54 -56 -13 102 122 -29 -174 -69 173 176 -88 -231
2689b31K03K16p0k11l8J25Q0k5n1k4p0L3J49O9j72j93J03K73L4k53j72J59K35
$$ -231 -28 188 118 -93 -131 -6 74 49 -2 -26 -96 -63 86 155 -17 -210 -107 166 200 -53 -225 -66 169
2712A69k7j95o5N8J07M3pj07j06M4K17Q8k27k39J18L30M9l08k05J57K72J4k08
$$ 169 142 -53 -118 -60 47 90 83 -24 -130 -86 131 219 -8 -247 -129 201 250 -58 -263 -106 166 180 -28
2735b8j47N9J46R6k0j81j34J15K76M7l10k30J80L66J9l59j96K06L01jk59j47R2
$$ -28 -175 -116 30 126 106 -75 -209 -94 182 229 -81 -311 -131 235 254 -105 -301 -95 206 205 -54 -201 -109
2758a09J89J01r5j92j12J80K69pl25k11K53L63o1l76j67K53K89l8k77j49J31K07
$$ -109 80 181 86 -106 -218 -38 231 224 -101 -312 -59 304 243 -133 -300 -47 242 204 -73 -222 -91 116
2780A16P0j34j98p9K19K61p7l43j47K78L31r8l81j11K82K68j09k65r1J51J97J9
$$ 116 186 52 -146 -225 -6 255 178 -165 -312 -34 297 199 -182 -293 -11 257 148 -117 -208 -57 140 159
2802A59j36j81qJ96K11j06l00r6K94K55j34l45l8K78K00j25k33m3J29J38K2j19
$$ 159 23 -158 -166 30 241 135 -165 -261 33 288 154 -191 -229 49 249 124 -109 -152 -23 115 137 18
2824A8j46LJ61J63q7k65p3K57K20j34k87l1K40J48j20j68k1J04Q7K0n9j24m6J45
$$ 18 -128 -125 36 199 112 -153 -226 31 251 117 -170 -201 39 187 67 -101 -122 -18 69 89 30 -94 -140 5
2848EJ77o1k44p5K07K07j01k39l7J80J39p3j31l8L6R0O9k9j44r4J38J97l8k34
$$ 5 182 121 -123 -198 9 216 115 -124 -161 19 158 85 -46 -84 -48 42 111 82 -62 -156 -18 179 141 -93
2872i3j04J82K12o8k34o3J57J24k4j12p4J0Q8J26l2j81j15J63K23k4k71j23K11
$$ -93 -197 -15 197 129 -105 -168 -11 113 89 -23 -97 -87 1 127 95 -86 -201 -38 185 161 -110 -233 -22
2895b2K21n4k40r2J48J76rj27j21MJ52J43n6k36j05K14K46p6l06j10K51K52j09
$$ -22 199 145 -95 -187 -39 137 128 1 -120 -116 36 179 123 -113 -218 -4 242 166 -140 -250 1 253 144
2918A44k64p8J74J85k6j63j33M6J78J17j03k48n0K56K20j46l11n0K82K21j39k76
$$ 144 -120 -198 -24 161 135 -28 -161 -115 63 180 77 -171 -221 35 255 109 -202 -252 30 251 112 -164
2940a64n0K13J76n0j77j20P2K04R2j47k38kK71J83j72l04jK92J78j68k55j4K16
$$ -164 -214 -1 175 125 -52 -172 -100 104 196 49 -189 -191 80 263 91 -213 -214 78 256 88 -167 -181 35
2963C5J56q5j72r8R7J85N6j60k04K2K57J45k00k57L8K83J10j85k01L3J94J16r6
$$ 35 191 106 -66 -164 -67 118 174 14 -190 -168 89 234 34 -223 -185 98 208 23 -178 -145 49 165 69
2986F9j64n7J08J55L4j58j70M8K48R4j88k19O8K37R4j64j91M4J74P8q0j17n1N1
$$ 69 -95 -152 -44 111 145 -13 -183 -135 113 207 19 -200 -132 105 199 35 -156 -112 62 140 60 -57 -108 -57
3010e7J43N1j28j73M1K11R4j69j95M0K32O8j49j53L4J31Q4l6j15p2M5J38P0j16
$$ -57 86 137 9 -164 -123 88 182 13 -182 -142 90 158 9 -144 -110 21 105 69 -46 -118 -73 65 135 19
3034A9j68K6J93J17j58j95K8J99R3j13j49MJ12R5j7j10r5L8J56Q2j16k00J6K28
$$ 19 -149 -123 70 187 29 -166 -138 61 154 41 -108 -104 8 103 86 -24 -119 -81 75 157 41 -159 -143 85
3058H5J05j29k30L7J95R5j09j52k9J15J19%j32j30N2J92R5j51k12K8K36J28j65
$$ 85 190 61 -169 -132 63 158 49 -103 -132 -17 102 102 -30 -160 -108 84 179 28 -184 -156 80 208 43
3081D3k23K5K10J21j09j85k5J30J54j7j53j39P9K19P8j87k14N9K60J03k04k20
$$ 43 -180 -155 55 176 67 -118 -143 -13 141 124 -29 -168 -89 130 208 21 -193 -134 126 229 25 -195
3103a95M7K48R1j31j96j2J60J21k7j60j26J05K01N4j93k05R9K45P0j91k12P8K14
$$ -195 -148 100 191 60 -136 -148 12 133 106 -54 -180 -75 126 180 -13 -218 -119 126 196 5 -207 -129 85
3126H5R0j40j71NJ57J31n7j76r1J18J98K0k07j53R7K52L1k00j77J02K00N6j58
$$ 85 175 35 -136 -131 26 157 100 -76 -167 -49 149 169 -38 -191 -94 158 189 -11 -188 -86 114 170 12
3149A2j45L1J43R5n5j62p4J16J72J3k00j37J22K07J4j88j42R2J80L7j27j36J5
$$ 12 -133 -102 41 136 81 -81 -155 -39 133 146 -54 -191 -69 138 152 -36 -178 -86 94 131 4 -132 -117
3172a17J43R6m5j47q2J14J67jj68j38J07K05L1j86j33O9J83M9j19j32kJ29J05
$$ -117 26 122 77 -70 -152 -38 129 128 -40 -178 -71 134 165 -21 -154 -85 98 147 28 -104 -106 23 128
3195A28k8j45r8R2J87kj62j38R2J86L0j59j33O3J46O5j02j24j8J15J10k8j38q9
$$ 128 100 -45 -143 -51 136 134 -28 -166 -74 112 142 -17 -150 -87 59 124 22 -102 -120 -5 105 77 -61 -150
3219a50R2J69K5j76j20P3J95M1j57j41O4J58N6p6j53nJ02J36j3j68j09J03J82
$$ -150 -58 111 136 -40 -160 -87 108 149 -8 -149 -85 73 129 53 -100 -105 -3 133 120 -48 -157 -54 128
3242A28K2j70j46Q9J90L8j40j57M8J62P1r4j35l1J15J41l7j52j06J02J90J5j85
$$ 128 150 -20 -166 -77 113 151 11 -146 -98 64 135 41 -94 -125 -10 131 94 -58 -164 -62 128 143 -42
3265d2j37R5K02L4j62j52N7J89P0j11j42k5J40J30m2j75r6J36J80Jj99j17J06
$$ -42 -179 -84 118 152 -10 -162 -105 84 154 43 -99 -124 16 146 104 -71 -167 -31 149 150 -49 -166 -60
3288f0J92K0j72j35P1J63O3j12j48j1J39J25m1j75q6J35J77j7k00r6J03J92jj57
$$ -60 132 152 -20 -155 -84 79 142 30 -118 -129 10 135 94 -81 -167 -32 145 128 -72 -168 -65 127 126 -31
3312c1j30P6J49N9j05j32oJ30J32n4j59p9J35J60k7j82r0J14J66Nj51j17P6J48
$$ -31 -161 -85 64 123 18 -114 -120 10 142 88 -71 -150 -15 145 118 -64 -154 -40 126 131 -20 -137 -61 87
3336H7M4j03j33j2J46J04m5j67p5J36J44j8j78q5J08J57J1j51j12O7J36O0r2j34
$$ 87 131 28 -105 -117 29 133 88 -79 -154 -18 126 108 -70 -155 -47 110 121 -30 -142 -75 61 121 29 -105
3360a05j0J24J13n1j49o8J30J43jj69r7Q3J77J3j27j20M2J34P2q1j29m0J29J29
$$ -105 -115 9 122 71 -78 -146 -16 127 126 -43 -140 -57 120 133 6 -114 -72 62 134 53 -76 -116 13 142
3384A42n0j55q3J17J56mj63r7P9J54K8j38j15L5J43P2p6j37l1J15J29k8j73o4
$$ 142 92 -63 -146 -29 127 123 -40 -137 -58 96 124 -14 -129 -94 49 121 45 -92 -123 -8 121 93 -80 -144
3408a44J10J62nj61j04Q1J70K2j33j26M3J44P9p9j50l3J34J34m1j71q3J27J55
$$ -144 -34 128 123 -38 -142 -61 109 131 -2 -128 -85 59 138 59 -91 -124 10 144 103 -68 -151 -24 131
3431A31nj62j13R8J64J3j28j20K9J51Q4j02j41k2J30J25n1j65o3J17J67l2j64
$$ 131 126 -36 -149 -51 113 126 -2 -122 -93 58 142 40 -101 -123 7 132 81 -84 -147 -30 137 105 -59
3454e9p6Q6J57J7j48j05O0J43N0r0j45lJ45J15o1j63n8J43J33l1j59r5J15J47
$$ -59 -135 -49 108 125 -23 -128 -68 75 125 35 -110 -113 32 147 86 -77 -135 8 141 110 -49 -144 -29 118
3478A18Mj31j17M6J37P3r4j43lJ31J12n5j81m0J28J44m1j43q8R9J46J2j53q7M7
$$ 118 122 -9 -126 -80 57 130 36 -107 -110 21 133 78 -103 -143 -15 129 88 -55 -143 -44 102 114 -39 -126 -79
3503g9J36O7r2j37qJ50R3n6j62m4J37J25l5j58o5J10J19K3j33j13N0J41O8r2j41
$$ -79 57 124 32 -105 -113 37 130 74 -88 -132 5 130 95 -63 -128 -18 101 124 -9 -122 -72 69 137 45 -96
3528i6j1J30J04n9j50n2J26J36n0j45p2R3J33J0j11j10M9J32N5q6j35LJ42R3o1
$$ -96 -107 23 127 68 -82 -134 -8 128 78 -67 -139 -46 87 97 -14 -124 -75 57 112 26 -109 -106 36 129 68
3553F8j59l4J22J36l6j39q5J02J42Rj30j07M3J43N8r6j33kJ39J03q4j38l9J14
$$ 68 -91 -125 -3 133 97 -42 -127 -25 117 126 -4 -111 -68 75 133 37 -96 -98 41 144 60 -78 -117 -3
3577cJ25l2j53p5R9J32J9j35j00M1J47N8j00j35nJ43J08q1j49j3J22J15l9j43
$$ -3 122 90 -63 -138 -39 93 112 -23 -123 -82 65 123 23 -112 -117 26 134 53 -96 -109 13 128 89 -54
3601e4o6J03J19J7j32j04O0J35N4j06j31J9J47Q2q0j59j7J29J18n1j43o6J10J27
$$ -54 -120 -17 102 119 -13 -117 -57 78 132 26 -105 -86 61 143 63 -96 -113 16 134 83 -60 -126 -16 111
3625A11rj22j09O0J38M7j01j38K9J27Q7q3j34j9J35J00o4j25m8R9J20rj27q2P5
$$ 111 102 -20 -129 -69 69 116 15 -123 -94 33 120 37 -97 -116 19 119 55 -70 -118 -19 101 92 -35 -117 -42
3650d2J26L2j00j19J7J45Q6j02j30j9J35J03o1j37m2R8J16j2j23q7O5J36K6r8
$$ -42 84 116 16 -103 -86 59 145 43 -87 -106 29 132 71 -66 -108 -10 106 94 -29 -116 -51 85 111 13
3674A3j23L2J38O4j03j19qJ28Q8n9j27n3J25R9mj31p4O6J43K2j12j16L5J39O4
$$ 13 -110 -78 60 124 21 -98 -106 22 110 51 -76 -129 -4 95 91 -40 -114 -48 95 117 5 -111 -76 63 127
3699A27p9j42lJ32R7n8j33n3J03J19j2j24q5O1J40L6j36j03K0J53O5q0j43j3J33
$$ 127 48 -94 -97 35 132 74 -59 -112 -9 110 98 -26 -111 -50 90 126 -10 -113 -93 60 125 45 -98 -111 22
3724B2Q6m3j40m3J03J09jj34p4O3J31M4j31j01K7J43O9q5j44%J31Q5m2j27m5J00
$$ 22 108 65 -75 -118 -15 94 93 -41 -115 -52 79 123 -8 -109 -82 61 130 45 -99 -99 32 117 75 -52 -97 3
3750CJ19l2j19p4O1J30L0j11j26L1J41P7q9j37LJ18R4m9j46l9R8J17j7j31p4P6
$$ 3 122 90 -29 -103 -42 88 118 7 -119 -88 53 130 41 -96 -93 25 119 70 -76 -115 -17 100 83 -48 -122 -46
3776d6J33J7j03j18M9J28N9r2j23j1J26R5n2j26m8J03J24j0j24r2O3J41K1j13
$$ -46 87 104 1 -117 -68 60 119 27 -96 -107 19 114 62 -64 -112 -9 115 105 -19 -111 -48 93 114 1
3800Aj04L4J42N0r0j24kJ27Q0o1j24l7J09J12k8j37o5N6J40K6j15j05M2J33N0
$$ 1 -103 -69 73 123 33 -91 -93 34 114 53 -71 -108 1 113 85 -52 -117 -61 79 105 -10 -115 -73 60 110
3825A10q5j18mJ40P2o7j16l9J04J20k9j32o9Q4J27K1j15j04M1J32N4r2j17lJ21
$$ 110 25 -93 -97 43 115 48 -68 -107 -3 117 88 -44 -113 -29 98 119 4 -100 -59 73 127 35 -82 -85 36
3850C6Q0o3j21l5J03J15l6j12p4P4J22mj03q3L0J29M6q0j28J2J14Q3n3j21l3J04
$$ 36 116 53 -68 -103 0 115 79 -33 -107 -33 89 85 -18 -101 -71 58 104 24 -104 -92 22 105 52 -69 -102 2
3876BR6k6j19n6P9J14Jr8r1M1J27M1q2j13NJ24P4o4r9m2J03Q2k4j08o6P0J06K2
$$ 2 98 72 -47 -103 -24 90 91 -7 -98 -57 70 111 29 -84 -79 45 119 55 -44 -86 17 99 75 -33 -99 -29 77 99
3904I9j10q5M0J21M5r8j04J3J00P1n1j16j3Q4R8k7j19m6P6R8Mr1r5O9R4L5p9r5
$$ 99 -11 -96 -56 65 110 12 -92 -79 21 92 41 -75 -88 -4 94 67 -52 -98 -22 76 80 -11 -106 -37 57 92 13 -82
3932h2K4J03N5n6j02k3R7Q0l9r6m3P2J00nj03o6M5J02L0r6q4K3J02N3o3j03j6
$$ -82 -58 45 100 44 -58 -81 16 96 57 -39 -82 -10 90 85 -18 -84 -39 63 93 -3 -87 -64 38 91 28 -75 -91
3959i1R0Q0l2r6m1P3R0j2q9o2M4J03L0q6q1K6Q7O1p3p7nP8P6l5r4l5P0Q8k6o6
$$ -91 -1 79 47 -49 -90 -17 73 61 -28 -90 -46 57 87 1 -80 -54 33 94 21 -56 -61 17 93 58 -36 -71 -1 87 61 -5
3989eo8M1R6J4p2p7K2R7M7p3j00J1Q8O9m9r8l0O6Q9%r8o8N4J00Qo4q4K5R8M6n9
$$ -5 -73 -32 64 78 6 -71 -49 48 95 22 -78 -67 21 90 41 -57 -87 -21 68 68 -30 -98 -44 56 64 0 -84 -59 39 85 26
4020B6q9j3J02N3k5r3l2P2P9k0q4n1M9R4J1p3p8K3Q9L9m9r0mP8P2n4p8l0O3P7
$$ 26 -63 -76 26 79 54 -39 -71 1 80 60 -24 -75 -26 68 79 6 -72 -49 40 79 30 -60 -64 14 86 32 -46 -76 -13 64
4050F4pq1o1L9R5J5q2o1K3R7L8o6q9LQ2Q1o7o8k6P2Q0l3p2o1O2Q6J1p6p3L1Q7
$$ 64 57 -24 -85 -46 49 64 -18 -79 -56 41 79 13 -76 -73 9 90 23 -45 -71 1 81 48 -24 -85 -23 63 74 -2 -75 -44 43
4081D3L5m9q3LP9N0k7j02k3Q3O7k9r1l1M2R0Qp2p1K5R1K9n7o8j1R3M3l7q1k6P1
$$ 43 78 29 -54 -51 28 78 51 -51 -74 9 76 47 -44 -75 -33 57 65 -7 -78 -53 38 67 10 -58 -69 24 67 30 -51 -77 -6
4112fP9k4q2m6N4Q9Oq2n8J7J07L3o7p8NQ9M4n2p5j4P2Q0l4q9m6O4Q6j0p1o7L6
$$ -6 73 49 -33 -79 -25 64 70 -12 -70 -53 54 87 20 -58 -53 36 80 28 -47 -61 11 91 57 -32 -78 -14 72 62 -9 -76 -40
4143d0P8M7q5p1J3Q3N4n1q2j2P5P8l4q1n8O8P8Oq2o0L7R7K5o2q1J2Q5M8m5q9j3
$$ -40 38 85 0 -71 -58 25 79 28 -54 -66 9 87 53 -28 -86 -18 60 66 -16 -76 -39 58 83 21 -60 -48 37 85 40 -49 -62
4174f2P9O9k0r8m2N5R1J2r1p1L1J07K1p1q1J2R1M7n6p5k7Q3P0k2r6m0O1Q2Oq4
$$ -62 17 86 66 -32 -74 -19 72 84 -7 -78 -47 60 81 10 -71 -59 32 79 23 -52 -79 4 74 52 -44 -84 -23 59 65 -19
4204a9n5L0R0L7o8p6NR5N1n4r1pP2P2oj08m7O9R0j2q0o7L1J00M2q5p2OQ6N6n1
$$ -19 -74 -44 46 83 15 -61 -56 39 90 36 -55 -62 10 82 76 -32 -79 -10 80 68 -12 -79 -48 52 94 9 -63 -57 29 85 34
4235C4q5j2O3Q5l6q3n0O3Q2kq7o1L9J01M0q7q0J5R8N7o7q0j4Q3P9m0q9m0O6R1
$$ 34 -51 -63 0 85 49 -34 -84 -21 61 59 -28 -89 -50 51 91 4 -76 -61 37 94 27 -53 -67 16 95 55 -34 -74 -8 83
4265H3oq9n8M4Q4L0p4q2J7R8L3n4p5j4Q0O2m2p8m0P0Q5j0q6n7L9R6J5o8q1K3R2
$$ 83 77 -12 -70 -26 58 88 14 -68 -51 47 80 26 -49 -63 17 79 37 -41 -81 -11 74 64 -22 -79 -40 56 71 3 -78 -55 37
4296C7M1n1r4oR3N3j7r5l3O8P2Nr3m6M6Q4J8p4q0K9J04K0n9o9j3Q4N4l4q9k4N9
$$ 37 78 27 -67 -73 20 73 56 -39 -72 -4 68 73 -20 -66 -20 64 82 8 -72 -43 61 81 22 -47 -60 24 78 44 -45 -69 -10
4327a0P0kq8n5M6Q0K7q7o4K9P8M4m8q3pQ1O6k8r4l1P4P7j5q9m5M1J02Lp1o4K0
$$ -10 60 58 -30 -85 -39 41 68 -19 -83 -54 24 68 20 -63 -70 11 77 49 -45 -76 -2 75 60 -29 -74 -33 69 72 1 -63 -43
4358d3Q9L6n1q5j3Q5Q1m9r9k8N3J02k1q2n8M6Q9J5o5q4L1Q7K5m2q4NO4O3l0p6
$$ -43 46 82 31 -54 -67 18 99 50 -49 -77 -24 78 57 -25 -83 -37 52 67 2 -82 -51 36 61 19 -65 -60 4 67 37 -39
4388c9m5O8Q6j6q4m0L6R9J1p2p2J7J01L6m9q9j7Q6P6n3q0k5O4P3mq8n1M6Q9jo4
$$ -39 -84 -16 70 54 -30 -70 -34 65 76 4 -68 -51 50 86 37 -52 -69 17 93 40 -40 -65 -1 72 68 -20 -71 -25 64 63 -1
4419ap2J5J04L2n7p1rP3N5l7p6l7P0P6qq4n3L3R8K3p1p1K4P9M4n6p2mQ0O1l4r3
$$ -1 -73 -58 46 78 21 -50 -59 14 69 32 -44 -81 -11 65 57 -27 -80 -47 51 74 3 -68 -44 35 79 23 -49 -53 27 88 54 -39
4451c9j9N9Q0j9q3m5N3O6K6p3o5K7P6K0m6p5pP7N9l6q8k4O0R2m1p9m2O5P6kn6
$$ -39 -58 1 81 62 -21 -66 -13 53 79 6 -59 -32 44 64 18 -57 -64 13 72 36 -52 -76 -16 76 35 -44 -86 -21 55 53 -3
4482cp9L1R0K3n3p5OR2N1m9p6j2O6O5l1p4m6N1R7qp1n5K2R9Rn7o8j4R6M8m0q2
$$ -3 -82 -51 39 62 9 -66 -60 32 83 34 -42 -54 12 77 46 -28 -74 -23 74 66 -5 -60 -38 61 70 13 -55 -69 27 75 35 -47
4514d7j3N4P4j6q2m0M3Q0Lp1n8L4P3K8n4p7J5P7M8m2p9j9O5P5k2q5k5M9P5Pq6
$$ -47 -60 -6 68 52 -30 -70 -27 53 56 -15 -73 -39 34 62 8 -69 -54 23 71 29 -50 -69 -4 71 49 -36 -61 -12 63 70 -16
4545a6m4L1Q6J8o2p4J3Q1M0m0q5j4Q2N7k8q3k7M8Q0Lq8n6M1P5K8p0o2RP6N7o1
$$ -16 -60 -29 57 75 13 -61 -48 33 73 33 -52 -66 16 73 45 -38 -65 -17 63 66 -22 -78 -37 38 66 -4 -66 -57 19 76 15
4576A5p7j3Q5O6k9q4k6N3Q5j0p3o0L9Q1K7o4p4K0P9M7n1p8j4P5N9l4q4l1P1O2
$$ 15 -62 -75 10 76 47 -37 -63 -10 75 65 -8 -68 -29 52 79 15 -59 -39 40 87 36 -42 -56 19 78 44 -40 -71 0 62
4606F2Jp2o6L6Q6K3q3n4J6P3M8n7p9%P2O2m4o3l8N1P8ko6n1L6Q1K8o4o2J0O9N1
$$ 62 63 -9 -75 -39 47 70 -13 -67 -51 22 70 13 -66 -66 6 68 24 -39 -77 -26 52 50 -16 -67 -31 50 78 14 -48 -38 31 82
4638H2n5q2J3O5L9k7o2k9N6N9nn8o1L6O9J6n6o1J3P3L9n2p2qP5N2l6n7l3O3N1
$$ 82 27 -55 -42 23 62 35 -27 -56 0 59 54 -4 -65 -29 40 56 0 -61 -48 25 64 12 -60 -68 7 59 23 -34 -67 -4 47
4669D7Lo3n1M7N4K3n0n6MO9L6l5p7PO5M5k7o1l8O5N5Mp0m8L3P0J7n6o7K0O8L2
$$ 47 50 -13 -64 -17 37 60 10 -46 -42 27 63 28 -49 -42 23 68 41 -20 -58 7 62 66 -4 -52 -19 51 68 12 -55 -35 33 65
4701F5l4p2k5O2M6j0p3l5N9O0j0n0l9K4P3J4n6n8JP3M7l9o8rP4M4k9p1k0N1P2
$$ 65 31 -41 -66 -4 42 32 -41 -76 -17 43 33 -17 -56 -32 41 55 -1 -59 -58 15 62 23 -45 -54 20 64 35 -36 -56 -5 67
4732F7j3n7m1L1N7K0o5m9J6N8M1n4o0kO9L9l0p0k7O6N6po6m9L3P0K1o2n8J1Q1
$$ 67 54 -3 -44 -13 44 64 -1 -50 -34 24 65 11 -49 -51 18 57 27 -43 -70 -4 52 45 -21 -70 -37 33 54 -8 -66 -55 26
4763B6M5n9o7oO6N6l2o2k7N4O9oq1l7M5P3%m8o2J5P8L2n8o6MO2M2k3p6k0N0N9
$$ 26 71 12 -55 -61 5 61 29 -33 -60 -6 63 57 -24 -61 -16 57 57 9 -53 -38 40 72 14 -52 -48 14 56 33 -43 -63 -13 46
4795D6%o6m1J5Q7Lm2o1K5N7L5n6n9%O7M3k9m9k8M9N5j1m8l4L4N9Nm6o5L3N5L1
$$ 46 46 -20 -61 -46 41 44 2 -59 -34 23 58 2 -57 -57 10 53 24 -25 -53 -4 51 40 -8 -42 -8 51 56 10 -55 -22 33 64
4827F4m4n9NN5M5l7n2k2M1M8ln5m6M3N4J0o3l9K1N6L6m6o3MN6M9l5o2j3M8N7r
$$ 64 20 -39 -34 21 66 29 -23 -45 -4 44 41 -14 -60 -17 37 47 -16 -55 -34 22 58 12 -51 -47 9 58 23 -39 -52 -4 53 44
4859D4n4m4L1P0J1m9n3J1O4L3m0o3KO0M8l4o2rL7N3oo4k6K8N7Mn1m8K1N1K7l4
$$ 44 -10 -54 -23 47 58 9 -44 -33 31 64 24 -39 -37 23 71 37 -25 -34 3 56 50 -14 -40 -12 45 49 -2 -50 -29 22 49 15
4891A5o7JN9M4l1n8j5L2O3qo7k3K9O2Pm9m2J8N9K2l2n7QN6L3k6n0k3N2N6j9n0
$$ 15 -52 -51 8 52 21 -37 -52 -20 43 35 -32 -55 -26 36 43 -6 -48 -30 29 51 19 -38 -30 26 59 33 -17 -40 12 68 49 -1
4923am1L6N1J1o9l3K8O0J4n4m2mO7L0k7o9jM5N5k7m9m4M3N8J5n4m9K7O5J3n4n6
$$ -1 -42 -6 45 56 -13 -46 -18 42 56 2 -40 -44 23 53 26 -43 -44 1 56 29 -20 -64 -21 37 52 -2 -51 -24 41 54 0 -56
4955e6J2P4K6k0o6j5N9L3Ko5l3M4N8%n9m0K4N6K7o1m5J5N4L3j9o4k8O4M2k0m6
$$ -56 -44 30 56 36 -30 -45 14 47 49 -16 -49 -5 53 53 -6 -46 -22 34 61 0 -45 -30 24 57 38 -26 -54 10 52 32 -14
4986a4m2M1M9Ln0n4L9N1K1m9m8RN7L6l6m2j7M8N5j8n7k4L4N4%n4k9K1O7J1o1l8
$$ -14 -56 -15 34 37 -13 -67 -28 23 44 -5 -53 -44 13 49 13 -29 -46 2 57 39 -18 -42 -8 46 46 -8 -37 -16 51 62 1 -37
5018c7PN2K8l3m2rM4L4ro1k3M6M5km3m6J9N7J6m8m2oP4J0k6l6j5M5M4j0m9l5L7
$$ -37 -30 22 50 17 -25 -34 10 44 35 -26 -49 -3 42 40 -3 -49 -30 27 43 -5 -47 -53 21 31 5 -31 -46 -1 43 33 -16 -51 -14
5051a4O2qn8k8L8M6J1m3m1J0M5L4k9n1%M0L6j8m8l2M8M9mn6l0J0N4J6l9n6J5N1
$$ -14 48 40 -18 -46 -8 38 49 6 -35 -25 20 54 25 -26 -26 14 50 32 -16 -48 0 49 45 -11 -41 -31 23 39 0 -56 -41 10
5083A0K7l1l6rK9N9l5l3k5K7M7J2o7j3J3O0Ql2l9lN8J3j6m5rM4M1j1n5k7N0L0
$$ 10 37 6 -30 -39 -10 49 14 -19 -44 -17 30 42 -25 -38 -25 35 43 11 -28 -31 27 40 24 -21 -30 14 55 44 -11 -38 12 42
5115D2lm4j8QM2J6l5l4LL4K3j9n2KL3L8j2m4k1L2M8qm6l1K5N0Jl0l1J7L8J8k6
$$ 42 39 -5 -23 -15 27 43 8 -26 -23 11 34 15 -37 -35 -2 36 24 -20 -41 -9 39 31 -15 -46 -21 29 30 0 -31 -14 24 42 16
5148A6m3mL4M2k2l5j5L2L4kl7l0K8J5K7l5l8J5L9J4j5n2qM6L5l2l6j2K6M7qm1
$$ 16 -27 -31 3 45 23 -12 -27 5 39 37 0 -30 -2 13 40 5 -33 -18 21 35 20 -32 -40 6 41 9 -27 -39 -13 34 26 -15
5180a5k3QN2Ql9l8K2L9K7k6l8oL8K2ll6k2M5K3Mn0k2K9L9Ql6l9RM1J8k0m7lL9
$$ -15 -38 -30 22 30 -9 -47 -25 14 41 15 -23 -29 9 31 28 -8 -30 15 38 42 -8 -30 -1 38 46 10 -29 -20 21 39 19 -28 -31 8
5214HL1l0k6j6K8K7Jl4k3J7K9J8m3k6QM2K7l0l5oM8K1k0l5j6L9K9kl1k5J2L4K2
$$ 8 39 9 -17 -33 -5 22 23 -11 -34 -17 12 30 -13 -39 -31 11 38 8 -27 -33 15 36 16 -19 -35 4 33 31 0 -25 -13 21 43
5247D3k8l6J4L1J9l3l1mL9J8mm4j3K1L4j2j7k5J5K5J2k5l4J3L2K2j9l9nL5K7j7
$$ 43 15 -21 -7 24 43 10 -21 -25 14 32 28 -16 -29 -8 26 14 -3 -28 -13 12 24 -1 -35 -22 10 32 13 -26 -31 4 31 14
5279A4m1j7L4M7j4k5l7L1L5Mk9rnL9Oj4l6kM4K1k0l7j6M0K6j9k0k6RM5Lm2k1J4
$$ 14 -27 -44 -10 37 23 -2 -39 -8 27 31 2 -7 -12 27 33 19 -17 -19 25 46 26 -11 -27 13 39 20 0 -26 -17 28 31 -11 -32 -18
5313a8L8Lk1k3qK8K8k2k5k1M2K2ok6k3J8K5L0m9k1J8L2J0k4j6j0L5J8j7l8lL3
$$ -18 20 23 2 -21 -29 -1 27 5 -20 -41 1 23 17 -9 -32 -14 11 41 -8 -29 -11 21 31 7 -9 -19 16 34 17 -21 -24 9
5345IJ6j5j5k4K2K7Jk8k5J5L1Nk7k7oM1L1l2k4pK8K1ol5jJ4K6Ql4k5K0L1Pj4l7
$$ 9 25 10 -5 -29 -7 20 21 -7 -32 -17 14 19 -8 -35 -41 0 31 -1 -25 -32 -4 17 11 -24 -25 -11 15 23 -11 -36 -16 15 22 8 -29
5380b9J1L2J6j8l8MM4Ork2j9K2K7mj7l0J0K2J3k1k3jL3K2k4k8qJ8K5nk9oJ0L6
$$ -29 -18 14 30 12 -26 -22 22 28 19 -3 -22 0 27 23 6 -24 -14 8 21 0 -23 -24 9 31 7 -21 -29 -11 14 9 -20 -26 -16 20
5414B0j3k0j6J6K4J2k3j5LL2J1l5rrL5K2j5l1lK9K0j2j6k5J1K9Mk2k6J8L1Kk7
$$ 20 7 -13 -29 -13 11 23 0 -15 -12 20 31 -4 -13 -22 13 35 20 -11 -14 15 35 23 7 -18 -7 22 26 4 -22 -4 27 29 2
5447Bk0nK5J6j9j8nK7J7qj2l6L0J9lj7k2J8K5J2l3j4OK6J0j5j3j2K9Qjk1KMJ6
$$ 2 -18 -23 2 18 -1 -19 -24 3 20 12 0 -36 -6 13 10 -7 -29 -11 14 26 -7 -21 -15 11 21 6 -7 -19 10 18 17 -4 -2 2 18
5482A8Nj8j7J4J8J2k1j2mK1Jrk3%J8K1l3Pk6K2K6qk5j2J0K4jk1pQL2pj9kQPJ7
$$ 18 23 5 -12 2 20 32 11 -1 -5 16 17 8 -15 -15 3 24 -9 -2 -28 -6 20 12 -13 -25 -15 9 8 -13 -20 -12 20 13 -6 -8 0 7 24
5519B4rj3j6J8K8jk3j2JK5Qj8j4MJ9Pj2j2nKJ9kj9rJ7NMj9j8RL9j3j0j6pK5jK
$$ 24 15 2 -14 4 32 31 8 -4 -3 22 30 12 -2 2 21 28 16 4 -1 1 20 18 -1 -10 7 12 16 -3 -21 -12 27 14 4 -12 -19 6 5 7
5557Gk4pK3J9j0j6kKL2rj9%KK1%j8j5J9J0J6j2k3LJ7J6j1l0MmJ9J0j1l8K8J4J
$$ 7 -17 -24 -1 18 8 -8 -10 -8 24 15 -4 -4 -2 19 19 1 -14 5 15 31 19 -4 -1 16 32 21 -9 -5 -9 10 20 9 -29 -1 13 14
5593A4j9j7J4MK1j3k0JOJ3J4k6rJ6J7oj6j6J4K4Qj1k1JJ6J8k1j3%J9J1Kj6j3J1
$$ 14 -5 -22 -8 -4 17 4 -16 -15 -9 4 18 -8 -17 -1 16 10 -6 -22 -8 16 24 13 -8 -7 9 27 6 -7 -7 12 23 25 9 -4 7
5628GJ9oj9nJ5J1Nj5k4JQK2j5j1rK7knj6qJ3J3Qk4KrJ9J4j2j6LJ3J7j2j1lJ2J0
$$ 7 26 20 1 -4 11 22 27 12 -12 -11 -3 19 4 -7 -16 11 9 4 -12 -20 -7 6 14 -10 -8 -17 2 16 4 -12 -9 4 21 9 -2 -5 7 17
5666A7Pj9j4RJ6J9k9j4QJ0Nnj6mJ0J1omj0%J8Lk4lJ1NJ7j8k0J9RNj0nj3K1Rj0
$$ 17 24 5 -9 0 16 35 6 -8 0 10 15 10 -6 -10 0 11 5 1 -9 -9 9 12 -12 -15 -4 1 18 0 -20 -1 8 13 3 -2 -15 6 15 5
5704Ej5QJ4JJ1j4j0J5MPj7j0QLMjj0pJ7Jj3j1oK0mJ2j0j2POQj8j4LJ8lRj5mJ8
$$ 5 -10 -2 12 13 24 10 0 15 19 26 9 -1 7 10 14 13 3 -4 13 14 1 -10 -16 4 0 12 2 -10 -3 3 11 -7 -21 -18 0 -3 6 -9 -13 5
5744EkPk1j1L1ll%j8OK4Rk1rJ0K2j1oj0nJ1J8j1k1LJ4J7j0k9nK3O%j7j3K3KpP
$$ 5 3 10 -11 -22 9 6 3 3 -15 -9 15 24 3 -6 4 26 15 9 -1 -6 5 23 12 -9 -6 8 25 15 -14 -19 4 10 10 -7 -20 3 5 -2 5
5783Ek2J8qK6j8j1j9K1J7rj2rJ6J2mj5RJ1MJj6JkJ9Qk6JJ2OLj3j5K1j3J6pmj4
$$ 5 -17 1 -7 19 1 -10 -29 -8 9 0 -12 -21 -5 7 3 -12 -3 8 12 13 -3 -2 -4 15 23 -3 -2 10 16 19 6 -9 12 -1 15 8 4 -10
5821a0J7MrkoPKKQk1rJ4JMk1J3MRjrnJ3OlnkjJ0qJ2qKPK%qqJ9oQj1nJ0%pkj6K
$$ -10 7 11 2 0 -6 1 3 5 13 -8 -17 -3 -2 2 -19 -6 -2 7 6 -3 -8 5 11 8 3 1 0 10 2 14 6 8 15 17 17 9 1 20 14 22 11 6 16 16 9 7 -9 -7
5869gK1%j5MjpQj2j0NJ1nOojPONrrNNQNk1J3LkKlj0K0Kjj0qJ4JJj2L%L%kj3R%
$$ -7 14 14 -1 3 2 -5 3 -9 -19 -14 -3 -8 -2 -8 -9 -2 4 9 0 -9 -4 1 9 14 -7 6 9 7 9 6 -4 16 18 17 7 -1 13 14 15 3 6 6 9 9 7 -6 3 3
5917CMpj1M%NmjmJ6oKpPJjJ2oj8NRJ2j3qQPrM%JNjOj1klJ7Kj9JoRJ4j3rkOQj0
$$ 3 7 0 -11 -7 -7 -2 -6 -7 -11 5 -1 1 -6 1 2 1 13 7 -11 -6 3 15 2 -6 2 9 0 4 4 5 10 9 15 4 2 -1 16 18 -1 0 -6 3 17 4 -5 -7 -1 7 -3
5966cj6J2OMj2jLJKLnmJ1Plj3%MRLj9KJ2NjQrr%J4j6J2omNkjnJ1JjnmnJ1%j2J2
$$ -3 -19 -7 -1 3 -9 -10 -7 -6 -4 -1 -6 -10 1 8 5 -8 -8 -4 5 8 -11 -9 3 8 7 15 6 -3 -3 11 -5 7 1 -3 2 0 -1 -6 5 6 5 0 -4 -9 2 2 -10 2
6014Bnj1PJ1j2llJ1KqJkKR%mkRkOloORqkMLqMkjjLQj8J5pKLoj5%JJ6mnj9J9Pj8
$$ 2 -3 -14 -7 4 -8 -11 -14 -3 -1 -9 -8 -10 -8 1 1 -3 -5 4 2 8 5 -1 5 14 6 4 8 11 3 7 5 4 3 6 14 -4 11 4 6 9 3 -12 -12 -11 5 1 -4 -23 -4 3 -15
6065a5RJkJLnnkJ1%PMj5J7j0OLj5QJ7j2Oj4%J0lnjJ2j1J9j7pjNNlJmoJ2lj1nP
$$ -15 -6 -5 -7 -6 -3 -8 -13 -15 -4 -4 3 7 -8 9 -1 5 8 -7 1 18 6 12 -2 -2 8 5 0 -1 11 0 19 2 -5 -6 -1 4 1 2 -2 -8 4 1 -10 -15 -8
6110hlJ6j9PQmLrPoJJ0mKKoJ2qJkNjRj1Nj2J1J4j8%kJ3Jknk%Pj3JJOkPj1kjJ4
$$ -8 -11 5 -14 -7 1 -3 0 -9 -2 -8 -7 3 -1 1 3 -3 9 1 2 0 5 4 13 2 7 -5 6 20 2 2 0 13 14 12 7 5 5 12 -1 0 1 7 5 12 1 -1 -2 12
6158A2jj1j1J2kmOLj4J3LLrqJ6Nj2RJj2J7mmJKnMOqj0J5%j4J2rJ3plJqlJ8j2k
$$ 12 11 0 -11 1 -1 -5 1 4 -10 3 6 9 0 -8 8 13 1 10 11 -1 16 12 8 9 11 6 10 16 8 -2 13 13 -1 11 2 15 8 5 6 -2 -5 13 1 -1
6202amlPpONokJ2j0pQMmLoLOlOloQMlKmLMOrrORlpPj0k%J0rjp%LPpqJ0KQpqoJ4
$$ -1 -5 -8 -1 -8 -2 3 -3 -5 7 -3 -10 -2 2 -2 1 -5 -2 4 1 7 4 -2 6 10 7 9 5 8 12 18 9 0 6 15 12 5 12 2 0 0 10 1 0 -7 -7 -4 3 -4 -12 -2 0 8 1 -7 -13 1
6258Amo%POQklk1K2Qj3jLJJ2mopJ3Qj5koQ%PqqNQlmj0oJ2nJ9k1pMJ0nJmJ4pkl
$$ 1 -3 -9 -9 -2 4 12 10 7 -14 8 16 3 2 5 6 18 14 8 1 14 22 7 5 -1 7 7 14 6 -2 3 11 8 4 -6 -12 0 -5 14 -7 -14 -10 0 -5 -4 -8 6 -1 -3 -6
6307fkkJ2Rj0jMNNonkNQj0R%OrOnmjJ7j6M%rOnmKPj3J0lkpMKKmj1JRjNoPJpJM
$$ -6 -8 -10 2 11 1 0 4 9 14 8 3 1 6 14 4 13 13 19 10 16 11 7 6 23 7 11 11 2 8 3 -1 1 8 -5 5 2 0 -7 -3 -1 1 -3 -14 -13 -4 -5 0 -6 1 2 -5 -4 0
6360@LkJ1oJj%L%n%%PNj4RpQLj1Qj0J0j1J3j3rJ8oqnPj1LkJ3j7NMNJ2j1N%ljO
$$ 0 3 1 12 6 7 6 6 9 9 4 4 4 11 16 2 11 4 12 15 4 12 2 12 1 14 1 -8 10 4 -4 -9 -2 -13 -10 -12 1 -16 -11 -7 -2 10 -1 4 4 1 0 6
6407FJj8K3lJnkJ8mqkJ0rMkmJ3ml%jj4OlPj2M%NOk4RoJ4p%pJ1kKljKJlJ6jj2J6
$$ 6 7 -11 12 9 10 5 3 21 17 9 7 17 8 12 10 6 19 15 12 12 11 -3 3 0 7 -5 -1 -1 4 10 -14 -5 -11 3 -4 -4 -11 0 -2 0 -3 -4 -2 -1 -4 12 11 -1 15
6456A5mMj0LlNJ4j8MJoR%j6QJJ2nj3JKQojqmJ8j4kQpMjM%KoJ1Nj5oKqJ4lJ0Kk
$$ 15 11 15 5 8 5 10 24 6 10 11 5 14 14 -2 6 7 19 14 1 2 4 12 6 5 -3 -7 11 -3 -5 3 -4 0 -1 3 3 5 -1 10 15 0 -6 -4 -12 2 -1 9 11 9
6504IJjLlmRoOnMKj2kjNMKj2MoJ2j1qON%oOlmoK1j4nkJ9lMrLQrQjoKJ2qMj8J8
$$ 9 10 9 12 9 5 14 8 14 9 13 15 3 1 0 5 9 11 -1 3 -3 9 -2 -10 -4 1 1 -5 1 -2 -6 -12 9 -5 -10 -12 7 4 8 -1 2 10 1 9 8 2 4 16 8 12 -6 12
6555A2qQjLkPj3LlLoqJ9j0mJ5nOLj7rOl%Oj5ORj9QNmMJOkklQj5J4nRMpMMMk0J6
$$ 12 4 12 11 14 12 19 6 9 6 9 3 -5 14 4 0 15 10 16 19 2 -7 -1 -4 -4 2 -13 -7 2 -17 -9 -4 -8 -4 -3 3 1 -1 -4 4 -11 3 -2 7 11 4 8 12 16 -4 12
6605A2ojJNrJPnLNj7%QlLk0J3nJ2j0lnK4j9J0%j0jk%N%%RnNlOmjPkm%NQk1J1k
$$ 12 6 5 6 11 2 3 10 5 8 13 -4 -4 4 1 4 -16 -3 -8 4 -6 -9 -14 10 -9 1 1 -9 -10 -12 -12 -7 -7 -7 2 -3 2 -1 5 1 0 7 5 1 1 6 14 -7 4 2
6654BJ9j7Llj9L1j3kkJ3nnlj5RRmLrnPjQj6JmK2po%pJ4LKj0LJ4qKkNKlRj6Qj0
$$ 2 21 4 7 4 -15 16 3 1 -1 12 7 2 -1 -16 -7 2 -2 1 -8 -13 -6 -7 1 -15 -14 -18 4 -3 -9 -9 -16 -2 1 3 -7 -4 10 2 4 2 7 9 6 15 -1 7 -3
6701cJ4nmJ0j1M%kMj2J0k0J5JKkmNmLpLNpN%kkLKPj4jJ2jNmoJ0lRjKmMj4QMj1
$$ -3 11 6 2 12 1 5 5 3 7 -5 5 -15 0 1 3 1 -3 2 -2 1 -6 -3 2 -5 0 0 -2 -4 -1 1 8 -6 -7 5 4 9 5 -1 9 6 15 14 16 12 16 2 10 14 3
6750CONj8J3nLKoj1OORj3pPkJ6j8j1K0ko%pQMJjMqlJ2nRj4MJ4qpPKKmOk%jjmj0
$$ 3 9 14 -4 9 4 7 9 3 -8 -2 4 13 0 -7 0 -2 14 -4 -15 5 3 -3 -3 -10 -2 2 3 2 6 -2 -5 7 2 11 -3 1 15 7 0 7 9 11 7 13 11 11 10 9 5 -5
6800eJ1MmrKLnPo%j3LJ8pj1MNjnKJJNlNj3RjJ3oJqJ1nkJ1%oPj0KolJ0pLqJ0JP
$$ -5 6 10 6 -3 -1 2 -3 4 -2 -2 -15 -12 6 -1 -12 -8 -3 -4 -9 -7 -6 -5 0 -3 2 -11 -2 -3 10 4 5 -3 8 3 1 12 12 6 13 3 5 -1 -4 6 -1 2 -6 4 5 12
6850A2qkj5K3j9J7j9MkMOkj4J3jrPqOpKQ%KKPjnJjPjJJrJ9lj2KRj0JpJ3j0%Mp
$$ 12 4 2 -13 10 -9 8 -11 -7 -9 -5 1 -1 -15 -2 -3 -12 -5 -13 -7 -14 -12 -4 -4 -2 0 7 6 1 2 1 8 7 8 9 0 19 16 4 6 15 5 6 -1 12 2 2 6 -1
6898aKj2J6p%j3J2nlRM%pLJ1pmLojO%j%J9plj4OJ5nMnLnKNk0OJ0qkPj0lONMj6
$$ -1 1 -11 5 -2 -2 -15 -3 -8 -11 -2 2 2 -5 -2 9 2 -2 1 -5 -6 0 0 -1 -1 18 11 8 -6 0 15 10 14 9 12 7 9 14 -6 0 10 2 0 7 -3 -6 0 5 9 -7
6947gP%J6j8kMLj3jJ2nkPj1Pj2J1Rj1Kj2J5K0j9J5k4J6J1oKojKn%Pj6kJ1J0rL
$$ -7 0 0 16 -2 -4 0 3 -10 -11 1 -4 -6 1 -10 -3 -15 -4 5 -6 -4 -16 -1 19 0 15 -9 7 18 12 14 8 7 9 4 4 11 -5 -7 4 14 5 8
6989HJkmp%KJnQ%j0LMoQKj2QmJJ0j2RMj0LLJPqopK1nRj4N%KKj4RLJ%qJ2j3KPr
$$ 8 9 7 3 -4 -4 -2 -1 -6 2 2 -8 -5 -1 -7 1 3 -9 -1 -5 -4 6 -6 3 7 -3 0 3 4 11 3 -3 -10 11 6 15 1 6 6 8 10 -4 5 8 9 9 1 13 0 2 9 0
7040@ojj%RrllJ1lj2J3jJ1mJmjJ%J0qkQlJK%%lJ5krJ2j5QrJ3j2%J1poJlJ2nn%
$$ 0 -6 -7 -8 -8 1 -8 -11 -14 -3 -6 -18 -5 -6 5 1 2 -2 -3 -2 -2 8 0 -2 6 3 4 6 6 6 3 18 16 7 19 4 12 3 16 4 4 15 8 2 3 0 12 7 2 2
7089BrKKPj3J0nP%kpqJ4nNmKkJ8j8NlNQqpK6j7J7oj4nJ0J5j0mpNJ3j1mQlmnL%
$$ 2 -7 -5 -3 4 -9 1 -4 3 3 1 -6 -14 0 -5 0 -4 -2 -4 14 -4 1 -2 3 11 3 -4 22 5 22 16 2 -3 7 22 12 8 1 6 19 8 4 12 9 5 0 3 3
7136CQj0%j6J0kLNj1Qj9J3oJ4mkJ1j4J1jNJLj0kNJlJ2j4J2mOJj4KOJMoqKQj0Q
$$ 3 11 1 1 -15 -5 -7 -4 1 -10 -2 -21 -8 -14 0 -4 -6 5 -9 2 1 6 7 10 0 -2 3 4 1 13 -1 11 7 13 14 0 2 8 9 13 7 -1 1 9 -1 7
7181GjqKmJ1j0kQpRjlj5RNkLpK3lj5KQjJ1oonJNNqmQOlnKrPlQr%PQj7rQpJ4j2
$$ 7 6 -2 0 -4 7 -3 -5 3 -4 5 4 1 -14 -5 0 -2 1 -6 17 14 -1 1 9 8 19 13 7 2 3 8 13 5 1 9 15 12 7 9 0 7 4 12 3 3 10 18 1 -8 0 -7 7 -5
7233e%KKM%pkLlJQJOpk%PlJrJ4j2J4j2J3j0J0j5J7rk%j0QLoQklrLOrJ0rLjpNq
$$ -5 -5 -3 -1 3 3 -4 -6 -3 -6 -5 3 4 10 3 1 1 8 5 6 -3 11 -1 13 1 14 4 14 -1 16 7 5 5 -5 3 6 0 8 6 3 -6 -3 3 -6 4 -5 -2 -3 -10 -5 -13
7283a3kJ4roPKJJ0qMkJkMJ0krJ1jj0JJ0kj2J6jmN%nklQ%j3j0LQJJ3k0PqQpj%L
$$ -13 -15 -1 -10 -16 -9 -7 -6 4 -4 0 -2 -1 -3 1 11 9 0 11 10 0 1 11 9 -3 13 12 8 13 13 8 6 3 11 11 -2 -12 -9 -1 0 13 -7 0 -8 0 -7 -8 -8 -5
7331eN%PrrOPq%MQjMj2N%LK%qQJ1j3%nJ1ljolLjJ0Qk5NmNrKJQk%%Kj1RjJq%LL
$$ -5 0 0 7 -2 -11 -5 2 -6 -6 -2 6 5 9 -3 2 2 5 7 7 -1 7 18 5 5 0 11 8 7 1 -2 1 0 10 18 -7 -2 -6 -1 -10 -8 -7 1 -1 -1 -1 1 -10 -1 -2 -1 -9 -9 -6 -3
7385cJ1qnPj4J0J2rjKRoOqMNj1J4prJ9j6Op%Jj5MKPj2J8j2NlNKnqrJ5kj%jLjP
$$ -3 8 0 -5 2 -12 -2 10 1 0 2 11 5 11 3 7 12 1 15 8 -1 18 2 8 1 1 2 -13 -9 -7 0 -12 6 -6 -1 -4 1 3 -2 -10 -19 -4 -6 -7 -7 -8 -5 -6 1
7433AqLmJ4Mj1LkJ6j3NkMrJ3%pMj2JNkJNmj1J5n%j%nNpMKj5R%O%j0%PLj1J2lj
$$ 1 -7 -4 -8 6 10 -1 2 0 16 3 8 6 10 1 14 14 7 11 -1 0 5 3 4 9 5 -6 9 4 4 3 3 -2 3 -4 0 2 -13 -4 -4 2 2 -8 -8 -1 2 -9 3 0 -1
7482aNNmJ1pkRll%LLmOqkljOj7J3nOlmLpJLPj7LJ0rNkLlMj5J7j1J4KOqj9K2j0
$$ -1 4 9 5 16 9 7 16 13 10 10 13 16 12 18 10 8 5 4 10 -7 6 1 7 4 0 3 -4 -3 0 7 -10 -7 3 -6 -1 -3 0 -3 1 -14 3 -8 6 8 14 6 -13 9 -1
7531aKOKLOp%lJ1Jk1J2nJkLLlMk2J7mjJ3j9klLLlQpQmrMMNnlJ0j2jPLK%%KmJO
$$ -1 1 7 9 12 18 11 11 8 19 20 -1 11 6 7 5 8 11 8 12 -10 7 3 2 15 -4 -6 -9 -6 -3 -6 2 -5 3 -1 -10 -6 -2 3 -2 -5 5 -7 -8 -1 2 4 4 4 6 2 3 9
7583IqRJkpQmMJp%JQJj3NKJooMkQj4RqMqJ0qKPqKOJqK0j5JPqJ1%jkPj0PqJ%J3
$$ 9 1 10 11 9 2 10 6 10 11 4 4 5 13 14 1 6 8 9 3 -3 1 -1 7 -7 2 -6 -2 -10 0 -8 -6 1 -7 -5 1 2 -6 14 -1 0 7 -1 10 10 9 7 14 4 11 3 4 4 17
7636A7j0qnJ2MjlnMqOmKj1J1mJp%jJ0k%Lj5MJ5lpnOJKK%L%Oj2pJ3OLj1J1j1QJ
$$ 17 7 -1 -6 6 10 9 6 1 5 -3 3 -1 1 -10 1 -3 -2 -9 -9 -10 0 -2 -2 1 -14 -10 5 2 -5 -10 -4 -3 -1 1 1 4 4 10 -2 -9 4 10 13 2 13 2 10 11
7684A1lnlMjJpk%MJnOLrjM%Kj0JJ0j1PPj1J3k1J8LooJ1%mLkKRknNJnjJ3j1Nmq
$$ 11 8 3 0 4 3 4 -3 -5 -5 -1 0 -5 1 4 -5 -6 -2 -2 0 -10 -9 1 -10 -3 4 -7 6 -15 3 6 0 -6 5 5 1 4 2 4 13 11 6 11 12 7 6 19 8 13 9 1
7734AJ2qlP%j0J0pjOj1KPjj3QlKjnpOkJ4j3J9j6RmMJ4j5nJ7KKqJKQnj0J0kmLJ
$$ 1 13 5 2 9 9 -1 9 2 1 7 -4 -2 5 4 -9 -1 -4 -2 -3 -8 -15 -9 -11 3 -10 9 -7 2 -2 2 16 1 -4 13 15 17 9 10 12 20 15 5 15 13 9 12 13
7781A3mjj0J7j1jm%lKqO%JlJkMKpJ1%njllQQpQp%%PM%j2RNlJl%%nj0ljJ7qjKq
$$ 13 9 8 -2 15 4 3 -1 -1 -4 -2 -10 -4 -4 -3 -6 -5 -7 -3 -1 -8 3 3 -2 -3 -6 -9 -1 7 0 8 1 1 1 8 12 12 0 9 14 11 12 9 9 9 4 -6 -9 -10 7 -1 -2 0 -8
7834hRJOqknOno%NqPKnJ9j4QjNpJ0Mpj2OJL%PrLLlLj3J9nlJpQlljJoRrJ1j1kk
$$ -8 1 2 8 0 -2 -7 -1 -6 -12 -12 -7 -15 -8 -6 -11 8 -6 2 1 6 -1 9 13 6 -6 0 1 4 4 11 2 5 8 5 8 -5 14 9 6 7 0 8 5 2 1 2 -4 5 -4 7 -4 -6 -8
7887hNrQqJ6oj0JJ1j1O%%Qj6J2kMjJmJ2KlJ4j4Jj3K2mmpNPj4QqKnkJ4j6J3j3N
$$ -8 -3 -12 -4 -12 4 -2 -12 -11 0 -11 -5 -5 -5 3 -13 -1 -3 1 0 1 -3 9 11 8 22 8 9 -4 18 14 10 3 8 15 1 9 1 3 -2 -4 10 -6 7 -6 -1
7932aOj8KQjqKKnLNOmKPkrLkMpJ8k2J6%PkqOjJljJ%MlpKQj0kjoQJMpnpJ2KKrk
$$ -1 5 -13 -11 -3 -4 -12 -10 -8 -13 -10 -5 1 -3 -1 6 4 -5 -2 -4 0 -7 11 -11 5 5 12 10 2 8 7 8 5 4 5 5 9 6 -1 1 9 -1 -3 -4 -10 -2 -1 3 -4 -9 -16 -4 -2 0 -9 -11
7987a1QjnJmLjRJnmJ7rKkNPql%QOj0NmqJ3Rqj1NJ0j1%%j5RO%j7J1KnrjPNLlkk
$$ -11 -3 -4 -9 -8 -12 -9 -10 -1 0 -5 -9 8 -1 1 -1 4 11 3 0 0 8 14 4 9 5 -3 10 19 11 0 5 15 4 4 4 -11 -2 4 4 -13 -2 0 -5 -14 -15 -8 -3 0 -3 -5 -7
8038gNjjlJ2LnQmkj%noQPOqPlj2J1pMJlJ1j3Jj2N%J2j0lrKKlMnOokNJ7j6LJ4j1
$$ -7 -2 -3 -4 -7 5 8 3 11 7 5 4 4 -1 -7 1 8 14 6 13 10 -2 9 2 6 7 4 15 2 3 -9 -4 -4 8 -2 -5 -14 -12 -10 -13 -9 -14 -8 -14 -16 -11 6 -10 -7 7 -4
8088dkPjPoK%oJ6j3PnOrKkMmmNpJ3mj0NqQQNj8mRQj0qlJ6l%j6K5j3NKk0J0PQn
$$ -4 -6 1 0 7 1 3 3 -3 13 0 7 2 8 -1 1 -1 3 -1 -5 0 -7 6 2 -8 -3 -11 -3 5 10 -8 -12 -3 5 -5 -13 -16 0 -3 -3 -19 6 -7 -2 0 -20 -10 -3 5 0
8137@oORlPrkKK0j2qkjJ0%j2%rK1j3LJj2J8kj3KLLKlj0nPJ0qpQkKKkmJJ0Kkrj8
$$ 0 -6 0 9 6 13 4 2 4 24 12 4 2 1 11 11 -1 -1 -10 11 -2 1 2 -10 8 6 -7 -5 -2 1 3 0 -10 -15 -8 2 -6 -13 -5 -7 -5 -3 -5 -9 -8 2 4 2 -7 -25
8186b5L4Oj3pK
$$ -25 9 15 2 -5 -3
8191c
$$ Imaginary data points
##PAGE= N=2
##DATA TABLE= (X++(I..I)), XYDATA
0@%%%%%%%%%%%%%%%%%%JrJ6j6J6j6J6k4L2l2L3m1M9n7O5p3Q1r0J05j20J34j48
$$ 0 0 0 0 0 0 0 0 0 0 0 0 0 0 0 0 0 0 0 1 -8 8 -8 8 -8 8 -16 16 -16 17 -24 25 -32 33 -40 41 -49 56 -64 70 -78
40g8J65j84K02k23K47k74L04l34L67m03M45m90N39n95O57p29Q08q97J002j124
$$ -78 87 -97 105 -118 129 -145 159 -175 192 -211 234 -256 283 -312 345 -384 424 -473 529 -595
60e95J267j442J664j948K326k860L678n106Q295k7935J3952O3769k8666n6514
$$ -595 672 -770 894 -1054 1272 -1588 2090 -3016 5279 -22656 -8704 55065 26399 -30115
74c0115j1115M7682K5635j6881k8911m549Q724J6967J3919o319l3906j5367L4542
$$ -30115 -41230 6452 32087 15206 -13705 -18254 -9530 7437 21356 15037 -18869 -34236 306
87C06M2638j9279n7795r563N6843L5855l7289n0934J0790M7128J2473l0022k1218
$$ 306 42944 23665 -34130 -43693 13150 49005 11716 -39218 -28428 18700 31173 1151 -20067
100b0067Q116J4780O219K468p226j9450n641K7644K4924k1867m1646M757M7454
$$ -20067 -11951 2829 9048 11516 4290 -15160 -20801 6843 31767 9900 -31746 -26989 20465
113B0465J6580m0198l2843K3353L8049n087l1633o910J8800Q606o935j614K157
$$ 20465 37045 -3153 -35996 -12643 25406 20319 -11314 -18224 576 9182 2247 633 2790
126B790q501o039J5434J5847j5239k6324P808L2488L607l1962j4339K5600K0745
$$ 2790 -5711 -11750 3684 19531 4292 -22032 -14224 18264 21871 -10091 -24430 1170 21915
139B1915j6823k1718R373J8869n551j5290N188J3626o247j4552O380J6928m442
$$ 21915 5092 -16626 -7253 11616 6065 -9225 -4037 9589 3342 -11210 -4830 12098 7656
152G656j8838J036J9104K336j7948m497J6608N524j6347o595J7231R142j8149
$$ 7656 -11182 -10146 8958 11294 -6654 -11151 5457 10981 -5366 -11961 5270 14412 -3737
165c737j3755J7205J9491j2974k4089N685K5109K492k1472q312J4576R247p799
$$ -3737 -17492 -287 19204 6230 -17859 -12174 12935 15427 -6045 -14357 219 9466 1667
178A667n165M934j271p962N643J5767m161k4241m200K8341J6781k4714k8344J3556
$$ 1667 -3498 1436 165 -7797 -2154 13613 9452 -14789 -18989 9352 26133 1419 -26925 -13369
192a3369L3576J059k9843j3022J8775J7205n729j2095k764R26K288R887P163j3951
$$ -13369 20207 21266 -8577 -21599 -2824 14381 8652 -3443 -6207 -5281 -2993 6894 14057 106
206A06k0831P872L1561O621l3320k3423K4146L5041p420l6178r749K6429J9942
$$ 106 -20725 -12853 18708 25329 -7991 -31414 -7268 27773 20353 -15825 -25574 855 20797
219B0797j0651j8935l383Q058Q658O542k574j6686j1874J6365K7274m660l5562
$$ 20797 10146 -8789 -12172 -4114 4544 11086 8512 -8174 -20048 -3683 23591 18931 -16631
232a6631j3599L1988L0270j7564l7786j511L3045J6755j8812k1682K318J4961
$$ -16631 -30230 1758 32028 14464 -23322 -24833 8212 24967 6155 -15527 -13209 1752
244A752Q249r38p866j2527k982J8056J8569j2260l0919k578L3723J9820k5382
$$ 1752 10001 9063 1197 -11330 -14312 3744 22313 10053 -20866 -23444 10279 30099 4717
257D717l1816R574L3629O627k5223j6349J1345J6104J005p327n954m619J592J3043
$$ 4717 -27099 -17525 16104 22731 -2492 -18841 -7496 8608 9613 2286 -3668 -8287 -6695 6348
271F348R463j3303k1355M857K8045Q536k6119k0910J6456K7058l521k4977p065
$$ 6348 15811 2508 -18847 -13990 14055 22591 -3528 -24438 -7982 19076 15555 -9422 -16487
284a6487J6662J1251o822q329L53J069q4N890N572q573j3540N344J9789K411k1182
$$ -16487 175 11426 4604 -3725 -3372 -2303 -2387 3503 9075 502 -13038 -7694 12095 14506 -6676
299f676j1275J7180J7586r823j9218K380J6584K313j1952l238Q087J461o849Q83
$$ -6676 -17951 -771 16815 6992 -12226 -9846 6738 9051 -2901 -6139 1948 3409 -3440 -2557
313b557Q237j719j0924K58J3044K943j3412o452J1941R056r610j0261P484J0679
$$ -2557 5680 3961 -6963 -6705 6339 9282 -4130 -10582 1359 10415 805 -9456 -1972 8707
327H707o119j1189N105J2344l596j3787R38J4535K622j3612n985J0858P795p351
$$ 8707 2588 -8601 -3496 8848 5252 -8535 -7597 6938 9560 -4052 -10037 821 8616 1265
341A265p233M696M942m426k554O728K122j0269m975J2766J0564j1886j6747O858
$$ 1265 -5968 -1272 3670 -756 -3310 3418 5540 -4729 -9704 3062 13626 1740 -15007 -8149
355h149K0602R85j9906q673J4559J2925o779j1962K09O511J976L39J390m591q629
$$ -8149 12453 13438 -6468 -15141 -582 12343 5564 -6398 -6189 322 2298 2637 4027 -564 -9193
370i193L326J5824L682j8815j3677J5261K2222n949k5209n445K1025J4093j1570
$$ -9193 -5867 9957 13639 -5176 -18853 -3592 18630 12681 -12528 -17973 3052 17145 5575
383E575j6266J261J1391M958k340m174n886l128Q633J3108l904k0419o654K0938
$$ 5575 -10691 -9430 1961 6919 4579 405 -5481 -8609 24 13132 9228 -11191 -17845 3093
397C093J8324j3652k5751J388K5466J0586j7633j7099O027J5622L806p503p219
$$ 3093 21417 7765 -17986 -16598 8868 19454 1821 -15278 -9251 6371 10177 2674 -4545
410d545k724K818R517O929r056j6916J100K1879J0811j8912k1292R073K5524L381
$$ -4545 -7269 -4451 5066 11995 2939 -13977 -12877 9002 19813 901 -20391 -11318 14206 17587
424A7587k1796j2977J2239J5795j638j1324m911K523M617N556J951q534j1080
$$ 17587 -4209 -17186 -4947 10848 9210 -2114 -7025 -4502 115 5671 7622 -912 -11992
437a1992M679J7871M329j8751j4313J3061K0800l361k1075o094J5541J1420p301
$$ -11992 -7313 10558 14887 -3864 -18177 -5116 15684 12323 -8752 -14846 695 12115 4814
450D814j0870L92N768K069N73N95m498o453L760J2176J294j4588q375J2410J4255
$$ 4814 -6056 -5664 104 2173 2746 3341 -1157 -7610 -3850 8326 9620 -4968 -13343 -933 13322
465A3322o600j6510k69J4634N390j0088p082N314N599k588k576K776J89n065o
$$ 13322 6722 -9788 -10057 4577 9967 -121 -7203 -1889 3710 1122 -1454 1322 1511 -3554 -3560
480c560P788K138r244n546Q551Q711o125j0379L024J0396m90r375r47Q280J548
$$ -3560 4228 6366 -2878 -8424 127 8838 2713 -7666 -4642 5754 5264 -4111 -5058 3222 4770
495D770p755j988P771K891p771m327P133N801n750o551M008O337k787n456K639
$$ 4770 -2985 -4973 2798 5689 -2082 -6409 724 6525 775 -5776 -1768 4569 1782 -3674 -1035
510a035M855l492n381M410P378m215j0142K033J2305J925j2412o405R885R595
$$ -1035 3820 328 -5053 -643 6735 2520 -7622 -5589 6716 8641 -3771 -10176 -291 9304
524I304n504j0028R90P627J562l664r54L59k439K11O666K789r185q291Q006J3825
$$ 9304 3800 -6228 -5238 2389 3951 287 -667 -308 -2747 -2536 4130 6919 -2266 -10557 -2551 11274
540A1274k940j6520m296J4811J0624r110j3323J903J1274L514n694m655l82J121
$$ 11274 8334 -8186 -12482 2329 12953 3843 -9480 -7577 3697 7211 1517 -3138 -3520 -2399
554b399L621N091k041j0520l963J1978J1677q170j7344L07J8157Q264j3547j3796
$$ -2399 1222 6313 4272 -6248 -10211 1767 13444 5274 -12070 -11763 6394 14658 1111 -12685
568a2685N566J4002K130r161n983J944M415L812J454m954q472P11J2756P050j1770
$$ -12685 -7119 6883 9013 -148 -6131 -4187 228 4040 5494 540 -7932 -7221 5535 12585 815
583H15j4658N506J8468L407j6602j1070R916J4237j577j1840m540N488N799J270
$$ 815 -13843 -8337 10131 13538 -3064 -14134 -4218 10019 8442 -3398 -7938 -2450 3349 4619
597D619j963m870m582L358J0289K518j1977r961Q573J5434j505j6422o116J2640
$$ 4619 2656 -2214 -6796 -3438 6851 9369 -2608 -12569 -3996 11438 9933 -6489 -12605 35
611C5J1070o049j1521k61P882L499k446k523j843j650K698O604K66r585n620Q926
$$ 35 11105 5056 -6465 -6726 1156 4655 2209 -314 -2157 -3807 -1109 5495 5761 -3824 -9444 -518
627e18J0865m844j3552r72J2684N995q901q329M166P517o69m632k72J581j292
$$ -518 10347 5503 -8049 -9021 3663 9658 757 -7572 -3406 4111 3442 -1190 -1462 119 -1173
642a173j13M049J022o191l810O489P062m686r271J541R657J592q358l623O251
$$ -1173 -1286 2763 3785 -2406 -6216 273 7335 2649 -6622 -5081 4576 6168 -2190 -5813 438
657D38M240m500l802L633L288l717l245M011L940l924m981L162N773j974n893
$$ 438 4678 178 -3624 9 3297 -420 -3665 346 4286 362 -4619 -1457 4316 2342 -3551
672c551Q57N542l02n193K40N383k01o181n18P173K246p573m605O597O844m331
$$ -3551 -2694 2848 2546 -2647 -2407 2976 2775 -3406 -3924 3249 5495 -2078 -6683 -86 6758 2427
688B427p864J394P193R60n131j687K787N21j527J791K345l747n036L752Q491j301
$$ 2427 -5437 -4043 3150 4110 -1021 -2708 79 600 -927 864 3209 -538 -5574 -1822 6669 5368
704E368j0768l113J0462P702p268j0451K322J0110K253o889m384K402L240R74
$$ 5368 -5400 -8513 1949 9651 2383 -8068 -5746 4364 6617 -272 -4656 -2254 986 1960
718A960M63j338m637j650O739O714n367j1265O00J2986N610j0764j0541N385J2037
$$ 1960 2423 1085 -3552 -5202 1537 8251 2884 -8381 -7781 5205 10815 51 -10490 -5105 6932
733F932P68r536m955M403N406O49k081l068l011J460P137L428p891r256M478J3214
$$ 6932 7700 -1836 -6791 -2388 3018 3667 1586 -1482 -4493 -3033 4104 7532 -359 -9615 -5137 8077
749H077J737j3181q160R065J1951k691j1505l103P361N755j734m295k482k57L100
$$ 8077 9814 -3367 -11527 -2462 9489 6798 -4707 -7810 -449 5306 3572 -723 -3205 -3462 -362
764c62N370J49q148n794P063J0985k301j3237m042J1391R245o376j1059M52R063
$$ -362 5008 5157 -2991 -8785 -1722 9263 6962 -6275 -10317 1074 10319 3943 -7116 -6664 2399
779B399L650m533m354lJ675K234K615j052o010k893O683P530m096j0616o39J0724
$$ 2399 6049 1516 -2838 -2841 -1166 1068 3683 2631 -3379 -6272 411 7941 3845 -6771 -7410 3314
795C314N421p912q225L547Q209K76n808k070K606J367l71J041K32l520k143M555
$$ 3314 8735 823 -7402 -3855 4354 4630 -1178 -3248 -642 725 354 1395 1627 -1893 -4036 519
811E19N096l571p540Q68Q399K313p345m731N064N606k687n037J164L801q81k826
$$ 519 5615 2044 -5496 -4628 3771 6084 -1261 -5992 -928 4678 1991 -3046 -1882 1919 1038 -1788
827a788J473K720k117l503K188M582j445n288J08N392J121m857j892M167K174
$$ -1788 -315 2405 288 -3215 -1027 3555 2110 -3178 -3070 2322 3443 -1414 -3306 861 3035
842C035l787k254L795K667l951l570L693M797k741n708J068N842O85m954j839
$$ 3035 -752 -3006 789 3456 -495 -4065 -372 4425 1684 -4024 -2956 2886 3571 -1383 -3222
857c222L447J881k136q88J828m28k806J016M639j74o284k155O696N142n258p475
$$ -3222 225 2106 -30 -918 910 482 -2324 -1308 3331 3157 -3127 -5282 1414 6556 1298 -6177
873f177K245Q073J140o557l474L640L752p67j933n72r17l93L104L243l202o555
$$ -6177 -3932 4141 5281 -1276 -4750 -1110 2642 1875 -58 -630 -1547 -1940 1164 4407 1205 -5350
889e350P90Q578L269q013p236M803R348l46q515l520N279N065j279l701j537L58
$$ -5350 -4560 4018 7287 -726 -7962 -3159 6189 5843 -2672 -6192 -913 4152 2873 -828 -2365 -2007
905b007J671L095R12m618m920L222Q310O25r174n363O988Q798k632r394k029P040
$$ -2007 -336 2759 3671 -947 -5867 -2645 5665 6290 -2884 -8247 -1259 7539 4907 -4487 -6516 524
921E24M911k979m837p84K149K340J654r58m410k656M573O662j899q994k571Q493
$$ 524 5435 2456 -2381 -3165 -1016 1324 2978 2020 -2390 -5046 -473 6189 4290 -4704 -7275 1218
937A218O810n276q947P21Q212L059n107m499J263L267J325k04j433k899q87M255
$$ 1218 8028 2752 -6195 -5474 2738 5797 690 -3809 -2546 721 2046 1842 409 -2490 -3377 878
953H78M360l090p175j72P977M005o317o732K952P362M60n743k606L013K728o56
$$ 878 5238 2148 -5027 -5199 2778 6783 466 -6266 -3314 4048 4508 -1235 -3841 -828 1900 1244
969A244j056k59j167o69K603K803k431m937O61O080J815n588m045L814N149j620
$$ 1244 188 -71 -1238 -1907 696 3499 1068 -3869 -3208 2872 4687 -901 -4946 -1132 4017 2397
985B397m840j39L660P84k325m16J617m26j826J045K689r43l633R2M120J090l883
$$ 2397 -2443 -2582 1078 1862 -463 -879 738 312 -1514 -469 2220 1277 -2356 -2264 1856 2946 -937
1002i37k158L161K715k335k774J763K622j546k634J512K979j316l502O84L879
$$ -937 -3095 66 2781 446 -2328 -565 2057 511 -2123 -611 2368 1052 -2450 -1766 2113
1017B113K82l752j257L093J809k181j710J497J150j461n89K072O11k976j452L474
$$ 2113 2395 -1357 -2614 479 2288 107 -1603 -106 1044 -417 -1006 1066 1677 -1299 -2751 723
1033G23K927l057m404J587N257L64m833k181L353L041j473k524L7J017J36O37
$$ 723 3650 593 -3811 -2224 3033 3397 -1436 -3617 -264 2777 1304 -1220 -1183 -166 -30 607
1049F07J047j359l055N98M707J549n061m172L653O166r92o432j940M882L825k263
$$ 607 1654 295 -2760 -2162 2545 4094 -967 -5139 -1486 4680 3688 -2744 -4684 198 4023 1760
1065A760l796k57K081J324M28m37k266j949K299M598l79o009k801N399N771k883
$$ 1760 -2036 -2293 -212 1112 1540 1103 -1163 -3112 -813 3785 3406 -2603 -5404 -5 5766 2883
1081B883p080n97O262L403l691m344N98L197J455o58j479j887m53K966L289j928
$$ 2883 -4197 -4794 1468 4871 1180 -3164 -2566 631 2086 1428 -51 -1938 -2391 575 3864 1936
1097A936n534q72O059M133m447o374J298O708J886m952l795K055L763M69j885
$$ 1936 -3598 -4470 1589 5722 1275 -5099 -3801 2907 4793 -159 -3954 -1899 1864 2333 448
1112D48j513o51N67K431J776k460m232O26N586K195n074m749K868N968n5n308
$$ 448 -1065 -1716 -1149 1282 3058 598 -3634 -3008 2578 4773 -301 -5050 -2182 3786 3731 -1577
1128a577k207L307L025j066k186l79M23K93J226J081j754k945Q63M271J024m360
$$ -1577 -3784 -477 2548 1482 -704 -1083 -660 -367 859 1940 186 -2759 -1896 2375 3399 -961
1144i61l055L176M359j311m427m95L493J472k093j442J029O81p79J85J325n40
$$ -961 -4016 -840 3519 2208 -2219 -2714 779 2251 158 -1284 -255 426 -353 -168 1157 617
1160F17k215J17K934Q43l013j964K436K745j499k932O06K640q0k228j4J989n0
$$ 617 -1598 -1481 1453 2296 -717 -2681 -245 2500 1001 -1931 -1325 1315 1235 -993 -1007 982 932
1177I32k069k3K370L75k545j005K392J610j890j905J263J799q14j484Q04J228
$$ 932 -1137 -1160 1210 1585 -960 -1965 427 2037 147 -1758 -495 1304 490 -994 -190 1038
1193A038j127j390J489K006j440k881P76L532L85l498j665K712K527j487k521
$$ 1038 -89 -1479 10 2016 576 -2305 -1529 2003 2388 -1110 -2775 -63 2464 977 -1544
1208a544K91J766K37o65J26q2j188l4K312J094k744k720K116M099n15m505j485
$$ -1544 -1253 513 750 85 211 129 -1059 -1093 1219 2313 -431 -3151 -1035 3064 2549 -1956 -3441
1225c441L727L011k022l397J31K513J043q65r40o48l51J140K129k80l373j624
$$ -3441 286 3297 1275 -2122 -1991 522 1565 700 -240 -888 -1239 -99 2030 1750 -1623 -3247
1241c247L336L688j946m863l73M672K531l108l596Q88L222Q73j616j417k82N08
$$ -3247 89 3777 1831 -3032 -3405 1267 3798 690 -2906 -2018 1204 2077 461 -956 -1238 -730
1257g30J439J313j191l034m02L723K566k938m273R19M819J359l862k977J899L324
$$ -730 709 2022 831 -2203 -2605 1118 3684 746 -3527 -2608 2211 3570 -292 -3269 -1370 1954
1273A954P8k276j241N33J028R83L42j432k098N57L284J249l263l109J921M251
$$ 1954 2032 -244 -1485 -952 76 1059 1401 -31 -2129 -1572 1712 2961 -302 -3411 -1490 2761
1289B761L1m033j891K740K798r82k454m27J238Q00J57q6r32j254O91K411M97k792
$$ 2761 2792 -1241 -3132 -392 2406 1424 -1030 -1457 -219 581 738 652 -280 -1534 -843 1568 2065 -727
1307g27k023K179L168q36l437o59K830J632j686j800O29J225r7m19L13j38j016
$$ -727 -2750 -571 2597 1761 -1676 -2335 495 2127 441 -1359 -730 495 398 -21 292 154 -862
1324h62J10J709N25j996j437J699K173r35k450N4K236N56j700p83J219O61j001
$$ -862 -752 957 1482 -514 -1951 -252 1921 986 -1464 -1410 826 1382 -318 -1101 118 779 -222
1341b22m42J090L89j310o32J436J069j297j454Q80J620l98j515P9J255l3j069
$$ -222 -664 426 815 -495 -1127 309 1378 81 -1373 -493 1127 729 -786 -707 548 515 -554
1358e54J80J142l09j459J64J853L17k014j042J783J672j131j947L42J697K49j088
$$ -554 -374 768 459 -1000 -836 1017 1334 -680 -1722 61 1733 602 -1345 -1003 694 943 -145
1375a45l44M72p1k53P58N66j200j392J116K267l40k762q39K547J921j618k468
$$ -145 -489 -17 -88 -341 417 983 -217 -1609 -493 1774 1434 -1328 -2167 380 2301 683 -1785
1392a785L82K194O35j283r26J80M33M59O19k99j596o53J909K000j312l017n9L200
$$ -1785 -1403 791 1426 143 -783 -603 -170 289 908 609 -987 -1640 269 2269 957 -2060 -2119 1081
1410A081J608k412k652R65K733M92j876j260N10J031O13M0q75j365J25K186J292
$$ 1081 2689 277 -2375 -1410 1323 1815 -61 -1321 -811 220 833 873 -2 -1367 -1242 944 2236
1427B236k017k694Q65L393P81l032k201J770K791k02k308r74J105J186K04m47
$$ 2236 219 -2475 -1610 1783 2564 -468 -2669 -899 1892 1690 -618 -1592 -487 699 903 456
1443D56r07q08O27J907N12k246j934J583K988k16l168j260K383K247j070k305
$$ 456 -451 -1259 -632 1275 1787 -459 -2393 -810 2178 1962 -1206 -2466 -83 2164 1094 -1211
1459a211k05J567Q41m37o39m52k38O35J252j7j857j063J691K097q23k618l43K365
$$ -1211 -1416 151 992 555 -84 -536 -774 -139 1113 1096 -761 -1824 -133 1964 1141 -1477 -1820 545
1477E45J341j546j735N62J459J24p59k50J03j81J56Q35J13j288p71J293J470q11
$$ 545 1886 340 -1395 -833 626 750 -9 -259 -156 -337 -181 654 767 -521 -1292 1 1471 660
1495F60j883P6J858N74j444r28R30Q83n43o25M50L92o32l64Q58N96r41r64P90
$$ 660 -1223 -1147 711 1285 -159 -1087 -157 726 183 -442 8 400 -232 -596 262 858 -83 -1047 -257
1514b57J257m28j319NJ199K12r39k56P81J39q21n5J020J69j225n17J270R96j023
$$ -257 1000 572 -747 -742 457 669 -270 -526 255 394 -427 -482 538 707 -518 -1035 235 1231 208
1533B08j372N29J439L3j183l72P22L40l22jK64m49n87O51J188m41j693k20J853
$$ 208 -1164 -635 804 837 -346 -718 4 344 22 21 285 -164 -751 -100 1088 647 -1046 -1266 587
1552E87J051j476j696O84J831J86j406p31O49P03M1j50k84o15q6J132R12j078
$$ 587 1638 162 -1534 -850 981 1167 -239 -970 -321 382 423 273 -11 -626 -712 420 1332 254
1570B54j772L71K240O87k017j666J190K114j08j820p77R85J053l4n74n80l34M85
$$ 254 -1518 -1147 1093 1780 -237 -1903 -713 1401 1293 -527 -1304 -319 734 700 126 -454 -788 -303
1588c03J195K82j516j350J068K207n1k373j146J792J966p02k058l89J404J007
$$ -303 892 1174 -342 -1692 -624 1583 1532 -841 -1987 -195 1771 1069 -989 -1378 26 1033
1604A033m05q58m46R2O92Q52j97j461p95J395J786o45k287m78K083J450j265j875
$$ 1033 628 -230 -676 -584 108 960 763 -698 -1493 -98 1688 1043 -1244 -1722 361 1811 546 -1329
1622a329K32J600N75q38p85j4L64M90M38l67j142k91J358J198j016j835J85J982
$$ -1329 -1097 503 1078 240 -545 -559 -195 295 733 366 -776 -1067 291 1489 473 -1362 -1177 805
1640H05P22j559j327P94J393l2j007l34L58K56R8K15j56p53j95J032P70q95j279
$$ 805 1527 -32 -1359 -565 828 796 -211 -545 -187 69 167 382 226 -527 -722 310 1080 185 -1094
1659a094L89J501K06j311o94Q98Q40m51o86J78M09k00j98M14K06o35m29O92P52
$$ -1094 -705 796 1002 -309 -1003 -105 735 284 -402 -224 185 -15 -213 201 407 -228 -657 35 787
1678G87n42r72K28J018Q6q67k74O62K65n07j66N31Q3o88j51Q57L92q69p46O93
$$ 787 245 -727 -499 519 605 -262 -536 126 391 -116 -282 249 332 -356 -507 350 742 -127 -873 -180
1698a80J001l34j045n9Q40K74m96k25K20j6k24L13M88m18q96K00J241K89j271
$$ -180 821 487 -558 -617 223 497 1 -224 -4 -20 -244 69 557 139 -757 -557 684 973 -298
1717b98q79R35J286l41j290k80R22O01l53m76j14K0J96N10J71q20q00O64J385
$$ -298 -1177 -242 1044 703 -587 -867 55 656 303 -173 -287 -267 -71 439 610 -210 -1010 -346 1039
1736A039o5j616p22J337J356o33j563j61J216P13n26p62j48K92M74M04k58r83
$$ 1039 974 -642 -1364 -27 1329 696 -867 -1028 188 901 375 -387 -535 -243 231 635 377 -606
1754f06l95J093J183o26j724k00J720J066j171j578L09J495M84r10q11J17N68
$$ -606 -1001 92 1275 649 -1075 -1275 445 1511 340 -1238 -929 566 1050 140 -671 -554 14
1771A4M69Q3n04q01jJ177P73r62j469K64J743O01j434j263O98J436J07j086n99
$$ 14 483 566 62 -739 -740 437 1210 248 -1221 -957 786 1387 -47 -1310 -612 824 931 -155 -754
1790g54L97O19K06j48m58m87J97R62M04r87j068N40J474J64j438p95R47J149l14
$$ -754 -357 262 468 320 -138 -625 -428 534 938 -49 -1117 -577 897 1061 -377 -1172 -225 924 610
1809F10j044k11O13L85j16j66j81k67J21O66K54p96p57N88J095j09j168l78R29
$$ 610 -434 -645 -32 353 237 71 -110 -377 -256 410 664 -132 -889 -301 794 685 -483 -861 68
1828F8O87n26p07J63N21j3k48R7P9l02j39M92L57n25o05L49P87p8p92j66O20L03
$$ 68 755 229 -478 -315 206 193 -55 42 121 -181 -320 172 529 4 -601 -252 535 457 -335 -501 119 422
1850D22m16k79L01J68l20j01M42J52n71l31N93N57m25p31J55P39J11n72k54L40
$$ 422 6 -273 28 196 -124 -225 217 369 -202 -533 60 617 192 -539 -384 355 466 -106 -360 -20
1870b0J69j38J1J58k18l59K72O72j14q97k47Q99O61o47r22K13Q99K03o22m04K17
$$ -20 149 11 22 180 -38 -397 -125 547 433 -464 -711 188 849 202 -720 -507 392 595 -27 -431 -214
1891b14L02Q7M6j30m19j55O30O02m98j012M4J170N09r41r50M36J073J41q07n19
$$ -214 88 175 221 91 -328 -483 147 749 251 -761 -717 453 962 21 -929 -493 580 721 -86 -605
1911f05L16N07J68j45l79l80J84P77L24q05r12M35J268J98j206q15P60J129j19
$$ -605 -289 218 386 241 -138 -518 -334 443 767 -38 -950 -515 753 951 -255 -1070 -310 819 700
1930G00j016m21N57N95K0l65l90j62L84O55M5q87o34O91J107j44j249m99R72R49
$$ 700 -316 -737 -180 415 435 70 -320 -482 -98 557 602 -285 -919 -228 879 735 -514 -1013 -41 908
1950I08m03j018j62O97M86j90m15k36K8L54M60j20p66l65P28Q54l61j093j71R92
$$ 908 505 -513 -675 22 508 318 -97 -333 -305 49 509 389 -377 -742 -14 840 479 -614 -785 207
1970B07O29o06q18J21P04K11l52k82k2P5K18K48j09n32k06N85N83m03q13K7Q41
$$ 207 836 230 -588 -467 237 448 96 -186 -208 -133 85 333 224 -308 -514 71 654 251 -562 -535 306
1991C06L10o14n14K95N13o3l14l9J13n6MK48M1l82k48M21M39k65n96N5N84J51
$$ 306 616 2 -512 -217 296 233 -81 -120 -7 -63 -59 189 230 -152 -400 21 460 195 -401 -346 238 389
2013C89m42k49K77K16j76j30J99P0k97j10M01K21l94m10K85N20q5n04j00L73J82
$$ 389 -53 -302 -25 191 15 -115 84 154 -143 -253 148 369 -25 -435 -150 370 285 -219 -319 54 236
2034B36k14j21J02j7j20J35K75j33m84kN99K57n47n24L37O54l5n76k35L55L14
$$ 236 22 -99 3 -14 -134 1 276 143 -341 -343 256 513 -34 -558 -221 433 398 -178 -413 -58 256
2055B56q5j68r6q3M7L24J86l76n15K00P48J44p45n17M93P59j15p20k52M47M07
$$ 256 171 3 -93 -176 -129 195 381 5 -510 -310 438 582 -163 -680 -187 572 457 -263 -515 -68 339
2076C39p4k95j97k2K21L57K2n30m18M42P41o9q63l91P05P18k90q19j43O09M20
$$ 339 265 -30 -227 -249 -28 329 351 -179 -597 -155 586 517 -346 -737 -32 686 396 -423 -566 43 463
2097D63k08m27j47J43L14K33j72n31j85N54O07l08q46j32Q12N54n03p49M9O70
$$ 463 255 -172 -319 -176 138 371 199 -332 -517 37 644 336 -510 -642 170 724 221 -528 -479 191
2117A91L08l64m10j8K29K65R6k31m04n9N51M23l96p19N0P77L34n79n97K29O19
$$ 191 499 135 -275 -293 -64 201 297 66 -338 -397 154 577 181 -538 -488 289 623 44 -553 -324 295
2138B95R7m17k59J18K01J17K8j56k82rM37K75l70n40J43O40J59n50l87L12M65
$$ 295 392 -25 -284 -166 35 152 180 24 -258 -267 170 445 75 -465 -322 318 477 -73 -460 -148 317
2159C17q2l52r5J83R6l2N4k2k08q8L02K57k71m14J11M87P9m11k23K66K67j40j98
$$ 317 235 -117 -212 -29 67 35 89 67 -141 -229 73 330 59 -355 -244 243 322 -89 -312 -46 221 81 -117
2182a17P5J01j05n1K03P6k75j98K75L39j74m15J8L91J21k76j67J37J08n6lJ01
$$ -117 -42 59 -46 -97 106 182 -93 -291 -16 323 149 -266 -248 143 264 -12 -179 -42 66 10 7 108
2204A08q9k28P4L63Q3m39k76L59M40j64m94p8M04K44k02k57MJ12R0Q5qk37k12
$$ 108 19 -209 -135 228 311 -128 -404 -45 395 231 -263 -341 63 307 105 -152 -148 -36 54 139 131 -106 -318
2227c18K41M48o9n69k26N08M96k74o11l5N10K87k47l60j5J91J87Q7j50l15r7L87
$$ -318 -77 371 302 -267 -493 15 511 237 -374 -409 101 388 141 -219 -234 -43 144 231 81 -234 -331 56
2249E6M12k33o43q2O48M26m25o38P9O12K44l69l84L2K79K21j6k38k93M4M52K87
$$ 56 468 235 -408 -490 158 584 159 -479 -400 212 456 87 -297 -265 14 235 219 -19 -312 -268 184 471
2271D71l79n88R3P13K68n75n63K56O37J13m92l29J80L39J18j35k41j71J38M03
$$ 471 92 -496 -403 310 578 3 -560 -304 333 446 -46 -375 -195 144 262 127 -114 -285 -147 256
2291B56J33m26m50K29O51Q8o06m14L79N63n7m88k05K50K79Kj37j55j00J22L12
$$ 256 389 -37 -487 -258 393 481 -125 -539 -160 403 346 -142 -347 -97 182 184 47 -108 -208 -86 226
2312B26O7l70l28K45N15j4n07k70L82M16j57l87n7K32J54o9p4m3p9K3K23J00k53
$$ 226 293 -77 -405 -160 355 341 -166 -436 -54 362 205 -182 -239 -7 147 78 4 -39 -118 -95 128 228 -25
2335b5k82J74L99Km00j73L00K62j38k56J9J55J5n7N4J5j38p2J89J97j83l05P6
$$ -25 -307 -133 266 268 -132 -305 -5 257 119 -137 -118 37 52 -5 49 64 -74 -146 43 240 57 -248 -172
2358a72L54N9l05j76J74K08o8j14OJ1n6N1J71mk87j20L01K98k01m26K9M11J62
$$ -172 182 241 -64 -240 -66 142 74 -40 -34 -23 -79 -28 143 139 -148 -268 33 331 130 -296 -267 144 306
2381C06k92k36P9K18N5o4o9j00m2J75K42j30m05o2M54L05l34m88P7N15J61l42
$$ 306 14 -222 -143 75 130 66 -3 -103 -145 30 272 142 -263 -325 129 434 100 -388 -311 204 365 23
2403B3l26J15K87J10j08j66j43M8K96J88k75m12N3N28K49m53m88J84N67J40m49
$$ 23 -303 -188 99 209 101 -65 -208 -160 136 324 49 -363 -310 218 467 14 -474 -290 277 417 -32
2424c2l26J58L51J14j74k30r5J43L10R4l42l86J84N59J20n32m13L09N64Qn06k64
$$ -32 -358 -200 151 265 91 -139 -234 -91 219 313 -29 -415 -231 328 448 -84 -497 -188 376 384 -122 -386
2446c86K62L49K2k35j95lJ70K57j8l37k57K48M79mn19k97L72M87j10m83j65L22
$$ -386 -124 225 247 12 -183 -186 -16 241 223 -114 -371 -123 356 352 -167 -464 -92 395 285 -198 -363 -41
2468d1K90n6k30j37M1J68J66m2k77j91K55L72o0m55j76L70L56j73l95m3K98J68
$$ -41 249 193 -37 -174 -133 35 201 159 -118 -309 -54 318 258 -197 -373 -3 353 180 -215 -258 40 208
2490B08j19j60l3M1P9J20j1k13j35J58L32p9l52j23L07K43j56k91J7K24N7r5m5
$$ 208 89 -71 -104 -63 16 136 125 -88 -223 -65 267 188 -164 -287 20 263 107 -184 -167 57 114 19 -26
2513b6Km0J0J44P0j92j87J31K85Nl03j30K23K14j05j90kR8K6j0L4m2j32k1K24
$$ -26 -24 -64 -54 90 160 -32 -219 -88 197 202 -101 -231 -8 206 101 -89 -91 7 33 23 57 15 -117 -138 86
2538H6J44k11k65J01L41N8l06j99J71K43l1j58q3L2O8Q8N0j16k19L7L18J37k81
$$ 86 230 19 -246 -145 196 254 -52 -251 -80 163 132 -26 -109 -77 -9 79 129 13 -206 -169 149 286 5
2561El32J47M19M9l46k37J93K90kk00j30J3J37J56ok09k17J41L68O6l81l13K45
$$ 5 -327 -180 239 288 -58 -295 -102 188 186 -14 -144 -131 6 162 156 -53 -270 -129 239 305 -76 -389 -144
2584a44M45Qm29k20K52L28j6k64j50N6J85J48n2k59j70K03L69j0m34k57L40M30
$$ -144 301 309 -120 -340 -88 240 224 -40 -190 -134 51 199 147 -112 -282 -79 290 280 -154 -411 -71 359
2606C59r1m53j88L28L34q3k92j48J37K02J09j26k46j00K43L31r3m27j54L59L70
$$ 359 268 -185 -373 -45 289 206 -86 -234 -97 105 214 88 -158 -258 -15 316 223 -204 -358 1 371
2627C71j68m34r0L45K66j43k79o2J50J79J6j06j93n1K25K46j35l61p9L61K79k15
$$ 371 203 -231 -321 24 290 147 -132 -194 -44 135 151 45 -148 -199 26 272 137 -224 -303 58 337 122
2649A22l78OL21J63j73k12J0J21J07K2q5j48l5J86J94j13k79p4K90K20j71k85
$$ 122 -256 -250 71 234 61 -151 -141 -20 87 109 24 -124 -159 27 221 108 -171 -245 45 265 94 -191
2671a91J6K53Q7j25j39J1P9M3M9k9j20r6J41K12n7k71p7K33K02j37k29JJ74Q0
$$ -191 -175 78 165 40 -99 -88 -9 34 83 54 -66 -162 -21 191 134 -137 -214 19 221 84 -145 -144 30 110
2695A10p3p5j4j1M6J00K4j65j39J35K47k5k77j02K10K14r4k13m7J35J00qn9q6
$$ 110 37 -38 -52 -63 -17 83 107 -58 -197 -62 185 160 -117 -219 -9 205 111 -102 -149 -14 86 78 19 -67
2719f7n1Q2J82J1k42j57J79K96k9l31j43K30K54o6k59r3J42J60K9r2j51n8J54
$$ -67 -118 -36 146 157 -85 -242 -63 233 204 -127 -270 -40 214 148 -111 -204 -62 98 127 35 -116 -174 -20
2742b0K19l5k96j68K71L11r3l66j33K96K74j02k91r3J89J78J4j44j68k1K10K06
$$ -20 199 164 -132 -300 -29 282 189 -177 -310 -14 260 158 -133 -226 -37 141 155 11 -157 -178 32 238
2764B38r9l14j03L01K90j45l94o3L16K67j57l07n5K13J86j2j83j55L2K19J58j45
$$ 238 139 -175 -278 23 313 168 -226 -289 27 294 137 -170 -225 -12 174 162 -21 -176 -144 75 233 88
2786H8k98n5L27K71k16l64k3L51K17k07k78j9K29J62p3j63j28N8K22J10j58k75
$$ 88 -210 -265 62 333 117 -247 -270 81 298 91 -187 -206 23 185 112 -51 -179 -121 101 211 53 -222
2808b22J0L17J83k24l09K5L36J34k06k41M9K04R1o3j38q9M1J81J00j45k30J0K80
$$ -222 -212 105 288 64 -245 -220 116 250 44 -197 -148 56 147 84 -54 -143 -102 79 179 34 -196 -186 94
2831I4J51k02k69M0K89R6j84j69L8J46P3m1r6q3J0J51J10j04k11j5K43J44j59
$$ 94 245 43 -226 -186 103 199 15 -154 -116 30 103 62 -34 -117 -107 44 154 50 -161 -176 67 211 52
2854E2k35K5K33R7j45j38K2R4O5Np1j01k6J48J42q0k36m4K24J72j31k44J4J95
$$ 52 -183 -158 75 172 27 -111 -89 5 70 75 4 -97 -123 25 167 87 -149 -193 31 203 72 -172 -158 37
2878C7J06q8j42k8P3R8N5p4j50n6J89J73r1k58p0K52J96j42k42j8J96J49p6j50
$$ 37 143 55 -87 -115 -42 56 111 37 -113 -169 20 193 102 -156 -226 26 222 80 -162 -180 16 165 89 -61
2902f1p6P4J46O5j04k02j8K32J71j54k78j7K90J77j76k62pK46J31r3j84p6J20
$$ -61 -137 -63 83 148 44 -158 -176 56 227 73 -205 -222 68 245 69 -193 -200 46 177 84 -100 -176 -56
2925e6J77L8j52k05L5K64J40j99k93M2L31J29k06k63L5K56J26j31j97l9J36J85
$$ -56 121 159 7 -198 -163 101 241 42 -251 -209 122 251 45 -218 -183 73 199 68 -129 -168 -32 153
2947A53Jj78j85P0K82J01k42k65J05L04J03k44k26P3K45R8j45j91k3J67J41j3
$$ 153 154 -24 -209 -139 143 244 2 -263 -158 146 249 5 -221 -148 97 195 50 -141 -164 3 144 131
2969A31j84j59J10K57M3k26k19J22K86N4k56j80J11K23N0j53j51K4J23J18k1j71
$$ 131 -53 -212 -102 155 198 -28 -247 -125 161 215 -41 -221 -110 113 163 10 -141 -117 6 124 103 -68
2991f8j16J14K22J6k27j68J37K41K1k18j42J14J73L1j29j10RJ10J10l3j36j17
$$ -68 -184 -70 152 168 -59 -227 -90 151 172 -46 -188 -74 99 130 1 -109 -100 10 120 87 -49 -166
3013a66R0K09L0j96j63J07K21J2j78j32Q0J57L8r9r9j5P6J22K1j54j24Q0K08L5
$$ -166 -76 133 163 -33 -196 -89 132 144 -34 -166 -86 71 109 10 -89 -104 -28 94 115 -39 -163 -83 125 160
3037A60j89j59R9K04L8j61j37M7J51O6p6j06n1P3J52J8j49j56P2K27O6k00j84
$$ 160 -29 -188 -89 115 153 -8 -145 -98 53 119 43 -63 -114 -41 111 129 -20 -176 -104 123 189 -11 -195
3060a95Q4K10O2j65j43L5J52Q6n8j46p2Q2J86L5j91j68R0K47O1k12j96R1K52M4
$$ -195 -111 99 161 -4 -147 -112 40 126 68 -78 -150 -68 118 153 -38 -206 -116 131 192 -20 -216 -125 127 171
3084A71j69j68L5J73J07p2j72o7J20J94Kk11j54J33K36L3k37j78J16K61J5j82
$$ 171 2 -166 -131 42 149 77 -95 -162 -42 152 154 -57 -211 -78 158 191 -46 -224 -108 153 168 -14
3106a4j63N8J97O8r5j78n1J47J97m0k15j32J53K33kk43j34J33K38Qk09j35Q4J76
$$ -14 -177 -119 78 146 51 -127 -178 -31 166 126 -89 -221 -68 165 163 -80 -214 -81 157 165 -44 -179 -95 81
3130H1P3j11j67k0J45J73o3k11j05J70K23l7k41j19J58K05j5j89j09Q5J55N2j08
$$ 81 154 43 -124 -144 1 174 111 -100 -205 -35 188 151 -90 -209 -51 154 139 -50 -159 -74 81 133 25
3153B5j47j7J53J32o0j88q7J68J86m5k12r9J52J82k7j72q1P4J47L6r7j29k1J43
$$ 25 -122 -139 14 146 86 -102 -189 -21 165 120 -92 -191 -39 143 116 -56 -137 -63 84 120 23 -106 -127 16
3177A6J24m4j91o6J39J81m4k01q6J40J58j2j35j12M8J38O3p4j34l4J20J37l1j78
$$ 16 140 96 -95 -161 -22 159 115 -86 -172 -32 126 114 -21 -133 -85 53 116 42 -92 -126 -6 131 100 -78
3201g8q8J40J71l4j81q5J11J61nj38j02M5J34O9p5j45l4J30J47l5j89r0J37J75
$$ -78 -166 -26 145 111 -70 -155 -44 117 112 -26 -128 -83 51 120 45 -100 -134 -4 143 108 -81 -171 -34 141
3225A41k5j80r0J03J66Nj36j01L4J34Q9q9j48l3J34J46m0j91r7J42J94k3j92j04
$$ 141 116 -64 -154 -51 115 120 -16 -117 -83 51 140 51 -97 -130 4 150 110 -81 -178 -36 158 135 -57 -161
3249a61J02J68K0j43j23K8J64Q7r4j60m2J53J63n8k04q4J57J79l7j86r6J19J66
$$ -161 -59 109 129 -14 -137 -109 55 142 48 -112 -154 -1 162 104 -100 -184 -27 152 115 -71 -167 -48 118
3272A18J0j53j09L7J61Q0r2j72k7J67J46p2k11n2J55J71m3j91r1J11J78J0j54
$$ 118 128 -25 -134 -97 64 144 52 -120 -147 20 166 94 -117 -169 -14 157 114 -77 -168 -57 121 131 -23
3295b3j25N7J65O1r8j66j0J63J43q1k05n0J50J69m2j90p7J26J61j4j45j09O3J56
$$ -23 -148 -91 74 135 37 -129 -139 24 167 86 -119 -169 -19 150 108 -82 -159 -33 128 114 -31 -140 -77 79
3319G9O1j05j49j1J55J23p4j85m1J55J55o3j74p1J34J34j4j46r1N6J40O3j00j50
$$ 79 140 35 -114 -125 30 153 79 -106 -147 8 163 100 -74 -145 -11 123 109 -37 -128 -72 68 131 31 -119
3343a19oJ56J17o7j87m4J57J41n2j73o9J01J46J2j29j08M7J30Q2r3j53k2J55J27
$$ -119 -125 31 148 81 -106 -150 7 148 96 -77 -146 -45 101 113 -16 -124 -77 53 135 42 -111 -133 22 149
3367A49o3j69n4J42J37l7j64q1J01J38J2j20j06L3J37P4q4j50k9J61J17n8j72
$$ 149 86 -83 -137 5 142 105 -59 -140 -39 99 111 -9 -115 -82 55 129 45 -105 -134 27 144 86 -86
3390h6n9J32J43l3j58q3R0J40K8j16j10J8J46Q7r0j48m2J53J29n0j66n3J19J37
$$ -86 -145 -13 130 97 -61 -144 -54 86 114 -2 -112 -94 52 139 49 -99 -141 12 141 91 -75 -128 -9 128
3414A28j7j52r8J04J29L2j20j26L1J50P1p0j71k3J55J29o7j77n1J39J40l7j67
$$ 128 111 -41 -139 -35 94 126 6 -120 -89 61 132 62 -109 -132 23 152 85 -92 -143 -4 136 99 -68
3437f8p1R5J34K7j28j21L2J62P5r6j61j2J67J16p1j81m0J49J20m1j44p4R6J35
$$ -68 -139 -44 90 117 -11 -132 -100 62 137 41 -120 -132 35 151 80 -101 -141 8 128 87 -57 -131 -35 100
3461A00Rj14j19M2J68N8j05j57jJ72J00p7j76l5J50J14l8j54p4R5J56oj27j06
$$ 100 109 -5 -124 -82 86 144 39 -118 -119 53 153 76 -100 -135 15 129 91 -63 -137 -42 114 108 -19 -125
3485a25L4J57O4r6j58J2J58R5q5j62k9J28J37n5j44n7Q6J35J3j18j16N0J45O9
$$ -125 -91 66 130 34 -124 -112 46 141 56 -106 -135 -7 130 75 -69 -126 -40 95 108 -10 -126 -76 69 138
3509A38j14j30PJ38R8q7j44k6J29J18m7j48o3J00J34Qj24j16N5J39O1j15j37K1
$$ 138 24 -106 -99 39 137 50 -94 -120 9 127 80 -68 -131 -31 103 111 -13 -129 -74 65 126 11 -126 -105
3533a05J42R6p7j55k1J19J20m4j34p1R9J24K3j21j15N2J41O8j19j40K0J45R5r3
$$ -105 37 133 56 -99 -120 -1 119 75 -59 -130 -31 93 116 -5 -120 -68 73 141 22 -118 -98 47 142 49
3557D9j51j7J31J14m3j49n5R7J25Kj27j06N7J38O0j19j32J9J49R7r9j41j8J39
$$ 49 -102 -119 12 126 83 -66 -121 -24 101 103 -24 -130 -73 65 125 6 -126 -107 42 139 40 -101 -119 20
3581B0R7m3j47n8J04J35pj27j06O7J48M7j21j34J7J65P1q9j39rJ31J12o7j20o4
$$ 20 117 74 -73 -131 -27 108 101 -26 -132 -65 83 130 9 -125 -108 57 128 39 -100 -109 22 134 67 -53 -117
3606a17J03J17Jj30j06P0J48M0j30j25M7J41P8r2j45j4J30J09o3j32m6Q9J34o
$$ -117 -14 103 104 -26 -132 -62 86 126 -4 -129 -82 59 137 45 -100 -114 16 125 62 -70 -116 -27 107 101
3630A01j43r3O8J60J3j14j19L6J52N5r3j29QJ23Q3m7j37l5Q7J31k0j28p6M6J70
$$ 101 -42 -135 -67 93 106 -8 -127 -91 61 116 23 -106 -98 25 108 61 -76 -111 -24 107 87 -41 -117 -71 99
3655I9Oj09j14L9J47O1j06j27PJ18R9n4j38m5J03J13Jj36r1O1J53J5j11j11M3
$$ 99 105 -4 -118 -79 68 129 23 -104 -97 21 120 66 -72 -117 -14 99 100 -36 -127 -66 87 102 -9 -120 -77
3680g7J38O4j08j27K6J14R5o6j39k9J04J16k0j37p1P3J35J9j14j14M7J35N7q7
$$ -77 61 125 17 -110 -84 30 125 59 -80 -109 -5 111 91 -46 -117 -44 91 110 -4 -118 -71 64 121 34
3704C4j40PJ28R7o7j38l8R9J31j6j45q2Q1J31K3j15j17N3J40N1j04j11j5J31R9
$$ 34 -106 -99 29 126 59 -79 -117 -18 113 97 -48 -130 -49 82 105 -10 -127 -74 66 117 13 -98 -113 18 117
3729A17o4j30n1J15J23l1j20q5P8J46K3j28j02L7J36N1r1j18MJ19Q4n2j45k2J03
$$ 117 53 -77 -128 -13 110 79 -41 -126 -48 98 121 -7 -109 -72 64 115 24 -94 -90 29 113 61 -84 -106 -3
3754cJ03oj32r6Q3J29L4j27j03M1J27O3r5j29J4J21Q5m2j46l4R4J32l5j30p9R6
$$ -3 100 94 -38 -134 -51 78 112 -15 -118 -77 50 113 18 -111 -97 24 109 67 -79 -113 -19 113 78 -52 -131 -35
3780c5J23K0j36j00N2J28N5q2j29LJ32R0o7j23m3J05J20l4j31p6R1J20K6j30j00
$$ -35 88 108 -28 -128 -76 52 107 25 -104 -101 31 121 54 -69 -112 -7 113 79 -52 -128 -37 83 109 -21 -121
3805a21M1J38N9r1j31J0J26Q2o5j33l4J14J00k4j21o9P9J15K7j28r2M5J34M8q5
$$ -121 -80 58 117 26 -105 -95 31 113 48 -85 -119 -5 95 71 -50 -119 -40 75 102 -26 -118 -73 61 109 24
3830B4j33J1J36P1n8j26l2J09J05k3j33p2R4J27oj10r6M3J33L7r2j09J4J11Q2
$$ 24 -109 -98 38 109 51 -75 -107 2 107 84 -49 -121 -27 100 94 -16 -112 -69 64 101 9 -100 -86 25 107
3855A07o5j37j2J12Q9k7j26n5P5J21Jj02r5N0J19N0r8j08K3J10P7o8j13k9J19
$$ 107 42 -95 -107 5 94 67 -59 -114 -39 82 83 -19 -114 -64 55 105 7 -101 -78 32 109 41 -72 -101 18
3880A8Q3l0j24m9P5J07Rj07r0M5J28L4r0j07J6J20O1n3j16k6Q9J06l3j17m6P3
$$ 18 101 71 -53 -102 -27 80 89 -18 -108 -63 65 99 9 -98 -82 38 99 46 -70 -96 -7 99 66 -51 -97 -24
3906b4J04Mj06q3N4J10L3q6r8J2J22N4p1j04j0J05R4m9j20l9Q9R3nj08o1N6R8
$$ -24 80 84 -22 -105 -51 59 92 6 -92 -80 42 96 25 -79 -89 16 110 61 -59 -98 -9 84 79 -29 -90 -34 64
3933F4L1q9r5L2R9N5o0j15j0J01P9m5j01l6P5Q9lj09n7M7J17K1r8r5K9J15M5n5
$$ 64 95 6 -89 -57 42 97 37 -78 -88 13 92 47 -54 -90 -15 74 71 -38 -95 -48 69 90 -8 -103 -74 41 86 31
3961C1j10j1J08O9m1r9l8P8R1qr9o2N7R2K3p8q6K6R6M2n6r4KR4O3l8j05k5Q2O8
$$ 31 -79 -90 18 87 46 -53 -91 -13 78 70 -29 -91 -34 58 81 3 -83 -57 39 81 25 -69 -67 27 90 52 -53 -78 4 72
3991G2j4r2m7N3Q7J8q7p2K5R7M5p4q2mQ7O8l9j02l5Q1Q4%j03o1O8Q6K1r5o6K8
$$ 72 58 -34 -81 -28 59 77 -10 -82 -57 40 85 11 -71 -75 12 80 41 -61 -96 -15 69 69 -34 -95 -27 59 80 -15 -81 -53
4021e3J04M3q2p5lR1O1m1r0k2O2P7j7q4n9M9J01J7p9p6M0P1L7o2q0jR2N4l5r2
$$ -53 51 94 12 -63 -66 25 86 45 -45 -67 -5 72 55 -29 -88 -39 62 79 0 -76 -36 35 72 10 -70 -71 21 75 40 -52
4051e2l0Q1O9j6q5m7N5Q8Kp3o8K5R9K5n4r0RQ8N7k9j04j1N9R3l4r0l6N4Q9oq3
$$ -52 -82 -1 68 52 -33 -80 -25 63 65 -8 -76 -51 48 73 19 -71 -62 26 83 54 -50 -61 -2 91 57 -33 -69 -15 74 68 -15
4082a5o1M0R9K1o3q9J6P4N5m6q6k1P7O9k6q4n9P2P7J7q6n2L9O9L9o6p6PQ7N3n9
$$ -15 -76 -36 63 84 21 -68 -52 22 77 31 -55 -76 1 70 44 -40 -99 -27 50 67 -19 -71 -32 37 76 10 -66 -59 28 81 22
4113B2q1rP9O0k6p7m9O9Q4np9o0L9Q1L5p6p2J8P7M8n1p8k6Q0P1k0j00m7P0Q6L
$$ 22 -59 -68 11 71 45 -32 -81 -12 72 67 -12 -72 -33 48 83 7 -65 -47 30 78 27 -51 -77 3 74 54 -46 -93 -23 63 66
4144F6r2o0M8R5K1p8p7J6Q5N0m8q1oP6O5k7r5l0O7P4Kr0p1O6Q2L1q5o6J2Q0M5
$$ 66 -26 -86 -38 57 78 0 -77 -61 24 74 26 -55 -61 15 80 53 -42 -72 -5 69 71 -19 -90 -24 58 89 4 -62 -50 30 75
4175G5m1r1k6R3O7k9r7k6O3P8Mr5o8N1R1K3p6p4J7R3M5o2q9%Q5N8k3r3l5P0Q8
$$ 75 34 -57 -83 10 77 48 -49 -75 -12 66 70 -25 -93 -42 49 72 -4 -78 -61 32 77 15 -74 -74 11 69 46 -47 -82 -12 76
4206G6kr8o3N1R3K3o8q5J6R2M0m3q5j4P0Q5l3r9l6N5R6j7p5o2M8R3K1q1q0K8Q0
$$ 76 74 -24 -87 -36 57 80 12 -73 -57 35 75 32 -53 -67 3 88 55 -44 -80 -25 71 54 -21 -83 -35 58 79 -2 -82 -54 26
4237B6N2o9p0lP7O5k8r8l2O9P9Nj01o0N6R8J0p2q0K6R3L7n5r0kP5P9m4r0k2N8
$$ 26 78 9 -61 -64 13 78 50 -48 -80 -11 68 73 -28 -88 -32 66 76 4 -76 -50 43 80 25 -65 -67 8 87 43 -47 -69 -11
4268a1P8oq5o2N2Q9J2p6o5J8J01J8m5p4j5Q2O5l7r0k8P5P5j0r4m8N7R0J2q8o8
$$ -11 67 61 -24 -86 -34 55 67 -9 -74 -56 45 63 18 -56 -71 11 76 39 -51 -79 -4 71 61 -33 -81 -24 66 78 -10 -78
4298g8L4R6L3n8q4jP9O6m2q9k3P2P8k0r5m2M7Q8J5q1o4K3Q3L7n7q3%Q8O5n0q8
$$ -78 -44 52 85 27 -57 -58 21 87 45 -44 -67 5 83 63 -32 -74 -27 61 76 -5 -69 -46 37 74 17 -66 -66 22 87 37 -51
4329e1m0P8Q9l5p2n6N2Q4K5q7n7K7Q4L1n0q4RO7P3m4r6k4P4Q6j3r4n3N2R6jp6
$$ -51 -91 -13 76 41 -31 -87 -35 49 74 -13 -70 -43 41 72 22 -62 -53 14 87 43 -53 -77 -3 83 70 -24 -77 -25 71 70 -6
4360fo9K0Q9L7n0r4KQ4P1l5r5l3P2P4j6q3m4L9Q5K3p3o0J5Q9M1o2p5j2P8O5m4
$$ -6 -75 -55 34 71 21 -73 -71 13 84 49 -46 -79 -7 67 51 -32 -76 -37 48 71 -2 -62 -47 42 83 21 -54 -66 12 77 33
4391C3q9j1O4P8j6q6n4N2R3J9q4n6PQ7L8n8p5PO0P8m0r7k0O2P5j0q9m7M4Q9J2
$$ 33 -56 -67 -3 75 59 -27 -81 -29 64 83 -1 -57 -50 37 75 17 -58 -51 9 87 47 -50 -70 -8 67 57 -32 -79 -35 54 66
4422F6p2p4L0Q6M3p0p3%Q4O0m6q6k4P8O6pq1n5O1Q1Pq0n9K9R0K4n6p1j2Q6O0n0
$$ 66 -6 -80 -50 36 79 9 -64 -64 20 80 34 -52 -76 2 68 61 -20 -75 -14 67 74 -6 -65 -36 54 78 22 -49 -61 25 85 35
4454C5p4k4O6P7l2q2l6N1Q9lp9n3J5R3K5n3r1J0Q8N9m4q8j8O9P1l2p4m7P2P1L
$$ 35 -39 -63 3 80 48 -34 -70 -19 70 67 -12 -65 -50 43 68 15 -76 -66 22 81 37 -51 -69 0 71 39 -35 -82 -10 61 64
4485F4p9n3K6R1M0o7r2J6Q7N1o3p0qO4N8k5p2k8N0P3kp7n5K4Q7K6o6p2K0P9L4
$$ 64 -15 -68 -42 49 89 22 -70 -54 33 84 21 -49 -57 7 65 40 -32 -60 -10 63 61 -16 -71 -47 40 66 0 -72 -52 27 61
4516F1m8p3%O7O0l0o9m2N1J00j3p7o2M0P8K6o3p8L3O7N1n5p2k6P2Q2m2q1l2O1
$$ 61 13 -60 -60 7 67 37 -32 -74 -23 77 64 -13 -75 -35 43 69 6 -72 -39 28 79 24 -48 -74 -2 80 38 -43 -75 -14
4546a4P5j0o2p4M2R0L0p1p8J4P9O1o7q0kO7O4l1q2l1O0Q3rp7m9M1P5K5p4p3L2
$$ -14 61 51 -11 -85 -43 47 77 6 -72 -58 21 82 15 -65 -67 0 64 33 -49 -80 -20 63 54 -23 -72 -31 44 69 -5 -78 -46
4577d6P3M2m5p6NO1N8l6p0m6O4Q6Kr1n7M0P6K6n4p8J3Q5N4p2p4nQ1M7k9p5l7O2
$$ -46 27 69 24 -52 -47 14 72 36 -34 -80 -16 70 72 -19 -76 -36 40 66 12 -66 -53 32 86 14 -60 -65 16 63 34 -41 -78 -16
4609a6O4Op9m6L5Q6J6o7p2K8P1M2n9o3mP2N6l1q3k0N7P2rp4n0N2P1J3o3o3J6P6
$$ -16 48 54 -25 -71 -36 50 66 -1 -73 -45 26 68 9 -54 -58 14 70 39 -44 -64 -7 65 56 -18 -68 -16 55 68 5 -58 -42 34
4641C4M0o1o3kO7N0k5p7l3P5O0j9o2m4L7O1K0n9o2J4P7L1m6o6LO1M3k7p2%L6O5
$$ 34 74 13 -50 -52 15 65 40 -37 -70 5 65 46 -16 -60 -23 38 58 -1 -63 -49 28 59 13 -53 -50 11 54 27 -45 -45 -9 56
4673E6oo4l8K9O4K6o4n7K4O5K4m6n8j2O8M8j9q0j5M7O6j0p5m0K8Q3K1o9o1K0O7
$$ 56 50 -14 -52 -23 41 67 3 -54 -30 35 59 13 -45 -57 11 59 40 -40 -55 -8 58 48 -27 -67 -39 44 65 -4 -65 -45 22
4704B2M2n9n7jO0M2l6n1k7N7O3j8n6m6M3O6J3o3n0J4O4M2n1o9J7N0N7l7p3k1N9
$$ 22 64 5 -52 -53 7 49 13 -38 -65 -8 55 37 -19 -65 -22 44 57 -6 -56 -42 22 64 13 -56 -39 11 68 31 -42 -63 -4
4735dM7jo2m5M1P3Ko6m4J8P6K0m0p1MP7J8j7o6k0O1M3Pp8m0M9N9J4o1n7K8O9K8
$$ -4 43 42 -20 -65 -24 49 51 -15 -59 -41 35 55 15 -56 -52 25 43 26 -40 -60 1 44 51 -27 -67 -18 41 55 -6 -63 -35 34 62
4768F2n4n6%P8M3m2o7rM5O1j0q0l5N2O5J2q2m0K2P3J9m6n6LN6M6k9o7k5O2M8n
$$ 62 8 -48 -48 30 73 31 -36 -45 0 61 51 -29 -64 -12 53 65 -17 -57 -35 38 57 11 -45 -42 14 60 31 -36 -61 1 49 44
4800D4p7k6M3N5K1o8n9L9N6K9m3o0LN7M0k6o6lM2M9j0n9l3L5P5jo4m0J5P6K1n2
$$ 44 -33 -59 -16 39 60 -8 -67 -28 28 57 14 -46 -43 14 54 28 -38 -41 1 50 40 -19 -52 -17 58 57 -7 -47 -32 44 65 13
4832A3n8ON2N1l7o6k0N9N4j5n8m2L9N4J7n7m8K5O8J0m3m5j4O4M3l0n5j5M8M0j
$$ 13 -45 -39 13 64 27 -39 -59 0 54 39 -19 -61 -22 32 49 -8 -56 -31 37 47 4 -41 -55 9 52 22 -33 -48 0 40 39
$$ [...]
8191h
##END NTUPLES=NMR FID
##END=
