##TITLE=1H_LY-D.M.A.A.
 CDCl3, 8 sc, 
 25.08.2021
##JCAMPDX= 6.0         $$ Bruker NMR JCAMP-DX V2.0
##DATA TYPE= NMR FID
##DATA CLASS= NTUPLES
##ORIGIN= UXNMR, Bruker Analytische Messtechnik GmbH
##OWNER= root
$$ XWIN-NMR		Version 3.5
$$ Wed Aug 25 10:38:12 2021 Russian Standard Time (UT+4h)  she@DPX200
##.OBSERVE FREQUENCY= 200.131506
##.OBSERVE NUCLEUS= ^1H
##.DELAY= (6, 6)
##.ACQUISITION MODE= SIMULTANEOUS
##.ACQUISITION SCHEME= undefined
##.AVERAGES= 8
##.DIGITISER RES= 18
##SPECTROMETER/DATA SYSTEM= spect
##.PULSE SEQUENCE= zg30
##.SOLVENT NAME= CDCl3
##.SHIFT REFERENCE= (INTERNAL, CDCl3, 0, 15.7039)
##AUDIT TRAIL= $$ (NUMBER, WHEN, WHO, WHERE, WHAT)
$$ ##TITLE= Audit trail, XWIN-NMR		Version 3.5
$$ ##JCAMPDX= 5.01
$$ ##ORIGIN= Bruker BioSpin GmbH
$$ ##OWNER= she
$$ F:/spectra/data/she/nmr/H-F/1/audita.txt
$$ ##AUDIT TRAIL=  $$ (NUMBER, WHEN, WHO, WHERE, WHAT)
(   1,<2021-08-25 10:36:57.26 +0400>,<she>,<DPX200>,
      <created by zg, POWCHK disabled, PULCHK disabled
       configuration hash MD5:
       00 E9 B6 7A A2 85 ED C7 34 08 36 98 17 FE 4E 26
       data hash MD5: 16K
       47 E2 02 C3 E7 B6 26 FA F6 F9 0D 11 EA 35 63 16>)
$$ ##END=
$$ 
$$ hash MD5
$$ 39 59 A5 57 E1 F1 F2 E2 E7 A9 A2 08 7A B5 77 40
##$RELAX= 
##$RELAX= 
##$RELAX= 
##$RELAX= 
##$RELAX= 
##$RELAX= 
$$ Bruker specific parameters
$$ --------------------------
##$DU= <F:/spectra>
##$EXPNO= 1
##$NAME= <H-F>
##$PROCNO= 1
##$TYPE= <nmr>
##$USER= <she>
##$AMP= (0..31)
100 100 100 100 100 100 100 100 100 100 100 100 100 100 100 100 100 100 
100 100 100 100 100 100 100 100 100 100 100 100 100 100 
##$AQSEQ= 0
##$AQ_mod= 1
##$AUNM= <au_zg>
##$AUTOPOS= <>
##$BF1= 200.13
##$BF2= 200.13
##$BF3= 200.13
##$BF4= 200.13
##$BF5= 200.13
##$BF6= 200.13
##$BF7= 200.13
##$BF8= 200.13
##$BYTORDA= 1
##$CFDGTYP= 0
##$CFRGTYP= 5
##$CHEMSTR= <none>
##$CNST= (0..31)
1 1 145 1 1 1 1 1 1 1 1 1 1 1 1 1 1 1 1 1 1 1 1 1 1 1 1 1 1 1 1 1 
##$CPDPRG= <>
##$CPDPRG1= <>
##$CPDPRG2= <>
##$CPDPRG3= <>
##$CPDPRG4= <mlev>
##$CPDPRG5= <mlev>
##$CPDPRG6= <mlev>
##$CPDPRG7= <mlev>
##$CPDPRG8= <mlev>
##$CPDPRGB= <>
##$CPDPRGT= <>
##$D= (0..31)
0 1.2 0 0 0 0 0 0 0 0.06 0 0.03 0 0 0 0 0.0002 0 0 0 0 0 0 0 0 0 0 0 0 
0 0 0 
##$DATE= 1629873416
##$DBL= (0..7)
120 120 120 120 120 120 120 120 
##$DBP= (0..7)
150 150 150 150 150 150 150 150 
##$DBP07= 0
##$DBPNAM0= <>
##$DBPNAM1= <>
##$DBPNAM2= <>
##$DBPNAM3= <>
##$DBPNAM4= <>
##$DBPNAM5= <>
##$DBPNAM6= <>
##$DBPNAM7= <>
##$DBPOAL= (0..7)
0.5 0.5 0.5 0.5 0.5 0.5 0.5 0.5 
##$DBPOFFS= (0..7)
0 0 0 0 0 0 0 0 
##$DE= 6
##$DECBNUC= <off>
##$DECIM= 32
##$DECNUC= <off>
##$DECSTAT= 4
##$DIGMOD= 1
##$DIGTYP= 9
##$DL= (0..7)
0 120 120 120 120 120 120 120 
##$DP= (0..7)
150 150 150 150 150 150 150 150 
##$DP07= 0
##$DPNAME0= <>
##$DPNAME1= <>
##$DPNAME2= <>
##$DPNAME3= <>
##$DPNAME4= <>
##$DPNAME5= <>
##$DPNAME6= <>
##$DPNAME7= <>
##$DPOAL= (0..7)
0.5 0.5 0.5 0.5 0.5 0.5 0.5 0.5 
##$DPOFFS= (0..7)
0 0 0 0 0 0 0 0 
##$DQDMODE= 0
##$DR= 18
##$DS= 0
##$DSLIST= <SSSSSSSSSSSSSSS>
$$ [...]
##$SUBNAM2= <"">
##$SUBNAM3= <"">
##$SUBNAM4= <"">
##$SUBNAM5= <"">
##$SUBNAM6= <"">
##$SUBNAM7= <"">
##$SUBNAM8= <"">
##$SUBNAM9= <"">
##$SW= 20.0188882624521
##$SWIBOX= (0..15)
0 0 2 0 0 0 0 0 0 0 0 0 0 0 0 0 
##$SW_h= 4006.41025641026
##$TD= 16384
##$TD0= 1
##$TE= 0
##$TE2= 300
##$TE3= 300
##$TEG= 300
##$TL= (0..7)
0 120 120 120 120 120 120 120 
##$TP= (0..7)
150 150 150 150 150 150 150 150 
##$TP07= 0
##$TPNAME0= <>
##$TPNAME1= <>
##$TPNAME2= <>
##$TPNAME3= <>
##$TPNAME4= <>
##$TPNAME5= <>
##$TPNAME6= <>
##$TPNAME7= <>
##$TPOAL= (0..7)
0.5 0.5 0.5 0.5 0.5 0.5 0.5 0.5 
##$TPOFFS= (0..7)
0 0 0 0 0 0 0 0 
##$TUNHIN= 0
##$TUNHOUT= 0
##$TUNXOUT= 0
##$USERA1= <user>
##$USERA2= <user>
##$USERA3= <user>
##$USERA4= <user>
##$USERA5= <user>
##$V9= 5
##$VALIST= <valist>
##$VCLIST= <CCCCCCCCCCCCCCC>
##$VD= 0
##$VDLIST= <DDDDDDDDDDDDDDD>
##$VPLIST= <PPPPPPPPPPPPPPP>
##$VTLIST= <TTTTTTTTTTTTTTT>
##$WBST= 1024
##$WBSW= 4
##$XGAIN= (0..3)
0 0 0 0 
##$XL= 0
##$YL= 0
##$YMAX_a= 659617
##$YMIN_a= -744574
##$ZGOPTNS= <>
##$ZL1= 120
##$ZL2= 120
##$ZL3= 120
##$ZL4= 120
##$ABSF1= 10
##$ABSF2= 0
##$ABSG= 5
##$ABSL= 3
##$ALPHA= 0
##$AQORDER= 0
##$ASSFAC= 0
##$ASSFACI= 0
##$ASSFACX= 0
##$ASSWID= 0
##$AUNMP= <proc_1d>
##$AZFE= 0.1
##$AZFW= 0.1
##$BCFW= 1
##$BC_mod= 2
##$BYTORDP= 1
##$COROFFS= 0
##$CY= 11.3945322036743
##$DATMOD= 1
##$DC= 2
##$DFILT= <>
##$DTYPP= 0
##$F1P= 2.36226072786647
##$F2P= -0.459571619588291
##$FCOR= 0.5
##$FTSIZE= 0
##$FT_mod= 4
##$GAMMA= 1
##$GB= 0.15
##$INTBC= 1
##$INTSCL= 1
##$ISEN= 128
##$LB= 0.24
##$LEV0= 0
##$LPBIN= 0
##$MAXI= 10000
##$MC2= 0
##$MEAN= 0
##$ME_mod= 0
##$MI= 1.114404
##$NCOEF= 0
##$NC_proc= 0
##$NLEV= 6
##$NOISF1= 3.799351
##$NOISF2= 2.8
##$NSP= 1
##$NTH_PI= 0
##$NZP= 0
##$OFFSET= 15.70392
##$PC= 1
##$PHC0= -13363.54
##$PHC1= 22.80099
##$PH_mod= 1
##$PKNL= yes
##$PPARMOD= 0
##$PSCAL= 0
##$PSIGN= 0
##$REVERSE= no
##$SF= 200.130013532006
##$SI= 16384
##$SIGF1= 3
##$SIGF2= 2
##$SINO= 400
##$SIOLD= 16384
##$SREGLST= <1H.CDCl3>
##$SSB= 0
##$STSI= 0
##$STSR= 0
##$SW_p= 3612.71676300578
##$SYMM= 0
##$S_DEV= 0
##$TDeff= 0
##$TDoff= 0
##$TI= <>
##$TILT= no
##$TM1= 0
##$TM2= 0
##$TOPLEV= 0
##$USERP1= <user>
##$USERP2= <user>
##$USERP3= <user>
##$USERP4= <user>
##$USERP5= <user>
##$WDW= 1
##$XDIM= 8192
##$YMAX_p= 0
##$YMIN_p= 0
$$ End of Bruker specific parameters
$$ ---------------------------------
##NTUPLES= NMR FID
##VAR_NAME=  TIME,          FID/REAL,        FID/IMAG
##SYMBOL=    X,             R,               I
##VAR_TYPE=  INDEPENDENT,   DEPENDENT,       DEPENDENT
##VAR_FORM=  AFFN,          ASDF,            ASDF
##VAR_DIM=   8192,          8192,            8192
##UNITS=     SECONDS,       ARBITRARY UNITS, ARBITRARY UNITS
##FACTOR=    0.0002496,     1,               1
##FIRST=     0,             0,               0
##LAST=      2.0444736,     0,               0
##MIN=       0,             -744574,         0
##MAX=       2.0444736,     659617,          0
$$ Real data points
##PAGE= N=1
##DATA TABLE= (X++(R..R)), XYDATA
$$ [...]
$$ plain form
1943 -299 -526 224 339 -19 -388 231 -126 -432 127 211 278 -302 -130 495 -314 30 402 321 -496 -83 303
1964 303 -194 -185 176 453 -54 -249 509 429 -236 -381 127 184 -358 -82 392 -144 -145 460 -221 -291 79 485
1986 485 -64 -532 232 188 -340 -553 161 321 -159 23 483 -106 -307 282 404 -126 -191 394 325 -452 61
2007 61 578 -198 -547 211 497 -383 -226 557 264 -584 206 512 136 -316 326 454 -13 -273 449 45
2027 45 -428 -96 245 -255 -438 221 241 -231 -25 601 319 -620 -33 227 -296 -439 151 302 -263 -345 343
2048 343 183 -426 -60 262 -370 -646 374 407 -264 -203 550 75 -415 -264 444 -269 -758 687 555 -576
2068 -576 -320 353 8 -452 -122 725 -507 -334 260 378 -339 -137 564 174 -504 -111 569 -339 -477 501
2088 501 486 -625 -352 573 193 -566 -126 412 -258 -273 535 366 -494 -90 664 76 -368 -66 381 -161
$$ packed form
1943b99k27P50J15l58l69O19l57l06N59Q4O7n80J72O25q09L44L72q1q17M13L86
1964C03m97RL61K77n07j95P58q0o65j45N08N7n42K76M74n36jO05o81p0L70M06
1986D85n49m68P64m4n28k13P14J60m80J82M60n89k01N89J22n30o5N85o9p77N13
2007F1N17p76l49P58K86q80J57P83k93q48P90L06l76m52O42J28m67k60P22m04
2027D5m73L32L41n00j83O59K0m72K06O26k82r39N87K60n23j43N90J51n65q2O88
2048C43j60o09L66L22o32k76J020L3o71O1P53m75m90J51P08p13m89J445j32j131
2068e76K56O73l45m60L30Q47j232J73N94J18p17K02P01l90o78L93O80r08j38R78
2088E01j5j111K73R25l80p59M40N38o70j5Q08j69q60M04P54n88m44L02M47n42
$$ plain form
2108 -161 -511 459 185 -484 -205 739 -105 -590 140 317 -226 -320 401 244 -444 -128 585 -62 -724 117
2128 117 483 -334 -535 282 103 -438 51 695 60 -539 179 114 -104 5 442 76 -339 61 353 -173
2148 -173 -470 333 429 -241 -35 602 28 -277 136 512 -210 -143 337 219 -438 -18 324 -26 -283 20 447
2169 447 47 -498 48 121 -403 -86 341 -248 -407 192 434 8 -376 581 253 -430 29 335 -207 -407
2189 -407 115 632 -435 -21 274 231 -251 110 542 289 -468 -247 364 -356 -96 542 37 -583 75 300
2209 300 -43 -157 203 478 -278 -249 99 366 -86 198 311 -136 -318 578 280 -351 -86 267 -184 -283 178
2230 178 286 -197 -475 426 354 -247 37 423 -16 -259 254 208 -273 -57 743 75 -457 106 549 -79 -429
2251 -429 171 448 -516 -85 448 35 -305 -79 720 -435 -418 367 227 -333 -133 289 -108 -290 76 491
$$ packed form
2108a61l50R70k74o69K79R44q44m85P30J77n43r4P21j57o88L16P13o47o62Q41
2128A17L66q17k01Q17j79n41M89O44o35n99P18o5k18J09M37l66m15M00K92n26
2148a73k97Q03R6o70K06O37n74l05M13L76p22O7M80j18o57M20L42l50k57L03M27
2169D47m00n45N46P3n24L17M27n89j59N99K42m26l84R57l28o83M59L06n42k00
2189d07N22N17j067M14K95m3m82L61M32k53p57K21O11p20K60O38n05o20O58K25
2209C00l43j14L60K75p56K9L48K67m52K84J13m47j82Q96k98o31K65L53m51r9M61
2230A78J08m83k78R01p2o01K84L86m39k43N13m6m81K16Q00o68n32N63M43o28l50
2251d29O00K77r64M31N33m13l40K26P99j155J7P85j40n60K00M22l97j82L66M15
$$ plain form
2271 491 -59 -724 294 283 -533 58 575 -73 -546 -9 269 -123 -251 422 185 -558 -300 281 -57 -546
2291 -546 83 427 -122 -574 298 244 -435 -125 755 164 -594 305 668 -324 -473 149 270 -370 42 477
2311 477 -244 -369 31 543 -318 -584 511 354 -591 -10 565 -84 -277 383 836 -307 -252 503 184 -498
2331 -498 27 615 -142 -536 172 404 -322 -488 307 418 -501 -9 670 83 -329 317 485 -462 -435 828
2351 828 3 -198 -159 428 -386 -391 275 75 -444 -287 511 227 -450 2 527 -91 -467 22 377 -338 -129
2372 -129 395 -72 -566 98 583 -233 -107 317 31 -308 -293 455 340 -329 106 514 -195 -265 446 40 -474
2393 -474 12 306 -265 -527 -30 409 -488 -314 137 294 -408 -151 541 334 -255 68 234 4 -120 196
2413 196 175 -405 -123 241 332 -251 218 402 -348 -223 375 34 -499 -105 363 31 -264 186 483 -289 64
$$ packed form
2271D91n50o65J018j1q16N91N17o48m73N37K78l92j28O73k37p43K58N81l38m89
2291e46O29L44n49m52Q72n4o79L10Q80n91p58Q99L63r92j49O22J21o40M12M35
2311D77p21j25M00N12q61k66J095j57r45N81N75o49j93O60M53j143N5P55l19o82
2331d98N25N88p57l94P08K32p26j66P95J11r19M92O79n87m12O46J68r47K7J263
2351H28q25k01L9N87q14nO66k00n19J57P98k84o77M52N25o18l76M89L55p15K09
2372a29N24m67m94O64M85q16J26M24k86l39J5P48j15o69M35M08p09p0P11m06n14
2393d74M86K94n71k62M97M39q97J74M51J57p02K57O92k07n89L23J66k30j24L16
2413A96k1n80K82L64R1n83M69J84p50J25N98l41n33L94M68l32k95M50K97p72L53
$$ plain form
2434 64 410 -132 -367 -84 511 -53 -524 409 324 -129 -85 367 163 -383 183 157 -250 -28 160 187 -340 -190
2456 -190 201 -56 -575 -37 240 -223 -47 244 193 -559 84 334 -181 -323 23 73 -78 -337 244 330 -576
2477 -576 222 410 -11 -226 116 175 111 -392 88 72 -209 94 121 -185 -173 132 244 -182 -153 94 125 -281
2499 -281 -127 359 49 -251 72 453 -117 -421 224 174 -254 33 73 -12 -246 184 146 84 65 129 3 11 42
2522 42 286 -396 -458 201 76 -157 -168 162 254 -59 108 99 -43 -238 186 149 -263 72 211 -56 -312 63
2544 63 -106 -79 -274 -96 216 54 -28 78 -133 -211 -231 -102 -66 -184 161 125 -358 85 144 -28 -93 -61 138
2567 138 108 127 307 101 -4 12 55 64 6 136 54 -114 213 -35 59 -193 322 173 -26 -205 -105 -26 -116 94
2591 94 39 -231 -209 298 75 -142 67 -192 -219 -152 121 11 -8 -113 36 200 -152 -98 -8 196 -76 36 -182
$$ packed form
2434F4L46n42k35K83N95n64m71R33q5m53M4M52k04n46N66k6m07K22J88K7n27J50
2456a90L91k57n19N38K77m63J76K91n1p52O43K50n15j42L46N0j51k59N81Q6r06
2477e76P98J88m21k15L42N9o4n03M80j6k81L03K7l06J2L05J12m26K9K47L1m06
2499b81J54M86l10l00L23L81n70l04O45n0m28K87M0q5k34M30l8o2j9O4j26QL1
2522D2K44o82o2O59j25k33j1L30R2l13J67rj42j95M24l7m12L35J39k67k56L75
2544F3j69K7j95J78L12j62q2J06k11p8k0J29L6j18L45l6m83M43N9j72o5L2J99
2567A38l0J9J80k06j05J6M3Rn8J30q2j68L27k48R4k52N15j49j99j79J00P9r0K10
2591I4n5k70K2N07k23k17K09k59k7O7K73j10j9j05J49J64l52N4R0K04k72J12k18
$$ plain form
2614 -182 -140 145 95 -95 -3 14 149 -300 -103 280 -65 -34 -63 71 175 -258 138 -53 -9 -298 373 -53
2636 -53 -307 -172 126 -108 17 190 -98 61 -346 102 62 -21 130 89 -164 -58 279 170 9 -34 318 270
2658 270 -261 17 213 -32 -87 251 -5 -295 251 126 -192 -273 -157 94 -133 162 566 9 -250 31 318
2679 318 -125 -86 443 191 -374 174 243 -127 -551 -1 384 -47 -126 153 -68 -544 -4 225 -144 -382 89
2700 89 164 -224 -347 71 85 -182 113 282 -232 -151 21 433 -94 -196 97 -46 -57 -71 346 75 61 273
2722 273 357 -9 72 447 202 -334 146 592 -55 -310 -118 270 -225 -349 603 83 -350 111 631 70 -196
2743 -196 186 333 -166 -245 564 -15 -207 -278 364 -561 -269 105 245 -287 -367 307 -19 -596 84 296 -238
2764 -238 -383 400 304 -471 -322 183 207 -512 21 177 -457 -181 67 174 -228 -311 486 -7 -347 139 552
$$ packed form
2614a82M2K85n0j90R2J7J35m49J97L83l45L1k9J34J04m33L96j91M4k89O71m26
2636e3k54J35K98k34J25J73k88J59m07M48m0q3J51m1k53J06L37j09j61m3L52m8
2658B70n31K78J96k45n5L38k56k90N46j25l18q1J16K51k27K95M04n57k59K81K87
2679C18m43L9N29k52n65N48O9l70m24N50L85m31p9K79k21m76N40K29l69k38M71
2700H9P5l88j23M18J4k67K95J69n14Q1J72M12n27j02K93j43j1j4M17k71j4K12
2722B73Q4l66Q1L75k45n36M80M46o47k55J92L88m95j24R52n20m33M61N20n61k66
2743a96L82J47m99p9Q09n79j92p1O42r25K92L74J40n32q0O74l26n77O80K12n34
2764b38j45P83r6p75J49N05K4p19N33J56o34K76K48J07m02q3P97m93l40M86M13
$$ plain form
2785 552 -245 -545 377 123 -314 -291 479 142 -614 98 562 -173 -332 69 31 -495 -141 272 254 -587 137
2806 137 270 23 -513 184 491 -238 37 371 192 -459 -80 245 -390 -451 340 52 -404 -157 414 53
2826 53 -668 -172 573 -96 -523 83 426 -297 -62 270 46 -368 -3 252 -232 -141 121 265 -293 -73 358
2847 358 473 -647 35 564 -251 -493 320 90 -220 -189 190 -40 -348 260 93 -209 -423 363 166 -639
2867 -639 14 634 -2 -107 261 356 -566 -374 138 305 50 102 409 -388 -363 189 382 -8 -189 404 234
2888 234 -247 -89 382 64 -91 271 473 -324 -338 400 -36 -387 -101 484 148 -187 -38 251 -163 -162 146
2909 146 124 -73 149 377 183 -110 143 480 55 -185 220 296 -467 102 281 -117 -343 148 96 -214 -168
2930 -168 -47 297 -252 -108 142 36 -125 67 227 -101 -295 256 1 -294 -108 159 140 -13 164 201 -174
$$ packed form
2785E52p97l00R22k54m37K3P70l37p56P12M64p35j59M01l8n26L54M13j8q41P24
2806A37J33k47n36O97L07p29K75L34j79o51L79L25o35o1P91k88m56K47N71l61
2826E3p21M96P45o69m27O06L43p23K35L32k24m14L65K55m84R1K62J44n58K20M31
2847C58J15j120O82N29q15k42Q13k30l10L1L79k30l08O08j67l02k14P86j97q05
2867f39O53O20o36j05L68R5r22J92N12J67k55N2L07p97K5N52J93l90j81N93j70
2888B34m81J58M71l18j55L62K02p97j4P38m36l51K86N85l36l35J49K89m14JL08
2909A46k2j97K22K28j94k93K53L37m25k40M05P6p63N69J79l98k26M91n2l10M6
2930a68J21L44n49J44K50j06j61J92J60l28j94N51k55k95J86K67j9j53J77L7l75
$$ plain form
2951 -174 -287 23 -72 -122 322 158 -159 -148 19 397 -259 -30 47 141 -131 -71 339 -125 -68 -11 386 -69 -114
2974 -114 243 64 -137 167 -181 117 -210 346 132 -211 -19 359 60 -104 125 258 11 47 183 39
2994 39 -59 -216 159 91 -84 208 267 150 -346 145 327 -111 -10 -7 -115 -353 85 103 -234 -210 -9 -89 -230
3017 -230 -148 138 96 81 187 109 -165 -378 -48 153 -146 193 90 -220 -128 -56 -18 -92 -71 153 393 -131 -470
3040 -470 272 58 -132 82 209 -73 -78 160 -23 -241 44 124 -139 124 -109 93 -25 -282 216 406 -2
3061 -2 -248 43 -47 -173 94 159 -137 -121 212 -157 -42 -2 231 73 -111 -21 6 93 -65 149 30 -290 -153
3084 -153 31 203 -370 -206 201 231 -97 261 36 -145 -7 365 18 -64 -335 157 22 -342 -25 -129 -38
3105 -38 -78 166 -209 96 -123 296 87 -163 60 241 7 122 -112 -115 85 -185 -26 17 90 41 -99 -113 150
$$ packed form
2951a74j13L10r5n0M44j64l17J1J67L78o56K29P7R4k72O0M10m64N7N7L97m55m5
2974a14L57j79k01L04l48K98l27N56k14l43J92L78k99j64K29J33k47L6J36j44
2994C9r8j57L75o8j75K92N9j17m96M91J82m38J01Lj08k38M38J8l37K4K01q0j41
3017b30Q2K86m2j5J06p8k74k13L30K01k99L39j03l10R2P2L8p4K1K24K40n24l39
3040d70P42k14j90K14J27k82nK38j83k18K85Q0k63K63k33K02j18k57M98J90m08
3061bk46K91r0j26K67O5k96J6L33l69J15M0K33j58j84R0K7Q7j58K14j19l20J37
3084a53J84J72n73J64M07L0l28L58k25j81J38L72l47q2k71M92j35l64L17j04R1
3105c8m0K44l75L05k19M19k09k50K23J81k34J15k34lK00k70J59M3P3m9j40j4K63
$$ plain form
3128 150 5 -219 -17 128 -58 357 -4 -21 17 78 -21 96 133 -249 -65 -269 -8 55 76 92 -145 165 158
3151 158 -25 -83 -25 309 -248 -203 -43 30 -191 160 176 85 -303 127 160 194 154 193 156 -207 -13 216 -421 -224
3175 -224 74 18 20 17 133 -59 77 -120 12 -59 72 -71 -30 -139 -49 -260 -90 -249 136 3 214 -111 -88
3198 -88 -95 -20 -183 82 40 -123 -61 -195 144 -11 -120 85 3 223 -90 73 -339 129 18 -267 -33 107
3220 107 16 59 -10 27 -166 -110 -69 -314 -65 -31 -151 38 -127 47 -55 -167 -19 361 75 -238 -85 68
3242 68 -125 -161 -52 22 -128 94 198 -5 211 -82 -181 -22 -220 56 -2 -79 89 -81 120 -39 252 -129
3264 -129 14 -78 32 17 -94 136 116 246 250 -51 27 -4 -113 -282 299 105 45 0 -107 135 162 104 -102 -184
3288 -184 -115 69 -115 10 105 152 -230 5 119 26 6 113 -83 198 124 -155 23 -23 -78 -317 -25 207 133
$$ packed form
3128A50j45k24K02J45j86M15l61j7L8O1r9J17L7l82J84k04K61O3K1J6k37L10p
3151A58j83n8N8L34n57M5J60P3k21L51J6r1l88M30L3L4m0L9l7l63J94K29o37J97
3175b24K98n6KlJ16j92J36j97J32p1J31j43M1j09R0k11J70j59L85j33K11l25K3
3198h8pP5j63K65m2j63O2j34L39j55j09K05q2K20l13J63m12M68j11k85K34J40
3220A07r1M3o9L7j93N6M1k45K49L4j20J89j65J74j02j12J48L80k86l13J53J53
3242F8j93l6J09P4j50K22J04k03K16k93r9J59j98K76n8p7J68j70K01j59K91l81
3264a29J43r2J10j5j11K30k0J30Ml01P8l1j09j69N81j94o0m5j07K42K7n8k06q2
3288a84O9J84j84J25R5M7l82K35J14r3k0J07j96K81p4k79J78m6n5k39K92K32p4
$$ plain form
3311 133 -231 -46 -203 5 -96 -3 150 63 -117 21 -96 -288 -19 153 76 -10 70 -6 -85 19 -97 163
3333 163 90 -104 146 -168 73 -273 -285 170 -80 -59 18 116 -170 -278 -102 -174 129 -91 104 -212 -102 237
3355 237 135 -232 -47 132 -3 -9 148 -274 -128 75 18 -39 114 24 -54 139 180 -7 144 -42 -83 212 -113
3378 -113 -80 188 168 -75 -10 275 188 -168 29 89 -24 43 -105 -47 -160 34 95 -109 208 -147 41 -134 -141
3401 -141 -17 -395 11 -154 319 -1 -42 30 65 -19 166 312 -9 -10 -156 -33 -145 -118 179 234 169 88 -268
3424 -268 -42 -218 39 160 128 -70 0 119 -61 129 119 81 124 61 1 147 155 173 -132 122 -36 -135 122 -4
3448 -4 0 -163 65 109 -137 240 115 -202 142 202 -164 45 -55 -184 119 -104 207 -124 -176 36 -77 -244
3470 -244 76 -67 -30 -95 71 85 78 221 3 1 -131 -72 -244 110 18 -7 20 -49 -100 186 -27 -83 -227 -52 95
$$ packed form
3311A33l64J85j57K08j01R3J53q7j80J38j17j92K69J72p7q6Q0p6p9J04j16K60
3333A63p3j94K50l14K41l46j2M55k50K1P7R8k86j08J76p2L03k20J95l16J10L39
3355B37j02l67J85J79j35oJ57m22J46K03n7n7J53r0p8J93M1j87J51j86m1K95l25
3378a13L3K68k0k43O5K85q7l56J97O0j13O7j48N8j13J94O1k04L17l55J88j75p
3401a41J24l78M06j65M73l20m1P2L5q4J85J46l21jj46J23j12K7K97N5o5q1l56
3424b68K26j76K57J21l2j98P0J19j80J90j0l8M3o3o0J46QJ8l05K54j58r9K57j26
3448dMj63K28M4k46L77j25l17L44O0l66K09j00j29L03k23L11l31n2K12j13j67
3470b44L20j43L7o5J66J4pJ43k18kj32N9j72L54r2k5K7o9n1K86k13n6j44J75J47
$$ plain form
3495 95 216 175 268 -135 364 71 -191 58 -151 -20 75 -30 -132 123 44 -207 -141 71 -181 -48 -111 155
3517 155 52 -118 -89 177 2 -78 -33 -22 -216 -50 13 -406 -120 110 71 -220 24 18 247 7 92 -221 91
3540 91 358 -135 -248 66 -282 21 -260 8 159 -218 106 -106 14 -74 -277 28 11 -8 -97 27 44 -44
3562 -44 3 -246 -279 117 146 -60 110 148 -22 -28 113 -86 -151 -26 84 194 -196 -331 47 -96 67 -223 153
3585 153 -90 291 195 -57 9 -128 -207 158 72 27 74 158 269 22 -267 -17 210 108 106 34 -3 218 -60 -3
3609 -3 1 -68 22 -141 4 -202 -117 9 -159 60 107 -174 242 70 -103 215 -108 -4 237 -221 -159 -193 -15
3632 -15 -336 -226 -147 249 -58 -8 3 66 -28 -14 -93 -8 229 61 180 53 122 32 -41 -66 110 -90 125 206 117
3657 117 -107 -34 23 95 -8 226 57 -67 -38 -156 -213 -131 -75 -107 -52 33 -154 27 246 19 99 -52 64 12
$$ packed form
3495I5J21m1R3m03M99k93k62K49k09J31R5j05j02K55p9k51O6K12k52J33o3K66
3517A55j03j70K9K66j75q0M5J1j94J66O3m19K86K30l9k91K44oK29k40Q5l13L12
3540I1K67m93j13L14l48L03k81K68J51l77L24k12J20q8k03L05j7j9q9J24J7q8
3562d4M7k49l3L96K9k06J70L8j70oJ41j99o5J25J10J10l90j35L78j43J63k90L76
3585A53k43L81r6k52O6j37p9L65q6m5M7Q4J11k47k89K50K27j02kp2l7K21k78N7
3609cMo9R0j63J45k06Q5J26j68K19M7k81M16j72j73L18l23J04K41m58O2l4J78
3632a5l21J10P9L96l07N0J1O3r4J4p9Q5K37j68J19j27O9r0p3k5J76k00K15Q1q9
3657A17k24P3N7P2j03K34j69j24K9j18n7Q2N6l2N5Q5j87J81K19k27Q0j51J16n2
$$ plain form
3681 12 -62 46 -139 -210 11 262 149 -106 142 -26 26 60 -148 -139 -112 16 141 165 114 224 23 166 43
3704 43 84 39 32 -80 153 105 -87 426 -310 50 -272 11 -125 -217 171 -10 289 40 22 -53 -79 56 -58
3727 -58 -197 69 171 61 168 -9 37 -103 -16 173 34 223 13 53 -76 70 226 -26 166 -142 453
3748 453 31 -136 129 -182 320 16 -106 -106 4 45 109 296 -145 -206 -95 -46 -231 45 -88 -62 81 138 95
3771 95 156 9 206 145 -45 215 146 60 90 -89 -185 -12 29 -111 115 298 226 -37 71 -4 -11 38 133 -254 -148
3796 -148 91 -71 61 -83 191 -149 -51 101 84 49 -117 -161 102 -173 -108 -102 53 -37 -65 -158 -5 -78 -22 22
3820 22 -12 -7 -140 12 -223 45 -182 -146 -111 -107 7 180 -144 -152 -167 181 -79 -70 279 41 178 -105 -27 -110 247
3845 247 -182 -137 -155 -212 -6 -135 100 -69 8 133 42 -112 44 -143 120 -142 -8 56 -163 -15 -65 12 -18
$$ packed form
3681A2p4J08j85p1K21K51j13k55K48j68N2L4k08RK7J28J25K4n1J10k01J43j23
3704D3M1m5pj12K33m8j92N13p36L60l22K83j36r2L88j81K99k49j8p5k6J35j14
3727e8j39K66J02j10J07j77M6j40Q7J89j39J89k10M0j29J46J56k52J92l08N95
3748D53m22j67K65l11N02l04j22%J10M1O4J87m41o1J11M9j85K76j33K6J43N7m3
3771I5O1j47J97o1j90K60o9q6L0j79r6J73M1j40K26J83p2k63J08p5pM9R5l87J06
3796a48K39j62J32j44K74l40R8J52j7l5j66m4K63k75O5OJ55r0k8r3J53p3N6M4
3820B2l4Nj33J52k35K68k27L6L5MJ14J73l24qj5L48k60RL49k38J37k83P8q3L57
3845B47m29M5j8n7K06j29K35j69P7J25r1j54J56j87K63k62J34O4k19J48n0P7l0
$$ plain form
3868 -18 -185 -218 -312 -18 423 -23 118 52 -2 -28 42 -43 -144 -174 366 54 57 -127 258 64 -4 -64 113 155 -97
3893 -97 -63 -150 36 192 137 85 -32 -112 127 -363 48 -152 -99 56 -69 14 121 -59 49 -10 -89 75 95 66
3917 66 51 -175 263 -37 -173 -27 74 -205 65 -119 -123 -18 -126 261 -257 -1 234 78 109 189 18 78
3939 78 -15 -8 73 244 -63 -47 177 91 -76 -13 175 -92 183 174 151 135 91 -282 -10 100 -94 130 -26 -106 95
3964 95 105 -87 -28 -39 26 103 -20 95 -70 -151 203 -198 262 -176 -57 -178 -39 -158 -170 12 264 69 -138
3987 -138 52 -162 84 -92 109 51 196 -113 102 211 54 20 -5 98 -108 -69 77 111 -51 -27 160 -85
4009 -85 201 -187 -68 188 238 -127 102 245 -4 -160 79 -163 39 0 -11 13 6 -78 -57 42 40 57 99 16 -7
4034 -7 160 49 -202 -242 -307 -207 -33 103 -162 -249 -82 -10 65 38 -198 -26 211 66 102 148 -109 410 -255
$$ packed form
3868a8j67l3r4K94M41m46J41o6n4k6P0q5j01l0N40l12Lj84L85j94o8o0J77M2k52
3893i7L4q7J86J56n5n2j17q0K39m90M11k00N3J55j25Q3J07j80J08n9p9J64K0k9
3917F6j5k26M38l00j36J46J01k79K70j84mJ05j08L87n18K56K35j56L1Q0j71O0
3939G8r3PQ1J71l07J6K24q6j67O3J88k67K75rk3j6m4l73K72J10j94K24j56q0K01
3964I5J0j92N9j1O5P7j23J15j65q1L54m01M60m38J19j21J39j19j2J82K52j95k07
3987a38J90k14K46j76K01n8J45l09K15J09j57l4k5J03k06L9J46L4j62K4J87k45
4009h5K86l88J19K56N0l65K29J43k49j56K39k42K02l9j1K4pq4K1R9kJ7M2q3k3
4034gJ67j11k51m0o5J00J74J36k65q7J67P2P5k7k36J72K37j45L6M6k57N19o65
$$ plain form
4057 -255 37 119 -69 -31 47 -189 242 128 80 46 -16 -188 -184 132 185 -248 -281 -174 -42 -110 -97 16 -123 -234
4081 -234 140 -115 207 26 -127 -189 181 187 82 -97 -180 132 -71 55 76 4 -149 -113 -164 96 -197 36 -89
4104 -89 -191 -424 -11 -95 -60 183 -80 375 20 225 -132 -219 77 226 20 -179 184 -96 48 -182 -104 129
4126 129 129 28 -83 80 -14 156 -128 301 -6 232 50 225 117 -279 -231 235 -69 121 -110 -154 192 -141
4148 -141 105 -17 -13 -157 61 -89 -313 89 -48 12 -128 -133 123 179 147 -165 -42 -54 -123 84 199 60 -32
4171 -32 -71 -74 -104 -1 21 -59 1 176 -125 -110 -121 -13 378 -60 -101 167 18 230 1 166 175 -185 87 -21
4195 -21 116 -41 113 -156 -5 46 -48 171 -180 108 -72 -231 -67 117 -50 -342 -264 256 49 -196 122
4216 122 -6 121 91 4 140 53 30 81 123 -43 -163 -112 -84 -247 -178 27 -25 -90 -18 228 -205 94 -109 72
$$ packed form
4057b55K92Q2j88L8P8k36M31j14m8l4o2j72ML16N3m33l3J07J32o8J3J13j39j11
4081b34L74k55L22j81j53o2L70Oj05j79q3L12k03J26K1p2j53L6n1K60k93K33j25
4104h9j02k33M13q4L5K43k63M55l55K05l57q7K96J49k06j99L63k80J44k30P8K33
4126A29%j01j11J63r4J70k84M29l07K38j82J75j08l96M8M66l04J90k31m4L46l33
4148a41K46j22Mj44K18j50k24M02j37O0j40nK56N6l2l12J23j2o9K07J15j39r2
4171c2l9ll0J03K2q0O0J75l01J5j1J08L91m38m1K68j49K12k29J65Rl60K72j08
4195b1J37j57J54k69J51N1r4K19l51K88j80j59J64J84j67k92P8N20k07k45L18
4216A22j28J27l0q7J36q7k3N1M2j66j20N1K8j63O9K05n2o5P2K46m33K99k03J81
$$ plain form
4240 72 14 -233 66 53 -67 62 82 -165 309 49 54 383 40 159 -51 -174 202 -27 -137 98 -153 223
4262 223 -65 -80 -40 -33 157 -31 -158 1 -57 -45 60 154 370 -227 49 -98 87 142 -121 15 -36 -22 -156
4285 -156 -53 93 -55 -68 141 74 -125 198 -52 224 -171 -21 163 -270 190 -105 84 137 -74 -17 127
4306 127 -109 32 54 -77 255 134 -219 31 -230 -132 -17 132 127 98 129 188 122 -151 -62 -234 84 -137 143
4329 143 -31 101 -27 407 -175 142 -43 13 23 -141 -120 147 -15 -76 17 -167 -62 -71 118 -46 36 36 43 -47
4353 -47 76 -9 124 -20 -90 -145 -103 -63 -231 44 -55 44 -11 85 82 82 -168 -276 -295 218 -315 48 -3 28 -113 314
4379 314 -263 112 -48 -10 -295 -200 -200 -132 -14 11 -36 -290 61 -70 106 26 233 97 -111 -354 182 90 -27
4402 -27 119 5 12 -243 -196 -94 191 -69 3 -193 267 350 -50 262 93 120 -47 -86 -240 -22 160 -30 -204
$$ packed form
4240G2n8k47K99j3j20J29K0k47M74k60NL29l43J19k10j23L76k29j10K35k51L76
4262B23k88j5M0PJ90j88j27J59n8J2J05R4K16n97K76j47J85N5k63J36n1J4j34
4285a56J03J46j48j3K09o7j99L23k50K76l95J50J84m33M60k95J89N3k11N7J44
4306A27k36J41K2j31L32j21l53K50k61R8J15J49nk9L1N9o6k73Q9j72L18k21K80
4329A43j74J32j28M34n82L17j85N6J0j64K1K67j62o1R3j84J05rJ89j64Q2%Pr0
4353d7J23q5J33j44p0n5M2M0j68K75r9R9n5R6l%k50j08j9N13n33L63n1L1j41M27
4379C14n77L75j60L8k85R5%O8J18K5m7k54L51j31J76q0K07j36k08k43N36r2j17
4402b7J46j14Pk55M7J02K85k60P2j96M60Q3m00L12j69K7j67l9j54K18J82j90j74
$$ plain form
4425 -204 -375 20 -202 137 194 167 100 308 61 44 -125 -216 -110 -25 -228 3 20 -202 -60 -105 -156 -74 -15 -31
4449 -31 272 188 116 -97 -172 211 85 49 295 -218 149 14 80 55 210 109 -129 6 -93 -205 43 159 142
4472 142 384 -109 46 7 297 -146 91 193 -170 -34 48 -99 79 125 55 -172 107 53 -55 -16 241 188
4494 188 -5 196 -356 65 -49 110 220 -74 196 166 166 145 54 -152 -16 -415 -3 -75 -20 45 -225 -168 32
4517 32 -237 -197 -235 34 -10 118 -27 23 10 -37 -24 -9 -102 478 246 -46 -167 -26 -71 -64 406 -79 215 -13
4541 -13 21 104 -154 -113 110 -162 -156 -9 41 90 22 270 186 -23 -85 -240 -22 -93 -143 -348 299 81 142 -22 224
4566 224 17 12 262 -126 173 112 -175 -172 -258 -4 -28 -26 245 -20 63 218 -163 59 43 -72 3 -53 48 -53
4590 -53 146 -21 174 55 -110 -68 -74 139 -193 166 -110 70 -123 -20 -147 112 -155 -188 311 -89 128 -42
$$ packed form
4425b04j71L95k22L39N7k7o7K08k47j7j69r1J06Q5k03K31J7k22J42m5n1Q2N9j6
4449c1L03q4p2k13p5L83j26l6K46n13L67j35O6k5J55j01k38J35r9j12K48J16j7
4472A42K42m93J55l9K90m43K37J02l63J36Q2j47J78M6p0k27K79n4j08L9K57n3
4494A88j93K01n52M21j14J59J10k94K70l0%k1r1k06J36l99M12p2N5O5k70N7K00
4517C2k69M0l8K69m4J28j45N0j3m7J3J5r3N80k32k92j21J41m5PM70m85K94k28
4541a3L4Q3k58M1K23k72OJ47N0M9o8K48q4k09o2j55K18p1n0k05O47k18O1j64K46
4566B24k07nK50l88K99o1k87Lq6K54k4KK71k65Q3J55l81K22j6j15P5n6J01j01
4590e3J99j67J95j19j65M2oK13l32L59k76J80j93J03j27K59k67l3M99m00K17j70
$$ plain form
4612 -42 128 -79 -246 -18 53 -174 49 -90 60 163 -200 56 -122 99 199 214 -77 -243 -8 33 170
4633 170 99 159 393 56 22 -149 119 -65 13 129 206 239 266 -48 301 306 233 -104 81 199 -67 83 218
4656 218 -14 -111 -64 -15 -320 7 208 -262 -170 -32 246 162 114 -19 92 109 -287 11 -74 -172 -77 -25 -91 97
4680 97 -153 169 116 17 -87 131 -112 136 -353 -14 90 -59 -48 208 446 182 125 -100 -6 172 219 220 57
4703 57 33 140 -42 96 252 67 46 -149 1 176 119 -80 -201 60 12 -195 -204 48 -143 122 -249 -39
4725 -39 66 75 -54 93 -32 263 387 273 -98 -16 161 -14 123 -134 344 -5 242 -54 -109 20 -127 -4
4747 -4 -379 -122 547 -224 -52 7 -263 -6 -111 -143 81 261 290 -83 197 -35 -80 61 -279 -10 -264 30
4769 30 -75 45 32 -154 -53 -196 136 -104 139 33 -167 -206 -65 -15 -37 -184 -424 28 157 53 25 -141
$$ packed form
4612d2J70k07j67K28P1k27K23j39J50J03l63K56j78K21J00J5k91j66K35M1J37
4633A70p1O0K34l37l4j71K68j84P8J16P7L3K7l14L49Np3l37J85J18k66J50J35
4656B18k32r7M7M9l05L27K01m70R2J38K78q4m8j33J11J7l96K98q5r8R5N2o6J88
4680I7k50L22n3r9j04K18k43K48m89L39J04j49J1K56K38k64n7k25R4J78M7Jj63
4703E7k4J07j82J38J56j85k1j95J50J75n7j99j21K61m8k07rK52j91K65l71K10
4725c9J05Rj29J47j25K95J24j14l71Q2J77j75J37k57M78l49K47k96n5J29j47J23
4747dl75K57O69p71J72N9k70K57j05l2K24J80K9l73K80k32m5J41l40K69k54K94
4769C0j05J20j3j86J01j43L32k40K43j06k00l9J41N0k2j47k40M52J29j04k8j66
$$ plain form
4791 -141 -153 46 -61 -43 8 125 -123 -119 162 -109 -49 129 -24 28 -184 -345 152 57 -125 -124 -83 -109 -58 -69 22
4816 22 -48 103 -124 47 1 -215 69 70 -145 180 88 133 -33 -32 14 475 -175 83 -72 187 113 181 64 -12
4840 -12 -26 13 129 114 -38 97 93 -55 -165 4 -260 -107 99 -174 224 147 -123 -62 -36 69 -222 -375 162
4863 162 -261 222 78 49 -53 83 -162 -113 -340 -71 227 296 205 221 -160 -104 207 73 -43 -110 -68 14 38
4886 38 -34 -62 55 0 378 -241 205 -75 -28 -62 -315 186 -98 -6 -107 50 -142 -36 43 -156 0 -147 104
4909 104 103 151 177 -81 -105 -39 43 -82 196 150 88 -47 156 19 -10 -167 -34 227 59 -25 2 53 -10 38 124
4934 124 -227 -203 28 102 106 -93 -69 25 -178 152 133 -105 -229 -64 147 -98 10 -219 -55 -178 156 -47
4956 -47 -101 -174 -280 169 -400 -29 -28 123 45 69 -84 -196 147 -138 85 223 213 69 125 235 -73 24 -123
$$ packed form
4791a41j2J99j07J8N1J17k48MK81k71O0J78j53N2k12j61M97r5j82JM1k6N1j1R1
4816B2p0J51k27J71m6k16K84Jk15L25r2M5j66JM6M61o50K58j55K59p4O8j17p6
4840a2j4L9J16j5j52J35mj48j10J69k64J53K06k73L98p7k70O1K6J05k91j53N37
4863A62m23M83j44k9j02J36k45M9k27K69K98O9r1J6l81N6L11j34j16o7M2Q2K4
4886C8p2k8J17n5L78o19M46k80M7l4k53N01k84R2j01J57j92J06P9j99J56j47K51
4909A04jM8K6k58k4O6Q2j25K78m6o2j35K03j37k9j57J33K61j68q4K7N1o3M8Q6
4934A24l51K4K31P4Mj99K4R4k03L30j9k38j24J65K11k45J08k29J64j23L34k03
4956d7n4p3j06M49n69L71JJ51p8K4j53j12L43k85K23J38j0j44N6J10l08R7j47
$$ plain form
4979 -123 1 39 -26 -31 94 37 -268 -359 91 169 74 273 123 56 84 128 -51 -20 126 -36 -108 -264 239 -250
5003 -250 -12 71 -128 -39 60 128 -47 128 39 -97 250 -55 -190 92 3 -139 -65 225 -105 -12 -124 72 282
5026 282 170 -139 55 207 -245 46 -126 97 189 -27 300 107 -6 -200 50 -281 101 29 -277 0 -74
5047 -74 12 -157 -268 69 159 -94 106 -3 -3 -57 88 20 -259 95 -7 -58 -94 164 252 -10 12 110 -253 -243
5071 -243 116 165 -42 63 -204 -88 -54 149 137 -126 34 89 121 144 -67 -30 -172 -39 119 55 -55 -97 62
5094 62 43 -22 92 -158 -148 -3 78 193 93 172 142 -12 45 -65 -206 -249 213 -79 -81 212 -287 -35 138 18
5118 18 -164 -99 6 -5 -1 174 4 166 -188 61 -51 -77 156 11 177 47 -9 -129 14 61 171 -51 22
5141 22 -37 -19 282 -63 4 -33 -260 137 -210 167 -119 -59 200 36 94 82 -1 -169 82 103 -63 -31 -95 -292
$$ packed form
4979a23J24L8o5nJ25n7l05r1M50P8r5J99j50o7K8M4j79L1J46j62p2j56N03m89
5003b50K38Q3j99Q9R9O8j75J75q9j36L47l05j35K82q9j42P4K90l30R3j12J96K10
5026B82j12l09J94J52m52K91j72K23R2k16L27j93j13j94K50l31L82p2l06K77p4
5047g4Q6j69j11L37R0k53K00j09%n4J45o8k79L54j02n1l6K58Q8k62K2R8l63J0
5071b43L59M9k07J05k67J16L4K03j2k63J60N5L2K3k11L7j42J33J58o4j10m2J59
5094F2j9o5J14k50J0J45Q1J15j00P9l0j54N7j10j41m3M62k92kK93m99K52J73j20
5118A8j82O5J05j1MJ75j70J62l54K49j12k6K33j45J66j30n6j20J43M7J10k22P3
5141B2n9J8L01l45O7l7k27L97l47L77k86O0K59j64N8j2q3j68K51K1j66L2o4j97
$$ plain form
5165 -292 256 -168 -53 233 75 58 293 156 -137 315 74 -77 -204 58 -33 137 62 -15 -32 -207 -23 -34
5187 -34 -213 33 -121 163 295 57 45 130 -32 177 -160 308 257 -125 229 -67 -139 252 9 321 145 -193
5209 -193 -136 -175 12 99 99 193 239 156 -48 145 195 -8 -117 -276 -106 19 -79 59 -157 -263 19 -116 139
5232 139 263 276 -98 -220 -276 -298 238 84 383 172 270 28 219 48 -82 -87 167 186 46 223 72 168 46
5255 46 -189 -40 -70 111 160 -138 -354 2 135 -319 5 265 60 -109 -348 50 -48 -87 51 -109 95 -17
5277 -17 -241 41 -11 -191 -251 8 188 27 231 -108 -14 54 -44 85 65 176 143 23 87 -25 -46 -132 62 27
5301 27 -124 113 61 -360 -63 426 -98 -184 194 -71 88 217 60 32 -87 200 -37 188 115 -140 87 138
5323 138 89 -170 5 61 -10 -23 -306 -45 56 -149 3 24 -76 -16 10 49 -283 -39 76 -43 -31 -157 -163 476
$$ packed form
5165b92N48m24J15K86j58j7K35j37k93M52k41j51j27K62r1J70p5p7j7j75J84j1
5187c4j79K46j54K84J32k38j2Q5j62K09l37M68n1l82L54k96p2L91k43L12j76l38
5209a93N7l9J87Q7%R4M6q3k04J93N0k03j09j59J70J25r8J38k16j06K82j35K55
5232A39J24J3l74j22n6k2N36j54K99k11R8k42J91j71j30nK54J9j40J77j51R6j22
5255D6k35J49l0J81M9k98k16L56J33m54L24K60k05j69k39L98r8l9J38j60K04j12
5277a7k24K82n2j80o0K59J80j61K04l39R4O8r8J29k0J11l3j20O4j12k1q6J94l5
5301B7j51K37n2m21K97M89n24q6L78k65J59J29j57k8j19K87k37K25p3k55K27N1
5323A38m9k59J75N6p1j3k83K61J01k05J52K1j00O0K6L9l32K44J15j19J2j26oO39
$$ plain form
5347 476 57 -10 84 -32 -174 38 -110 32 78 -87 93 -220 41 -122 -171 106 107 -512 146 -57 111 45
5369 45 -13 -29 48 32 -238 -26 81 -56 -95 -5 49 111 31 -70 186 -103 -79 -40 -18 108 1 -168 -176 327 -93
5394 -93 13 -80 166 75 215 107 294 76 -35 96 -210 116 40 -68 3 -116 -124 84 -118 94 245 -146
5416 -146 133 47 98 98 69 21 24 -141 168 16 112 59 10 4 64 -159 146 -33 -289 -110 -168 50 -155 -28 -37 -50
5442 -50 -94 -38 60 13 -15 -83 -124 61 -88 84 40 -245 24 -240 157 40 -204 -208 -125 -22 55 -76 -107 95 -187
5467 -187 -240 173 14 291 155 203 -180 26 -175 -78 4 -24 91 45 -43 23 -10 37 88 126 102 1 13 -272 -10
5492 -10 303 239 126 -18 97 67 85 54 -73 -218 -111 -296 148 62 203 172 56 -250 -33 83 85 -130 223
5515 223 -174 80 219 118 -125 -329 -91 32 178 -137 -73 41 306 -73 -49 -425 236 -93 -135 175 91
$$ packed form
5347D76m19o7R4j16j42K12j48J42M6j65J80l13K61j63m9K77Jo19O58k03J68o6
5369D5n8j6P7j6k70K12J07j37l9R0N4O2q0j01K56k89K4L9K2J26j07j69qN03m20
5394i3J06r3K46r1J40j08J87k18j11J31l06L26p6j08P1j19qK08k02K12J51l91
5416a46K79q6N1%k9m8Lj65L09j52R6n3m9oO0k23L05j79k56J79n8K18k05J27rj3
5442e0m4N6R8m7k8o8m1J85j49J72m4k85K69k64L97j17k44mQ3J03P7j31l1K02k82
5467a87n3M13j59K77j36M8l83K06k01R7Q2k8J15m6q8O6l3M7N1L8k4j01J2k85K62
5492a0L13o4j13j44J15l0J8l1j27j45J07j85M44q6J41l1j16l06K17J16Kk15L53
5515B23l97K54J39j01k43k04K38J23J46l15O4J14K65l79K4l76O61l29m2L10q4
$$ plain form
5536 91 -96 134 60 84 -175 -184 -74 -106 14 115 -49 73 195 178 23 55 -136 197 16 -281 -56 -367 -197
5559 -197 -284 -167 76 -53 82 200 90 268 1 109 -242 27 50 165 -47 -134 -132 61 -44 -163 -221 108
5581 108 61 166 -25 -339 103 109 -117 -49 123 45 260 155 -26 52 -13 -4 159 22 86 -133 -33 107 200 -83
5605 -83 43 65 -217 337 -210 184 -226 -3 -47 -80 19 -45 77 123 91 -143 -211 -59 230 -13 119 -58 -239
5628 -239 -32 -90 -81 -97 2 5 -82 305 -41 15 -287 140 -116 27 -243 -40 20 -202 -153 -43 92 71 -25 -73 166
5653 166 -111 -23 -193 42 -148 -199 -30 -63 -75 122 356 8 -229 -247 -34 70 134 -72 -26 -151 79 102 146
5676 146 -178 -215 -117 241 69 2 35 -347 127 29 -347 293 49 140 157 203 202 73 29 116 -220 -161 -112 -123 -35
5701 -35 -188 247 -65 15 -131 93 -304 142 -180 -174 -96 158 209 -228 -135 75 -310 -5 -89 -193 155 59 3
$$ packed form
5536I1j87K30p4K4k59rJ10l2J20J01j64J22J22j7j55L2j91L33j81k97K25l11J70
5559a97q7J17K43j29J35J18j10J78k67J08l51K69K3J15k12q7KJ93j05j19n8L29
5581A08m7J05j91l14M42Ok26O8J72p8K15j05j81P8o5RJ63j37O4k19J00J40R3k83
5605h3J26K2k82N54n47L94m10K23m4l3R9o4J22M6l2k34o8J52K89k43J32j77j81
5628b39K07n8Rj6R9Lq7L87l46N6l02M27k56J43k70K03O0k22M9J10J35k1r6m8K39
5653A66k77Q8j70K35j90n1J69l3j2J97K34l48k37j8K13J04O4k06M6j25K30K3M4
5676A46l24l7R8L58j72o7L3l82M74r8l76O40k44R1J7M6jj29m4Q7l36N9M9j1Q8
5701c5j53M35l12Q0j46K24l97M46l22OP8K54N1m37R3K10l85L05q4j04L48r6n6
$$ plain form
5724 3 -97 -215 -13 -41 -186 -101 95 -31 -131 133 152 71 36 139 -25 -143 268 -118 18 -175 -112 167 -72
5747 -72 -70 -50 -13 14 -105 -21 -303 -170 -119 262 -136 -270 -100 72 -4 5 19 8 75 132 99 -96 -44 -209 -73 -77
5773 -77 -93 -35 9 30 29 -41 124 -38 96 18 -132 -22 -70 4 96 15 -88 -16 2 43 188 125 -254 -43 -309 14
5799 14 162 -67 104 -44 -37 150 75 59 58 -310 187 -24 -162 -117 243 51 0 -9 152 -23 -69 -66 -268 -151 -109
5824 -109 90 49 -58 25 136 -58 66 -117 -67 -91 79 327 -231 132 183 -150 -32 225 -86 54 -135 205
5846 205 26 30 252 -64 184 -229 -122 -44 134 -20 -11 -45 -166 -133 -123 29 115 -46 40 212 53 -50 -234
5869 -234 -143 -48 -63 123 -195 -242 74 71 -173 -173 -12 61 151 -118 123 -170 -177 -15 -200 183 -8 -130 11 -70
5893 -70 177 -266 -7 -5 -247 238 147 24 65 39 3 -282 340 -30 192 151 -118 -22 -276 -175 26 174 -123
$$ packed form
5724Cj00j18K02k8j45Q5J96j26j00K64J9q1l5J03j64j18M11l86J36j93O3K79k39
5747g2KK0L7K7j19Q4k82J33N1L81l98j34J70J72p6RJ4j1O7N7l3j95N2j65J36m
5773g7j6N8M4K1jp0J65j62J34p8j50J10m8P4R2q1j03P2J8M1J45o3l79K11k66L23
5799A4J48k29J71j48PJ87p5j6jl68M97k11j38M5L60j92n1rJ61j75m6Lk02J17M2
5824a09J99m1j07Q3J11j94J24j83N0k4J70K48n58L63N1l33J18K57l11J40j89L40
5846B05j79MK22l16K48m13J07P8J78j54Rl4j21L3J0J52Q6j61Q6J72j59j03j84
5869b34R1R5j5J86l18m7L16lk44%J61P3R0k69K41k93pJ62j85L83j91j22J41q1
5893g0K47m43K59Kk42M85r1j23M1k6l6k85O22l70K22m1k69R6k54J01K01J48k97
$$ plain form
5916 -123 42 -209 104 60 274 -78 -127 95 -22 -76 209 -157 164 411 -66 12 18 154 55 -99 50 -37 137
5939 137 86 103 -330 134 -16 39 12 -161 154 43 -241 -116 -121 63 288 -324 288 179 108 137 -55 154 53
5962 53 -134 7 -82 -57 -30 -147 -191 -186 248 70 -141 109 399 161 -92 -10 223 -111 17 65 -69 -159 129
5985 129 65 -169 -1 25 -52 186 -42 -120 -61 -232 33 208 38 109 -115 -225 -178 -48 376 58 152 160 217 -287
6009 -287 4 144 -104 -133 -29 289 37 68 29 3 50 166 126 144 -155 -80 -7 -144 -106 -7 56 138 99 139 215
6034 215 37 -93 135 -100 -69 69 -40 128 -66 -52 -110 9 49 -286 -20 -44 -36 -133 69 200 27 184 152
6057 152 18 84 29 181 213 103 -31 78 -82 191 -39 176 -3 -22 78 -68 79 5 -41 110 -30 360
6079 360 -15 -60 -84 -104 324 106 -80 -4 -77 32 -34 -82 65 3 -93 77 -126 -12 137 -28 -118 189 -6
$$ packed form
5916a23J65k51L13m4K14l52m9K22j17n4K85l66L21K47m77P8OJ36r9j54J49q7J74
5939A37n1J7m33M64j50N5k7j73L15j11k84J25nJ84K25o12O12j09p1K9j92K09j01
5962E3j87J41q9K5K7j17m4NM34j78k11K50K90k38k53Q2K33l34J28M8j34r0K88
5985A29o4k34J68K6p7K38k28p8N9j71K65J75j70P1k24j10M7J30M24l18R4QN7n04
6009b87K91J40k48k9J04L18k52L1l9k6M7J16m0J8k99P5P3j37L8R9O3Q2l9M0P6
6034B15j78j30K28k35L1J38j09J68j94J4n8J19M0l35K66k4Qr7K02J31j73J57l2
6057A52j34O6n5J52L2j10j34J09j60K73k30K15j79j9J00j46J47p4m6J51j40L90
6079C60l75m5k4k0M28k18j86P6p3J09o6m8J47o2r6J70k03J14J49j65r0L07j95
$$ plain form
6102 -6 -238 -111 -128 -97 -99 114 -123 -19 -31 138 5 0 160 30 -326 179 -48 197 -134 -148 -61 -122 -116 -152 -195
6127 -195 -31 -225 130 -16 -163 269 417 -91 -89 81 -80 -327 -47 182 29 -155 -120 282 -96 -282 -107
6148 -107 -5 -81 -31 -135 353 55 63 -36 241 -59 272 -62 -9 112 -148 162 -14 30 -22 224 44 -53 301
6171 301 -78 -104 -134 107 78 103 -129 118 118 -189 62 -34 -163 37 77 -46 -71 56 -30 -30 107 -54 95 -208
6195 -208 -172 -252 108 167 91 168 195 -58 -185 -106 66 121 218 206 -60 93 0 -25 -72 -3 286 36 28 121 -97 -115
6221 -115 -138 -107 284 57 -260 48 17 20 141 -180 -65 3 -48 -50 -149 -28 -89 -37 -31 -33 28 -22 47 -182 -169 93 -286
6248 -286 -26 -113 -44 150 -409 -25 -201 -25 95 -128 68 -71 -89 99 -138 -61 -20 -50 130 44 44 0 -40 -111
6272 -111 -56 -105 8 26 -20 -7 -160 -68 9 75 -188 63 179 -213 16 70 -195 -30 193 21 -53 42 180 -4
$$ packed form
6102fk32J27j7L1kK13k37J04j2J69j33nJ60j30l56N05k27K45l31j4Q7o1Ol6m3
6127a95J64j94L55j46j47M32J48n08KJ70j61k47K80K29j53j84L5M02l78j86J75
6148a07J02p6N0j04M88k98Qr9K77l00L31l34N3J21k60L10j76M4n2K46j80r7L54
6171C01l79k6l0K41k9K5k32K47%l07K51r6j29K00M0j23k5J27q6%J37j61J49l03
6195b08L6q0L60N9p6P7K7k53j27P9J72N5R7j2k66J53r3k5m7O9K89k50qR3k18j8
6221a15k3L1L91k27l17L08l1LJ21l21J15O8n1kr9J21o1N2OkO1n0O9k29J3K62l79
6248b86K60q7O9J94n59L84j76J76J20k23J96j39j8J88k37P7M1l0J80q6%m4m0p1
6272a11N5m9J13J8m6J3j53R2P7O6k63K51J16l92K29N4k65J65K23j72p4R5J38j84
$$ plain form
6296 -4 26 -38 57 52 76 57 -73 -13 37 -250 70 -223 59 -83 -116 -43 -162 -85 -57 196 142 22 61 -447 162 -65
6322 -65 -102 24 23 299 -100 29 104 7 46 164 -15 111 81 33 -22 56 -23 -119 103 -63 222 100 125 99 120
6347 120 -71 -200 29 65 234 17 96 -233 -124 112 -173 103 131 -64 49 112 36 -79 -42 -91 26 -48 43
6370 43 -21 -10 62 30 114 -54 206 28 -132 -146 -75 -84 79 132 -56 195 -104 40 161 88 -4 40 -69 25 68
6395 68 80 -109 -49 -9 -116 -35 -136 82 -145 182 112 -235 -333 32 123 -80 -91 -33 -120 -9 -24 -235 87 29
6419 29 88 -55 -135 -36 36 -117 -79 123 241 56 136 -43 133 140 -18 279 7 36 222 -15 68 -237 28 30
6443 30 -73 -110 17 -124 -127 -62 -322 59 -2 -139 148 -14 24 -202 120 268 37 25 95 -265 -124 12 -118
6466 -118 -123 -50 -145 -53 -4 -42 236 44 116 -63 15 77 -78 257 136 77 -164 89 -145 -116 131 -25 194 -219
$$ packed form
6296dL0o4R5nK4j9j30O0N0k87L20k93K82j42l3P3j19P7K8K53n4j20L9n08O09k27
6322f5l7J26jK76l99J29P5r7L9J18j79J26l0m8n5P8p9r6K22j66K85j22K5k6K1
6347A20j91j29K29L6J69k17P9l29J09K36k85K76K8j95J13O3p6j15L7m9J17p4R1
6370D3o4J1P2l2Q4j68K60j78j60j4P1rJ63N3j88K51k99J44J21p3r2M4j09R4M3
6395F8J2j89O0M0j07Q1j01K18k27L27p0l47r8L65R1k03j1N8q7J11j5k11L22n8
6419B9N9j43q0R9P2j53L8K02J18j85Q0j79J76Pj58K97k72K9J86k37Q3l05K65K
6443C0j03l7J27j41lO5k60L81o1j37K87j62L8k26L22J48k31j2P0l60J41J36j30
6466a18nP3r5R2M9l8K78j92P2j79P8O2j55L35j21n9k41K53k34K9K47j56K19m13
$$ plain form
6490 -219 -17 -63 -160 -49 188 -49 87 -151 -187 -56 -179 -54 -66 -211 153 71 -99 80 -5 -291 -222 -66
6512 -66 -137 -68 60 351 -74 37 -98 173 200 -115 242 -162 177 119 -3 192 41 -211 217 -199 -190 -22
6534 -22 -166 67 -7 -69 -86 45 -95 -61 66 133 -64 -1 -70 -48 334 16 177 157 454 194 54 218 -136
6557 -136 -188 -91 -236 28 99 -17 -22 137 160 94 325 289 -22 13 -86 -146 -221 -105 76 218 97 -299 155 77
6581 77 -6 10 -164 -8 -249 -76 110 -5 140 57 112 270 329 -45 -127 -104 -35 -80 -86 -127 35 23 314 -4 108
6606 108 -51 162 -6 207 104 -139 -146 62 39 9 109 246 118 160 0 -1 39 -24 15 165 -92 212 -99
6629 -99 41 133 119 190 -108 96 2 -25 5 -69 -149 13 -222 150 37 82 180 -13 -160 96 178 -340 -427 -85
6653 -85 89 239 36 -149 -9 126 -30 146 -62 -39 204 79 37 -120 -33 120 -257 75 132 -110 -304 96
$$ packed form
6490b19K02m6r7J11K37k37J36k38l6J31j23J25j2j45L64q2j70J79q5k86O9J56
6512f6p1O9J28K91m25J11j35K71K7l15L57m04L39n8j22J95j51k52M28m16RJ68
6534b2j44K33p4o2j7J31j40L4J27O7j97O3o9K2L82l18J61k0K97k60j40J64l54
6557a36n2R7j45K64P1j16nJ59K3o6K31l6l11L5r9o0p5J16J81J42j21l96M54p8
6581G7q3J6j74J56k41J73J86j15J45q3N5J58N9l74q2K3O9m5om1J62j2K91l18J12
6606A08j59K13j68K13j03k43pK08k3l0J00J37j28M2j60jM0o3L9J50k57L04l11
6629i9J40R2j4P1k98K04r4k7L0p4q0J62k35L72j13M5R8j93j47K56Q2n18q7L42
6653h5J74J50k03j85J40J35j56J76k08K3K43j25m2j57Q7J53l77L32N7k42j94M00
$$ plain form
6675 96 -145 -133 72 64 -183 33 -278 -57 87 -151 -37 -327 -82 75 60 -145 194 -18 -54 81 -89 -163
6697 -163 246 103 22 88 111 -106 -382 81 -244 204 -113 -15 213 -194 30 58 32 101 224 -47 -24 -110 -38
6720 -38 15 -139 -127 -23 -20 2 -72 -135 265 -146 -176 -12 22 -177 39 8 -77 -80 47 56 239 117 88 -112 13 113
6746 113 -191 -5 -163 74 -154 60 97 62 28 73 10 -208 137 49 -254 79 -20 -17 -79 150 -67 146 170 127
6770 127 62 9 33 -283 -147 -259 55 -70 -2 -103 91 252 105 68 4 -226 232 -103 -98 -49 101 8 -79 -67
6794 -67 -31 16 106 -216 5 -153 -52 91 117 135 -7 154 80 29 -68 134 -60 57 59 61 -103 380 -81 -180 250
6819 250 -85 230 5 -35 210 -225 -86 18 -152 81 101 41 61 45 -71 54 -49 47 17 -82 259 -213 147
6842 147 38 62 250 -100 -94 174 -68 233 141 -64 20 270 149 -256 -13 -159 53 180 -368 451 9 171
$$ packed form
6675I6k41J2K05qk47K16l11K21J44k38J14k90K45J57j5k05L39k12l6J35j70p4
6697a63M09j43q1O6K3k17k76M63l25M48l17R8K28m07K24K8k6O9J23k71K3q6P2
6720c8N3j54J2J04LK2p4o3M00m11l0J64L4j99K16l1q5lJ27RJ83j22k9k00J25J00
6746A13l04J86j58K37k28K14L7l5l4M5o3k18L45q8l03L33r9Lo2K29k17K13K4m3
6770A27o5n3K4l16J36j12L14j25O8j01J94J61j47l7o4k30M58l35NM9J50r3q7J2
6794f7L6M7R0l22K21j58J01J43K6J8j42J61p4n1r7K02j94J17KKj64M83m61r9M30
6819B50l35L15k25m0K45m35J39J04j70K33K0o0K0j6j16J25j03R6l0r9L41m72L60
6842A47j09K4J88l50OK68k42L01r2k05Q4K50j21m05K43j46K12J27n48Q19m42J62
$$ plain form
6864 171 319 65 170 -60 168 -13 51 -5 -112 120 2 -104 120 41 127 -47 -32 -45 71 -150 156 -21
6886 -21 -122 -7 197 -332 66 215 9 399 -97 -36 119 -6 55 33 -22 -38 -146 120 -278 75 -18 69 65
6909 65 84 50 38 32 31 -16 227 116 -250 81 -13 -170 -25 165 -2 23 -39 -103 160 -96 204 -46 -178 44
6933 44 -63 -219 147 124 83 55 -94 5 102 84 -63 239 34 235 -153 -129 5 219 173 -7 95 -217 14
6956 14 186 -248 -30 -45 -91 101 -87 39 -156 40 -106 -155 -14 -79 -1 -174 -44 -100 67 -55 -91 -50 103
6979 103 122 -96 167 -255 -12 72 14 68 41 30 106 106 -39 164 136 55 27 15 -332 172 41 -206 230 155 97
7004 97 48 0 -86 179 -87 22 26 -40 -83 185 -129 -248 -221 -125 86 -285 -25 67 -242 -276 91 55 -178 -52
7028 -52 -129 -199 23 -64 -127 24 -108 -182 141 -30 -360 -44 -43 -288 141 65 173 154 18 1 232 -89 81 -20
$$ packed form
6864A71J48k54J05k30K28j81O4n6j07K32j18j06K24p9Q6j74J5j3J16k21L06j77
6886b1j01J15K04n29L98J49k06L90m96O1J55j25O1k2n5j6j08K66l98L53r3Q7m
6909F5J9l4j2ojm7K43j11l66L31r4j57J45J90j67K5o2o4K63k56L00k50j32K22
6933D4j07j56L66k3m1k8j49R9R7j8j47L02k05K01l88K4J34K14m6j80J02l12K31
6956A4J72m34K18j5m6J92j88J26j95J96j46m9J41o5P8j73J30n6J67j22l6M1J53
6979A03J9k18K63m22K43Q4n8N4k7j1P6%j45K03k8q1k8j2l47N04j31k47M36p5n8
7004I7m9m8q6K65k66J09Mo6m3K68l14j19K7R6K11l71K60R2l09l4L67l6k33J26
7028e2p7p0K22q7o3J51j32p4L23j71l30L16Jk45M29p6J08j9j36j7K31l21J70j01
$$ plain form
7052 -20 -56 -7 -350 99 50 -49 -86 -11 42 -53 7 -102 171 328 102 -92 421 -168 -126 137 72 20 183 -339
7076 -339 56 -40 4 137 161 101 45 105 -114 72 -20 296 57 51 -102 -320 168 -109 -69 -30 -201 30 -162 124
7100 124 237 205 51 -7 50 -48 -297 -74 188 -101 239 -204 -80 76 -40 57 101 199 39 -72 -62 89 1
7123 1 79 -34 -151 -199 -9 -1 39 -163 -10 -107 -217 -144 -183 -159 47 132 81 -119 92 104 265 24 54 213 73
7148 73 106 12 46 -74 -43 -304 -124 -231 -42 100 75 -112 167 30 200 -71 53 -26 119 282 -161 -71 -89
7171 -89 69 90 181 -1 26 -96 110 30 21 -36 -23 -61 -60 72 -165 -182 -43 -118 162 -138 -143 141 -120 -84 -99 3
7197 3 43 -96 -22 -22 28 139 192 -89 96 91 19 19 -306 72 138 -96 -154 97 142 79 12 4 19 141 150 -92 -12 -53
7225 -53 -260 -381 5 -279 1 -41 165 133 -141 -230 208 53 -176 -2 -44 225 -58 -236 -7 181 -140 -32
$$ packed form
7052b0l6M9l43M49m9r9l7P5N3r5O0j09K73J57k26j94N13n89M2K63o5n2J63n22
7076c39L95r6M4J33K4o0n6O0k19J86r2L16k39oj53k18M88k77M0L9j71K31j92K86
7100A24J13l2j54n8N7r8k49K23K62k89L40m43J24J56j16R7M4R8j60j11J0J51q8
7123AP8j13j17m8J90QM0k02J53r7j10P3l9K4K06Q5n1k00K11J2J61k41L0J59j40
7148G3L3r4L4j20L1k61J80j07J89J42k5j87K79j37J70k71J24p9J45J63m43R0j8
7171h9J58K1R1j82K7j22K06q0rn7J3l8JJ32k37j7J39p5K80l00nK84k61L6j5J02
7197CM0j39P4%N0J11N3k81J85np2%l25L78O6k34n8K51M5o3o7qJ5J22Rk42Q0m1
7225e3k07j21L86k84K80m2K06l2k74q9M38j55k29J74m2K69k83j78K29J88l21J08
$$ plain form
7247 -32 -6 -102 77 72 -20 -358 -63 -206 103 86 -323 24 106 176 -14 82 26 -36 -103 157 -156 110 87 -97 -177
7272 -177 114 238 44 -243 -9 -203 163 194 -212 -8 -97 94 -177 101 36 -163 48 -26 61 -36 -16 -71 -111
7295 -111 -137 -207 -401 65 114 -145 258 27 82 136 -92 -194 79 87 -73 180 95 25 -35 -6 -169 -187 -93 -77 184
7320 184 -168 52 -301 -150 110 69 7 -115 -18 80 -23 -72 28 127 120 -32 0 74 -103 -104 -142 170 -86 130
7344 130 97 -112 175 151 272 21 -154 -49 -252 114 157 -453 -173 -94 -68 133 -23 43 -64 127 -291 6
7366 6 -51 -68 28 -6 -66 -142 -115 -66 -15 -149 166 -206 66 52 47 -44 139 -72 -7 -42 -136 -207 -35 271 -17 -162
7392 -162 1 279 -75 83 104 -86 20 -203 -83 -139 134 60 123 -175 -1 80 -69 -139 -168 -51 -184 22
7414 22 -67 149 252 -30 147 -51 271 14 57 -189 -10 -45 9 62 -54 137 75 -122 139 140 -83 81 -224
$$ packed form
7247c2K6r6J79nr2l38K95j43L09j7m09L47Q2P0j90R6n6o2o7K60l13K66k3j84q0
7272a77K91J24j94k87K34j94L66L1m06K04q9J91k71K78o5j99K11p4Q7r7K0n5m0
7295a11k6p0j94M66M9k59M03k31N5N4k28j02K73Qj60K53q5p0o0K9j63j8R4J6K61
7320A84l52K20l53J51K60m1o2j22R7R8j03m9J00R9pj52L2P4j77jl8L12k56K16
7344A30l3k09K87k4J21k51j75J05k03L66M3o10K80P9K6K01j56O6j07J91m18K97
7366Fn7j7R6l4o0p6K7M9N1j34L15l72K72j4nr1J83k11O5l5r4p1J72L06k88j45
7392a62J63K78l54J58K1j90J06k23J20n6K73p4O3k98J74Q1j49p0k9J17j33K06
7414B2q9K16J03k82J77j98L22k57M3k46J79l5N4N3j16J91o2j97K61Jk23J64l05
$$ plain form
7437 -224 -157 59 241 -118 230 -159 -74 52 101 195 50 59 163 -20 -48 71 216 48 45 184 -38 -74 93
7460 93 -60 56 307 -70 129 89 38 -7 58 -29 53 -59 -81 161 177 -74 -182 -168 118 315 97 214 34
7483 34 -24 131 19 -224 -178 -55 -73 -165 -18 109 258 155 -50 71 277 294 -84 203 -128 -70 57 107 -84
7506 -84 -65 -107 -140 23 112 -29 -242 122 -169 385 77 67 110 13 33 77 142 96 -143 108 -96 -67 -146 -124 -124 77
7532 77 131 84 183 117 -166 -276 19 113 -105 -104 23 -25 128 -15 89 117 173 3 120 -158 71 192 266 -26
7556 -26 246 -301 4 -28 -163 -95 114 -8 -178 46 -47 254 95 180 -44 21 -199 240 -71 48 -50 97
7578 97 61 71 -148 247 -272 -123 -113 17 193 -226 -119 -220 114 166 -315 126 -17 -27 -155 -65 -25 -15 93
7601 93 -64 149 73 177 -63 -12 130 207 -157 -291 -72 145 320 -160 57 50 -188 -183 -25 -186 -102 -160 -137 -167
$$ packed form
7437b24O7K16J82l59L48l89Q5J26M9R4j45RJ04j83k8J19J45j68lJ39k22l6J67
7460I3j53J16K51l77J99m0n1m5O5q7Q2j12k2K42J6k51j08J4K86J97k18J17j80
7483C4n8J55j12k43M6J23j8r2J47J27J49j03k05J21K06J7l78K87l31N8J27N0j91
7506h4J9m2l3J63Q9j41k13L64k91N54l08j0M3r7K0M4O5m6k39K51k04K9p9K2%K01
7532G7N4m7R9o6k83j10K95R4k18JJ27m8J53j43J04K8N6j70J17k78K29J21P4k92
7556b6K72n47L05l2j35O8K09j22j70K24r3L01j59Q5k24O5k20M39l11J19r8J47
7578I7l6J0k19L95n19J49J0J30J76m19J07j01L34N2m81M41j43j0j28R0M0J0J08
7601I3j57K13p6J04k40N1J42P7l64j34K19K17J75m80K17pk38NJ58j61Q4n8K3l0
$$ plain form
7625 -167 -32 434 -78 17 138 -181 46 -81 -272 -331 2 -263 -178 100 -45 256 207 54 193 9 -213
7646 -213 -33 -145 263 50 -122 184 455 268 -237 -91 19 -95 390 49 58 99 166 44 -50 -75 -89 28
7668 28 42 79 -2 88 -185 178 -8 -120 203 -100 153 47 155 -22 -92 -137 34 16 213 128 -93 -128 -293
7691 -293 -163 105 100 52 48 83 36 -184 105 262 161 -159 153 -22 160 -18 243 -2 17 -213 -15 -89 -163
7714 -163 -7 330 -56 -180 50 -5 70 -144 156 43 -41 -199 127 -221 93 258 78 -236 -48 179 -1
7735 -1 -146 -24 -61 -19 68 -228 122 -14 -163 108 -173 -143 399 -4 -17 -185 84 7 -399 406 41 -259 -249
7758 -249 30 25 52 88 -117 -144 146 128 -101 301 -437 -36 -98 -14 72 -35 -94 -13 -193 -135 -6 -66 27 -239 9
7783 9 184 39 16 318 243 95 -181 48 49 52 -47 -78 -22 55 162 130 28 7 -172 41 -75 320 201 -143 70
$$ packed form
7625a67J35M66n12R5J21l19K27j27j91n9L33k65Q5K78j45L01m9j53J39j84k22
7646b13J80j12M08k13j72L06K71j87n05J46J10j14M85l41RM1O7j22r4k5j4J17
7668B8J4L7q1R0k73L63j86j12L23l03K53j06J08j77p0m5J71j8J97q5k21l5j65
7691b93J30K68nm8mL5m7k20K89J57j01l20L12j75J82j78K61k45J9k30J98p4p4
7714a63J56L37l86j24K30n5P5k14L00j13q4j58L26l48L14J65j80l14J88K27j80
7735aj45J22l7M2Q7k96L50j36j49K71k81L0N42m03j3j68K69p7m06Q05l65l00J0
7758b49K79nK7L6k05k7K90j8k29M02p38M01o2Q4Q6j07n9Q1j80N8J29o0R3k66K48
7783IJ75j45k3L02p5j48k76K29JLr9l1N6P7J07l2j02k1j79K13j16L95j19l44K13
$$ plain form
7808 70 9 440 45 40 -32 66 40 107 119 18 -38 -74 7 187 -17 200 85 12 -256 -136 -3 122 -94 -71 -34
7833 -34 174 155 40 42 -72 82 37 -103 38 114 -127 -217 -21 107 -35 21 208 -35 222 -39 -88 84 50
7856 50 74 161 123 73 113 118 140 -102 233 64 174 -160 36 -134 82 -167 110 -348 -78 -23 109 81 94 252
7880 252 -25 266 -117 -146 -288 119 18 -43 -89 -44 -133 -357 185 310 165 -198 22 211 87 -44 -116 276
7902 276 37 119 -110 -27 -272 -44 39 108 -98 -151 301 -252 -107 -53 -104 -25 30 3 -130 -244 121 49 82 65
7926 65 -46 143 40 -98 -94 -13 -105 131 -84 -13 116 -48 -241 46 81 -19 383 53 118 -134 -105 -130 -197 -46
7950 -46 -101 -22 555 -103 -24 65 -257 -33 -162 25 1 -48 53 93 11 -195 -95 -222 294 3 -312 -25 188
7973 188 60 203 175 174 30 142 43 -117 -125 -18 -16 131 192 -79 20 202 82 -192 -375 76 -77 -122 -75 -40
$$ packed form
7808G0o1M31l95np2R8k6O7J2j01n6l6Q1J80k04K17j15p3k68J20J33J25k16K3L7
7833c4K08j9j15Kj14J54m5j40J41P6k41r0J96J28j42N6J87k43K57k61m9J72l4
7856E0K4Q7l8n0M0NK2k42L35j69J10l34J96j70K16k49K77m58K70N5J32k8J3J58
7880B52k77K91l83k9j42M07j01o1m6M5q9k24N42J25j45l63K20J89j24j31p2L92
7902B76k39Q2k29Q3k45K28Q3O9k06n3M52n53J45N4n1P9N5k7j33j14L65p2L3j7
7926F5j11J89j03j38MQ1r2K36k15P1J29j64j93K87L5j00M02l30O5k52K9k5o7J51
7950d6n5P9N77o58P9Q9l22K24j29J87k4m9J01M0q2k06J00j27N16k91l15K87K13
7973A88j28J43k8jj44J12r9j60qJ07KJ47O1k71R9J82j20k74j83M51j53m5M7L5
$$ plain form
7997 -40 325 -28 -66 462 -80 140 140 178 -53 -295 18 23 225 12 69 -60 106 -16 39 -45 -16 46 -118 -89
8021 -89 -64 179 -218 42 45 257 -223 -60 -69 -212 191 -295 95 156 -129 -62 498 25 32 -8 -184 142 9 -146
8045 -146 -12 -152 -101 -112 31 -93 77 151 -71 149 -74 -102 308 -17 348 -216 10 64 150 -154 -44 241
8067 241 132 141 -23 -242 24 255 -92 263 -93 181 91 235 -186 86 -126 -140 146 -10 229 -99 -219
8088 -219 311 -43 47 -36 -47 89 -134 -195 227 223 -3 166 -68 74 6 -1 -190 117 -9 146 33 109 230
8111 230 -203 191 -83 -41 275 -310 -33 250 -55 77 -104 3 184 63 126 82 -31 109 17 179 -42
8132 -42 19 231 250 -141 -63 343 -338 -339 -114 251 -39 -76 144 184 -86 -269 -97 -240 -63 204 8 -52 -92
8155 -92 37 104 -182 -41 -366 -34 14 -121 82 7 8 259 31 105 -31 177 95 -145 324 -200 -442 -23 -290
$$ packed form
7997d0L65l53l8N28n42K20%L8k31k42L13NK02k13N7j29J66j22N5q4K9O2j64K9
8021h9K5K43l97K60LK12m80J63rj43M03m86L90O1k85O7N60m73Pm0j76L26j33j55
8045a46J34j40N1j1J43j24J70P4k22K20k23k8M10l25L65n64K26N4Q6l04J10K85
8067B41j09Rj64k19K66K31l47L55l56K74r0J44m21K72k12j4K86j56K39l28j20
8088b19N30l54R0q3j1J36k23o1M22mk26J69k34J42o8pj89L07j26J55j13P6J21
8111B30m33L94k74M2L16n85K77K83l05J32j81J07J81j21O3m4j13J40r2J62k21
8132d2O1K12J9l91P8M06o81jK25L65k90l7K20M0k70j83J72j43J77K67j96o0m0
8155i2J29O7k86J41l25L32M8j35K03p5JK51k28P4j36K08q2k40M69n24k42M19k67
$$ plain form
8178 -290 217 -47 12 2 4 -149 135 137 -144 -195 -42 -64 -66
$$ packed form
8178b90N07k64N9j0Kj53K84Kk81n1J53k2k
8191f6
$$ Imaginary data points
##PAGE= N=2
##DATA TABLE= (X++(I..I)), XYDATA
$$ plain form
0 0 0 0 0 0 0 0 0 0 0 0 8 -8 8 -8 16 -16 16 -24 27 -32 40 -48 56 -66 79 -91 102 -121 139 -158 179 -205 233
33 233 -261 294 -332 372 -414 463 -515 573 -636 706 -780 859 -950 1048 -1154 1269 -1400
50 -1400 1545 -1701 1875 -2071 2293 -2544 2830 -3164 3554 -4022 4590 -5302 6216 -7443 9179
65 9179 -11812 16262 -25146 49566 -251413 -732984 215616 659617 -92487 -576764 -10605
76 -10605 420225 117864 -270318 -196825 84455 248938 78900 -270088 -251260 264033 380035
87 380035 -244879 -489793 207344 536366 -167394 -546691 114501 496649 -62772 -421407
97 -421407 1520 309775 52669 -195009 -105353 71860 142615 37314 -169348 -139500 179824
108 179824 222239 -180580 -287498 173598 326712 -161308 -338066 144588 320986 -116039
$$ packed form
0@%%%%%%%%%%Qj6J6j6K4l2L2m0N1n9P2q8J04j22J45j70J93k23K60k97L37l84M38
33B33m94N55o26P04p86Q77r78J088j209J342j486J639j809J998k202K423k669
50a400K945l246L576l946M364m837N374n994O718p576Q612r892J1518j3659J6622
65I179k0991K8074m1408P4712l00979m81571R48600M44001p52104m84277N66159
76a0605M30830l02361l88182P3493K81280J64483j70038l48988J8828N15293J16002
87C80035o24914k44914O97137L29022p03760l79297O61192L82148n59421l58635
97d21407M22927L08255k57106k47678Q9656J77213P0755j05301k06662K9848L19324
108A79824M2415m02819j06918M61096J53114m88020j76758M82654J76398m37025
$$ plain form
118 -116039 -274855 81014 213471 -32192 -139008 -16117 68857 68164 4261 -105690 -65605
129 -65605 138496 125550 -154931 -168881 169025 203559 -168548 -213071 164361 206742 -143772
140 -143772 -176606 117334 137647 -76584 -87180 33974 39038 11475 9077 -50008 -49088 82523
152 82523 83027 -105763 -107681 119863 122270 -126914 -127207 125747 117149 -120658 -98521 104251
164 104251 67058 -83775 -34801 52931 -132 -22415 25603 -11966 -48222 37269 59460 -60647
176 -60647 -68627 73466 67830 -85279 -65132 89454 51861 -91551 -35071 84609 10632
187 10632 -73266 12194 53764 -34386 -31611 48807 7567 -57547 13592 58492 -30885 -54242
199 -54242 43526 45607 -51567 -32569 57192 17692 -58315 1752 57771 -20599 -50817 41178
$$ packed form
118a16039j58816L55869J32457k45663j06816J22891Q4974o93o3903j09951M0085
129f5605K04101j2946k80481j3950L37906L4534l72107m4523L77432M2381l50514
140a43772l2834K93940K0313k14231j0596J21154N064k7563k398n9085R20J31611
152H2523N04j88790j918K27544K407k49184k93K52954q598k37807K2137K02772
164A04251l7193j50833M8974Q7732n3063k2283M8018l7569l6256Q5491K2191j20107
176f0647p980J42093n636j53109K0147J54586l7593j43412N6480J19680p3977
187A0632q3898Q5460M1570q8150K775Q0418m1240o5114P1139M4900q9377k3357
199e4242R7768K081r7174J8998Q9761l9500p6007O0067N6019p8370l0218R1995
$$ plain form
211 41178 42317 -55464 -27910 66753 14732 -67894 325 64236 -10081 -52083 19373 39131
223 39131 -22368 -20882 26906 4158 -26864 15423 28746 -32002 -27264 49136 24014 -61456
235 -61456 -17609 68730 10397 -68206 -2729 61523 -2844 -49493 6191 33861 -8235 -17342
247 -17342 7507 -358 -7885 16197 5837 -32292 -4818 44446 1315 -55358 1333 59014
259 59014 -6028 -59688 8591 53228 -11114 -43826 9352 29905 -7314 -16239 2126 1436 2409
272 2409 11811 -7849 -24238 11878 34703 -15773 -43030 18283 48021 -20623 -48639 21398
284 21398 45031 -19848 -37465 16105 28309 -9597 -16293 2401 5581 5824 5552 -12257 -14403
297 -14403 18683 23141 -22048 -28608 26083 33314 -26896 -33203 27246 31272 -24790 -26131 20498
$$ packed form
211D1178J139r7781K7554R4663n2021q2626O8219O3911p4317m2002P1456J9758
223C9131o1499J486M7788k2748l1022M2287J3323o0748M738P6400k5122q5470
235f1456M3847Q6339n8333p8603O5477O4252o4367m6649N5684K7670m2096r107
247a7342K4849p865p527K4082j0360l8129K7474M9264m3131n6673N6691N7681
259E9014o5042n3660O8279M4637o4342l2712N3178K0553l7219q925J8365o90R73
272B409R402j9660j6389L6116K2825n0476k7257O1313K9738o8644k8016P0037
284B1398K3633o4879j7617N3570J2204l7906o696J8694L180K43k72j7809k146
297a4403L3086M458m5189o560N4691P231o0210o307O0449M026n6062j341M6629
$$ plain form
310 20498 19760 -13667 -12284 5864 5533 2826 493 -10759 -5227 18008 9208 -23711 -12523 27349
324 27349 14378 -30055 -14996 30145 13781 -28765 -12055 23965 8937 -17800 -5735 9391
336 9391 3031 -578 -1775 -8301 -12 15368 762 -21790 -2227 26038 2633 -28047 -3624
349 -3624 28604 3423 -27118 -3036 22913 1878 -17013 -765 9710 215 -2226 -298 -4914
362 -4914 751 10792 -1565 -15399 2246 18492 -2719 -19521 3229 19541 -3998 -17563
374 -17563 4815 15082 -4781 -10874 4775 6306 -3462 -1240 2158 -2715 764 6666 -3198 -9135
388 -9135 5748 10467 -7825 -10563 9407 10136 -10446 -8977 10396 7065 -10219 -4486 8408 1485
402 1485 -6289 1573 2785 -4223 508 5993 -4465 -6971 7527 6803 -10139 -6266 11074 4993
$$ packed form
310B0498p38l3427J383J8148l31k707k333j1252N532K3235q800l2919J1188L9872
324B7349j2971m4433J5059M5141j6364m2546J6710L6020j5028k6737J2065J5126
336I391o360l609j197o526Q289J5380j4606k2552J9563K8265k3405l0680K4423
349c624L2228k5181l0541K4082K5949k1035j8891J6248J0475r495k441J928m616
362d914N665J0041j2357j3834J7645J6246k1211j6802K2750J6312k3539j3565
374a7563K2378J0267j9863o093J5649J531r768K222L398m873L479N902r864n937
388i135J4883M719j8292k738J9970P29k0582J469J9373l331j7284N733J2894o923
402A485p774P862J212p008M731N485j0458k506J4498p24j6942L873J7340o081
$$ plain form
416 4993 -11924 -3739 11446 1685 -10573 660 8678 -2818 -6225 5061 2876 -6341 587 7048
430 7048 -3508 -6628 6524 4911 -8526 -3343 9214 1302 -9425 990 8662 -2986 -7441
443 -7441 5111 5304 -6469 -3052 7895 39 -8126 2970 7824 -5193 -6233 7387 4019 -8219
457 -8219 -947 8248 -1347 -6900 4502 5388 -6102 -3436 8036 1430 -9314 1408 10275 -3841
471 -3841 -10412 6323 9501 -8463 -7684 9317 5046 -9542 -2181 8004 -1613 -5960 4249 3201
485 3201 -6893 -402 8798 -2825 -10586 5197 11365 -7360 -11282 8974 10620 -10843 -9291 10455
499 10455 6141 -9899 -3142 7584 -517 -5297 3431 1267 -6038 2109 7433 -5248 -9021 7813
513 7813 9382 -10018 -9495 11594 8796 -12101 -7688 12149 5385 -10232 -2761 7846 555 -4393
$$ packed form
416D993j6917Q185J5185r761j2258J1233Q018j1496l407J1286k185r217O928O461
430G048j0556l120J3152j613j3437N183J2557p912j0727J0415P672j1648m455
443g441J2552J93j1773L417J0947p856q165J1096M854j3017j040J3620l368j2238
457h219P272R195r595n553J1402Q86j1490K666J1472o606j0744J0722Q867j4116
471c841o571J6735L178j7964P79J7001m271j4588P361J0185r617m347J0209j048
485C201j0094O491R200j1623p761J5783O168j8725l922K0256J646k1463J552J9746
499A0455m314j6040O757J0726q101m780Q728k164p305Q147N324j2681l773J6834
513G813J569j9400N23K1089k798k0897M413J9837o764j5617P471J0607p291m948
$$ plain form
527 -4393 2342 521 -4058 3942 5950 -7427 -6506 10670 6976 -12250 -7063 13710 7102 -14111
541 -14111 -5722 13503 4637 -11138 -2440 8721 690 -4902 1560 385 -3328 4120 4770 -7579
555 -7579 -5344 10632 5724 -12554 -5743 13584 5397 -13680 -4447 12824 3384 -11260 -1755 8409
569 8409 176 -4846 1410 1033 -3032 2638 3524 -6437 -4105 8929 3571 -11090 -3758 11435 2751
584 2751 -11421 -2231 10748 1075 -9494 -616 7268 -1041 -4399 1612 1402 -2301 1811 2562 -5073
599 -5073 -2290 7185 1844 -8760 -1072 9558 552 -9351 13 8772 -371 -7252 1521 5533 -1407
614 -1407 -3395 2209 1124 -2406 1352 2370 -3576 -1597 5386 1306 -6327 -335 6944 -137 -6604
629 -6604 536 6188 -1317 -5133 1555 3789 -1972 -2100 1949 825 -2182 674 2006 -1933 -1672 3081
$$ packed form
527d393O735j821m579Q000K008j3377R21J7176l694j9226N187K0773o608k1213
541a4111Q389J9225q866j5775Q698J1161q031n592O462j175l713P448O50j2349
555g579K235J5976m908j8278O811J9327q187j9077R233J7271r440j4644R505J0164
569H409q233n022O256l77m065N670Q86r961K332J3034n358j4661P332J5193q684
584B751j4172R190J2979r673j0569Q878P884q309l358O011k10l703M112P51p635
599e073K783R475n341j0604P688J0630r006r903R364Q759r143o881Q773M012o940
614a407j988N604j085l530L758J018n946J979O983m080p633N992P279p081o467
629f604P140N652p505l816O688K234n761j28M049j124l007K856J332l939K61M753
$$ plain form
645 3081 798 -3920 -368 3977 -159 -3562 1093 2871 -1216 -2469 1676 1532 -1524 -984 1638 -133
661 -133 -1257 615 983 -1203 -717 1728 202 -1813 310 1594 -827 -1350 972 814 -1177 -717 1013
678 1013 95 -1010 251 798 -286 -353 825 125 -581 -139 780 -503 -650 482 131 -755 118 649
696 649 -213 -778 489 336 -471 110 679 -167 -574 592 206 -866 -49 909 117 -915 236 994 -868
715 -868 -875 1094 314 -1047 260 1060 -647 -1251 1156 777 -1910 -504 1574 89 -2099 417 2053
732 2053 -249 -2070 909 1791 -1245 -1055 1571 550 -1594 408 1508 -1227 -1311 1861 1120 -2428
748 -2428 -397 2890 241 -3162 148 3007 -436 -2729 1083 2627 -1334 -1575 1578 776 -1706 413
764 413 1552 -1309 -1246 2243 841 -2782 -238 3490 -133 -3237 777 2915 -777 -2892 1178 2354
$$ packed form
645C081k283m718L552M345m136l403M655J778m087j253M145j44l056N40K622j771
661a33j124J872L68k186M86K445j526k015K123J284k421n23K322j58j991M60J730
678A013r18j105J261N47j084o7J178p00p06M42R19j283j47J132l51q86Q73N31
696F49q62n65J267j53q07N81N69q46m07J166l86j072Q17R58p92j032J151P58j862
715h68pJ969p80j361J307Q00j707o04K407l79k687J406K078j485k188K516J636
732B053k302j821K979Q82l036J90K626j021k144K002J100k735q4L172p41l548
748b428K031L287k649l403L310K859l443k293L812J544l961k41L153q02k482K119
764D13J139k861O3L489j402l623K544L728l623l104M014K138l692k115M070J176
$$ plain form
780 2354 -1516 -1751 1452 741 -1108 430 1363 -1397 -1082 2450 211 -2848 27 3716 -747 -3553
796 -3553 1302 3256 -1406 -2928 1746 2358 -1707 -1886 1706 835 -1566 529 1076 -1554 -874 2208
812 2208 426 -2799 184 3109 -950 -3768 1170 3334 -1646 -2783 1479 2230 -1820 -1624 1406 541
828 541 -1472 302 1021 -823 -715 1834 111 -2526 376 2842 -664 -2905 1437 2798 -1584 -2164
844 -2164 1640 1472 -1560 -1112 1201 406 -1338 341 787 -690 -474 1471 41 -1766 353 2119
860 2119 -872 -1846 1650 1991 -1746 -1607 1635 1091 -1803 -560 1515 125 -1127 439 867 -964
876 -964 -711 1373 -71 -1437 467 1628 -982 -1815 1080 1461 -1478 -1048 1437 971 -1382 -299 1309
893 1309 -220 -1374 597 647 -1017 -429 1266 242 -1351 33 1233 -448 -1317 529 859 -804
$$ packed form
780B354l870k35L203p11j849J538R33k760L15L532k239l059K875L689m463k806
796c553M855J954m662j522M674O12m065j79L592q71k401K095N47k630O80L082
812B208j782l225K983K925m059k818M938K164m980j137M262P51m050J96L030q65
828E41k013J774P19j844J08K549j723k637K902K466l506k241M342J361m382n80
844b164L804j68l032M48K313p95j744J679M46j477K16J945j430j807K119J766
860B119k991r74L496L41l737J39L242n44k894J243K075j390j252J566M28j831
876i64K53K084j444j366J904J161k610q33K895L81k939M30K485m66k353J083J608
893A309j529j154J971N0j664N88J695j024j593J384J200j681q69J846L30j663
$$ plain form
909 -804 -1062 864 486 -836 -29 989 28 -693 193 605 -344 -225 780 77 -756 -56 449 -101 -567
928 -567 427 506 -609 -651 593 73 -370 83 533 -23 -275 435 302 -576 -141 182 179 -507 191 362 -316
949 -316 -431 175 209 -241 -92 25 -248 -96 129 269 -380 -214 288 115 -129 -587 -170 -167 -156 -242 46 52 -203
972 -203 -46 -74 35 -456 -153 297 -94 -49 -133 442 -93 -110 388 238 -180 -61 47 199 -92 -37 414 87
994 87 -97 -43 88 54 -366 89 17 39 -529 155 192 -384 -238 476 36 -194 240 206 -146 -288 312 188 -362
1017 -362 188 220 -184 -42 246 188 -397 -254 185 45 -450 309 490 -144 -348 310 296 -416 -144 350 -69
1038 -69 -399 -64 118 -136 55 334 218 -216 -209 408 -313 -550 301 333 -207 -440 601 226 -695 57 678
1059 678 359 -396 139 393 -206 -331 165 260 -283 110 488 -248 -637 374 1015 -480 -395 680 395 -404
$$ packed form
909h04k58J926l78j322Q07J018r61p21Q86M12r49J19J005p03q33P00N05n50m66
928e67R94P9j115m2J244n20m43M53M50n56k52P10j33q78M35L23lo86O98J71o78
949c16j15O06L4m50J49J17k73J52K25J40o49J66N02j73k44m58M17LJ1q6K88Ok55
972b03J57k8J09m91L03M50l91M5q4N75n35j7M98j50m18J19J08J52k91N5M51l27
994H7j84N4J31l4m20M55p2K2n68O84L7n76J46P14m40k30M34l4l52j42O00j24n50
1017c62N50L2m04J42K88n8n85J43M39j40m95P59J81o34k04O58j4p12K72M94m19
1038f9l30L35J82k54J91K79j16m34PO17p21k37Q51L2n40k33J041l75r21P52O21
1059F78l19p55N35K54n99j25M96R5n43L93L78p36l89J011O41j495Q5J075k85p99
$$ plain form
1079 -404 -334 818 -37 -765 83 738 -149 -269 558 195 -511 118 521 -457 -569 683 460 -705 -422
1098 -422 917 255 -529 -221 945 -316 -521 203 390 -581 -124 612 -216 -454 28 497 -332 -649 683
1117 683 283 -995 -400 1085 266 -1069 -177 890 -489 -907 528 530 -866 -408 629 62 -933 311
1135 311 787 -294 -408 898 787 -1072 -490 909 122 -941 99 794 -489 -848 558 493 -947
1152 -947 -332 875 -137 -813 271 787 -315 -853 481 260 -890 -126 928 136 -925 192 841
1169 841 -36 -657 870 563 -681 -315 756 -58 -855 406 729 -495 -614 652 601 -1219 -370 693
1187 693 -34 -916 319 815 -478 -513 904 422 -888 -319 915 -196 -874 130 851 -835 -539 883
1205 883 559 -638 -342 769 8 -664 325 713 -636 -565 516 506 -601 -203 831 8 -772 243
$$ packed form
1079d04P0J152q55p28Q48O55q87j20Q27l63p06O29M03r78j12J252k23j165K83
1098d22J339o62p84L08J166j261k05P24J87r71M57P36q28k38M82M69q29l17J332
1117F83m00j278N95J485q19j335Q92J067j379m18J435Kj396M58J037n67r95J244
1135C11M76j081j14J306j11j859N82J399p87j063J040O95j283l59J406o5j440
1152i47O15J207j012o76J084N16j102n38J334k21j150P64J054p92j061J117O49
1169H41q77o21J527l07j244L66J071q14p97J261L23j224j19J266n1j820Q49J063
1187F93p27q82J235M96j293l5J417m82j310N69J234j111o78J004P21j686K96J422
1205H83l24j197K96J111p61o72R89L88j349P1J081j0j107L98J034q23p80J015
$$ plain form
1223 243 844 -103 -643 618 496 -707 15 699 22 -735 384 442 -306 -740 675 405 -820 -155 697
1242 697 -222 -828 217 672 -464 -701 376 303 -469 -486 496 107 -288 248 602 -416 -209 877 405
1261 405 -569 -263 649 -351 -614 431 943 -460 -688 517 321 -145 -260 466 -49 -462 -118 220 -439
1280 -439 -172 483 224 -658 -82 459 -75 -579 198 418 -354 -464 415 256 -565 -43 369 -15 -574 55
1300 55 260 -301 -164 284 104 -389 126 244 -107 -398 346 376 -208 -507 38 516 -149 122 153 -30 -233
1321 -233 116 384 -374 -81 221 -134 -272 142 273 -18 -167 136 297 -191 -49 89 -9 -403 101 249
1341 249 204 -184 92 147 -97 91 110 -62 -210 55 224 -126 -239 -11 127 33 -116 140 24 -196 44
1362 44 34 126 14 34 -19 242 366 -30 71 -79 -178 137 22 -101 133 104 -70 -278 71 163 71 180 -102
$$ packed form
1223B43O01r47n40J261j22j203P22O84o77p57J119N8p48m34J415k70j225O65Q52
1242F97r19o06J045M55j136k37J077p3p72j7R82l89l95N36L54j018K07J086m72
1261D05r74L06R12j000k63J045N12j403k28J205j96m66j15P26n15m13L44L38o59
1280d39K67O55k59q82N76N41n34n04P77K20p72j10Q79j59q21N22M12l84n59O29
1300E5K05n61J37M48j80m93N15J18l51k91P44L0n84k99N45M78o65K71L1j83k03
1321b33L49K68p58K93L02l55j38M14J31k91j49L03J61m88J42J38r8l94N04J48
1341B49m5l88K76N5k44J88J9j72j48K65J69l50j13K28J38r4j49K56j16k20K40
1362D4j0R2j12K0n3K61J24l96J01j50r9L15j15j23K34k9j74k08L49R2r2J09k82
$$ plain form
1385 -102 -76 -254 -248 41 -294 -271 384 108 46 58 262 120 -44 -62 -152 -4 -42 -65 107 266 101 337 2
1408 2 166 -242 182 -77 131 159 -134 155 130 64 29 97 128 209 -113 -9 -15 81 1 -179 70 172 -235 -262 106
1433 106 -44 -97 -15 -29 -89 44 -159 70 -121 -72 -124 43 299 -110 15 -87 -21 -18 -85 -11 -104 -31 -16 -144 50
1458 50 86 -97 -220 133 -50 -39 172 -130 178 -154 -7 -36 37 -337 -96 -357 -135 -10 -86 285 115 -267
1480 -267 87 -113 64 -230 14 -39 -171 37 -167 87 -66 143 266 -161 -177 -155 -200 115 -239 131 50 -7
1502 -7 -53 266 -155 -33 184 -69 9 104 49 282 -84 132 295 -119 -26 8 -125 -152 -62 313 -41 -203 -217 32
1526 32 -74 84 -87 129 -177 18 -64 182 -377 -126 219 -92 24 -208 -35 -71 80 129 190 -8 168 215
1548 215 197 -26 275 112 283 -41 45 22 -277 62 -15 10 -79 -122 399 -164 121 407 27 -126 51 394
$$ packed form
1385a02K6j78OK89l35K3O55k76o2J2K04j42j64j8r0J48l8k3J72J59j65K36l35
1408BJ64m08M24k59K08K8k93K89k5o6l5O8L1Q1l22J04oR6q0j80K49J02m07k7L68
1433A06j50n3Q2j4o0J33k03K29j91M9n2J67K56m09J25j02O6Lo7P4r3P3J5j28J94
1458E0L6j83j23L53j83J1K11l02L08l32J47k9P3l74K41k61K22J25p6L71j70l82
1480b67L54k00J77k94K44n3j32K08k04K54j53K09J23m27j6K2m5L15l54L70q1n7
1502gm6L19m21J22K17k53P8R5n5K33l66K16J63m14R3L4j33k7R0L75l54j62j4K49
1526C2j06J58j71K16l06J95q2K46n59K51L45l11J16k32J73l6J51M9O1j98J76M7
1548B15j8k23L01j63J71l24Q6k3k99L39p7K5q9m3N21n63K85K86l80j53J77L43
$$ plain form
1570 394 -45 69 121 255 -179 -238 60 154 34 -25 278 -45 -416 89 209 -207 -195 309 105 44 -164 383
1592 383 -118 -351 -175 197 -138 -58 122 397 -278 -227 389 55 -116 255 4 29 -368 123 159 -306 -310 -63
1614 -63 -18 -344 234 191 142 8 103 185 -172 -193 318 7 -129 -73 193 -177 -262 163 260 -216 -210 301 165 -226
1638 -226 -62 425 -124 -348 29 16 -37 -544 274 218 -393 -77 418 157 -563 57 125 -174 -199 244 363 -378
1660 -378 104 283 50 -367 -2 196 16 -379 -14 54 -327 -94 51 89 -610 89 623 -37 -383 322 339
1681 339 -549 -148 271 -108 -270 187 499 140 -310 120 383 -50 -211 130 -37 -491 270 93 64 -124
1701 -124 58 372 -390 -198 331 277 -304 224 276 -4 -289 83 414 -544 -446 481 202 -809 95 326 -17
1722 -17 -236 379 283 -276 -147 409 23 -438 -176 470 -30 -299 8 272 -293 -426 298 299 -443 13 345
$$ packed form
1570C94m39J14N2J34m34n9K98R4j20n9L03l23l71N05J20m16J2N04k04o1k08N47
1592C83n01k33J76L72l35Q0J80K75o75N1O16l34j71L71k51K5l97M91L6m65mK47
1614f3M5l26N78m3m9j34R5Q2l57k1N11l11j36N6K66l70q5M25R7m76ON11j36l91
1638b26J64M87n49k24L77j3n3n07Q18n6o11L16M95k61p20O20O8k99k5M43J19p41
1660c78M82J79k33m17L65J98j80l95L65O8l81K33J45L8o99O99N34o60l46P05J7
1681C39q88M01M19l79j62M57L12l59m50M30K63m33j61L41j67m54P61j77k9j88
1701a24J82L14p62J92N29n4n81N28N2k80k85L72L31r58R8R27k79j011R04K31l43
1722a7k19O15r6n59J29N56l86m61K62O46n00k69L07K64n65j33P24Jp42M56L32
$$ plain form
1743 345 -104 -530 225 370 -156 -374 369 30 -374 45 521 134 -428 444 548 -340 -254 245 55 -446
1763 -446 -158 259 -135 -276 -26 433 -257 -181 159 60 -374 223 299 -94 -177 238 371 -255 -436 536 163
1784 163 -519 -129 297 165 -312 102 326 -109 -26 82 23 -509 293 340 -123 36 20 664 -452 -364 76
1805 76 219 -235 7 255 -31 -340 381 472 -148 -479 335 217 -233 -19 242 -48 -465 64 767 -29 -409
1826 -409 299 178 -157 279 225 -19 -460 -48 133 -165 -90 298 70 -400 -141 477 -116 -390 51 308 10
1847 10 -91 449 471 -96 -265 -48 175 -405 -43 135 -243 -399 154 292 -100 -192 279 -12 -231 114 168
1868 168 -154 -297 227 94 -443 101 142 93 -572 -42 -21 175 -159 -82 121 -170 25 457 52 -405 -23
1889 -23 320 -330 -147 240 219 -337 -337 481 0 -359 157 183 -42 -164 104 93 -233 -102 340 155 -156 189
$$ packed form
1743C45m49m26P55J45n26k18P43l39m04M19M76l87n62Q72J04q88Q6M99j90n01
1763d46K88M17l94j41K50M59o90P6L40r9m34N97P6l93q3M15J33o26j81R72l73
1784A63o82L90M26j32m77M14K24m35Q3J08n9n32Q02M7m63J59j6O44j116Q8M40
1805G6J43m54K42K48k86l09P21R1o20l31Q14j18m50K14K61k90m17N29P03p96l80
1826d09P08j21l35M36n4k44m41M12J81k98P5L88k28m70K59O18n93k74M41K57k98
1847A0j01N40K2n67j69K17K23n80L62J78l78j56N53J38l92r2M71k91k19L45N4
1868A68l22j43N24j33n37N44M1m9o65N30K1J96l34P7K03k91J95M32m05m57L82
1889b3L43o50J83L87k1n56%Q18m81l59N16K6k25j22K68j1l26J31M42j85l11L45
$$ plain form
1911 189 170 -101 22 -75 124 -122 -316 197 89 -176 13 332 -84 29 265 212 -377 -107 328 -97 -603
1932 -603 62 220 -437 -275 253 391 -408 -117 314 217 -460 -85 469 -159 -524 131 100 -271 -66 37 -128
1953 -128 -280 93 379 -281 -258 204 202 -346 -72 291 -21 -193 54 434 -240 -140 418 428 -70 -421 577
1974 577 353 -147 323 325 59 -439 208 423 -308 -188 354 38 -561 216 567 -251 -281 453 237 -442 -212
1995 -212 449 39 -572 178 241 26 -331 488 273 -317 -93 60 -39 -301 227 430 -230 -427 350 144 -263
2016 -263 82 427 -223 -307 402 730 -439 -541 355 495 -191 42 386 -58 -695 350 397 -331 -461 490
2036 490 101 -633 -10 616 -48 -435 286 433 -222 -468 591 152 -190 -294 412 -86 -439 423 340 -439
2056 -439 -291 582 372 -368 -118 370 36 -469 163 590 -325 -213 574 336 -427 -112 603 -160 -497 39
$$ packed form
1911A89j9k71J23r7J99k46j94N13j08k65J89L19m16J13K36n3n89K70M35m25n06
1932f03O65J58o57J62N28J38p99K91M31r7o77L75N54o28l65O55l1l71K05J03j65
1953a28j52L73K86o60K3M62kn48K74L63l12j72K47L80o74J00N58J0m98l51R98
1974E77k24n00M70Kk66m98O47K15p31J20N42l16n99P77L51q18l0P34k16o79K30
1995b12O61m10o11P50O3k15l57Q19k15n90K24J53r9k62N28K03o60j97P77k06m07
2016b63L45L45o50q4P09L28j169j02Q96J40o86K33L44m44o37J045M7p28j30R51
2036D90l89p34O23O26o64l87P21J47o55k46J059m39l42j04P06m98l53Q62q3p79
2056d39J48Q73k10p40K50M88l34n05O32M27r15J12P87k38p63L15P15p63l37N36
$$ plain form
2076 39 294 -475 -128 644 104 -348 65 618 -34 -503 409 302 -81 -257 564 114 -369 -267 656 -359
2096 -359 -319 328 589 -437 -349 442 30 -551 -9 610 -232 -503 301 222 -361 -272 581 137 -367 -27 532
2117 532 -120 -588 375 247 -400 -237 371 -46 -530 -113 497 -323 -384 457 537 -455 -258 373 66 -585 125
2138 125 314 -210 -268 406 331 -240 -193 414 91 -689 235 375 -336 -318 274 294 -294 -104 518 -62 -390 256
2160 256 494 -251 -4 135 341 -260 87 533 -296 -350 181 410 -321 -308 316 -33 -211 65 255 -115 -216
2181 -216 389 -44 -433 -407 346 131 -398 385 164 31 -320 58 272 -383 -150 585 -30 -413 286 171
2201 171 -449 -352 502 135 -299 73 534 33 -896 181 443 -394 -80 343 -267 -302 243 102 -224 -78
2221 -78 321 267 -424 -253 439 -231 -454 455 748 -199 -661 293 192 -148 -96 179 -183 -188 -312 225 36 -399
$$ packed form
2076C9K55p69L47P72n40m52M13N53o52m69R12j07l83j76Q21m50m83J02R23j015
2096c59M0O47K61j026Q8P91m12n81N42O19q42k71Q04p9n83Q9Q53m44n04L40N59
2117E32o52m68R63j28o47J63O08m17m84M17O10q20o1Q41Q0r92J97O31l07o51P10
2138A25J89n24n8O74p5n71M7O07l23p80R24J40p11J8N92K0n88J90O22n80l28O46
2160B56K38p45K47J39K06o01L47M46q29n4N31K29p31J3O24l49j78K76J90l70j01
2181b16O05m33l89K6P53k15n29P83k21j33l51L78K14o55K33P35o15l83O99j15
2201A71o20R7Q54l67m34L72M61n01r29J077K62q37L14M23o10l5N45j41l26J46
2221g8L99n4o91J71O92o70k23R09K93r47m62R54j01l40N2K75l62nj24N37j89m35
$$ plain form
2243 -399 414 67 -659 -215 358 -13 -477 -119 482 -196 -395 500 279 -508 11 351 -318 -470 19 114
2263 114 -515 -178 416 -120 -636 57 435 -196 -552 361 334 -239 -287 642 149 -578 -201 236 -154 -473 162
2284 162 436 -567 -110 427 169 -409 19 788 -186 -384 340 381 -265 -7 486 88 -421 336 518 -140
2304 -140 -615 295 400 -466 -95 674 323 -613 77 558 -158 -450 271 299 -644 -257 638 68 -629 182
2324 182 421 -564 -183 371 153 -601 -46 450 -2 -944 192 354 -327 -493 487 196 -557 -45 473 128
2344 128 -571 85 433 -552 -189 417 -65 -309 112 537 -291 -313 195 437 -235 -381 503 377 -481 -48
2364 -48 540 -320 -565 228 740 -433 -195 237 283 -478 -35 367 -390 -428 358 288 -282 -208 226 -88 -430
2385 -430 183 377 -337 -590 560 459 -246 -219 427 21 -401 -88 517 -152 -426 271 408 -303 -163 387
$$ packed form
2243c99Q13l47p26M44N73l71m64L58O01o78j99Q95k21p87N19L40o69j52M89R5
2263A14o29L37N94n36n16O93L78o31l56R13k7n73m8R29m93p27L77M37l90l19O35
2284A62K74j003M57N37k58n78M28P69r74j98P24M1o46K58M93l98n09P57J82o58
2304a40m75R10J05q66L71P69l51r36O90M81p16k92P21K8r43L87Q95n70o97Q11
2324A82K39r85L81N54k18p54N55M96m52r42J136J62o81j66R80k91p53N12N18l45
2344A28o99O56L48r85L63O06m82k44M21M25q28k2N08K42o72j46Q84j26q58M33
2364d8N88q60k45P93N12j173K38M32M6p61M43M02p57l8P86p0n70P4M34l14l42
2385d30O13J94p14k53J150j01p05K7O46m06m22L13O05o69k74O97J37p11J40N50
$$ plain form
2405 387 27 -466 43 448 41 -422 450 10 -377 -489 437 36 -311 64 257 -277 -107 445 216 -244
2425 -244 -245 526 -48 -365 29 314 -139 -256 94 395 -406 -25 290 48 -252 351 197 -339 -66 567 176
2446 176 -443 127 466 134 -257 358 32 -109 -121 128 219 -113 73 213 -272 -314 -9 165 -245 -226 311
2467 311 -4 -8 188 531 -329 -172 122 25 -379 -93 477 -143 -237 117 361 -171 49 52 35 137 250 219 -279
2490 -279 -298 244 524 -54 -281 395 115 -236 96 -10 5 -259 131 44 -243 -349 131 219 -465 45 135 -220
2512 -220 -394 77 352 -324 -4 239 182 -73 -68 184 133 -20 330 -7 -191 -97 339 38 -145 13 -22 -185
2534 -185 -16 -129 -7 -185 -88 114 124 -174 -32 178 -113 -149 265 179 -146 -262 265 11 -119 181 317
2555 317 -237 -200 134 -226 -59 -4 220 -70 -70 -127 12 -319 29 141 119 -383 -103 135 31 -117 -35 -28 -187
$$ packed form
2405C87l60m93N09M05m07m63Q72m40l87j12R26m01l47L75J93n34J70N52k29m60
2425b44jP71n74l17L94K85m53j17L50L01q01L81L15k42l00O03j54n36K73O33l91
2446A76o19N70L39l32l91O15l26j41j2K49R1l32J86J40m85m2L05J74m10J9N37
2467C11l15mJ96L43q60J57K94r7m04K86N70o20r4L54K44n32K20Lj7J02J13l1m98
2490b79j9N42K80n78k27O76k80l51L32j06J5k64L90q7k87j06M80Q8o84N10R0l55
2512b20j74M71K75o76L20K43n7k55NK52n1j53L50l37j84R4M36l01j83J58l5j63
2534a85J69j13J22j78R7K02J0k98J42K10k91l6M14q6l25j16N27k54j30L00J36
2555C17n54L7L34l60J67N5K24k90%n7J39l31L48J12k2n02K80K38j04j48Q2Pj59
$$ plain form
2578 -187 29 188 -72 219 13 -152 -56 -118 147 -36 -268 9 232 -113 -339 63 -34 -172 251 79 327
2599 327 -151 256 113 206 20 148 -88 -102 -21 12 -14 -172 8 151 -22 6 -77 241 -102 -263 -14 0 -52
2622 -52 205 177 -61 48 230 47 -6 -24 -22 -43 -45 283 -161 -107 16 217 -15 -35 360 -92 -307 -130 18 -115
2646 -115 219 27 -79 -131 6 231 147 -257 -73 406 -268 -92 73 8 -133 -224 189 56 -36 102 160 -495
2668 -495 -210 171 385 -113 -15 183 -129 -370 -193 165 84 -249 218 29 -250 -243 363 93 -189 101 404
2689 404 -371 -57 381 177 -230 -157 154 -84 -149 -75 235 -314 15 77 60 -152 92 98 -57 -327 184 804
2711 804 56 -317 194 100 -363 -114 568 51 -474 239 242 -93 -145 242 273 -471 -31 525 -28 -335 -37 102
2733 102 -371 -271 246 -1 -591 27 389 -13 -160 120 395 -173 -255 418 29 -95 46 245 -240 -581
$$ packed form
2578a87K16J59k60K91k06j65R6o2K65j83k32K77K23l45k26M02r7j38M23j72K48
2599C27m78M07j43R3j86J28k36j4Q1L3k6j58J80J43j73K8q3L18l43j61K49J4n2
2622e2K57k8k38J09J82j83n3j8Kk1kL28m44N4J23K01k32k0L95m52k15J77J48j33
2646a15L34j92j06n2J37K25q4m04J84M79o74J76J65o5j41r1M13j33r2J38N8o55
2668d95K85L81K14m98R8J98l12k41J77L58q1l33M67j89k79PO06k70k82K90L03
2689D04p75L14M38k04m07P3L11k38o5P4L10n49L29O2j7k12K44Oj55k70N11O20
2711H04p48l73N11r4m63K49O82n17n25P13Ll35n2L87L1p44M40N56n53l07K98J39
2733A02m73J00N17k47n90O18L62m02j47K80K75n68q2O73l89j24J41J99m85l41
$$ plain form
2753 -581 230 257 -435 -276 284 -55 -543 -350 407 73 -410 315 556 -241 -135 266 228 -355 -8 689 -57
2774 -57 -455 264 609 -162 -78 204 -205 -249 258 228 28 -263 49 304 -354 -238 358 249 -118 194 359
2795 359 -221 -339 247 340 -366 -165 439 127 -272 140 425 110 -402 403 267 -369 -408 560 -12 -331 -11
2816 -11 536 -98 -393 199 533 -415 -232 443 280 -410 80 472 -232 -338 401 405 -419 -259 409 -82 -495
2837 -495 -42 510 46 -349 -11 307 -367 -266 446 219 -232 -306 311 -235 -200 263 192 -344 -320 381 -2
2858 -2 -538 -135 567 -160 -381 302 95 -405 -160 390 -9 -450 -140 246 -224 -137 107 -18 -249 -17 287
2879 287 311 -320 187 273 -462 -148 308 323 -217 -211 161 199 -190 44 249 -114 -497 279 203 -255 -146 272
2901 272 130 -434 342 101 -171 -161 494 140 -187 -238 398 -49 -445 33 244 -89 -467 -101 96 -175 -294
$$ packed form
2753e81Q11K7o92J59N60l39m88J93P57l34m83P25K41p97J06M01l8n83L47O97p46
2774e7l98P19L45p71Q4K82m09m4N07l0k00k91L12K55o58J16N96j09l67L12J65
2795C59n80j18N86R3p06K01O04l12l99M12K85l15n12Q05j36o36l9R68n72l19L20
2816a1N47o34k95N92L34r48J83O75j63o90M90L92p04j06P39Mq24J60O68m91m13
2837d95M53N52m64l95L38L18o74J01P12k27m51p4O17n46L5M63p1n36K4P01l83
2858bn36M03P02p27k21O83k07n00K45N50l99m41L10L86m70Q7K44j25k31K32L04
2879B87K4o31N07Q6p35L14M56J5n40OL72L8l89K34K05l63l83P76p6m58J09M18
2901B72j42n64P76k41k72J0O55l54l27n1O36m47l96M78K11l33l78L66J97k71j19
$$ plain form
2922 -294 357 -316 -333 -137 40 -265 76 277 187 -318 -7 257 -97 -236 -11 389 -150 -269 89 45 -259
2943 -259 -86 62 119 -493 49 330 -131 -298 80 -108 -65 -28 397 93 13 155 389 3 -110 92 -20
2964 -20 -378 -262 195 -158 -415 5 135 -112 -191 332 139 -145 154 58 34 -301 31 236 -429 -66 67
2985 67 241 -276 -93 420 2 -355 144 116 -74 -192 430 97 -154 91 -19 -17 -9 129 223 -415 -100 192
3007 192 128 17 97 278 -87 -233 -25 231 -201 -205 -80 189 -120 221 30 -331 -214 148 130 74 85 -106
3029 -106 23 -9 -25 200 -239 -240 28 112 -305 -282 297 27 -265 147 17 -99 -296 -39 44 -119 -279 -40
3051 -40 228 15 -32 199 -275 -222 10 17 -277 -382 140 264 -94 102 134 52 -242 -121 8 -54 -130 7 12 -340
3075 -340 310 222 -125 113 374 198 -359 -196 215 167 -27 106 204 -258 31 -42 -2 -13 -11 -66 -89 -286 254
$$ packed form
2922b94O51o73j7J96J77l05L41K01r0n05L11K64l54j39K25M00n39j19L58m4l04
2943b59J73J48N7o12N42K81m61j67L78j88M3L7M25l04q0J42K34l86j13K02j12
2964b0l58J16M57l53k57M20J30k47p9N23j93k84K99r6k4l35L32K05o65L63J33
2985F7J74n17J83N13m18l57M99k8j90j18O22l33k51K45j10KQJ38R4o38L15K92
3007A92o4j11Q0J81l65j46K08K56m32mJ25K69l09L41j91l61J17L62j8n6J1j91
3029a06J29l2j6K25m39jK68Q4m17K3N79k70k92M12j30j16j97K57Q3j63j60K39
3051d0K68k13m7K31m74N3K32Pk94j05N22J24l58J96L2q2k94J21J29o2p6J37Nl52
3075c40O50q8l47K38K61j76n57J63M11m8j94J33R8m62K89p3M0j1Kn5k3j97N40
$$ plain form
3098 254 -36 -127 -137 81 45 -94 48 150 -8 24 -56 237 -106 36 326 152 8 11 46 30 -32 -38 187 -180
3122 -180 -228 214 175 -232 -236 -68 -94 -102 46 1 125 155 323 -57 -50 221 -88 -22 -116 -67 -9 107 20 54 69 -145
3148 -145 92 102 113 -3 183 -63 12 113 -98 -104 -255 176 73 -42 -318 31 203 -64 45 71 -48 52
3170 52 -45 -11 151 10 96 -188 -155 -158 -5 -176 33 -118 -85 -140 -87 44 78 -152 -271 252 69 129 51 50 55 -108
3196 -108 48 199 57 -50 146 38 150 -72 -88 -9 19 23 125 -123 256 71 7 -21 -199 173 -26 6 -123
3219 -123 67 -156 -173 276 4 22 -135 -150 -47 -317 97 -75 -125 263 142 -52 119 171 85 232 19 24 259
3242 259 -139 108 -150 -160 239 65 -485 -329 -115 -91 8 -59 -156 -123 57 166 -56 30 -1 68 37 346 -175
3265 -175 72 -60 -308 63 -142 152 14 92 278 79 -316 60 47 44 -66 -316 -57 -89 -50 -174 -112 -9
$$ packed form
3098B54k90r1j0K18l6j39J42J02j58L2q0K93l43J42K90j74j44LL5j6o2oK25l67
3122a80m8M42l9m07mJ68k6qJ48m5J24L0J68l80PK71l09O6r4M9N8J16q7L4J5k14
3148a45K37J0J1j16J86k46P5J01k11oj51M31j03j15k76L49J72k67J09K6j19J00
3170E2r7L4J62j41Q6k84L3lJ53j71K09j51L3n5N3J31L4k30j19N23j83O0p8jNj63
3196a08J56J51j42j07J96j08J12k22j6P9K8MJ02k48L79j85o4k8j78L72j99L2j29
3219a23J90k23j7M49k72J8j57j5J03k70M14j72n0L88j21j94J71N2q6J47k13NK35
3242B59l98K47k58j0L99j74n50J56K14K4R9o7r7L3J80J09k22Q6l1O9l1L09n21
3265a75K47j32k48L71k05K94j38P8J86j99l95L76j3lj10k50K59l2L9j24O2J03
$$ plain form
3287 -9 231 232 -115 -58 -105 -72 -196 217 -31 -259 -26 11 -1 -32 -92 210 116 -40 202 -23 -16 39 309 -69 -189
3312 -189 166 90 -137 29 -85 -190 -144 95 -69 7 37 211 -13 -38 302 52 239 -16 -113 179 -211 -116
3334 -116 224 20 119 259 -116 28 8 160 -94 291 -135 -5 -74 -59 -167 136 30 -170 5 -232 -9
3355 -9 57 245 -145 67 71 169 209 136 -213 -8 22 -14 157 246 100 19 98 47 -13 176 -250 -144 -13 38 -139
3380 -139 -119 143 66 -75 -257 90 140 135 54 -41 164 -65 30 142 -160 -16 -64 115 -253 298 186 105 -181
3403 -181 -18 398 -128 -61 61 63 -97 -61 -6 -8 131 37 40 21 54 -39 -50 332 -53 100 164 -59 176 115 -348
3428 -348 -113 -31 70 -35 145 59 173 -15 95 94 13 -76 4 -271 85 83 25 387 139 -187 -61 -6 -29 110
3452 110 149 -113 -199 -35 -107 279 -40 32 -78 -40 198 63 214 -5 -202 311 -197 62 -61 -132 84 -244
$$ packed form
3287iK40Jl47N7m7L3j24M13k48k28K33L7j2l1o0L02r4j56K42k25PN5K70l78j20
3312a89L55p6k27J66j14j05M6K39j64P6L0J74k24k5L40k50J87k55r7K92l90R5
3334a16L40k04R9J40l75J44k0J52k54L85m26J30o9J5j08L03j06k00J75k37K23
3355iO6J88l90K12MR8M0p3l49K05L0l6J71Q9j46q1P9n1o0J89m26J06J31N1j77
3380a39K0K62p7j41j82L47N0nq1r5K05k29R5J12l02J44m8J79l68N51j12q1k86
3403a81J63M16n26O7J22Kj60L6N5kJ39r4Lj9L3r3j1L82l85J53O4k23K35o1m63
3428c48K35Q2J01j05J80q6J14j88J10jq1q9Q0k75L56kn8L62k48l26J26N5k3J39
3452A10L9k62q6J64p2L86l19P2j10L8K38j35J51k19j97N13n08K59j23p1K16l28
$$ plain form
3474 -244 387 158 -238 -331 118 -55 -46 25 191 -50 72 313 37 -20 -146 241 -38 -11 107 -16 74 43 -162
3497 -162 -102 142 63 171 -57 -155 283 117 -221 -197 -16 -212 -105 -79 -145 29 180 77 120 -35 -278 52
3519 52 11 -129 231 120 -80 39 81 232 6 72 -196 56 241 -168 97 33 -37 102 244 400 67 -91
3541 -91 34 42 -163 98 -163 148 -99 233 -85 -198 -1 168 259 -29 8 -49 2 -305 -67 66 -169 -126 279
3564 279 50 -148 144 -142 -280 -71 -132 146 91 -82 -43 18 110 -96 -50 -47 -111 34 230 -58 -146 -54 -149 -133
3588 -133 46 -156 -21 -151 -32 121 -191 -284 127 64 39 -48 -322 166 216 -68 -236 -56 169 -79 -197 -144
3610 -144 -227 -122 51 127 -49 -18 -296 -89 1 217 -108 51 257 2 62 -11 65 25 86 -85 -136 -85 16 113
3634 113 121 199 63 -34 358 -203 38 116 -139 -50 99 -59 -66 188 55 255 10 -109 -65 121 14 106 -155
$$ packed form
3474b44O31k29l96r3M49j73RP1J66k41J22K41k76n7j26L87k79K7J18j23R0l1k05
3497a62O0K44p9J08k28r8M38j66l38K4J81j96J07K6o6J74J51j03M3j55k43L30
3519E2m1j40L60j11k00J19M2J51k26O6k68K52J85m09K65o4p0J39J42J56l33j58
3541i1J25Qk05K61k61L11k47L32l18j13J97J69R1k88L7n7N1l07K38J33k35M3M05
3564B79k29j98K92k86j38K09o1K78n5j73L9O1R2k06M6Lo4J45J96k88q8R2r5J6
3588a33J79k02J35j30J19J53l12r3M11o3k5q7k74M88N0k84j68J80K25k48j18N3
3610a44q3J05J73P6j76L1k78K07R0K16l25J59K06k55O0p3P6m0O1j71n1N1J01R7
3634A13QP8j36r7L92n61K41P8k55Q9J49j58pK54j33K00k45j19M4J86j07R2k61
$$ plain form
3657 -155 -40 33 132 -29 64 -32 295 123 -24 164 96 -144 -78 -197 -143 -217 139 -110 401 60 182 27 72
3680 72 -105 17 133 -363 -112 8 -51 -193 -2 -55 201 -62 111 -115 -150 80 -44 18 -104 181 8 -138
3702 -138 -111 268 74 -132 365 62 -136 -14 23 263 70 244 20 156 126 -17 45 -98 -108 187 34 -15
3724 -15 -71 100 109 -326 -175 283 41 65 23 259 157 93 -2 -46 162 210 246 217 -83 62 -205 -45 -5 51 75
3749 75 -189 180 199 -105 74 59 -3 94 164 82 -140 113 128 -156 -44 118 -14 0 34 81 37 -149 22 4
3773 4 115 -248 -86 -222 -5 107 48 43 -91 -65 141 196 156 -63 64 -126 29 78 133 315 216 -62 142 -46
3797 -46 -81 94 46 -43 -33 52 186 -72 -40 103 18 78 114 104 155 -35 135 -14 220 10 255 -254 186 -291
3821 -291 -61 -71 -109 -235 -126 140 57 -4 226 -76 -150 161 -242 45 -61 -90 314 -21 -251 152 -61 81
$$ packed form
3657a55J15P3R9j61R3r6L27j72j47J88o8k40O6j19N4p4L56k49N11l41J22j55M5
3680G2j77J22J16m96K51J20n9j42J91n3K56k63J73k26l5K30j24O2j22K85j73j46
3702a38K7L79j94k06M97l03j98J22L7K40j93J74k24J36l0j43O2j43j0K95j53m9
3724a5n6J71Rm35J51M58k42K4m2K36j02o4r5m4K08M8L6k9l00J45k67J60M0N6K4
3749G5k64L69J9l04J79j5o2R7P0q2k22K53J5k84J12J62j32J4L4M7m4j86J71j8
3773DJ11l63J62j36K17J12n9nj34K6K06N5m0k19J27j90J55M9N5J82r9k78K04j88
3797d6l5J75m8q9J0Q5J34k58L2J43q5O0L6j0N1j90J70j49K34k10K45n09M40m77
3821b91K30j0l8j26J09K66q3o1K30l02p4L11m03K87j06k9M04l35k30M03k13J42
$$ plain form
3843 81 41 -76 -16 194 -67 -112 -81 -117 -166 155 -120 -228 78 -123 83 -115 -124 -120 -94 -73 140 281 -158 16
3867 16 10 -71 -26 77 -52 -17 42 223 -278 -118 125 22 -66 37 -30 1 189 512 -35 -318 -92 24 162
3890 162 -70 0 92 111 166 112 50 147 0 -77 221 -17 60 293 -124 -64 -243 157 -1 91 -205 27 -103 -147
3914 -147 -26 -86 -121 31 175 64 -84 -180 -126 37 229 114 27 -58 19 119 237 177 -153 -106 284 -8 -160
3937 -160 155 -224 -132 158 83 59 -172 -107 -6 78 143 -271 161 27 94 319 -207 112 -163 -51 68 -40
3959 -40 39 114 146 -142 51 95 112 184 -134 -5 -119 -68 -69 -181 56 -89 172 -6 -26 -17 -109 -62 168 -69 -113
3984 -113 104 145 -283 99 90 25 45 87 -180 -2 -13 52 173 67 50 61 -108 206 -55 95 -239 -28 44 40
4008 40 -31 52 -62 181 -21 281 109 -257 103 172 -225 -73 97 -315 -128 24 55 129 54 -103 58 -26 152
$$ packed form
3843H1m0j17O0K10k61m5L1l6m9L21k75j08L06k01K06j98rMK6K1K13J41m39J74
3867A6oq1M5J03j29L5N9J81n01J60K43j03q8J03o7L1J88L23n47k83K26J16J38
3890A62k32P0R2J9N5n4o2R7j47p7K98k38P7K33m17O0j79M00j58R2k96K32j30m4
3914a47J21o0l5J52J44j11j48r6N4J63J92j15q7q5P7J00J18o0l30M7L90k92j52
3937a60L15l79R2K90p5k4k31O5J01Q4O5m14M32j34O7K25n26L19k75J12J19j08
3959d0P9P5L2k88J93M4J7P2l18J29j14N1jj12K37j45K61j78k0Rr2M7K30k37m4
3984a13K17M1m28L82ro5K0M2k67J78j1O5J21j06j7J1j69L14k61J50l34K11P2m
4008D0p1Q3j14K43k02L02j72l66L60O9l97J52J70m12J87J52L1P4p5j57J61q4J78
$$ plain form
4031 152 -60 -44 51 157 -328 78 107 -254 -147 -23 -82 -52 -73 150 161 -89 63 155 127 -29 110 -137 -58
4054 -58 146 108 -207 8 29 162 170 107 5 161 141 -111 -82 -81 -148 -19 -8 -39 -150 -53 -148 156 -179 240 -167
4079 -167 211 37 -31 -29 -109 -14 154 -22 -132 145 -92 -122 92 194 134 -71 64 -13 205 26 24 24 -104 -99 -145
4104 -145 71 -187 -148 -42 42 141 172 -133 -192 -5 125 -290 -116 -93 97 34 154 195 -155 -150 -216 -255 -108 -280
4128 -280 -149 41 56 -69 -144 185 170 58 80 394 298 -39 324 113 0 -80 27 219 -122 136 2 7 -113
4151 -113 -237 120 -337 15 94 45 229 298 -189 131 -61 -18 -12 -267 48 129 -49 -112 -279 -124 84 -121 -122
4174 -122 -92 -89 66 -200 -117 -73 281 25 29 -334 -51 55 -98 28 -39 -225 107 88 -251 186 334 126 70
4197 70 -20 -25 110 7 -152 105 -112 -53 -169 -242 11 -106 141 424 188 -190 73 54 -52 -42 -248 80 -116
$$ packed form
4031A52k12J6R5J06m85M06K9l61J07J24n9L0k1K23J1k50J52R2k8j56J39k47P9
4054e8K04l8l15K15K1J33Qo3j02J56k0k52K9Jo7J29J1l1j11R7r5L04l35M19m07
4079a67L78j74o8Kq0R5J68j76j10K77k37l0K14J02o0k05J35p7K18j79k%j28Nm6
4104a45K16k58L9J06Q4R9L1l05n9J87J30m15J74K3J90o3J20M1l50No6l9J47j72
4128b80J31J90J5j25p5L29j5j12K2L14r6l37L63k11j13q0J07J92l41K58j34Nj20
4151a13j24L57m57L52P9m9J84O9m87L20j92M3Ok55L15Q1j78o3j67J55K08k05j
4174a22L0LJ55k66Q3M4L54k56Ml63K83J06j53J26o7j86L32j9l39M37J48k08n6
4197G0r0nJ35j03j59K57k17N9j16p3K53j17K47K83k36l78K63j9j06J0k06L28j96
$$ plain form
4220 -116 -54 -343 -111 -79 108 -222 -203 -56 -109 -25 6 -286 234 362 18 25 176 -127 -15 156 88 -81 -188
4243 -188 2 246 -86 -42 26 -87 -64 -37 -226 45 73 207 -288 -86 17 16 -52 2 135 199 109 9 75 -337
4267 -337 74 -1 23 -118 -225 -102 -68 250 140 36 -174 23 45 -85 -144 309 -129 -121 78 0 -5 -132 -36 98
4291 98 55 106 1 -103 -287 48 -30 146 -124 -120 -17 0 47 -239 88 9 131 88 43 34 -24 -18 -75 227 18 -146
4317 -146 68 31 -296 -67 -123 -212 176 -11 -145 158 306 -47 -50 87 -96 39 -193 -84 -21 -10 167 186 17
4340 17 25 115 104 245 -98 233 -71 -46 -218 -29 106 319 34 16 52 16 -202 -201 38 -43 -96 -88 -8 263 -94
4365 -94 71 -109 -52 142 -53 11 -172 191 -90 -258 252 -221 18 207 -159 -15 140 176 -23 -103 11 27
4387 27 -191 344 -63 -19 220 26 37 -93 89 -13 308 92 165 66 -22 102 67 -10 169 244 -239 -6 -29
$$ packed form
4220a16O2k89K32L2J87l30J9J47n3Q4L1k92N20J28l44PJ51l03J12J71o8j69j07
4243a88J90K44l32M4O8j13K3K7j89K71K8J34m95K02J03jo8N4J33O4r0j00O6m12
4267c37M11p5K4j41j07J23L4L18j10j04k10J97K2j30n9M53m38QJ99p8nj27R6J34
4291I8m3N1j05j04j84L35p8J76k70MJ03J7M7k86L27p9J22m3m5rn8On7L02k09j64
4317a46K14l7l27K29n6q9L88j87j34L03J48l53lJ37j83J35k32J09O3J1J77J9j69
4340A7QR0j1J41l43L31l04K5j72J89J35K13k85j8L6l6k18JK39q1n3QQ0K71l57
4365i4J65j80N7J94j95O4j83L63k81j68N10m73K39J89l66J44J55L6j99q0J14J6
4387B7k18N35m07M4K39j94J1j30J82j02L21k16P3r9q8J24l5p7J79P5m83K33k3
$$ plain form
4410 -29 34 -220 -148 -148 156 -67 -38 15 -179 -157 -180 22 -108 -47 -81 69 -199 -34 234 212 -81 92 -83 145
4434 145 -116 74 -211 -183 -5 -250 260 70 -66 119 -23 58 -2 -296 -50 61 202 -124 51 -26 60 137
4456 137 41 -32 -78 143 -149 107 -78 -9 -4 -141 -114 -134 138 123 -94 -94 197 -28 123 22 103 -14 71 50 -70
4481 -70 7 63 125 176 -121 49 129 47 3 -170 2 92 -4 245 -67 -285 6 -131 28 -3 -104 187 171 22
4505 22 155 170 -173 -236 -16 -134 -101 -155 -351 48 10 74 81 -66 -201 0 4 -180 314 43 154 -210 -76 97
4529 97 -8 317 38 -307 -37 -184 137 310 257 -97 -104 15 -13 -178 -17 -4 7 66 -242 12 8 222 -181
4552 -181 157 96 -6 130 -137 -165 83 2 -65 -17 -230 10 -49 227 177 103 -181 14 105 15 -174 3 -25 2
4576 2 -15 -220 49 18 -48 38 167 -22 -92 -157 -57 58 -142 -49 -164 -208 154 -66 -52 -316 -134 208 17 -12
$$ packed form
4410b9O3k54P2%L04k23K9N3j94K2k3K02j30O1l4J50k68J65K68k2k93J73j75K28
4434A45k61J90k85K8J78k45N10j90j36J85j42Q1o0k94K46J11J41l26J75p7Q6P7
4456A37r6p3m6K21k92K56j85O9Nj37K7k0K72j5k17%K91k25J51j01Q1j17Q5k1j20
4481g0P7N6O2N1k97J70Q0q2m4j73J72R0r6K49l12k18K91j37J59l1j01K91j6j49
4505B2J33J5l43o3K20j18L3n4j96L99l8O4Pj47j35K01Mj84M94k71J11l64J34J73
4529I7j05L25k79l45K70j47L21J73n3l54pJ19k8j65J61J3J1N9l08K54mK14m03
4552a81L38o1j02J36k67k8K48q1o7M8k13K40n9K76n0p4k84J95R1r0j89J77k8K7
4576Bj7k05K69l1o6Q6J29j89p0o5J00J15k00R3j15m4L62k20J4k64J82L42j91k9
$$ plain form
4600 -12 -174 -178 132 9 18 249 159 -88 226 28 37 23 -45 93 100 213 -6 58 -186 336 -248 15 48 108 8
4625 8 -135 174 60 106 -4 135 -72 89 -97 -112 -102 -118 -165 -120 -72 -44 137 306 96 -177 -137 -271 171 -77
4649 -77 162 -99 -229 -52 -75 -265 -17 1 40 -82 -87 44 -252 -31 19 22 -237 54 -40 -159 51 85 -77 -8
4673 -8 128 63 43 -149 -311 71 -383 -101 234 -430 118 91 -100 89 2 -159 -10 94 -17 116 -265 -55
4695 -55 55 -116 -73 -146 22 -160 12 -19 26 -88 79 -162 -172 90 12 -120 59 77 -76 -103 -226 61 -320
4718 -320 22 -166 -48 89 61 -76 -21 22 -265 -52 -23 58 -246 -127 -177 -335 19 -73 -397 -288 -93 113
4740 113 -124 81 19 256 218 -97 -380 -80 -41 119 2 -2 306 -140 92 -288 -25 330 -8 -28 42 -247
4762 -247 -24 260 -5 301 -134 127 105 159 135 256 -344 -126 89 34 -191 73 65 147 196 3 -179 15 129
$$ packed form
4600a2j62mL10j23RK31r0k47L14j98Rj4o8J38PJ13k19O4k44N22n84K63L3O0j00
4625Hj43L09j14M6j10J39k07J61j86j5J0j6m7M5M8K8J81J69k10k73M0j34M42k48
4649g7K39k61j30J77k3j90K48J8L9j22nJ31k96K21N0Lk59K91r4j19K10L4j62O9
4673hJ36o5k0j92j62L82m54K82L35o64N48k7j91J89q7j61J49J04j11J33l81K10
4695e5J10j71M3p3J68j82J72l1M5j14J67k41j0K62p8j32J79J8j53k7j23K87l81
4718c20L42j88J18J37k8j37N5M3k87K13K9Q1l04J19n0j58L54r2l24J09J95K06
4740A13k37K05o2K37l8l15k83L00L9J60j17mL08m46K32l80K63L55l38k0P0k89
4762b47K23K84k65L06m35K61k2N4k4J21o00K18K15n5k25K64qQ2M9j93j82J94J14
$$ plain form
4785 129 -20 -48 -144 15 -194 97 264 149 265 71 83 83 193 -50 40 101 -93 -191 -57 185 31 -68 25
4808 25 167 122 304 14 78 1 49 123 -24 39 -111 160 67 -53 -51 -40 -10 -17 100 190 -140 -74 -79 -107 -127 90 -12
4835 -12 73 27 254 238 -91 64 -31 155 -137 -23 -14 -8 213 156 33 -13 334 65 -56 121 -151 56 -245 -49
4859 -49 20 -49 29 -121 93 155 -176 84 -105 320 47 -119 -119 -136 -58 99 68 108 165 31 20 -16 33 -123 -157
4884 -157 -9 240 -109 81 -84 -28 76 30 -119 86 131 -108 275 2 24 177 -41 11 -153 203 -22 126
4906 126 189 20 -109 7 32 184 33 22 75 -212 -151 8 -162 -50 326 -16 -110 203 148 -88 -2 -182 142
4929 142 -166 -131 -54 -32 -40 -30 207 10 112 71 123 -70 128 -123 131 70 -193 -123 -67 6 83 -155 -259 -111
4953 -111 121 -20 -85 35 200 -54 229 135 -161 -109 -1 0 70 100 61 88 -119 111 -141 -56 -108 102 -128 -78
$$ packed form
4785A29j49k8r6J59k09K91J67j15J16j94J2%J10k43R0O1j94r8J34K42j54r9R3
4808B5J42m5J82k90O4p7M8P4j47O3j50K71r3j20KJ1L0pJ17R0l30O6nk8k0K17j02
4835a2Q5m6K27j6l29J55r5J86k92J14ROK21n7j23m6L47k69j21J77k72K07l01J96
4859d9O9o9P8j50K14O2l31K60j89M25k73j66%j7P8J57l1M0N7j34j1l6M9j56l4
4884a57J48K49l49J90j65N6J04m6j49K05M5k39L83k73K2J53k18N2j64L56k25J48
4906A26O3j69j29J16K5J52j51j1N3k87O1J59j70J12L76l42r4L13n5k36Q6j80L24
4929A42l08L5P7K2qJ0K37j97J02m1N2j93J98k51K54o1k63P0N6P3P7k38j04J48
4953a11K32j41o5J20J65k54K83r4k96N2J08JP0L0l9K7k07K30k52Q5n2K10k30N0
$$ plain form
4977 -78 -296 94 -41 -146 -190 -8 30 -257 42 190 -29 -145 -12 -217 192 123 128 134 53 48 123 74 159 15 209
5002 209 -224 33 -33 -23 6 -137 218 -44 -32 35 -198 -47 99 -78 -31 -231 21 -299 -163 -248 241 -18
5024 -18 -218 79 -11 40 227 -151 -137 -54 100 36 109 -82 -129 -284 -210 23 -225 92 -164 282 -132 -180 -1
5047 -1 -188 56 -77 -15 143 29 152 144 200 -118 6 109 112 97 -76 -51 33 -157 158 28 151 46 15 -218
5071 -218 -85 244 -24 90 -21 -138 60 -14 -119 -18 -87 -21 124 277 -46 137 45 -101 -8 -174 -196 17
5093 17 -113 72 -96 229 159 136 67 -124 70 229 87 -285 40 -42 -7 29 -10 37 -172 -4 -199 220 58
5116 58 103 -98 -82 -73 -72 -30 -146 103 -158 9 -8 51 -55 137 169 -128 -53 114 -126 64 128 -66 226 17
5140 17 158 -25 -262 0 113 -22 -43 115 318 -48 -40 74 90 -11 220 -28 -48 100 191 51 105 -96 -171
$$ packed form
4977g8k18L90j35j05m4J82L8k87K99J48k19j16J33k05M09o9NOq1nP5m9Q5j44J94
5002B09m33K57o6J0K9j43L55k62J2O7k33J51J46j77M7k00K52l20J36q5M89k59
5024a8k00K97r0N1J87l78J4Q3J54o4P3j91m7j55P4K33k48L17k56M46m14m8J79
5047aj87K44j33O2J58j14J23qN6l18J24J03Lj5j73K5Q4j90L15j30J23j05l1k33
5071b18J33L29k68J14j11j17J98p4j05J01o9O6J45J53l23J83r2j46R3j66k2K13
5093A7j30J85j68L25p0k3o9j91J94J59j42l72L25q2L5L6l9M7k09J68j95M19j62
5116E8M5k01J6RJM2j16K49k61J67j7N9j06J92L2k97P5J67k40J90O4j94K92k09
5140A7J41j83k37K62J13j35k1J58K03l66QJ14J6j01K31k48k0J48R1j40N4k01p5
$$ plain form
5163 -171 -94 -96 -65 57 182 -142 -74 30 73 -7 -65 106 -206 64 241 4 80 -165 -24 -209 -36 -322 19
5186 19 -165 -239 -107 -27 13 -126 158 180 -89 74 314 99 69 -10 -17 -31 84 -24 -7 119 -25 101 -119 -38
5210 -38 5 -109 -129 96 -130 -227 169 -259 162 33 86 50 -179 201 -120 -126 187 -217 189 104 -246 194 135
5233 135 -36 -169 75 202 41 -182 -94 -105 174 184 89 209 -88 -170 -35 101 167 -285 15 -364 1 20
5255 20 -17 60 17 21 -163 -276 38 75 80 63 -41 -12 31 -84 22 25 -143 -57 112 158 -88 106 -66 -97 183 -60
5281 -60 81 -62 -86 187 56 -129 -99 118 206 -91 -65 -221 16 120 58 152 236 -177 117 -66 -215 -80 -118
5304 -118 266 204 -265 -121 -12 -257 -145 -202 65 112 -39 174 134 99 35 -188 105 -40 -110 123 -97 -55 -1
5327 -1 -125 33 135 -328 -15 12 214 -95 -177 -42 -97 -18 -45 -66 -144 54 33 183 19 48 -79 9 -89 -152 -21
$$ packed form
5163a71P7kL1J22J25l24O8J04M3q0n8J71l12K70J77k37P6k45J41j85J73k86L41
5186A9j84p4J32Q0M0j39K84K2k69J63K40k15l0p9pj4J15j08J7J26j44J26k20Q1
5210c8M3j14k0K25k26r7L96m28M21j29N3l6k29L80l21oL13m04M06q5l50M40n9
5233A35j71j33K44J27j61k23Q8j1K79J0r5J20k97q2J35J36O6m52L00l79L65J9
5255B0l7P7m3Mj84j13L14L7Nj7j04K9M3j15J06Lj68Q6J69M6k46J94j72l1K80k43
5281f0J41j43k4K73j31j85L0K17Q8k97K6j56K37J04o2R4Q4m13K94j83j49J35l8
5304a18L84o2m69J44J09k45J12n7K67M7j51K13m0l5o4k23K93j45p0K33k20M2N4
5327aj24J58J02m63L13K7K02l09q2J35n5P9k7k1p8J98k1J50j64K9j27Q8r8o3J31
$$ plain form
5352 -21 94 3 192 82 125 165 140 161 158 173 125 -251 69 17 37 -65 21 30 -184 51 -164 -112 3 43 -252 -9
5378 -9 -62 -105 3 -5 -20 115 150 19 227 55 -66 -66 302 -192 -183 162 -92 119 196 47 154 27 -63 369 -124
5403 -124 312 -50 191 -75 -36 -52 26 -44 31 -142 25 75 53 83 -42 93 14 162 31 -151 -12 -73 26 -37
5427 -37 -220 -120 173 94 -38 214 141 -64 370 16 30 -232 223 -212 50 140 -183 290 113 -4 -72 -48
5449 -48 89 -154 -151 -224 -22 11 61 -44 24 -30 36 -190 -16 -119 -275 148 68 60 -72 -18 136 -72 -115 -210 -115
5474 -115 120 107 -179 -86 98 138 -110 -94 -92 -183 -73 -135 72 50 -63 75 164 -75 -93 462 -138 -131 169 -4
5498 -4 -59 162 95 -408 49 -69 361 -59 -5 -91 82 44 74 3 -70 -26 -91 162 -85 48 -33 95 47 109 83
5523 83 113 47 121 198 -38 -47 0 -69 161 -80 -187 -175 -128 -388 -81 237 148 208 -117 -199 -84 -210 3 -13 77
$$ packed form
5352b1J15r1J89j10M3M0k5K1lJ5m8l76L20n2K0j02Q6Rk14K35k15N2J15M0k95K43
5378in3m3J08qj5J35L5j31K08j72j21%L68m94RL45k54K11P7j49J07j27r0M32m93
5403a24M36l62K41k66L9j6P8p0P5j73J67N0k2L0j25J35p9J48j31j82J39o1R9o3
5427c7j83J00K93p9j32K52p3k05M34l54J4k62M55m35K62R0l23M73j77j17o8K4
5449d8J37k43Lp3K02L3N0j05O8n4O6k26J74j03j56M23q0qj32N4J54k08m3r5R5
5474a15K35j3k86R3J84M0k48J6Kr1J10o2K07k2j13J38Q9k39j8N55o00PL00j73
5498dn5K21o7n03M57j18M30m20N4q6J73l8L0p1p3M4o5K53k47J33q1J28m8O2k6
5523H3L0o6P4P7k36rM7o9K30k41j07J2M7k60L07L18q9O0l25q2J15j26K13j6R0
$$ plain form
5548 77 -311 52 83 133 -134 -23 -150 -274 -37 109 78 55 -64 115 -114 20 -111 -14 39 -125 -24 147
5570 147 390 2 146 116 60 51 233 -49 282 101 -81 -210 -126 81 119 273 -172 -211 4 7 -86 -134 -73 -124
5594 -124 69 -56 81 13 65 184 -80 133 119 309 42 261 -111 -141 187 136 -155 -120 -58 -35 -40 -29 42 -187
5618 -187 -36 -220 35 68 -241 -113 165 -188 -28 -209 35 -102 82 133 -175 -44 85 -256 19 358 -67
5639 -67 14 -34 -211 -119 -114 -20 -338 139 -224 -14 -71 -87 -185 34 134 -2 -259 -87 -20 -19 81 -196 -58 213
5663 213 125 -134 -216 -219 97 -35 -191 176 -53 -41 -76 -25 -290 -280 139 -198 -74 -258 -8 -27 -87 -19 74 130
5687 130 -89 -30 -60 -2 145 7 -11 80 -299 200 -248 51 -51 220 -91 -83 125 223 -84 -171 -98 -172 -95 -65
5711 -65 53 -183 53 -22 204 -123 178 43 -96 29 37 -107 -207 -229 28 66 -57 -273 -120 169 152 -298
$$ packed form
5548G7l88L63L1N0k67J11j27j24K37J46l1k3j19J79k29J34j31R7N3j64J01J71
5570A47K43l88J44l0n6rJ82k82L31j81j82j29Q4K07L8J54m45l9K15Lr3m8O1n1
5594a24J93j25J37o8N2J19k64K13j4J90k67K19l72l0L28n1k91L5O2K3nJ1P1k29
5618a87J51j84K55L3l09J28K78l53J60j81K44j37J84N1l08J31J29l41K75L39m25
5639f7Q1m8j77R2NR4l18M77l63K10n7j6r8K19J00j36k57J72O7JJ00k77J38K71
5663B13q8k59q2lL16j32j56L67k29J2l5N1k65J0M19l37J24j84K50j9o0O8R3N6
5687A30k19N9l0N8J47j38j8R1l79M99m48K99j02K71l11QK08R8l07q7P3p4P7L0
5711f5J18k36K36p5K26l27L01j35j39J25Qj44j00k2K57L8j23k16J53K89j7m50
$$ plain form
5733 -298 -136 -97 10 -100 -49 40 -100 181 -54 101 111 -236 53 137 127 -243 -22 -7 -40 267 32 143 -240
5756 -240 -87 -353 -131 55 -97 54 45 23 125 17 99 52 -69 158 130 75 -322 85 51 -37 134 -20 159
5779 159 -333 -205 119 -1 -154 91 -64 -241 -211 0 -141 -178 -115 251 -88 -140 -207 14 249 116 -2 -32
5801 -32 -62 -238 -42 167 159 -187 -50 -82 -112 -114 27 -169 320 -167 24 125 51 116 103 -3 -200 -113 -165 46
5825 46 133 -23 -178 -149 44 68 86 317 -9 27 -19 -83 -86 149 116 -38 -245 49 191 241 -100 78 163 142 150
5850 150 132 112 151 -150 163 -160 13 -7 -120 11 -315 -366 -155 152 259 -28 38 5 53 -130 87 -140 -12
5873 -12 -184 -74 -177 338 -34 -109 -163 24 77 -55 -46 -17 156 -112 -16 -120 149 45 76 191 -39 -48 -24 1
5897 1 -321 -93 122 144 -70 270 -2 -263 189 142 -16 113 12 267 205 49 -108 -412 -166 -20 -64 -205
$$ packed form
5733b98J62L9J07j10N1Q9j40K81k35J55J0l47K89Q4j0l70K21J5l3L07k35J11l83
5756b40J53k66K22J86j52J51rk2J02j08Q2m7j21K27k8n5l97M07l4q8J71j54J79
5779A59m92J28L24j20j53K45j55j77L0K11j41l7O3L66l39n2o7K21K35j33j18l0
5801c2l0j76J96K09ql46J37l2l0kJ41j96M89m87J91J01p4O5j3j06j97Q7n2K11
5825D6Q7j56j55K9J93K4J8K31l26L6m6o4lK35l3j54k07K94J42N0l41J78Q5k1Q
5850A50j8k0L9l01L13l23J73k0j13J31l26n1K11L07J07k87O6l3M8j83K17k27J28
5873a2j72J10j03N15l72p5n4J87N3j32RK9J73k68R6j04K69j04L1J15k30rK4K5
5897Al22K28K15K2k14L40k72k61M52m7j58J29j01K55o2j56j57l04K46J46m4j41
$$ plain form
5919 -205 -285 132 62 16 -64 -161 -4 159 -268 206 -102 -368 102 -118 280 -37 78 -201 -124 19 420 145
5941 145 55 -42 31 70 106 246 -73 -110 53 94 -19 13 130 -4 -48 116 117 -143 -50 -129 212 -233 -54 -5 -145
5966 -145 18 -48 99 -44 37 -7 -33 -80 134 197 -63 -46 -37 171 275 -5 174 136 -14 -3 -12 -135 -21 -124
$$ packed form
5919b05q0M17p0m6q0r7J57J63m27M74l08k66M70k20L98l17J15k79P7J43M01k75
5941A45r0r7P3L9L6J40l19l7J63M1j13L2J17j34m4J64Jk60R3p9L41m45J79M9j40
5966a45J63o6J47j43Q1m4k6m7K14O3k60J7RK08J04k80J79l8j50J1rj23J14j03
$$ [...]
8191D08
##END NTUPLES=NMR FID
##END=
