##TITLE=1H_LY-DMAA.Per.3.8
 CDCl3
 8 sc, 
 11.02.2022
##JCAMPDX= 6.0         $$ Bruker NMR JCAMP-DX V2.0
##DATA TYPE= NMR FID
##DATA CLASS= NTUPLES
##ORIGIN= UXNMR, Bruker Analytische Messtechnik GmbH
##OWNER= root
$$ XWIN-NMR		Version 3.5
$$ Fri Feb 11 10:25:29 2022 Russian Standard Time (UT+4h)  she@DPX200
##.OBSERVE FREQUENCY= 200.131346
##.OBSERVE NUCLEUS= ^1H
##.DELAY= (6, 6)
##.ACQUISITION MODE= SIMULTANEOUS
##.ACQUISITION SCHEME= undefined
##.AVERAGES= 8
##.DIGITISER RES= 18
##SPECTROMETER/DATA SYSTEM= spect
##.PULSE SEQUENCE= zg30
##.SOLVENT NAME= CDCl3
##.SHIFT REFERENCE= (INTERNAL, CDCl3, 0, 15.7039)
##AUDIT TRAIL= $$ (NUMBER, WHEN, WHO, WHERE, WHAT)
$$ ##TITLE= Audit trail, XWIN-NMR		Version 3.5
$$ ##JCAMPDX= 5.01
$$ ##ORIGIN= Bruker BioSpin GmbH
$$ ##OWNER= she
$$ F:/spectra/data/she/nmr/H-F/1/audita.txt
$$ ##AUDIT TRAIL=  $$ (NUMBER, WHEN, WHO, WHERE, WHAT)
(   1,<2022-02-11 10:23:39.98 +0400>,<she>,<DPX200>,
      <created by zg, POWCHK disabled, PULCHK disabled
       configuration hash MD5:
       00 E9 B6 7A A2 85 ED C7 34 08 36 98 17 FE 4E 26
       data hash MD5: 16K
       5A 05 98 05 A5 45 BD AB 15 34 A4 0D 4E D2 53 1A>)
$$ ##END=
$$ 
$$ hash MD5
$$ 5F 2F 4E D8 C8 F5 31 B5 E7 44 4A 04 C2 A7 60 34
##$RELAX= 
##$RELAX= 
##$RELAX= 
##$RELAX= 
##$RELAX= 
##$RELAX= 
$$ Bruker specific parameters
$$ --------------------------
##$DU= <F:/spectra>
##$EXPNO= 1
##$NAME= <H-F>
##$PROCNO= 1
##$TYPE= <nmr>
##$USER= <she>
##$AMP= (0..31)
100 100 100 100 100 100 100 100 100 100 100 100 100 100 100 100 100 100 
100 100 100 100 100 100 100 100 100 100 100 100 100 100 
##$AQSEQ= 0
##$AQ_mod= 1
##$AUNM= <au_zg>
##$AUTOPOS= <>
##$BF1= 200.13
##$BF2= 200.13
##$BF3= 200.13
##$BF4= 200.13
##$BF5= 200.13
##$BF6= 200.13
##$BF7= 200.13
##$BF8= 200.13
##$BYTORDA= 1
##$CFDGTYP= 0
##$CFRGTYP= 5
##$CHEMSTR= <none>
##$CNST= (0..31)
1 1 145 1 1 1 1 1 1 1 1 1 1 1 1 1 1 1 1 1 1 1 1 1 1 1 1 1 1 1 1 1 
##$CPDPRG= <>
##$CPDPRG1= <>
##$CPDPRG2= <>
##$CPDPRG3= <>
##$CPDPRG4= <mlev>
##$CPDPRG5= <mlev>
##$CPDPRG6= <mlev>
##$CPDPRG7= <mlev>
##$CPDPRG8= <mlev>
##$CPDPRGB= <>
##$CPDPRGT= <>
##$D= (0..31)
0 1.2 0 0 0 0 0 0 0 0.06 0 0.03 0 0 0 0 0.0002 0 0 0 0 0 0 0 0 0 0 0 0 
0 0 0 
##$DATE= 1644560619
##$DBL= (0..7)
120 120 120 120 120 120 120 120 
##$DBP= (0..7)
150 150 150 150 150 150 150 150 
##$DBP07= 0
##$DBPNAM0= <>
##$DBPNAM1= <>
##$DBPNAM2= <>
##$DBPNAM3= <>
##$DBPNAM4= <>
##$DBPNAM5= <>
##$DBPNAM6= <>
##$DBPNAM7= <>
##$DBPOAL= (0..7)
0.5 0.5 0.5 0.5 0.5 0.5 0.5 0.5 
##$DBPOFFS= (0..7)
0 0 0 0 0 0 0 0 
##$DE= 6
##$DECBNUC= <off>
##$DECIM= 32
##$DECNUC= <off>
##$DECSTAT= 4
##$DIGMOD= 1
##$DIGTYP= 9
##$DL= (0..7)
0 120 120 120 120 120 120 120 
##$DP= (0..7)
150 150 150 150 150 150 150 150 
##$DP07= 0
##$DPNAME0= <>
##$DPNAME1= <>
##$DPNAME2= <>
##$DPNAME3= <>
##$DPNAME4= <>
##$DPNAME5= <>
##$DPNAME6= <>
##$DPNAME7= <>
##$DPOAL= (0..7)
0.5 0.5 0.5 0.5 0.5 0.5 0.5 0.5 
##$DPOFFS= (0..7)
0 0 0 0 0 0 0 0 
##$DQDMODE= 0
##$DR= 18
##$DS= 0
##$DSLIST= <SSSSSSSSSSSSSSS>
$$ [...]
##$SUBNAM2= <"">
##$SUBNAM3= <"">
##$SUBNAM4= <"">
##$SUBNAM5= <"">
##$SUBNAM6= <"">
##$SUBNAM7= <"">
##$SUBNAM8= <"">
##$SUBNAM9= <"">
##$SW= 18.0517287032376
##$SWIBOX= (0..15)
0 0 2 0 0 0 0 0 0 0 0 0 0 0 0 0 
##$SW_h= 3612.71676300578
##$TD= 16384
##$TD0= 1
##$TE= 0
##$TE2= 300
##$TE3= 300
##$TEG= 300
##$TL= (0..7)
0 120 120 120 120 120 120 120 
##$TP= (0..7)
150 150 150 150 150 150 150 150 
##$TP07= 0
##$TPNAME0= <>
##$TPNAME1= <>
##$TPNAME2= <>
##$TPNAME3= <>
##$TPNAME4= <>
##$TPNAME5= <>
##$TPNAME6= <>
##$TPNAME7= <>
##$TPOAL= (0..7)
0.5 0.5 0.5 0.5 0.5 0.5 0.5 0.5 
##$TPOFFS= (0..7)
0 0 0 0 0 0 0 0 
##$TUNHIN= 0
##$TUNHOUT= 0
##$TUNXOUT= 0
##$USERA1= <user>
##$USERA2= <user>
##$USERA3= <user>
##$USERA4= <user>
##$USERA5= <user>
##$V9= 5
##$VALIST= <valist>
##$VCLIST= <CCCCCCCCCCCCCCC>
##$VD= 0
##$VDLIST= <DDDDDDDDDDDDDDD>
##$VPLIST= <PPPPPPPPPPPPPPP>
##$VTLIST= <TTTTTTTTTTTTTTT>
##$WBST= 1024
##$WBSW= 4
##$XGAIN= (0..3)
0 0 0 0 
##$XL= 0
##$YL= 0
##$YMAX_a= 79137
##$YMIN_a= -76260
##$ZGOPTNS= <>
##$ZL1= 120
##$ZL2= 120
##$ZL3= 120
##$ZL4= 120
##$ABSF1= 10
##$ABSF2= 0
##$ABSG= 5
##$ABSL= 3
##$ALPHA= 0
##$AQORDER= 0
##$ASSFAC= 0
##$ASSFACI= 0
##$ASSFACX= 0
##$ASSWID= 0
##$AUNMP= <proc_1d>
##$AZFE= 0.1
##$AZFW= 0.1
##$BCFW= 1
##$BC_mod= 2
##$BYTORDP= 1
##$COROFFS= 0
##$CY= 11.3945322036743
##$DATMOD= 1
##$DC= 2
##$DFILT= <>
##$DTYPP= 0
##$F1P= 2.36226072786647
##$F2P= -0.459571619588291
##$FCOR= 0.5
##$FTSIZE= 0
##$FT_mod= 4
##$GAMMA= 1
##$GB= 0.15
##$INTBC= 1
##$INTSCL= 1
##$ISEN= 128
##$LB= 0.24
##$LEV0= 0
##$LPBIN= 0
##$MAXI= 10000
##$MC2= 0
##$MEAN= 0
##$ME_mod= 0
##$MI= 1.114404
##$NCOEF= 0
##$NC_proc= 0
##$NLEV= 6
##$NOISF1= 3.799351
##$NOISF2= 2.8
##$NSP= 1
##$NTH_PI= 0
##$NZP= 0
##$OFFSET= 15.70392
##$PC= 1
##$PHC0= -16314.63
##$PHC1= 17.80078
##$PH_mod= 1
##$PKNL= yes
##$PPARMOD= 0
##$PSCAL= 0
##$PSIGN= 0
##$REVERSE= no
##$SF= 200.130013532006
##$SI= 16384
##$SIGF1= 3
##$SIGF2= 2
##$SINO= 400
##$SIOLD= 16384
##$SREGLST= <1H.CDCl3>
##$SSB= 0
##$STSI= 0
##$STSR= 0
##$SW_p= 3612.71676300578
##$SYMM= 0
##$S_DEV= 0
##$TDeff= 0
##$TDoff= 0
##$TI= <>
##$TILT= no
##$TM1= 0
##$TM2= 0
##$TOPLEV= 0
##$USERP1= <user>
##$USERP2= <user>
##$USERP3= <user>
##$USERP4= <user>
##$USERP5= <user>
##$WDW= 1
##$XDIM= 8192
##$YMAX_p= 0
##$YMIN_p= 0
$$ End of Bruker specific parameters
$$ ---------------------------------
##NTUPLES= NMR FID
##VAR_NAME=  TIME,          FID/REAL,        FID/IMAG
##SYMBOL=    X,             R,               I
##VAR_TYPE=  INDEPENDENT,   DEPENDENT,       DEPENDENT
##VAR_FORM=  AFFN,          ASDF,            ASDF
##VAR_DIM=   8192,          8192,            8192
##UNITS=     SECONDS,       ARBITRARY UNITS, ARBITRARY UNITS
##FACTOR=    0.0002768,     1,               1
##FIRST=     0,             0,               0
##LAST=      2.2672688,     0,               0
##MIN=       0,             -76260,          0
##MAX=       2.2672688,     79137,           0
$$ Real data points
##PAGE= N=1
##DATA TABLE= (X++(R..R)), XYDATA
$$ [...]
692D647m13n230k866J004O163L161r119o774J1352R595j2593j1356J2678J1973
706A2222j1526j1454R203R954n966p669K037M918K152k010o181q30R705L217j2335
721d563n050J3830O161j4007o528J2881O205j0514n351P182M144l187k806j051
735b654J505N130l86q611m05J1175Q69j2602r81J2701Q35j1559n05R264J61o198
751b261J11K684k59R72J61m259J58O836o67q472J311R093k015q616K654P197l151
768A477n113L436K557l412J30L037k607k306M513J298n676p7N946j191n408K444
784i52M085l505k153M282p0m710K368M671m285m235N646L473o260k431N987J256
800C167m873l6K971j113n49K061k148k745M742L074o877l184Q344L029q921k683
$$ plain form
692 4647 4234 -996 -3862 -2858 3305 6466 -2653 -9427 1925 11520 -1073 -12429 249 12222
706 12222 696 -10758 -1555 8399 2433 -5236 -3199 1719 3871 1861 -4320 -5150 4555 7772 -4563
721 -4563 -9613 4217 10378 -3629 -10157 2724 8929 -1585 -6936 246 4390 1203 -1603 -2654
735 -2654 -1149 3981 3595 -5016 -5421 5754 6623 -5979 -6960 5741 6576 -4983 -5488 3776 3937 -2261
751 -2261 -2150 534 275 1247 1408 -2851 -2693 4143 3476 -4996 -3685 5408 3393 -5223 -2569 4628 1477
768 1477 -3636 -200 2357 -1055 -925 2112 -495 -2801 1712 3010 -2666 -2743 3203 2012 -3396 -952
784 -952 3133 -372 -2525 1757 1687 -3023 -655 4016 -269 -4504 1142 4615 -1645 -4076 1911 3167
800 3167 -1706 -1742 1229 116 -433 1628 -520 -3265 1477 4551 -2326 -5510 2834 5863 -3058 -5741
816e741Q507K227p092j744M868J328k035r20j177O38M364m38p143K86R284j61
832E051j0541oJ0765K54r921o19Q066J108n432j710K228K366J237l073m522L627
848a122P366l995r500M105J0678l838j0803L152R916k074q084O72N574R72k634
863C85k671m87M300L360n619n761O522P475o899q385O641Q430n767p655M315O233
879D417k412m351K44K193K031j5m160j930N932L475p198m505P808M955p682m868
895f066O856M259n365l332L421K112j113q69j267k65L479J170n280j723O493J921
911D431p037j764O861J336o003o90M588k3k748O88P38j228J260J487k969j452
927b525M190J149m879n84M921j45m413R51L396j746k047K384N29k801R68K932
$$ plain form
816 -5741 2766 4993 -2099 -3843 1025 2353 318 -602 -1779 -1141 3223 2785 -4358 -4072 5212 5051
832 5051 -5490 -5496 5269 5523 -4398 -5017 3049 4157 -1275 -2985 -757 1609 2846 -227 -4749 -1122
848 -1122 6244 2249 -7251 -3146 7532 3694 -7109 -3957 5959 3885 -4199 -3527 2047 3019 385
863 385 -2286 -2773 1527 4887 -732 -6493 29 7504 605 -7780 -1139 7291 1524 -6131 -1816 4417
879 4417 2005 -2346 -2102 91 2122 2107 -2053 -3983 1949 5424 -1774 -6279 1529 6484 -1198 -6066
895 -6066 790 5049 -316 -3648 -227 1885 772 -97 -1364 -1629 1850 3020 -2260 -3983 2510 4431
911 4431 -2606 -4370 2491 3827 -2176 -2866 1722 1699 -1049 -361 377 -851 409 1896 -1073 -2525
927 -2525 1665 2814 -2065 -2649 2272 2127 -2286 -1335 2061 315 -1732 652 1181 -1620 -652 2280
943B280k227k714L088K214l476j429L343M77k696N80J649j604l04K506j165l158
959b636K508L529l567l581M173L315m260k769L769J968k739j047J264O8M96Q40
975A331k289j628L935K215n198k563N914K728o033k663N512K417m345k086K707
990d6J624o63j171j507P11L582k71n331j00O561M29p198p12P114R95o357j243
1007c583M955J522l076j744Q44J974J443k129l601K231N337k219o522K058P064
1022D554j741o912J248O088n89m728k11K947J064r14j920j094K696K891l294m259
1038d174L626N145l670n484L423N263k837m569K003L472r40k100k78O43J474P60
1054A757k596j936L470K787m043l261M242L330m073l025L506K396k609j566J492
$$ plain form
943 2280 53 -2661 427 2641 -835 -2264 1079 1556 -1140 -560 1089 -515 -819 1687 522 -2636
959 -2636 -128 3401 -166 -3747 426 3741 -519 -3288 481 2449 -290 -1337 -73 -5 491 1331
975 1331 -958 -2586 1349 3564 -1634 -4197 1717 4445 -1588 -4251 1261 3678 -667 -2753 -46
990 -46 1578 915 -256 -1763 -1052 2530 2259 -3072 -3172 3389 3818 -3380 -4092 3022 4017 -2340 -3583
1007 -3583 1372 2894 -182 -1926 -1082 892 2335 206 -3395 -1164 4173 1954 -4568 -2510 4554
1022 4554 2813 -4099 -2851 3237 2648 -2080 -2291 656 1720 806 -1114 -2208 488 3379 85 -4174
1038 -4174 -548 4597 927 -4557 -1134 4129 1292 -3277 -1274 2198 1258 -842 -1120 -477 997 1757
1054 1757 -839 -2775 695 3482 -561 -3822 420 3750 -323 -3348 158 2554 -55 -1621 -129
1069a29O34k15K72j024j028K146J536k983j777L531J696l660j362L422Q10k846
1085i77j29J981n63r65J157r9j595J095J767j867j692K358J355k528q29K357J55
1102I81j878N87J184j304l54J908n05k294J245K475j796k407K088K067k043j509
1118a555J699P91j073K1K30q25O96J558j618k119K352K507k875k627L040K532
1134B734k846k181K262J682j383j050K63L72R43K97k131q90L136J380l869j698
1150b979M184J877m093j898L556J801k628j625J423J360k6j050j400P30K735m08
1166A559l789J00M494J98m777m47M573O94l930r21K908J110j623j270J65J394
1182D38J266j463k567J468L558j406m166J227M366r66m128O32L483k00k527k70
$$ plain form
1069 -129 505 290 562 -462 -1490 656 2192 -791 -2568 963 2659 -1001 -2363 1059 1869 -977
1085 -977 -1106 875 312 -653 504 405 -1190 -95 1672 -195 -1887 471 1826 -702 -1531 826 981
1102 981 -897 -310 874 -430 -784 1124 619 -1675 -430 2045 249 -2158 -70 1997 -46 -1555
1118 -1555 144 935 -138 -117 113 -712 -16 1542 -76 -2195 157 2664 -211 -2838 202 2734
1134 2734 -112 -2293 -31 1651 268 -782 -519 -147 796 1093 -1038 -1928 1208 2588 -1281 -2979
1150 -2979 1205 3082 -1011 -2909 647 2448 -180 -1805 -382 978 952 -98 -1498 -768 1967 1559
1166 1559 -2230 -2130 2364 2562 -2215 -2662 1911 2605 -1325 -2246 662 1772 149 -1121 -956 438
1182 438 1704 241 -2326 -858 2700 1294 -2872 -1645 2721 1755 -2373 -1741 1742 1542 -985 -1255
1198a255J376P72j22j259j055J680K068j985k792K144L189k137l234J923K961
1213B274j548k410J016J644l81p73l17j02R80Q75j559j487J994J868k246j992
1229b164K285J861k102j516J724R99j179l91N43k00J06P70p63j131J280J321j638
1246a95j315J804J090j777p00J547J98j140L35O37q37r7J259m40j503Q79J568
1263A313j173j433J277J126j193o71R27J19n39M46P2j009M29J478q88j803J224
1280b98J953j399j884J371J645j135j248P39P16j95j16m04m80J022J036j571j466
1297a714J950J764k133j887K081J848j801j636J267J286n81q63k27L83J059P8
1313H74j807n24K402Q85k789j136K894J289k691j345K239J319j540j200O76J021
$$ plain form
1198 -1255 121 893 771 -488 -1543 137 2205 220 -2572 -428 2761 624 -2610 -687 2274
1213 2274 726 -1684 -668 976 595 -178 -495 -597 383 1258 -301 -1788 206 2074 -172 -2164
1229 -2164 121 1982 -120 -1636 88 1087 -92 -483 60 -140 -34 736 -27 -1158 122 1443 -195
1246 -195 -1510 294 1384 -393 -1093 454 652 -488 -153 484 -353 -450 809 369 -1134 -255 1313
1263 1313 140 -1293 -16 1110 -83 -754 173 292 -247 199 271 -738 -309 1169 281 -1522 -298
1280 -298 1655 256 -1628 -257 1388 253 -995 -256 460 265 149 -255 -735 287 1323 -248 -1714
1297 -1714 236 2000 -133 -2020 61 1909 108 -1528 -261 1025 444 -419 -646 -263 796 874
1313 874 -933 -1457 945 1830 -959 -2095 799 2088 -603 -1948 291 1610 70 -1130 -454 567
1329E67K78p96j211N67K022l05k647N7L005J59l068l73K843N32k325o86J588Q02
1347A009p18q73k18R08J101r19j831Q79K363p83k672O89K663n18k394K92J913
1364H91k5j274k45N14N51K29q21q93J020J477j188j813J229J957j180j883J037
1381d17J591p78j167M61O44r0r3k87m41O27Q69r12j144J085J273j173j210J125
1399c7R97r84o71P45K54m35J72J05n77K38Q75n19j058P57J077q48r50Q59O84p42
1419e8l31N35p8k70M86Mq75K97J146n44j295O96J285p32j169O62Q81m75n12K04
1439a43P3J13L80m40q00P42J141r68j361J061J491j040j429Q80J252o10r30K22
1457c66N55K14j24o72l08J087P06j411j021J598J227j631j325J483J307j174j190
$$ plain form
1329 567 845 49 -1162 -595 1427 1122 -1525 -1468 1537 1696 -1372 -1745 1098 1630 -695 -1381 207 1009
1347 1009 291 -582 -800 108 1209 290 -1541 -662 1701 918 -1754 -1065 1598 1080 -1314 -1022 891
1364 891 866 -408 -653 -139 412 641 -180 -1073 -53 1424 236 -1577 -348 1609 429 -1454 -417
1381 -417 1174 396 -771 -310 334 244 151 -136 -577 50 919 7 -1137 -52 1221 48 -1162 -37
1399 -37 960 -24 -695 50 304 -131 41 146 -431 -193 682 163 -895 -138 939 91 -859 0 684 -58
1419 -58 -389 146 68 -202 284 288 -587 -290 856 312 -983 -287 998 266 -903 -241 640 165 -347 -143
1439 -143 -70 43 423 -17 -817 -75 1066 98 -1263 -202 1289 249 -1180 -300 952 342 -588 -366
1457 -366 189 403 279 -393 -701 386 1092 -319 -1340 258 1485 -146 -1471 12 1319 145 -1045
1474a045P38R51j79o83m07L51J000l3j496k62J855N18k031p16K010Q48j802q94
1492a277J400Q97q77q17K46P05M09n54j011L86J510k07j849L1K011J33j959k77
1510a100J729L83j333m80Q08N40k27n55l80N81Q86n51j338N34J583m55j687L61
1528g01J609k44j378J01J018M7n50k17P2L68M04m91p84N96J063o44j206O45J197
1547I05n81j048M59Q07l14m73J43R5K4K65k08n64L47P84m65q98N16Q68n19p48
1567f05M72N10l52k14K27j07o9M15p8o66K17Q41l10q99L68Q60l59p02K91M51j89
1588A02j28L1k06J29N18k78p96L98R83m72j068M59J055m00r12K66O54o1l48j72
1608b46K9L70L44n81o49P21R05q00j066P96J125o89j087N06R27k38o95o0L96L96
$$ plain form
1474 -1045 -307 644 465 -218 -625 -274 726 693 -803 -1065 790 1308 -723 -1439 571 1419 -383 -1277
1492 -1277 123 1020 143 -674 -428 277 686 132 -879 -493 1017 810 -1039 -1008 1003 1136 -823 -1100
1510 -1100 629 1012 -321 -801 7 547 320 -235 -615 -34 852 301 -1037 -503 1080 625 -1062 -701
1528 -701 908 664 -714 -613 405 452 -98 -315 -243 125 529 38 -746 -150 913 269 -937 -292 905
1547 905 324 -724 -265 542 228 -245 -102 -7 17 282 74 -490 -143 641 176 -722 -206 662 143 -605
1567 -605 -133 377 25 -189 38 -69 -138 277 199 -467 -250 591 281 -618 -250 610 251 -451 -160 291 102
1588 102 -26 5 -201 -72 446 168 -628 -230 753 281 -787 -328 727 327 -585 -319 335 274 -74 -246
1608 -246 -217 153 497 -84 -733 -12 893 93 -973 -177 948 259 -828 -322 605 367 -328 -388 8 404
1628D04r8o90k26R56N13j117p59J206Q87j130r70R69R54p05q54L43O80P3m86m74
1648e24K43Q41Oj159k13J331M05j386n40J314O20j109o44P86O33m00n37m6M59
1667H0M58l36q10J92J095o4j251o4J305J47j209k29R94K91o99l41L41L43L5l48
1687g0m01L42P01l17r25K73J048k22j046J57R35p5p34OM52R1j43j49j67K23M28
1708D07k55o54L06P53k97p76K81O85k25n29J45L26p9q2j0j64Q1L81j47n48J87
1729b14O40k08o39J98N57j51m09R0K08k8L5n4k62J23M61j72o21K15P07k12p03
1750d39J76O27j04m81J8K71R9l0k04k17K87M50l72o26L98P55m04p90L21P63k04
1771B94o47N2M60J22k44k95rM56K42n68m69O51O20o53p13N95P62m69p25K94O21
$$ plain form
1628 404 306 -384 -610 346 859 -258 -1017 189 1076 -54 -1024 -55 899 194 -660 -317 363 436 -50 -524
1648 -524 -281 560 566 -593 -806 525 930 -456 -996 318 938 -171 -815 -29 604 204 -333 -379 80
1667 80 538 202 -608 -416 679 615 -636 -700 605 752 -457 -686 308 599 -100 -441 -100 243 278 -70
1687 -70 -471 -129 572 255 -670 -397 651 429 -617 -460 475 400 -334 -328 124 215 72 -77 -244 -21 407
1708 407 152 -502 -196 557 260 -516 -235 450 225 -304 -159 167 88 6 -4 -168 -87 294 147 -401 -214
1729 -214 426 218 -421 -223 334 183 -226 -136 72 44 79 25 -237 -114 347 175 -446 -231 476 264 -439
1750 -439 -263 364 260 -221 -203 68 167 137 -67 -284 3 453 81 -545 -147 608 204 -586 -265 498 294
1771 294 -353 -301 159 281 37 -258 -267 189 431 -137 -606 45 665 12 -701 -106 656 187 -538 -244 377
1792C77m8m95j63K91L97q1n99j11P48L06q48m36Q40N45p66o15O22N75l92n33J23
1813b63M50J38l13m14J71O32k4p88j12Q74K27q63l17P86L59o11l79L82L80j15
1833B00l38j41K83L66j99n71J31P13o0p78j5P46Q0o63j29M94J69k90j95O3K15
1854H1J41j91l59J89N05j53o05J25O19r8n52L3M48J0k73n8R1R6J05j29k55J33
1876i7L90j28m84J27N01j09m41O0L58k5k05j5L0O9J23q6k89J01M05j17m85J16
1898b01M82p9m40L4L28L6k15p1L0J45J29j76k87K06M08j90n09J85N33j24n11O6
1920b21M23L6l03j21J53J98L3k84k07L34L54l55m78L42N40k83n59J93N03p6m38
1941b16m8L00J93j47l06j7M13J63m60l11M87M19m70m68L98M94k78m72J34M14P
$$ plain form
1792 377 329 -166 -329 -38 359 278 -321 -432 316 622 -226 -662 178 723 -43 -658 -36 539 147 -386 -263
1813 -263 187 325 12 -402 -231 401 377 -411 -523 351 578 -285 -602 184 543 -68 -447 -65 315 200
1833 200 -138 -279 4 370 171 -400 -269 444 384 -394 -409 337 417 -246 -375 119 288 -2 -197 -134 81
1854 81 222 31 -328 -139 366 213 -392 -267 352 254 -298 -265 183 193 -80 -138 -47 49 154 25 -230 -97
1876 -97 293 165 -319 -192 309 200 -241 -181 177 152 -53 -68 -38 31 154 68 -221 -120 285 168 -317 -201
1898 -201 281 202 -238 -204 124 160 -55 -126 -96 49 178 2 -285 -79 329 139 -370 -185 348 224 -287 -221
1920 -221 202 238 -65 -186 -33 165 198 -86 -293 41 395 40 -438 -96 444 161 -398 -205 298 222 -216
1941 -216 -264 36 229 82 -224 -241 172 335 -125 -436 51 470 0 -468 -70 424 146 -326 -192 222 229
1962B29k87j91J85L36n1m53p9N30J82n59k64N28L15m39l48L10L50j75k99rK45
1983E6J67j74l20R0M38qn05p4N42J17m90j62M08J90k81k00J25K02K2j78j64J40
2005e9L08j16l85P1M29j8m27k1L81N4k91r3J87R5m1j13r9J21J99j00l04R3L38
2028B09p8l39M1L17nk41k8J38N2k3o4q6Q1J92p5k73O9L23n8l11K8K87Lk34j8J10
2054A7P3j7r8r3J07K10j40k85J24L26j04l46O7L28k5k65m6J82R6p1j38m7J90J75
2078B20k36k48K33L18k06l56J73L61j09l31K9K76N5j80j32O1K24M6k94j46L21
2099G9K29l27k98K98L26k45l37J75L01p4k49m2J73J56r2k51PL33O6l73j31L85
2121A09J85l44k29K95K34k01k31R6K00L2j62j34J06K41n9l23J4L61L7l70p3L39
$$ plain form
1962 229 -58 -249 -64 272 221 -232 -311 219 401 -158 -422 106 421 -18 -366 -56 294 119 -180 -189 56
1983 56 223 49 -271 -181 257 249 -256 -330 212 329 -161 -323 85 275 -6 -206 -81 121 143 -35 -199 -59
2005 -59 249 133 -252 -181 248 230 -197 -218 163 217 -74 -167 20 115 74 -39 -138 -17 182 82 -222 -129 209
2028 209 131 -208 -167 150 145 -96 -124 14 66 43 -21 -107 -26 166 91 -182 -113 210 152 -159 -131 156 159 -75 -93 17
2054 17 90 73 -25 -118 -11 199 59 -226 -102 224 120 -226 -159 169 144 -121 -167 15 111 40 -98 -145 45 220
2078 220 -16 -264 -31 287 81 -275 -102 259 150 -181 -152 124 179 -1 -133 -72 152 198 -96 -242 79
2099 79 308 -19 -317 -19 307 62 -275 -100 201 127 -122 -164 9 165 73 -178 -171 162 228 -145 -276 109
2121 109 294 -50 -279 16 250 49 -182 -86 114 146 -16 -150 -44 197 138 -185 -171 190 227 -143 -216 123
2143A23J05k76j34J87J35r1j39j8J29J26j18k13Q4K79p3l07L3L16j5k58j5K08
2165F8L8j25n6L6Q4O4q8j35J03J88r2k34Q7K35p1k13M9J66k9j06qL1L5N2o1j36
2191a18P7J77q4k22Q6K25p5j83L4J46j9o7j4JM5P2o1j48R4K12j03k41J13K39q7
2216I9k21N9J64rj00m4L3P9M8j27j21J52J79j68k24J62K45j41k52J13K12n3j68
2239h3j4J15O4k7j44m3K07J13k41j74K71K04k46k24K02K29j44k09P8J75J0j23
2261dj10P2J90%k81l7L12Q9l34j18L13J32k72j52J97J59j04j68K1J24R3j00k03
2284a81Q7K75m6l21J0L49J3l10n0K68P3k03p8J05J13qj14r5J20J73j17k41J08
2307g0K74r3k95Q3K53m1k16J3J39K4p1m8k6Q7R0j17j50J31K00j27k16J16K12j10
$$ plain form
2143 123 228 -48 -182 5 140 49 -90 -108 21 147 29 -184 -100 179 106 -201 -168 148 133 -125 -140 68
2165 68 106 -19 -75 -39 45 109 21 -114 -11 177 85 -149 -62 173 102 -111 -62 104 75 -31 -39 -8 27 79 18 -118
2191 -118 -41 136 52 -170 -84 141 66 -117 -83 63 44 -23 -37 -36 9 81 20 -128 -34 178 75 -166 -53 186 99
2216 99 -122 -63 101 92 -8 -52 -19 60 108 -19 -140 12 191 23 -201 -39 206 65 -187 -74 138 85 -83
2239 -83 -97 18 82 55 -89 -132 75 188 -53 -227 44 248 2 -222 -20 209 65 -144 -66 109 119 -4
2261 -4 -114 -42 148 148 -133 -170 142 231 -103 -221 92 224 -48 -200 -3 156 52 -116 -95 29 122 22 -181
2284 -181 -94 181 135 -186 -176 173 186 -124 -174 94 167 -36 -114 -9 104 96 -18 -113 7 180 63 -178 -70
2307 -70 204 111 -184 -101 152 111 -105 -92 47 71 0 -48 -74 13 103 -14 -164 -33 167 40 -176 -60 152 42
2331D2j54O6J40l8p9NOL9N1o3j11R6J54j21j64J23J63j31j25R3Q4n1m0J8l4K2
2357iQ3o3j33R3J63j20j64J15J66j11j26P7Q2l8k7j8j0M7Q5q5j41J31J67j37j94
2382a67J61J80j33j62R7J32m5q3j8J6R2K6j47q6J95J29k31j57K25J74k07j82J50
2405d1J82j03j30J8Q0Q0n9j43J2K19M8k71r4L17J13l01j26K49J64k07j40J11J37
2428A15k0j20p9Q9J71n3k61K3L15nl26m9L26P3l02r0K33R2j17j34K9J29Q4j36
2452a3j74J20K66j14k94Q5L21n4l06K4K66J9j99n1J10R1j8j11p6J26J59j59k21
2475b03J55K63j41k73J13K51p7k14L2J49J7p3n9j3R5Q7j21j63J75J72j59k00J42
2498d5K00j22j62Q7J17l3o3j0qO5P0r3j31J30J77j54j71J44J55j19j38P9R2m1
$$ plain form
2331 42 -112 -46 94 56 -23 -18 -12 27 78 15 -96 0 154 33 -131 -8 155 24 -101 -8 76 25 -15 3 -31 -9
2357 -9 74 11 -122 -29 134 14 -150 -35 131 20 -106 -29 53 15 -12 -30 -40 7 92 7 -134 -3 164 27 -167
2382 -167 -6 174 41 -121 -24 108 63 -20 -38 -22 70 96 -51 -137 58 187 -44 -201 24 198 -9 -191 -41
2405 -41 141 38 -92 -74 6 86 27 -116 -104 115 163 -108 -202 115 228 -73 -199 50 214 7 -133 -22 115
2428 115 95 -25 -104 -15 156 103 -158 -135 180 175 -151 -200 126 199 -103 -193 40 132 15 -119 -90 39 123 -13
2452 -13 -187 -67 199 85 -209 -124 197 143 -163 -139 127 146 -53 -104 6 97 79 -32 -108 18 177 18 -203
2475 -203 -48 215 74 -199 -86 165 88 -126 -94 55 72 -1 -60 -73 22 109 -12 -175 0 172 13 -187 -45
2498 -45 155 33 -129 -42 75 42 -21 -31 -39 26 96 3 -128 2 179 25 -146 -2 153 34 -104 -25 67 26
2522B6l1j9k3O9O9j05j35J32J67j44j83J38J79j20j51P8J16j2o9k8mR5N9j32j27
2547a55J84J69j90j78J63K02j45j83R9J51l4j13l5M0J31oj86o0K21J19k71j49
2569b26K62J82k35j96J72J98j02j72K1J33P7q9j56K1K58J2k99o8L32J17l29j36
2591b23K81J54k00j70J18J63lj60j00J26J98r0k76M3L28ol49m4L30R1l02j16K21
2614A4J42j11j58jJ53J16j53k15J53K67r9l18P3L29l8k97k0K63N8j71j05R1J30
2637A03jj39r8J39K03j53k52J22K78r4k73N3K51k8k01k7J22P1l4j15n1J42J21
2660A39j41j94J44K29j31k30J06K12n9j65J4J16L6n0o8l4J03J25j42j66J40K14
2682A98j46k01R1K06q0j51LJ18L1m7q3k8J12J10j53j55J49J99j37k14J13K18q4
$$ plain form
2522 26 -5 -24 -47 22 91 -14 -149 -17 150 6 -177 -39 140 20 -131 -53 63 51 -18 -46 -50 45 104 -28 -155
2547 -155 29 198 8 -170 -7 195 50 -133 -34 117 83 -30 -65 -25 106 100 -86 -146 75 194 -77 -226
2569 -226 36 218 -17 -213 -41 157 55 -117 -96 37 114 25 -131 -110 148 160 -139 -207 125 242 -87 -223
2591 -223 58 212 12 -158 -40 123 120 -40 -140 -14 184 94 -182 -139 189 183 -166 -210 120 211 -91 -207 14
2614 14 156 45 -113 -114 39 155 2 -213 -60 207 108 -210 -137 192 154 -143 -163 100 158 -13 -118 -27 103
2637 103 102 -37 -135 4 207 54 -198 -76 202 108 -165 -112 139 111 -90 -117 5 76 42 -73 -124 18 139
2660 139 -2 -196 -52 177 46 -184 -78 134 75 -90 -76 40 76 26 -42 -76 27 152 10 -156 -16 198
2682 198 52 -149 -58 148 68 -83 -80 38 69 22 -61 -89 23 133 -20 -175 -26 173 36 -178 -65 153 69
2705F9j91L5J31M7q2r4J6J39P9j97j23K00J93j97k25J68K39j17k30O3J83K0j46
2728b0j00P6J72rk36o1K56J31k66j91K55K25k16k22J31K33n9k13k7J67J22r4k16
2751a62M8K65L3l04r3L16J34k81j92K48K00j55k05N6K02L1j63j39J21K41p8k95
2773a72ML22N0l25j05K94J39k38j71J42J98n2j76p0J74J54j38k41J01K98m1l02
2795a55j9L12N3k64r8K17J13j13j36PJ71Q1j62j63J24K32j03k75O1K75j2k66m0
2818a60K21P2j44j04M6J32M0j43j19J25J98j18k35R6K53m8k45J1K03M2j48o9O2
2841c2J11J1j24q9J42J62j34k06R7K51q7k39L1K16J1j64o5R5J08k1j39p2J61J53
2865A77j75k08J53K37j04k72P4K42Ok08n8J51J14o9j52k2K03R3k06j73K05K28
$$ plain form
2705 69 -122 -87 44 91 9 -85 -69 70 149 -48 -171 29 222 25 -200 -32 207 90 -140 -77 106 126 -20
2728 -20 -120 -44 128 119 -117 -178 78 209 -57 -248 7 232 16 -206 -75 158 99 -114 -141 26 148 54 -162
2751 -162 -114 151 184 -120 -213 103 237 -44 -236 12 212 57 -148 -92 110 141 -22 -161 -40 201 123 -172
2773 -172 -168 154 204 -121 -226 68 207 -31 -202 -60 138 86 -90 -160 14 168 30 -211 -110 188 147 -155
2795 -155 -174 138 191 -73 -171 46 159 46 -90 -83 88 169 7 -156 -32 200 97 -178 -117 158 146 -120 -160
2818 -160 61 133 -11 -115 -69 63 103 -40 -159 -34 164 46 -189 -93 160 112 -133 -122 81 123 -25 -94 -32
2841 -32 79 90 -34 -123 19 181 47 -159 -62 189 102 -137 -106 110 121 -43 -108 -13 95 74 -65 -137 24 177
2865 177 2 -206 -53 184 80 -192 -118 124 130 -78 -136 15 129 60 -92 -114 89 182 -24 -197 8 236
2887B36j75k60J24K70o0k47j6K12Q0j47j61N4K27J1k36j15K62J68k42k23J89K65
2909B16j54k51N4K46J7j92r7J45J71p3k37KK77Q4k79j43K54K18k25k32J57K30
2931A88o6k28l4K06J07j41j89N2K69pk97o5L03J13k61j86K28J98j52j96M5J99
2953H6M4j73j22J24K01p0k61K7K74M9k70r8K50J35j83j60J09J77k9j70o1J47J40
2976A66j05k12N0K58j8k64l8K44R4k14j26J44J52p1j62k1J57J15j47j66Q9K30
2998A55m1k56oK49N6k24r2J72J33q8j54LJ67P6j52j46J19K13q9k36M0K48Nk44
3022i2o6K13J08j47j29L4J72L9j89j21J69J81j36k39J02K69m9k60k2K32R3j86
3044b4j31J12J87k8k06n2K04J53k10k05J53K66j18k75M9K78Qk22j00J75J51j12
$$ plain form
2887 236 61 -199 -75 195 135 -112 -128 84 164 17 -144 -90 137 148 -88 -203 59 227 -15 -238 -49 216
2909 216 62 -189 -135 111 128 -64 -161 -16 155 82 -155 -153 124 208 -71 -214 40 258 33 -199 -42 188
2931 188 122 -106 -140 66 173 32 -157 -105 164 157 -140 -205 98 211 -50 -236 -8 190 38 -158 -113 86
2953 86 130 -43 -165 -41 160 90 -171 -144 130 179 -91 -189 61 196 13 -147 -38 139 110 -60 -121 26 166
2976 166 61 -151 -101 157 139 -125 -163 81 175 -39 -165 -21 131 60 -102 -123 34 149 2 -164 -75 155
2998 155 114 -142 -148 101 157 -67 -159 13 146 58 -96 -93 74 150 -2 -148 -29 184 95 -141 -101 147 152 -92
3022 -92 -158 55 163 16 -113 -79 93 132 -57 -178 -9 172 36 -203 -101 168 119 -141 -163 69 162 -24
3044 -24 -155 -43 144 116 -90 -142 62 215 5 -200 -47 219 101 -174 -125 153 161 -61 -161 14 165 53
3066E3j93K0K24N8k17j72K36K03j77k58J26K70n6k61k1K17J01j58j61R6K10pk46
3089a13n5K47J38k25k06J93K41j27k54O0K35L7k15j09J56J71r3k23RK53N6k53
3111g7j30K29J81j97j98J14K22n1k10k4J82J04j36j71P7K20rk39o1K48J22k28
3133c2j42J54J84r0j90J6J81O3j51j26R3K10o6k34kK41N8k24j07J81J46j26j86
3156a49M8J90K1j65j05J35J65q4k17M0K38J7k28p3K10J24j62j51R9J70j9j73m7
3179a16J55J35j39j81P3K31l0k46j8K28Q3j95j35J39J63n4k04j9J84R7j74j63
3201a86J32K19p9k62K9K65L4k24j04J86J53j13j93M9K02M7k03j08J73J86j41k27
3223a65Q4K54k6k55l2K16J01j76j46J04J82m0k06m3K06J23j89j96J37K46r7k47
$$ plain form
3066 53 -140 -120 104 162 -55 -227 9 212 35 -223 -97 173 117 -144 -165 52 153 -5 -166 -70 140 133 -113
3089 -113 -168 79 217 -8 -214 -21 220 93 -161 -101 134 171 -44 -153 3 174 81 -142 -133 120 176 -77
3111 -77 -207 22 203 6 -192 -78 144 93 -117 -141 41 145 9 -162 -85 135 126 -113 -174 74 196 -32
3133 -32 -174 -20 164 74 -116 -100 81 144 -7 -133 -40 170 104 -130 -132 109 167 -57 -164 17 163 37 -149
3156 -149 -101 89 110 -55 -160 -25 140 56 -161 -121 117 134 -94 -167 43 167 5 -146 -47 123 104 -69 -116
3179 -116 39 174 35 -146 -73 158 128 -118 -136 92 175 -20 -155 -16 147 93 -111 -130 54 151 -23 -186
3201 -186 -54 165 86 -176 -147 118 152 -72 -176 10 163 50 -143 -94 108 155 -48 -156 17 203 62 -165
3223 -165 -81 173 147 -108 -140 76 177 1 -145 -41 141 101 -105 -148 58 181 -8 -204 -67 179 82 -165
3245a65K9K33O1k09j25J52J67q9j85J0K17O2k02j28J75J85j26k35R1K46k0k32
3267h8m0J81J22j48j56O8J97rk25n6K03J30j80j88J23K23p1k21JK10N6j74j22
3290a64J23J74o0j86k7K12Q6k06j25J65J77j07k05M9K09K3j91q7J48J48r2j95
3312a31L8K08L7k11j02J97J38j55j79R5K08n1j88l3J58J00j23j68Q6J97j9k18
3334a16l8K04J01j72j32J22J90q2j97J2J96O4j77j19J27J73o6k11JK32M2k02j11
3357a59J72J58j13j99N2J98J4j89q4J59J40j14j93N7K34j0k35m2J92J20j60j65
3379a67J02J97l8j90k9J90R3j57j54J09K10p2k08mK08P4j92j26J55J61r6j90K3
3402a01J96M7j86r9J42J63j07k12N6K18J0k16o7J81J23j37j56O6J96j1j88n6J78
$$ plain form
3245 -165 -136 97 158 -51 -176 -24 143 54 -131 -121 96 158 -44 -172 3 188 62 -173 -82 164 144 -88
3267 -88 -128 53 175 27 -129 -61 136 127 -98 -154 49 179 -1 -189 -66 157 86 -135 -134 76 132 -42 -164
3290 -164 -41 133 73 -113 -140 72 158 -48 -173 -8 169 62 -143 -94 115 138 -53 -140 8 156 64 -131
3312 -131 -93 115 152 -59 -161 36 174 19 -160 -65 143 92 -96 -129 29 129 6 -162 -76 121 102 -116
3334 -116 -154 50 151 -21 -153 -31 159 77 -120 -108 88 152 -25 -144 -17 156 90 -121 -120 112 154 -48 -159
3357 -159 13 171 58 -141 -89 109 123 -66 -150 9 149 35 -158 -101 133 123 -112 -154 38 158 -2 -167
3379 -167 -65 132 94 -96 -125 65 158 1 -153 -44 166 94 -114 -118 90 164 -28 -154 1 162 66 -124 -101
3402 -101 95 142 -44 -143 -1 162 55 -157 -101 117 127 -89 -156 25 148 11 -145 -79 117 106 -82 -138 40
3425D0J18j42j67J09K05n4k04k4K00P1j60j11J11J49n2j93j4J97P5j76j36J37
3447b1J67r1j99L3K00K4j86o9J40J52j16j62L1K01Pj82q3J64J61j38j82Q6K00
3470A37k1j97l8J78R2j37j39R3J61k6j91k0J69Q5j46j45J17J76q3j82PJ89M0j53
3494c4j03J14J45o8j76LJ98L8j68r7J51J48j14j63N3J91J0j89n8J58J20j25j63
3517a29N9J94%j98m9J68J17j40j60J03J70n2j82j8J70Q3j58j29J15J66o5j86l
3540a24J92M8j70r4J42J42r2j63L8J82K3j74q3J46J34r9j68N6J86Lj84o0J55J13
3564A49j16j51O8J91k8j92l8J61J04j49j35Q0J67l6j78k8J78P5j45j22J14J50
3586A19n5j69RJ59O1j61r3J28J35o4j80L5J67L2j63p9J37J22q9j60M3J76jj61
$$ plain form
3425 40 158 16 -151 -42 163 109 -95 -119 81 152 -8 -119 -8 141 89 -104 -118 79 154 -22 -158 -21
3447 -21 146 55 -144 -111 89 113 -73 -142 -2 150 34 -128 -97 104 111 -71 -154 10 171 33 -149 -63 137
3470 137 116 -81 -119 59 151 14 -125 -32 129 103 -88 -108 61 146 0 -145 -28 148 65 -117 -110 79 119 -34
3494 -34 -137 -23 122 54 -122 -119 79 117 -51 -148 3 151 37 -126 -73 118 128 -61 -119 39 159 34 -129
3517 -129 -70 124 124 -74 -123 45 162 22 -138 -35 135 83 -99 -117 53 136 -22 -151 -36 130 65 -121 -124
3540 -124 68 116 -54 -148 -6 136 44 -119 -81 101 124 -50 -133 13 147 48 -120 -64 122 125 -59 -119 36 149
3564 149 33 -118 -50 141 113 -79 -117 44 148 -1 -136 -56 111 75 -103 -131 47 122 -23 -145 -31 119
3586 119 64 -105 -96 63 124 -37 -130 -2 133 69 -111 -76 91 123 -40 -119 18 140 51 -109 -66 110 109 -52
3610e2q2J57J05j07j43O1J60j1j77n5J75Q2j21j33P8J52j8j60l0J59Q7j45j16
3633a34J06J48m4j68LJ62M4j36r7J13J36o4j62J6J76K5j58r1J35J35j02j56M2
3656g1J62Qj71m6J27J01r1j58N7J62Qj69n3J71Q9j35j30R2J57l9j68j2J69P5j50
3681a5j00J02J47n3j59KJ55N0j51q9J10J39r1j42K1J51J6j37p7J27J14r6j39L4
3705h1J48J6j56m5J36J03j13j38O8J52j1j48l1J33R0j14j21P6J47l4j53j0J38
3728E2P0j16j18J04J27n1j57J1J50L5j24r7J15J08p3j40K0J44L8j46p7J24J19
3751A18r9j26M2J43J5j51n4J28J01j08j05N2J39j0j50l3J47O6j00j18Q4J33m2
3774G2j46rJ37O4j27j06Q8J24n4j25j3J52M7j30r4J01J21o6j53L0J57K1j54n4
$$ plain form
3610 -52 -134 23 128 21 -122 -61 99 88 -89 -144 31 113 -8 -141 -63 89 71 -89 -119 40 127 -18 -134
3633 -134 -28 120 76 -92 -89 73 117 -19 -116 -3 133 69 -93 -77 99 124 -34 -125 10 145 43 -113 -71
3656 -71 91 99 -72 -118 9 110 19 -139 -82 80 88 -81 -134 37 126 -9 -139 -47 110 71 -97 -109 60 135 -15
3681 -15 -115 -13 134 81 -78 -76 79 129 -22 -111 -1 138 47 -95 -74 77 93 -44 -121 6 120 24 -115 -81
3705 -81 67 83 -73 -118 18 121 8 -130 -62 90 79 -69 -100 33 123 9 -112 -36 111 77 -76 -86 52
3728 52 122 6 -112 -8 119 68 -89 -78 72 107 -17 -114 1 109 36 -104 -84 60 98 -48 -125 -1 118
3751 118 19 -107 -65 78 93 -58 -112 16 117 9 -96 -44 95 85 -65 -98 49 115 15 -103 -19 114 72
3774 72 -74 -83 54 118 -9 -115 -27 97 43 -82 -95 57 104 -26 -120 -19 102 36 -117 -87 70 91 -63 -117
3798a17J17R4o4j26L8J43Rj40m6J28Q7r6j17N4J41k5j39k2J31O9j18j04Q2J16
3822I5l6j37j8J43M8j24p4Q3J14n2j39KJ49L8j32o6J06J01o7j28L2J38J0j24n7
3847i5J17J00q1j25M8J26Qj48l8J38O6r8j05O0J21l0j38pJ13O0r3r5N5J17k6j32
3873h2lJ17N3j28o8Q9J13n3j24K2J24L0j17o4Q7J07o7j15L0J39Kj27n4J10Q5p5
3899C1j14M7J17jj25m2J17O8r8j00N7J17j7j20l2J14P8j07j01O7J25l7j16oJ20
3924D2N2j15p6R4J00n5j06PJ21L6j18o2R7Q8n7j24K8J42pj26m2J03Q5r6r1M3J07
3951G0j1j15l4R8Q7r4r9O0J08k4j19qJ09O2j07q6Q0R3l1j05pJ23M6j20o5R7R1
3978I9p3r3K0J24J6j21n1R4Q2q5q6M0R6J1j16m8J02P5p6j08M4J18j4j24k1J09
$$ plain form
3798 -117 0 94 30 -96 -58 85 94 -46 -92 36 123 27 -90 -36 105 80 -59 -81 50 119 1 -103 -21 95
3822 95 59 -78 -96 47 95 -29 -103 -20 94 42 -97 -95 54 92 -40 -106 0 101 34 -94 -62 76 86 -38 -95
3847 -95 22 122 41 -84 -36 90 98 -50 -88 50 116 18 -87 -27 94 64 -74 -81 32 92 -1 -96 -41 76 50 -82
3873 -82 -85 32 85 -43 -111 -22 91 38 -86 -64 60 90 -27 -91 -4 103 36 -79 -49 90 92 -35 -89 21 106 31
3899 31 -83 -36 81 80 -45 -87 30 98 0 -100 -43 74 57 -63 -95 19 97 -10 -111 -44 81 44 -72 -78 42
3924 42 94 -21 -97 -3 97 42 -64 -57 64 100 -18 -80 17 105 48 -76 -48 94 87 -39 -81 22 107 11 -80 -37 70
3951 70 59 -56 -90 8 95 1 -98 -38 70 46 -73 -81 28 90 -17 -103 -23 70 39 -66 -73 50 96 -24 -89 8 99
3978 99 26 -67 -47 77 93 -28 -79 15 97 12 -74 -34 62 73 -43 -91 11 86 10 -98 -54 64 50 -74 -95 14
4004A4N6r4p0O2J07k1j16lR9M7q8p5P4R4m7j04J5J16J7r9o3Q2R6o3j01K1J07J0
4032G3j05m8Q2Q0p0j01M0J01kj07m0J02N2n8r5N0J06j3r7l1J00N4o4r0N8J03k8
4059E2q9k8J09N3j05o9O8Q7k1j06oJ01L2r9n5O9P5l2j09J5J04J3j03n1P6P3n5
4086ar8L5J20oj02l6Q8Q2p1q5M0J08j7j11j4J09M5q7o9O3J01l4j16j0J02M4q9
4113ip7P2R3m6j04RR5L5r7o8P9P8m7j08L5J06j0p7m7R0P6p2p5K4J02Jr2l3Q1P3
4143H7p9p6M3R4j0j05rR4L8q0p7O4Q2k8q7j9J06K1p9o6Q1O1l7r3QR6Rq2m0O9P3
4174E9n1p5K4P7J6p5m5Q1O5o1q3L6J02pr7j4P7M5p1p0M4Q9k2q4j7P9M4q1n3L4
4204c4Q5j7j01J1R3K2q3n5N2Q3l4p6mQ4L2q3n1O6Q2n1p7K1R4j0p9l5R6L8n1p3
$$ plain form
4004 14 70 -24 -94 -32 75 54 -62 -65 34 81 -7 -82 -8 86 39 -65 -50 66 83 -16 -79 3 99 36 -65 -44 63 73
4032 73 -32 -80 2 82 12 -89 -49 52 50 -57 -97 5 57 -1 -96 -46 60 47 -50 -81 19 73 9 -81 -23 80 52
4059 52 -37 -65 44 97 -8 -77 -9 78 57 -49 -55 46 78 -21 -76 -7 68 36 -73 -58 46 59 -44 -95 -19 54 -1
4086 -1 -99 -64 56 50 -52 -88 0 82 11 -74 -34 74 57 -54 -68 41 86 -1 -70 -7 94 60 -56 -66 36 80 -9
4113 -9 -86 -14 79 33 -71 -62 33 68 -29 -97 -18 60 13 -95 -60 46 36 -41 -88 2 78 6 -69 -45 57 58 -34 -67 14 87
4143 87 8 -68 -25 69 59 -46 -55 39 77 -3 -80 -16 66 38 -49 -68 38 59 -20 -86 -5 56 19 -74 -66 30 39 -43 -83 -14 59
4174 59 8 -67 -43 34 50 -25 -70 11 76 15 -68 -32 70 63 -34 -48 29 74 3 -67 -23 66 44 -40 -57 22 66 -15 -68 -34
4204 -34 51 34 -67 -56 37 59 -24 -79 -27 56 22 -54 -58 26 58 -25 -76 -10 72 21 -56 -35 59 49 -30 -65 31 69 18 -55
4234e5K3Q8lr0k0P8M9o6p8M8Q2k0r7j1Q8L6p6n3L9R0l0q9jQ9K3p6m9O7P7m2q2
4265f1K2Q0J2q3l5P3N8m2q2J8R4Jq1l3O9M8n2p3L1Q1j0q3j7P9M2p1o9N0Q3k3r2
4296f6OQ1L0p9m8O2O8k9q5J5Q7J4o2m4O0N4l8q2K9P1K0r0k4O1N3n0p3M1O3Nr6
4327d6qN7M7o3n6L2Q3qq2j4O8L7o3m8M0O9k3o5oO9L0n2n6M7P3l3o3MP1K0p5l0
4359d4N1N7k5p4NP0J4p7l4N8N7m6p7L3P2pp4k0O1M5m3o8L2P3op5j0P3L1n6n9M8
4391a5O8j4p9NP6J8o2m4N2N4j7p5oP3K5p8l9O7N0m9o9J8P5Kp2k2O4M3n1n8K6O6
4423C2mp7j9P8M7o5n1L8Q2k8o5j2P2L5o5m1L9N8j8o6qP9J8p0m0N6M9l4q1J3Q4
4454C6Kp1l3N3N1m2o4L6O1Kp3j9N5N4m9n4L6O2j5o2j3O3M4n2n6M1O5k2o1rO8J9
$$ plain form
4234 -55 -32 56 53 -37 -57 21 70 4 -74 -26 56 36 -61 -72 16 52 -24 -77 -38 52 22 -67 -68 21 44 -32 -81 -14 63 21 -61
4265 -61 -39 41 53 -30 -65 8 66 24 -58 -40 54 55 -26 -59 10 58 6 -67 -36 45 35 -48 -65 14 56 -15 -84 -34 49 26 -66
4296 -66 -60 21 51 -28 -76 -14 54 25 -60 -45 42 56 -6 -50 10 64 26 -56 -27 44 64 -26 -50 11 64 14 -59 -18 45 50 -46
4327 -46 -54 3 50 -13 -69 -37 46 38 -44 -58 10 47 -16 -64 -24 45 22 -43 -49 20 50 -2 -58 -11 62 29 -34 -30 41 61 -14 -44
4359 -44 7 64 39 -35 -30 40 54 -23 -57 1 58 12 -65 -32 40 33 -41 -61 0 45 2 -66 -34 39 33 -42 -52 21 52 -4 -63 -15
4391 -15 53 39 -40 -35 41 59 -3 -47 5 59 42 -33 -39 34 59 -19 -58 9 59 10 -59 -41 34 36 -36 -58 6 49 -2 -60 -34 32
4423 32 28 -49 -68 10 57 -8 -59 -21 61 33 -32 -44 28 63 -2 -43 -4 54 36 -30 -38 41 59 -11 -51 5 54 20 -61 -48 36
4454 36 38 -33 -66 -13 38 -4 -68 -32 29 31 -42 -61 -6 48 -1 -55 -19 43 28 -34 -47 16 60 8 -48 -7 58 36 -25 -34 34 53
4486E3n4m3M3O9m6o1KO5K2p2l4N6M4l6n8J2O2J1n8l2N9L7m2n3L2M7J6o7k6O3M1
4517E2m3o2L8O3no8pN6L2n1m3L4N9k1o3rO0K6n3m6L3O8l7n0j0N9K3n0l0K7M9k2
4549Io0J4N5K4p1k3N1O1n2o5L3O5Mp3j5O0M3m7o1L2O1pm9k9N7L9m6o9M1O4k6o9
4581d9OO3J9n7n0M8N6k7n4JN2K8n8m3N8N0k6o0K5N8Mo0j9N5L9m0m8J9N9Kp1j3
4613c3O0L2n2m2L1N8j9p0mN9J2l8l1K4M4j4n9JO2K4o2l8N0N0l3n3PO4Ml9l2M5
4645HM4m0m4J1N4Qn6j9M2M6m1n6L7M0%o8rN3K7m5n0M0M9rn9j0N5K8n4m7N0M5j8
4678A2n3jN1J8m4k3L2N4k5n1RO1%l8l5L9M2k2o1J8M6J2n6k9M2L5l4n4K4N2%n7
4710c6j7N9K2m2l6J9N6j2n8lN0L6l7m5L1N5j8o7J8N4Rn2j8L8L5j9o1RN7J6m7k9
$$ plain form
4486 53 -1 -44 -1 68 22 -39 -37 28 50 -22 -56 0 44 8 -50 -38 24 35 -23 -55 4 41 -1 -54 -22 25 41 -26 -52 11 52
4517 52 9 -53 -15 48 43 -25 -32 24 56 5 -38 -4 55 34 -29 -38 22 48 -5 -51 -18 50 13 -37 -47 12 35 -15 -45 -18 31 9
4549 9 -51 -37 18 42 -29 -52 -1 60 8 -57 -24 41 45 -28 -43 17 60 13 -48 -16 45 38 -11 -40 17 56 10 -59 -18 46 20 -49
4581 -49 -43 20 39 -18 -68 -20 36 9 -45 -44 8 36 -22 -65 -7 43 17 -43 -18 40 44 -16 -35 20 59 19 -29 -10 49 51 -20 -33
4613 -33 27 59 7 -35 -4 54 35 -35 -39 20 32 -6 -37 -13 31 17 -42 -41 21 45 -17 -55 -5 45 12 -41 -34 30 34 -5 -37 8
4645 8 52 12 -32 -21 33 41 -15 -34 8 54 13 -43 -6 34 34 -34 -43 10 37 -8 -58 -18 31 22 -37 -47 8 36 -18 -65 -15 30 12
4678 12 -41 -42 9 27 -17 -40 -8 46 21 -30 -21 40 40 2 -33 6 48 26 -35 -17 29 41 -15 -44 -2 33 -1 -55 -31 21 21 -36
4710 -36 -53 6 28 -14 -50 -31 25 13 -45 -48 2 38 1 -44 -13 42 24 -43 -25 29 38 -14 -32 6 41 22 -39 -30 27 43 -4 -33
4742c3L8N2l4p4L2L6%l7k2L1M6l9m6J8N1Jn8qM7K9l9n1M7M9j6o1K1M5J4m2k8K9
4774bN0j1o1QM5K4o5k7N0L8m1m8K5N3j0m9j2L5K7l3l5J0M4J1o2rM4L0m0l5L0M5
4806B9j0n2PN1Ok6l4K1M8j2m1KL3J7m3k2K6N0k8l4MK2J4m0l4K8M4j9n0J2M8Jm0
4839b2k6M1L6k9m1K0L0Qm2kL6K3k3l6J9M3j0k9k5L8K4k7k9J8M4rn0qN0J9m2m9
4871e0M3M6j8n4qN3K2m5k7K5M2k6l0%L6K0n1k6N3L3k8m2K5L8Lm5j7M8K1l0l7J7
4903iM6rl5j6L4L0m8k9K0N0j0m4oM0J1m1k3K0L8mm3j8M9J9m3k5L6M3l1m0K2M4
4935B8Lm2k2M8J6j2l8J6L2Kl9j0M6J1l0m1L1M4j7m1qM1J8n0k2K3L6mm3j0M6J0
4967B2l2k7K7L7k1m0J7N0ml7oK2K0ql7QM0J5m4k2M0K4k8m6K8M0k4k8JK2J7k7k9
$$ plain form
4742 -33 5 57 23 -51 -19 17 17 -20 -42 -11 35 -4 -50 -32 19 20 -38 -46 1 30 -9 -60 -13 36 20 -41 -20 25 39 -3 -31 -2
4774 -2 48 37 -24 -16 29 53 -12 -39 11 49 8 -40 -15 38 28 -21 -33 2 29 -4 -39 -29 15 26 -36 -45 -1 29 -11 -46 -16 29
4806 29 19 -33 -26 25 31 5 -29 -8 40 28 -13 -11 22 39 -4 -26 0 50 22 -12 -8 14 28 -12 -46 -18 26 7 -43 -31 17 18 -22
4839 -22 -48 -7 29 0 -41 -21 9 17 -25 -27 9 32 9 -27 -8 35 25 -4 -29 9 33 6 -23 -5 39 30 -20 -28 22 41 -1 -50
4871 -50 -7 39 21 -33 -41 12 34 -11 -38 -13 29 3 -27 -27 9 29 -22 -48 5 38 10 -32 -7 31 34 -11 -28 20 41 11 -26 -9
4903 -9 37 28 -7 -23 11 41 -7 -36 -16 34 24 -20 -26 14 25 -16 -39 -19 19 15 -28 -46 3 22 -21 -46 -10 33 2 -38 -16 28
4935 28 31 -11 -33 15 31 19 -19 -3 29 31 -8 -18 28 39 9 -32 -1 43 26 -15 -23 18 36 -14 -36 -13 23 19 -24 -34 12 22
4967 22 -10 -37 -10 27 6 -34 -17 33 29 -8 -14 8 28 20 -17 -9 31 46 2 -20 20 44 16 -30 -2 38 14 -14 -13 9 26 -1 -30
5000c0PM4Mn0mK7K3l7k7L2J7Ml8JL0J5k5j5J6L7%n0RL3J1l2k1L8K2k2l9J3K1K4
5034C8l2l8M2J9k0l6ML3Pm3oL3J9j4m4J5L3om0LK8K4j9l8K3M1j3k7j1L9K8l9k8
5067b5L9K5k1k5KL3Nl4k1K2L6j6m4J3L4om2rK4L6l2l2J8L2ml4j2L2K2k7k6L3K8
5100B4rm2QL5Qj5k9K5K4rl1J0K2Pk5k7L6K9j9l3MK8nl3j6K5K3j5k6mM2Lk9j7K0
5135a1K6l1j4K1J9nj8j3K6J9j4j7J1K0nj6j5K1L7k9l9K7L9k6k8LK2J8l8pjK8k
5168Hk5j3L2J9k6l4L1K9k5l2J3K8lk5pJ2L1j5j6nM1J1m4j2L6K1k1m2L3L0rl3L
5201iK4J7k7k7J5L6k0l6nL3J9m2j6J6K9ok7MK4Kk6oJ9L0ql6PL2Mm5pM5%rk0RL2
5238B5ok1lML7l5j9NK9ql2QJ9J6m6j4L4J8qk9kK7Nl1mJ7J6ok4J1L1mk4oL1Pqk1
$$ plain form
5000 -30 -23 21 25 -25 -29 -2 21 -16 -43 -11 6 10 -28 -27 3 18 -7 -22 -6 31 31 -19 -10 23 34 2 -19 19 41 19 -20 -7 14 38
5034 38 6 -32 10 29 9 -27 -23 10 17 -26 -32 1 20 6 -38 -23 10 4 -36 -33 -5 19 0 -38 -15 26 13 -14 -25 14 42 3 -25
5067 -25 14 39 18 -7 -5 28 33 -1 -22 0 36 20 -24 -11 23 17 -25 -34 -10 26 -6 -38 -20 12 8 -26 -38 -6 16 -11 -37 -4 24
5100 24 15 -27 -19 16 24 9 -20 5 29 20 -11 -1 21 28 3 -24 12 41 22 -11 -7 21 16 -17 -33 -8 15 0 -26 -30 12 15 -14 -31 -11
5135 -11 15 -16 -30 -9 10 5 -13 -26 0 19 5 -12 -1 19 14 -2 -17 4 41 12 -27 0 39 13 -15 -12 10 28 -10 -17 -18 10 8
5168 8 -17 -30 2 21 -5 -39 -8 21 -4 -36 -23 5 2 -23 -30 -18 13 -2 -18 -23 18 29 -15 -27 9 30 9 -33 0 30 21 -12 -9
5201 -9 15 32 5 -22 -7 29 9 -27 -32 1 20 -22 -38 -22 7 1 -26 -22 2 4 -22 -28 -9 21 13 -23 -16 16 20 -25 -32 13 13 4 -16 -7 25
5238 25 19 -2 -5 -1 36 1 -18 -13 16 8 -24 -16 3 19 -27 -41 -7 11 3 -26 -28 -1 4 -27 -31 -14 2 -4 -28 -17 14 10 -14 -20 11 18 10 -11
5276a1J6J3%k3MK2Qj6l0J8J7mk2rK8Ok9rOJ4Ok9pJ4K3j3j5NJ1jj4MK4Ok7jK0J
5314F%qlJ3J6j4j8J9J5j1j9mK5%k0nLJ8rk6mK6J0k6rJ6K6l3j8K3J8ok4%K1J2j2
5351bk1NK7J2k7j2K8J5k0j2NL3rm5J9J1J5k2j0J5Qnk4JK7Pk5j5PL0j9l0J7K4p
5386Al0J4J5Rk2j4J6J3J0k0j6L5J3l2nK8Mnj8%K6kj2j3J4J0jl0JK4Kk9oK1J2k1
5422hk0J6J8j5j4LJ0J4j0j8NL4pk9OL2lk2nJ3J1pmOOPj5kmJ7Lk5QLLj0qN%Lj8
5463b1jK0%nj1oJ8j2nmL6j1j0qJ6MNj4LJ4Nj3j8J5K1Rl8OL0j5%k8K4Qj5j1MNk
5502eqqJ9J1ol5K8J0qj8JJ7%j6jJ0J1jj7kL4Nj8j9K3K5k6k5RL5j3k5J2J2Npqj1
5540a0K0%l5MK7J1j9k5NK6nk6RK6pj5KJQjj1NJ7Pj5j1RJ5j1oJ3NJj1oK2Kj3j1
$$ plain form
5276 -11 5 18 18 -5 -1 21 29 13 -17 1 18 14 -8 -17 11 17 -12 -21 -15 -1 5 -24 -31 -17 6 -7 -22 -17 -6 -7 -21 -17 7 13 -14 -15 5 6
5314 6 6 -2 -5 8 24 10 -8 11 26 15 -4 -8 17 17 -3 -8 -5 13 4 -22 -26 0 10 -16 -25 -9 17 -16 -34 -11 7 1 -23 -23 -2 10 -2
5351 -2 -23 -18 9 21 -6 -18 10 25 5 -7 -2 31 22 -23 -4 7 22 0 -10 5 13 8 -16 -15 12 19 -6 -21 -14 16 -3 -33 -16 8 1
5386 1 -29 -15 0 9 -13 -27 -11 2 12 -8 -24 11 24 -8 -13 15 19 14 -4 -4 22 20 8 -5 9 19 18 -12 -11 13 15 -14 -20 1 13 -8
5422 -8 -28 -12 6 -9 -23 -20 -10 4 -6 -24 -19 15 8 -21 -15 17 14 -8 -13 0 11 4 0 6 12 19 4 2 -2 15 18 -7 1 4 7 -3 -11 -6 -6 -3 -21
5463 -21 -22 -2 -2 -7 -18 -24 -6 -18 -23 -27 9 -2 -12 -20 -4 0 5 -9 -6 8 13 0 -18 -3 18 27 -11 -5 25 10 10 -18 6 14 -1 -12 -8 -3 -5
5502 -5 -13 -21 -2 9 3 -32 -4 6 -2 -20 -19 -2 -2 -18 -19 -9 2 1 -16 -18 16 21 3 -16 7 32 6 -19 -10 25 12 -13 -1 11 16 9 1 -10
5540 -10 10 10 -25 -21 6 17 -2 -27 -22 4 -1 -27 -18 8 1 -14 -12 -11 -3 -4 -15 -10 7 14 -1 -12 -3 12 1 -5 8 13 14 3 -3 19 21 8 -3
5579c%J0Jk1lK1%j1pNQj3nMK4j2qnJ0J3j8rnJ7%kLRj0J6k1J3ROjj0lMjlnJ7Qk7
5623ej3J6Nj3mOKmqpJ1J9j0j0mJ1J5k0LPjkj4K0Pnj0%K0KKk1LJ0jj0oK8Ql3lJ4
5665ElPj8JJ1lmk1QK2qpmMK0l2mK8Pj0k3J1J7Pj0k4L3Pj5j6K8%Jj7NJ7mj9j0K1
5705HJ2j1k1J3jJ2k4KJ6kj5pQJ0j4qOJ0Jj4oJ5J7kj0rK3%j8j0K4J6rj8J0QJj0
5743CjJ0jqj2LJ6rj0pJ5jojkJ1j4NqPjjMKMQj7LJ5%lqJ0JOrNnMJ1j0Lj%j1jJ2
5790A1qj1LJK0j0j0q%KnmoK2Nj4pJ6lj1j2J5J2Oj4%J5Qmj0LJ7oj2LPNk1oK3Lk4
5832iMMJ2nj0mPOjk3%J2lkj5L3j4j0NlK0rpPOJ0k3%J7Ooj2NJ1Kj7KJ8Kk7J0nJ8
5875A2kj8jJ4Lrk4J3J5pk0jK4jj6PNo%lONJ2j5lQQrlNK2j5KLpMlRmkNnj5R%Nj7
$$ plain form
5579 -3 -3 7 8 -13 -16 5 5 -6 -13 -8 0 -13 -18 -14 10 -2 -10 -15 -5 8 -10 -19 -24 -7 -7 -9 -6 3 -7 9 -12 1 10 16 15 5 2 6 5 2 -3 14 22 -5
5623 -5 -18 -2 3 -10 -14 -8 -6 -10 -18 -25 -14 5 -5 -15 -19 -8 7 -13 -10 -3 -4 -6 -20 0 7 2 -8 -8 12 14 16 -5 -2 8 7 -3 -9 19 27 -6 -9 5
5665 5 2 9 -9 -8 3 0 -4 -25 -17 5 -3 -10 -14 -10 10 -22 -26 2 9 -1 -24 -13 4 11 1 -23 10 17 2 -14 14 14 15 -2 3 20 16 -3 -13 8
5705 8 20 9 -12 1 0 12 -12 -10 6 4 -11 -18 -10 0 -14 -22 -16 -6 -5 -19 -25 -10 7 5 -5 -14 9 9 -9 -19 5 21 12 -6 4 12 13 3
5743 3 2 12 11 3 -9 -6 10 1 -9 -16 -1 -2 -8 -9 -11 0 -14 -9 -17 -10 -11 -12 -8 -6 -2 6 -11 -8 7 7 4 -4 6 7 13 4 9 4 8 19 9 12 11 11 0 -1 11
5790 11 3 -8 -5 -4 16 6 -4 -12 -12 -10 -15 -19 -25 -3 2 -12 -19 -3 -6 -17 -29 -14 -2 4 -10 -10 5 13 9 -1 2 19 13 1 4 11 16 -5 -11 12 15 -9
5832 -9 -5 -1 11 6 -4 -8 -1 5 4 -19 -19 -7 -10 -12 -27 6 -8 -18 -13 -16 4 -5 -12 -5 1 11 -12 -12 5 11 5 -7 -2 9 11 -6 -4 14 16 -11 -1 -6 12
5875 12 10 -8 -9 5 8 -1 -25 -12 3 -4 -24 -25 -1 -2 -18 -11 -6 -12 -12 -15 -9 -4 8 -7 -10 -2 6 -3 -6 -1 21 6 8 11 4 8 5 14 10 8 13 8 -7 2 2 7 -10
5922a0PJnpJ3j2kjJ1j5LJ4j2L%J0oJ2mLjoNJMoPJJ0j3Rj7RMoJrJ4llj0POrMoP
5969Cjj0j6K3Kj3lRJ4pmnJ8qj1NJ4Omj8J2KJ0j8MJ2J1j9lKMj5kLPLpj9JJ7j0p
6011a8J0QqqoK4loj1J5J0nj6jJ6J4j7MRLLj2%J9pj4mJ1J1j5QqJ2mj8NkoJ3k1J1
6052dJ6k1oJ7%j7KJLKRj2MQonMMMmJ6%nJoJ3j6%jKJ%j1J3j5PrJ3qrKLkRj1N%o
6100a5MlQ%jNMLqMNqLK%Rmjj1J3ml%QmjnqJ5j3LjkNrMqPmmrRPkoOJ7j0rQ%J0k
6153Dj1PQ%rOJ6Kk1j5K0J4j6pNoRj4MRNj6OqMPk5QK0lj8MJ0lj4KJ9J3j9nPLJ3
6196A5qmMRnj5J3J3Pl6J9JKk0J1omJLkmlJj1J3l%q%KMkKJ4oK%jK%mRoK9k3lMP
6244A3j0kJ4j3ljOj1J2nkmPoNj6K5j5KknK%oLpJ4MnMmQlprJ7J0llPpJ8j2onJ9
$$ plain form
5922 -10 -3 -2 -7 -14 -1 -13 -15 -16 -5 -20 -17 -3 -15 -12 -12 -2 -8 4 0 3 2 -4 1 2 6 0 7 8 18 5 14 -3 6 10 4 5 -4 10 7 4 -6 1 7 -2 2 -4 3
5969 3 2 -8 -24 -1 1 -12 -15 -6 8 1 -3 -8 10 2 -9 -4 10 16 12 -6 6 8 18 0 4 16 27 8 5 7 11 -4 -6 -3 4 7 0 -19 -18 -1 -11 -18
6011 -18 -8 0 -8 -16 -22 2 -1 -7 -18 -3 7 2 -14 -15 1 15 -2 2 11 14 17 5 5 24 17 3 -1 10 21 6 14 6 18 14 -4 1 -1 -7 6 -15 -4
6052 -4 12 -9 -15 2 2 -15 -13 -12 -9 -7 2 -10 -6 2 -4 -9 -5 -1 3 -1 15 15 10 11 5 18 2 2 1 3 4 4 -7 6 -9 -2 -11 2 -6 -15 -13 -10 -12 -3 -14 -9 -9 -15
6100 -15 -11 -14 -6 -6 -7 -2 2 5 -3 1 6 -2 1 3 3 12 8 7 -4 9 5 2 2 10 6 5 0 -8 7 -6 -3 -4 -6 -1 -10 -6 -14 -7 -11 -15 -24 -15 -8 -10 -16 -10 7 -3 -12 -4 -4 6 4
6153 4 -7 0 8 8 -1 5 21 23 2 -13 7 21 5 -2 3 -3 6 -8 -4 5 10 -6 0 -8 -4 3 -22 -14 6 3 -15 -11 -1 -4 -18 -16 3 16 -3 -8 -1 2 15
6196 15 7 3 7 16 11 -4 9 22 29 -7 12 13 15 -5 6 0 -4 -3 0 -2 -6 -9 -8 -19 -6 -9 -9 -17 -17 -15 -11 -13 -11 3 -3 -1 -1 -2 0 0 -4 5 -1 28 5 2 6 13
6244 13 3 1 15 2 -1 -2 4 -7 5 0 -2 -6 1 -5 0 -16 9 -6 -4 -6 -11 -9 -9 -15 -12 -19 -5 -1 -6 -2 -6 2 -1 -8 -17 0 10 7 4 11 4 22 10 4 -1 18
6290A8qo%jjoMJkMj6%J2j2kKJ1qmjmNNj1J7PkpJQlMnjJ6Jk3JJ8km%oJ4kk0O%o
6339hNn%Qj8oOPJj1LRRj5oJ2Qjj5J6JQnKrJ1pLRLnj2JJ5Pk0%J3qrLjnOrMOrJ6
6388Hk1J0KoqLJrMOJ6rJmJ%MLMqJ0rKKNmjOqnQj3J1%K%Lj4Olp%Oj%qQlmOmLRl
6442bLnROj0rJ5KLrQrMJkj3J9kj4Oj0RjKn%qklJ3Lj1mNPNj8jK3j2%jKJ4j2mRN
6490FNqPKj1Mj1J6KomLKJqjPj1Pj0J%lQj1QLrjMOnkJ1knmPJ0Nj1jkJ0j3MJ3jo
6539FkpJ0Kj1MmJp%KOpRj2pOKKMoMJjjnKJ2j2J0QpM%Pjm%j1J6mrPJ0pj6PMloN
6590ApPrOlkOj0jkQlRqlNjQj4K2j0Kj5K4kjMmOlmjJ1j0On%%OJj7J7qjj1NJ0rj0
6639a0PrOrJnLOjkJ4kj0QKmMrMJ6KkmqPJj2J2oLJ0mlj4MjMpLpJJJ1j2jlOoKjj1
$$ plain form
6290 18 10 4 4 3 2 -4 0 1 -1 3 -13 -13 -1 -13 -15 -13 -2 -10 -14 -15 -19 -14 -9 -20 -3 4 2 -5 -4 4 1 5 0 -1 15 16 -7 -6 12 10 6 6 0 14 12 -8 -2 -2 -8
6339 -8 -3 -8 -8 0 -18 -24 -18 -11 -10 -21 -18 -9 0 -15 -21 -9 -1 -2 -17 -1 0 8 3 5 -4 7 0 3 12 15 10 -2 -1 14 21 1 1 14 6 -3 0 -1 -6 0 -9 -5 1 -8 8
6388 8 -13 -3 -1 -7 -15 -12 -11 -20 -16 -10 6 -3 -2 -6 -5 -5 -1 2 6 -2 8 -1 1 3 8 4 3 9 1 -4 4 -9 2 2 4 4 7 -7 -1 -4 -11 -11 -5 -6 -6 -14 -6 -9 -13 -7 -11 -8 1 -2
6442 -2 1 -4 5 11 1 -8 7 9 12 3 11 2 6 7 5 -8 11 9 -5 1 -9 0 -1 1 -4 -4 -12 -14 -17 -4 -1 -12 -16 -11 -4 1 -17 -18 5 -7 -7 -8 -6 8 -4 -8 1 6
6490 6 11 3 10 12 1 5 -6 10 12 6 2 5 7 8 0 -1 6 -5 2 -8 -7 -7 -10 -2 -13 -5 -2 -11 -12 -8 -2 -7 -9 2 0 -5 -9 -2 8 13 2 1 -1 9 -4 0 13 12 6
6539 6 4 -3 7 9 -2 2 -2 -1 -8 -8 -6 0 -7 2 -10 -17 -11 -9 -7 -3 -9 -5 -4 -5 -6 -11 -9 3 -9 1 9 2 6 6 13 12 8 8 -3 13 9 0 7 17 10 -6 1 5 2 -4 1
6590 1 -6 1 -8 -2 -5 -7 -1 -11 -12 -14 -6 -9 0 -8 -11 -6 -7 1 -13 9 -1 1 -14 10 8 7 11 7 13 10 6 5 16 6 12 7 7 7 13 14 -3 14 6 5 -6 -1 9 0 -10
6639 -10 -3 -12 -6 -15 -14 -19 -16 -10 -11 -13 1 -1 -11 -3 -1 -5 -1 -10 -6 10 12 10 6 -2 5 6 -6 6 0 3 13 9 6 -8 -4 -5 -1 -8 -5 -12 -11 -10 1 -11 -12 -15 -9 -15 -13 -14 -25
6690b5J8joJ2j0MLj%Q%kKMRj0kJKlJ0j0kkqmQkLrR%k%j0JJKJ3j1JkQj6J4Oj4J0
6738cNnLLmONj1LjKmOmPlKj1Mj1mPONj2%pLOj1JNjLnOJ3q%%mMNKJMpQoP%lLJp
6793DljQll%pJ5nnmNj3RMrLj0J0nMLkJjjkJ0mnJ3Oj1%K%%J3rRnpRj3JkoJ3lr%
6844fkJ1pl%lkRLnj0LlJ0nRqLnJ0J0rLKjJqOLJ4k0kmJ7mnqJ3oj1NoJ2j3pNJ1n
6892hNlqRlqJ3LKrJ1Kj0KmJ1kJrOKM%j1RolOM%pqKjKLpmJMjJo%%jkKNMLkL%mL
6948d%lMJJ1j1%QJrj%MoPpLmLlKjkQopqJ4kj2LqJ7rJ1j2LJ4j0mNJ2Npl%K%MqJ2
6999GkK%kQk3JPjmoJ0pJj1J4jkKj4J1ljjKMnLLNKOlNJlOrJj%RoJkKRj2Lj2NMJ
7052DoJJljj4MOJKj0KNmkJ3%nQkMNj0JOJ1j1PNlNj2k%%Om%mNj2PokoJ0Lj4Qkl
$$ plain form
6690 -25 -7 -8 -14 -2 -12 -8 -5 -6 -6 2 2 0 2 6 15 5 3 4 6 3 13 3 1 -1 -9 -13 -5 -7 -4 -13 -4 -4 -6 -6 -16 -15 -14 -12 1 -10 -9 -11 -3 -19 -5 1 -13 -3
6738 -3 2 -3 0 3 -1 5 10 -1 2 1 3 -1 5 1 8 5 7 -4 0 -11 -15 -8 -2 3 -9 -9 -16 -13 -7 -18 -17 -12 -13 -10 -15 -9 4 -4 -4 -4 -8 -4 1 3 4 8 1 9 3 10 10 7 10 11 4
6793 4 1 0 8 5 2 2 -5 10 5 0 -4 1 -12 -3 1 -8 -5 -15 -5 -10 -6 -3 -5 -4 -5 -6 -8 2 -2 -7 6 12 1 1 3 3 3 16 7 16 11 4 13 0 1 -1 -7 6 3 -6 -6
6844 -6 -8 3 -4 -7 -7 -10 -12 -3 0 -5 -15 -12 -15 -5 -10 -1 -9 -6 -11 -1 9 0 3 5 4 5 -3 3 6 20 0 -2 -6 11 7 2 -6 7 1 -10 -5 -11 1 -12 -19 -14 -3 -8
6892 -8 -3 -6 -14 -5 -8 -16 -3 0 2 -7 4 6 -4 -2 -6 5 3 4 -5 1 3 7 7 -4 5 -1 -4 2 6 6 -1 -9 -7 -8 -6 -3 -10 -14 -13 -9 -10 -9 -15 -15 -15 -16 -18 -16 -11 -7 -4 -6 -3 -3 -7 -4
6948 -4 -4 -7 -3 -2 9 -2 -2 6 7 -2 -3 -3 1 -5 2 -5 -2 -6 -3 -6 -4 -5 -7 1 -5 -12 -20 -6 -8 -20 -17 -25 -8 -17 -6 -18 -15 -1 -11 -15 -10 2 7 0 -3 -3 -1 -1 3 -5 7
6999 7 5 7 7 5 13 -10 -9 -2 -3 -7 -13 -3 -10 -9 -20 -6 -7 -9 -7 -21 -10 -13 -14 -15 -13 -9 -14 -11 -8 -3 -1 5 2 7 8 5 11 2 3 2 2 11 5 6 4 6 15 3 6 -6 -1 3 4
7052 4 -2 -1 0 -3 -4 -18 -14 -8 -7 -5 -15 -13 -8 -12 -14 -1 -1 -6 2 0 4 9 -1 0 6 17 6 13 18 15 20 8 6 6 6 12 8 8 4 9 -3 4 -2 -4 -10 0 3 -11 -3 -5 -8
7103hJ9j0k0J3rJ3pkNRj7J3J1j1j2K0KlOM%j4Q%rJ1nlj0QRoj0J1onqmPMpNO%j
7148cj1kRllnK2lpLj0K3%j1LjJOOmR%j9J7pmj2PPLj6MpJ0nmMprJ3Kk%j0ONKln
7197a1QJ1j1qJ3J3j1rK0ojjj3LJ7lr%JOmj5J0%mLj%ql%J3j1kKMlpLKJ7oqPMko
7244fKOj0J4jmrJ2NpJ3rj0jMJ2j4jK%rRKqjPp%rJ0jqRLj5J8Rj6Qj5J6jpJ8oLl
7291DoMRj0QJjJrpLJ1j4kJ6j0j2QpJ7j9RKj0KKmKMJrJ4J0kpnOqJ8rjJ4k2J0Mk
7337DJnmJ0Qqj1QkJj3M%JpOnKM%nJOmqJ2J3j8nJ5mKKqjJ1kmJ2%qQrJOj5LRMj7
7387inRJj1JJKpJ3lpjPjlJ2qlROj8J8oOkKoRj3PLmMjjnJ8j2j1NlOJj6J2lnLLj
7437gj8RQj4RPj0oJ0Oj6K4mJmnK3oKj8J6%qJ1nRj0Lj4MP%j3JRrn%J2pm%lKoNj
$$ plain form
7103 -8 11 1 -19 -6 -15 -2 -9 -11 -6 3 -14 -1 10 -1 -13 7 9 6 12 16 16 2 10 10 1 12 7 4 -6 2 11 5 -5 6 0 -5 -13 -17 -10 -6 -13 -8 -2 -2 -3
7148 -3 -14 -16 -7 -10 -13 -18 4 1 -6 -3 -13 10 10 -1 2 1 2 8 14 10 19 19 0 17 10 6 -6 1 8 11 -5 -1 -8 2 -3 -7 -3 -10 -19 -6 -4 -6 -6 -16 -10 -5 -3 -6 -11
7197 -11 -3 8 -3 -11 2 15 4 -5 15 9 8 7 -6 -3 14 11 2 2 3 9 5 -10 0 0 -4 -1 -2 -2 -10 -13 -13 0 -11 -13 -11 -7 -10 -17 -14 -12 5 -1 -9 -2 2 0 -6
7244 -6 -4 2 -8 6 5 1 -8 4 9 2 15 6 -4 -5 -1 11 -3 -4 -2 -2 -11 -2 0 -8 -9 -2 -9 -9 -18 -8 -9 -17 -8 -5 -20 -2 7 -9 -1 -16 0 -1 -8 10 4 7 4
7291 4 -2 2 11 1 9 10 9 10 1 -6 -3 8 -6 -8 8 -2 -14 -6 -13 4 -15 -6 -4 -14 -12 -10 -14 -12 -8 -7 -16 -2 8 6 -1 -6 0 -8 10 1 0 14 -8 2 6 4
7337 4 5 0 -4 6 14 6 -5 3 1 2 -11 -7 -7 -6 -13 -7 -12 -10 -6 -6 -11 -10 -4 -8 -16 -4 9 -9 -14 1 -3 -1 1 -7 -8 3 1 -3 9 9 1 9 0 1 7 -8 -5 4 8 -9
7387 -9 -14 -5 -4 -15 -14 -13 -11 -18 -5 -8 -15 -16 -9 -10 -13 -1 -9 -12 -3 3 -15 3 -3 3 1 3 -3 6 -7 0 3 -1 3 2 1 -4 14 2 -9 -4 -7 -1 0 -16 -4 -7 -12 -9 -6 -7
7437 -7 -25 -16 -8 -22 -13 -6 -16 -22 -12 -6 -22 2 -2 -1 -5 -10 13 7 9 -9 7 7 -1 10 5 14 4 7 -7 -3 4 4 -9 -8 1 -8 -13 -13 -1 -8 -12 -12 -15 -13 -19 -14 -15
7484a5OKk0J3Rlk%PKJqJ1J0qqJ1Pj2mJ5j1PpLj3RqLlQlj5kPlqkJ3%nlJ0RqlPP
7532CklmJ5kjj7QkJ2%qPJJj3OMjj2J4pPj0q%J5j5mLpMLjLoNJ0j4J1Jj4PJ2JpJ
7579dJ1Jj0JQoJ1j4OkOQqoLl%J1j4p%oJ4oj0QOnKpRj3QKMOrnQPPk4K0jNnqJ6o
7628IllONjMj4OKlj6NOrj0JK3k2mPnPkKnQ%lj0J3J0ojJ0nrJLJ8moPLj1%j1J3p
7676aj%Mm%oJ%J2mqMkj0nJ5KJrPLmLrJ6OrpQOjrNJ0qOJj0QqNLoKl%jLppRJj0%
7730hPj2J1j1OjQJpPmOj7%J2KqJ1J2j5Lj1J5%kOj1LLj1lJ1OJj5mJ6Jk8K4Kj1n
7773a0nRmmNlK%JkJ0lRmMnljJ8nj8RLJkNnOrNKK%nj8NJ9j3j1L%Lr%J3jLlOpQn
7825dL%jJrJ5J1j0qJ2pjNmMlpNjPj0lkJ0Pj6JNjj5kPRj5J5mkPj3OKpJ1mJJ8j4
$$ plain form
7484 -15 -9 -7 -27 -14 -5 -8 -10 -10 -3 -1 0 -8 3 13 5 -3 8 15 3 -1 14 3 10 3 6 -7 2 -6 -3 -6 2 -1 -16 -18 -11 -14 -22 -24 -11 -11 -16 -19 -9 0 -8 -11 -4 3
7532 3 1 -2 -6 9 7 6 -11 -3 -5 7 7 -1 6 7 8 -5 1 5 4 -8 6 -1 6 -4 -12 -12 3 -12 -16 -13 -20 -16 -13 -14 -11 -17 -12 -2 -16 -5 -4 -18 -11 1 2 -5 -4
7579 -4 7 8 -2 -1 7 1 12 -2 4 2 8 16 8 2 5 2 2 13 -1 -8 -8 -14 0 -6 -16 -8 -2 -7 -5 -12 -3 -16 -8 -6 -2 4 -5 -10 -2 5 12 -12 8 7 12 7 -1 15 9
7628 9 6 3 9 14 13 17 3 9 11 8 -8 -3 3 -6 -16 -15 8 -14 -18 -11 -16 -9 -11 -9 -14 -6 -6 -9 -19 -6 4 -2 -3 7 2 -7 -6 -3 15 11 5 12 15 4 4 -7 6 -1
7676 -1 -2 -2 2 -2 -2 -8 -7 -7 5 1 -7 -3 -5 -15 -20 -5 -3 -2 -11 -4 -1 -5 -2 -11 5 11 2 -5 3 9 8 -1 4 14 6 12 13 3 11 3 8 11 5 7 4 4 3 6 -1 -8 1 2 -8 -8
7730 -8 -1 -13 -2 -13 -7 -8 0 1 -6 1 -3 3 -14 -14 -2 0 -8 3 15 0 3 -8 7 7 5 11 0 3 6 -5 -8 3 9 10 -5 -9 7 8 -20 4 6 -5 -10
7773 -10 -15 -6 -10 -14 -9 -12 -10 -10 -9 -11 -1 -4 5 1 5 0 -3 -4 14 9 -9 0 3 4 2 7 2 8 -1 4 6 8 8 3 -15 -10 9 -4 -15 -12 -12 -9 -18 -18 -5 -6 -3 -6 0 -7 1 -4
7825 -4 -1 -1 -2 -1 -10 5 16 6 -2 10 3 2 7 3 7 4 -3 2 1 8 -2 -5 -7 3 10 -6 -5 0 -1 -16 -18 -11 -2 -17 -2 -6 -8 -1 -14 -8 -6 -13 -2 -6 -5 13 -1
7872akJ0Jj1OKjOpJMmnlJ0m%Jj2J8rmj3NJ6k0OmJ0qmNjRlQlKmJQk%kNQmrlkJ8
7923A5j6L%PjqJkLNj4lJ1kj5RPj2mjJ4n%mJ0j2J1JlOJqkJ8%j0kkJ0oOjRj1lmJ6
7970A2j4KKlLooKNOj1pJ2%j3KJ0kpLKj%jJ2lLnLKOj3PmNqKPJLJj4Pj4K0k1OKQ
8019Clj0lRj0j0J0RjkjjPKm%J0lqMJ2kj8J1PMj2QNj0oMlNpmJ%JmnJ0LlLj6J6m
8067fj3J4Jpj1MQPnJJPnJM%kpOPojkJ4qjlLkPj4j%J0j1jPlj0qJ4J3j4%l%Qj2J6
8116clMj6NMMNrONOmmL%nMpRl%KjkmpJNqNrRlkkQMpLmJ1lqmJ4j7J0lMJ1%j2J1
8169CNmlmJ1j0K0j9MmLnPj0J0j1nNNnkQ
$$ plain form
7872 -1 -3 7 8 -3 3 5 4 10 3 4 8 4 -1 -4 6 2 2 3 -9 9 0 -4 -17 -12 4 -16 -10 -14 -4 -12 -16 -11 -12 -3 -6 2 -1 1 -3 -2 6 4 4 2 7 15 11 2 -1 -3 15
7923 15 -1 2 2 9 8 0 1 -1 2 7 -7 -10 1 -1 -16 -7 0 -12 -16 -17 -3 -8 -8 -12 -2 -14 -3 -2 -5 1 2 -6 -8 10 10 0 -2 -4 6 0 6 5 14 3 0 -4 12
7970 12 -2 0 2 -1 2 -4 -10 -8 -3 3 -8 -15 -3 -3 -16 -14 -4 -6 -13 -10 -8 -9 -9 -10 2 -1 2 -3 0 2 8 -5 2 -2 3 -5 -3 4 5 8 9 -5 2 -12 8 -13 -7 -5 3
8019 3 0 -10 -13 -4 -14 -24 -14 -5 -6 -8 -9 -10 -3 -1 -5 -5 5 2 -6 -2 10 8 -10 1 8 12 0 8 13 3 -3 1 -2 3 -4 -8 -7 -7 -6 -10 -15 -5 -2 -5 -2 -18 -2 -6
8067 -6 -19 -5 -4 -11 -22 -18 -10 -3 -8 -7 -6 1 -4 -3 1 1 -1 -8 -2 5 -1 -2 -4 10 2 1 -2 1 -1 6 -8 -9 -9 1 -10 -11 -4 -7 -17 -25 -11 2 -12 -12 -15 -15 -7 -19 -3
8116 -3 -6 -2 -18 -13 -9 -5 0 -9 -3 2 8 4 0 3 3 -2 2 -5 4 1 1 3 2 0 -4 -11 -10 -5 -13 -8 -17 -8 -11 -13 -15 -7 -3 -10 -7 -11 0 -3 -11 -15 -1 -18 -8 -11 -7 4 4 -8 3
8169 3 8 4 1 -3 8 -2 18 -1 3 -1 2 -3 4 -6 4 -7 -12 -7 -2 -7 -9 -1
8191a
$$ Imaginary data points
##PAGE= N=2
##DATA TABLE= (X++(I..I)), XYDATA
0@%%%%%%%%%%%%%%%%JrJ6j6J6j6K4l2L2l3M1m8N6o5P3q8R7j06J22j38J56j79K01
39A05k23K47k74L06l38L75m15M58n07N59o15O76p45Q22r05J001j110J229j366
58g20J525j709J929k198K531k958L530m336N565p691J2365m0198L0903Q0599q2754
73c617n8096N3222N8180l7681l8958N794K8327J8041r092m7130k767O6216J7188
86D9627q3312k4134Q8848L0704q8924l0988P8193L0435o2364k5672L9381K1021
98B2815j4835j4692j1371R800L4670n119n4462K441O7678p48p4088P75P2654j346
112C4172o4393K512N0086l218l1764L316J1387k174Q503j23k6090L671L9381q092
126A7174m7322J2905M9214j7484m5397K1163L6659k3337k4443K3558J0485k1593
$$ plain form
0 0 0 0 0 0 0 0 0 0 0 0 0 0 0 0 0 0 1 -8 8 -8 8 -8 16 -16 16 -17 24 -24 32 -33 40 -48 49 -57 65 -73 83 -96 105
39 105 -118 129 -145 161 -177 198 -217 241 -266 293 -322 354 -391 431 -474 527 -583 646 -720
58 -720 805 -904 1025 -1173 1358 -1600 1930 -2406 3159 -4532 7833 -32365 -1462 79137 -3617
73 -3617 -61713 -8491 49689 12008 -26950 -21156 7171 25212 16120 -31010 -33777 32439 49627
86 49627 -33685 -57819 31029 61733 -27191 -58179 20014 50449 -11915 -37587 1794 22815
98 22815 7980 -6712 -18083 -8283 26387 21268 -33194 -30753 36925 36177 -37911 -37136 35518 34172
112 34172 -30221 -27709 22377 19159 -12605 -9289 2098 -76 8427 8304 -17786 -14115 25266 17174
126 17174 -30148 -17243 31971 14487 -30910 -9747 26912 3575 -20868 2690 13175 -8418
138h418L344J7558j5301j1636K4054M417k8602L511K8584j1291k4221J8252J6292
151A6543k3702o009K7141n207k8313J5723K7122k4156k3769K9248J8526l0243
163g096j2023K6831M871j9286K214Q480q581M331J3812j7622j7515K9838J9490
176B7744l9280j9777M4748J8606m5401j6242M0925J3194l1722r852J8570O615
188H128k950l826j3541J553K9197J22m2300j350N1401K335n5526l326N4225M581
202B8723m7552o221L6221Q304k1271j0753M303J3338J3098j5716k9188J7454M2407
215C3147j8189n1489J7525N5546j5243n4356J1283M8003n735l7328j075K3444
227E533Q645p869j6288p793K3292K2014k8838l3431L2327M1034l3164m4245L1117
$$ plain form
138 -8418 -5074 12484 -2817 -14453 9601 14018 -14584 -11073 17511 6220 -18001 251 16543
151 16543 -7159 -13168 13973 8766 -19547 -3824 23298 -858 -24627 4621 23147 -7096
163 -7096 -19119 7712 12583 -6703 -4489 3991 -4590 -259 13553 -4069 -21584 8254 27744
176 27744 -11536 -31313 13435 32041 -13360 -29602 11323 24517 -7205 -17057 1513 8128
188 8128 5178 1352 -12189 -10636 18561 18683 -23617 -24967 26434 28769 -26757 -30083 24142 28723
202 28723 -18829 -25050 11171 19475 -1796 -12549 -8246 5092 18190 2474 -26714 -9260 33147
215 33147 14958 -36531 -19006 36540 21297 -33059 -21776 26227 20492 -16836 -17911 5533
227 5533 14178 6309 -9979 -17772 5520 27534 -1304 -34735 -2408 38626 5462 -38783 -7666
240g666M3049k6126l7846J8543K9449q963j8979j771P638J2663L319k2734j2849
253b2273L0897K0082l6382k4534L8544K6013l7195k4661L2430K0939k4648j5533
265a6321J4686R245l454k929p861k651J8243O918k6641r433L2284J0046l4666
278a2534q862L3596O214k9326k702K2391j093j3620M458L998o821N338P793j3478
292d648p174J9599M977k3082j467K3726k872k1594P495J7145j1687j1033J4861
305D246M177j6573K533J6511q253j4580J2260J0914j4128n857J3631j31j0913
318f163O326O446j2181q99J7128n011k0540J0367K2145j4403k1699J6463J9306
331A7285j6147j5138J3381R665q373l465J694k944N957Q882j3617j3845K0337
$$ plain form
240 -7666 35383 9257 -28589 -10046 19403 10440 -8539 -10310 -2672 9991 13310 -9424 -22273
253 -22273 8624 28706 -7676 -32210 6334 32347 -4848 -29509 2921 23860 -788 -16321
265 -16321 -1635 7610 4156 1227 -6634 -9285 8958 15876 -10765 -20198 12086 22132 -12534
278 -12534 -21396 12200 18414 -10912 -13614 8777 7684 -5936 -1478 2520 -4301 1037 8830 -4648
292 -4648 -11822 7777 12754 -10328 -11795 11931 9059 -12535 -5040 12105 418 -10615 4246
305 4246 8423 -8150 -5617 10894 2641 -11939 321 11235 -2893 -8750 4881 4750 -6163
318 -6163 163 6609 -5572 -6471 10657 5646 -14894 -4527 17618 3215 -18484 -2021 17285
331 17285 1138 -14000 -619 9046 673 -2792 -1098 -4042 1915 10797 -2820 -16665 3672
344C672J7404k5276j9293K7616J9452k6991j8039K3301J5281j6801j1570Q109
356c135P360J920l051j2241r37K1779M414k9468p135L4426R110l6091j0300L4185
370A0836J0831k8870j0868K0615J0493j0235r859j239R023J2648q028k2911O852
383a0712L0940n500l5956L913L7466k034l5364p7K9915K467k1701m976J1631P544
397G556p77r973r769J2091J8970j3657k5905J4380L0011j4148l0982J2772K8846
410A9415j0259k4054O678J7209k271r168k631Q54P628O867j2216j3255J5968J7722
424A8487j8427j9920J9338J9809j8519j7578J6030J3668j2097q644P084L206j480
437I57J988m232o286R413R225j3668j0538J6567J0117j7825q154J7379M987j5292
$$ plain form
344 3672 21076 -4200 -23493 4123 23575 -3416 -21455 1846 17127 326 -11244 -3135
356 -3135 4225 6145 3094 -9147 -10084 11695 16109 -13359 -20494 13932 23042 -13049 -23349 10836
370 10836 21667 -7203 -18071 2544 13037 2802 -7057 -8296 727 13375 5347 -17564 -10712
383 -10712 20228 14728 -21228 -17315 20151 18117 -17247 -17324 12591 15058 -6643 -11619 12 7556
397 7556 6779 -3194 -12963 -872 18098 4441 -21464 -7084 22927 8779 -22203 -9431 19415
410 19415 9156 -14898 -8220 8989 6718 -2450 -5081 -4227 3401 10268 -1948 -15203 765 18487
424 18487 60 -19860 -522 19287 768 -16810 -780 12888 791 -7853 -769 2437 957
437 957 2945 -1287 -7573 1840 11065 -2603 -13141 3426 13543 -4282 -12436 4943 9930 -5362
451e362j149J1854k736p490O157K690q562K054R614o208r151R387P165j1261l922
466f920J1713k03j0778M635Q651q836n754J2274K442j4462P60J5085l416j4036
480h845N215J1339n886p251N439K199l923L368J543q747J270J3458m073j6999
494a1893O475J8917q028j9062Q453J7327p599j3938N477R174k250l613j760k231
508d551O032P854j0159j2621J3557J6130j5745j8051J6357J8324j5210j6908J2248
521b743J4136p730j0223K016N732M279j060j0531l430J6072P289k0263j0264K2579
535E859J2174k2732j2972K0630J2653j6438j1400J0519R432l480o995l946M341
548b355J1092j722j7183o35K1639K595k3973m066K4016M967k1740n393J7412N422
$$ plain form
451 -5362 -6511 5343 2607 -4883 1274 3964 -4598 -2544 7070 862 -8289 1098 8263 -2998 -6920
466 -6920 4793 4590 -6188 -1553 7098 -1738 -7492 4782 7224 -7238 -6478 8607 5191 -8845
480 -8845 -3630 7709 1823 -5428 11 2210 -1713 1655 3198 -5549 -4279 9179 5106 -11893
494 -11893 -5418 13499 5471 -13591 -5138 12189 4590 -9348 -3871 5303 3053 -560 -2320 -4551
508 -4551 1481 9335 -824 -13445 112 16242 497 -17554 -1197 17127 1917 -14991 -2743
521 -2743 11393 3663 -6560 -4544 1188 5467 4407 -6124 -9554 6518 13807 -6456 -16720 5859
535 5859 18033 -4699 -17671 2959 15612 -826 -12226 -1707 7725 4245 -2750 -6696 -2355
548 -2355 8737 7015 -10168 -10803 10836 13431 -10542 -14608 9408 14375 -7365 -12758 4654 10076
562A0076j1480n227M578M914K548m569r278M263J4895m005j8865L756K0841l428
576I019k0691K987J8495k265j4591J293R418J2l643j529k120L141P276m721j1313
591i232O123J3849p195j4687P747J3853p743j1537P071Q129n831m102M081o3j935
606a472L898m65o786K812Q536m914q974O633Q100p757o077Q209L221p942M7O975
622D044l279n429N999L484p883j331Q591p94q042K629O293m058l526M933N5n172
638c486L681M818p153m028R973L004j1776j840J2298P71j1430Q6R200n78n877
653b337O89J753m58K768j04p118P89J0857j475j3636K013J5060k235j4997K041
668f390J3459j418j0521L12O584J178j952k907k869M671P394o252j1206P449J3888
$$ plain form
562 10076 -1404 -6631 -2053 2861 5409 840 -8438 -4175 10720 6715 -12150 -8394 12447 9019
576 9019 -11672 -8685 9810 7545 -7046 -5753 3665 3677 34 -1495 -3615 -474 6802 2081 -9232
591 -9232 -3109 10740 3545 -11142 -3395 10458 2715 -8822 -1751 6378 547 -3555 526 463 -1472
606 -1472 2426 1961 -4825 -2013 6523 1609 -7365 -732 7368 -389 -6466 1743 4964 -2978 -2931 4044
622 4044 765 -4664 1335 4819 -3064 -4395 4196 3402 -4640 -2011 4282 224 -3302 1631 1686 -3486
638 -3486 195 5013 -2140 -6168 3805 6809 -4967 -6807 5491 6262 -5168 -5082 4118 3540 -2337
653 -2337 -1648 105 -353 2415 2311 -4807 -4018 6839 5364 -8272 -6259 8801 6566 -8431 -6390
668 -6390 7069 5651 -4870 -4558 2026 3204 1252 -1655 -4524 147 7541 1289 -9917 -2468 11420
683A1420q000j5228P753J5107o628j3608M663J0852j953p253j205L116M548J110
697D694p702n037J0341Q292j2103j0610J2788J1819j2253j1851J0511J0821p675
710B035q901M052O331L8l445m212N54Q015K090j1155m217J3225N692j4092o431
725a0421J3608O446j1831n837Q961M769n236l494J104K125L158r22o960l9J0012
740E443O93j2051r46J2807R35j2282o89J0523L33p814oM447j92q46K36k680k9
757b118N639l95p763R67Q909j652q984K360Q016k931o205L332L846l455j194L275
773A647j430k705L636J833n199p09N912n39n790J802M831k992l178L944J053m553
789b437J240M748l390m499N056L892o050k978O239J845n527o35M012n69j793J622
$$ plain form
683 11420 3420 -11808 -4055 11052 4424 -9184 -4521 6331 4378 -2875 -4080 -964 3584 4694
697 4694 -3008 -8045 2296 10588 -1515 -12125 663 12482 229 -11622 -1111 9710 2035
710 2035 -6866 -2814 3517 3555 110 -4102 -3548 4467 6557 -4598 -8815 4410 10102 -3990 -10421
725 -10421 3187 9633 -2198 -8035 926 5695 459 -3035 -1931 194 3352 2430 -4530 -4569 5443
740 5443 6136 -5915 -6861 5946 6881 -5401 -6090 4433 4766 -3048 -3054 1393 1201 355 591 -2089 -2118
757 -2118 3521 3126 -4637 -3670 5239 3587 -5397 -3037 4979 2048 -4157 -825 3021 -434 -1628 1647
773 1647 217 -2488 1148 2981 -2218 -2927 2985 2446 -3344 -1542 3289 297 -2881 1063 2116 -2437
789 -2437 -1197 3551 161 -4338 718 4610 -1440 -4418 1821 3666 -1861 -2496 1516 947 -846 776
805G76p99k450L495K933n882l149P706L125q757k866Q826K473p926j992O088J536
821C137l538j100M44P59K817n27n822L55Q307k01j0041Q6J0778J19j0464l99R090
838C800Q32o835j374L857K046n03k732k929L351O034l838q552M098J0197l998
853C454j0879L540J0483k648r104J427O886J19m113j831J080L509J960n019m607
868e743O114O732o796q041O861Q494o268q148N107P010l408n343J346L288R01
883B106j077l150r97N108K772o639m074P600M807p824m972P341M629o194l804
898d368M448K725k293j499p3K78K401P60m457j471N957J868o861j884P032J570
914D133o505j027N355L42l696L68J752r93K93J392k161j502L638J337m599q99
$$ plain form
805 776 -23 -2473 1022 3955 -1927 -5076 2630 5755 -3002 -5868 2958 5431 -2495 -4487 1601 3137
821 3137 -401 -1501 -1057 -298 2519 1992 -3830 -3475 4832 4631 -5410 -5324 5454 5573 -4891 -5290 3800
838 3800 4632 -2203 -3577 280 2326 1823 -909 -3838 -487 5547 1709 -6843 -2745 7452 3454
853 3454 -7425 -3885 6598 3950 -5154 -3727 3159 3278 -835 -2666 -1586 1923 3883 -1136 -5743
868 -5743 371 7103 307 -7734 -873 7621 1353 -6795 -1688 5322 1914 -3429 -2083 1205 2106
883 2106 1029 -2121 -3118 1990 4762 -1877 -5951 1649 6456 -1368 -6340 1001 5630 -564 -4368
898 -4368 80 2805 512 -987 -1060 -782 1619 2379 -2078 -3549 2408 4276 -2585 -4469 2563 4133
914 4133 -2372 -3399 1956 2298 -1398 -1030 722 -271 22 1414 -747 -2249 1389 2726 -1873 -2772
930b772M974K47m746N51L953j377k743K092J287k637K30K916j642k859K711K490
946B675l339j852L488R70l095N5K228j105j004K100m33k863J852L390l078l597
962c608L936L482m309l051M088K376l308j530K051N46m02L93j404j245L139J953
978C107m630k412N622K675o061k712N850K574m997k276L591J862j692j412m15
993a326R28K571m79m520Q2O028K63o972n74P250Q49o822j119N709J394m076j627
1010b441J983J866L03k067k545K197M515k229o000K155O878j913p074J521O560
1025C709r12n478J82L881O34j942j500r8K317K020l018l622L490M773l695n393
1041d652L597N437l170m969K453M058j477k810L49J364Q88P0k048j374L056K409
$$ plain form
930 -2772 2202 2449 -2297 -1746 2207 830 -1913 179 1466 -1171 -941 1975 333 -2526 185 2675
946 2675 -664 -2516 972 1942 -1153 -1098 1130 25 -979 1121 688 -2175 -323 3067 -11 -3608
962 -3608 328 3810 -499 -3550 538 2914 -394 -1924 127 673 271 664 -740 -1985 1154 3107
978 3107 -1523 -3935 1687 4362 -1699 -4411 1439 4013 -984 -3260 331 2193 501 -911 -1326
993 -1326 -398 2173 1694 -2826 -2744 3284 3547 -3425 -3999 3251 4100 -2722 -3841 1868 3262 -814 -2441
1010 -2441 -458 1408 1711 -356 -2901 -704 3811 1582 -4418 -2263 4615 2702 -4372 -2851 3709
1025 3709 2797 -2681 -2499 1382 2016 74 -1426 -1524 793 2813 -205 -3827 -337 4436 741 -4652
1041 -4652 -1055 4382 1212 -3757 -1304 2754 1277 -1533 -1184 180 1068 1138 -910 -2284 772 3181
1057C181l797l091M205L339m203l233L828K758l105k007K077J108q67j71m04o85
1073a067J613J322k602j705L323J783l659j562L589J131l192m77K452k17j484
1088g52Q61M40j403O09J697j504j761K149J556k483j131K472N17k161K22J562
1104H90r57p75J619p9k124Q98K408j543k466J983K251k101j803J915J164j410
1120a30m01O78m18K07J204j163j862J989K352k656k586K986K606k979k392K598
1136C3J956j857j377Q50P09L36k3j552o00K670J141l548j541M076J810m195j915
1153c027L873J875l134j737K064J499p43j214o99Q96K080n60l298K38M203N3m699
1170b330l22M747N60m304q04L473J012k302j187R04J349N54j433j939J468L100
$$ plain form
1057 3181 -616 -3707 498 3837 -366 -3599 229 2987 -118 -2125 -48 1060 193 22 -382 -1067
1073 -1067 546 1868 -734 -2439 884 2667 -992 -2554 1035 2166 -1026 -1503 949 732 -752
1088 -752 109 549 -854 -245 1452 -52 -1813 336 1892 -591 -1722 750 1267 -894 -672 890
1104 890 -67 -842 777 698 -1426 -528 1880 337 -2129 -146 2105 4 -1799 116 1280 -130
1120 -130 -531 147 -271 -64 1140 -23 -1885 104 2456 -200 -2786 200 2806 -173 -2565 33
1136 33 1989 132 -1245 -395 314 650 627 -925 -1525 1145 2286 -1262 -2803 1273 3083 -1112 -3027
1153 -3027 846 2721 -413 -2150 -86 1413 670 -544 -1243 -347 1733 1173 -2125 -1887 2316 2369 -2330
1170 -2330 -2652 2095 2655 -1649 -2453 1020 2032 -270 -1457 -553 796 1350 -83 -2022 -554 2546
1186B546j445l916J316M328j101m311Q16L840m29l027l4J966N16p43j018m81J490
1203C13J578j847k452K086L022k155l243K043L135j757k713J305K042p10j227
1218e80K2L51O43N05j287j218J801J708k149j956K295J947k220j691J925J275
1234A371j483o87Q80Q1k08N00m46r59J025J260j468j354J753J210j811r12J677
1251D29M52j346O1Q81n87l63J060j91j399O80J559j056j516J251J297j255r10
1268i53J084M03p40J57L17p50J97J272o88j646J063J899j350j916J392J789j288
1285B42j454R60R98m98m19r8j94P31P69j317j270J794J635k074j860K155J885
1302A985j966j753J571J462r41j076J71O40O24j44j441l11K142O93k619j024K872
$$ plain form
1186 2546 1101 -2815 -1499 2829 1728 -2583 -1767 2073 1644 -1383 -1417 549 1065 322 -696 -1177 313
1203 313 1891 44 -2408 -322 2700 545 -2698 -655 2480 723 -1990 -685 1357 647 -580
1218 -580 -558 -207 436 941 -346 -1564 237 1945 -204 -2160 135 2082 -138 -1829 96 1371
1234 1371 -112 -799 81 162 -46 454 8 -951 74 1334 -134 -1488 265 1475 -336 -1248 429
1251 429 881 -465 -404 477 -110 -473 587 396 -1003 -323 1236 180 -1336 -85 1212 -43 -953
1268 -953 131 534 -206 -49 268 -482 -285 987 299 -1347 -284 1615 265 -1651 -259 1530 242
1285 242 -1212 -252 746 248 -171 -269 -463 268 1037 -280 -1550 244 1879 -195 -2055 100 1985
1302 1985 19 -1734 -163 1299 358 -718 -547 93 717 573 -868 -1179 963 1656 -963 -1987 885
1319H85J232k835j333K498J350j935j257J138J107j93r14p53O77J641m22k369
1335a483J82K856N6l075k68K979M54k597o13J967P41j165q33K46Q99O57r16j491
1353a404R01K140q48k542P39K704n98k556L99K187j78j597j01Q89M05j30o87n89
1371h66R30J207j118j676J237J908j232j931J104J756r08j412O28R21k75l61j02
1388a90j92M70O57p71j020J006J229j138j255J155J128j061q46Q61M71n88m3K72
1406A45l84O8P32l91r60O29J080q05j022Q53Q26q04n13O48J29m18K98J38p02J63
1426b90J028m38j227O17J324p27j246P16J035n79p18L57K97n7J51k78n98N95R85
1445I47q62j270J021J451j071j471J000J328p62j097M30P55kl46m47r0Q82N15
$$ plain form
1319 885 2117 -718 -2051 447 1797 -138 -1395 -257 850 657 -257 -1010 -333 1308 886 -1483
1335 -1483 -1301 1555 1611 -1464 -1732 1247 1701 -896 -1509 458 1199 34 -799 -553 346 1003 87 -1404
1353 -1404 -503 1637 789 -1753 -1014 1690 1092 -1464 -1065 1122 944 -653 -754 135 540 410 -277 -866
1371 -866 64 1271 153 -1523 -286 1622 390 -1541 -437 1319 411 -1001 -373 548 273 -88 -190
1388 -190 -382 88 745 -26 -1046 -40 1189 51 -1204 -49 1079 18 -828 33 504 -84 -127 145
1406 145 -239 -171 561 170 -790 -161 919 114 -908 -55 771 -33 -546 102 231 -187 111 249 -453 -290
1426 -290 738 300 -927 -310 1014 287 -959 -243 792 213 -505 -148 149 92 243 -35 -633 -38 947
1445 947 85 -1185 -164 1287 216 -1255 -255 1073 311 -786 -356 399 397 51 -396 -486 396 911
1463I11j255q77J521J129j624j295J574J335j360j255R59J079m63q20j13N18P03
1480F67j95j240j26J684M09j960o20K041P86j929q75J628R01j160q52N58P64R0
1498E71o35p19M78J269k93j713J26J940N9k017j93J858L35j546m40J083N11n20
1516A54n63o2N71O30n53j124N49J467m98j650M05J669l01j504J82J192k7p90j21
1535c74L12K86J60m28o04N44R31o09j157O49J218o13j150N33R51l98o39K15L00
1554A27o7J06j29m22K80O90m07q56M92Q95n28q21M94O45m21l70K95M4j35K57l
1575A66n55J56P75k67q89L53Q89l79p67L14N87k34k98R3k1L9L69j96o78L55Q86
1596F98m35j052M85J067m38r81L27P87j63n13m7J89K76J53m79m98O64P83p75r82
$$ plain form
1463 911 -344 -1221 300 1429 -195 -1490 84 1419 59 -1196 -237 842 379 -441 -554 -36 667
1480 667 472 -768 -894 790 1199 -761 -1381 660 1446 -483 -1358 270 1171 11 -841 -283 481 571
1498 571 -64 -783 -305 964 671 -1042 -916 1024 1083 -934 -1127 731 1066 -480 -920 163 674 154
1516 154 -409 -471 100 730 177 -947 -398 1069 571 -1079 -674 995 694 -810 -628 564 537 -253 -374
1535 -374 -62 224 384 -44 -648 -104 827 218 -939 -290 928 315 -835 -302 649 251 -388 -173 127
1554 127 60 166 37 -385 -105 585 178 -678 -186 709 181 -640 -146 499 78 -292 3 47 -88 169 166
1575 166 -389 -233 542 275 -614 -261 628 249 -518 -204 383 149 -149 -56 -77 -38 331 135 -543 -188 698
1596 698 263 -789 -304 763 325 -656 -329 458 295 -218 -265 -76 200 353 -126 -624 40 823 48 -934
1616i34P98J107p48j100N99J008l68q21P7N62K34k51n52o4Q18L82j050o44J173
1635B26Q20j165r49J079R56q45r14N35P73j41n72k75L62O59j18j002j06J245L11
1654H79j364m77J363N80j215o36R38O43n86o04J78N11K47l87o50K64R68j40j184
1673f72J2J307R2j272j92J134K54q70l08N23L37j47l51k21L43N62l24q32K97R93
1693F65k39j067J90R96j18q30L3N76N7k84j28j2J88L14k44n57K87P23k97p89L04
1714b32P32k44o37J92M30j00k13K7m9L9K96j26m75J66O13k09o48K00O16j83m91
1735b96J41L12n6r7j4j29P4L63j48n46J92O82k24p18J98O77j46n55N2L82M1j44
1757D1j51r9K39L50l37n60L90P09l95p96L67P86k74p01J40N54L1l45k09J13L71
$$ plain form
1616 -934 -136 971 223 -877 -278 730 362 -459 -382 180 414 163 -389 -453 365 747 -303 -947 226
1635 226 1046 -119 -1068 11 967 122 -792 -257 516 375 -197 -472 -110 549 431 -571 -677 568 879
1654 879 -485 -962 401 981 -234 -870 68 711 125 -479 -301 210 457 70 -580 -316 652 512 -672
1673 -672 -660 647 739 -533 -725 409 663 -207 -515 8 345 198 -153 -374 -31 531 207 -625 -328 665
1693 665 426 -641 -451 545 427 -403 -370 206 263 -21 -149 -161 27 341 97 -460 -173 550 253 -536 -232
1714 -232 500 256 -381 -189 241 141 -72 -45 -94 -55 241 115 -360 -194 419 210 -438 -238 378 195 -296
1735 -296 -155 157 101 4 -10 -139 -65 298 150 -396 -204 478 254 -464 -266 411 265 -290 -238 144 185 41
1757 41 -110 -209 30 380 43 -517 -127 582 187 -609 -242 544 270 -431 -291 263 294 -51 -260 -147 224
1778B24J30n05l64O08N51o53o77O15P67n50p51L81P00j88n61n5L99K77j90n02
1798c44k1O89K12p96l95Q56N05q19n79O95O03n00n65K55M75L4l91k87K36N36q0
1819C19p27n0Q39J76q94k56Q26L30o91l75N08L71k52l52pK97K66k35m86J59O60
1840D26q6p62L5P72L9p22j02N87J58m06k01J81K13M7k10k61K11M29j84n55J57
1861b34O08j07n87O4N14j1l75l2J85P0J0j12j78J22L38j36m48J33M92j10m79Q2
1883a91M05n2k70pJ31K7N4p6k13R6L53j04m31R3M81q3m78N5M02Nk78o6J36J12
1907A01M0j60k02J84L59k12m73K06N29j63n39J11M74k3l74p1K25J58n1k51j05
1928b37L19K75l39m40L62N08l13n50K45N17j30m73J8L59J18k20k42N5L57R2m43
$$ plain form
1778 224 354 -151 -515 93 644 -9 -686 -71 696 146 -605 -224 476 288 -273 -328 71 348 158 -344
1798 -344 -365 324 536 -260 -655 201 706 -113 -692 3 606 106 -459 -204 271 305 -86 -373 -137 399 319
1819 319 -408 -458 381 557 -337 -593 233 563 -128 -503 5 376 124 -228 -235 62 328 93 -393 -234 426
1840 426 340 -422 -387 385 424 -298 -400 187 345 -61 -262 -81 132 179 -31 -292 -81 348 164 -391 -234
1861 -234 374 267 -320 -256 258 247 -128 -160 25 95 105 -7 -185 -63 275 139 -309 -176 316 206 -273 -191
1883 -191 214 162 -108 -115 16 43 97 21 -192 -96 257 153 -278 -185 296 213 -265 -210 192 197 -81 -147 -11 101
1907 101 141 -19 -221 -37 322 110 -363 -157 372 209 -330 -219 255 232 -142 -213 12 170 119 -132 -237
1928 -237 82 357 18 -422 -60 448 135 -415 -170 347 217 -256 -238 121 239 19 -223 -168 189 281 -162
1949a62k37M82L80m97m45M40M88l29m93K16M29m0l69j08K49K70j24m00mM95J25
1970C66n50k39N53K94m87l35L83L45k45l19N7K89J08k12k63J21L99m4m86k4N19
1991B30J03n13j45M48J92l50k07K14K08o7j72j05J47K43j19l55Q4M08l3m32jM03
2013A81K7l33o3K38R4j19j08j2J12J57j25k51J04L25q6l51N6L37k0k85mJ90M1
2036A05r1o0l5P3J49p6k41P7L04p4l25M4L15j6k61j2J77L8n5r0m5J14J55j32k42
2061b04J34L00j13l41Q5L38l6l10pK35O4j31j22K0J73Q2j99k10K32K93k27l40
2083b84J91L69j41l46O7K96J6k16j11J26J87j6k56r6K99J91l25k64L22L04k78
2104C5l26K08L12j18k74J9K11J02j46k02O4K93K6l57r2L78J59l67k01L27K20k45
$$ plain form
1949 -162 -399 83 463 -34 -479 -39 449 120 -373 -157 272 232 -137 -245 4 274 150 -250 -254 241 366
1970 366 -184 -423 130 424 -63 -398 -15 330 85 -234 -177 112 220 8 -255 -134 265 221 -265 -289 230
1991 230 333 -180 -325 123 315 -35 -242 -28 180 113 -59 -164 -17 226 107 -248 -164 244 211 -221 -222 181
2013 181 208 -125 -188 50 144 25 -83 -95 17 174 49 -202 -98 227 141 -210 -154 183 163 -122 -126 64 105
2036 105 14 -46 -81 -8 141 65 -176 -99 205 131 -194 -150 165 149 -112 -124 53 91 36 -54 -99 15 170 38 -204
2061 -204 -70 230 117 -224 -139 199 163 -147 -154 81 145 14 -108 -88 85 167 -32 -242 -10 283 56 -284
2083 -284 -93 276 135 -211 -144 152 168 -48 -159 -33 154 138 -118 -214 85 276 -49 -313 9 313 35
2104 35 -291 -83 229 111 -163 -144 67 169 23 -179 -115 178 204 -153 -245 133 292 -75 -276 51 271 26
2126B6k37J51K29m2j87r2J50J84q8k93M4L41J9l71o1L52J05l13j22K40J33j36
2148C2j46L3J27Q3j12j79Q9K52o4l05N7L25m1l03J8K37J6j63m0O7O3J4p7r9R9
2173a7J64j03k09Q0K51p7k30N4K06n1j27J2N9K1J3l7j07P6J51r1j83P2K17p3j96
2198a25N1J59j4j20J1K7K9M6o2j06Q5J74r2k26J07K22r3k17P8J82k7j51j5Q2N2
2223E7J3j14q5J44J53j66k15J80K39j66k41J35K28q2j99K8J41N0o8j25j0J92Q9
2246A78k42j41K64J83k64k19K39K30j92k18J23J84l2j51o2J03J54m1k40j5K91
2267A32P4l28j14L36J24k87j50K42J54j51j55M6J41N7j22j47R6K30o2k99K4L39
2289A80Ll36l3K99N9k45p5J65R0n1j25l5J15J36j08k11J05K61r5k90Q2K73m9k40
$$ plain form
2126 26 -211 -60 169 127 -60 -152 -2 182 94 -199 -155 186 205 -166 -227 125 230 -83 -205 35 168 32
2148 32 -114 -81 46 129 17 -162 -73 179 115 -190 -133 192 151 -152 -134 103 119 -44 -84 -17 46 60 -17 -116 -17
2173 -17 147 44 -165 -85 166 89 -141 -87 119 68 -59 -47 12 33 46 9 -98 -22 129 38 -145 -73 144 71 -125
2198 -125 -74 85 71 -49 -38 -11 18 64 2 -104 -19 155 63 -163 -56 166 73 -144 -66 116 89 -62 -77 5 57
2223 57 70 -44 -129 15 168 2 -213 -33 206 40 -201 -66 162 80 -119 -91 50 100 32 -93 -103 89 178
2246 178 -64 -205 59 242 -22 -241 -2 228 36 -182 -59 125 93 -58 -120 -17 137 96 -144 -159 132
2267 132 206 -122 -236 100 224 -63 -213 29 183 32 -123 -77 64 121 -1 -148 -52 178 116 -183 -159 180
2289 180 183 -153 -186 113 172 -73 -148 17 107 56 -69 -104 11 147 39 -172 -67 194 99 -191 -109 164 115 -125
2313a25K4J88Kj14k7J4P0O7j04j26J26J68j27k21J46K12j23j98J11J49o3r5J4
2336c2M4J9K4n3r5Q8J42j26j48J09J67j14j49J17J01p9o1L3NlO4n2j00Q8J32j00
2362B1j65J13J61j10j35R2R8n4n5K1mL5N5p0j19J27J44j37j86J55J83j39j85J25
2386b9J44o7j11OO6M8Kj25n2J73J21k21j47K28J78k22j92J93J72j20j54M2J25
2409E8L1o7j16K6J81J2k49o3K85J16l07j28K87J44k34j58J67J49q0j29l3J17J25
2432A34p3k26N5K83j5l32j6L43M7l23p4K62R5j76j20Q8J22L5j43j24J38K20j26
2455G4k87J02L20p8l06K2L04Kk50l6J59Q5p0j14l3J34J21j43j97J54K49j52k73
2478b13J24K66q9k26M7J74pj01m2L0Q5M7j18j16J36J77j51k01J61J92j34j83R5
$$ plain form
2313 -125 -101 87 89 -25 -52 -38 32 99 -5 -131 -5 163 36 -185 -39 173 50 -148 -37 112 49 -46 -32
2336 -32 12 31 55 2 -93 -5 137 11 -137 -28 139 25 -124 -7 94 15 -46 -13 -8 -11 53 1 -99 -11 121 21
2362 21 -144 -31 130 20 -115 -23 75 21 -34 -13 -17 18 73 3 -116 11 155 18 -168 -13 170 31 -154 -29
2386 -29 115 48 -63 -57 9 57 59 -66 -118 55 176 -45 -192 36 214 -8 -200 -7 165 45 -109 -67 58
2409 58 89 22 -94 -68 113 125 -124 -187 98 214 -93 -221 66 210 -24 -182 -15 134 54 -75 -108 9 134
2432 134 61 -165 -110 173 158 -174 -190 153 200 -123 -197 65 160 -16 -136 -48 74 109 -34 -158 -20 200 74
2455 74 -213 -111 209 131 -175 -153 151 153 -97 -133 26 111 41 -73 -106 28 149 6 -191 -37 212 60 -213
2478 -213 -89 177 88 -138 -91 83 76 -25 -67 -37 48 95 -23 -139 -3 174 23 -178 -17 175 41 -142 -47
2501d7J51n2r4QK1L4M1q4r3J19J39j44j55J30J62j14j53J04J13o5o5K2kM2N4r0
2527a8r6J12J50j42j66J34J82j29j59R8J16m2q7j0K3P9K6j11r6J60J51j81j99
2550b05K01J94j63k01J25J71o2j34rQ5P9k3j57l0K05R2k41j37K56J85k53j98K05
2573a5J98j28k02N9J59L8j11j34P4K06j0k81l8L17Q9l25j31L09J42k38j73J71
2595b4J64n8j72l4J35J52j18k34P5L02k2l51j8L44N1l01r6K53J28j59j46M9J67
2618H7N1j57j55J34K47j16l10R1L27m5l27J3K81K8k18o9J27J18m2j36o4J59J51
2641A75j69k15J43K71j33k69P6K66l6k13mJ54L9o9q6j2J21R5j47j58J48K04j30
2664E1k37J12K35r6j84L3J39J0o4n6qJ03O3j12j32J27J88j33k27J24K05p7j93
$$ plain form
2501 -47 104 52 -42 -34 -13 21 62 -22 -115 4 143 -1 -156 -26 136 22 -131 -27 86 21 -44 -22 -24 18 72 -18
2527 -18 -114 -2 148 6 -160 -26 156 27 -132 -34 82 40 -47 -57 -34 45 71 -40 -136 24 175 -6 -205
2550 -205 -4 190 27 -174 -49 122 60 -74 -83 2 81 58 -99 -129 76 168 -73 -210 46 231 -22 -220 -15
2573 -15 183 55 -147 -88 71 109 -2 -136 -62 144 134 -147 -185 132 221 -104 -235 74 216 -22 -195 -24
2595 -24 140 82 -90 -124 11 163 45 -189 -114 188 166 -185 -203 141 192 -109 -205 48 176 17 -129 -80 87
2618 87 138 -19 -174 -40 207 91 -219 -128 199 154 -173 -160 121 149 -69 -138 -11 107 65 -71 -135 24 175
2641 175 6 -209 -66 205 72 -197 -121 145 109 -104 -108 46 85 16 -70 -82 39 134 -13 -171 -23 181 51
2664 51 -186 -74 161 65 -119 -86 53 63 -1 -57 -65 38 101 -11 -143 -16 172 39 -188 -64 141 64 -129
2687a29O0J29Kp3n6QR0P8j32j29J49J77j68j98J37K20r2k22N8J68Nj01p6M9J37
2712I1J7j72j02K01J67k10k10J93K28j50k42R7K18l0j66o3J10J44m0j97l2K42
2734I4J05k80j59K74J95k38k28J80K39j08k14J9J85P6j14j82O9K43kk94o2L12
2756A10J15k98j71K69J99j97k25J12K07nj79j00J50J90j02k61L8L11K2l34o7L20
2778A04J12k56j62J87J72r1j81j6J90R8j52j96J17K63n9l05J4L16J9k78q2K37
2800E1J20j69j30O5J43L5j59j18J40K02j21k47P8K83n0k66nK32O0j82r8R9J14
2823G7Oj37p9J34J52j23k16J11K45p8k50M0K17K3j73p3J17Q9j9j27m5J22J36j33
2847A6k01J32K17q0k50M8K42k0j90l6J30R8o9j22k5J51R7j48j75J64K16j28k64
$$ plain form
2687 -129 -69 60 62 -11 -67 -59 31 109 -23 -152 -3 174 6 -192 -55 165 73 -149 -91 77 82 -19 -95 -46 91
2712 91 108 -64 -166 35 202 -8 -218 -25 203 53 -189 -92 126 96 -70 -133 -23 121 81 -116 -148 94
2734 94 199 -81 -240 34 229 -9 -237 -57 182 74 -140 -121 64 140 26 -156 -87 156 154 -140 -202 110
2756 110 225 -73 -244 25 224 27 -198 -86 121 116 -63 -163 -13 177 75 -186 -148 163 185 -149 -216 104
2778 104 216 -40 -202 -15 157 66 -115 -131 59 157 5 -191 -74 189 130 -175 -161 155 174 -104 -186 51
2800 51 171 2 -128 -63 80 115 -44 -162 -22 180 59 -188 -110 173 123 -143 -148 84 144 -38 -136 -37 77
2823 77 83 -54 -133 1 153 30 -186 -75 170 92 -158 -118 99 122 -51 -124 -7 82 63 -64 -109 13 149 16
2847 16 -185 -53 164 84 -166 -118 124 104 -86 -122 8 106 37 -85 -110 41 138 -10 -185 -21 195 67 -197
2870a97R0K60k7k40l2J93Q3j12j40L7J77O0k15j38K11K07j87k49J43K72q8k78
2892a70K9K28M8j79j17J11J84j8k36n5K51J42k53k02K23K37j68k63J10K48k4k14
2914h8o4J74J45j24k08M3K43O0k97j14K83J79k46k25K02K34j03k48K8K15P1j82
2936b2j47J11K17k8k86k5K94Q9k81j41K38J89j89k01R0K16lj95p6J53J56r9k21
2959a61N7K66kk89n6K69J06k08j62J49J68p0j63j7J61J01j40j71Q9K24l9k47j
2982a36K33P8k47r5J77J25r8j65K9J68O9j54j45J22J97q2k36L7K52Rk24p2K05
3005D7J04j34j40M8J55K8j44j12J44J67j09k31P3K55j5k61l3K23R0j67j21Q5J57
3028A09j8j76o0J73J47j39k32J28K54q2k52mK54O7k25j06J53J59p3k04j3K10J04
$$ plain form
2870 -197 -107 153 126 -114 -146 47 130 18 -122 -85 92 152 -63 -201 10 217 30 -219 -76 196 108 -170
2892 -170 -141 87 135 -44 -161 -50 134 116 -120 -175 76 218 -35 -237 -14 223 55 -208 -98 150 126 -88
2914 -88 -152 22 167 43 -165 -122 121 181 -116 -230 53 232 -14 -239 -37 197 94 -154 -126 89 160 -22
2936 -22 -169 -58 159 131 -155 -180 114 203 -78 -219 19 208 19 -182 -92 124 121 -74 -150 3 159 60 -161
2959 -161 -104 162 160 -129 -185 84 190 -18 -180 -31 137 67 -96 -113 48 149 9 -162 -73 151 112 -135 -136
2982 -136 97 175 -72 -167 10 135 37 -128 -99 69 138 -16 -161 -39 158 76 -160 -123 129 138 -86 -158 47
3005 47 151 17 -123 -75 80 108 -36 -148 -4 163 54 -177 -104 151 136 -125 -158 65 155 -12 -133 -48 109
3028 109 91 -85 -145 28 175 36 -196 -68 186 104 -148 -152 102 169 -56 -162 -9 150 77 -127 -140 70 174
3051A74k02j76J82K39j54k56P3K79j5k48n9K09J20j40j78O3K23K5k53r8K26J82
3073B16k06k35J57K59q5k70K0K48N2k01j23J25K05n3k38l1K53J10k55j71K27K08
3095B12j64k43R7K49k1k13p1J78J41j19j98L3K48K5k59q6K45J57k16j97J55K15
3117A68q8k08nK02P0j48j43R8K03l4k38l1K46R9k35j37J85J69j26j92M2J97K9
3140A23j75r1J21J55o6k21K3K30N5k32j11K18J42j52j79J01J82j9j78o4J63J30
3162A55j23j91Q4K17pk55l1K17J07j94j47J44J62n9j89j5J86Q7j46j55J02K09
3184A58n9k39%K40N9k08j21J63J62j11j82K5K11L9j76j27J40K04j15k42N6K57
3206A34J3k43p7K08J31j49j80R0K00Kk12o6J81J50j63k12J26K38n5k53j7K35Q5
$$ plain form
3051 174 -28 -204 -22 217 63 -193 -120 159 144 -104 -163 46 166 26 -152 -89 134 159 -94 -192 34 216
3073 216 10 -225 -68 191 106 -164 -144 104 156 -45 -168 -43 162 109 -129 -160 93 203 -52 -223 4 212
3095 212 48 -195 -98 151 130 -83 -154 24 165 46 -152 -119 129 154 -105 -191 54 211 -5 -202 -47 168
3117 168 80 -128 -133 69 139 -9 -152 -54 149 115 -123 -154 92 191 -44 -181 4 173 47 -145 -103 94 123
3140 123 -52 -143 -22 133 67 -154 -131 99 154 -78 -189 29 171 19 -160 -59 123 104 -74 -138 25 155
3162 155 32 -159 -75 142 135 -120 -151 66 173 -21 -168 -24 138 79 -110 -125 61 148 2 -153 -51 158
3184 158 99 -140 -140 100 159 -49 -170 -7 155 44 -138 -113 98 137 -39 -166 -26 178 63 -179 -123 134
3206 134 147 -96 -173 35 166 17 -163 -73 127 129 -83 -149 32 182 19 -193 -67 171 116 -137 -154 81 166
3229A66k13j18J30J80o9j99k1K21R1k07j54J69K09j09k43M7K54J6k31q4J91J36
3251A62j19j92M6K12L7k22j05J94J79j66k17J21K33o1k30j3K10Q5j76j46J24J78
3273A34l6k02k6K00J10k06j54J54K07j15k15L6K22K0j85r0J46J51q9j95K3K07
3295I7N8k19j06J93J50j30k11R5K03j8j99m6J70J14j24j70P7J85Jk13n8K03J21
3318A73j77j62J24J93o0k11MJ79Q0j61j30J02J81n7k06%K15P1j95j27J71J57j15
3341D9j82L8K03K8j81j03J50J56j06j79K4K27J9k17r1J98J38j58j77R4K03k3j89
3364g9o0J83J05j35j72R1K13l3k32k3K19Q3j79j49J45J74p8j95J2J94O8j74j39
3387a61J43J77q8k02L4K04K8k02r5J75J41j27j66M9J99J7k05p6J80J22j23j85
$$ plain form
3229 166 -47 -165 -35 145 76 -123 -144 77 168 -39 -193 -24 185 76 -167 -120 134 150 -81 -165 26 162
3251 162 43 -149 -103 109 146 -76 -181 13 192 26 -191 -70 163 102 -128 -141 69 154 -22 -168 -44 134
3273 134 98 -104 -130 70 180 -26 -180 -26 181 66 -149 -113 109 129 -56 -146 0 151 62 -133 -110 97
3295 97 155 -64 -170 23 173 43 -168 -73 130 112 -87 -133 37 151 27 -143 -66 119 120 -93 -151 52 173
3318 173 -4 -166 -42 151 91 -120 -116 63 143 -18 -148 -46 135 78 -128 -128 87 158 -37 -164 7 164 49
3341 49 -133 -95 108 136 -45 -148 2 158 52 -127 -103 124 143 -74 -165 33 171 13 -164 -70 133 110 -79
3364 -79 -139 44 149 14 -158 -67 146 113 -119 -142 77 160 -19 -168 -23 151 73 -122 -110 84 152 -22 -161
3387 -161 -18 159 71 -131 -97 107 135 -67 -162 13 154 27 -139 -90 109 126 -79 -155 25 147 24 -161
3409a61Q2K23l8k06m1K03R1j62j44J12J79n7j85l0J86R1j58j52J29J88q0k15L1
3432a14K10L3j83q3J38J36q9j59RJ84N6j93j04J53J67j29j86P2J99rj98m5J73
3455C8R6j27j47P3J77Pk12m2J76J13j53j56J22J72n4k02lJ79P3j59j07J01J65
3478A30o6j74nJ76P8j74j29J65J38r8j72M2J81K1j79o5J32J31r0j62M1J85J7k03
3502h0n8J61J24j26j64R3J68k3j75m8J79Q7j29j51R4J76l0k02j9J72J09j87j21
3525a50J23J56o1j76J0J90K7j53r8J17J55q4j81L4J83K8j80q2J63J19j07j70O1
3548g6J78Kj74n6J53J13j35j31O6J78k2j75m5J84R1j60j40J04J69n0j64j0J55
3571E5O5j34j25J22J45n9j96K7J72M8j58j00J35J33q5j58K8J76J5j57q1J37J18
$$ plain form
3409 -161 -79 144 106 -100 -141 62 153 -9 -153 -41 138 81 -104 -134 52 143 -15 -167 -38 150 70 -145 -114
3432 -114 96 129 -54 -137 1 137 48 -111 -102 82 138 -55 -159 -6 161 32 -154 -82 117 108 -90 -135 38
3455 38 134 7 -140 -67 110 117 -95 -137 39 152 -1 -157 -35 137 83 -119 -122 57 130 -29 -136 -35 130
3478 130 64 -110 -115 61 139 -35 -164 1 139 41 -131 -89 92 113 -66 -131 1 132 42 -120 -79 106 123 -80
3502 -80 -138 23 147 21 -143 -50 118 95 -80 -128 51 138 9 -142 -48 128 98 -104 -123 49 158 -29 -150
3525 -150 -27 129 68 -108 -98 92 119 -34 -132 -15 140 56 -125 -91 92 120 -60 -142 21 140 33 -137 -76
3548 -76 102 104 -70 -126 27 140 5 -126 -60 118 96 -79 -124 60 151 -9 -149 -45 124 74 -90 -100 55
3571 55 120 -14 -139 -17 128 69 -127 -100 72 120 -38 -138 -3 130 45 -113 -85 91 106 -51 -132 5 123
3594A23j02j47M5J81qj67n1J58J04j17j41O4J74k3j64m8J62Q7j27j31Q8J71m6
3617H5j77k0J68N2j26j14J09J45n9j65MJ63N9j53r8J20J50q9j68L5J70K0j66n9
3641a14J21J19j01j34N2J57J1j78n3J49R9j11j18N7J50k3j62l3J41Q5j31j08Q9
3664c6J44l3j67k8J72O9j44j06J04J38n8j60J2J66L5j40r7J20J30p5j54L0J57
3687G9K7j52p2J22J21j01j44O3J37Nj51m6J36R8j07j31P0J41rj73k5J39Q3j21
3711a1j02P4J47m3j57NJ45N6j36r3R7J33n3j57%J59M7j41r1J17J23p4j60L5J47
3736F7K2j43o5J31J02q6j40M8J51mj43n8J41Q1r6j17N8J45k3j48k5J53O4j23j08
3761a16Q4J32m0j46KJ42N8j47q1J02J20n2j48RJ55L5j43p8R7J22o7j39K4J46K6
$$ plain form
3594 123 21 -126 -81 100 92 -75 -126 32 136 19 -122 -58 116 93 -71 -119 43 130 3 -128 -40 131 85
3617 85 -92 -112 56 108 -18 -132 -23 122 63 -102 -98 65 124 -29 -127 -7 143 54 -114 -79 91 111 -55 -114
3641 -114 7 126 25 -109 -57 100 111 -67 -120 29 128 17 -101 -44 106 83 -79 -112 29 114 -17 -125 -36
3664 -36 108 75 -92 -120 52 121 -23 -129 -25 113 55 -105 -93 73 108 -32 -129 -9 121 46 -108 -78 79
3687 79 106 -46 -118 4 125 24 -120 -57 80 85 -66 -112 24 122 15 -116 -46 95 86 -87 -112 27 110 -11
3711 -11 -113 -39 108 65 -92 -87 58 114 -22 -115 -18 115 62 -95 -95 64 111 -30 -121 -4 119 45 -115 -80 67
3736 67 89 -54 -119 12 114 28 -112 -64 87 83 -60 -118 23 104 8 -109 -51 94 71 -77 -102 51 115 -8 -116
3761 -116 -32 100 60 -86 -84 58 116 -31 -112 -10 110 58 -90 -81 74 109 -34 -112 -15 107 40 -99 -75 71 97
3786I7j43o6J19J03q6j36N2J44lj40l2J10R2j04j23O6J44k4j45j9J37N8j04j09
3810a12P9J36l9j44mJ29N9j22r3R4J17n8j30K3J35K3j27q0J13J09p5j27K7J45
3834G8J4j39m7J07Q7q3j10M4J30jj47k0J18P5j03j04P2J14j4j37j8J36N3j13r9
3859a07Q8J11m0j27KJ32K5j13p1Q7J10o0j17PJ40L1j28p2J12R0p0j20K9J35Rj27
3885d4m9J13P7q5j12N6J16rj18m4J30O1r7j00O4J27k9j23j1J18N3j08q7P2J18
3910H9l6j23kJ22M9j17p8R1J07o5j19J7J30K5j28o3J08Q5o8j07L2J11J5j16o2
3935a03J20Q3q1j10M5J29qj25k7R9O4r1q5N9J05j2j30j7J30M0j00q1P4J13n1j15
3961g5LJ24K9j07p1R5Q8n2j06J9J10L4j46m0J08Q3p3j13L9J24Jj13l5Q8P3q5r4
$$ plain form
3786 97 -46 -112 7 110 24 -112 -60 84 81 -59 -91 19 111 7 -116 -50 94 70 -75 -94 43 101 -3 -112
3810 -112 -33 103 64 -80 -84 45 104 -18 -111 -17 100 42 -88 -65 70 93 -34 -114 -1 108 33 -94 -67 78
3834 78 92 -47 -94 13 100 17 -93 -49 81 80 -67 -87 31 106 3 -101 -29 85 71 -66 -84 52 105 -8 -107
3859 -107 -19 92 52 -75 -73 59 84 -29 -100 -13 97 37 -80 -73 67 98 -30 -102 10 100 30 -90 -61 74 83 -44
3885 -44 -93 20 97 12 -100 -44 72 63 -55 -99 31 92 -5 -105 -41 86 57 -66 -77 41 94 -14 -101 -29 89
3910 89 53 -70 -72 50 99 -18 -96 -5 102 37 -82 -65 65 90 -38 -101 7 92 24 -83 -51 60 75 -41 -103
3935 -103 17 100 19 -91 -46 83 75 -50 -77 22 86 -5 -90 -31 74 62 -68 -85 45 85 -15 -96 -22 91 40 -75
3961 -75 -72 52 81 -26 -97 -2 86 34 -72 -53 57 91 -55 -95 13 96 23 -90 -51 73 74 -39 -74 14 87 2 -92
3988i2O0J07j7j11l3J18N3r2r4O9J21l7j20jJ14M3j14o8P6J04m2j14NJ12K6j04
4014c1n5Q3R1o8j03L4J10kr6m8J09N5o3r1L6R8Jj07l7J00O9q0p5M7R6j3j22rR6
4043B5N7q6q1O0J11m1r9j6J11K9q2p2O3J02m6r6%J06L0r4o0P7P4m6r7K3R9J9r7
4072b7m3Q3P1n6r6L3R0kj01l4R5P2p9q8M6R7oj11j5J00O1r3o9M6J00l5j00%J05
4101D4L4r8n4N6R6l6j13J0J09K6r6n0P0P5m2j10L3J04J0r5n4Q9Q4p4r5K9J14j7
4129D9r7qP6O0q1p6N6Q5j6j00j3R4N0r3p0O6R0l2j03JJ01K9q5o1O9O7l3p8kR0
4159C5K6r0m5Q0O5n1q9L0R9Kr7l3O9N8n4p3L3Q0Kq7k1R0M0o4p6N0R0l3q7lR0K6
4191F2p0p1O6P4k8q1nR1K5p0p3P6P9m8q4J2R3%p9l9P3O0n6o1J7Q2J0q7l1P7N3
$$ plain form
3988 -92 -32 75 58 -53 -86 32 85 -7 -101 -32 89 52 -68 -69 45 88 -26 -94 -18 86 44 -70 -65 47 73 -31
4014 -31 -86 -3 88 20 -83 -49 61 59 -37 -85 24 79 16 -75 -39 59 60 -47 -84 16 85 5 -70 -23 73 60 -62 -71 25
4043 25 82 -4 -85 -25 86 45 -54 -70 41 70 -12 -84 -21 81 35 -61 -61 45 75 -19 -79 -2 72 26 -71 -48 51 70 -27
4072 -27 -70 13 84 28 -68 -35 55 53 -48 -82 13 85 6 -82 -36 61 55 -56 -71 29 90 -3 -72 -26 74 39 -61 -61 44
4101 44 78 -20 -74 -18 78 42 -71 -61 48 74 -22 -72 -2 73 31 -79 -46 58 68 -27 -81 8 92 18 -77 -48 66 49
4129 49 -48 -56 20 80 -1 -77 -21 64 48 -52 -65 29 79 -14 -84 -18 72 40 -63 -62 39 68 -17 -78 -9 58 25 -53 -55 35
4159 35 61 -29 -74 6 71 20 -69 -39 60 62 -35 -68 1 59 5 -68 -35 45 47 -40 -61 29 69 5 -71 -21 69 36 -51 -54 36 62
4191 62 -8 -79 -13 61 33 -48 -53 38 63 -7 -80 -4 75 27 -57 -45 48 48 -31 -70 3 63 7 -54 -37 45 55 -32 -63 14 67
4222F7o2o8K4R9j3q6k7R1M4p2o0N0P5k2p8k6R6L5p9m8N0P2k7r1J3Q7K3q4m6N7
4252fP1l6q8J0J03J0q5l9O8O3n9p1K9Q1np3k2O4N5o8o7L6Q3j5q6j8R4L3p5m7N0
4283a0O7k2q7kQ3L2o7o0O5N3k7q4J0P4K5q2k5N3O6m2p6J8Q0J2p4l7N4P2n3p4K3
4314c5R5j3q3k5Q5L6o3n5M3O9j8p2k0P9L5n4o4M1P5k6q0J4O3K9p2l9M7O8m5p4
4344e9K1P1K0p5l7N6O8n6o7K2Q2Mq1k6O8L6m1n9J6P8po4k3P1K7m7m5J5P6j7p4
4375d7oP6K9o0m9M4O6l4o6kP4K4n5n4N0N7k4p7J2P8K1q2l7O5M9l5p9K8P8mo5m6
4407g1Q0N0n1p0K9P8mq4j0P1L6o1n0L9P0l2n5j4O8L2n0n3M3O3l3p4J5P8Qp0k5
4438d7L7O6l6o3MQ5Mp0l0O1N2o1n4K8O5ln5k4N5L7l7o0K8O4j2p7oP5L2o1n0M2
$$ plain form
4222 67 5 -63 -39 60 47 -39 -66 25 69 -3 -63 -13 62 40 -38 -64 32 67 -12 -60 -10 62 35 -56 -43 44 67 -17 -63 -6
4252 -6 65 29 -59 -49 54 64 -21 -60 8 71 12 -59 -30 51 46 -27 -49 15 70 2 -65 -29 54 39 -47 -65 29 62 -13 -60 -10
4283 -10 57 35 -52 -54 29 61 -6 -66 -1 52 25 -59 -49 25 50 -32 -57 -4 62 20 -56 -38 42 54 -20 -57 -3 69 16 -58 -35
4314 -35 60 47 -36 -61 24 60 -3 -58 -15 54 36 -36 -56 23 58 4 -60 -19 56 30 -50 -36 27 56 -16 -55 -8 60 15 -59
4344 -59 -38 33 53 -22 -59 -3 65 9 -58 -36 46 50 -31 -57 11 47 6 -53 -37 41 34 -30 -53 18 45 -2 -47 -32 44 27 -47
4375 -47 -53 23 52 -8 -57 -13 53 19 -47 -49 25 49 -6 -60 -10 47 23 -54 -42 36 57 -25 -62 3 52 17 -62 -34 44 40 -25 -71
4407 -71 9 59 8 -62 -33 45 41 -43 -53 18 54 -7 -57 -18 52 20 -35 -49 19 51 1 -52 -9 54 21 -53 -38 40 48 -22 -47
4438 -47 -10 56 20 -43 -39 46 50 -20 -50 11 63 2 -52 -24 41 38 -17 -41 14 51 14 -46 -18 46 34 -43 -49 26 58 -3 -53 -11
4470a1N6j7o7PN8K4n5m5M4O3l1o9J8O0J3n6m4M8M9l2n8J2O9jo2k1N9L8l5o9K8
4501b7O4mn8k6N7L8n0l6J9O1qo6j4O6L3n2m3L6N9j5p3KO0K8o3l3L3M6j4o2QN3
4533A9K2n4l7M2O5l9o4J5N5K3o4l0N1L9m3m5J7N8J5p0k5O1L9m5n8L0O6mo9JM6
4564A7L1m3n2M5N1k0o1j5O8K7o6m0M5O9l8n7LN9K3o2j9L6M6l9m9QO9Po2l3O7L4
4596D9m4n5L0N6nn7pN9K5o0l4L1M5Jn4j8O4K9o8l8M3M9k6n9J4N6J8o1k4M4M3k5
4628B1o2LP8no4j1M6L9l5m8J1O2j2m8j1L9L6l0n2K2O3j3o4nN9K1n8l5M2M9k1n2
4660c5rO3J8m7k8L2N4l2m8PN2J4n5l8O4L2k8n4QL9J7m0k6M6L6l6m0MO2Ln4k0M4
4693EL6m3m0J8N8rn5pN2L0m0m9J2O2no1%M6K2m8k7K6M9j6m7j6O9K0n2l8N0L9k1
$$ plain form
4470 -11 45 28 -39 -32 26 50 -5 -50 -6 57 26 -43 -25 35 48 -8 -52 -4 45 13 -45 -33 36 35 -27 -48 11 49 14 -55 -27
4501 -27 37 33 -25 -51 6 44 -6 -42 -23 38 30 -36 -50 16 49 -3 -46 -10 49 34 -39 -37 23 51 -12 -45 -12 34 20 -42 -34 19
4533 19 41 -13 -50 -8 57 18 -46 -31 24 47 -17 -47 4 43 0 -45 -28 30 45 -25 -50 11 50 5 -53 -23 43 39 -30 -29 17
4564 17 48 5 -47 -2 49 29 -32 -47 21 48 -18 -58 -13 56 18 -39 -36 23 46 -16 -35 1 47 8 -41 -33 36 43 -19 -52 15 49
4596 49 5 -50 -20 36 31 -26 -33 26 51 -9 -43 -12 33 34 -20 -38 26 55 -13 -51 -8 41 15 -44 -30 26 44 -17 -41 3 46 21
4628 21 -41 -38 40 35 -29 -40 6 45 10 -38 -27 35 23 -25 -36 3 39 9 -43 -21 42 29 -35 -40 19 40 -18 -53 -11 38 17 -35
4660 -35 -44 19 37 -10 -38 -6 48 16 -32 -25 27 41 -14 -52 12 44 16 -38 -30 9 26 -14 -40 6 42 6 -34 -30 32 35 -19 -39 5
4693 5 41 -2 -42 -24 34 25 -30 -37 15 45 5 -44 -32 30 25 -36 -36 10 32 -16 -43 -17 32 16 -31 -47 22 42 -10 -48 2 41 20
4726B0n6J1N3Pn6k0L3M1k5m5J0N7Pn9k0M7K8k6n0K5N2j6n1nN2K4n0k7L1M2j7m9
4758c2mM9L3n4l3L8N2l2n6RO7mn4k2M5L7k1m4lN3J2n1k3N0L8n2m9L6M3jn7JM4
4791A5J5m0k6J7M5j0n0lN0K5m8k9L3M3k4m4LM6J4l7l1L5K9j1o2J3M7J3m2l2M9
4822CL7k7m7K2L6ol4k2M1L7k9l6MM8Jn0k1N0K9l8m1K3M8ln2rM5J5k4m0L0M3j6
4855A7m7jL8K7l5l1L4L9k2m6mM5J8l5l0K7L5j1m2rN1J6n1j6M1L8m4l8K1M0nl1
4887a1l3N7K7l9k8LN7j1n8J1L8K4m6k5L6K3rm3oM4K3l7m3L8M4k0m6NM9jl6k2K4
4920a1L0j3m1J2M5Lm3j9L9M2l4n1J3O1k0m5NL7J8l0k4K3L0rl8pL7J3k0m9L3N4
4952D1l0m1MM1J0l0k0J7L3rm0JM6Ml5l1L2L4j7m1J8L3Nm2j1L4J6k0l5J0M9jm4
$$ plain form
4726 20 -36 -25 28 35 -21 -41 -8 33 8 -37 -27 30 37 -22 -42 5 33 7 -43 -18 34 18 -33 -38 14 38 -12 -39 -8 34 17 -32
4758 -32 -36 13 46 -8 -41 -3 49 17 -39 -30 37 33 -21 -43 2 39 18 -26 -29 24 36 -15 -38 12 50 -2 -51 -15 28 27 -30 -29 15
4791 15 30 -10 -36 -19 26 16 -34 -37 13 38 -10 -39 -6 37 13 -31 -28 18 32 -5 -36 -1 28 17 -45 -32 15 28 -14 -46 3
4822 3 40 13 -34 -12 24 18 -16 -38 3 40 11 -25 -21 27 28 -22 -43 7 36 -2 -43 -20 28 25 -27 -36 9 24 0 -40 -10 33 17
4855 17 -30 -31 7 34 -1 -32 2 41 19 -27 -31 14 32 -3 -33 -6 29 18 -24 -33 18 34 -17 -33 8 46 2 -36 -15 25 20 -11
4887 -11 -44 13 40 1 -27 -24 33 22 -36 -25 13 37 -9 -34 2 25 16 -27 -33 11 34 -3 -46 -8 36 16 -30 -25 24 23 -13 -35 -11
4920 -11 19 6 -35 -23 22 25 -18 -37 2 44 10 -41 -28 33 13 -32 -27 10 28 -2 -26 -3 27 18 -20 -27 10 23 3 -46 -13 41
4952 41 11 -30 -26 15 25 -5 -25 -8 25 16 -24 -23 23 27 -8 -39 -7 27 10 -31 -13 20 25 -17 -28 6 22 2 -33 -23 26 25 -19
4985a9qK6L3m2k5K9L0j1l8JK9J9k4k6J1L1Km6jM6Lk8k6K5L4k4k2oL5Pl2j3J6L2
5019A8pl4JL1J4l8j0K3K5k7k5MM5kl0j8K1N0l6l7RN0lm7j3M2K0l6l1K5L8j6k9
5052b3pM8Nl2k9L3K3pm6RM1K1m5k0L0K6k0l8J7K4Rl6j9M6K1l0l4PM5J0m6j1N3
5085B5ll1j8K4K4j3l5KK6K0k1l1K4L2j9l0JN4om0j7L1K5j1l6J4K8Nk7k1K7K3j7
5118Il7J3K6Kk3nK3J7k4k2K1K0ok9mK1K9l3k1J7J9rj6nK3Nk1j8K8J2mk1lL0jk6
5154a3j9K5K0Ll7%L2Jk3j6L0J5j1k4mL3J4l4j6J9K9l0j7JM0kl2PJ4Qrj8%K7J4
5189B7n0j0L4L2l3k2J5K7j3l3J4K1Pj5j9RK9Mm1rM0Ql6j5K2M4k7l5NL2%k6qK6
5223DJ7k6j0oM4j0k5j0K1K7l9j2K1K5j6l1J0J9J3j8k6K2K2rk0pL3J3k9k3K0K2
$$ plain form
4985 -19 -27 -1 32 -10 -35 -6 24 13 -25 -24 5 24 0 -26 -15 16 18 -28 -29 17 20 -8 -34 -9 25 1 -21 -27 8 15 -17 -30 -14 18
5019 18 11 -23 -22 9 23 -15 -25 -2 23 -4 -29 -25 20 18 -12 -30 -9 41 5 -32 -23 27 24 -23 -36 6 26 -10 -41 -16 22 6 -23
5052 -23 -30 18 23 -9 -38 -5 18 11 -35 -26 15 36 -9 -29 1 27 7 -31 -14 10 19 -17 -36 10 31 1 -33 -26 19 29 -17 -28 25
5085 25 22 -9 -27 -3 21 8 -27 -25 1 21 0 -31 -7 25 6 -24 -23 31 25 -15 -32 -1 24 13 -23 -9 19 24 -3 -24 3 26 9
5118 9 -28 -15 11 13 -10 -15 8 25 1 -21 0 20 14 -15 -19 2 31 -2 -23 -6 13 4 -12 -17 6 11 -10 -28 0 12 8 -13 -16 14 13 -13
5154 -13 -32 -7 13 16 -21 -21 11 12 -11 -27 3 18 7 -17 -21 12 26 -8 -24 -5 24 -6 -23 -22 18 16 -16 -9 5 13 4 -14 -14 13 27
5189 27 -23 -33 1 33 0 -22 -7 20 7 -26 -12 9 16 1 -18 -9 20 24 -17 -26 14 22 -14 -29 -7 37 10 -25 -20 12 12 -14 -22 4
5223 4 21 -5 -15 -21 23 13 -12 -22 -1 26 -13 -25 -4 21 5 -26 -16 3 16 -2 -28 -6 16 7 -13 -20 13 26 -3 -26 -6 16
5255A6k6j0J4J7Ol6mK3K1k2k1PL0nj7k0L2J1k2j1OK3%k3qK3J7k2k8K0K8k1j5m
5289b1K5J1j2j9J8J2roj0J0Nj2k0L3J1kk5oK7mrj0J0QJl0QK7Lk2j6J6K5j7k4J6
5325hK8j2k6RJ8J7k6j8MJ6Qj5j3J9NPl3RJ6%l1%L4Ml2jOK6nl2RJ8J3k9j6K1L2
5362B2k5k9K3K2jk6kJ5Rj4k6QL2J0k9qJ9L5l7k5K5J9pl4MK6Rj7j6RK4jl4j0L5
5397EJ1k0k8L1J3mk5LQJ2rpKJ9j2l3K9J7%k7kL6jk3j7J1K4j0k2PJ6Mj5mRJ4kl4
5435b4PK4Nk0j0J8njplK5j5jj0J3J5j3qj0L2ok1J0J2jj1j6J3PPj7JJJ2omqJ8J0
5474A3k3NJ3mnj0KKJ3j0j6K0MrpJK2Nk5nK9Kk3LJ4rRj4j0OL1l4nLK3mk6OK5Pl0
5515a1qJ7J9oj8NJ6rok4K1K6k5j9RK6lk4PJ5Mj2mkJ6pqnJ8J8k1k5K1J7j2j4PJ5
$$ plain form
5255 16 -10 -20 -6 11 17 -19 -23 0 21 -1 -22 -15 15 10 -7 -27 5 16 -6 -17 -11 12 12 -11 -19 4 21 -1 -29 -9 19 -2 -17 -21
5289 -21 4 15 3 -16 2 14 5 -1 -11 -1 4 -8 -28 5 16 14 -11 -17 10 6 -3 -13 -3 5 6 -24 -16 11 14 -8 -24 -8 17 0 -24 -8
5325 -8 20 8 -18 -9 9 26 0 -18 -14 2 10 -5 -18 1 6 13 -20 -11 5 5 -26 -26 8 12 -20 -21 -15 11 6 -26 -17 1 14 -15 -31 -10 22
5362 22 -3 -32 -9 13 12 -14 -16 -1 8 -6 -32 -24 8 18 -11 -19 0 35 -2 -27 -2 17 10 -24 -20 6 15 -2 -18 -9 15 14 -20 -30 5
5397 5 16 -4 -32 -1 12 8 -17 -14 -6 6 -3 -10 -8 11 -1 -34 -5 12 12 -15 -17 19 18 -5 -22 -11 13 3 -19 -12 4 8 -7 -11 -2 12 10 -24
5435 -24 -17 7 12 -8 -18 0 -5 -6 -13 -16 9 -6 -7 -17 -4 11 -2 -10 -20 12 6 -15 -5 7 6 -5 -21 -8 -1 6 -11 -10 -9 3 -3 -7 -15 3 13
5474 13 -10 -5 8 4 -1 -11 -9 -7 6 -4 -20 0 4 -5 -12 -11 11 16 -9 -14 15 17 -6 -3 11 2 11 -3 -13 -7 24 -10 -15 -12 11 7 -19 -13 12 19 -11
5515 -11 -19 -2 17 11 -7 -2 14 5 -1 -25 -4 22 -3 -22 -13 13 10 -14 -7 8 12 0 -4 -6 10 3 -5 -10 8 26 5 -20 1 18 6 -8 -1 14
5553A4nk8J0J1J2j3j6QK2J9m7jK6Pk9j1K3J8j4rj0K0%j7%LK3lj7nK0kj2pOK6k1
5590Aj3mJ1JJ0qJJ7rj3mK0jj4j2J7kLj0JJ4plmJ0Pnj5lK4nprJ1J4j7pKK2pjlj
5633BQqrnK1nj4jK0Pj6lkJ7j3mJNKqp%J4Ok3QJ8%j5oJ1J0j9NlJ1Mj1j6J4K9j6
5675Ik5J1J3%j0j0J4J3j6j3jK0Ok3MJ0Rnj6MK3kl2PJ9Lj6oJ4J8j8kj1J9Rl5lK6
5713GKok2K4J1pj8LJ3kj5%J3Nj0onK3Kk0kJ2J3k1pQPnqoJ6LJj7kK1J1j6%LPk0
5755a0NkJ0n%J2j9QMMj1KRj3oK1lj2jJ6j1NkmJ0lnrPOPj0KoJ4j3MJJ3j2ooJ4J0
5799A5j5jLJ1jj9kJ1Ooj5J0Rmj1%MJ9k0L%J2ok3QJ3Nj3j7K3J1k0lJ6J0rrqJ1N
5839Cmq%J1Qk3nK2nj2mK1lpjJJ4pj6MK3r%k2J1K0lj9oK5oppMJ3krMNMrk1K6J1
$$ plain form
5553 14 9 -19 -9 2 14 1 -15 -7 15 34 -13 -14 12 19 -10 -21 2 20 6 -3 -13 7 7 -10 -10 -7 16 13 -4 -9 11 9 -3 -10 -4 22 1
5590 1 -12 -16 -5 -4 6 -2 -1 16 7 -6 -10 10 9 -5 -17 0 -2 1 -9 -8 6 -1 -4 -8 2 9 4 -11 -14 10 5 -2 -11 0 14 -3 -10 -8 14 7 6 3 2
5633 2 10 2 -7 -12 9 4 -10 -11 9 16 0 -3 -5 12 -1 -5 -4 1 3 -5 -12 -12 2 8 -15 -7 11 11 -4 -10 1 11 -8 -3 -6 5 9 -2 -18 -4 25 9
5675 9 -16 -5 8 8 -2 -12 2 15 -1 -14 -15 5 11 -12 -8 2 11 6 -10 -6 17 15 -17 -10 9 12 -4 -10 4 22 4 2 -9 10 19 -16 -19 7
5713 7 9 3 -19 5 16 9 -9 -6 7 5 -10 -10 3 8 -2 -8 -13 10 12 -8 -10 2 15 -6 -13 -5 2 -3 -11 -17 -1 2 3 -14 -16 5 16 0 0 3 10 -10
5755 -10 -5 -7 3 -2 -2 10 -9 -1 3 7 -4 -2 7 -6 -12 9 6 -6 -7 9 -2 3 1 -3 7 4 -1 -10 -3 3 10 0 2 -4 10 -3 1 2 15 3 -3 -9 5 15
5799 15 0 -1 2 13 12 -7 -9 2 8 2 -13 -3 6 2 -9 -9 -5 14 -6 -3 -3 9 3 -20 -12 1 6 -7 -24 -1 10 -10 -13 3 13 4 -5 -13 -2 3
5839 3 -1 -9 -9 2 10 -13 -18 4 -1 -13 -17 4 1 -6 -7 -6 8 1 -15 -11 12 3 3 -19 -8 12 9 -10 -16 9 3 -4 -11 -7 6 4 -5 -1 4 8 -1 -22 4 15
5883A5j9kkJ5nj2LJ0%nnJ2RrrjPnqMJ2Jkj5jJ6llONnQj8KNJ6k5QoJ3mpPlm%jP
5931BjKj1QoKJQoLkrJ3%j5PNKkNnqJ0Lj2%J6Mj5okJ1JnJO%Oj9J1JLj1j0J3jkj1
5979a5MK7j7jqJ2jMj5KK1rj8LJ7Pj6j5K4klpMpJ6pk2K2J7k1KpJ2Kk3PJ3Mj2qJ4
6020@%npjJ1Lm%%Rj9LJJ6Oj1j0OJ6k9J7KJj9J1KkPpj1J2J3j6JkJ8lqlNlnmlMJ6
6066Hk4QJ0nQmKQj4%J5j1nLoMJ0n%lMMqj2J6Rj2JoJ3rj1QKKj%kMKlnJ1%qp%Q%
6115a%qRpRJj5RPmk3K5OnRj3K0qj3%lKJ3j2pPJ1pk2J4J1%k3J5Jlj1J5oJ2j0qJ1
6158bJ6Pk3j0J7Rj1j3J0J2lj0OmjOj2RJ7j4k0J5PJj9jK1j6LpJ7Klj7NOjRj0jR
6199Fj0%QKLj9RNJ0j4kMjLm%NmJoPOj1mON%mlQlj2RQj0QoNkpLj0J0J2j4jKKJ1
$$ plain form
5883 15 -4 -6 -8 7 2 -10 -7 3 3 -2 -7 5 14 5 -4 -5 2 -3 -11 -7 5 6 4 -11 -12 4 1 -2 4 9 4 12 -6 -4 1 17 -8 0 -6 7 3 -4 3 0 -4 -4 -5 2
5931 2 1 3 -8 0 -6 -4 -3 5 -1 2 0 -9 4 4 -11 -4 1 3 1 6 1 -7 3 6 -6 -6 10 14 -1 -7 -9 2 3 -2 -1 5 5 11 -8 3 4 7 -4 -14 -1 -2 -4 -15
5979 -15 -11 16 -1 -2 -10 2 1 5 -10 -8 13 4 -14 -11 6 13 -3 -18 6 4 1 -6 -2 -9 7 0 -22 0 17 -4 -2 -9 3 5 -18 -11 2 6 -6 -14 0
6020 0 0 -5 -12 -13 -2 1 -3 -3 -3 6 -13 -10 -9 7 13 2 -8 -2 14 -15 2 4 5 -14 -3 -1 -3 4 -3 -14 -2 11 -5 -4 -6 12 9 1 -2 3 0 -5 -9 -12 -8 8
6066 8 -16 -8 2 -3 5 1 3 11 -3 -3 12 1 -4 -1 -7 -3 7 2 2 -1 3 7 -1 -13 3 12 0 1 -5 8 -1 -12 -4 -2 0 -1 -1 -3 1 3 0 -5 6 6 -2 -9 -9 -1 -1
6115 -1 -1 -9 0 -7 2 3 -12 -3 4 0 -23 2 8 3 12 -1 19 11 -2 -2 -5 -3 10 -2 -9 -2 9 2 -20 -6 5 5 -18 -3 -2 -5 -16 -1 -7 5 -5 -13 -2
6158 -2 14 21 -2 -12 5 14 3 -10 0 12 9 -1 5 1 0 6 -6 3 20 6 -14 1 8 9 -10 -11 10 -6 -3 -10 7 9 6 -11 -6 0 -1 8 -2 -3 6
6199 6 -4 -4 4 6 9 -10 -1 4 14 0 -2 2 1 4 0 0 5 1 2 -4 3 9 -2 -6 0 5 5 1 -2 6 3 -9 0 8 -2 6 0 5 3 -4 -1 -11 -1 11 -3 -4 -2 0 11
6248A1j4mNjJ4lj5jJ1Nj4JLNPqj4J4%knjNPj6RNpkJ2qPqMj1MRnnJK3k3MKNkLj
6296FjmpPj0J1%j3POnQq%QmoMRkj3oJ6Ko%oJ5nj2NRQk1JJ0ooMNjQj0NJ3orj2K
6345a0J2ljmJ4mj6LJ4Lj6kJ4omQj5J1Qj3JPOj0oJLJ9k0%QLkMnmJ1plJOLj6J5n
6390CJpkMNQj7J0rPMqj0J4JmmjLNNoJplrK1KKpnJ3mrKJPj1%J3qnJ2j2%J4Mj8m
6439hJ4roQJ1j3JlJRqlJKOnj8K1MmrQNJj3LRmMPmqlJkRllplJ4qoPLnmLMJOj5J
$$ plain form
6248 11 -3 -7 -2 -3 11 8 -7 -8 3 8 -6 -5 -2 3 10 2 -12 2 2 0 -5 -6 -1 6 -10 -1 4 -3 -5 7 -1 6 -2 2 -9 -5 4 -1 -6 -5 18 -5 -1 1 6 4 7 6
6296 6 5 1 -6 1 -9 2 2 -11 -4 2 -3 5 -3 -3 5 1 -5 -1 8 6 -7 -13 3 5 -1 -1 -7 8 3 -9 -4 5 13 -8 -7 3 -3 -9 -5 0 -1 7 -3 2 15 9 0 -12 -10
6345 -10 2 -1 -2 -6 8 4 -12 -9 5 8 -8 -10 4 -2 -6 2 -13 -2 6 -7 -6 1 7 -3 -9 -8 -5 14 -6 -6 2 5 3 7 2 -2 9 2 -1 0 6 9 -7 8 3
6390 3 4 -3 -5 -1 4 12 -5 5 -4 3 7 -1 -11 3 4 0 -4 -5 -2 3 8 2 3 -4 -7 -16 5 7 9 2 -3 10 6 -3 -1 0 7 -4 -4 9 1 -4 8 -4 -4 10 14 -4 -8
6439 -8 6 -3 -9 -1 10 -3 -2 -5 -4 5 -3 -6 -5 -3 3 -2 -20 1 5 1 -8 0 5 6 -7 -4 5 1 5 12 8 0 -3 -2 -4 5 2 -1 -8 -11 3 -5 -11 -4 -1 -6 -10 -7 -3 -2 4 -11 -10
$$ [...]
8191B
##END NTUPLES=NMR FID
##END=
