##TITLE=1H_LY-DMAA.Per.4.7
 CDCl3
 8 sc, 
 11.02.2022
##JCAMPDX= 6.0         $$ Bruker NMR JCAMP-DX V2.0
##DATA TYPE= NMR FID
##DATA CLASS= NTUPLES
##ORIGIN= UXNMR, Bruker Analytische Messtechnik GmbH
##OWNER= root
$$ XWIN-NMR		Version 3.5
$$ Fri Feb 11 11:07:06 2022 Russian Standard Time (UT+4h)  she@DPX200
##.OBSERVE FREQUENCY= 200.131346
##.OBSERVE NUCLEUS= ^1H
##.DELAY= (6, 6)
##.ACQUISITION MODE= SIMULTANEOUS
##.ACQUISITION SCHEME= undefined
##.AVERAGES= 8
##.DIGITISER RES= 18
##SPECTROMETER/DATA SYSTEM= spect
##.PULSE SEQUENCE= zg30
##.SOLVENT NAME= CDCl3
##.SHIFT REFERENCE= (INTERNAL, CDCl3, 0, 15.7039)
##AUDIT TRAIL= $$ (NUMBER, WHEN, WHO, WHERE, WHAT)
$$ ##TITLE= Audit trail, XWIN-NMR		Version 3.5
$$ ##JCAMPDX= 5.01
$$ ##ORIGIN= Bruker BioSpin GmbH
$$ ##OWNER= she
$$ F:/spectra/data/she/nmr/H-F/1/audita.txt
$$ ##AUDIT TRAIL=  $$ (NUMBER, WHEN, WHO, WHERE, WHAT)
(   1,<2022-02-11 11:05:29.84 +0400>,<she>,<DPX200>,
      <created by zg, POWCHK disabled, PULCHK disabled
       configuration hash MD5:
       00 E9 B6 7A A2 85 ED C7 34 08 36 98 17 FE 4E 26
       data hash MD5: 16K
       FC 9D 63 08 9A 0D EE 98 A4 B7 45 1C 68 59 09 B7>)
$$ ##END=
$$ 
$$ hash MD5
$$ E8 73 73 B2 65 0A 78 62 DF F4 A5 39 C7 03 EC 56
##$RELAX= 
##$RELAX= 
##$RELAX= 
##$RELAX= 
##$RELAX= 
##$RELAX= 
$$ Bruker specific parameters
$$ --------------------------
##$DU= <F:/spectra>
##$EXPNO= 1
##$NAME= <H-F>
##$PROCNO= 1
##$TYPE= <nmr>
##$USER= <she>
##$AMP= (0..31)
100 100 100 100 100 100 100 100 100 100 100 100 100 100 100 100 100 100 
100 100 100 100 100 100 100 100 100 100 100 100 100 100 
##$AQSEQ= 0
##$AQ_mod= 1
##$AUNM= <au_zg>
##$AUTOPOS= <>
##$BF1= 200.13
##$BF2= 200.13
##$BF3= 200.13
##$BF4= 200.13
##$BF5= 200.13
##$BF6= 200.13
##$BF7= 200.13
##$BF8= 200.13
##$BYTORDA= 1
##$CFDGTYP= 0
##$CFRGTYP= 5
##$CHEMSTR= <none>
##$CNST= (0..31)
1 1 145 1 1 1 1 1 1 1 1 1 1 1 1 1 1 1 1 1 1 1 1 1 1 1 1 1 1 1 1 1 
##$CPDPRG= <>
##$CPDPRG1= <>
##$CPDPRG2= <>
##$CPDPRG3= <>
##$CPDPRG4= <mlev>
##$CPDPRG5= <mlev>
##$CPDPRG6= <mlev>
##$CPDPRG7= <mlev>
##$CPDPRG8= <mlev>
##$CPDPRGB= <>
##$CPDPRGT= <>
##$D= (0..31)
0 1.2 0 0 0 0 0 0 0 0.06 0 0.03 0 0 0 0 0.0002 0 0 0 0 0 0 0 0 0 0 0 0 
0 0 0 
##$DATE= 1644563129
##$DBL= (0..7)
120 120 120 120 120 120 120 120 
##$DBP= (0..7)
150 150 150 150 150 150 150 150 
##$DBP07= 0
##$DBPNAM0= <>
##$DBPNAM1= <>
##$DBPNAM2= <>
##$DBPNAM3= <>
##$DBPNAM4= <>
##$DBPNAM5= <>
##$DBPNAM6= <>
##$DBPNAM7= <>
##$DBPOAL= (0..7)
0.5 0.5 0.5 0.5 0.5 0.5 0.5 0.5 
##$DBPOFFS= (0..7)
0 0 0 0 0 0 0 0 
##$DE= 6
##$DECBNUC= <off>
##$DECIM= 32
##$DECNUC= <off>
##$DECSTAT= 4
##$DIGMOD= 1
##$DIGTYP= 9
##$DL= (0..7)
0 120 120 120 120 120 120 120 
##$DP= (0..7)
150 150 150 150 150 150 150 150 
##$DP07= 0
##$DPNAME0= <>
##$DPNAME1= <>
##$DPNAME2= <>
##$DPNAME3= <>
##$DPNAME4= <>
##$DPNAME5= <>
##$DPNAME6= <>
##$DPNAME7= <>
##$DPOAL= (0..7)
0.5 0.5 0.5 0.5 0.5 0.5 0.5 0.5 
##$DPOFFS= (0..7)
0 0 0 0 0 0 0 0 
##$DQDMODE= 0
##$DR= 18
##$DS= 0
##$DSLIST= <SSSSSSSSSSSSSSS>
$$ [...]
##$SUBNAM2= <"">
##$SUBNAM3= <"">
##$SUBNAM4= <"">
##$SUBNAM5= <"">
##$SUBNAM6= <"">
##$SUBNAM7= <"">
##$SUBNAM8= <"">
##$SUBNAM9= <"">
##$SW= 18.0517287032376
##$SWIBOX= (0..15)
0 0 2 0 0 0 0 0 0 0 0 0 0 0 0 0 
##$SW_h= 3612.71676300578
##$TD= 16384
##$TD0= 1
##$TE= 0
##$TE2= 300
##$TE3= 300
##$TEG= 300
##$TL= (0..7)
0 120 120 120 120 120 120 120 
##$TP= (0..7)
150 150 150 150 150 150 150 150 
##$TP07= 0
##$TPNAME0= <>
##$TPNAME1= <>
##$TPNAME2= <>
##$TPNAME3= <>
##$TPNAME4= <>
##$TPNAME5= <>
##$TPNAME6= <>
##$TPNAME7= <>
##$TPOAL= (0..7)
0.5 0.5 0.5 0.5 0.5 0.5 0.5 0.5 
##$TPOFFS= (0..7)
0 0 0 0 0 0 0 0 
##$TUNHIN= 0
##$TUNHOUT= 0
##$TUNXOUT= 0
##$USERA1= <user>
##$USERA2= <user>
##$USERA3= <user>
##$USERA4= <user>
##$USERA5= <user>
##$V9= 5
##$VALIST= <valist>
##$VCLIST= <CCCCCCCCCCCCCCC>
##$VD= 0
##$VDLIST= <DDDDDDDDDDDDDDD>
##$VPLIST= <PPPPPPPPPPPPPPP>
##$VTLIST= <TTTTTTTTTTTTTTT>
##$WBST= 1024
##$WBSW= 4
##$XGAIN= (0..3)
0 0 0 0 
##$XL= 0
##$YL= 0
##$YMAX_a= 18519
##$YMIN_a= -18349
##$ZGOPTNS= <>
##$ZL1= 120
##$ZL2= 120
##$ZL3= 120
##$ZL4= 120
##$ABSF1= 10
##$ABSF2= 0
##$ABSG= 5
##$ABSL= 3
##$ALPHA= 0
##$AQORDER= 0
##$ASSFAC= 0
##$ASSFACI= 0
##$ASSFACX= 0
##$ASSWID= 0
##$AUNMP= <proc_1d>
##$AZFE= 0.1
##$AZFW= 0.1
##$BCFW= 1
##$BC_mod= 2
##$BYTORDP= 1
##$COROFFS= 0
##$CY= 11.3945322036743
##$DATMOD= 1
##$DC= 2
##$DFILT= <>
##$DTYPP= 0
##$F1P= 2.36226072786647
##$F2P= -0.459571619588291
##$FCOR= 0.5
##$FTSIZE= 0
##$FT_mod= 4
##$GAMMA= 1
##$GB= 0.15
##$INTBC= 1
##$INTSCL= 1
##$ISEN= 128
##$LB= 0.24
##$LEV0= 0
##$LPBIN= 0
##$MAXI= 10000
##$MC2= 0
##$MEAN= 0
##$ME_mod= 0
##$MI= 1.114404
##$NCOEF= 0
##$NC_proc= 0
##$NLEV= 6
##$NOISF1= 3.799351
##$NOISF2= 2.8
##$NSP= 1
##$NTH_PI= 0
##$NZP= 0
##$OFFSET= 15.70392
##$PC= 1
##$PHC0= -16316.56
##$PHC1= 21.40078
##$PH_mod= 1
##$PKNL= yes
##$PPARMOD= 0
##$PSCAL= 0
##$PSIGN= 0
##$REVERSE= no
##$SF= 200.130013532006
##$SI= 16384
##$SIGF1= 3
##$SIGF2= 2
##$SINO= 400
##$SIOLD= 16384
##$SREGLST= <1H.CDCl3>
##$SSB= 0
##$STSI= 0
##$STSR= 0
##$SW_p= 3612.71676300578
##$SYMM= 0
##$S_DEV= 0
##$TDeff= 0
##$TDoff= 0
##$TI= <>
##$TILT= no
##$TM1= 0
##$TM2= 0
##$TOPLEV= 0
##$USERP1= <user>
##$USERP2= <user>
##$USERP3= <user>
##$USERP4= <user>
##$USERP5= <user>
##$WDW= 1
##$XDIM= 8192
##$YMAX_p= 0
##$YMIN_p= 0
$$ End of Bruker specific parameters
$$ ---------------------------------
##NTUPLES= NMR FID
##VAR_NAME=  TIME,          FID/REAL,        FID/IMAG
##SYMBOL=    X,             R,               I
##VAR_TYPE=  INDEPENDENT,   DEPENDENT,       DEPENDENT
##VAR_FORM=  AFFN,          ASDF,            ASDF
##VAR_DIM=   8192,          8192,            8192
##UNITS=     SECONDS,       ARBITRARY UNITS, ARBITRARY UNITS
##FACTOR=    0.0002768,     1,               1
##FIRST=     0,             0,               0
##LAST=      2.2672688,     0,               0
##MIN=       0,             -18349,          0
##MAX=       2.2672688,     18519,           0
$$ Real data points
##PAGE= N=1
##DATA TABLE= (X++(R..R)), XYDATA
0@%%%%%%%%%%%%%%%%%%%%%%%%%%%%%%%%%%%%%kOj2J6j6J6j6J6j6J6j6J8k2K7l1
52a6L2l3L7m3M7n2O0o8P8r1J08j31J62k13L02m77R55m503j4503J5099J9036q431
74G355j8144J680J3558L683o367n747j963M461R397p6j4629o225J6310J2669j4676
89A286j7596J0251J9743m485j8477r56J4180M599p803n490Q19L391N288J066r093
104c277o877J0208J2536q455j6625M768J8236k50j7093l693J3405N903q310n766
118e290K836L297J622R30m207n955M558J0560k896j3776j6J4885L297j3907n781
133i843J1197O868p540o078L947L717j198j64j63l710rP022J415r281l503J0060
149B737N546r508o938P896P216n876o288L952M378k728j808K372q60k838L127
$$ y = [0, 0, 0, 0, 0, 0, 0, 0, 0, 0, 0, 0, 0, 0, 0, 0, 0, 0, 0, 0, 0, 0, 0, 0, 0, 0, 0, 0, 0, 0, 0, 0, 0, 0, 0, 0, 0, 0, -2, 4, -8, 8, -8, 8, -8, 8, -8, 8, -8, 10, -12, 15, -16, 16, -17, 20, -23, 24, -28, 32, -36, 42, -49, 59, -72, 90, -123, 179, -298, 657, -3846, -18349, -3250, 15786, 7355, -10789, -9109, 4449, 8132, 1765, -3982, -5945, -1484, 7913, 7837, -6792, -13017, 3293, 15962, 1286, -16310, -6059, 13684, 9199, -9278, -10234, 3946, 8545, 742, -4748, -3929, -538, 4750, 5816, -3277, -10154, 54, 12590, 4135, -12490, -7722, 10514, 10264, -6829, -10522, 2883, 8786, 476, -5290, -2454, 843, 2465, 3395, -812, -6767, -2209, 8351, 5455, -8321, -8337, 6548, 9845, -4062, -9843, 1354, 8222, 682, -5396, -1449, 2268, 1070, 906, 743, -2967, -2976, 4046, 5461, -3820, -7323, 2737, 8283, -1225, -8163, -267, 6949, 1073, -5215, -1263, 3115, 387, -1421, 951, 91, -2747, 380]
164C80L952m580n290N248O460n127p066M566O987l885o196L371M944l308l457
179c001L611J983m245q26M999n2n639N73O001r15o062J241N833j644n429K227
195a345N009k896m595L584M288m088m042M404L760m441l330M280K608m062j627
210b493L938L83m037Q48M432j982n043K722N715l009o281K872O457k397o074J870
226b079N139j506l686J623K003k267l63L423q50m881J456O305j381p406P48P834
242D112J12p479r09O332J263m693r54K853j60j226J884J75l888J28N767L72p126
259c437j375P714K607p362l556O208L905m535l405K781K003j347M2O22k421p75
275b331M542J663o033l089O626M547o285n640N162N951l586n327K092L812j019
$$ y = [380, 4332, -248, -5538, -290, 6170, 1043, -6023, -1457, 5530, 1645, -4551, -1180, 3764, 456, -3001, 610, 2593, -1652, -2478, 2521, 2469, -3170, -2597, 3404, 2489, -3573, -2332, 3501, 1857, -3572, -1345, 3664, 768, -3827, -243, 4045, -43, -4085, 319, 4079, -362, -3692, 588, 3196, -866, -2493, 1445, 1828, -2209, -1361, 3071, 1089, -3954, -1232, 4483, 1474, -4807, -1935, 4522, 2125, -3949, -2079, 3060, 1554, -2132, -509, 1494, -773, -1136, 2287, 1437, -3444, -1988, 4317, 2936, -4470, -3722, 4112, 4224, -3255, -4164, 2168, 3431, -1262, -2216, 637, 477, -749, 1135, 1310, -2578, -2450, 3317, 3689, -3437, -4812, 2902, 5509, -1853, -5409, 799, 4704, 169, -3236, -455, 1548, 201, 243, 865, -1556, -2331, 2211, 3874, -2159, -5248, 1378, 5925, -360, -6000, -838, 5113, 1527, -3800, -1708, 2104, 1085]
290A085j651P56p16j293K797K574m189m140M655N692m295o747L242P015j961o365
306c541P70M904j14k959K02Q67j071Q99K529k037m219K368N762j940o772J024
322c328P080M2o529q82N333J207l722p97K044k81p07J827p9l528J84M979K64n948
340b841j058O235J842n859k372M987K380l829j806K725P23j893P08J532k176j601
356b303L435K061m242k689M576L194m388l494L880L368l256k802K657J832k290
371d61p15K248m43k513J415K976k088l481K426L887k472m012K329L886k141l413
387b572K044K761k089j998K357J226k741o05L188J00l559J83L842m36l936O12
403a623L831q37l607J118L285j464k966J879K643k266k335K619K057k853j760
$$ y = [1085, -566, 190, -526, -1819, 978, 3552, -637, -4777, -122, 5570, 1275, -5472, -2230, 4785, 2824, -3541, -2771, 2133, 2019, -940, -738, 129, -942, -43, 2486, 449, -3770, -1402, 4360, 2420, -4352, -3328, 3752, 3794, -2735, -3617, 1716, 2923, -799, -1596, 448, 167, -540, 1287, 1208, -2320, -2136, 2843, 3107, -2841, -3899, 2336, 4178, -1681, -4053, 934, 3314, -515, -2321, 404, 1127, -766, -58, 1474, -702, -2303, 1132, 3193, -1049, -3738, 838, 4032, -356, -3850, 30, 3398, 142, -2660, -3, 1829, -461, -1176, 1072, 629, -1884, -469, 2507, 419, -3062, -636, 3251, 779, -3233, -904, 2982, 841, -2572, -528, 2233, 144, -1854, 503, 1729, -1012, -1617, 1571, 1671, -1888, -1705, 2137, 1701, -2235, -1623, 2208, 1371, -2236, -1118, 2167, 703, -2263, -384, 2259, -7, -2342, 277, 2334, -519, -2279]
418b279L026J429l101j004L142N33l165l3L224m77l324Q95L411j228l457J415
434i93L387j534l180J626K769j721k243J915J650k239j045K684N44l158j86L612
450A888K1l926K8M037K2l921J1L499j50k951M84K331j042j780J746J361k518j177
468b037L201J196l691j373L919J567l825j630L464J506k935j082K410M02j964
483h72M77J744j405j776K218K027k815k412L089K748l049k935K735K829k328k412
499b137J934J685j689p68J704j75j971J009K476j609l002J893L468j862l720J641
515a123L674j331l293J105K614j049j804J262R32j724k11K330k96k998N11L543
531B142m78l878K78L913o1l624m9L085k0k409L78J737r21j198J651Q63k376p47
$$ y = [-2279, 747, 2176, -925, -1929, 1213, 1746, -1419, -1452, 1772, 1295, -2029, -1134, 2277, 1049, -2408, -993, 2394, 860, -2320, -694, 2075, 354, -1889, 26, 1676, -563, -1608, 1076, 1620, -1538, -1724, 1888, 1909, -2017, -1989, 2048, 2070, -1851, -1840, 1659, 1509, -1442, -958, 1373, 331, -1449, 297, 1658, -860, -2037, 1164, 2360, -1331, -2704, 1215, 2782, -1043, -2673, 791, 2297, -638, -1720, 690, 1092, -872, -395, 1349, -56, -1832, 386, 2413, -402, -2814, 275, 3023, -26, -2961, -226, 2603, 275, -2137, -203, 1482, -207, -975, 729, 554, -1417, -408, 2068, 459, -2543, -650, 2818, 956, -2764, -1123, 2551, 1220, -2073, -968, 1646, 597, -1207, 55, 987, -737, -948, 1382, 1086, -1912, -1401, 2142, 1664, -2214, -1936, 1977, 1916, -1708, -1757, 1328, 1308, -1101, -723, 1014, 93, -1105, 546, 1409, -967, -1714]
549a714K977Q31l356j007L455J175l340j199K984R99k545o02K123rj822P16J678
566A344j414j700K005J842k379k022K593K141k580k109K440J902k241j514K069
581C77R86j995l68K017k54k144P52K329j122k537J334K662j450k640J445K517
597A909j460k207J500J799j587j365J806R35k033n49K278K58k493k9K643j49k709
614a453L09K641m88k504O96K286r53k060J225J835j528j632J794J427k015j224
630a644K199J024k311p73K370N14k375k07K370q0k381M26K328o91k284R14K209
647A608j124k076J285J878j460j624J605J329j790j035J971P58k166m93K334K94
663A294k451j12K482j6k426J87K287l79k078O28J858r48j605J285J395j640j256
$$ y = [-1714, 1263, 2094, -1262, -2269, 1186, 2361, -979, -2178, 806, 1805, -740, -1342, 781, 772, -1050, -334, 1344, -70, -1770, 235, 2077, -302, -2324, 269, 2410, -170, -2279, 161, 2063, -178, -1692, 377, 1363, -632, -1000, 1017, 763, -1381, -629, 1700, 578, -1959, -625, 2037, 587, -2053, -608, 1909, 449, -1758, -258, 1541, -46, -1411, 395, 1330, -703, -1252, 1026, 1284, -1209, -1238, 1405, 1256, -1453, -1144, 1497, 1009, -1495, -799, 1487, 534, -1526, -301, 1534, 6, -1626, 168, 1595, -420, -1644, 555, 1579, -732, -1505, 865, 1379, -996, -1203, 1167, 1087, -1294, -868, 1460, 769, -1515, -601, 1608, 484, -1592, -307, 1571, 111, -1513, 92, 1421, -369, -1404, 567, 1325, -841, -1334, 1000, 1294, -1157, -1269, 1213, 1197, -1229, -1042, 1245, 866, -1212, -584, 1274, 326, -1279, 6, 1401, -239, -1495]
680a495J971J139k213j078K325J009k344r03K274O97k134l93J946L4j821M34J721
697A169q54j711J263J746j560j786J741J802j794j763J764J607j691j329J604
712B08R51j598n20J661L9j762L37J950o57k119Q49K258r53k279R80K193r62j957
730a381R75J651j075j261J275Q52j515n11J801K43k096p3K306k2k422M9K404q6
748A114k275J66K036l46j732N96J445r13j194J281J008j603r10J892Q76k069q34
765a462K136P84k080o87J958M95j806k11J641j42j530N02J472q71j470J174J472
782A375j395j482J508J490j595j357J570J213j554r44J543O26j549k83J616n0
798G32j683L40J775n76j850P42J853q58j823R51J682j023j491J089J282j239j002
$$ y = [-1495, 476, 1615, -598, -1676, 649, 1658, -686, -1589, 685, 1382, -752, -1145, 801, 835, -986, -552, 1169, 315, -1396, -133, 1613, 53, -1733, 8, 1810, 16, -1747, 17, 1624, -67, -1396, 208, 1159, -439, -959, 702, 741, -1021, -684, 1266, 609, -1510, -661, 1597, 644, -1635, -655, 1538, 576, -1381, -406, 1245, 170, -1091, 184, 1036, -479, -990, 811, 1054, -1042, -1115, 1191, 1169, -1253, -1204, 1200, 1114, -1161, -995, 1041, 695, -1037, -441, 1004, 91, -1103, 178, 1186, -417, -1327, 565, 1441, -628, -1462, 674, 1458, -622, -1309, 649, 1144, -662, -873, 768, 626, -904, -402, 1070, 199, -1271, -97, 1375, -20, -1502, 6, 1496, -99, -1456, 114, 1327, -227, -1171, 372, 998, -551, -834, 782, 732, -951, -611, 1164, 588, -1262, -520, 1333, 475, -1348, -397, 1285, 262, -1229, -140, 1142, -97, -1099]
815a099J369P46j521n07J666L29j792j41J854Rj867J37J821k63j743M36J612o21
833D25j480Q24J330j028j205J226J052j393r16J505P87j613o10J655M38j679k42
850i24J690L7j675J98J647m01j595N99J546p84j464R40J349j076j212J194J032
867A101j313q56J411O78j528m85J603K97j650j37J663k3j637J78J586l27j493
884i32N10J391o93j264Q94J152j083j028J247R30j397q03J475O75j524n59J532
901E23L86j518j95J474l8j419K67J381n04j357P27J333r14j282J049J246j143
918A6j154J211J016j230q34J256O20j280l77J328J24j386P0J458k86j491M10J526
936I97n31j497O10J418o86j301P82J122q79r25J011P06j134n09J284L62j419k25
$$ y = [-1099, 270, 1016, -505, -1012, 654, 983, -809, -950, 904, 913, -954, -817, 1004, 741, -1002, -566, 1046, 425, -1055, -231, 1099, 71, -1134, 92, 1144, -249, -1165, 340, 1127, -486, -1096, 559, 997, -682, -924, 766, 803, -872, -674, 973, 572, -1023, -424, 1122, 338, -1126, -186, 1163, 87, -1125, 69, 1101, -212, -1068, 343, 1021, -507, -992, 611, 908, -742, -879, 784, 761, -876, -698, 888, 561, -932, -422, 969, 276, -988, -94, 1058, -25, -1053, 194, 1124, -273, -1076, 399, 1074, -450, -1009, 523, 909, -609, -804, 670, 632, -787, -520, 861, 357, -1000, -273, 1060, 146, -1136, -87, 1159, 16, -1138, 73, 1089, -141, -975, 281, 901, -379, -756, 572, 696, -690, -620, 838, 552, -939, -529, 997, 466, -1031, -421, 997, 311, -990, -208, 914, 35, -890, 121, 827, -307, -816, 468, 830, -589, -814]
954h14J519J03j563JJ534p4j490J97J373l53j246N26J108p19r92R36Q67j119p75
973i81J267O95j357o19J413N29j409l93J383K37j328l0J250j59j204L64J157n74
991B41j138P59J104r05j063R84R99j052q93J085P66j117o11J137M22j168j84J200
1009E66Qj242J75J280l43j275M70J270n69j225O58J133p50j012Q34Q64r39p14
1027h11J037N48j137m00J220K50j283j21J299K2j319J14J296k33j233L65J160
1044G74n04j048O36R59p66q63Q92P61r89o57J069N45j146m21J168K89j190j56
1062f47J190J3j184J47J142k78j130M43J081n67j021P04R20p89q42Q97P29r65
1080a57o05J030M77j091l34J134J97j178n8J174q6j159K04J134l33j076M47R99
$$ y = [-814, 705, 808, -755, -754, 780, 706, -784, -587, 786, 433, -813, -287, 821, 102, -890, 46, 913, -206, -981, 286, 981, -376, -995, 418, 947, -462, -855, 528, 765, -563, -593, 657, 498, -706, -342, 815, 241, -897, -138, 966, 61, -1002, -18, 981, -71, -964, 121, 887, -230, -841, 296, 718, -450, -634, 566, 574, -668, -493, 787, 444, -831, -361, 909, 340, -885, -227, 906, 156, -856, -22, 842, -97, -811, 226, 774, -363, -763, 457, 707, -576, -697, 602, 624, -695, -581, 715, 482, -751, -386, 774, 270, -778, -142, 817, 51, -812, 80, 841, -148, -805, 264, 809, -337, -758, 410, 699, -491, -647, 543, 556, -628, -481, 661, 383, -747, -304, 777, 210, -811, -107, 813, 24, -818, 79, 808, -157, -762, 268, 745, -346, -680, 454, 651, -527, -585, 589, 503, -656, -452, 682, 349, -727, -280, 719]
1098G19n51r24O73Q45p96p22Q81O44r67n41J033M34j073l09J093J86j095n7J057
1117E30p0j058K29J013l69r86N05R33o28q77P13Q39q10p51Q78O51r38m98R62L76
1137F44r84k26J012Q5j045O8J053k02j065L23J050m34r95N05R40n90q58O58P45
1156F84p44o10Q03M93q82l72R62K47j006j47J063M4j076N3J052j35j010K35R64
1175F18l52q68M66P86n85p05O90O19q07n41Q90M58r49l84R86K89r95j76R78O6
1195D84r55O5R21j91q91L33Q56m62q07N66P67o56p24P35O53p73n82Q14M72q46
1215b21l43Q59K14q77r9Q92k2r06J42R08k45q87L48Q63m22q22M90P63n72o72O39
1236C0N77p08m67P60L64q16k70Q78J47r15n2R19l8r19J32Q91k22q57L16Q03m11
$$ y = [719, 168, -756, -83, 762, -34, -756, 125, 769, -198, -739, 294, 728, -345, -654, 439, 625, -470, -527, 530, 460, -598, -369, 644, 275, -711, -206, 727, 99, -778, -65, 774, -36, -787, 91, 742, -196, -694, 268, 644, -340, -566, 446, 531, -514, -446, 607, 405, -660, -337, 713, 279, -716, -211, 729, 139, -719, -61, 684, -60, -670, 133, 626, -256, -628, 334, 581, -425, -572, 491, 535, -541, -488, 564, 429, -581, -346, 618, 266, -602, -136, 650, 65, -640, 50, 669, -138, -679, 211, 669, -280, -664, 322, 611, -384, -560, 418, 484, -471, -406, 515, 324, -567, -234, 622, 160, -647, -81, 686, 30, -694, 41, 694, -79, -661, 153, 625, -221, -564, 295, 509, -368, -467, 425, 403, -503, -361, 547, 302, -585, -237, 626, 204, -618, -128, 635, 63, -609, 30, 607, -101, -568, 192, 556, -260, -530, 348, 495, -420, -472, 447, 409, -510, -378, 513, 291, -566, -250, 553, 142]
1257A42p38N09O77o04n88O91N08p39m21P93L50q43k65Q64J56q53o3Q47m6q32J24
1278c31Q19k39p86L31P47m33o96N18O44n83n78O47M95o93m16P50L14p65k16Q10
1298C39J00q15%Q22q9q21J78Q04k86p51L41P19m37o61N24N79n84n13O52M22p05
1319a82l46P56K67p69j82P69J02p80qP77p3p63J78P21k70p01L65O63m43o17N12
1340b4N53n66m94O09M31o61l34O90K59p25j61P34O4p38L1P51j40p25K15P28k93
1361B04o94L69O40m25n85M76N15n54m37N97L55o48k73O93J75p21r6P38L5p46M8
1382c34P25j15p03J94O80k68o36L55N61m05n11M91M47n47l97O02L32o48k68O68
1402B23J98o82j32O82L9o70K7O70j25o43K13O27l03n86L73N54m39n02N00M60n54
$$ y = [142, -596, -87, 590, -14, -602, 89, 597, -142, -563, 230, 580, -263, -528, 336, 492, -361, -424, 423, 377, -455, -331, 488, 249, -537, -206, 541, 108, -588, -70, 574, -9, -587, 60, 555, -138, -554, 196, 510, -255, -471, 339, 439, -376, -376, 446, 357, -464, -286, 518, 232, -519, -178, 541, 104, -557, -33, 546, -38, -551, 101, 523, -182, -528, 228, 495, -274, -456, 313, 415, -365, -373, 404, 331, -432, -254, 467, 197, -504, -139, 524, 81, -536, -24, 529, -37, -531, 78, 509, -152, -486, 204, 463, -262, -423, 311, 375, -363, -332, 419, 279, -446, -231, 497, 204, -490, -121, 519, 94, -491, -15, 500, -54, -491, 106, 461, -187, -460, 233, 408, -313, -409, 329, 364, -382, -334, 391, 276, -427, -233, 447, 179, -457, -102, 459, 54, -457, 34, 481, -66, -463, 139, 471, -177, -445, 223, 421, -261, -393, 289, 328, -342, -315, 355, 230, -413, -200, 427, 124, -462, -89, 465, 26, -476, 24, 484, -70]
1423g0l92N89L27o06k57O35J60o36p6O39j1o60R7O43j82o14K31O03k96n74L58
1444i2N31m15m56M48M08n05l32N40K69n79j91O03J29o24m9O25k1o18O2O25j56
1465B02n90K26N60k93n28L63M80m24m19M73L72n27l10N64K48n85j72O03J01o05
1485b61m1O05l1n95J12N66j83n51K47N31l32m82L72M44m22l85M42L43m97k77N22
1506A27K33n42j64N70P0n59pN78o3n59J33N46j92n22K39M96l08m48L52M08m13
1527b5l59M50L04m88k44N18J83n46j22N56N9n48mN46o4n39J46N09j83m99K60M77
1549C87l28m12L47L88m02l35M38K79m64k37M93J55m99j11N22L9n24K6N08p4n07
1570c11J53M78j93m75K52M36k91m02L35L60l75l18M26K61m62j89M79J33n06o2
$$ y = [-70, -462, 127, 454, -152, -409, 226, 386, -250, -326, 313, 302, -358, -261, 382, 200, -414, -183, 420, 124, -450, -92, 439, 24, -432, 16, 424, -81, -413, 127, 396, -183, -374, 229, 358, -266, -315, 310, 289, -329, -267, 358, 202, -388, -162, 398, 105, -423, -60, 420, -4, -423, 50, 422, -105, -415, 149, 397, -188, -360, 243, 344, -261, -302, 303, 272, -323, -211, 355, 172, -379, -132, 399, 67, -415, -43, 401, -21, -406, 36, 379, -118, -395, 127, 360, -182, -346, 224, 294, -265, -272, 306, 243, -316, -183, 363, 171, -351, -112, 384, 76, -372, -20, 388, -25, -384, 66, 370, -118, -362, 156, 339, -207, -329, 227, 286, -262, -266, 280, 216, -323, -177, 332, 149, -350, -90, 387, 59, -353, -6, 382, -20, -355, 83, 362, -102, -339, 154, 309, -190, -301, 221, 260, -264, -238, 270, 196, -311, -158, 320, 127, -348, -96, 340, 49, -353, -18, 342, -33, -351, 75, 336, -126, -315, 164, 297, -209, -271]
1590b71M97J4n07L7N00q7m82J40M72k10m31K64L97l02l68L54L20l96k65M24K30
1611C30m55j74M68J05m71n4M71Om68M1M58j04m53J58M27k07m04K57L73k95l38
1632c29L41L07l73k67M04K16m21j51M38J02m61l2M51k0m44P0M40j14m38J72M05
1653B96k19l91K56L56k96l19L26K73l57k26L90J80l97j27M10Q6m32k7M30rm36
1674b33P0M23j08m02J40L82j92l53K37L26k93k87L13K62l60k06L76J63m01j23
1694b66M15P5m14j6M06j5m17P6M01j30l85J82L67k20l34K45L07k85k76L07K51
1715B74l45j92L63J35l73r9L86M7l80j6L98l9l90Q3L77j11l56J61L34k01l11K23
1737c2L05k83k42K87K17l20j72L38J27l51r5L68M9l88KL72n0l56Q4L55j20l42
$$ y = [-271, 226, 240, -267, -230, 270, 183, -299, -159, 313, 103, -328, -64, 333, 31, -337, 17, 337, -59, -324, 100, 330, -125, -299, 169, 274, -197, -251, 220, 226, -242, -201, 257, 153, -300, -142, 285, 78, -326, -69, 304, 9, -329, 12, 319, -54, -321, 83, 299, -122, -273, 165, 267, -194, -226, 225, 205, -239, -169, 271, 157, -281, -109, 296, 77, -314, -58, 298, 2, -317, 9, 282, -75, -301, 89, 269, -128, -255, 155, 241, -191, -218, 212, 203, -233, -163, 260, 152, -250, -110, 272, 80, -273, -36, 290, -3, -290, 23, 285, -75, -281, 95, 258, -143, -266, 149, 224, -190, -206, 200, 185, -232, -156, 245, 115, -270, -88, 279, 59, -275, -30, 277, -8, -284, 23, 274, -71, -263, 100, 235, -138, -237, 149, 196, -184, -200, 198, 159, -231, -148, 229, 118, -238, -77, 257, 56, -255, -32, 273, -10, -252, 35, 252, -68, -240, 98, 225, -126, -221, 147, 196, -192, -190, 182, 132, -224, -140, 215, 95, -247]
1759b47J71L23k14k78K45K59k74k19K88J85l12j42L21J07l34p2L38K5l58K1L54
1780A87n7l52J05L22j27l17J69K95k05k65K32K39k64j96K78J78l05j20L09R3l24
1801a25m7L36J1l33K3L32p3l29J04L23j56k89J67K75k19k29K36K08k68j74K73
1822D6J63l03j20L29P4l11m8L20Ol21L1L13o1l04J05K93j49k81J85K47k01k27
1844b14K14K12k49j69K55J49k88j04K92O4k98k4L08j1k91L4K94p5k85R7K89j49
1866E1k58J84K25j99k21K32J75k47j46K64J16k84q0K85M6k79j0K90j8k85N4K70
1888A65p6k72J19K57j46k25J62K10j92j95K18J65k39j37K43J09k64p7K73M4k77
1909a35mK73k7k71N5K63r0k49J23K35j48k18J84J97k07j63K29J28k19j26K52Q2
$$ y = [-247, -76, 247, 33, -245, 0, 259, -15, -234, 54, 239, -73, -215, 106, 213, -121, -193, 145, 170, -188, -167, 187, 130, -222, -117, 205, 78, -239, -70, 225, 20, -245, -13, 226, -38, -234, 44, 222, -83, -203, 106, 199, -125, -172, 164, 175, -158, -135, 197, 124, -205, -101, 222, 66, -223, -56, 219, 0, -229, 7, 215, -53, -227, 46, 209, -94, -214, 115, 189, -122, -170, 150, 156, -165, -134, 179, 118, -186, -81, 212, 63, -218, -33, 214, 13, -214, 0, 212, -37, -206, 49, 198, -90, -194, 98, 162, -136, -160, 148, 137, -154, -120, 174, 99, -186, -89, 200, 51, -207, -23, 202, 3, -218, 14, 189, -58, -204, 60, 176, -108, -188, 97, 143, -136, -146, 144, 126, -159, -105, 165, 89, -183, -64, 193, 47, -178, -16, 194, 2, -193, 25, 190, -49, -186, 57, 166, -98, -175, 98, 142, -135, -139, 134, 107, -164, -109, 154, 64, -185, -62, 173, 25, -193, -9, 188, -19, -182, 47, 175, -44, -170, 82, 164]
1931A64k52o3K67J9k64NK55k2k70P7K53j23k30J28K23j49k05J78J78j89j56K04
1953B8J33k18j10K34P4k41m2K44J7k48J3K43m0k50R3K30j07k26J31K08j54j98
1975a86J84J64j93j25J90J30k35q0K31O3k39k7K39lk36K3K39o0k21Q5K11j10k09
1998a65J38J84j54j80J76J55j97j12J92J09k22o5K13O4k26k5K21Lk32L0K26m9
2020H4k12P5K09j20j89J30J66j35j64J57J47j95j12J99Q0k05n5K12M0k15k2K26
2042A01j4k12M3K07o9j93R2J84j10j74J28J72j64j47J80J25j82r5J84Q4k06o0
2064a26K04K7k03rK10k5k00M8J82n4j80O8J90j00j75J38J40j42j29J68R7j70r1
2087a32J88O3j89m1J89K3j94kJ96k6j90L8J85o2j77R8J60j17j38J36J22j44j17
$$ y = [164, -88, -151, 116, 135, -129, -124, 131, 109, -161, -84, 169, 46, -184, -56, 167, 18, -187, -9, 169, -20, -176, 28, 161, -57, -167, 67, 141, -100, -142, 102, 119, -129, -116, 127, 87, -163, -70, 160, 53, -173, -42, 166, 12, -186, -2, 162, -31, -156, 34, 164, -71, -151, 80, 143, -96, -123, 116, 113, -123, -100, 139, 79, -142, -57, 154, 44, -165, -27, 157, 3, -177, -1, 154, -43, -155, 37, 146, -76, -141, 72, 136, -90, -115, 106, 109, -123, -93, 133, 84, -128, -53, 156, 36, -153, -23, 143, 8, -156, 1, 148, -47, -159, 40, 120, -85, -140, 72, 112, -103, -125, 101, 87, -125, -82, 125, 56, -137, -45, 139, 29, -145, -17, 155, -9, -156, 24, 149, -33, -128, 56, 140, -66, -126, 78, 105, -98, -107, 103, 78, -122, -74, 108, 54, -126, -58, 132, 32, -143, -5, 135, -7, -136, 32, 129, -41, -132, 56, 119, -70, -111, 78, 101, -93, -95, 101, 75, -115, -77, 108, 46, -131, -33, 127, 10, -128, 8, 130, -14, -131]
2110a31J62R3j69p3J79N3j86l8J93J2j91PJ81k3j81N2J67p6j65Q6J52j03j30J27
2134bJ24j40j03J48R1j58o8J63N8j86k3J82kj78K7J71m6j63N5J70r0j51R3J38
2158A10j21j06J18J04j38q6J44Q4j74m5J66M1j67j9J74j1j58J9J68n0j62O8J46
2181A05p4j41Q7J40j10j16J19J04j35q5J29P0j58l5J58L0j63nJ52pj62L2J54n1
2205C8j35N7J46q6j25R6J15j08j05J23Q7j40o5J32O5j46m1J56J2j44LJ52k6j47
2229h6L0J46n0j38O7J28q2j12R2J06j16q7J13R0j41n6J33M9j50k4J49Pj41lJ51
2254G5k4j50L9J54n5j40Q0J14q4j00J00R1j11p9J07Q4j23o2J31M7j45k7J47j2
2278E7j28J5J29l5j22L5J27n5j32P5J17q5r4R6Q3j05o5J05P4j28m5J33L1j27j2
$$ y = [-131, 31, 124, -45, -118, 61, 114, -72, -110, 83, 95, -96, -89, 92, 69, -112, -60, 107, 31, -134, -48, 104, 1, -129, -2, 122, -18, -121, 27, 118, -40, -108, 55, 113, -73, -96, 86, 84, -94, -67, 104, 58, -105, -50, 120, 30, -121, -28, 110, -11, -117, 1, 105, -33, -119, 25, 109, -65, -110, 56, 97, -70, -89, 85, 74, -84, -65, 103, 53, -109, -41, 105, 31, -110, -23, 117, 7, -109, 10, 114, -21, -106, 23, 93, -65, -100, 58, 88, -75, -80, 72, 65, -97, -65, 89, 38, -97, -40, 106, 20, -105, -9, 106, -2, -107, 16, 103, -37, -102, 30, 95, -51, -92, 64, 76, -68, -65, 87, 61, -86, -56, 90, 40, -98, -31, 97, 15, -97, -5, 101, -15, -102, 11, 101, -40, -96, 37, 86, -64, -88, 61, 68, -73, -76, 75, 51, -99, -60, 94, 39, -101, -21, 93, 9, -91, 9, 100, -11, -90, 17, 101, -22, -84, 47, 94, -51, -78, 69, 57, -71, -56, 73, 38, -84, -49, 78, 23, -109, -34, 83, -2, -96, 0, 83, -22, -87, 18, 92, -36, -81, 52, 83, -44, -56]
2303e6J32j6j22J6J27l0j29N1J15n4j28P6J07r0j01J04P9j09n8J00O0j12l3J23
2327E2J5j22j4J19Lj10J6J19l5j23N1J17o3j04O9R1r1p7R5O1r2o3J08M9j17l6
2353h2J35K0j21mJ16pj17J9J06l2j12N6R9o5q7O9Q3p3q7Q6O7r8n8J02N1j23j7
2380g4J11Rj19J7J17k4j06L6R8l6j02N6R2o4q1O7P6o8p2R0M2j04k5J01K4j05j3
2407e7R5Oj02NJ02j8r9L0R8m5q6M6R5n7q9P8O7p4o5Q1N4q0m4R7K2r6j4R4J2j06
2437e0MJ06k4r8K8R2n1q4O7P1o4p8P1O4p1m7Q1M9q8m1R8J1r1j1R4lq1PR0j5r3
2468e7K6Q5l8q2M8Q8p8o1Q4M2o6n1R1L2r5l1J01J2q8k1J06jr9K6P8k5q7M5P1n3
2498Bo0M3P5o6o0O8N2q1k9P5L9q6k7Q9J3r0RP8nq6J4R9l7q7N2O3m6o5N3N8n7n9
$$ y = [-56, 76, 60, -62, -46, 81, 51, -78, -27, 88, 34, -94, -18, 89, -1, -102, 2, 81, -28, -86, 14, 74, -38, -71, 52, 67, -55, -69, 50, 53, -57, -41, 78, 43, -80, -29, 88, 25, -79, -10, 81, -10, -87, 8, 69, -23, -86, 22, 71, -46, -82, 53, 73, -48, -52, 64, 57, -60, -41, 65, 33, -79, -23, 76, 11, -76, -7, 76, 3, -84, 2, 69, -29, -87, 15, 66, -57, -74, 37, 46, -73, -56, 61, 37, -69, -33, 65, 29, -73, -17, 75, 11, -70, -3, 73, 5, -67, 23, 65, -39, -64, 37, 61, -44, -57, 38, 44, -58, -53, 49, 31, -68, -38, 60, 15, -71, -25, 70, 13, -76, 2, 69, -5, -70, 11, 65, -15, -59, 38, 60, -36, -50, 44, 56, -50, -46, 60, 36, -62, -34, 58, 7, -77, -10, 61, -3, -81, -10, 54, -17, -64, 17, 66, -22, -63, 35, 46, -45, -56, 38, 35, -46, -39, 51, 36, -57, -31, 54, 16, -66, -18, 70, -8, -69, 15, 57, -9, -60, 31, 63, -32, -63, 38, 50, -38, -59, 47, 46, -53, -27, 51, 26, -61, -16, 55, 2, -58, -15, 60, -6, -66, 2, 54, -27, -56, 19, 58, -28, -55, 34, 47, -43, -34, 44, 39, -47, -33, 66, 29, -58, -6, 57, 11, -54, -1, 57, 0, -59]
2530e9P2L8p2l9P9J8p5j1P8j1p4QR3j0q9K8P7l5n7L5O4n6o4P2N2p2l9P1M0p6l3
2561d7P6J4p5j0P9jp0%O3mq1L1P4m1n6L3O5l7o6N4N0n9m5O4M1p4l4P9K0p1k4Q7
2593C5Op6QO5j4o6J3P7m4m8L4O2m7n8N9M0o2l0O2K5o9j6P5kp4MP0ro6K3N8k0o5
2626e0K8N8k9n9M3N4n1m7N5M3n5l6N9M3p2k3O3J5o5rO7jp0J7O3k8n9M2M0k2n9
2657d5L2M8l7n1N3L9n5k9M4K1n4JN8J0o8lP1qo3J9O5k7o6M4L3j6n0K9N4m6l6M5
2689A2K9n3l8O5J1n4kM1J4o0QN0j7m7K3N0k8m9K5M7k5m5N1L1m4l6N2L3n5k7N9
2720B1K1n9j4O6mo2MM9lo0K4M8j1n6K6N2m2m2L1M2l7k8M2K0l7k5M9jl4j5N7ln8
2753c9ON6j7m3K6M3k8m4L5L9k6m6M2L2l7l4M8J8m0k0N6%l9pL6Kn2J2M4nn8K5M0
$$ y = [-59, 13, 51, -21, -60, 19, 37, -38, -49, 29, 18, -56, -48, 45, 35, -54, -26, 51, 16, -41, -6, 58, 2, -62, 10, 62, -10, -49, 22, 62, -14, -47, 29, 43, -32, -42, 37, 36, -34, -34, 29, 25, -56, -25, 49, 8, -48, -15, 50, 13, -53, 1, 51, -8, -53, 11, 52, -22, -56, 23, 43, -28, -52, 35, 41, -35, -27, 38, 24, -42, -29, 48, 4, -44, -10, 52, 5, -53, 6, 46, -16, -46, 16, 41, -28, -44, 31, 29, -45, -41, 29, 20, -46, -23, 35, 15, -50, -22, 36, 7, -52, -9, 45, -6, -53, 2, 45, -10, -46, 13, 56, -16, -39, 24, 39, -26, -35, 32, 31, -39, -22, 41, 13, -46, -4, 36, 14, -45, -13, 35, -2, -53, 0, 39, -16, -45, -1, 20, -34, -33, 25, 35, -33, -36, 35, 27, -36, -17, 48, 21, -45, -1, 32, 16, -34, -5, 49, 3, -33, 12, 41, -12, -50, 15, 26, -28, -30, 11, 25, -35, -27, 23, 6, -41, -18, 32, 4, -45, -20, 27, 2, -43, 8, 39, -5, -41, 11, 44, -11, -38, 21, 42, -17, -31, 35, 31, -31, -27, 22, 19, -41, -17, 31, 20, -36, -10, 42, 0, -42, -11, 31, -6, -34, 8, 28, -9, -34, 15, 14, -20, -35, 22, 19, -39, -33, 23, 6, -37, -11, 32, 4, -40, -5, 34, 8, -38, 4, 36, -1, -35, 13, 31, -9, -29, 27, 27, -12, -19, 17, 19, -33, -21, 23, 18, -40, -15, 25]
2786B5j5m9L2L1k4l7M5J5l6k4L8K5l5j8L8K8n6jN6rm6NM8j5m8K0M3k2m3K8K9l0
2818bk8K3L6m0j6M5Ml9j1M2Pn0LM3Km3%N1j6m4K9L9k9l9L6K9l2j7K8K4l3l2M7
2851A7J0m3qM3Rm9PM1pm5RN2k1l2J6L4k4m0K6M9m2k5K1K4l8j2M4Mm3%L7Pm6J1
2885a4L8j8j9mL7j2k2J6K8j2k5J4J9j5k9L3J3l4j2M0Jm4NL3pl4MM0kl7OL2j8j3
2919a2J0K1j3l0K4L8l3j9K3J8k3j5K9J0l1kL1kl7LK5Lm7K8L2k6k2K0K4m1j6L2
2951BJ7l2j8M0J0k9mL2Jl1KL4j0k4PK9mm4K0K1ll3J5K5j6k3J7J9k6nK2J4k8j4
2985a7K3J8l4jK7jk8KL6k7j5J8Pnk3K5J8k8j3K4J7k3j9K7Oj6lQJ5k5jL0j4j1L
3020@J4Ql0LK2qk8K7J3j7k0K5J6l8nK5j0prM0j1k5MK8mk2KL1j5l4K4K8j7k0J6
$$ y = [25, 10, -39, -7, 24, 0, -37, 8, 23, -13, -37, 1, 26, -9, -27, 11, 39, -17, -18, 38, 29, -17, -12, 36, 21, -27, -7, 36, 14, -29, -1, 28, -2, -30, -7, 29, -11, -27, 18, 22, -17, -28, 14, 21, -29, -26, 17, 19, -24, -24, 27, 11, -33, -4, 35, 6, -33, 3, 32, 0, -17, 11, 35, 2, -30, 17, 27, -16, -24, 19, 28, -21, -14, 27, 20, -25, -16, 36, 15, -17, -1, 33, 9, -31, -5, 44, 2, -23, -2, 22, -16, -28, 16, 20, -23, -23, 14, 21, -25, -14, 24, 6, -13, -17, 20, 8, -14, 2, 30, 18, -7, 7, 26, 11, -18, 15, 28, -6, -18, 22, 23, -21, -16, 17, 10, -24, -20, 20, 18, -19, -13, 19, 1, -12, -2, 19, 6, -24, 0, 38, 5, -14, 9, 27, 4, -11, 18, 28, -3, -5, 26, 24, -13, -10, 15, 18, -29, -1, 31, 5, -17, 3, 27, -14, -30, 2, 19, -13, -31, 9, 19, -10, -14, 18, 19, -12, -10, 24, 14, -10, -3, 26, 22, -22, -2, 19, 16, -17, -2, 23, 7, -16, 1, 20, -6, -11, 11, 25, -3, -17, 6, 24, -10, -11, 16, 15, -13, -11, 25, -2, -17, 1, 8, 3, -20, 5, 23, -5, -18, 6, 23, 0, -19, 8, 14, -2, -5, 3, 18, -7, -8, 22, 8, -3, 0, 14, 22, -8, -5, 17, 9, -19, 8, 21, 4, -16, 9, 25, -13, -18, 7, -3, -10, -19, 21, 10, -15, -11, 17, 13, -9, -7, 24, 9, -25, -1, 27, 10, -10, 6]
3055FJ7j7k4L0J1j9oK1Kk4j6L6rj9%K3ok8J0L6j7k6J1K1j1l2L1J7j8j3J5Rj8J
3089fJ3Kj3j0L3j2o%J4mj5mK4pk5K1Qj3j1J5MojNJ5l7NJ9Lj6kK9j1j2pK6j0j6
3127hnK9j7j9K2J9j4j3J3J0j0k0K4J7k8%J7%k3KK2lj2kK2qk4MJ4Mk1J2Ok2KJ2
3163Bkj5qK5mj4KK2lk3J2J9Nk6OK4mk6J4J4j3j5PPomJ6lk3J1kJ7j9pRJ0j9lJ9
3202Blj7%L0j1k1J8J7k2j1K1Qj1k1K8%j0KJ2oj0pL1j1j3OJNk0QJ3j4j3PJ0kj0
3239a4J3Rj4j3RQj0MJ6Kj8mK0pj0LQmj9J1J3Mj7J7Kk0RJ0Mj6jJ1Orj4J1Rj2j3
3278a6L1rj4NJKlqRMk2J5LqLOJ1k0JJ0Pj0rK2Kj4nJ7Jj4oK2lj8J3%oj2J0J0pj6
3320a5J7Qk0jOQj0kMLj2OJ0J4l2J4LOrOOj5jQJ7j3lJ%l%J1j1MrlJ3j9JK3j5oK0
$$ y = [6, 23, 6, -18, 12, 23, 4, -2, 19, 21, -3, -19, 17, 8, -11, -11, 12, 6, -22, -12, 24, 7, -19, -8, 13, 2, -30, 1, 18, 0, -13, 2, 11, -7, -6, 7, 9, -4, -14, 19, 7, 1, 1, 15, 11, -4, -8, 16, 9, -16, 5, 13, 0, -11, 4, 8, 2, 1, 6, 21, -16, -11, 8, 11, -5, -7, 22, 11, -1, -8, 18, 8, -8, -13, 16, -1, -20, 2, 21, 7, -6, 7, 17, 7, -13, 11, 28, 0, 0, 17, 17, -6, -4, 18, 15, 3, 1, 23, 15, -9, -5, 9, 13, -8, 4, 10, -12, -10, 2, 0, -15, -23, 2, -2, -16, -14, 8, 5, -18, -6, 13, 18, -8, -2, 22, 18, -8, 6, 20, 7, -8, -1, 6, 0, -4, 12, 9, -14, -3, -5, 12, -7, -14, -5, 5, -14, -17, 2, -1, -18, -18, 12, 1, -20, -2, 15, -7, -18, 3, 11, 0, -21, 7, 7, -3, -1, 11, 5, -5, -12, 19, 8, -5, 1, 2, 7, -13, -5, 8, -6, -19, -12, -2, -4, -14, -1, 8, -6, -19, -10, -2, -12, -8, 8, 10, -8, -12, 8, 1, -9, -6, 2, -2, -21, -10, 3, 7, -10, 7, 9, -11, -2, 8, 12, -4, -5, 6, 12, 3, -11, 0, 9, -3, -16, 15, 6, -8, -3, -2, 0, -3, -11, -2, 2, -20, -5, -2, -10, -7, -1, 10, -10, -9, 1, 8, -2, -11, 11, 13, -1, -6, 11, 12, -2, -8, 14, 11, -7, 6, 6, 0, -12, -2, 8, 1, -15, 2, 10, -10, -11, -5, 3, -7, -9, -5, -2, -14, -8, 2, 16, -16, -2, 1, 7, -2, 4, 10, -5, -6, 2, 19, 6, 3, 4, 4, 1, 1, 12, 1, 5, -4, -7, 6, -13, -12, 11, -4, -10, 10]
3363A0jj4rJ5J3nj6ROj1KLMj7nK4nj7J0LkJkJ8onJlJ4j2MJ0j1mOJlj1NJ4nj3P
3406CpkLJ0Lj6nJ2Kj9OJ4moNJ1pmNmKOnJ1pjRkj7NPNj5OQnqnJ4qnlRqqJ4kpOP
3456CJj0mJ9j2j0LJ2Kn%J2Mj6J4kj3JnJ9j3qOPokQ%j1kJ4oKj1J6j2j1RRnlJ%r
3500a4LJ4nQk2J2MnpJ3J0j3%QnKkNroJ1J1j4mQLJojJ0j3pKJ1j3R%J0j5nJ2lpJ
3544hNNj1LoOlMK2qqlP%%loJ1klOj3QmMlNmj2kJ0Mkj2RRj4%MRqKRoMj4K1j0KN
3594IKmnRj0QkNj1Jj4J4Oj1%MMlmN%j1QnRoL%mlKNMk4J3PkojJ5mj1J0Pj0K%J2
3642A3j2pJ8ooKONj8NOKpJ%%nrJ0j7jJ6KmKqJ2pLRj1NjJjlKmJ6j3LLOnMlnOrQ
3692Dr%PnjqMoPONj3QkPJj4LOqMLknJ1kjJmNRj4KRrLj0J0mjOPk6J6mNKlKLrPL
$$ y = [10, 9, -5, -14, 1, 14, 9, -7, 2, 8, -3, -1, 2, 6, -11, -16, 8, 3, -14, -4, -1, -3, -2, -4, 14, 8, 3, 4, 1, 15, 3, 7, 17, 6, 2, 8, 9, 6, -5, 0, 14, 9, -4, 3, -4, -6, -3, 7, 10, -6, -11, 1, 3, -16, -10, 4, 0, -6, -1, 10, 3, -1, 4, 0, 2, 8, 3, 14, 7, 6, 15, 13, -4, 1, 8, 13, -2, 4, 12, 7, -1, -6, 8, 0, -5, -8, 1, -7, -15, -1, -3, -10, -4, 3, 4, -6, -10, 9, -3, -13, -10, 2, 4, -1, -1, 11, 15, -1, 13, 11, -2, -1, -6, 13, 0, -8, -2, 5, -1, -3, 5, 5, -6, -8, 6, 0, 2, -9, 7, -5, -16, -7, 2, -3, -6, -5, -5, -14, -11, 3, -2, 6, -16, -4, 0, -5, -12, 1, 11, -2, -2, 6, 1, 3, 1, 6, -3, -9, 2, 13, -1, -5, 3, 6, 7, 1, 0, 10, -3, -10, -8, 3, -10, -1, -1, 9, -6, -11, 1, -2, -9, -8, -3, 2, -9, -6, -12, -6, -9, -5, 17, 9, 1, -2, 5, 5, 5, 2, -4, 7, 5, 2, 8, -5, 3, -1, 3, 0, 5, 1, -11, -13, -3, 1, -1, -13, -4, 5, -9, -9, -5, 4, -4, -2, 7, 1, 5, -9, 12, 2, 4, 9, 11, 7, 2, 11, 1, 9, 7, 12, 1, 2, -12, 2, 8, -3, -3, 1, 5, 2, -2, 3, 3, -8, 0, -5, 4, -2, 1, 1, -3, -6, -4, 1, 5, -19, -6, 1, -1, -7, -8, 7, 3, -8, 2, 9, -1, 1, 1, 13, 1, -6, 12, 6, 0, 2, 8, 13, -5, 0, 6, 8, 1, 2, 2, 2, -3, -12, -2, -19, -20, -4, -2, -6, -4, -12, 0, -7, -4, 5, -6, -1, -2, -1, -2, -5, -3, -7, 9, -4, -1, 2, 8, 3, 7, 4, -1, 5, -4, 4, -5, -5, 2, -3, -4, -12, -8, -14, -7, -1, 4, -9, -1, -3, 4, 5, -9, -6, 0, -8, -4, -1, -3, -8, 3, 1, 0, 1, -3, 2, 11, -3, -1, 8, -1, 2, -8, 2, -2, -3, 3, 10, -16, 0, -4, 1, 3, 0, 2, 5, -4, 3, 6]
3745FLj2kLlRpPjnpRKnRMnq%NrJ6j7PPrJ4qKrKOqNOrmRonkLJmPMoj5NPRlkKPJ
3801FMpk%nJ0%j1ROjMqooJ3jj1%JJrJ3lrJ6j0kK%nJ2o%jRmoPj%KkJ0lQj5PPqo
3852aQo%J0%rMpjNlJ0okK%ojkQJljQjo%Lj1OMpKjLLLnlQmkjJ1jM%mpJ0jj0rPJ0
3907IqjKMpMqJJ1j3NMpMj1J3kklQjMj2K5j2noQJKPqj0J2omJQj1KLMrLk1J6jJo
3956a2PQrM%OqLNj0NPjoO%Rj2jmPnKkQpjjqNoLnJ6qRrrJ4kj2JK%J3qKNj3%oK1
4008Cj0QnJNqQ%lRqNLpMoQj1J5rlKRnoQkrjPnpNOjk%rJ2qNKljJ3lKj1RpRrOKr
4063bQKj3QoRj6ORj1J3j3mLNoJJmOj%%MJmLjnJ1rJPOrON%mj6J4oqJ6pOnmMLLj2
4115eLj1J4j6J5kj3J0ONpnNKpLJOQj3MjrMJ7j9LQpkJ1Lj2QqOpNQrmJ1p%JrRmm
$$ y = [6, 9, -3, -5, -2, -5, 4, -3, 4, 3, -2, -9, 0, 2, -3, 6, 10, 5, -3, -3, 2, -7, 9, -8, -1, 6, -3, 11, 3, 5, -4, -2, 4, -4, 1, 7, -2, -6, 3, -3, -8, -10, -7, -6, -10, -3, 1, -5, -20, -15, -8, 1, -2, -4, -2, 5, 6, 10, 3, 1, 1, -4, 6, 6, -5, 4, 10, 9, 13, 5, -1, -7, 6, 5, -6, -6, -5, -4, -13, 0, -3, -12, 4, -6, -8, -6, -6, -11, 1, -5, -5, -6, 3, -1, -7, 0, -1, -1, 1, -1, 9, 6, 14, -1, 6, 13, 5, -1, 7, 1, 1, 11, 11, 2, 6, -1, -2, 3, 0, 10, 4, 2, 4, 4, -2, -3, -5, 3, 4, 1, 0, 8, 7, 1, 1, 4, -7, -1, 3, -4, -2, -3, 0, 3, 6, 1, -2, 6, 2, 0, -1, 10, 9, 13, 13, 9, 2, 12, 11, 1, -8, -1, 9, 1, 0, 2, 6, -1, 3, -5, -4, 7, -6, -1, 3, -4, 0, -11, 2, 0, -2, -5, 3, 2, 6, -6, 19, 7, 2, -4, 4, 5, 7, 14, 6, -4, 8, 2, -2, -1, 7, -4, -2, 1, 5, -4, -1, -22, -6, -7, -6, -12, -5, 3, -6, -2, -2, 4, -4, -1, 4, -6, -1, 6, 5, -1, 5, 5, 14, 2, 1, -3, 4, -1, 1, -1, 7, 0, -1, -2, -10, -5, -11, -8, -13, 3, -5, 4, -5, -14, 0, -2, -14, -13, -11, -11, 2, -6, -4, 1, -12, -12, -18, 3, -7, 1, -4, -3, 2, -6, 2, 2, -1, 8, 0, 5, 8, 1, 5, -1, 7, -4, 11, 2, -1, 1, 10, 5, -1, 7, 5, -4, -5, 2, -3, -10, -5, 1, 0, -2, -2, -11, 1, -7, -2, 0, -3, -4, 9, 6, 8, -3, 6, -1, 8, -1, 5, 7, -2, 6, 8, -5, 3, -3, 6, -10, -4, 5, -6, 7, -6, -10, -7, -2, -8, -7, -6, -10, -4, -5, -5, -5, -1, 0, -4, -1, -2, -7, 4, -5, -4, 3, 9, 0, 6, 11, 11, 7, -9, 5, -1, -9, 7, 0, 6, 1, -3, 1, 4, 7, -5, -2, -13, 1, -15, 0, -2, -15, -5, 1, 6, -1, -6, -1, 1, -6, -3, -2, 4, 12, -1, 3, 2, -7, -3, 14, -5, -2, 6, -1, -3, 8, 11, -1, 7, -1, 5, -2, 3, 11, 2, -2, 9, 2, 2, 3, -6, 3, -1, -5]
4164eJ0pQk%krRMj0QNJj6QNKPj1JjJ0Jj8K3j5%j%jj1J5kqnJ1KlJKnJPq%j3jJ6
4212CjJnJ0pJ2k0QMjrQqRKq%kRrJPLJj0nlJ4komNnQKpLmJ8j6NPnj5K0qpjJ1lN
4263Ej0PJ1nKJnMojJLoOlMljKnMnj0PKrLlJ9j1Llj5RJ8oKjqLJoJ3JlkKm%Qq%%
4316BoRjqMLKoOmooJ2mMp%mjMJkPMmM%lOrQOMnmJ1j3JJ1rjjmnRnl%J0oj%krJ2
4371Aj1MJk%OqRNM%j2nRoKROn%nj0J9pjJ2j0o%J3j1NQj6lKPpKlPJkKJj3PjKPq
4422aKkkOqJ4qJ%rJ0LlRj1J3k2KJ7lpJLlrQJJoJ4j2KlJ%KjJNolQj%k%oNMJqmL
4475cOKokPMknjJ0j1J2j5LmkQKj5J3nRj6MQmjLKmqJ3qjJ0npJ0PkkMj4J8Kqj1J3
4523HJmLj0Kp%kRO%pMmKMj7J3LprOmJ1jKjPj0nJ5mMOj1J0j1NkQknkpONkj1J8k
$$ y = [-5, 5, -2, 6, 4, 4, 2, -7, 2, 6, -4, 4, 9, 10, -6, 2, 7, 9, 16, 5, 6, 5, 15, 16, -2, 21, 6, 6, 5, 5, 4, -7, 8, 6, -2, -7, 4, 6, 3, 4, 6, 1, 2, 9, 1, 1, -12, -13, 3, 2, 3, -2, 8, 1, 13, -7, 1, 5, 4, -5, 3, -5, 4, 6, -2, -2, -4, 5, -4, -3, 4, 7, 8, -2, -7, -10, 4, 2, -4, -8, -3, -8, 0, 2, -5, -2, -6, 12, -4, 1, 8, 3, -12, 8, 0, -7, -8, 3, 0, 5, -5, 2, 13, 8, 10, 11, 6, 10, 4, 3, 4, 7, 1, 7, 4, 8, 5, 4, 6, 1, 5, 0, -10, -3, -1, -10, -7, -10, 9, -2, 1, -2, -17, -8, 10, 4, 6, 5, -3, 0, 1, -5, 8, 9, 6, 4, 6, 2, 2, 10, 2, 2, 2, -4, 5, 4, -4, 0, 3, 5, -1, 5, 1, -5, -11, 1, -3, 1, -6, -6, -10, -11, -7, -6, -8, -1, 3, -1, 3, 3, 0, 6, -3, 5, 11, 15, 10, 6, 17, 4, 5, 16, 7, 6, 5, 1, -4, 5, 0, -3, -3, 7, 1, 0, 0, -2, -11, 1, -10, -6, -5, -7, -7, -1, -9, 0, 5, 9, 9, -3, -8, 1, -5, -3, 6, 12, 7, 7, 2, -8, 11, 4, 3, 15, 5, -1, -1, 12, 1, 6, 14, -2, -5, -3, 4, -3, -1, -4, 3, 4, 2, 4, 5, -8, -1, -2, 0, 7, -1, 1, -1, -3, 3, -5, 9, 1, 2, 2, -7, 3, 6, 3, 12, 1, 14, -8, -6, 11, 8, 1, 2, 5, 2, -7, 1, 2, 3, -3, 11, -1, 1, -2, -1, -1, 1, 0, 1, 6, 0, -3, 5, 4, 4, 2, 2, -4, 1, 5, 6, -2, -6, -3, 3, 5, -1, -3, 4, 8, 6, 1, 0, 10, -1, 11, -4, -1, -5, -7, 1, 3, -12, 1, -4, 5, -11, -7, 1, -3, -4, -1, 1, -3, -11, 2, -6, -7, 3, -2, -9, 1, 8, 6, 4, 8, -6, 12, 14, 6, -5, 8, 9, 5, 8, -2, 0, -7, -7, -9, 0, 6, 6, -1, 3, -1, 1, 5, -12, 1, 4, -3, -12, -6, -10, 1, 0, 2, 1, 8, -2, -7, 8, 4, 8, 14, 3, 13, 2, 7, 5, 13, 11, 6, 4, -3, 3, 8, 6, -5, 13, 11]
4573A1j0OrRj9QJ0j0NmJlNRrlMkOkQpPqoJ4KojmOmLKlQJqpLmlMNj2RlOMlQk0J
4626eJ6j2Mj%%qJ2Lmjk%LJ%LK%lpML%pRpLNnoOj9NR%Oj2M%NqkJ7pNqnJ0pJ1lK
4679ImRj0J9j1Mk1J1Rjnj0OKJpO%qNnKKkNj4J0j1KKOOqKMrQkR%mPjjqJRnJJj2
4730aRp%kOJ2j4JnRLk2J7okJ3rj2J0qRqPPmKqLjQj1P%mNPmmMJoRNj7QPmll%mm
4782dNKLMqkMnMklLJpoJ4%jNojPrJ4Nj0oMjoQJJjnknJKJNnNrOLm%qJ3o%JmOLn
4839@JJ%QqJMNlNnoPkQj0lRrj2K1j4Okj2J1MOkj0mKJ0nKoPPj2LKmRjnJ1qLjNn
4890InjOLmKkOomRppJ2%%j3J2mNpNoJMqmKKOoj3J7pPnJ0%k%pJQj3J2oOrJ3k%%
4942A0NjJj0J%kkMkjppR%nlNQ%lJoJ1pJ1lJoOlOklj%oQPnPj5J4j8J7pj2OmQKl
$$ y = [11, 1, 7, -2, 7, -12, -4, 6, -4, 1, -3, -2, -5, 0, 9, 0, -3, 1, -1, 5, 3, 11, 4, 11, 3, -3, 11, 13, 7, 6, 2, 8, 4, 7, 9, 6, 14, 15, 7, 0, 3, -1, -4, 0, 5, -7, 2, -1, 5, 9, 6, 14, -6, -5, 11, -1, 3, 2, 2, 2, -6, 6, 9, 5, 4, 2, 2, 5, 6, 6, 9, 11, 11, 8, 1, 5, 8, 8, 1, 10, 3, 6, 11, 6, 0, 6, -13, -8, 1, 1, 7, -5, -1, -1, 4, -4, -6, 11, 4, 9, 1, -4, 6, -1, 10, 7, 9, 5, 14, 4, 23, 12, 16, -5, 6, 15, 14, 9, -1, 5, 7, 8, 1, 7, 7, -1, 4, -1, 1, 3, 1, 6, -8, 2, -9, -7, -5, 1, 7, -1, 1, 5, -4, 4, 2, 11, 11, 7, 14, 13, 12, 4, 5, 14, 9, 10, 11, -1, 8, 1, 1, -1, 5, 17, 3, 4, -1, 8, 11, -11, 6, 0, -2, 11, 2, -10, 0, -8, 1, -7, 0, 7, 3, 5, -3, 0, -1, 7, -4, 3, 3, -1, 4, 11, 7, 3, 7, 8, 2, 11, 16, -1, 7, 14, 10, 7, 4, 4, 0, -4, 1, 3, 6, 10, 2, 0, 4, -1, 3, 1, -2, 1, 2, -5, -11, 3, 3, 2, 7, 1, 0, 7, -2, 12, 17, 7, 1, 5, 4, -2, 6, 7, 8, 7, 2, 0, -5, -4, -2, -1, 4, -1, 4, -5, 1, 4, 0, 0, -8, 5, -1, -1, 0, -4, 2, 5, 0, 1, 2, 2, 10, 2, 3, 7, 12, 9, 14, 9, 3, 10, 8, 16, 6, 3, 12, 3, -9, 12, -2, 4, 2, -10, 1, 5, 11, 9, -1, -5, -3, 7, 2, 4, -2, 5, 12, 0, 3, 5, 1, 10, 9, 4, 15, 7, 10, 9, 14, 9, 4, 3, 9, 12, 8, 10, 8, 14, 8, 4, 13, 6, -1, 11, 11, 11, -2, 10, 6, 11, 4, 9, 3, 4, 8, 0, -4, -2, 0, 6, 0, -13, 4, -3, 4, -1, 9, 9, 7, 7, 0, 1, 9, -4, 8, 2, 8, -1, 12, 10, 10, 10, 15, 14, 15, 5, 6, 6, 4, 2, 6, 4, 3, -4, -11, -2, -2, -7, -10, -5, 3, 3, 0, 1, -5, 6, -1, 10, 7, 8, 2, 8, 5, 11, 9, 6, 5, 5, -1, 7, 14, 9, 16, 1, 15, -3, 14, 7, -5, 1, -3, 5, 7, 4]
4994DqMklQjQj1lmJ4%j3%J4KrJ1Kj5QmJ4j2J1o%n%jJ5j5QoJ%jppJ3qKLqNJRmp
5043cOm%JOnlJJ1lmqJ5j0QlJ0mKkqJ5Mj0lj3JJ3rkPmmoOoOLjqOoRJ2qOj6%J1p
5093aKLkJ7j7KP%Lj1Pjl%kNoOqJ2%j8J6j1JKkjkr%K3MrkkoljRpOkJ2MolknNNo
5145COLj1LqMNj2J6kmJpLK%pLkQnoqJ0jRMqJ1pnOmMqLOK%PkqJ6j8MKpNkP%qQq
5199CnRQk1NJ4j2j%lMLnkOoQn%J1ooNKMjJ%jjMkPj8NJlKJ1j4J0rPj1NmJMj1%O
5250aQk3PRrJ4mRqmkJ2OoOj0lKnLJ1j4J2l%qQq%%oJ3LqJpMNnlmJO%kJr%NOnJ0
5302EoLJLJjMj0kMNoOj1L%%kjJ1krNMj2J3j1JJjLMpKnkL%J2qNKjkqKJKNPrPqJ
5356BkJMoLLJ6j5j8RLMqJkJrJ2LkOooN%KKoLPLokOqmJ0J3lmrPj1PrJ6j9R%MNj3
$$ y = [4, -4, 0, -2, -5, 3, 2, 10, -1, -4, -8, 6, 6, -7, -7, 7, 9, 0, 11, 13, -2, 6, 2, 16, 4, 15, 9, 9, 4, 4, 3, 18, 3, 11, 5, 6, 6, 5, -2, -9, 4, -4, -2, 1, -7, -2, -1, 8, 4, -3, 3, -1, -1, 0, 6, 1, -2, -1, 10, 7, 3, -5, 10, 0, 8, 5, 15, 11, 13, 11, 3, 18, 22, 12, 9, -4, -3, 10, 1, -1, 6, 2, -2, -8, -2, -8, -2, 1, 0, -8, -2, -8, 1, 13, 5, 11, -5, -5, 6, -1, 1, 4, 2, 19, 2, 4, 11, 11, 14, 3, 10, 9, 6, 6, 4, 9, 3, 9, 1, 13, 13, -5, 11, 0, 1, 3, 1, 0, -2, -11, -11, 12, 16, 7, 5, 3, -3, -6, -7, 2, -5, 1, -1, 11, 15, 9, 6, 4, -1, 4, 9, 3, 9, 12, 1, 4, -4, 0, 5, -7, 9, 7, 3, 4, -3, 0, 2, 2, -5, -2, -4, 4, -1, -7, -15, -5, -6, 3, 7, -1, 10, 3, -2, 4, 0, 4, -4, -1, 5, 7, 7, 14, 12, 4, 20, 2, 6, 8, 1, 6, 4, 11, 11, 3, 11, 3, -2, 7, 15, -6, -1, 13, 1, 0, 0, -3, 1, 4, -1, -3, 3, -3, 5, 0, 0, 11, 5, -1, 4, 6, 10, 9, 10, 10, 9, 8, 12, 10, 17, -1, 4, 5, 2, 4, 15, 1, 11, 2, 9, -2, 3, -1, 0, 4, -7, -7, -1, 7, -16, -9, 0, -9, 5, 1, 10, 2, -2, -4, 8, 14, 8, 14, 4, 1, 3, -2, 1, 12, -2, 10, 7, 7, -1, 7, -1, -1, -1, -7, 6, 9, 1, 2, -5, -1, 4, -1, -4, -8, -7, -1, -1, -3, -2, -11, -11, -6, 0, -5, 5, -1, 2, 3, 6, 7, 6, 10, 0, -2, 2, 7, 1, 7, -4, -1, -1, -1, -3, -4, 7, 5, -4, 1, 5, -7, 6, -5, -4, -3, -4, -1, 3, -4, -2, -7, -9, -6, -6, 6, -2, 3, 5, 4, 2, -6, -4, -3, -1, 4, 11, 2, 9, 1, 2, 0, 1, 5, -1, 2, 5, 21, 6, -12, -3, 0, 4, -4, -3, -5, -4, -13, -1, 2, 0, 6, 0, -6, -1, -1, 1, 3, -3, 0, 7, 10, 4, 2, 8, 0, -4, 6, 19, 16, 12, 3, 10, -1, 6, -3, 13, -6, 3, 3, 7, 12, -1]
5408aKmPLj0rJ1nLLKj2P%kJ0j3RkJPj2MlPkLJLKKkjqoMJ7j3OmkrNkKJpNMrQlk
5461dRoLJLLnMpKJ3j3kJ3rP%nnlOOj5J1KKrjoLLj1KMKkPoJ1okQj0rJ6%J0j7Mq
5511fRMK%rJ3j0LKj0J5rmJ3%rOj4OoKKKJmLm%kPj2J2jnJ4k0J1pNNnMKRj6j0J7
5558FoPjPmjj1PnPlJ1Jj0NljrqJ4mkklNLOj0J0j8J1KoMRpJ3j0j3J1J0j0MpO%j
5605DJ1rLooKkQ%njnjMJ1rmMkljJ8j5LnJ0rMPnOrRpRJpKQmqKoJ7nk%l%Lj4J2k
5658CpMkOj1J0MJpn%POj3J9j4lPj2QJkKQjpNlj%%J1kn%j%Oj0KOj3kKNj%MmJ0o
5709EPj1OoRj1J%KjNj3J5PrlOjLj0OjlPKrNpNnj0J5j1QokJmJ0KpkmNJnJ9qpJ4
5759A0%j4NPkJr%J1LoNrQj0ljJ1j0PljjlNkjLJj0QqJ0rjJ0j0Mj%m%J8lqjNLOJ
$$ y = [-1, 1, -3, 4, 7, -3, -12, -1, -6, -3, 0, 2, -10, -3, -3, -5, 5, -8, 1, -1, 0, 7, -5, -1, -4, 3, 1, 4, 5, 8, 10, 12, 10, 9, 1, -5, -1, 16, 3, 9, 5, 3, -6, -1, -3, -1, 0, -7, -2, 2, -7, 1, -2, -4, 5, -1, 2, 3, 6, 9, 4, 8, 1, 3, 16, 3, 1, 14, 5, 12, 12, 7, 2, -1, 5, 11, -4, 7, 9, 11, 2, 1, -5, -2, 1, -10, -8, -4, -2, -4, 3, -3, 8, 2, 0, 8, -2, -11, 5, 5, 15, -2, 2, -6, 3, 7, 9, 9, 0, 13, 3, 6, 8, -2, 13, 4, 0, 13, 13, 4, 10, -4, 2, -4, -2, 0, 2, 3, -1, 2, -2, -2, -4, 3, -9, 3, 2, -3, 11, -9, 2, -5, 0, 5, 0, 4, 6, 15, -1, -11, 6, 0, 7, 6, 13, 9, 8, -3, 4, -1, 6, 3, 14, 15, 5, 10, 7, 6, -3, -11, 3, -1, -3, -5, -8, -3, 0, 6, -4, 6, -12, -1, 1, -5, -1, 8, 1, 14, 4, -9, 2, 12, 2, 6, -1, 5, 5, 4, 15, 6, 9, 3, -3, -1, -3, 5, 5, 0, -1, -6, -7, -3, 8, -1, -5, -1, -3, -6, -7, 11, -4, -1, -6, 4, -5, -1, 6, 1, 7, -2, 7, 0, 9, 10, 3, 5, 13, 9, 1, 3, -3, 14, 9, 7, 7, 4, 4, 7, -7, 5, 3, -4, 0, -2, 4, -7, 3, 7, 8, 1, -4, -4, 3, 9, -4, 15, 1, -2, 5, -7, 1, 2, 0, 2, 10, 9, 2, 7, 4, 3, 3, 3, 14, 12, 7, 7, 6, 6, 12, 2, 4, 10, -3, -5, -3, 2, 1, 1, 5, 1, 11, 5, 12, 1, 7, 1, 10, -1, 0, 0, 2, 1, 6, -7, 8, 15, 6, 3, 9, 8, 11, 1, 7, 6, 3, 10, 12, 3, 8, 1, 6, 1, -9, 6, -5, 3, -3, -5, -4, -8, 2, 4, -3, -5, -9, -4, -3, -8, 11, 3, -4, 10, 10, -4, 1, 8, 6, 7, -2, -2, 9, 12, 6, 11, 2, 10, 0, -3, -4, 7, -3, 4, 1, 0, -1, -4, 1, -1, -2, 1, 2, -8, 0, -8, 2, -7, -8, 2, -8, -4, -5, -5, -9, -9, 9, 6, -2, -3, 2, 5, 11, 12]
5809A2poNj1QJ1qj3NN%jKm%KnmJ0j0RrQorKPKPkLo%lRKpJlLqJ1OloJ5rNj0JLm
5861@kqJ3jj4J1LplLpmRNj5RJJ%QkJ5j9RlnJ2pKlJ5rrJKlO%Mj7OLLj2JMkJ1j2
5910gKmJ6noMjnjPr%nJJ7kjNnJ3qn%Jjp%Q%oK6j0qpPOkqjmMJjlKjmLKkQpJ2j8
5964iLjJ5j3J2nKNPqjjkLkKJ1j1JmP%krKpMNj2NJ0%k4K1Rj7OPrnMJ1j1OMllmK
6013AJ5qjLnKkpJ4j0mLPLpJmjmPqOKkJ%%%LoQrnJmOmQJMOooOnLPj3NOQj1oRmj
6069CMnlJnN%Qj2OnmMmOkJmQLmPpKnjNMMlJLj4QlNrJ4kklNj0JLLlJ%q%KKoJ2o
6125Aj1Pj0J4olJ0ojJ1Mlj1NMOj2RljKkm%J7k1J0KnLkNlj3J2pqJ3jj7J2J3j1K
6169AJ1jroJ2j0jMLjJJ0pjj5K0kmmQOj1%KjlJ5j2LmJOj8J8j9LJ1rjJlQPrLoLJ0
$$ y = [12, 5, -1, 4, -7, 1, 12, 4, -9, -4, 1, 1, 0, 2, -2, -2, 0, -5, -9, 1, -9, 0, -9, -1, -7, -16, -14, -7, -5, 2, 0, 3, -3, -3, -6, 3, 5, -2, -1, -4, -1, -9, 2, 8, 5, -1, 14, 5, 10, 0, 1, 4, 0, -2, -10, 3, 2, -12, -1, 2, -5, -8, -5, -12, -16, -7, -2, -17, -8, -7, -6, -6, 2, 0, 15, -4, 5, 2, -3, 9, 2, 4, 1, 16, 7, -2, -1, 1, -2, 4, 4, 8, -9, -3, 0, 3, -9, -8, -4, -6, 5, -7, -5, -9, 7, 2, -4, 0, -1, -6, -7, 0, -9, -9, -14, -13, 4, 2, 1, 6, 1, 14, 6, 1, 1, 2, 1, -6, -6, 2, 2, -4, 22, 12, 4, -3, 4, 10, 8, 0, -1, -5, -1, 0, -1, -4, -2, -3, -7, -4, -2, -4, 4, -3, 9, -9, -6, -7, 8, -5, 7, 2, 4, 9, 16, 8, 7, 6, 4, 7, 5, 7, 18, 7, 8, 4, 11, 11, 9, 0, 2, -5, -1, 4, -8, -3, 7, 7, -17, 4, 13, -4, 2, 9, 0, -5, -1, 10, -1, 5, 9, 6, 3, -1, 1, 16, 8, 7, 10, 5, 7, 5, -2, 12, 2, -2, 1, 8, 11, 4, 5, 1, 0, -4, 3, -5, 1, 3, 1, 2, 2, 2, 2, 5, -1, 7, -2, -7, -6, -10, -4, -8, 0, 1, 5, 11, 5, -1, 5, 0, 3, 10, -3, 2, 8, 16, 5, -1, 8, 4, 3, 7, 2, -1, 0, -5, 0, 0, 8, -4, 2, -3, -7, -3, -7, -1, -3, -2, -6, 2, 5, 1, 8, 1, 3, -2, -3, 2, 6, 10, 7, 8, 11, -3, 5, 2, 7, -2, 12, 10, 8, 5, 10, 0, 1, 4, 7, 4, 5, 5, -3, -3, -1, 1, -5, 7, 1, -10, -3, -13, 1, -5, -8, 2, -4, -5, 6, 10, 7, -4, 1, 5, 11, -1, 8, 5, 4, 6, 4, 0, 0, 17, -4, 6, 8, 3, 6, 4, 9, 6, -7, 5, -2, -10, 3, 2, -15, -3, 10, -1, 1, 12, 11, 2, -4, 8, -2, -3, 1, 4, 3, 4, 14, 7, 6, -9, 11, 9, 5, 1, 9, 15, 4, 4, 6, 5, 2, 17, 5, 8, 4, 5, 11, -7, 11, -8, -5, 6, -3, -4, -3, -6, 2, 9, 0, 3, -3, 0, 10]
6217A0j1J0nKPj6OMKpOJQj6Oj1NQkoOmj3OJ1jJpjMrRkKj0J0Kj3KKNoJ1jKj2J9
6264A4jmj0J5Mj2kMJ0j1NnJklJ0loj2JJ4j1QrlRJoKNj1KJ4j3kJJ3kL%poMRJ%o
6311CNPrNjj0PlJ2j3Kj0RKLnLlpMMpKjNmnMJ%lPnJL%mJPnLqLP%nKJ2plJmmPjn
6367@qJ2OqlQqkLKqRjmJ0j9OJ4JqRkmNj1MNjNj0J4j2J0j4JL%JjPk2QMJ1j1%LQ
6415A2j2KMnjOj2J0l%LKPj1jKmR%oJ8k7K0j4J3orKNllLQrPLlkj6PMOJj1J2j0%
6462blQKjKnlOLoQJqJjMJ5j7%OmmKLMJqLj1J2ojj2LJ1j2J1oNJ0mj2RKjNj3PmL
6512CM%rkKQ%ll%NN%j5%J5j0MnJ4lj0KjNnJjKqOlMMKqJkmJ2ljLmKJ1npjPOjkp
6566EQj7OnPjLJ1k8QPqOmmj0J3J%JJmJ%J6j2lLqK3j0Qj2ONnmL%QnoJ7j2KmkRj4
$$ y = [10, -1, 9, 4, 6, 13, -3, 3, 7, 9, 2, 8, 9, 17, 1, 7, -4, 1, 9, 7, 1, 7, 3, -10, -4, 7, 6, 7, 0, -1, 3, -6, 3, 1, 3, -7, 3, 5, -8, -6, -4, 1, -5, 6, 5, 7, -5, 14, 13, 9, -1, 14, 18, 6, 4, 8, 18, 7, 12, 7, 8, 6, 3, 13, 10, 4, -8, -7, 7, -4, 4, -5, -8, 1, 2, -4, -2, 3, -8, -6, 8, -5, -7, -6, 7, 5, 8, 8, 1, -5, -1, 8, 9, 9, 3, 8, 15, 6, 11, 10, 0, 7, 4, 16, 3, 5, -5, 4, 6, 9, 4, 7, 4, -3, 1, 5, -2, 0, -1, 4, 0, -5, -1, 0, 0, -3, 4, -1, 0, 3, 3, -1, 0, 7, 2, 5, -3, 0, 7, 7, 2, 4, 16, 9, 6, 7, 3, -1, 6, 5, 0, -8, 4, 10, 2, -1, 7, -1, -3, 0, 2, -6, 3, 2, -2, 8, -11, -5, 9, 10, 2, 11, 9, 5, 10, -1, 3, 8, 7, 12, 2, 16, 4, 14, 0, 1, 4, 4, 5, 4, 11, -11, -3, 1, 12, 1, 1, 4, 12, 0, 2, 6, 1, 0, 6, -6, 4, 1, 1, 4, 6, 13, 2, 1, 3, -1, 8, 8, 2, 20, -7, 13, -1, 12, 6, -3, -1, 4, 1, -2, 1, 9, 0, 7, 10, 7, 5, -11, -4, 0, 6, 7, -4, 8, -2, -2, -5, 3, 5, 4, 6, 1, -2, 4, 7, 1, 9, 10, 2, 3, 2, 6, 21, 4, 4, 10, 6, 2, 4, 7, 11, 12, 4, 7, -4, 8, 2, 1, -11, -8, 3, -9, 2, -4, 1, 11, 7, -5, 4, 6, 5, 10, -3, 4, 0, 3, 7, 7, -2, -4, -2, 6, 6, 3, 0, 0, 5, 10, 10, -5, -5, 10, 0, 4, -1, 13, 10, 0, 2, 1, 6, 1, 2, 1, 3, -5, 1, -2, 2, 6, 8, 0, 1, -1, -5, 7, 4, 3, 6, 2, 4, 15, 10, 3, 2, 9, 15, 14, 12, 5, 13, -4, 2, -3, 4, 3, 6, 17, -11, -3, 4, -4, 2, -2, -6, -16, -3, -2, -2, -1, 0, -4, -3, -3, 13, 1, -2, 1, -7, 16, 6, 14, 2, 8, 13, 8, 4, 7, 7, 15, 10, 4, 21, 9, 11, 7, 5, 14, 0]
6615@jMKl%Qj5NnJ4j5jJ1j3J3lnJ2%jNrjmJNnJ5mkLqJ2j7J6j1lOjPj2NjlJJ1%
6662A3j2NqNo%Nj0RmLlKJ1KoLOmj2RJ1j7MJ0kmJlj0MQnJNj9PQMkj1RJqnRMj1J
6711bOplOjKjPnJ0onRKnLLj0J2Jqk%MMj9J5JoJlPj5LljLJ6j6KPmlJ2j5NJOmlQ
6762IJMkmNLJj1OlMlpJ1omMjJKrLkjMJoQj0pK3j1l%mJ7qkLLPj4J4p%LnpJOJ0m
6814A3nknJ0%JJklkKmNj0LjmJ4j7kJ5jnoJ1rJkJ8j3OrJ2oJ7k6R%RmpJ6o%j8K3
6860A7j3lRolJ0j7J0pJ1kj1JPl%j%J1j0lOMrOMKmkmQMj0J3j5kJ4okKOpJ4j7J2
6905A4j0KjN%j4OnNJjkpNJkkPLlj1J6jKkjlkLLMqLkJjJ0j0Pjmnl%J1J3nrPKj1
6956ErJkmQKmJlJ2Mj2NlRKKj4J0%nMpQ%j3J1%j0mJ2MmljLjqmQKlmjkRJj1J3j1
$$ y = [0, -1, 3, 5, 2, 2, 10, -5, 0, -5, 9, -6, -7, 4, -9, 4, 1, -4, 8, 8, 7, 12, 3, 2, -2, -1, 4, -1, 14, 10, 8, 11, 3, 15, -2, 14, 3, 0, 6, 5, 12, 0, 5, 4, 1, 2, 13, 13, 1, 6, -2, 3, -3, -3, 2, -8, 1, -3, 0, -3, -1, 10, 12, 6, 9, 15, 11, -1, 8, 19, 2, 6, 16, 14, 10, 11, 8, -2, 2, 10, 5, 6, 11, -8, -1, 7, 11, 9, -2, 7, 8, 0, -5, 4, 8, -3, -2, 4, -3, -6, 0, -1, 1, 0, 7, 2, 12, 6, 1, 10, 12, 7, 10, 13, 3, 15, 16, 8, 6, 6, 10, 14, -5, 10, 11, 5, 6, 3, 10, -5, -2, -5, -6, -3, 13, -3, -1, 6, 2, -1, 11, -4, 1, 2, 8, 4, 1, 9, 10, 14, 12, 8, 13, 16, 17, 6, 12, 9, 13, 10, 3, 14, 8, 4, 8, 7, 8, 10, 1, 4, 2, 1, 5, 6, 0, 8, -2, -9, 14, 3, 0, 0, -4, 13, 5, 3, 6, 9, 16, 2, 16, 9, 9, 12, 7, 0, 1, 7, 17, 13, 8, 6, 1, 11, 11, 12, 13, 11, 8, 6, 8, 4, 9, -1, 2, 1, -3, 11, -6, -8, 7, 6, 1, -5, 6, -3, -2, -4, 14, 1, 7, -2, 10, 4, 21, -5, 4, 4, 13, 9, 2, 18, 12, 12, -6, 17, 4, 1, 10, 4, 1, 11, -6, 4, -3, 8, 6, -5, -4, 3, 0, 0, -1, -1, 10, 0, -3, 3, 7, -2, 4, 8, 10, 6, 4, 0, 8, 12, 2, 15, 0, -2, 12, 6, 4, 6, 12, 5, 19, 2, 14, 4, 6, 5, 10, 10, -4, 2, -3, 2, 3, 2, 0, -7, -2, -1, -3, -5, 2, 5, 2, -9, 7, 6, 8, 6, 5, 2, 0, 3, 6, 10, 2, 5, 3, 4, 3, 13, 3, 10, 9, 5, 0, -3, -3, 8, 21, 16, 7, 14, 16, 5, -4, -3, -5, -9, -1, 1, -3, -2, -5, 7, 11, -1, 4, 1, 10, 12, 14, 0, 10, 10, 5, 9, 2, 10, 10, -3, 8, 8, -2, -6, 6, 10, 6, 3, 2, 5, 4, -4, -8, 0, 2, -1, -5, -6, -8, 1, 2, -9, 4, -7]
7006gJ4j0OJ1j5RpKPpJ0Mj6J7qkpRPj0JmOMqK%qNkpQjqK0j2kk%JPKj0KrR%MkM
7056GnjOqlJ4roJ9j0kNNrkPqqJ2LjoJjOjj4NPjj1J3pj2NJ0oJ2mLLmPj0jJ3mKj1
7105@NOkkkJlJRj8NNj0KO%Pj2jKMlJlOj2%J1Oj5J5qnOJKLkmPllNOrLKLlnpM%O
7159HNj2LMmjlOmrJ5j6J1mJ0Nj2NmjNMLko%jkKRljjpJJ0j2LLj5MNQj0OrLjPnj
7210aJ2j4QMj2nRqOLJ0pj1J2Mj0J3kmkKLnkJ0j2J5j0nlOOqNpQj0J2pLmlMmJnJ3
7257HmkMMRlqNj0J2j0kLj%JNlL%nJoJ7j4JKlOkLj7Q%KKjnNnmLMKkOqQjnPoO%k
7312HQj0Mj0LkRknLj4RknOLj4K4j3pKOllP%pJQLrPJnJjLJ2mplOmKKoPJjnQj1L
7365DMj3J3qNjnONj2J0ollJOKj6J4KmNrOLNj4J5j0LjLPkj3LQMklj3J0PJj0j0N
$$ y = [-7, 7, -3, 3, 14, -1, 8, 1, 3, 10, 3, 13, 17, 1, 18, 10, 8, 1, 10, 17, 7, 8, 4, 10, 14, 6, 8, 8, 0, 5, 3, -4, 4, 3, -5, 15, 3, 1, -1, -1, 0, 7, 9, -1, 1, -8, 1, 1, 5, 3, 7, 2, 1, 7, -1, -4, 10, 1, -5, 14, 4, 2, 7, 12, 3, 1, 8, 0, -8, 4, 7, 6, 0, 1, 0, 6, 5, -9, -4, 3, 2, -9, 4, -3, -15, -10, 0, -6, 6, 2, 5, 8, 4, 11, 1, 0, 13, 9, 11, 0, 5, 11, 9, 7, 5, 6, 3, 4, 13, -5, 0, 5, -5, -3, 3, 3, 10, -2, -3, -1, 3, 0, 1, -2, 4, -8, -8, 3, 9, -6, 9, 1, -4, 2, 3, 5, 8, 6, 2, 9, 6, 3, 8, 14, 5, 8, 10, 13, 10, 5, -2, 2, 2, 8, 13, 1, 4, 8, 4, 3, 0, 6, 2, -7, 8, -8, 3, -1, 9, 14, 2, 7, 3, 2, 7, 11, 14, 12, 6, 6, 5, 3, 5, 14, 11, 10, 9, 2, 3, 13, 1, 4, 7, -8, -4, 1, 9, -1, 5, -4, -1, -2, 5, 0, -1, 11, -3, 5, 9, -3, -8, 1, -7, -1, 2, 12, 5, -6, 6, 10, 0, 13, 11, 7, 5, 7, 10, 5, 3, 13, 1, 16, 6, 1, -2, 4, 10, 2, 7, 0, 8, -2, 10, 3, 6, 2, -1, 3, -1, 0, -5, 8, 4, 2, 6, 10, 19, 16, 8, 13, 3, 15, 5, 3, 6, 5, 5, 6, 11, 8, 11, 11, 6, 7, 1, 18, 4, 5, 7, 4, 10, 8, 11, -6, 2, 2, 4, 6, 5, 0, 5, 0, -4, -1, 3, 5, 3, 9, 1, 9, 8, 3, 10, 4, 10, 10, 8, 16, 6, 10, 0, 3, 1, 10, 8, 3, 6, -8, 1, -1, -6, 0, 3, -11, 13, 0, -7, -5, 1, -2, -5, 2, 2, -5, -4, 4, 7, -2, 5, 6, 1, 2, 1, 4, 16, 12, 5, 2, 8, 4, 6, 8, 2, 9, 10, 9, 4, 12, 1, 4, 8, -5, 8, 0, 5, 4, -1, 5, 10, -2, 8, 2, -1, -4, -3, 3, 5, -11, 3, 5, 1, 6, -3, 3, 6, 11, -3, 12, 2, 5, 4, 7, 14, 12, -1, 2, 10, 14, 12, 9, -4, 6, 13, 14, 4, -6, -1]
7412alLNmMKNj6MkQ%lJKJ0j7NJ3j0jNqRmOj5RNj0J4pKNj4JlLLKmjMPrmjmRj3J6
7463HplLjmPMj%jlJ3noR%lkKJ3j9NoLkQ%pljMMnRj5%NNKjllMpl%QKNkj0J0Kql
7518ANPPnoPqMk%Rj7PjpQj1NKkQj1J%OrKmJ1%qKKNqJJ7j3OqoRNJnlKKjKJJljl
7573DJjLj0NJlM%LRj6kkJ0mJ0j7J1lRj7MjJ2rRjnNkOqMQmj8J0pNjJ3r%km%Klq
7623iOLnmQK1j4jj1J6lpnRkmJ4kj1J3j1JJ3nkLlPj4J4mjJrOnOpnJ0JoRpRlnOj
7672A0JkmJPkpJ3j0JnJQmmNQmJ1j5jqJ0pjO%Nqlj2J5%ljNQj1jLkjRNj4j1K9rj
7721A0plK0rj0OOJKk1J2OkKNj3JjnOkMNqJMoKp%QKloQjnPnJ0qOqNJ%Lj1J1Nor
7773CMOpKoOO%rJmMmkj%J2lpJ5lj2mKk%KL%RojNnLLoOLLKKj2KJKKj6MMkRj4J4
$$ y = [-1, -4, -1, 4, 0, 4, 6, 11, -5, -1, -3, 5, 5, 2, 3, 5, 15, -2, 3, 16, 6, 5, 10, 2, 11, 7, 13, -2, 7, 12, 2, 16, 9, 11, 16, 2, 3, 0, 3, 6, 8, 4, 3, 7, 14, 5, 1, 0, -4, 5, -8, 8, 1, -2, 1, 0, -4, 3, 7, 6, 6, 5, 2, 15, 10, 4, 13, 13, 10, 8, 10, 23, 4, 9, 3, 6, 4, 12, 12, 5, 2, 1, 5, 9, 4, 13, -2, -2, 3, 8, 10, 9, 6, 3, 7, 0, -3, -3, 5, 7, 12, 10, 0, 10, 12, 4, 1, 6, 13, 20, 15, 9, 16, 8, 12, 10, 10, 19, 2, 9, 8, 1, 9, -2, 3, 5, 3, 11, 0, 1, 1, 7, -2, 0, -4, 7, 7, -1, 1, 3, 8, 0, 1, 18, 5, 11, 3, -3, 6, 11, 12, 7, 4, 6, 8, 7, 9, 10, 11, 8, 7, 4, 5, 4, 7, -3, 2, 3, 0, 4, 4, 7, 16, 0, -2, -4, 6, 2, 12, -5, 6, 3, 12, -5, -1, -2, 10, 1, 10, 9, 4, 9, 7, 13, 5, 9, 17, 13, -5, 5, -2, 3, 2, 15, 6, 6, 4, 0, 0, 2, -1, -9, -3, 0, -5, -9, -1, 20, 6, 5, -6, 10, 7, 0, -5, 4, 2, -2, 12, 10, -1, 12, 1, 2, 15, 10, 8, 11, 8, 15, 1, 15, 11, 10, 11, 2, 8, 3, 9, 2, -3, 7, 8, 2, 11, 4, 13, 10, 5, 11, 10, 11, 9, 5, 6, 13, 11, 4, 17, 7, 8, 3, 4, 12, 8, 4, 9, 17, 13, 24, 9, 8, 0, 10, 3, 2, 8, 8, 13, 5, 2, -10, 5, 5, 2, 1, 6, 14, 3, 2, 5, 3, 2, 11, 16, 2, -9, 20, 11, 10, 3, 0, 20, 11, 1, 7, 13, 14, 16, -5, 7, 13, 11, 13, 18, 5, 6, 5, 0, 6, 4, 8, 13, 5, 6, 10, 4, 6, -1, -1, 7, 9, 6, 0, 8, 7, 2, 9, 4, 14, 6, 12, 4, 9, 10, 10, 13, 2, 13, 18, 12, 3, 7, 13, 6, 8, 2, 8, 14, 14, 5, 6, 2, 6, 2, 0, -1, -1, 11, 8, 1, 16, 13, 1, -3, -1, -3, -3, -1, 2, 2, 11, 5, 4, 9, 4, 7, 10, 4, 10, 13, 16, 18, 20, 8, 10, 11, 13, 15, -1, 3, 7, 5, 14, 0, 14]
7827A4j4lJ3j0MPkj1OpkK0j0OrQj0OL%kjNLnj4J2%%LqLMnJ2nQj5Rj0KoqJ0KqJ4
7874Ik%kqMkNlLjjJ1Kj4JJ1%qJ1qMQq%ojkLJO%k5K2j4MPj1MLnqPJ3rnQlkNOrK
7926CjnJ3%oLj0jJ5jkNpPq%RnmNolOrPQmnLnKkN%rJ3j0Rp%%LMj0MKj%OnQkj2L
7980CPkkpRLmmJNj3NJ0kj1J5j6J0lMnj0J2j3QQKJplMJJLjjOJoMpmlQjkMjoMpP
8032EKolOlKJKj1RoLlkKPPpkKmOj1RJqJ4nkJJ2knQj0QMk2J4rJ1j0NmMlMjj1Oj4
8083iNKmKOlJj1J1Mj2LJ1MpRJnMRj2mKpMjLqJ6rPrOj1NJ%oMOj1PorJ1l%OmJ0j
8134Hj3J2qNllRj3J2%lJ2kklJj5LJ0mMpJkPkmJMm%rJ1nMjlj1RKlOOj7OJ0j2J3
8182Gj4lJ0KJ%J2on
$$ y = [14, 0, -3, 10, 0, 4, 11, 9, -2, 4, -3, -5, 15, 5, 11, 2, 10, 0, 6, 9, 9, 7, 6, 11, 14, 9, -5, 7, 7, 7, 10, 2, 5, 9, 4, 16, 11, 19, 4, 13, 3, 5, -1, -9, 1, 3, -5, 9, 7, 7, 5, -3, 1, -1, 4, 1, 4, 3, 2, 13, 15, 1, 2, 13, 13, 5, 16, 8, 12, 20, 12, 12, 6, 5, 3, 6, 7, 13, 13, -12, 10, -4, 0, 7, -4, 0, 3, -2, -10, -3, 10, 1, -4, 4, 1, -1, 4, 10, 1, 3, 2, -3, 10, 10, 4, 7, -3, -4, 11, 10, 8, 13, 6, 13, 5, 5, 14, 9, 5, 10, 4, 1, 7, -2, 5, 13, 9, 4, 7, 2, 4, 2, 7, 7, -2, 11, 1, 10, 3, 3, 3, 6, 10, 0, 4, 6, 5, 5, 11, 6, 14, 12, 0, 3, 10, 8, 6, -1, 8, 11, 7, 3, 4, 9, -4, 1, 11, 9, -2, 13, -3, 7, 4, 8, 3, -7, 5, -8, 0, 8, 10, 11, 4, 1, 5, 6, 7, 10, 9, 8, 14, 15, 9, 13, 6, 2, -1, 7, 6, 4, 8, 7, 1, 5, -2, 5, 7, 1, -2, 4, 1, 3, 4, 6, -5, 4, -2, 1, -2, -4, -2, 5, 12, 5, 3, 5, 1, 7, -4, 5, 6, -2, 12, 7, 5, 6, 18, 16, 11, 19, 9, 17, 21, -1, 13, 4, 15, 5, 10, 6, 10, 7, 11, 10, -1, 5, -9, -4, -2, -6, -4, 2, -1, 0, -11, 0, 4, -8, -5, 6, 10, 3, 12, 13, 8, 12, 21, 9, 5, 7, 0, 4, 3, 6, -2, 14, 5, 12, 3, 9, -2, 3, 4, 4, -2, 2, 8, -3, 4, -2, -11, 0, -3, -3, 3, -1, 9, 8, -5, 7, -1, 4, 1, -2, 7, -6, 6, 6, 3, 15, 13, 11, 8, 9, -6, -3, 7, 3, 7, 0, 1, -1, 6, 4, 0, 1, 5, 1, 1, -8, 3, -2, 2, 1, -2, -13, -4, -2, -5, 1, 7, -10, -4, 6, -6, 7, -7, -10, 0, 2, 3, 3, 15, 9, 4]
8191D
$$ Imaginary data points
##PAGE= N=2
##DATA TABLE= (X++(I..I)), XYDATA
0@%%%%%%%%%%%%%%%%%%%%%%%%Kj0J6j6J6j6J6j6K1k9L2l2L3m1M8m9N7o5P3q1Q9
45D8r7J06j20J30j40J54j70J90k11K31k56K85l17L54l97M49n12N91o90Q22j012
66e62J302j807K933r929N426K1156j3845j7690L937J7148O23r617n630K655N143
81A243O244k922j2102l180J6170R323j5708j5578J2886J8923p307j9694J719J6569
95F586L141j1285n336M174M881K378j363p551l850R999R849r651j4808O781J7809
110A1754k528j7993j853J5526N042j0951o127N519M834m36j366l195l427M636
124e65Q360l977j2401J539J4586J680j4675m681J2728O545r421o686N678N103
138C813k413k049L62j779K56N505N92q296k420R864M578r951o363Q802P231o936
$$ y = [0, 0, 0, 0, 0, 0, 0, 0, 0, 0, 0, 0, 0, 0, 0, 0, 0, 0, 0, 0, 0, 0, 0, 0, 0, 2, -8, 8, -8, 8, -8, 8, -8, 13, -16, 16, -16, 17, -24, 24, -25, 32, -33, 40, -41, 48, -49, 57, -63, 67, -73, 81, -89, 101, -110, 121, -135, 150, -167, 187, -210, 239, -273, 318, -372, 450, -562, 740, -1067, 1866, -8063, -2637, 18519, 4674, -13016, -9079, 8069, 8692, -925, -6555, -3900, 1243, 7487, 4565, -7537, -10717, 5453, 14776, -932, -16510, -3624, 15299, 7992, -11702, -9983, 6586, 9727, -1558, -6894, -2720, 2161, 4539, 3176, -4375, -8225, 1774, 11623, 1972, -12836, -6055, 11754, 9226, -8767, -10620, 4906, 9948, -1003, -7130, -1611, 3223, 2787, 1421, -1774, -5201, -565, 7795, 3818, -8583, -7044, 7542, 9222, -5453, -10134, 2594, 9139, -282, -6968, -1290, 3813, 1400, -649, -287, -2066, -1810, 3695, 4287, -4009, -6429, 3435, 8013, -1938, -8301, 501, 7732, 796]
154G96o907M857N422l251l158K432M39k514K065L340l968m618N020N933n257o847
170f216M908P108m198o652L602N619l277m205L432K693l903j355M609L35n360
185b860L45N841p53o088J061N977j439n667J921N236k566m785L254M428l856m151
201d102M282L903m428l566M400L009m169k144L970J042l954K33M199j457m724
216c506K391N386k942o045K988O428k682o333K118N679j650m463J495K873j870
231a33j146K792k90m133J253N625j503o901J131P723l41p751n49O982J156n563
247a648j206L769M56j984R35O00k868P6M858K6o542q16P536J998p647l126O871
264A288L845n403l753L641K818j988j046Q92j212n85L531J141n402k354O451L852
$$ y = [796, -6111, -1254, 4168, 917, -2241, 191, 630, -1884, 181, 3521, -447, -5065, -45, 5888, 631, -6216, -1308, 5800, 1602, -5050, -1448, 4171, 894, -3311, 121, 2814, -1089, -2444, 2165, 2500, -2860, -2515, 3326, 2573, -3515, -2454, 3523, 2084, -3583, -1662, 3574, 1008, -3777, -523, 3905, 49, -4102, 180, 4083, -345, -3911, 489, 3498, -671, -2815, 1155, 2197, -1757, -1524, 2675, 1218, -3506, -1115, 4271, 1329, -4716, -1728, 4700, 2018, -4315, -2197, 3482, 1832, -2631, -1136, 1737, -133, -1279, 1513, 1223, -2910, -1657, 3968, 2465, -4436, -3305, 4418, 4077, -3674, -4223, 2759, 3915, -1648, -2854, 915, 1371, -613, 322, 922, -1946, -1870, 2988, 3014, -3528, -4344, 3192, 5190, -2457, -5583, 1288, 5133, -270, -4023, -382, 2436, 448, -598, 294, -918, -1503, 2028, 3169, -2233, -4587, 1864, 5716]
280E716o581n198N787N914m416n759K799M653j468k788P82M52r16J828J881l595
296i09l326M539M960m564o298L833P001k612o784J318N727l66l993O5J902n63
312g0O8J740j560l376K281N037k237o353J511P063n05o902n07O007J133m557j076
329b303K866L57j330J024K41k681K02M314qn570o24O164J468o121k185N475K461
346C750m452k184L263J316k270k5J658j455j513K856J800l897k353M481K979m532
362e78l382M176L482l566l137K941K345k443j292K228J28k372R60K726j815l222
378b821K285L687k480l996K420M003k240l694K093L112k040k369K209J613k520
393g38r05K966L42l378O0L737l36l911N26L908p32l751R68L457j294l137J674
$$ y = [5716, -865, -6063, -276, 5638, 1222, -4537, -1738, 2915, 1447, -1341, -559, -107, -1023, 805, 2686, -909, -4235, 304, 5264, 700, -5598, -1765, 5236, 2624, -4160, -2842, 2885, 2519, -1474, -1409, 493, -70, -2, 1738, 178, -3198, -917, 4120, 1883, -4470, -2959, 4104, 3599, -3303, -3810, 2197, 3330, -1227, -2303, 563, 920, -410, 614, 855, -1826, -1624, 2690, 2682, -2888, -3512, 2652, 4120, -2001, -4186, 1289, 3750, -702, -2886, 377, 1693, -577, -602, 1056, -399, -1912, 944, 2744, -1153, -3506, 975, 3954, -578, -3960, 216, 3698, 132, -3005, -64, 2281, -162, -1454, 774, 902, -1470, -510, 2216, 401, -2821, -536, 3151, 671, -3325, -905, 3098, 858, -2836, -743, 2369, 329, -2040, 169, 1782, -738, -1643, 1323, 1665, -1713, -1653, 2084, 1748, -2163, -1637, 2271, 1539, -2212, -1244, 2213, 919, -2218, -544]
410e44K787k077k485K433K194k743j921K964J601l069j212L121P82l142k80L210
426A619k24l291P09L379j069l444J313L437j484l299J576K992j671k536J810J937
442A754k056j346K446P72k922l30L397P6l787J7M018jl983k0L743o1l236K83K655
461A419p34k050J384J540k140j255K875J168l483j278L817J489l922j620L679
476H89J597l210j320K657P76k152J4J839r44j712J831J881k542k206K991K603
492B992l104k889K931K912k535k677K109K065j786j238J658K80j826O22K208j357
508C65k721J773L264j909l623J774L743j480l515J210K994j048k234J144J359
523A096j454n54K020r0k663M36L296n28l764L97L920j72l806j5L370M3k759J60
$$ y = [-544, 2243, 166, -2319, 114, 2308, -435, -2356, 608, 2209, -860, -2072, 1049, 1831, -1311, -1591, 1619, 1395, -1896, -1187, 2192, 1123, -2321, -1008, 2429, 945, -2354, -778, 2214, 543, -1993, -183, 1754, -302, -1648, 798, 1570, -1352, -1682, 1715, 1791, -1996, -1979, 2039, 2038, -1945, -1965, 1778, 1717, -1519, -1236, 1419, 685, -1365, 19, 1559, -581, -1836, 1039, 2207, -1276, -2554, 1263, 2752, -1170, -2790, 889, 2486, -724, -2044, 613, 1389, -763, -749, 1090, 146, -1566, 265, 2146, -396, -2602, 389, 2992, -112, -3001, -70, 2842, 307, -2370, -261, 1804, 18, -1220, 438, 718, -1108, -486, 1722, 365, -2356, -583, 2681, 772, -2851, -1077, 2666, 1186, -2329, -1119, 1875, 827, -1407, -263, 1096, -358, -912, 1108, 1018, -1645, -1209, 2087, 1559, -2205, -1808, 2112, 1940, -1866, -1881, 1489, 1532, -1227, -1067]
541a067K065o26j437J295R82k006p70K689P84l201r01L451J103l419j201L167
557I08J128k770q28K327L14j974L59J718j070j687J723J771k220j950K538K081
573B368k606k135K510K036k324j734K150J265k013o74K000N4k077N01K257r64
589F14k450J240K614j397k676J442K597j469k365J465K017j546j572J679J149
604A342j916p22K166L99k409j27K591o7k667K30K683l86k576N81K391q17k175
621a479J078J947j380j740J662J519j927j319K101J125k256q98K335O57k383l62
637a320K378P1k375K60K359n37k318Q14K256j014k144J209J972j360j765J535
653B1J486j707j195J882Q77k078o22K259L74k400k07K471O4k473Q3K388k84k181
$$ y = [-1067, 998, 372, -1065, 230, 1212, -794, -1564, 1125, 1909, -1292, -2193, 1258, 2361, -1058, -2259, 908, 2036, -734, -1562, 765, 1079, -895, -536, 1182, 112, -1575, 148, 1919, -301, -2251, 287, 2368, -238, -2373, 137, 2173, -151, -1885, 265, 1530, -483, -1157, 843, 897, -1180, -679, 1578, 614, -1836, -596, 2018, 621, -2055, -613, 1984, 515, -1850, -385, 1632, 86, -1486, 193, 1342, -574, -1296, 870, 1269, -1140, -1267, 1324, 1257, -1410, -1180, 1503, 1117, -1459, -878, 1513, 696, -1479, -401, 1546, 166, -1574, 88, 1607, -320, -1639, 462, 1587, -669, -1567, 768, 1425, -958, -1320, 1058, 1129, -1246, -986, 1373, 836, -1482, -668, 1588, 574, -1570, -361, 1611, 251, -1514, 21, 1507, -200, -1395, 487, 1364, -714, -1336, 923, 1297, -1103, -1310, 1161, 1225, -1248, -1165, 1223, 939, -1242]
671a242N08J967p82j722J122J493j467j320J827J190k094j110K275J056k365r51
687a615K315P99k219n49K037K18j891K03J763o53j704J070J700j397j772J668
703b7J827j785j807J796J708j737j491J666J149j589p37J600K92j721J58J843
719A145n15k032P66K188r11k289R65K251r72k082R58J830j020j452J166J054j371
736c21o68J667L58j945j44K196K3k366M0K416o9k356J14K161k45j887M38J574
754I86p31j325J094J092j453r61J784Q75k002q33K109Q28k120p29K026O07j878
771f31l64J721N1j582L15J505p02j460J037J456j301j496J481J489j577j441J581
788H2J302j575j079J547P82j538m51J586J08j635J92J738m58j818O72J866q07
$$ y = [-1242, -734, 1233, 451, -1271, -149, 1344, -123, -1443, 384, 1574, -520, -1630, 645, 1701, -664, -1615, 700, 1499, -720, -1269, 768, 986, -905, -702, 1061, 408, -1296, -226, 1474, 77, -1695, -27, 1800, 15, -1792, 4, 1712, -25, -1516, 150, 1299, -290, -1027, 573, 865, -856, -698, 1145, 630, -1402, -636, 1552, 641, -1648, -683, 1568, 596, -1486, -528, 1302, 282, -1170, -4, 1050, -321, -989, 678, 1036, -909, -1053, 1143, 1166, -1200, -1160, 1256, 1187, -1169, -1055, 1106, 861, -1026, -588, 986, 255, -1070, 24, 1116, -337, -1298, 486, 1361, -641, -1474, 635, 1463, -657, -1386, 640, 1247, -631, -995, 726, 777, -805, -490, 1015, 313, -1147, -110, 1346, 45, -1451, 30, 1519, -58, -1499, 82, 1384, -191, -1270, 277, 1059, -479, -930, 656, 764, -871, -679, 1059, 601, -1217, -545, 1321, 514]
805E14j855R11J767r88j604J060J393j175j135J300Q63j445o21J582M13j725k30
822i75J827P6j869P4J841j94j790L73J670n36j536P28J403r36j258J139J114j318
840a67r88J455Q47j566o97J634N17j658l52J672J44j686Q4J656k88j617N04J573
858A067o88j498Q71J406j008j274J143J117j264r49J384P61j479n74J550L93j630
875f72k23J652O2j668R2J623k64j539M13J458o07j335Q04J192r77j078J179R86
893A098j347q41J439P48j491o34J543M70j517k99J485Q6j452J41J393l81j381
910i40O31J338q34j323J000J270j113j214J189J084j209r23J250P23j275m97J315
927D72K65j369qJ419j85j476L56J509m73j528N80J464o58j361P33J207q32j021
$$ y = [514, -1341, -430, 1337, 349, -1255, -195, 1198, 23, -1112, 188, 1051, -394, -1015, 567, 980, -745, -975, 852, 928, -941, -867, 974, 780, -1010, -637, 1033, 497, -1039, -311, 1092, 156, -1102, 37, 1151, -167, -1155, 300, 1147, -419, -1116, 518, 1035, -623, -975, 697, 841, -845, -761, 895, 607, -1010, -506, 1067, 379, -1119, -248, 1158, 150, -1124, 19, 1136, -128, -1077, 307, 1068, -411, -985, 565, 958, -672, -895, 757, 819, -849, -757, 866, 602, -937, -524, 934, 327, -1008, -204, 988, 11, -1067, 112, 1098, -249, -1090, 349, 1097, -394, -1028, 515, 985, -532, -831, 654, 740, -712, -571, 822, 441, -940, -309, 1029, 195, -1128, -128, 1142, 29, -1185, 4, 1088, -121, -1044, 206, 929, -346, -843, 472, 737, -632, -640, 779, 594, -882, -526, 983, 510, -1018, -438, 1026, 368, -993, -260, 947, 115, -906]
945i06R34Q23j067o16J216M43j373k79J470J78j546o1J562k9j531J43J443k68
963E36j328M39J170o23j039Q22R25j030q22J192P28j313o61J385N79j423m51J404
981D90L24j360j40J291o3j205K68J175m66j156O78J119q32j103R56J047j026r77
999i80J082Q30j107o84J121M99j148l14J185J07j232R6J251k50j291M12J275m98
1017C54j260O20J196p13j078Q08R41q81p95R90O29j094m54J175L05j256j89J309
1035F07O3j325M2J318j88j262K98J182m22j114N95R92p07r03Q30Q22r48p04J040
1054B16O10j123m78J165L55j174k36J182R2j185N3J180k24j144L71J087n05j041
1072g99O30R77p43q95Q49P95r34o73J014N43j073m05J127K69j164j24J177j9j169
$$ y = [-906, 28, 851, -216, -832, 384, 827, -546, -825, 645, 823, -723, -784, 778, 749, -782, -639, 804, 536, -792, -353, 817, 194, -845, -23, 902, -128, -950, 242, 970, -343, -1004, 381, 960, -463, -914, 490, 814, -546, -686, 605, 542, -663, -395, 780, 314, -842, -164, 955, 123, -980, -24, 1023, -3, -980, 102, 932, -175, -859, 262, 761, -387, -701, 484, 591, -641, -545, 706, 456, -835, -423, 852, 354, -906, -286, 910, 197, -881, -73, 868, -13, -808, 182, 811, -283, -737, 438, 743, -513, -702, 607, 670, -655, -613, 705, 517, -745, -447, 735, 313, -801, -206, 786, 79, -824, 6, 828, -120, -824, 216, 826, -297, -775, 390, 745, -429, -665, 517, 609, -576, -523, 657, 433, -711, -340, 747, 242, -799, -169, 808, 65, -830, 19, 814, -120, -793, 221, 764, -309, -714, 413, 682, -482, -606, 571, 552, -617]
1091f17J33J154k65j111L83J048n12r72O26Q85p45p96Q61O90r29n98J012M90j057
1110c20l75J092K63j093j43J098kj070J59J026l03r89M31R57n76r18O80Q52p84
1129a5p82Q46O94r11n66R38M48r76l02J014J53j027pJ051j36j049K64J054l61
1148C30j034M57R80n32r07O23Q03o93o92P68N51q51m24R12L02r84j99J025R8j062
1168e29jJ066r2j024J85R83l00r06L98Q42n13p42O31O61p44n77Q51M92r12m29
1188f60R75L19j001k21R96J22r83pR50j22r14K71Q56l92q24N07P95o02p53O97
1208IO99p74o15Q08N22q33m13Q52K89q72j53Q69M1r03Q5R02j93r11L06Q86l86
1229B15q48M64P94n33p08O12O16o73n20P50M25q03l18Q60K02q95j06R15Pr35Q9
$$ y = [-617, -484, 670, 405, -706, -323, 725, 213, -759, -133, 752, 7, -789, 72, 762, -167, -765, 247, 737, -320, -695, 397, 660, -433, -576, 522, 520, -550, -391, 635, 332, -657, -226, 731, 155, -763, -83, 769, -15, -797, 49, 743, -168, -734, 204, 652, -324, -626, 388, 541, -486, -493, 558, 422, -627, -363, 691, 330, -704, -247, 733, 201, -706, -83, 720, 27, -665, 103, 654, -197, -621, 291, 593, -391, -590, 435, 533, -529, -530, 536, 444, -580, -395, 588, 288, -618, -220, 622, 109, -633, -2, 659, -85, -662, 189, 681, -231, -660, 315, 634, -367, -588, 408, 530, -453, -460, 490, 368, -546, -275, 581, 189, -635, -128, 667, 65, -688, 9, 708, -66, -681, 127, 649, -184, -597, 255, 544, -328, -481, 388, 429, -474, -389, 513, 320, -591, -285, 601, 215, -633, -169, 625, 92, -616, -4, 612, -61, -581, 169, 594, -209, -527, 333, 535, -360, -466, 449, 456, -479, -390]
1250c90R08j74q93K73Q29l73p58M42P08n56o28O37N52p10m64P73M01q26l01Q52
1270C02K12q64j11Q67J0q40Q7Q30j89p96K89P60l86p30M77O62n52o16O15N41o78
1291a10m49P10L63p62k65P97J70q18n8Q26l2q23J37Q05k33p67L12P36m02o73M75
1312f1O20n60n37O15M70o73m03P26L02p56k21P79J44p90n4P96m8p83J45P47k29
1333B29p07L14O77l96o46M77N95n37n38N96M57o39l84O66L01p05k08P25J06p42
1353c59kP55r1p48J79P41k74o90L35O61l81o24M65N56n20m87N72M01o24l13O60
1374B12K29p05j63P42O2p41LP42p4p38J49P00k30o54L11N95l72n42M51M89n16
1395e0m13N73L71o16l10O53K45o74j65O73R5o81j6O77r6o47J72O26k73n92L44
$$ y = [-390, 518, 344, -549, -276, 553, 180, -578, -136, 572, 16, -612, 25, 577, -133, -597, 176, 577, -249, -550, 302, 514, -350, -461, 406, 416, -424, -337, 493, 304, -492, -203, 557, 171, -559, -82, 580, 28, -588, 27, 568, -110, -559, 151, 514, -248, -513, 284, 454, -364, -422, 404, 372, -451, -314, 491, 258, -509, -197, 539, 137, -536, -61, 559, -1, -538, 77, 547, -126, -529, 197, 499, -257, -478, 301, 445, -345, -399, 397, 349, -434, -289, 458, 229, -478, -164, 513, 117, -529, -52, 543, 6, -532, 64, 521, -118, -502, 164, 465, -240, -448, 277, 383, -359, -361, 394, 303, -445, -266, 475, 201, -489, -154, 507, 126, -498, -33, 523, 3, -484, 88, 489, -135, -448, 212, 441, -264, -427, 315, 377, -364, -361, 381, 307, -431, -282, 418, 188, -466, -155, 440, 68, -474, -23, 466, -50, -463, 110, 481, -135, -445, 208, 453, -221, -386, 287, 382, -299, -315, 362, 266, -381, -209, 417, 144, -448, -104]
1416a04N66m23n32M75M98n45m17N63L58n91k77O20K03o25j24O50K7o49N5O50j33
1437B45o41J91O35k68n95L24N51l78n08M42M39m78l80N27L04n74k31N98J72o27
1457b52r0O34K2o33M7O25j18o12J81N91k59n35L11M90l88m51M61L93n13l29N45
1478A20K64n65k03O02J30o13n5O17po05P6N83j37n68K21N34k72n14L37M66l95
1499A6m18M32L66m74l25N25K29n25j90N55J17n68m3N55j4n59R1N53j52n32K28
1520a33N00k63m86L36M36l81l90M36L33m67k74M93K15n26j62N59P7n61k6N52m0
1541B28n50J17N14j57n15K35M75k74m56L44M10l87l61M28L14m49k71M83K09n08
1561a71j30N10P5n18j7N25n5n21J15N13j76m82K24M63k90m18L32L78l69l34L97
$$ y = [-104, 462, 39, -493, -18, 480, -65, -482, 81, 439, -152, -429, 191, 394, -231, -355, 295, 322, -327, -272, 378, 245, -396, -205, 430, 162, -433, -109, 442, 64, -444, -2, 437, -41, -421, 106, 410, -164, -395, 203, 375, -252, -342, 292, 314, -319, -272, 353, 235, -377, -196, 395, 136, -399, -88, 402, 14, -437, 24, 417, -96, -425, 120, 384, -181, -384, 218, 348, -265, -320, 297, 290, -315, -239, 344, 207, -361, -140, 394, 122, -392, -55, 411, 16, -402, 30, 396, -78, -403, 122, 351, -174, -364, 191, 308, -260, -303, 252, 238, -321, -230, 323, 171, -361, -133, 367, 104, -382, -46, 390, 9, -381, 55, 388, -79, -353, 140, 355, -171, -333, 226, 303, -258, -284, 268, 228, -322, -205, 309, 152, -363, -128, 347, 73, -383, -39, 371, -16, -377, 51, 365, -84, -355, 128, 337, -171, -301, 209, 284, -234, -251, 274, 219, -302, -187, 326, 150, -332, -108, 355, 65, -353, -21, 357, -12, -346, 51]
1582E1K76m31k13M74J56m88j10N05M6n10LN18p8m96J16M83j82m50K39M08k69l94
1604c46L33L44l73k83L97K53m29k03M60J54m71r8M77M6m73J7M66q5m55J36M36
1625C03j91m22K34L97k92l57L09L25l55k87L93K38m19j73M14J41m34o8M49J1m53
1646b37O1M34q7m52J55M29j89m00K35L68k86l32L21K89l53k48L72K01m03j54M16
1667A40J02m43l9M32Rm36K7M44q4m14J36L93j75l75K26L46k61l03K94K69l39k27
1689b78L62J90l84j57M12Q5m07m6M14%m19N9L94r5l77J41L67j81l60K37L21k58
1711B0k92L00K51l40k11L61J65l76j14L59Q9l84l9L90rl92N0L90r9l64J36L49
1733B40j82l15K17K98k58k56K91K20l06j91L38J50l61j08L57P6l72k1L72l6l71
$$ y = [51, 327, -104, -317, 157, 313, -175, -285, 220, 266, -244, -241, 277, 199, -297, -181, 302, 120, -330, -91, 317, 48, -346, -13, 331, -42, -325, 72, 325, -104, -307, 153, 307, -164, -262, 215, 261, -212, -195, 271, 186, -269, -133, 303, 112, -310, -76, 321, 29, -328, -19, 306, -49, -336, 57, 295, -124, -297, 117, 258, -176, -244, 205, 216, -237, -176, 258, 171, -281, -126, 303, 114, -286, -51, 317, 31, -301, 20, 309, -44, -292, 80, 281, -122, -276, 140, 242, -201, -240, 192, 201, -235, -208, 236, 152, -262, -126, 267, 92, -283, -57, 289, 28, -275, 19, 288, -51, -278, 84, 274, -110, -267, 145, 230, -177, -223, 191, 191, -228, -169, 225, 130, -247, -106, 261, 80, -280, -43, 278, 20, -272, 28, 279, -61, -272, 89, 254, -122, -236, 123, 212, -172, -211, 179, 170, -222, -172, 218, 119, -245, -109, 240, 58, -257, -40, 258, 0, -256, 35, 255, -51, -242, 96, 246, -115, -223, 134, 210, -162, -183, 189, 153, -218]
1754b18O7L62j20l44J59L24j94l00K28K74k60k31K86K09l17j60L27J40l36q8L39
1775A47M6l45%L42l4l45P3L44j17l42J67K98j83k85K12K50k52k17K73J81k96j40
1797b23L15R7l14o7L32L5l38lL39m2l22P8L21j13l00J51K74j81k61K31K17k59
1819c3j90K76J63k93j33L03R7l13m9L15K4l36J8L21n7l04R1L03j31k75J54K63
1841B14j96k34K20K06k43j92K67J68k86j25K89Q2k88n9K99K7l08L0K99n8k86R8
1863g6K79j32k71J64K44j82k22K15J88k47j60K64J24k69r2K71O8l12k6L01kk99
1885a72L9K72o3k64J04K61j31k44J53K34j79k08K18J70k21j52K50J22k60q8K76
1906A17N0k75k7K69%k84L8K66p1k62J10K51j49k13J56J99j89j85K16J53k17j30
$$ y = [-218, -151, 211, 91, -253, -94, 230, 36, -264, -36, 238, -22, -253, 33, 242, -75, -235, 92, 232, -104, -192, 147, 193, -152, -152, 190, 156, -189, -116, 228, 111, -231, -64, 234, 51, -234, -22, 228, -24, -241, 32, 213, -83, -223, 92, 189, -125, -192, 140, 175, -163, -166, 173, 131, -191, -113, 208, 95, -205, -54, 220, 39, -222, 9, 226, -33, -223, 53, 216, -77, -210, 93, 190, -123, -172, 143, 167, -169, -151, 170, 113, -191, -100, 203, 72, -203, -49, 214, 18, -216, 4, 210, -33, -225, 42, 210, -76, -201, 88, 170, -118, -177, 122, 149, -159, -129, 170, 112, -174, -76, 203, 71, -200, -36, 208, 26, -196, 19, 207, -40, -200, 64, 188, -81, -173, 98, 166, -146, -172, 129, 127, -172, -133, 139, 76, -188, -84, 177, 46, -198, -45, 189, 10, -198, 20, 190, -31, -183, 67, 189, -71, -159, 117, 167, -108, -135, 134, 134, -150, -112, 154, 83, -179, -69, 182, 33, -180, -24, 175, -14, -199, 17, 170, -47, -177]
1928a77K36J03k40q9K66M4k66OK51k3k59O0K42p3k52J20K38j53j99J56J90j87
1950fj69K02J41k10j26K37R0k50o4K66L2k63nK51j8k46N6K32q1k28J12K04j36
1973B1j88J51J82j86j50K05J35k37r1K22Q1k26n4K42J8k35RK43m7k38Q3K09q3
1996F6k14J23J93j44j78J44J69j86j37J93J08k08r5K07P5k28k5K24J7k28J2K31
2018A19m5k15P1K20j01j94J27J63j16j70J68J40j73j27J87J05k07q5K16M9k26
2039i4j5K12%k10J2K11n2k04Q4J95r8j90J18J74j43j55J66J32j78j13K04Q2j87
2062d9p8K18K7k10qJ97Jk09K6K13n6j92Q0J81j00j75J22J59j42j44J53J20j56
2085b2j05J71O9j80m3J86L5j97j3K03k0j93L4J89n7j81Q6J66j08j54J24J39j33
$$ y = [-177, 59, 162, -78, -167, 99, 143, -123, -117, 134, 111, -148, -88, 154, 81, -171, -51, 187, 34, -165, -9, 181, -6, -175, 27, 168, -42, -168, 69, 159, -91, -155, 111, 143, -120, -125, 126, 108, -138, -82, 150, 69, -159, -47, 157, 21, -167, -16, 166, -20, -170, 35, 170, -67, -158, 64, 145, -81, -135, 107, 125, -110, -101, 142, 95, -143, -60, 149, 66, -148, -25, 168, 24, -154, -10, 159, -27, -164, 29, 137, -71, -166, 41, 116, -112, -137, 87, 104, -124, -112, 119, 74, -141, -70, 150, 49, -145, -18, 145, 29, -141, 27, 167, -6, -133, 54, 159, -48, -133, 83, 132, -94, -109, 103, 103, -107, -95, 116, 64, -140, -56, 139, 41, -149, -31, 143, 0, -155, 11, 143, -35, -148, 56, 138, -49, -127, 91, 118, -92, -100, 97, 98, -111, -85, 128, 72, -120, -40, 141, 41, -134, -12, 147, 5, -139, 14, 134, -22, -127, 44, 113, -67, -110, 76, 111, -86, -99, 104, 84, -109, -75, 114, 57, -124, -38, 128, 20, -134, -10, 129, -4]
2108dj19J49J07j64q3J73O2j80m8J92K8j87JJ79k0j87M2J80o9j62P4J53r5j60
2132a38J31J19j31j16J51R4j49q5J67O7j80k5J73K8j87J0J71k1j72M3J77q2j50
2155a05Q8J47j06j30J15J18j45q7J40Q2j48q2J64M4j65k6J73Mj66PJ53k2j52M0
2179e9J61o2j41P4J32q2j32J24R3j31o7J29P9j62n6J58L7j54k3J59rj55K5J43
2203H1m2j48P1J48q6j27Q6J19j00j03J05R5j21r0J45O0j47l7J44L8j68lJ60j8
2227F2j56L3J46m5j43P3J19o4j27R4J16j14r7J29Q2j17q3J36N5j33l9J34J1j38
2251f6NJ35j3j47L1J38n1j27M3J35q1j10Q8J08r3j03J21P3j26n0J27L8j18k6J29
2276F0J5j34NJ37j9j34M3J17m4j32O9J18q3j02P3J04j04q6J12O0j11n7J26M0j26
$$ y = [-4, -123, 26, 133, -31, -114, 59, 121, -59, -107, 85, 113, -74, -73, 106, 86, -101, -59, 121, 52, -110, -36, 117, 22, -138, -7, 112, -19, -135, 16, 110, -39, -124, 43, 110, -70, -95, 78, 106, -81, -71, 100, 79, -93, -50, 127, 45, -105, -17, 130, 24, -106, 9, 127, -18, -105, 35, 117, -31, -113, 51, 95, -70, -96, 77, 81, -85, -78, 75, 53, -99, -59, 102, 40, -101, -27, 105, 23, -109, 15, 108, -23, -90, 39, 118, -44, -100, 58, 95, -59, -82, 77, 68, -87, -62, 81, 39, -109, -38, 110, 24, -103, -17, 102, 2, -101, 4, 99, -22, -112, 33, 93, -54, -91, 53, 91, -77, -80, 80, 62, -94, -61, 85, 40, -103, -30, 89, 25, -102, -8, 108, -6, -103, 26, 108, -9, -92, 44, 99, -34, -73, 61, 72, -66, -61, 74, 61, -86, -55, 83, 32, -95, -52, 83, 2, -108, -20, 88, -5, -108, 13, 86, -40, -90, 37, 75, -43, -69, 60, 75, -59, -54, 83, 64, -70, -27, 90, 46, -86, -17, 101, 18, -84, -11, 93, -11, -97, 15, 75, -36, -93, 33, 73, -53]
2301e3k2J29Nj28MJ29j1j27L3J25n0j08O1J07q6j00J06Q3r9q2J19O5j33l4J22
2326E5J2j12k1J20Jj23K0J20k8j16L9J09n3j10O7R7p5q2P9Q4j01o6J07N3j15m0
2352g9J21J7j16pJ16Lj18J6J22l4j10M6J08n6r5O5Q7p5p9P8P3r0o9J07M1j01m0
2379f9J06J8j13oJ09j6j04K1J21m8r7M5Q8m0r7P6Q6r0p1R6O7j02m2R0M8j02l6
2406f2J09K6j13lJ08k0j04K9R6l7j04N6P5m6q9O1P3o9n9P3N3q8l5Q8L6r5j7R9
2434D1J6j04J2R9j5j03K8J07n5q3N2P5n2q5P0O9p8n6P5N3r3l9R7L2j15lR3Pr7
2463e2KJ01k3r9M5Q4l8q6L5R6o1p4P6M9p1m5P5M3q2m0R1K1q3pR1oq7J4Q5j4r0
2494e0L9R0n9p4N6O5m9p7O7N0p1n1P1L8p9k3P7J7q2oP6lp8PQ9pr4M3Q3n1p0N8
$$ y = [-53, -75, 54, 59, -69, -65, 64, 53, -74, -41, 84, 34, -74, -13, 94, 8, -92, 14, 97, -2, -84, 35, 100, -33, -67, 55, 67, -45, -66, 54, 55, -68, -48, 72, 44, -72, -33, 76, 23, -87, -20, 77, 2, -80, -1, 83, -18, -84, 23, 76, -39, -79, 42, 59, -57, -64, 52, 55, -63, -47, 75, 41, -69, -23, 85, 29, -66, -1, 86, 11, -68, 10, 83, -7, -76, 31, 72, -29, -69, 37, 55, -58, -64, 45, 29, -75, -54, 67, 19, -78, -33, 55, 15, -82, -6, 80, -10, -81, 15, 82, -20, -62, 28, 76, -26, -62, 47, 73, -40, -43, 65, 45, -59, -30, 66, 29, -75, -19, 56, 10, -79, -18, 55, -14, -73, 0, 53, -35, -70, 18, 54, -41, -58, 41, 57, -47, -35, 64, 49, -54, -26, 81, 26, -57, -5, 70, 18, -67, 3, 72, -6, -62, 13, 66, -27, -66, 31, 63, -52, -55, 38, 45, -52, -50, 51, 28, -71, -26, 58, 20, -66, -31, 65, 4, -70, 6, 55, -16, -61, 14, 57, -25, -65, 26, 47, -36, -43, 48, 42, -45, -31, 54, 40, -50, -11, 79, 20, -54, 2, 67, 18, -59, 8, 58, -13, -64, 7, 45, -34, -57, 20, 37, -45, -51, 25, 22, -56, -49, 40, 33, -61, -18, 65, 14, -56, 2]
2526BN8o0n2P1N8q2l8P1L8q4k2Q1J1q7pP8qp6K1P2k8q3M2P5n1n8N6N5o7m7N6O3
2558E8p4l7Q5J5p9j0Q0jo4pQ1nq2K3P9m1o8L7O7l8o6M7N2n5m9O6M0q1j8N9K2p5
2590c9j2P4K2q4%P5j0o8MP8l5n7L4O9m7o2N2N4o4l4O8L0o4k3P3J7p2oO5oo0OO7
2623D5j8p1K8O1k9o4L9N7n2m4K9N7m8m2N4L0n1k7O7J1o2j5P8lp0K1N8j6n5K2O0
2654E0k7n0L0N5m6m4M0L4l9l2M8J6n8j6O6Ko2jN8mo7NP4k4l6J4M7l4n7M5L8k5
2686@l6M3L2n4j8O0J4n3j6N9Mo0JN8j1n9J2N6k5m4K5M8k6n5L8L6l7l3L8L0m3k3
2718c9M2K1m7j6O3No1RN1j3n3K0N7l0m4L0M7k9m7L4M4m9k0L6L0n0k0N2Qn0jL6
2750A6Nm2%M5ko0J6N4k3n7L9K7l8l6M4L8l6l4M5L3m8k2N6J9o1JM9Lm6oN3j2m8
$$ y = [2, 60, 0, -52, 19, 77, -5, -43, 28, 66, -18, -40, 41, 52, -35, -42, 36, 28, -48, -27, 45, 17, -66, -24, 51, 0, -58, -2, 53, -14, -61, -5, 58, -16, -53, 32, 47, -32, -42, 38, 37, -27, -34, 47, 42, -40, -17, 62, 21, -47, -10, 57, 19, -47, 0, 52, -3, -52, 14, 54, -27, -45, 14, 36, -39, -51, 23, 45, -39, -39, 36, 26, -42, -38, 40, 5, -52, -18, 51, 4, -58, -6, 48, -16, -50, 18, 48, -16, -39, 34, 51, -21, -27, 38, 32, -28, -22, 45, 27, -44, -16, 45, 16, -48, -9, 48, -4, -48, -19, 38, -10, -52, 2, 32, -19, -46, 21, 32, -30, -45, 33, 30, -40, -19, 39, 23, -32, -10, 50, 23, -27, 3, 58, 12, -32, 8, 42, 3, -29, 19, 35, -23, -39, 27, 29, -33, -34, 24, 20, -47, -42, 32, 8, -28, -14, 33, -1, -58, -13, 25, 0, -36, 7, 39, -15, -33, 27, 41, -12, -28, 31, 35, -25, -24, 34, 23, -36, -24, 32, 7, -37, -12, 36, 10, -45, -7, 29, -8, -41, -3, 27, -16, -39, 3, 24, -23, -39, 24, 29, -32, -23, 28, 15, -38, -18, 39, 9, -35, -5, 42, 13, -34, 0, 44, -5, -25, 11, 41, -9, -29, 23, 31, -19, -20, 16, 21, -21, -21, 24, 22, -38, -22, 32, 9, -48, -9, 18, -20, -56, -12, 26, -10, -44, 1, 34, -14, -36, 20, 39, -22, -21, 28, 31, -15, -21, 32, 20, -28]
2783b8L5L5k7m3L5K7k9k5K1K4l2l4M3J4l6j7M3Pm3LM2nn0J5N4k1m6K4M6k2n1M9
2815HL6m2k1M0Pl0k2M1J3l9j3L1J4m6JL7ll0JM4j1n1J9L1j1l5K1L0k5m4M8K6l7
2848a2j9L6J5l3kL2j1k9%M7nm4RM4j7l7K5K7k3l3K7L9l5k6K4K2k4j2K5Qk9qM1
2881B2ml0j4L9ml8J1M0j6m2K0M7m1k7M0K5k8j6K5J0j8k6M2J9k9k3L3Jk7pM8j0
2913B2m5J5L0j9l8K1L7k0l7K7J8k4l2L4K4k4k1L2J3l5lM6j2l2RL0ql6J5K9j4j8
2945a6K2J6j7j2%L4l0j5L4J0l6j0K9Ll2KK7jm4J1L7j1l7K3K8k2j1QL3k9j5RL0
2978A8k6mK0J6l9j2M3Ll6OJ9Qk4OK7j0l0RK7j0k9K2K6k9k2L3%k1j4L5J6m4lK3
3012DPl7OL8j0m3K1K8j1k5J3L3k6j4QK9j0k6K9Jj7qK2J1l4JL8nl2%K7ql5J6J8
$$ y = [-28, 7, 42, 15, -28, 7, 34, 5, -20, 1, 25, -7, -41, 2, 16, -20, -37, 6, 13, -30, -27, 15, 10, -40, -25, 29, 8, -38, -14, 32, 10, -41, 8, 44, 2, -19, 21, 28, -2, -24, 17, 30, -9, -22, 9, 23, -23, -22, 15, 12, -18, -17, 27, 16, -35, -16, 15, 4, -31, -10, 20, -5, -49, -1, 25, -12, -31, 5, 20, -13, -15, 17, 6, -23, -23, 24, 19, -25, -16, 28, 11, -26, -1, 26, 3, -30, -3, 36, 1, -25, -1, 21, -3, -15, 10, 18, -11, -19, 22, 18, -12, -26, 13, 9, -29, -18, 22, 6, -36, -16, 31, -10, -37, 3, 28, 0, -16, 9, 19, 1, -25, 17, 36, 7, -16, 17, 18, -9, -16, 32, 22, -23, -8, 22, 3, -35, -14, 23, 3, -34, -7, 11, -13, -45, -11, 13, -11, -32, 0, 13, -22, -25, 21, 9, -23, -14, 16, 8, -28, -13, 16, 2, -16, 6, 22, 5, -7, -7, 27, -3, -18, 16, 26, -10, -20, 9, 12, -20, -18, 9, 8, -36, -25, 12, 1, -36, -13, 15, -7, -18, -10, 23, -6, -21, -12, 18, -8, -12, 8, 24, -15, -27, 16, 19, -17, -11, 8, 16, -8, -2, 25, 15, -15, -6, 21, 11, -18, 4, 30, 1, -21, 12, 12, -9, -23, 12, 28, -16, -19, 4, 11, -26, -20, 18, 8, -35, -14, 14, 3, -22, -9, 24, -2, -16, -8, 21, 11, -15, 14, 15, -2, -10, 12, 23, -11, -10, 28, 23, -9, -9, 18, 10, -25, -9, 9]
3047Iqk9J9J6j8j3J2L1l9kJ6J5j4k0L8Ok2lJ7Mk2ML0j2k7J3J6j5k1K2K3j8k6K7
3081I%rrRK2l6JK1pqoJ6pk1JL8pk7OK1nk2PK6j9j1K3J9k3j8K4J0l0J2KJ1oj1K4
3120B0Kk7MJ8k3lOK6j6k0kJ9rk9K1J8ok5J9Mj9qK7mj0NJ6Kqj2K8jk8J9K1j0k4
3157iJ9Rj0qMJ3rk1J5loLKRk4nK2mk4J1J3oqJRnnOJ6pj7J6K3k4lK5ok0MJ5Jj8
3199fj5K6Oj5%J7j0j8J0J6j0k4K4Rj8j4J4J8j3j3QJ2j6pOJ9k2LK2rj1M%J0j3J5
3235EJ5j4pPJ4j1j3K0jk5OJ8Kk0oJ7Lk2rL5j0j2jJ4j5j3J3QmrJPjqOJ0j7qL4%
3275Ij5%J1J5l4J4J9qj9J5Pkj9K4j4Lk1J3mj0LQKj8KRKoLJNj6J1J0onKPp%J3J
3317Ej3NJ0LKj5J2Mk2RJ4rj6%K6qj8QRlk2J5J3j8j7J3J6j2pPJ1j7KJ8nkqJ2lo
$$ y = [9, 1, -28, -9, 7, -11, -24, -12, 19, -20, -22, -6, 9, -5, -25, 13, 19, -3, -6, 11, 15, -7, -3, 27, 15, -12, 1, 17, 2, -19, 3, 26, 8, -18, 9, 9, 0, -9, 0, 22, -14, -13, 8, 1, -7, -13, 3, -4, -25, -24, 14, 7, -20, -14, 7, 2, -20, -13, 13, -6, -17, 6, 25, 2, -16, 8, 18, -12, 0, 2, 13, 7, -4, 20, 22, -5, -1, 17, -6, -9, -3, 23, 7, -13, -15, 4, -5, -34, -13, 5, -1, -26, -7, -3, -22, -30, -3, -7, -17, -12, 4, 6, -2, -14, 14, 13, -15, 4, 25, 15, -9, 10, 19, 9, 1, 5, 18, 9, -12, 3, 0, -6, -3, -1, 8, -16, -21, 1, -3, -27, -16, -3, -9, -17, -16, -7, -12, -17, -11, 5, -2, -19, -3, 20, -4, -7, 18, 12, -8, -4, 11, 12, -6, -21, 5, 11, -4, -4, 13, 3, -15, -5, 11, 1, -23, 1, 10, -8, -22, -8, 10, -3, -16, -8, 4, -12, -19, -13, 6, -16, -13, 9, 0, -11, -7, -7, 3, -10, 5, 20, 6, -1, 6, 20, 9, -4, 16, 15, -10, -4, 14, 16, -4, -10, 7, 10, -12, -21, 14, 4, -8, -9, 5, -10, -23, -10, -2, -6, -15, -14, -7, -8, -16, -10, 0, -17, -25, 9, 9, -6, -6, 5, 20, -14, 0, 19, 11, -8, 7, 14, 12, -7, 17, 3, 6, -15, -2, -6, -16, -13, -5, -3, -21, -19, -10, -8, -14, -11, -10, -5, -21, -10, 0, -6, -11, -9, -2, -9, -9, 4, 5, -8, -3, 7, 10, 12, -3, 9, 13, -9, 0, 14, 5, -11, -11, 15, 7, -11, -3, 6, 3, -19, -4, 9, -9, -26, -13, 3, -9, -16, -9, 2, -15, -13, 5, 0, -2, -10, 2, -1, -7]
3357gjJ5nj1lJ6Jj5J4J3qj4J2J2j5j2J0N%j6J4qjpRjj8lK2Lk5NK1j0rJ2Mmm%J5
3398Fj3pK1%oj5K2RnlKk0J6kJKj4RMkj5RLnk3J9Qpj4K0nj4MNJ0j6MLJ0qNJ0Np
3442FpJ2nj0J3Nj3ONKqj0QjKknLpj1J4LjJr%p%K1j1oMJ2j6jJ0Mmj9K5Lj8RlKN
3488A%OmqKJ2kj9J2Plj0J2kjMk5Rkk%J3j1j2K4npj3J9%%KjOj2LMlmJ4LlKRpj0
3534bqJ8Oj7LMNj7Qj1J2k0PJ0qkKJqjJ4jl%LJqkRmRkJ4llOkj0j0QJ2oj0MRqJO
3582FqjOoLrpMPqlK0j4jOnKoP%PoNOq%J2rlNlMloJ1jqRJjloJ7j4jkJ6lj4JNkn
3635fNkkj4J2Oj2JNJ1k1%K2j1nJ1J3j1%PmNj3J0MKj8QOj6mJ1pJ2rNj1jkJ4j5Q
3677fkMLqNkMnKMKqJ7Kkj3J3oOlJJj9MK4nj0Nj4QjnOj0kLJ3j4oK0Jj2oJ6rlNO
$$ y = [-7, -8, 7, 2, -9, -12, 4, 5, -10, 4, 17, 9, -5, 7, 19, 4, -8, 2, 7, 7, -9, 5, -3, -4, -11, -2, -3, -21, -24, -2, 1, -24, -19, 2, -8, -17, -5, -1, -5, -9, -9, 6, -7, -14, 7, 7, 1, -14, 8, 17, 12, 9, 11, -9, 7, 5, 6, 8, -6, 3, 7, 5, -10, -1, 2, -3, -26, -7, 1, -6, -20, 0, -5, -19, -15, -10, 0, -16, -12, -9, 1, -7, -2, 8, 13, 6, -1, 11, 6, -4, 9, 14, 1, 7, 12, 14, 6, -4, 4, 3, 5, 3, -2, 1, -6, -17, -3, 0, -1, 0, -9, -9, -16, -16, 5, -6, -12, -8, 4, -12, -13, -3, 1, -3, -22, 3, 6, -12, -3, -6, -4, 1, 1, 7, 3, -5, -3, 9, 7, -12, 0, 7, 4, -6, 6, 4, 3, 7, -18, -9, -11, -13, -13, 0, -11, -23, 1, -4, -11, -24, -5, -5, -5, -3, -4, 2, -10, -7, -3, -6, -10, 4, 7, 4, 6, 15, 8, -2, -10, 8, 14, -3, 0, 4, 9, -8, 0, -11, 1, -19, -12, -2, -10, -12, -10, -9, -17, -18, -4, -5, -8, -8, -5, -4, -12, -14, -5, -9, 0, -2, 12, 9, 6, 12, 10, 0, -10, -2, 10, 4, -6, -2, 7, -1, 0, 6, -2, -3, 3, -3, 0, -9, -16, -12, -5, -13, -16, 4, -10, -11, -5, -10, -8, -14, -7, -7, 0, -6, -1, 5, -3, -3, 9, 0, -3, 2, -1, 3, 0, -6, 5, 4, -4, 5, 6, 5, 2, -4, 13, -1, -2, -4, 12, 9, -5, -4, 1, -1, -6, -1, -3, -5, -19, -7, -1, -13, -12, -7, 4, -17, -17, 5, -6, -11, 0, 13, 2, 2, 9, 5, 10, -3, 7, 11, 13, -5, 3, 9, -7, -11, 0, -7, 5, -4, 1, -10, -11, -13, 1, -14, -6, -8, -4, -1, -9, -4, -6, -2, -7, -5, -1, 1, -7, 10, 12, 10, -3, 10, 4, 10, 7, 8, 9, -10, -6, 18, 13, 3, 8, -6, 2, 1, -4, 2, -8, -10, -7, 6, -8, -14, 6, 7, -5, -11, 5, -4, -7, -2, 4]
3725Dnjj1J0Olj0K7j3j0J0M%ljLlMmmj0RJ4lj2j1J9prK2j0lkkkrkLJ4rOLpmJ0
3770bMrj%K1k1J1mJ3kJj4J4Kj2mK3j8oORj4O%Lj8LJ2rqM%OrJK%%NLoMmJ4o%qJ6
3818HolNPj0KJ7j8Kj1J5Rk3mJ5j4MJ1jj1j0QJLnqJ6j4NNmnNQkPpMmQlOr%%N%%
3866DlJ2nKqoRrNOj9J7j0mj0J2J2pJ5rkj1NpoJ3Oj1JLlMnJ3jnJ1j0MJ2kpmJ2l
3911A1q%J%j2J0kJkpKNj9J2Kj2JJ1j%oLLjkPJJJ%L%PkjlKkNQj3KNnnljJ3j1jK
3962@mLJj2OkqRkKMk%qJ4qRj0%PJ0Lj6RkqOMKOnkJ0j2K%%rkjRj6Qj%jk%LLllj
4015a0QnjKmKMMqJ1jjOoOkrPO%LknKj0Q%pnnQJLlj1PlQojMKj0J7Lj6JLRkO%nJ
4069DOM%qLJoQkqlMKj0RJkj4%MQ%jPno%jnKRpJJ0mJj7J9okJ6%j8J1nOQnKjmlK
$$ y = [4, -1, -2, -13, -3, 3, 0, -10, 17, 4, -6, 4, 8, 8, 5, 4, 7, 4, 8, 4, 0, -10, -1, 13, 10, -2, -13, 6, -1, -10, 12, 2, -1, -3, -5, -7, -16, -18, -15, -1, -10, -4, -1, -8, -12, -2, 2, -7, -8, -8, 13, -8, 3, -1, 12, 10, 11, -3, 11, 13, 1, -3, 20, 2, -4, 2, 11, -3, 3, 3, 6, -12, -9, 3, -6, -14, -10, -10, -4, -13, -12, -10, -10, -10, -5, -2, -8, -4, -8, 6, 0, 0, -8, 8, 2, -1, 4, 11, 1, 3, 20, 2, 4, -7, 8, 17, -6, -10, 5, -9, -5, 6, 5, -6, -16, -8, -7, -4, -9, -17, -1, -15, -10, -5, -9, -14, -9, -1, -3, 4, -3, 1, -3, 5, 2, 8, -1, -1, -1, 4, 4, 4, 1, 13, 8, 10, 2, -4, 5, -4, 1, 7, -12, 5, -5, -9, -19, -7, 5, -2, 13, 4, 2, -9, -4, -11, -17, -4, 2, -9, -8, -5, -8, -4, -9, 4, 3, -2, 9, -1, 3, 15, 13, 6, 2, 14, 11, 3, 3, 4, 4, -8, 2, 0, 1, -1, -8, -6, -1, -20, -8, -6, -18, -17, -6, -7, -7, -13, -10, -7, -8, -10, -3, -2, -1, 0, 0, 3, 3, 10, 8, 7, 4, 6, 4, 9, 17, 4, 6, 11, 6, 1, -2, -3, 10, -1, -2, 0, -4, -1, 0, -12, -6, -8, -16, -7, -9, -7, -3, -5, -5, -13, 1, -7, 2, -8, -8, -1, 9, 12, -4, 5, 3, -5, 1, 5, 7, 13, 8, 6, 16, 4, 6, 6, 6, -3, -5, -6, 3, -13, -5, -6, -6, -7, -9, -9, -6, -3, -6, -9, -10, -2, -7, -8, -6, -10, -8, -4, 0, -8, 3, 2, 1, 7, 1, 7, 5, -4, 3, 9, 9, 12, 10, 5, 7, -3, 5, 5, -2, -7, -12, -4, -3, 0, -3, -14, -7, -10, -2, -8, -9, -5, -3, -13, 4, 7, -9, -8, -5, 4, 2, 8, 8, 3, 4, 10, 14, 14, 6, 9, 10, 4, 12, 10, 2, -1, 3, 5, -5, 4, 5, 3, -11, -11, -7, 1, 1, 0, 7, 2, -4, -4, -5, -10, -8, 1, -6, -5, 5, 1, 2, -15, 4, -2, -4, 12, 12, -6, 5, 0, 6, 14, 9, 11, 10, 6, 3, 5]
4122EkQj0j2J5nqMJ1pMmj3Po%Rj1NRrLp%J3Lj1J0mP%%JNOrLLJj8PjLj0QqjJ7j9
4171hklQjLkj5J3mjJ4qkjJ1MJkmK%nLNjMlNqOmkmoKKKKmoOKrJ1lrkmPjLj1J6n
4225hnM%MMOj2QLnOoJlQJJoQ%qKOmmJ1j4Oj1J2rQrLjnPr%MJMlMloJ1KRj9J8mj4
4278fJ9J0j6PkNj6RlmJ0lqNnrJ1pJJNj8RkKrQMlkMjmKMMK%JMmklNMj5QKJLrLL
4331EkoMKj0Rj9RNolPMoq%LPpNQpJ4j9J1JLjjM%oQMj0JjKNj1lQkKnMqRq%j0jQ
4384hPLj0oQlMLmrPjJ0%L%pRlj3K5j3JlRlKJ1pLj5JlRJnjmj1ONj1J1j4QJmJ0j0
4433a1kQoOQkKj%PJj8K0oj2J3j1OlRjlOl%qRj9Rj1J4lnNj5NKKnMOkKJnlJ1k%P
4483FoPkjLmMqPp%JJ6k1J0j2L%kRrOrj1J3Qjkj3QL%JLoKJqMnJ6qlJ4nQrQoLqR
$$ y = [5, 3, 11, 1, -11, 4, -1, -9, -5, 6, -1, 3, -1, -14, -7, -13, -13, -4, -15, -10, -1, -10, -7, -14, -14, -1, 2, -9, 1, -3, 4, 4, 4, 5, 10, 16, 7, 10, 13, 14, -4, 3, 2, 5, -5, 3, -5, -6, 11, -8, -10, -13, -5, -6, -3, -5, -20, -7, -11, -12, 2, -6, -8, -9, 2, 6, 7, 5, 1, 3, 3, -2, 1, 6, 5, 9, 6, 11, 3, 9, 5, 3, -1, -7, -5, -3, -1, 1, -3, -9, -3, -1, -10, 1, -2, -11, -13, -17, -10, -11, -8, -19, -3, -8, -13, -9, -9, -5, -1, 5, -7, 1, 4, -1, 5, -1, 0, -3, 5, 6, 7, 1, 9, 9, 1, 3, 9, 5, 1, 12, -2, 4, -7, 5, -4, 4, -5, -2, -3, -8, -1, -10, -10, -6, -5, -1, -4, 0, -3, -9, 2, 4, 13, -6, 12, 8, -6, 13, 23, 7, 14, 12, 17, 1, 10, 7, 3, 13, 10, 2, 7, 2, -7, 4, -3, -2, -1, 4, -14, -5, -7, -5, -14, -6, -2, -5, -7, -3, -4, -8, -6, -2, 2, 4, 4, 5, 9, 5, 3, 0, 5, 9, -6, 2, 4, 5, 8, -1, 2, 5, 3, -3, 1, 3, -7, 2, -17, -8, -3, -9, -12, -5, -1, -7, -15, -15, -12, -5, -12, -7, 1, -6, 8, -11, 0, 1, 4, 3, 2, 6, 6, 0, 8, 12, 2, 3, 2, 4, 9, -2, -5, 3, 1, 3, -2, 2, -6, 3, -5, -5, -15, -16, -8, -1, 2, -8, -14, -6, -9, -5, -2, -6, -15, -8, -9, 1, 1, 4, 4, -3, 6, 3, -10, 15, 2, 3, 0, 9, 6, 8, 19, 12, 15, 0, 1, -2, 7, 8, 3, 2, -2, -13, -7, -2, -13, -2, -16, -8, -7, -11, -1, -11, -13, -5, -11, -5, 3, 1, 3, 2, 2, 9, 10, -8, 12, 6, -6, 7, -4, 2, -1, 8, 7, 4, 10, 7, 7, -1, 8, -11, -2, -13, 1, -2, -7, -2, -17, -12, -10, -8, -13, -9, -3, -5, -3, -2, -7, -10, 1, -1, -1, 6, 0, 7, 5, 4, 7, 3, 7, -1, 6, -1, -1, 0, 16, -5, 5, -7, -4, -4, -6, 3, -6, 0, -9, -20, -7, 1, 0, -2, -15, -7, -4, -4, -3, 0, -6, -4, -3, -11, -7, -12, 4, -4, -7, 7, 2, 10, 1, 9, 3, 6, -2, 7]
4535Gl%klQpNlpPonLkknPMKj0lPplOJ5kJMo%k%PPo%Mkmkjj%MJ1j3jj4J1MrnjO
4590gjqJ4j2%%J0Jj6J1nJ8%rOJ%KrJ0KljKRoj3KNMQjj3Pjj4Qlj1PK%qNPnJQjj2
4640iLKOpOjJ0j2J1j5J1lQQk2J1NpkkNj%OpJ3j2qNkj0NmPqQ%njKQjj7KJ5kkoP
4689blJ0KKnJ0mkrJ5mKnMLlrMOj6JLmLmnNpJ0jj0MLNj3NK2qoRrOJJLl%PprQkP
4742A1nqLLRlj2NqOoJlQj0OJkpMljOpLOkklQNnONrkMJ1KoJpMkJ0j0Ojj1KJ8k1
4794brJ3j0LoLoJO%Mj0J5j0lMMqJ1nPOjnOJnmQKMjo%j0jN%mJpJ4j3KJMj3jQkn
4845a4RlKJpjLJ2qJ4j1JLmJ0lqOQ%j1Rj%kJlMjnl%kmOlJqKmJ2pLNrJ4j1Jl%MJ
4897dQljMoPMjl%NlMLmjKj8J4pLmj%ljqLMlRj5KKMMrkOQLkmJ3k%j1jJ7rOLj4P
$$ y = [7, 4, 4, 2, -1, 7, 0, 5, 2, -5, 2, -4, -9, -6, -8, -10, -15, -8, -4, -2, -12, -15, -8, -15, -18, -12, 3, 1, 2, 6, 0, 0, -2, -2, 5, 12, 6, 6, 10, 8, 4, 2, 1, 0, 0, 4, 15, 2, 1, -13, -2, 2, -7, -12, -13, -7, -8, -16, -2, -14, -14, -14, -4, -3, -19, -8, -13, 5, 5, -4, 2, 3, 3, 5, -4, 6, 8, 5, 4, 6, 15, 9, -4, -2, 3, 7, 15, 14, 1, 8, 7, -7, 1, -2, -13, -6, -4, -4, -12, -7, 0, -5, -4, 4, 3, -9, -6, -4, 2, -5, 1, 0, 10, -2, 9, -6, 5, 2, 10, 18, -4, 7, 12, 5, 3, 1, 6, 5, 5, 11, 4, 17, 5, -3, 2, 0, -10, -5, -9, -2, -10, -2, -2, -7, -8, -6, 2, 1, -16, -14, 1, -1, -3, -9, -2, -5, 5, 7, 9, 4, 14, 10, 8, -1, 14, 10, 12, 7, 11, 14, 11, 2, 6, 12, -4, -3, 0, -4, -1, -5, -10, -5, -12, -2, -3, -13, -9, -6, -1, -14, -9, 13, 5, -1, 8, -1, 5, 6, 7, 10, 7, 7, 14, 7, -2, 6, 4, 11, 6, -2, 1, 4, 13, 10, -2, 3, -5, 1, -5, -4, -7, 1, -9, -3, -2, -4, -11, -7, -10, -11, -5, -12, -9, -3, -5, -7, -10, -2, 3, -2, 4, 9, 0, -2, 2, 13, 15, 9, 10, 3, 7, 5, 15, 5, 11, 10, -1, 1, 19, -2, -11, 2, -8, -5, -11, -8, -14, -13, -7, -7, -3, -13, 2, -8, -11, -7, -3, -11, 0, -5, 2, 8, 7, 2, 8, 9, 4, 0, 8, 10, 14, 13, 7, 7, -3, -4, 1, 1, -3, -2, -9, 5, -8, -6, -5, -1, -14, -15, -7, -9, -14, -5, -8, -6, -5, -12, -13, -10, 2, -6, 8, -3, -2, 1, -3, 7, 4, -4, 2, 10, 10, -1, 8, 7, 7, 5, 6, 3, 7, 6, 1, -2, -2, -4, -8, -2, -5, -4, -12, -10, -14, -2, -9, -6, -1, -10, 4, -7, -6, -9, -9, -5, -4, 4, 1, 0, 4, -2, 5, 9, 8, 5, 5, 10, 7, 11, 14, 10, 9, 11, -7, 7, 0, 3, -1, -2, -2, -5, -6, -14, -11, -7, -10, -1, -16, -14, -12, -8, -4, -13, -15, -9, -1, 2, 0, -4, 9, 7, 7, -4, -5, 12, 3, 9, 12, -2, 5]
4951EjKJKrjMj0J1rLjl%oJ1j2PQj0%J1j1lJ1poJ2lPj2QPrJ9oLjpLpQmLqOPj7J6
5000A2j1LjmmqRjJkj1J6mjoQoJkRmK%LKNqNLp%J0moJ9j4MjlNQj6Rj6K%OJj0Pq
5051h%Rj1KmOjJpkQNmRLKlNmJJ1rlJ0mKj2PqMOoLoLLopMJnLOq%rjJ6poLOLnNl
5107bOJOlMj6J4kQk0LNkJ1j0%j3J9qL%KnrmQnPLj2J4jj3NJKnkM%J3qJ0KmkJ2p
5155A0Jj0PnQMn%%kpkOmqJ0oNj2M%rRpJ4mPqJjNJ0k1NJ6ojPmKNrkOPnpRmOpjl
5208DPrJkMooLjJmkpJ0kJ1%nOoPkpLmJ1krJJPpJ8pRolOplKkmJLN%j5QpkPlNj2
5263a1OLrL%KlJJ0l%kOnJQoMJ2j5P%PmllmRoqOnkLJkLMj0ljNlnQmRNo%%JjoNN
5319DPKj1J3KnLmJKkjnjJj0OkQj8MMkokNlLkMjKnJ2oKjjQJjlQlLmOlj0PjR%oo
$$ y = [5, 4, 6, 7, 9, 0, -1, 3, -7, 4, -5, -2, -3, -6, -6, -12, -1, -13, -6, 2, -8, -8, 3, -8, -11, 0, -7, -13, -1, -4, 3, -9, -1, 6, -3, 16, 10, 13, 12, 5, 8, 1, 9, 5, 8, 0, 6, 13, -4, 12, 1, 4, 3, -1, -5, -13, -4, -5, -4, -6, -17, -1, -5, -6, -12, -4, -10, -9, -11, -2, -6, -4, -4, -1, 1, 6, -2, 3, 6, -1, -1, 9, 5, -1, 18, 4, 8, 7, 4, 9, 17, 1, 10, -6, -4, -4, 2, 3, -7, 0, -8, -8, 1, -10, -8, -12, -6, -7, -6, -13, -15, -7, -2, -6, 3, 6, 8, 5, 10, 6, 7, 18, 9, 6, 16, 12, 14, 2, 9, 1, 5, 11, 5, 8, 2, 5, 8, 2, -5, -1, 0, -5, -2, 4, -4, -4, -13, -14, 2, -5, -11, -8, -2, 1, -4, 1, -2, 4, 5, 11, 8, 12, -4, 10, 8, 16, -4, -1, 4, 2, 13, 3, 3, -10, 9, 1, 4, 4, 6, 1, -8, -12, -4, -9, -2, 1, -11, 3, 2, -11, -6, -5, -3, -8, -10, -6, -6, 7, -1, 9, 11, 7, 5, 17, 10, 11, 1, 8, 3, 11, 15, 10, 10, 10, 8, 1, -1, 5, 1, -7, 3, -3, 2, -10, -6, -6, -15, -6, -13, 1, -3, 4, -4, -3, -4, 1, 11, -10, -5, 11, 5, 4, 11, 7, 9, 14, 5, 3, 9, 16, 11, 4, 13, 9, 15, 8, 7, 4, 11, 2, 3, 1, 5, -1, -7, -4, -5, -4, -8, -10, -17, -7, -9, 2, 2, -3, 3, -3, 4, 2, -5, -2, -6, 5, 3, -6, -5, -4, 3, -4, 14, 7, 16, 10, 7, 13, 6, 3, 5, 3, -1, 0, 3, 8, 8, -7, 1, -6, -8, -1, -4, 1, -11, -5, -2, -11, -8, -8, -6, -9, -8, 2, -1, -1, -3, 3, -2, -1, 7, 1, 5, 17, 2, 9, 9, 16, 12, 9, 6, 2, 11, 5, -3, 3, -2, -4, -1, 0, -2, 1, 5, -5, -8, -9, -4, -7, -12, -4, -8, 1, 6, 0, 0, 0, 1, 0, -6, -1, 4, 11, 13, 2, 15, 17, 12, 15, 11, 12, 14, 12, 11, 6, 5, 6, -4, 2, 0, 8, -10, -6, -2, -4, -10, -12, -7, -10, -7, -9, -5, -6, -4, -9, 3, -3, -1, -2, -3, 5, 6, 5, 2, 10, 7, 10, 6, 12, 9, -1, 6, 5, 14, 14, 8, 2]
5374BJjMmjmJmlKOnJ5j3JpJ%KJ3mqNlNjnRLMoLmNlRrOqOMkPj1j2Lj1J2%%jkmj
5428hNoKqJ2rPLLkKj1RJ0nLk%JKLPj8J0Mj2kQmj%%%mj2J5mmLqJ0olJkmRMLpNJ0
5480Ij8MNJOJ3j9J0mlJ2j2PKnOj4J1JlpnqKJ2oMKj0LMj2jO%J3nrPj8J6JqJ7rN
5526CJnJ4jjoNNplkjlJ3j1jKlqLMNoJj1Oj1J7j5NqjQJ5j7QMKNnKmNjJ4qRrJ0j2
5576FKkoJK%mLmmL%Ljj1mMPpjNMqNkjRnK%Pj4J7mLnmJ3oKqJ0JLOqj0kNlMrlJ1
5630Bj1J1nnJ1j2mLLJkoN%NMoMMoJ0Oj5J2mqMLnJ5j0lOmNopQQj1OmJ%j0%Oj1O
5679fqKJ0Kj3J0Nj2Rn%kJ4lrQLj0J5pL%jnmJ1%j7J3kqMll%QjKnKj2MJ0j1Nj%N
5727cokJ3RpnkPnMNj2J6kkNrN%KrOkm%j0QpOj2NJ0omnMJ0j4J0lkjkKO%lQMpMo
$$ y = [2, 3, 2, 6, 2, 1, -3, -2, -6, -9, -7, -1, -6, 9, -4, -3, -10, -9, -9, -7, 6, 2, -6, -1, -4, 1, 0, -5, 4, 7, 11, 5, 8, 4, 9, 6, 15, 6, 12, 4, 10, 14, 12, 19, 8, -4, -1, -12, 0, 0, 0, -1, -3, -7, -8, -3, -9, -7, -15, -3, -12, -5, -2, 1, -1, 1, -10, -1, 9, 4, 7, 5, 5, 6, 8, 11, 18, 0, 10, 14, 2, 0, 8, 4, 3, 3, 3, 3, -1, -13, 2, -2, -6, -3, -11, -1, -7, -10, -9, -11, -15, -6, -2, 1, -6, -1, 9, -9, -5, 0, 1, 7, 20, 1, 11, 7, 4, 16, 4, 11, 13, 8, 14, 0, 11, 12, 9, 2, -3, -11, -9, 3, -3, 1, 3, -7, -4, 0, -12, -13, -7, -7, 6, 1, -8, -1, -19, -3, -2, -10, 7, -2, 3, 4, -1, 13, 12, 11, 5, 10, 15, 8, 5, 3, 2, -1, 12, 1, 0, 2, -1, -9, -6, -2, 3, -3, -2, -13, -7, -18, -1, -16, -11, -19, -20, -12, 3, -14, -6, -2, 0, 5, 0, 2, -2, 3, 2, 16, 8, 17, 8, 18, 6, 8, 6, 0, 1, 3, 3, -1, 2, -2, -6, -3, -3, 0, -1, -12, -16, -12, -5, -12, -13, -8, -4, -12, -7, -9, -10, -1, -6, -4, -4, 3, -11, 6, 2, 5, 0, -4, 9, 3, 5, -3, 7, 8, 11, 17, 9, -1, -3, 2, -1, 3, -6, -9, 2, -9, 2, -3, -8, 3, -9, -13, -10, -7, -6, -8, -14, -9, -9, -4, 0, -6, -2, 2, -4, 6, 12, -3, 9, 5, -3, 1, 4, -1, 14, 4, 1, 7, 3, 8, 2, -5, 3, 11, 0, 6, 2, 3, 3, -7, -7, -1, -12, -6, -14, -12, -2, 0, -13, -3, 2, -10, -1, -6, -6, -8, 6, 3, -6, 2, 5, -5, 10, 3, 6, 6, 5, 0, -4, 7, 7, -10, 3, 1, -7, -3, -6, -9, -9, -1, -2, 0, -5, -3, -15, -11, -1, -12, -7, -8, -8, -3, -9, -11, 2, 11, 4, -1, -3, 4, -1, 3, 8, -4, 12, 10, 8, 13, 4, 9, 9, 11, 2, 8, 6, 2, 2, -8, 0, -7, -1, -13, -8, 2, -4, -8, -13, -9, 1, -13, -3, -6, -8, -9, -11, -9, -3, -3, -6, 2, 6, -1, 3, -3]
5779cOPnjlJ7pmlmJ0JjmJJj2Jmj1J4rjRp%MOj4J2%Lmj0J8pKOjkRj0J0mlJLKjN
5829A3qljKoOjJ0j3J0j4Jm%Oj4Qk%kKMJ%RjkQlnM%KlPqK%j1J8%qrNQkJj3Lj0J1
5880bllOnj%JKJ0j2LLLpJJ1j6NJJLKPq%KqPLoRj2Jk%PlPj2PpKm%LJqJ0j3RPk1
5932a9J4rNOlmOKoJ6nmNnNKJ0pNqMkjmJ3j5lJ1monNJrLnMJ2j4KjqOMLnMj%kJ5
5983HqNmjJ1Kqk%J5j7LMNrOj3J1JqQqNrKj2nJ3qOKj3OkRpJ8kj4PkJPkkNjnLNN
6034A1qNPkKmkjnNmqRLoqLpkN%KkoJ3j3P%NnJ2j1MjPkKLkrRjnlK4j2nmNkjj5R
6087djKlJk%Rj3LLlLnkMjNPpjPNlmQlKlm%M%N%Mj4LJ3j9J1rj0PMLonOj2K%JkJ5
6141Aj6MRJpPLlMj2J3pQjJ1nMmn%okLMNlj2LjOkNk2QKPj4J1lJL%mmkPKNkj0K1
$$ y = [-3, 3, 10, 5, 4, 1, 18, 11, 7, 4, 0, 10, 11, 10, 6, 7, 8, -4, -3, -7, -18, -4, -13, -14, -5, -12, -12, -8, -2, -16, -4, -4, -1, -5, -15, 3, -4, -2, 4, 3, 1, 10, 0, 10, 6, 3, 4, 7, 9, 8, 13, 5, 2, 1, 3, -3, 3, 2, 12, -1, 9, -5, -4, -8, -8, -2, -16, -8, -10, -10, -12, -10, -6, -5, -5, 4, 3, 1, 9, 6, 1, 5, 5, 7, 4, 11, 3, 5, 5, -6, 12, 12, 4, -5, 0, 8, 6, 7, -6, -3, -13, -2, -5, -8, -2, -7, -8, -8, -7, -5, 5, -7, -4, -1, 2, -5, -4, 7, -9, -4, -3, -2, 1, 3, 10, 2, 2, 4, -4, 3, 6, 0, 9, -3, -2, -4, -4, 3, 0, 7, -5, 2, -5, -3, -7, -7, -4, -3, -11, -1, -14, -5, 2, -19, -5, -14, -9, -3, -6, -10, -4, -2, -8, 8, 3, -1, 4, -1, 4, 6, 16, 9, 14, 6, 10, 8, 7, 3, 16, 1, -2, 9, 5, -1, -6, -1, 0, -9, -6, -11, -7, 5, -9, -7, -8, -16, -10, -6, -3, -8, -4, -5, -5, -7, 8, 0, 5, 1, 0, 11, 13, 5, 3, 3, 18, 1, 4, 8, 13, 4, 10, -3, 8, 9, 1, 9, 1, 6, -3, -1, -13, -18, -5, -13, -7, -5, -18, -12, -14, -5, -12, 6, 4, -10, -3, -5, -4, 3, 1, -1, 4, 3, -2, 1, 6, 11, 3, 8, 15, 13, 15, 11, 9, 8, 3, 8, 4, -4, 5, 8, 2, -6, -3, -10, -12, -7, -7, -5, -7, -13, 0, -13, -6, -6, -1, -6, 6, -5, -1, -2, 5, 3, 5, 8, 6, -3, 6, 5, 0, -3, 21, 9, 4, 0, 5, 3, 2, -13, -4, -5, -3, -6, -5, -7, -7, 2, -11, -8, -5, -8, -5, -10, -12, -8, -9, -4, 3, -4, -5, 2, 7, 4, 0, 8, 5, 7, 4, 0, 0, 4, 4, 9, 9, 13, -1, 2, 15, -4, 7, -2, -12, -5, -1, 2, -4, -9, -3, -15, -13, -13, -12, -14, 1, -15, -11, -2, -1, -8, -1, 2, -1, 3, -9, 4, -3, 5, 4, 15, 10, 14, 10, 5, 5, -1, -3, 0, 4, 9, 6, -6, -3, -4, 2, 0, 5, -17, -9, -7, 0, -14, -3, -6, -5, -2, -2, -6, -10, -12, -5, -3, 2, 0, -10, 11]
6192A1rMj5J0%KkJ3j1LJqJ1Mmnm%lMj1OkoJ5j0%Ko%k%jON%%jKKjlN%jJ4Jj7%Q
6242GJ4nJrOnmOnLlkm%pkKOj0J2j1Pjj5%PkJ8kllNLpOjJLnJ2kojPQj7M%oJ1j3
6293bMj1KJ5j1j5J2oNlnMN%j0J0jPqjjNOKrPmLJ1j2J1rmQJMj0J3rNrKj1J6rjo
6340ilN%Qp%pRoJ1j0llK0lklOKQr%jQlj0QNpjjJpJ2qQrkpPNnJ2j4oLjRj0JJNj2
6393a5MKjJ4kpQOmjLj0J7oNMpoR%kmnnMjKNJmj4NlNoRj0%K%joROqQj1NOML%Nj5
6447cONlNKrJ0nkLkoOknojPPj0j3ONmmOLNj6lJ0JJ0%Kn%NrOoQQjoljJ9j8Pl%q
6500bJQj8J3rKk%Mj0J4Mk1%K2j0nPkrQJ%%RqlJ3nJjP%LLljmNj1kmKKpNo%LK%j
6552eJlkkPqN%mj1PMLJ0%j%OJpoJ3pJ2Lk1J0Oj0Rj0MoLLlKKqprLK1lqOjj4LQN
$$ y = [11, 2, 6, -9, 1, 1, 3, 1, 14, 3, 6, 7, -1, 10, 14, 10, 5, 1, 1, -2, 2, -9, -3, -5, -11, 4, -6, -6, -4, -10, -10, -12, -12, -13, -7, -2, -2, -2, -3, -1, 1, 0, -3, 2, 2, 1, 15, 16, -1, -1, 7, 21, 16, 17, 8, 14, 9, 5, 11, 6, 9, 6, 4, 0, 0, -7, -9, -7, -1, -11, 1, -10, -3, -4, -19, -19, -12, -14, 4, 2, -1, -4, 1, 4, -3, 3, 2, 3, 6, 1, 13, 11, 5, 4, 11, 19, 2, 6, 6, 0, 11, -2, 2, -9, -7, 8, -3, -18, -6, -12, -7, -10, -15, -11, -6, -6, -16, -6, -7, 0, -8, -9, -10, -5, 1, 3, -6, 1, -3, 0, 11, -1, 10, 1, -3, 5, 6, 10, 0, 13, 4, 9, 0, 2, -9, 7, -2, -3, -9, -12, -7, -7, 1, -6, -6, -13, -4, -10, 1, -9, -12, -15, 5, 2, 0, -3, 3, 5, 13, 4, 4, 3, 11, 8, -2, 6, 11, 4, 3, 2, 3, -4, 8, 0, 8, -1, -3, -10, -3, 2, -3, 9, -5, -11, -8, -9, 0, -10, -9, -8, -3, -15, -11, -9, -10, 4, 2, -5, 3, 9, 5, 4, 7, -3, 14, 8, 13, 17, 10, 4, 13, 13, 11, 7, 2, -3, 1, 0, 2, 7, 8, 4, -10, -5, -8, -3, -9, 0, -10, -10, -8, -8, -9, -15, -6, 0, -8, 0, -11, -6, 0, 4, 7, 7, 12, -3, 3, 8, 5, 10, 12, 3, 13, 8, 6, 9, 7, 1, 7, 5, 0, -6, -7, 0, 7, -3, -16, -10, -5, -9, -13, -7, -4, 1, -15, -18, -8, -7, 3, 3, 5, 0, 0, 5, -4, 2, -4, 4, 12, 11, 5, 2, 1, 20, 2, 9, 6, 6, -2, -1, 7, -11, 2, -7, -5, -7, -7, -3, -13, 1, 5, -16, -16, 6, -4, -9, -2, -4, -13, -5, -4, -4, -4, 5, -3, -6, 7, 2, 3, 2, 9, 9, 12, 15, 12, 11, 7, 12, 1, -1, -5, -3, -1, -8, -3, -9, -9, -6, -4, -4, -5, -4, -7, -9, -11, -4, -12, -7, -7, -11, -22, -15, -11, -8, 2, 2, 1, 1, 7, 8, 1, -5, 8, 1, 13, 16, -5, 5, 11, 1, 10, 0, 4, -2, 1, 4, 1, 3, 5, -3, -10, -19, -16, 5, 2, -6, 0, -1, -15, -12, -4, 1]
6603Aq%RjMLrKKPKqOnJlJRj6J2j2%J1j2Pj1kKL%Kj2J6oLj1KLlmJ0J0j1oQJ2j6
6650hJ9j1PkoLPolPqPQrNlNnj2J5kMojnmjjmLPj3J1moQLpJ0kj2J4NrJ0jkL%Qn
6701A1nJ2Nj2o%kjL%j1k%oJ2nOJjlJpJ1nPlJm%J1j0lJ5pJ8j7QJkmPjNJj2lJK1
6749B6j4oKprRlJOrk%QK%j7QMjkJ1jkK%Pj8J7l%jPqnJ1MqkJ0mnmJJnl%Rj6QLj
6801ANrLj4J1nj2J2J0pLPj0J1jqPkLJpJ3j4PRjjkQj2J2j5J1pJj1MmRj2LLKkmq
6847a2PrRkJkJKNjjQJ0j0J%NqNMj1J4mpJjKpJ2nnOnMpmOqJjRnMj0KNJ1mj9J6k
6898ALlOj0J0nOKlmMKNkoPj3JKOnmlJlpJ2qQKqnJ2JrNojKmJJ4nkNPkQj2J2j3K
6950DQmLNkk0J3%JNnljpjoNOolNpNjRooQLokKJ0Rj4kPO%nlLlkQpjJ1j0Mj2nkJ3
$$ y = [1, -7, -7, 2, 1, 5, 8, -1, 1, 3, 10, 12, 4, 10, 5, 6, 3, 4, 13, -3, 9, -3, -3, 8, -4, 3, -8, -10, -8, -5, -5, -3, -15, 1, -5, -2, -13, -11, -8, -11, -15, -5, 5, -6, -12, -4, 8, -8, 11, 0, 7, 5, -1, 2, 9, 3, 0, 7, -1, 6, 14, 5, 10, 7, 12, 7, -5, 10, 8, 12, 6, 5, 0, -4, -5, -6, -10, -7, 0, -13, -2, -6, -12, -4, -1, -8, 2, 0, -12, 2, 7, -2, 8, 7, 5, 8, 8, 16, 11, 6, 18, 23, 11, 5, 5, 3, 2, 5, 5, -6, -8, -8, -14, -2, -7, -1, 0, -1, -4, -3, -10, 1, -4, 3, 0, 1, -3, -3, 8, -2, -5, 10, 3, 21, 4, 12, 13, 11, 7, 14, 13, 18, 19, 7, 4, 5, 26, 12, 6, 8, 1, -8, 1, -2, -1, 5, -4, -6, -6, 2, 4, 4, -13, -5, -1, -2, -4, 7, 6, 4, 6, 6, 13, -5, 12, 9, 9, 8, 15, 7, 2, 13, 17, 9, 7, 17, 13, 8, 4, 5, 6, 1, -2, -2, 7, -9, -1, 2, 1, 6, -3, 0, -14, -3, -8, -20, -8, 2, -5, -2, 5, -5, 6, 5, -3, 4, 2, 5, 6, -1, 12, -2, 5, 14, 13, 12, 10, 18, 6, 18, 3, 14, 7, 8, -3, 1, -3, 6, -6, -3, 0, 2, 0, -4, -12, -5, -14, -5, -7, -6, -8, -7, -5, 0, -1, -2, 6, 16, 6, 7, 7, 12, 4, 9, 13, 2, 16, 12, 5, 6, 5, 7, 0, 12, 7, 2, 8, 3, 7, 0, -4, 2, -6, -5, -6, 3, -2, 2, -8, -6, -1, 10, 6, -13, 3, 1, 4, 1, 7, -3, 7, 2, 8, 10, 7, 3, 7, 9, 14, 12, 6, 13, 0, 1, 3, 9, 4, 0, -3, -2, -5, -12, 0, -8, 0, 2, -6, -11, 1, 2, -7, -2, -8, -9, -7, -11, -10, 4, -1, -3, 2, 9, 7, 15, 3, 15, 2, 4, 12, 8, 11, 16, 14, -6, 7, 7, 8, 13, 8, 5, 4, -3, -4, -10, -5, 1, -5, -8, -3, -10, -5, -6, 3, -3, -9, -1, 2, -4, -6, -4, 6, 15, 1, -1, 6, 12, 12, 7, 4, 7, 4, 2, 10, 3, 2, 13, 3, 7, -5, -10, -12, 1]
7004Aj%JnNj3RqRk%LlJ1qlkJnLJ1PJkj0LJPRqlKlPj2QJj%oMKn%j4NJJlMpMqJ%
7059a0Rj1kJ0ONlOj6Rj1J6%oJLPnNLJj0k%NpjKJMj0LLqjKrj%jJ1koKQqLJnPNK
7111ELnL%KMnOj2KQqNqJ1mjljjjrMJ0roQpJ1j0Lj2J9j4JJ0kKNmPJljONj2jmOj
7162COlrMRj0%rJ0kloqK0qMpmQjkNlMopJ2%L%%NNj0NlJ4j3rJ7LjKj0knJ0jkmj4
7213a3J3omlNkjLjmnRKqJ%J2lQokM%KNKlJPJrmOmnOJ1mj0QkrjnoNjkOoOJKj3J
7268a5LlLLmJJ5j2MJ3j%JjLjjjj3OMljj5J5J1j5mKJ%qK0j7JlQnlJ3j6J4j1nJ0
7313gqJ1jMOopJ9molRjJjNpMLj2RnrNnLpNJ2j2kpJ0Nj5J1kpQ%LKNqJjJ0oKNj1
7364bJ0jlNmLpMk%Qj4KpR%nkPqqPNpJkQOj0QkmrQJ0lOllkK%J0nMkJ4j3pPj6NM
$$ y = [1, 0, 0, 1, -4, 1, -12, -3, -11, -2, -4, -4, -1, -4, 7, -1, -4, -6, -5, -10, -7, 4, 11, 12, 10, 0, 3, 4, 11, 20, 12, 9, 11, 8, 15, 3, 11, 12, 11, 11, 5, 9, 11, 6, 6, -8, -3, -2, -1, -4, 0, -7, -3, -11, -10, -10, -1, -12, -14, -4, 2, 7, 4, 10, -6, 3, -8, 8, 8, 2, 3, 6, 13, 8, 13, 16, 17, 7, 5, 5, 10, 3, 2, 4, 5, 9, -1, 2, 5, -3, -4, -2, -11, -12, -12, -13, -2, -4, -10, -8, 0, -8, -5, -4, -9, -2, 3, 5, 8, 3, 6, 6, 8, 12, 7, 13, 1, 3, 11, 3, 8, 0, 11, 7, 6, 3, 2, 1, 0, -9, -5, 5, -4, -10, -2, -9, 2, -8, -5, -17, 2, -12, -11, -1, -3, -1, 4, 0, 7, 8, 5, 4, 10, 15, 3, 2, -2, 4, 3, 9, 6, -3, 1, 10, 0, 0, -9, 1, -1, -4, -10, -18, 2, -6, -2, -9, -13, -5, -6, -8, -3, -6, -2, -8, -15, -3, -3, 0, 0, 0, 5, 10, 0, 5, 2, 16, 3, -6, 11, 14, 13, 15, 5, 3, -2, 8, 7, 5, 1, -13, 0, -6, -10, -13, -8, -10, -11, -8, -9, -13, -18, -9, -7, -15, -14, -14, -2, -5, 3, -3, -5, -1, -1, 1, 6, 8, 5, 6, 13, 14, 5, 1, 7, 3, -2, 4, 15, 11, 1, 9, 7, -2, -3, -8, -14, -9, -10, -12, -6, -12, -6, -5, -3, -16, -15, -12, -15, -12, -9, -13, -12, 3, -9, -5, 8, 7, 7, 8, 7, 10, 9, 8, 7, -6, 0, 4, 1, 0, -15, 0, 11, -4, -8, -6, -5, -5, -13, 7, -10, -9, -12, -4, -9, -12, 1, -15, -1, -12, -17, -7, -15, -4, -5, -1, 5, -1, -8, 11, 7, 1, -2, 7, 6, 7, 6, 11, 4, 8, 11, -1, 8, 3, -6, -1, -6, -3, -10, -5, 7, -5, -7, -14, -4, 1, -14, -3, -5, -12, -4, -4, -1, 1, 6, -2, -1, -2, 8, 2, 4, 9, -2, 8, 7, 4, 9, 5, 8, 1, 5, 3, 3, 11, -3, -1, -8, 1, 1, -4, -6, 1, -7, -15, -8, -3, -10, -9, -11, -3, 3, -7, 1, -1, -5, -14, -6, 4, 1, 7, 4, 1, -1, 1, 1, 11, 6, 10, 8, 22, 9, 2, 9, -7, -2, 2]
7417BMlLjrLL%jmMmj0K0k5OJ0kMknLnRmj1J1mQkJ3pJ%J2j3PmNrOnOjrRqJ2j1K
7467DoqK%Oj0OmLjrKNkJ4kL%OnjOj4J9Kk0QJ1oLojooOoMMr%kKpJ1jqkJ0kJnOk
7520g%Pk%nQKNj0J0kMknJ1j0OqPJ0oj3Q%lJqqJ3j3LQj4PMNqjj%J1j2NqJ3LNpO
7569Ik%nR%Nj1PJj0LPj0MJOlrPoolJ6j2rLKKnKoRqOKPrK%jQmRnoOJJ1oKqLJ0N
7623B1kk2J3pQpjl%KmmN%jJmlNj2QKPlpJ4%kKqJ4JmJrQpPm%J3rJj0MMlnlJ3j0
7674@kMjKkj1kJ3nJkJMmrJ2lNRqMMoJ1j1%NqQlOJ%pMj0%mJ2nkpOpjMjqPjmQnM
7728dMoRMnrKNLOlNkpMJ0j0NnQKmlj1J0mOpm%j1K0j0jLronK2j6RMjk%PLjrRjN
7780IJ1j0lokJ2jMkk0K0j4J3j0j2J8kmqJOJnnkNJLjLKj7J3jNJjKnKlJ5jj%Kmj
$$ y = [2, 6, 3, 6, 5, -4, -1, 2, 2, 1, -3, 1, -3, -13, 7, -18, -12, -2, -4, 0, -2, -7, -4, -9, 0, -4, -15, -4, -8, 0, -2, 11, 4, 5, 5, 17, 4, 11, 7, 12, 3, 9, 4, 10, 9, 0, 9, 1, 13, 2, 4, -2, -10, -8, -8, -2, -12, -6, -10, -7, -8, -17, -15, -10, -12, 2, 0, 3, 3, 9, 4, 3, 9, -5, 14, 16, -4, 4, 15, 9, 12, 6, 5, -1, -7, -1, -7, -3, 1, -8, -8, -10, -8, -15, -4, -5, -13, -15, -5, -7, -6, -11, -5, -7, -7, 0, -2, -2, -7, 1, 3, 8, -2, 8, 6, 10, 8, 3, 14, 4, 10, 2, 9, 19, 13, 0, 8, 8, 5, 6, -2, -10, 3, -10, -7, 1, -13, -6, -2, 3, -5, -6, -7, -7, 4, -8, -3, -11, 2, 5, 10, 3, 9, 7, 7, 2, 11, 11, 16, 5, 12, 13, 3, 6, 13, 3, 7, 8, 14, 11, 2, 9, 3, -3, -6, 10, -2, -11, -8, -6, -4, -9, -7, -13, -4, -12, -6, -4, 3, -6, -4, -4, -5, 3, -1, 8, 3, -3, 3, 4, 15, 9, 11, 3, 6, 16, 21, 19, -3, 10, 3, 11, 4, 3, 0, 0, 2, -2, -6, -1, -1, -2, -1, -5, -8, -3, -15, -7, -5, 2, -1, -8, 6, 6, 4, 6, -2, 12, 13, 9, 10, 1, 9, 2, 9, 5, 5, 18, 9, 10, 0, 4, 8, 5, 0, -3, 10, 0, -2, 2, 1, 3, 1, -10, -12, 1, -4, -3, -5, -4, 0, -4, -13, -1, -4, 1, 10, 2, 6, 10, 4, 15, 4, 4, 9, 1, 9, 6, 12, 13, 13, 6, 10, 0, 0, -4, 8, 3, 1, -6, 0, -7, -8, -4, -5, -13, -6, -7, -11, -3, -8, -4, 0, -6, 3, 7, 2, -7, -5, 0, 3, 9, 6, 11, 9, 2, 6, 16, 6, 11, 6, 14, 16, 12, 9, -2, 8, 4, 10, 3, -1, -1, -12, 8, -2, -3, 0, -9, -15, -20, 2, -14, -5, -1, -2, -4, -4, 3, 6, 5, -4, 5, 4, 9, 20, 10, 7, 1, -1, 11, 10, 14, 12, -8, 12, -2, 11, 1, -11, 7, 5, 1, -7, -6, 0, 1, -4, -9, -11, -6, -5, -2, -3, 0, 2, -15, -2, -3, 2, 3, 2, 4, -1, 1, -2, 13, 12, 11, 11, 13, 9, 8]
7828H%QkpJ3mj8NMKj0ML%kroLPj1KPMklMkkOkKQqkLjmJ5lklLqPJKKmnKpoOljM
7884bolRpj%PLqoJkJ2OoM%n%PlP%kkNKqJ6j0J%jokJmlNj1NJ6j6LpOLnoJ0qpJ1
7937gPlMmOJ%oJ1j4J8%nMoJRj4J5rlmLPojrNRoKj7J0oqJ4Lj7RJ0j2RMj0%QnJR
7986GKqNNlnJ0mJ0noQj2OOqoJOrLN%j5PnmjNkJ1j3RnpJ3Kj0OmJ7jjLqQMjknj0
8037aJ3%mKlLpKlKJmoMnkQrJ1j1OjOj1J1nj0J5lLmKLOjj4RPj5OLNnpJ7pKnKnO
8088GmKklj5J3Kj3NkKkjMKNn%J0j0JMKjkJNRoKnMOj5R%j2N%mLNmkj6JQPljj0N
8140iKNmklMLjpPRlmMPOj1j%KJLLj%%nk%jLj2MQj3J0oOolqNjOKNjj1PmO
$$ y = [8, 8, 16, 14, 7, 20, 16, -2, 3, 7, 9, -1, 3, 6, 6, 4, -5, -11, -8, -1, -12, -10, -3, 1, -1, -4, 0, -2, -4, 2, 0, 2, 10, 2, 0, 3, 2, -2, 13, 10, 8, 5, 8, 0, 7, 8, 10, 12, 8, 3, 5, -2, -8, -2, -5, -6, -2, -8, -11, -2, -9, -10, -10, -3, 0, -8, -14, -13, -15, -3, 3, -3, 1, 1, -4, -4, 3, 0, 7, 7, 5, 3, 8, 10, 2, 18, 8, 9, 9, 8, 2, 0, 1, -3, -6, -1, -12, -7, 9, -7, -4, -11, -5, -2, -7, -13, -3, -11, -18, -7, 0, -3, 1, -3, 3, 4, 4, -2, 9, -5, 13, 13, 8, 12, 6, 7, 16, 2, 17, 8, 5, 1, 4, 11, 5, 4, -5, 0, 9, 3, 5, -12, -2, -8, -16, -2, 1, -16, -7, 3, -9, 0, 4, -6, -6, 2, -3, -2, 7, 9, 1, 6, 11, 8, 3, 13, 9, 19, 14, 8, 16, 4, 10, 16, 8, 2, 3, 9, 0, 3, 8, 8, -7, 0, -5, -9, -10, -5, -7, 4, -9, 0, -5, -12, 1, 3, -7, -1, -5, 12, 11, 10, 13, 5, 13, 17, 16, 14, 9, -1, 12, 12, 8, 10, 7, 10, 3, 5, 2, 4, 5, 1, -5, -1, -6, -8, 0, -9, 2, -9, -3, -4, 2, -9, 2, -3, -13, 2, -1, 2, -2, 0, 3, 9, 8, -6, 3, 10, -5, 1, 4, 9, 4, -3, 14, 7, 9, 4, 6, 1, 7, 3, 5, 3, 0, -15, -2, 0, -13, -8, -10, -8, -10, -11, -7, -5, 0, -5, -5, 5, -5, -4, 0, 2, 1, -1, 0, 5, 14, 8, 10, 5, 9, 15, 0, 9, 9, -3, 2, 2, -2, 1, 6, 2, 0, -16, -15, -7, 0, -3, -4, -14, -9, -7, -2, -6, -8, -11, -7, -4, -5, -12, -5, 4, 1, -3, 1, 8, 14, 3, 2, 2, 4, 5, 8, 11, 10, 10, 10, 5, 3, 3, 2, 5, -7, -3, 5, -8, 2, -4, 2, -4, -7, -15, -10, -11, -5, -3, 2, 1, -10, -3, -7, -1]
8191a
##END NTUPLES=NMR FID
##END=
