##TITLE=1H_LY-DMAA.Per.4.5
 CDCl3
 8 sc, 
 8.02.2022
##JCAMPDX= 6.0         $$ Bruker NMR JCAMP-DX V2.0
##DATA TYPE= NMR FID
##DATA CLASS= NTUPLES
##ORIGIN= UXNMR, Bruker Analytische Messtechnik GmbH
##OWNER= root
$$ XWIN-NMR		Version 3.5
$$ Tue Feb  8 13:44:21 2022 Russian Standard Time (UT+4h)  she@DPX200
##.OBSERVE FREQUENCY= 200.131346
##.OBSERVE NUCLEUS= ^1H
##.DELAY= (6, 6)
##.ACQUISITION MODE= SIMULTANEOUS
##.ACQUISITION SCHEME= undefined
##.AVERAGES= 8
##.DIGITISER RES= 18
##SPECTROMETER/DATA SYSTEM= spect
##.PULSE SEQUENCE= zg30
##.SOLVENT NAME= CDCl3
##.SHIFT REFERENCE= (INTERNAL, CDCl3, 0, 15.7039)
##AUDIT TRAIL= $$ (NUMBER, WHEN, WHO, WHERE, WHAT)
$$ ##TITLE= Audit trail, XWIN-NMR		Version 3.5
$$ ##JCAMPDX= 5.01
$$ ##ORIGIN= Bruker BioSpin GmbH
$$ ##OWNER= she
$$ F:/spectra/data/she/nmr/H-F/1/audita.txt
$$ ##AUDIT TRAIL=  $$ (NUMBER, WHEN, WHO, WHERE, WHAT)
(   1,<2022-02-08 13:42:03.54 +0400>,<she>,<DPX200>,
      <created by zg, POWCHK disabled, PULCHK disabled
       configuration hash MD5:
       00 E9 B6 7A A2 85 ED C7 34 08 36 98 17 FE 4E 26
       data hash MD5: 16K
       AD 69 CF DF 7B E6 1F E3 13 23 16 23 02 3C 00 5E>)
$$ ##END=
$$ 
$$ hash MD5
$$ 01 C9 4C 86 F9 F8 4C BA ED 43 D4 1F BE 31 69 50
##$RELAX= 
##$RELAX= 
##$RELAX= 
##$RELAX= 
##$RELAX= 
##$RELAX= 
$$ Bruker specific parameters
$$ --------------------------
##$DU= <F:/spectra>
##$EXPNO= 1
##$NAME= <H-F>
##$PROCNO= 1
##$TYPE= <nmr>
##$USER= <she>
##$AMP= (0..31)
100 100 100 100 100 100 100 100 100 100 100 100 100 100 100 100 100 100 
100 100 100 100 100 100 100 100 100 100 100 100 100 100 
##$AQSEQ= 0
##$AQ_mod= 1
##$AUNM= <au_zg>
##$AUTOPOS= <>
##$BF1= 200.13
##$BF2= 200.13
##$BF3= 200.13
##$BF4= 200.13
##$BF5= 200.13
##$BF6= 200.13
##$BF7= 200.13
##$BF8= 200.13
##$BYTORDA= 1
##$CFDGTYP= 0
##$CFRGTYP= 5
##$CHEMSTR= <none>
##$CNST= (0..31)
1 1 145 1 1 1 1 1 1 1 1 1 1 1 1 1 1 1 1 1 1 1 1 1 1 1 1 1 1 1 1 1 
##$CPDPRG= <>
##$CPDPRG1= <>
##$CPDPRG2= <>
##$CPDPRG3= <>
##$CPDPRG4= <mlev>
##$CPDPRG5= <mlev>
##$CPDPRG6= <mlev>
##$CPDPRG7= <mlev>
##$CPDPRG8= <mlev>
##$CPDPRGB= <>
##$CPDPRGT= <>
##$D= (0..31)
0 1.2 0 0 0 0 0 0 0 0.06 0 0.03 0 0 0 0 0.0002 0 0 0 0 0 0 0 0 0 0 0 0 
0 0 0 
##$DATE= 1644313322
##$DBL= (0..7)
120 120 120 120 120 120 120 120 
##$DBP= (0..7)
150 150 150 150 150 150 150 150 
##$DBP07= 0
##$DBPNAM0= <>
##$DBPNAM1= <>
##$DBPNAM2= <>
##$DBPNAM3= <>
##$DBPNAM4= <>
##$DBPNAM5= <>
##$DBPNAM6= <>
##$DBPNAM7= <>
##$DBPOAL= (0..7)
0.5 0.5 0.5 0.5 0.5 0.5 0.5 0.5 
##$DBPOFFS= (0..7)
0 0 0 0 0 0 0 0 
##$DE= 6
##$DECBNUC= <off>
##$DECIM= 32
##$DECNUC= <off>
##$DECSTAT= 4
##$DIGMOD= 1
##$DIGTYP= 9
##$DL= (0..7)
0 120 120 120 120 120 120 120 
##$DP= (0..7)
150 150 150 150 150 150 150 150 
##$DP07= 0
##$DPNAME0= <>
##$DPNAME1= <>
##$DPNAME2= <>
##$DPNAME3= <>
##$DPNAME4= <>
##$DPNAME5= <>
##$DPNAME6= <>
##$DPNAME7= <>
##$DPOAL= (0..7)
0.5 0.5 0.5 0.5 0.5 0.5 0.5 0.5 
##$DPOFFS= (0..7)
0 0 0 0 0 0 0 0 
##$DQDMODE= 0
##$DR= 18
##$DS= 0
##$DSLIST= <SSSSSSSSSSSSSSS>
$$ [...]
##$SUBNAM2= <"">
##$SUBNAM3= <"">
##$SUBNAM4= <"">
##$SUBNAM5= <"">
##$SUBNAM6= <"">
##$SUBNAM7= <"">
##$SUBNAM8= <"">
##$SUBNAM9= <"">
##$SW= 18.0517287032376
##$SWIBOX= (0..15)
0 0 2 0 0 0 0 0 0 0 0 0 0 0 0 0 
##$SW_h= 3612.71676300578
##$TD= 16384
##$TD0= 1
##$TE= 0
##$TE2= 300
##$TE3= 300
##$TEG= 300
##$TL= (0..7)
0 120 120 120 120 120 120 120 
##$TP= (0..7)
150 150 150 150 150 150 150 150 
##$TP07= 0
##$TPNAME0= <>
##$TPNAME1= <>
##$TPNAME2= <>
##$TPNAME3= <>
##$TPNAME4= <>
##$TPNAME5= <>
##$TPNAME6= <>
##$TPNAME7= <>
##$TPOAL= (0..7)
0.5 0.5 0.5 0.5 0.5 0.5 0.5 0.5 
##$TPOFFS= (0..7)
0 0 0 0 0 0 0 0 
##$TUNHIN= 0
##$TUNHOUT= 0
##$TUNXOUT= 0
##$USERA1= <user>
##$USERA2= <user>
##$USERA3= <user>
##$USERA4= <user>
##$USERA5= <user>
##$V9= 5
##$VALIST= <valist>
##$VCLIST= <CCCCCCCCCCCCCCC>
##$VD= 0
##$VDLIST= <DDDDDDDDDDDDDDD>
##$VPLIST= <PPPPPPPPPPPPPPP>
##$VTLIST= <TTTTTTTTTTTTTTT>
##$WBST= 1024
##$WBSW= 4
##$XGAIN= (0..3)
0 0 0 0 
##$XL= 0
##$YL= 0
##$YMAX_a= 81659
##$YMIN_a= -78605
##$ZGOPTNS= <>
##$ZL1= 120
##$ZL2= 120
##$ZL3= 120
##$ZL4= 120
##$ABSF1= 10
##$ABSF2= 0
##$ABSG= 5
##$ABSL= 3
##$ALPHA= 0
##$AQORDER= 0
##$ASSFAC= 0
##$ASSFACI= 0
##$ASSFACX= 0
##$ASSWID= 0
##$AUNMP= <proc_1d>
##$AZFE= 0.1
##$AZFW= 0.1
##$BCFW= 1
##$BC_mod= 2
##$BYTORDP= 1
##$COROFFS= 0
##$CY= 11.3945322036743
##$DATMOD= 1
##$DC= 2
##$DFILT= <>
##$DTYPP= 0
##$F1P= 2.36226072786647
##$F2P= -0.459571619588291
##$FCOR= 0.5
##$FTSIZE= 0
##$FT_mod= 4
##$GAMMA= 1
##$GB= 0.15
##$INTBC= 1
##$INTSCL= 1
##$ISEN= 128
##$LB= 0.24
##$LEV0= 0
##$LPBIN= 0
##$MAXI= 10000
##$MC2= 0
##$MEAN= 0
##$ME_mod= 0
##$MI= 1.114404
##$NCOEF= 0
##$NC_proc= 0
##$NLEV= 6
##$NOISF1= 3.799351
##$NOISF2= 2.8
##$NSP= 1
##$NTH_PI= 0
##$NZP= 0
##$OFFSET= 15.70392
##$PC= 1
##$PHC0= -15951.02
##$PHC1= 13.80078
##$PH_mod= 1
##$PKNL= yes
##$PPARMOD= 0
##$PSCAL= 0
##$PSIGN= 0
##$REVERSE= no
##$SF= 200.130013532006
##$SI= 16384
##$SIGF1= 3
##$SIGF2= 2
##$SINO= 400
##$SIOLD= 16384
##$SREGLST= <1H.CDCl3>
##$SSB= 0
##$STSI= 0
##$STSR= 0
##$SW_p= 3612.71676300578
##$SYMM= 0
##$S_DEV= 0
##$TDeff= 0
##$TDoff= 0
##$TI= <>
##$TILT= no
##$TM1= 0
##$TM2= 0
##$TOPLEV= 0
##$USERP1= <user>
##$USERP2= <user>
##$USERP3= <user>
##$USERP4= <user>
##$USERP5= <user>
##$WDW= 1
##$XDIM= 8192
##$YMAX_p= 0
##$YMIN_p= 0
$$ End of Bruker specific parameters
$$ ---------------------------------
##NTUPLES= NMR FID
##VAR_NAME=  TIME,          FID/REAL,        FID/IMAG
##SYMBOL=    X,             R,               I
##VAR_TYPE=  INDEPENDENT,   DEPENDENT,       DEPENDENT
##VAR_FORM=  AFFN,          ASDF,            ASDF
##VAR_DIM=   8192,          8192,            8192
##UNITS=     SECONDS,       ARBITRARY UNITS, ARBITRARY UNITS
##FACTOR=    0.0002768,     1,               1
##FIRST=     0,             0,               0
##LAST=      2.2672688,     0,               0
##MIN=       0,             -78605,          0
##MAX=       2.2672688,     81659,           0
$$ Real data points
##PAGE= N=1
##DATA TABLE= (X++(R..R)), XYDATA
0@%%%%%%%%%%%%%%%%%%%%%%%%%lJ0j5J6j6J6j6J6j6K0k8L2l2L2l7M5m8N2o0O4
45C2o9P7q5R4j04J15j28J43j57J73j91K12k38K70l08L53m11M88n91P43r80J383
67H21k201M436k0937o0724Q2151O8828o9884o1107M9639M9001k3529l5165m850
80b3521K0117L3815o425n9331n640P9471J4295r1704j9949R5433K2337q9967k2614
93e3683P6237K1010n5536j8616L0469J6034l466j4094k2586J3073M5360j3053
105B1149o2448J3764P2532j4809p4733J5568O9298j5489n7209J3993M0194j0831
117A0979k0354N770J57O75J8090q038l2556J5715M1686k2815m4899K8483M2207
130C5100l1925l4346L2718K2790l0612r286K5748m131j8547J5743R780k4010l47
$$ plain form
0 0 0 0 0 0 0 0 0 0 0 0 0 0 0 0 0 0 0 0 0 0 0 0 0 0 0 -3 7 -8 8 -8 8 -8 8 -8 12 -16 16 -16 16 -21 24 -24 28 -32 32
45 32 -37 40 -45 49 -55 60 -68 75 -82 91 -100 112 -126 144 -164 189 -222 266 -325 418 -562 821
67 821 -1380 3056 -17881 -78605 3546 72374 2490 -58617 -8978 40023 16494 -18671 -23521
80 -23521 -3404 30411 23986 -35345 -40985 38486 52781 -38923 -58872 36561 58898 -31069 -53683
93 -53683 22554 43564 -11972 -30588 -119 15915 12449 -1645 -24231 -11158 34202 21149
105 21149 -41299 -27535 44997 30188 -44545 -28977 40321 24832 -32377 -18384 21810 10979
117 10979 -9375 -3605 -3448 -2773 15317 7279 -25277 -9562 32124 9309 -35590 -7107 35100
130 35100 3175 -31171 1547 24337 -6275 -15561 10187 6056 -12491 3252 13032 -10978 -11325
143a1325K7915q799k7115J6706K1801k2615j2809K5947J397k6610J0754K4696
155A9943k2091k0574L1016J4952l6272q617L7004K433l2899K860K4346o535j2196
168f630Q290k128q116J7146O261l1095l197M2293l88m9462L646N1649n872m8569
182b6172O418M0481m986k8274J477J3206L799L058j0173j8895J6827L2753k2717
195F802m3266K6885M9583k8479n1113K6986M7951k2151m0624J4214K9998l714
207A3072j7287q387L819K0827R098l2387k0364M1658K9008m7529l4463M9072L6506
220D2643m5900l5317L8105L1374k6196k5385J1294J8231N183j0741k1546L717
232a4538L6215K292m7590o903N4450J0024n6171j1673N2507J2190m3904j2000
$$ plain form
143 -11325 16590 7791 -19324 -2618 19183 -3432 -16241 9706 11103 -15507 -4753 19943
155 19943 -2148 -22722 8294 23246 -13026 -21643 15361 17794 -15105 -12245 12101 5566 -6630
168 -6630 1660 -468 -8584 8562 14823 -16272 -19469 22824 22436 -27026 -23380 28269 22397 -26172
182 -26172 -19754 20727 15741 -12533 -11056 2150 5949 9007 -1166 -20061 -3234 29519 6802
195 6802 -36464 -9579 40004 11525 -39588 -12602 35349 13198 -27426 -13212 16786 13072
207 13072 -4215 -12602 -8783 12044 21142 -11245 -31609 10049 39057 -8472 -42935 6137 42643
220 42643 -3257 -38574 -469 30905 4709 -20676 -9382 8849 14032 3291 -18255 -14538
232 -14538 21677 23969 -23621 -30524 23926 33950 -22221 -33894 18613 30803 -13101 -25101
244b5101L1268J1389j5963j0839l59J0522J6111j0573k9726J0893L9848j1221
256A6249m5634J1336M6713j0852m3154R515L5561p080k4973L630J2663P53n3n792
270a118j1509J0984K0850j5838k7047J9758K9601k2319k8488K3059K4067k1787
282B13j7172J8570Q792j3576j90P310p483l24J3295o604j6523J2864J6821j7726
296a733j4265K0696R353k1509k841K0147m303j6878J0964J2165j6276o648J9417
309H289R98j9919M032J7622p928j2712J0215N817j0720K339R526j0776o945J8558
323H396L456k4672L58K8407l784k9271O264K7054p295k1948O607J4474m219n437
337a610L01m251M544J3643r777k1724J4611K7629j8266l0847K0083L1125j9584
$$ plain form
244 -25101 6167 17556 1593 -9246 -9605 917 17028 6455 -23271 -12378 27470 16249
256 16249 -29385 -18049 28664 17812 -25342 -15827 19734 12654 -12319 -8689 3974 4727 4674 -1118
270 -1118 -12627 -1643 19207 3369 -23678 -3920 25681 3362 -25126 -2067 22000 213
282 213 -16959 1611 10403 -3173 -3363 3947 -3536 -3860 9435 2831 -13692 -828 15993 -1733
296 -1733 -15998 4698 14051 -7458 -10299 9848 5545 -11333 -369 11796 -4480 -11128 8289
309 8289 9287 -10632 -6600 11022 3094 -9618 597 6414 -4306 -1967 7559 -3217 -10162 8396
323 8396 11852 -12820 -12462 15945 12161 -17110 -10846 16208 8913 -13035 -6428 8046 3827 -1610
337 -1610 -1309 -5560 -1016 12627 2850 -18874 -4263 23366 5100 -25747 -5664 25461 5877
350E877k8496J6585K3427j1179j6475L795Q474M834k03j3840p485K2199J3951
363B1464k8894j8747L3068K1587l4112k2457L1722K1488k6037j9021J7460J5494
375A3015o820j1383m870P147J6417l137k6667l27L4528L159l9161n230M0073O647
389B3391l7146p533L0681Q110k1348q518J0145Q855J785r313j3212R773K3025
402A8695j0199l0242J0333L4243j0036l4722R082L1787p281k5938M615J7926j113
415G150q719k948o25P308R188j1549j6033J5125K0625j7670k2576J8783K1904
428A9963j8305j8901J6100J4111j2400q251P513K125j899L499l940p934R351J0727
442A1759j3829j1597J6972J0518j8396p752J8030L810j5900O92J2325n059p708
$$ plain form
350 5877 -22619 -6034 17393 6214 -10261 -6466 2008 6842 6639 -7201 -14686 7513 21464
363 21464 -7430 -26177 6891 28478 -5634 -28091 3631 25119 -918 -19939 -2479 13015
375 13015 6195 -5188 -10058 -2911 13506 10369 -16298 -16625 17903 21062 -18099 -23329 16744 23391
389 23391 -13755 -21288 9393 17503 -3845 -12363 -2218 6637 8422 -891 -14103 -4330 18695
402 18695 8496 -21746 -11413 22830 12794 -21928 -12846 18941 11660 -14278 -9663 8263 7150
415 7150 -1569 -4517 -5142 2166 11354 -195 -16228 -1103 19522 1852 -20724 -1941 19963
428 19963 1658 -17243 -1143 12968 568 -7683 -170 1955 56 3555 -385 -8319 1032 11759
442 11759 -2070 -13667 3305 13823 -4573 -12325 5705 9515 -6385 -5693 6632 1573 -6135
455f135Q597K618j0836K368J1385o688j0129R839P185j1531k915J1572k143j0084
469f897P301P380j1984l856J5534R5j7485L365J7597n951j5764P281J2184p111
483A689p210N471J405k561M669j266j0363N390J5121r283j8467J2331K0046j4027
497B945j9756J3971J7626j2012j4003Q304R214l057l897l120j443R573O416j5627
511d866j0415K0477J3240k3512j4678K4231J4808k2471j3763J8250J1807j1918
523A190r305M066O571M490l904j2937J517K0331M95k5909k097K9088L319k9460
537a2545m259K6996N041k1931n743J4816O467o367p221k488P918J0953q547j8149
551a5059Q937K3367q909k6205Q348K6370p141k4021N248J9450k657j3256n15O190
$$ plain form
455 -6135 2462 5080 -5756 -3388 7997 1309 -8820 1019 8204 -3327 -6242 5330 3187 -6897
469 -6897 404 7784 -4200 -8056 7478 7573 -9912 -6547 11050 5099 -10665 -3384 8800 1689
483 1689 -5521 -50 1355 -1206 3463 2197 -8166 -2776 12345 3062 -15405 -3074 16972 2945
497 2945 -16811 -2840 14786 2774 -11229 -2925 6289 3232 -665 -3785 -5228 4345 10761 -4866
511 -4866 -15281 5196 18436 -5076 -19754 4477 19285 -3186 -16949 1301 13108 1190
523 1190 -8115 -4049 2522 7012 3108 -9829 -8312 12019 12514 -13395 -15492 13596 16915 -12545
537 -12545 -16804 10192 15233 -6698 -12441 2375 8842 2475 -4746 -7234 684 11637 3090 -15059
551 -15059 -6122 17245 8336 -17869 -9521 16849 9708 -14313 -9065 10385 7728 -5528 -6043 147
565A47M036R55p626p482J0981J2733j3669j6214J5372J7727j5819j7213J4861
578a211J4959j2494j1362Q885O941m297k427p40j784N760N137j0266p315J3770
592C556Q150j5900p674J6444O059j5371l655J2848Q62r131J842M772m102j14N504
607D090m245n834P798N122j0233l405J1316R05j0998K050R333n045o628P636L260
622E122r481K63J0285l479r929N969Q395p358n817P428K540o231J148L932m860
637b073p01Q042k786j0550O165J2044q876j2413J0504J1639j0759r856R481P288
651G149o806m247K984R77J667K128o503m808J0961O893j4567q201J6809Q726j7334
666d172q523J6041P707j2926o496Q333N043k608l661l552K344R619j253j4951
$$ plain form
565 147 4183 5138 -2488 -9970 1011 13744 75 -16139 -767 16960 1141 -16072 -1211
578 -1211 13748 1254 -10108 -1223 5718 1421 -1006 -1746 -3530 2230 7367 -2899 -10214 3556
592 3556 11706 -4194 -11868 4576 10635 -4736 -8391 4457 5319 -3812 -1970 2802 -1300 -1414 4090
607 4090 -155 -5989 1809 6931 -3302 -6707 4609 5514 -5484 -3434 5899 854 -5774 1862 5122
622 5122 -4359 -4096 6189 2710 -7219 -1250 7145 -213 -6030 1398 3938 -2293 -1145 2787 -2073
637 -2073 -2774 5268 2482 -8068 -1903 10141 1265 -11148 -644 10995 236 -9620 -139 7149
651 7149 343 -3904 -920 57 1724 3852 -2651 -7459 3502 10395 -4172 -12373 4436 13162 -4172
666 -4172 -12695 3346 11053 -1873 -8369 -36 5007 2399 -1262 -4814 -2470 7149 5896 -9055
680i055M30J8884K34k1078p87K1213J346j9299k003J5495K839j0217l852L992
694a858N087K473o302q626P441J3778q217j7463Q485J9370q053j9380O890J7523
708A1148m916j4164K319R614P87m505m134o34P337N330j0169r114J2263J1669
722A2831j3361j2808J3296J2583j2028j1072R604Q622o232n580K190K391K142
735B578O05o312l033R872M721j2569n482J4002N373j4098m487J2775L074j0237
749c218j422O788k02k799J564j336k381N078K565q019k118R925J121j0588K76
764d766J0020j865q323L380N799m624k785N404l87n521L232M921n383l712O626
779B016J981o823Q2N972k253m190M310J668n935J172O988l907p398O182P124p670
$$ plain form
680 -9055 -8625 10259 10493 -10585 -11372 9841 11187 -8112 -10115 5380 8219 -1998 -5850 -1858
694 -1858 3229 5702 -600 -9226 -1785 11993 3776 -13687 -5202 14168 6115 -13265 -6375 11148
708 11148 6232 -7932 -5613 4001 4788 283 -3851 -4485 2852 8182 -1987 -11101 1162 12831
722 12831 -530 -13338 -42 12541 513 -10559 -955 7667 1435 -4145 -1955 436 2578
735 2578 3183 -3129 -6162 3710 8431 -4138 -9620 4382 9755 -4343 -8830 3945 7019 -3218
749 -3218 -4640 2148 1946 -853 711 -625 -3006 2072 4637 -3382 -5500 4425 5546 -5042 -4766
764 -4766 5254 3389 -4934 -1554 4245 -379 -3164 2240 1853 -3668 -436 4485 -898 -4610 2016
779 2016 3997 -2826 -2744 3228 975 -3215 1095 2763 -3172 -2000 4988 1081 -6317 -135 6989 -681
795f81o166Q116M687p368k896N527R71k766R04o63k536M283L733p640m489J0330
811C346M795j2003m697J2414M258j1435l626R149K940n792k288J717J727K740
825C245j309o985J002J0658q08j3357O58J4744m38j4719O8J3247M96j0486j296
840e280O699K340k313l552k240M736O544n804j0146O589J2703o897j3968O597
854c992J3880n592j2488L954R963j718o675r27K973L696P75o335m184Q609O888
869H827j0222q695J0953R481j0683r279R399Q201p189o487M265M392q90k144k646
884b717M2N921J709q649k937J0564L625j1489l701J1274L309r974k559P732J637
899C787m792p56J485j6J916M48m955n27P293K81q771K62R220r79q622J765P094
$$ plain form
795 -681 -6847 1269 5956 -1412 -4308 1219 2190 -576 328 -335 -2871 1412 5145 -2495 -6984 3346
811 3346 8141 -3862 -8559 3855 8113 -3322 -6948 2201 5141 -651 -2939 -1222 505 3245
825 3245 1936 -5049 -4047 6611 5803 -7554 -6896 7848 7410 -7309 -7241 6006 6502 -3984 -5280
840 -5280 1419 3759 1446 -2106 -4346 390 6934 1130 -9016 -2427 10276 3379 -10589 -3992
854 -3992 9888 4296 -8192 -4238 5725 4007 -2668 -3595 -622 3074 3849 -2486 -6670 1939 8827
869 8827 -1395 -10090 863 10344 -339 -9618 -219 7982 793 -5694 -1429 2963 2073 -71 -2717
884 -2717 -2675 3246 4955 -3694 -6631 3933 7558 -3931 -7632 3642 6951 -3023 -5582 2150 3787
899 3787 -1005 -1761 -276 -292 1624 2072 -2883 -3410 3883 4164 -4607 -4345 4875 3896 -4726 -2961 4133
916D133k416m883K849K252k935M95K606k949j910M828Q85n913L44O080j595n444
932c573K769M035l740k081M368j60m560K332M344m159l681N364K741n836j569
947c406N449L81m274P96K375j801K6K524k593k908M997K950o943k724Q165K314
963E328q544j755P903J204o349p78M016M67j061l79k098M70N120o93p663R77R501
980E666j215j0377J291J0225j090r091O43P040J14m336j157J254K331J928l535
995c09m837M564P236n353q901N707R683n521r536M739Q525l365o804J515M578
1010A921P08k059l081m74N315K765p180m600Q485N835r055o410Q769O311p610
1025c60n661N705M568l184l251L27J802K655m94n327o20P478J434q916j886R483
$$ plain form
916 4133 1717 -3166 -317 1935 -1000 -505 2101 -848 -2758 2070 2955 -2958 -2614 3466 1871 -3573
932 -3573 -804 3231 -509 -2590 1778 1618 -2942 -610 3734 -425 -4106 1258 3999 -1837 -3406
947 -3406 2043 2424 -1850 -1054 1321 -480 -454 2070 -523 -3431 1566 4516 -2427 -5151 3014 5328
963 5328 -3216 -4971 2932 4136 -2213 -2991 1025 1492 431 52 -2046 -1576 3544 2851 -4812 -3835 5666
980 5666 4451 -5926 -4635 5590 4500 -4591 -3948 3092 3206 -1130 -2287 -1033 1298 3226 -309
995 -309 -5146 -582 6654 1301 -7600 -1893 7790 2269 -7267 -2528 5997 2632 -4172 -2657 1921
1010 1921 2629 570 -2511 -2985 2330 5095 -2085 -6685 1800 7635 -1420 -7830 939 7250 -360
1025 -360 -6021 -316 4252 1068 -2183 -1856 -54 2601 2107 -3220 -3840 3638 5072 -3844 -5730 3753
1041C753K041r123j925P876J662n911j350L439J041o82q31k041P63M432q61o225
1057c942J048P289j296p568J548P022j716n792J761L990j598j833J239l84o57
1072h89K400j07l938R36M893j778n127K499M655l015l600L293K061l233l31K877
1088A596j404k253K898J397l888m72M317m81m100J308L258j897j949K270K68k322
1104a454J534K111l224j678M598J116n472m93N697k8n311M42M259o32k669N67
1120f37P04k88J408j78l441P26N169j289o369J716O960j936o839J866O030j441
1136B161m644P13K802K85o60j467j486K641L465l728n001M470O054m847o506M711
1152a037O349m068n634K923M473j343k997m94J326K439L24m273j774N754K968
$$ plain form
1041 3753 5794 -3329 -5254 2622 4284 -1627 -2977 462 1503 821 -10 -2051 -1288 3144 2283 -3942
1057 -3942 -2894 4395 3099 -4469 -2921 4101 2385 -3407 -1646 2344 746 -1087 152 -232 -889
1072 -889 1511 1404 -2534 -1598 3295 1517 -3610 -1111 3544 529 -3071 222 2283 -950 -1281 1596
1088 1596 192 -2061 837 2234 -1654 -2126 2191 1710 -2390 -1082 2176 279 -1670 600 868 -1454
1104 -1454 80 2191 -1033 -2711 1887 3003 -2469 -2962 2735 2707 -2604 -2162 2097 1465 -1204 -637
1120 -637 67 -221 1187 1009 -2432 -1706 3463 2174 -4195 -2479 4481 2545 -4294 -2428 3602 2161
1136 2161 -2483 -1770 1032 1317 657 -810 -2296 345 3810 82 -4919 -449 5605 758 -5748 -1037
1152 -1037 5312 1244 -4390 -1467 3006 1663 -1334 -1828 -502 1937 2261 -2012 -3786 1968 4936
1167D936o757l799P173M214o872m239N918L891m335l335K324K551k4j700k313
1182b367Q57M438j33o108m27P166Q35p559j032P165J131o097j153M461J147k420
1198i6j132J79J209J964j302l830J445N205j594n966J681O082j665n617J539M590
1214B692j270l121Q13J442k46K81m41j829J128L046j770l800K310M045k657l752
1230c129K769L028k647j930K251O69j638O10Q87j757l6K558p71k978J473K919
1246B278j999k429K269J560k260m65K032p72j546J930R18k857k41L480m13l646
1262b161R10L398j224k711J298J662j119l95P20r73j36K254m99l361J113M113
1278B889j598m446J869M352j856l827J534K918r29j724J03L72Q78R99j883k247
$$ plain form
1167 4936 -1821 -5620 1553 5767 -1105 -5344 574 4465 130 -3205 -881 1670 1646 -54 -2367
1182 -2367 -1510 2928 2795 -3313 -3740 3426 4261 -3298 -4330 2835 3966 -2131 -3284 1177 2324 -96
1198 -96 -1228 -1049 160 2124 822 -3008 -1563 3642 2048 -3918 -2237 3845 2180 -3437 -1898 2692
1214 2692 1422 -1699 -886 556 310 591 150 -1679 -551 2495 725 -3075 -765 3280 623 -3129
1230 -3129 -360 2668 21 -1909 342 1011 -627 -17 870 -887 -923 1635 864 -2114 -641 2278
1246 2278 279 -2150 119 1679 -581 -1046 986 214 -1332 598 1516 -1341 -1582 1898 1485 -2161
1262 -2161 -1251 2147 923 -1788 -490 1172 53 -342 378 -595 -731 1523 1024 -2337 -1224 2889
1278 2889 1291 -3155 -1286 3066 1210 -2617 -1083 1835 906 -818 -715 -343 535 1534 -349 -2596
1294b596K796L231l453l894L808M121l717m034L253L563k368k789J121J849L04
1309A195p92j849k03L267J102m450j794N211K277n479k525N239K589m501k443
1324c156L259K172j665j814r7J414J876j012l467O09M728k70n511j7N737K69n431
1341b376n25M614P31l339r40J775J166r1j367j555J567K967j713m020J793M627
1357C314j795m689J635M301j329l508R04K385l34j124l04j98R93J354j627k270
1373b292K159K832k494l057K643K895k544k378K169J665j617p88Q90j01r2R01
1389G91o87j525J392J872j930j906K213J682k260j194K063N25j650K30J059r66
1405b91l77J560l11j951R07K116j388j962J620J562j596r43J337J96q73O16K56
$$ plain form
1294 -2596 200 3431 -22 -3916 -108 4013 296 -3738 -485 3078 710 -2079 -958 891 1195
1309 1195 403 -1446 -1649 1618 2720 -1730 -3524 1687 3964 -1515 -4040 1199 3788 -713 -3156
1324 -3156 103 2275 610 -1204 -1301 113 1989 977 -2490 -1881 2847 2577 -2934 -2951 2786 3055 -2376
1341 -2376 -2901 1713 2444 -895 -1835 -60 1106 1015 -352 -1907 -340 2627 914 -3106 -1313 3314
1357 3314 1519 -3170 -1535 2766 1437 -2071 -1167 1218 884 -240 -544 -742 251 1605 -22 -2292
1373 -2292 -133 2699 205 -2852 -209 2686 142 -2236 -67 1598 -19 -807 83 -18 -110 791
1389 791 104 -1421 -29 1843 -87 -1993 220 1902 -358 -1552 511 1036 -614 -384 675 -291
1405 -291 -668 892 581 -1370 -463 1653 265 -1697 -77 1485 -111 -1054 283 479 -394 222 478
1422D78j394M25K020j058k445J569K592j839k514J879K173j630j634J113R52m07
1438B80j68m35o16J303J303k084j844K682K206k984k375K985K324k634k071J947
1454a81J670j004j173r4O15J240m5k347m41L226Q58l823j175M053J348l875j419
1471b567L293J424k372j362J205J268J09j143j418J005K590q42l528O97M086m83
1487A962m252K34M031J6l392l60K478O85j315j041P6J349J118j612k154J773K940
1504B536j816l382J720L479j485l223J109K654n98j874L0R56N91rj196q42J700
1521C50J538k080k007K302K192k302k140K098J837j683j375J112P98m10j90l26
1537b86l65J010Q18j596j075J988J164k152j095K112Q48j833m79J344P6p49L25
$$ plain form
1422 478 -916 -491 1529 471 -1974 -405 2187 348 -2166 -287 1886 256 -1378 -265 687 280
1438 280 112 -323 -939 364 1667 -417 -2261 421 2627 -357 -2732 253 2577 -57 -2128 -181
1454 -181 1489 485 -688 -782 -167 1073 1028 -1319 -1760 1466 2324 -1499 -2674 1379 2727 -1148 -2567
1471 -2567 726 2150 -222 -1584 -379 889 998 -145 -1563 -558 2032 1190 -2338 -1641 2445 1962
1487 1962 -2290 -2056 1975 1991 -1401 -1761 717 1402 87 -954 -878 471 1589 -23 -2177 -404 2536
1504 2536 720 -2662 -942 2537 1052 -2171 -1062 1592 994 -880 -850 106 697 688 -508 -1350 350
1521 350 1888 -192 -2199 103 2295 -7 -2147 -49 1788 105 -1270 -158 640 230 40 -286
1537 -286 -651 359 1177 -419 -1494 494 1658 -494 -1589 523 1371 -462 -941 403 479 -270 55
1554E5R1p05N73R40j096j059J460J008j616q23J568N13j309j19Q72k82l34P08
1572D45k79j028Q27J254j268j343J549J284j628j085J444Q09j070m40M96N7J47
1589A71L55q62o77J478R45j959j125K247J198k284j165K034J058j548q79Q54O80
1606E21m5m36q07J85J618L5k261k58K718M26k869n87K755O95k355p89J708Q51
1624A105q75r00n5R24R69r14j792Q78K457p94k873O48K995m47k829J84K407J37
1642A225j766m88R74Q56j08j189p39J451J475j627k033J682K348j559k460J312
1658f46K299r37j937M71J408Q8p87o43J37J153M66j576r66J854J331j960j518
1675a763J892J528j646j401J238J141p30p73J37L87M62j6j013l12J453N41j733
$$ plain form
1554 55 146 -559 14 954 -142 -1201 259 1267 -349 -1172 396 909 -400 -519 353 71 -263 445
1572 445 166 -862 -35 1219 -49 -1392 157 1441 -187 -1272 172 981 -89 -529 -33 24 171
1589 171 526 -336 -1013 465 1410 -549 -1674 573 1771 -513 -1678 356 1414 -134 -1013 -159 521
1606 521 476 40 -767 -582 1036 1071 -1190 -1448 1270 1696 -1173 -1760 995 1690 -665 -1454 254 1105
1624 1105 230 -670 -725 199 1168 254 -1538 -660 1797 1003 -1870 -1222 1773 1326 -1503 -1319 1088 1225
1642 1225 -541 -1029 -55 801 693 -496 -1235 216 1691 64 -1969 -287 2061 502 -1958 -646
1658 -646 1653 716 -1221 -750 658 746 -41 -684 -547 606 1072 -504 -1470 384 1715 -245 -1763
1675 -1763 129 1657 11 -1390 -152 989 259 -514 -377 10 472 456 -557 -869 584 1125 -608
1692f08o48J843O59j736o01J489M28j041k58N27M3L3J46n70k84J022L58j312l79
1711h89J443L10j393k01J162O2q08J07L50k71J34M14n94m87R49N44j204n10J277
1730C95M31j165l24R18J69n18j8O2j48M42K78r18l77J294M27j510m75J593M58
1749A014j451m52J163L93p04l64J55L11M36k48j003K02J459j17j787N5J926M8
1767A036j881j57J626K79j181m38O47N54j9o94n86P70J147q16j582P97J866o97
1785F71j973N36J879l00j630J7J235L08p26o31J72R31L77j176q68J331J242j378
1803A7j489J285J613j102j544P83J340l66j040r3O73N40k45r77j55J313M85j510
1821d72p58J593R35j520r83J271R72r41q33M94O52j5m45m54K17Q77j0j197j77
$$ plain form
1692 -608 -1256 587 1246 -490 -1091 398 826 -215 -473 54 97 130 276 -294 -578 444 802 -510 -889
1711 -889 554 864 -529 -730 432 494 -314 -207 143 -128 6 420 -174 -661 288 832 -372 -882 395
1730 395 826 -339 -663 255 424 -94 -112 -50 -198 244 522 -396 -773 521 948 -562 -1037 556 1014
1749 1014 -437 -889 274 667 -37 -401 -246 65 501 253 -750 -548 911 794 -993 -938 988 1036
1767 1036 -845 -1002 624 903 -278 -716 -69 485 466 -228 -814 -44 1103 287 -1295 -498 1368 671
1785 671 -1302 -766 1113 813 -817 -800 435 743 17 -614 -442 489 866 -310 -1178 153 1395 17
1803 17 -1472 -187 1426 324 -1220 -437 903 537 -503 -596 77 617 372 -605 -760 553 1038 -472
1821 -472 -1230 363 1298 -222 -1205 66 1038 97 -736 -242 410 395 -50 -504 -287 590 580 -617 -794
1840g94J407K99j459l70J343M06j134l69P89L27l90k49l8J59M62j01p84K5J046
1859E75Mj139m4J121N0r68k0O89%l50J2k9k2L73L9o74m4Q82K9r62j3R24%p68K6
1884c09M82j8j61K9j96j3N15K2q03j4R75K3j041l7R88O9q33j06N56J56k09j94
1906a19j76K44N20k74q39K97J067k70j189K18J179j05j060k4Q24J61m87l18J04
1925b47M85K64o01o39O92R23p16j115O67J212n55j170L50J047j29q14j27M97M24
1944D48j74o88j45Q81M60j023o93J056Q66r97r57Q45R77o28q78L05P44K9n31l89
1964d92L12P04p4r75j42J136L31j193m75J135N70r72o06P09N89l69n23KM36L52
1984D55l23o61J91R15q5j048l3J089J13r95j96Q31K35n79k67K67K84M2k72l41
$$ plain form
1840 -794 613 912 -547 -917 426 832 -302 -671 118 445 55 -194 -232 -73 389 288 -496 -471 575
1859 575 579 -560 -604 517 567 -401 -421 268 268 -82 -70 -99 -121 252 291 -383 -427 455 484 -478 -491 433 433 -335 -309
1884 -309 173 155 -6 23 -173 -186 329 351 -452 -466 509 532 -509 -546 442 511 -322 -428 128 284 75 -119
1906 -119 -295 -51 469 195 -644 -347 720 450 -739 -521 658 553 -507 -531 293 454 -33 -351 -247
1925 -247 238 502 -99 -738 -46 877 161 -954 -287 925 370 -800 -450 597 468 -346 -473 24 448
1944 448 274 -414 -559 322 782 -241 -934 122 988 -9 -966 -121 856 228 -650 -345 399 428 -103 -492
1964 -492 -180 524 450 -525 -667 469 800 -393 -868 267 837 -135 -741 -32 557 188 -335 -333 103 455
1984 455 132 -529 -338 577 492 -556 -589 500 613 -382 -578 253 488 -91 -358 -91 193 235 -37 -378
2004c78K68N75k32p45J85Q51j54q27P5P40k4n53l7L05J09n5j51k05K04M04k14
2025A41n61K07O60j94o66J76N53q8m29L2K16L9J2j04k30J59M24k04n59K08O36
2046D28k00o36J52N59p0m04k4K02J30nk08k23K95M15l42n69L61O67l45o72K52
2067b37O46j50n41J7L61J60j72k95m6M36K44n42m26N97N55n69o46N12O51l84o09
2088d38J92N22Kl67k41K18M27j8o22j25P27K97p94m17P73M87o61n29N10N19k82
2109A80m69QM05K29k90m77J97O57q1p82m6Q39J42q06k38P06L10n29l61L14L74
2130B82n9l62j98L42M08k89n92K28P11j45p43N3P02L4n97j27M48J91k39k52J0
2151a94L13J90l28l64L26M92l17n54K62N59j79n22J01M03Ok43j13R2J98N9k65
$$ plain form
2004 -378 -110 465 233 -512 -327 524 370 -457 -382 358 334 -219 -256 49 158 103 -48 -253 -49 355 141
2025 141 -420 -213 447 253 -413 -237 316 228 -201 -169 47 86 98 -6 -236 -77 347 143 -416 -208 428
2046 428 228 -408 -256 303 233 -171 -195 7 137 132 -76 -299 -4 411 69 -500 -139 528 183 -489 -237
2067 -237 409 259 -282 -265 96 256 84 -211 -257 179 423 -119 -545 52 607 38 -608 -96 555 171 -438
2088 -438 -246 276 278 -89 -330 -112 315 297 -325 -450 277 574 -220 -637 136 623 -38 -567 -57 462 180
2109 180 -289 -281 124 353 63 -414 -217 440 359 -423 -469 370 512 -294 -532 174 484 -45 -406 -92 282
2130 282 223 -139 -337 5 413 124 -468 -240 471 326 -417 -364 338 372 -225 -352 96 287 48 -204 -194
2151 -194 119 309 -19 -383 -57 435 118 -436 -174 385 206 -316 -215 188 194 -49 -162 -70 128 187 -78
2172g8k01L03L25l19l99K91M33k65l79J64L34p8k26l0R0J47L8k24j72K86K61k87
2194A4l39K89L57k36l48J64K87p3j96l9R5J47K5k55j44L34K38l69k96L51L44l15
2216C5l39K28K98r2k58l6J83J59o9k94j3L75J26m68j93M68K62m25l17L56L29k21
2238I4l22P4K74J03k29k46J34L88n6m85k7N28J16n40j80M87K35l75k81K40K94
2259B26o4l10q7K71K61k35l93J81M79r2n46L8N40M3m90j05L52J97k33k46P4K85
2281A46Q4l09k23K99L48k82m15K11M65j44m48N5M00L7l12j31K01J95o5k52p2L02
2303I0J76l09k59K75L28k36l52J77L22p8k85RJ98J00j27j77L1K36O8k89j35K98
2325F1K07k81k32K34K31j61k22Q2J68K4j07j34O3J82J9k48q1K84J27k71j68K38
$$ plain form
2172 -78 -279 24 349 30 -369 -78 355 90 -289 -125 209 131 -95 -125 -35 112 150 -74 -246 40 301 14
2194 14 -325 -36 321 85 -263 -99 188 115 -81 -120 -25 122 147 -108 -252 82 320 -49 -345 6 350 35
2216 35 -304 -76 222 130 -128 -164 19 178 109 -185 -198 177 303 -165 -358 110 372 -53 -370 -14 315 94
2238 94 -228 -154 120 223 -6 -252 -118 270 214 -271 -298 230 346 -194 -374 113 348 -27 -308 -68 226
2259 226 162 -148 -235 36 297 62 -331 -150 329 237 -309 -271 269 312 -178 -283 69 266 33 -213 -139 146
2281 146 230 -79 -302 -3 345 63 -352 -141 324 180 -268 -213 187 224 -88 -219 -18 177 112 -140 -212 90
2303 90 266 -43 -302 -27 301 65 -287 -110 212 134 -151 -142 56 156 29 -148 -117 119 187 -102 -237 61
2325 61 268 -13 -245 -11 220 59 -163 -81 87 111 4 -130 -67 115 134 -114 -195 89 216 -55 -223 15
2347A5J82j85j75J04J62j2j10r9P5J78k0k52k2K72Q4k87j19K72J39k08j62J28
2369d0J69l7j47p2J21J71r7k43M0L10ol14n6L20R4k78j45K28J54j16j74NJ87R7
2393A71j74j99J57K71j10l30O9L39ol24o2K80J12j86j70R6J89K1k26j06K22J96
2415B30k16k72J97L00j30l18P4L02lk58p6J88J50j12j96K3K30O8k68j21K54J87
2437B33k31k31J87K49j16k46M1J95M3j51j11R6J94l9k34l0K54R0k45j45K13J73
2459A89j70j88J13J76l7j57m3J37J00q0j64K6K10J7k35l9K24P1j87j05J46J22
2481A26r1j17J7J19O4j05j17O3J78m9k04J1K09J4j87m5J50P7j09r6M1J03L0r9
2505a7j05J00J48p7j90O5J99k2j94j8J66O1j32p8O1J07Kj20p1J38J24j26j63R5
$$ plain form
2347 15 197 12 -163 -59 103 91 -19 -118 -43 135 115 -137 -159 113 197 -90 -209 63 202 -6 -168 -40
2369 -40 129 92 -55 -127 -6 165 68 -175 -135 175 169 -145 -201 119 213 -65 -210 18 172 56 -118 -113 74 171
2393 171 -3 -202 -45 226 116 -214 -145 194 188 -136 -198 82 194 8 -162 -66 123 144 -82 -188 34 230
2415 230 14 -258 -61 239 109 -209 -135 167 164 -94 -170 18 168 56 -140 -117 113 181 -87 -208 46 233
2437 233 2 -229 -42 207 91 -155 -114 81 124 -27 -138 -42 152 113 -121 -151 103 193 -52 -197 16 189
2459 189 19 -169 -56 120 83 -74 -117 20 120 40 -124 -98 112 129 -106 -145 79 150 -37 -142 4 126
2481 126 35 -82 -65 54 118 13 -104 -41 137 88 -116 -105 104 118 -69 -114 36 113 4 -92 -51 52 82 -17
2505 -17 -122 -22 126 49 -141 -76 123 101 -93 -111 55 116 -16 -94 -33 74 76 -44 -115 23 147 21 -142 -47
2529d7J96p6j96M1J73K9j79n5J21R3m8j54J5J55O5j78j10J69J53j44j83J09J80
2552A29n9j79J1J45O0j11j02O2J49Nj96m3J93R7j95j32J78J46j23j70P5J52Jj44
2576e1o6J22J12p8j71N6J93kk03l6J93Q7k01q6J27J19p3j35K1J23M7j17r9P9J65
2601A26o5j79L8J83%j80l9J66O3j18q2O3Q9Lj10m5J09J06j09j33O7J54l6j69K5
2626g3J46J7j27n1R7N9l6r2oJ08N0j09q9R5J29q6j32N5J34k1j24j2R9L6n0o5P
2653d1R7K3j17n5J14R7j09j07O8J26n1j21J6R2K8p0o1L3J00Qj24l8J34P0j44r2
2679a24J22J06p3j31O1J07rq4m8P5P9m5j16J6J46K0j62n7J54P7j23r2Q0J12n0
2704D1j09J5R4L3p9r3O7J28l9j56J4J60K0j49n5J43N5j03q2N2J09Mj16n4J23Q6
$$ plain form
2529 -47 149 73 -123 -82 91 120 -59 -114 7 100 52 -102 -87 68 133 -45 -155 14 167 23 -160 -51 129
2552 129 70 -109 -98 47 107 -4 -106 -44 105 110 -86 -129 64 161 -34 -166 12 158 35 -135 -60 92 93 -51
2576 -51 -117 5 117 39 -132 -76 117 115 -88 -124 69 156 -45 -131 -4 115 42 -93 -72 51 98 -19 -118 -39 126
2601 126 61 -118 -80 103 103 -77 -116 50 113 -5 -87 -24 65 68 -42 -87 22 128 19 -114 -47 107 71 -98 -73
2626 -73 73 90 -37 -88 9 68 32 -60 -66 42 92 -17 -106 -11 118 32 -100 -45 89 68 -56 -68 31 67 17 -48 -41
2653 -41 56 79 -38 -93 21 118 9 -98 -30 96 45 -76 -60 32 60 -10 -71 -38 62 70 -54 -92 42 112 -32 -124
2679 -124 -2 104 31 -100 -39 68 59 -25 -73 2 81 36 -80 -64 82 102 -60 -117 37 114 -9 -101 -21 91 41
2704 41 -68 -53 41 74 -5 -98 -31 97 58 -98 -84 76 96 -53 -108 35 90 -13 -95 -43 66 70 -46 -100 23 109
2730A09r0j28P8J39m9j59K4J51J0j20n3R7P7o1q3%J07M1j14q1J17R6q4j21O4J21
2756H8l4j29K0J05K2r0m7N3P6j1j02l4J19N8j09q2J07Q9p5r5M1R5qq4j5M6O0l4
2784C0r3J6R9L3j16n7J13N8q7o5O7O9k8q9RO1M0n4o3K9Q8rj05k6J24L5j05m6Q3
2813A1O4o6o4J4P6K0m8o4M7Q1k8j09J3J15J2j26k0R3M9p4o0L2P8Jp8l7P3P7o6
2842A6j06M7J22j9j38J4J15K7j13m4R1N2m1q3J0P8M7r3p3Q7J14q1j22M6J36l8
2868E1j22J1J02L9q7n6L8R8k1j01l5J19N5j01r7R8J07q3j07N9R6pr4k2Q2N2n3
2895B1q4J4J12Mj15k7J13P2j27q0R5J00p9p7J6Q3J9p6n3O7O7k0j15J1J13J1j09
2922d4k7J01M6q1n9M8P2k7n8l0P8M5n2p2J8J12k3j01j1J12K5j00k4O5M2l9n3J1
$$ plain form
2730 109 19 -109 -31 108 59 -100 -76 75 85 -35 -88 9 86 25 -58 -58 49 90 -24 -105 12 108 24 -97 -33 88
2756 88 54 -75 -55 50 72 -18 -65 -12 64 53 -49 -83 36 94 -15 -97 10 99 24 -71 -30 65 57 -27 -42 4 64 30
2784 30 -63 -47 52 85 -31 -88 25 83 -4 -69 -2 67 39 -50 -41 20 60 6 -57 -28 60 51 -54 -80 44 79 -26 -72 11
2813 11 75 9 -55 -41 35 55 7 -57 -10 71 43 -66 -53 62 74 -52 -72 21 70 -4 -64 -32 46 47 -31 -68 5 82 16
2842 16 -90 -43 79 60 -78 -64 51 78 -35 -79 12 64 23 -60 -50 28 75 -18 -91 -4 110 29 -93 -47 89 51
2868 51 -71 -60 42 81 -6 -62 -24 74 53 -48 -83 36 91 -10 -107 -9 98 15 -92 -33 63 56 -38 -60 22 74 21
2895 21 -63 -49 63 67 -48 -75 38 110 -17 -97 -2 98 19 -58 -42 41 60 -16 -69 -2 65 45 -70 -59 54 65 -44
2922 -44 -71 30 76 -5 -64 -16 56 29 -29 -59 19 64 12 -60 -42 70 47 -54 -65 47 72 -28 -52 13 55 16 -37 -26
2950b6M0M0n2p1O1P8l6r4PJ07%r6j3O9M7n0o0L4N2J7o7n5P4N3n1p8M9R7l3r4O
2981d5Q3J1o2k9K8N7j3o6k4Q4N5q2p6P1R4n2j06M2Q5j2p3k8N9O3m3q1J4R6J2r5
3011c3n2J13N3q8q0O8J02n4q1LQ1L6p9n5M9Q7k4j09j2J29K3j20m6J12N8p7p9N8
3039a7Q4k3q6k1Q6N1o6q1M7J00j9j20NJ07L2j12m2Q6M7m8p5K6P9J2o1m4O4P6o4
3068B3r9L2J14k4r1j9R8L4p7n1N1O0j9p9j0P7M1o4q0O5Q5l6j12L6R4Nq8rN0L8
3098D5l3p0K2P7ko2m4P6O4o7o6L9P3j8p9RO4K0m2m3K1M9Rp4k1P7L9p1o4O1P3m2
3130B0p5K5O1J2n7l4L1P5k8r0NR0K5q8m5Q1N8o0p2M7O0Jo8j6O1L8m0p3K6R0lj09
3162e2j4J13K0q6m5P0N7l9q0J2O6L0o5n9O1P7l5q6OJ07Qj14j7R8L5q0n3N2N8l
$$ plain form
2950 -26 14 54 2 -69 -8 70 34 -60 -53 54 54 -42 -55 14 61 11 -49 -15 37 54 -13 -68 6 59 8 -70 -21 76 43 -51 -45
2981 -45 38 49 -13 -42 -14 43 30 -36 -60 24 79 -3 -79 -8 86 34 -72 -30 55 43 -30 -58 1 64 21 -60 -46 50 62 -33
3011 -33 -85 28 81 -7 -87 -19 83 29 -52 -49 32 68 -11 -66 -17 70 46 -63 -75 54 77 -43 -89 23 81 4 -75 -17
3039 -17 67 44 -42 -63 23 74 8 -73 -26 74 55 -65 -60 47 79 -33 -75 11 58 10 -65 -39 40 52 -9 -53 11 87 23
3068 23 -76 -44 70 46 -45 -64 34 68 -9 -60 -9 51 32 -47 -57 20 61 -3 -83 -18 67 31 -81 -45 49 54 -34 -43 7 45
3098 45 12 -58 -36 41 39 -23 -67 9 73 6 -60 -21 52 34 -45 -36 28 48 6 -37 -16 33 42 -32 -53 24 63 -8 -72 -11 62 20
3130 20 -55 -30 31 43 -14 -48 -17 58 30 -60 -55 35 60 -28 -73 8 66 6 -66 -19 41 42 -26 -42 19 57 17 -56 -30 60 57 -52
3162 -52 -66 47 67 -19 -64 6 63 24 -56 -44 22 52 -13 -72 -11 66 31 -55 -49 58 66 -48 -65 33 68 -12 -65 -13 45 42
3192D2p1k0P6M0o2p7M6J04m8r0J0J02J3q8l9O8N8n6o6J3R6J3r1k9N8O3o2q4M5
3221c6J00j6r6LP3K5o2m9M1O0j5p2pQ6L7q2p0Q3P4o1q3L5Q7j4o8j4N6L1l2o0j
3252d7Q7J4q6l7Q6O1q1o2M2P2k6p5J9N9K3n6m5L3P1j1q6oQ0L5q2m1O4N5m7n3J4
3283b6O2Ln1l6L8N8k3q7J7Q8oq3j4P4L8o4m2L3N9Lq7j4O5N2o1o8M8Q4k8q7LQ9
3315C7K7r3l3N9O3m4n5pP7K1p1m0O3N4l7q3K1J00j0r3j5Q7K9p0m0L3N9j0o3l1
3345f5P8N0p4p4P2Q8n4q5K6Q6lp2k9O4M8k9q1J1R3Lq3l1P2O3o3r5P6P6m1p2kO7
3377B0L0o1n2M4O8j8q6pR2K5p7n4P5N6n1n5J8P5Ko8k2N2M3l1p2J8Q6lq3j7O6M9
3409F2p2m9M3O5j7p4kO4L1o4m3L6P6k5p8MP9K2q6k6N5M9m1o5K0P3Kn1m1M4P1m3
$$ plain form
3192 42 -29 -49 27 67 5 -72 -26 78 30 -60 -50 52 65 -23 -62 6 64 8 -58 -45 51 64 -27 -56 2 65 3 -81 -36
3221 -36 64 48 -48 -45 28 53 -9 -58 -17 43 28 -44 -51 35 72 -10 -80 3 77 16 -67 -32 55 41 -27 -41 15 46 14 -46 -47
3252 -47 40 54 -32 -69 17 78 -3 -65 -23 49 23 -52 -33 26 49 -7 -52 -19 52 41 -45 -51 29 64 -18 -59 5 60 13 -40 -26
3283 -26 36 39 -12 -48 -10 48 25 -62 -45 43 37 -46 -60 14 52 -12 -54 -21 38 41 -46 -60 5 57 -4 -72 -24 60 32 -55 -52 37
3315 37 64 -29 -62 -3 60 16 -39 -46 31 52 -19 -59 4 58 21 -62 -41 59 49 -44 -59 28 57 -13 -53 -20 39 29 -34 -65
3345 -65 13 63 -11 -85 -13 75 21 -64 -38 48 45 -27 -56 8 56 27 -54 -43 50 53 -30 -61 11 74 11 -84 -8 68 27 -45 -47 20
3377 20 50 -11 -63 -19 49 31 -55 -62 30 55 -22 -76 -1 55 4 -51 -33 42 44 -24 -46 6 49 18 -54 -36 50 47 -36 -53 13 62
3409 62 -10 -59 -16 49 32 -42 -44 20 51 -13 -56 -20 56 31 -47 -43 36 58 -28 -54 1 50 9 -56 -36 37 39 -12 -53 -9 62 19
3441A9p7K2Q3Kr4rP2M4o4n4L5Q0k5o7j0O2M6o9n6M2Q0l3q6J2Q1Ro1m1M8N6l3o6
3473e2J3P9J4p9l9P3N7n7p4M3P2rp5j5O8L3m9n8M2O1k2p1qP9M3o9o2N8P0l5q5
3504e4J6P8J3q1l5P0N3m1q1J9R0%r0k0P1O1o2p8M1P7lq3oO2M1o3n5M0R1m1p5m
3536d9P9K8q1m2O7N7m4o1J0P2no1l3O3O1m5p3K7P6j2o9j1O2L1n9m4L8O1j4o9j0
3567e0Q1J0m9n3M9P0j8p7PP0J1o6m7O8M4l4o4J4P7Ko4l5N9N4n2o4L4P1j0o7k3
3598e2P5L0n5m7K7P6j9o7j8P3L1n9n4N5P1m4o9J3O8J3o1m2N2N2j7p7QP4K3q1l7
3629e8P2M5n4o4M1O0kp0j4N8L5n3o0M5O3mp1j2P3K2n6n4M8P1l5p8J1P4Rn4m9N9
3661bP1m5p8J2R0mq3k1Q1L6n0o6M3O3j3o8j6P1L2o3n3M0Q0k4p1oQ1K1o8m0N1N4
$$ plain form
3441 19 -58 -36 47 49 -45 -54 18 62 -2 -56 -21 59 34 -33 -43 19 65 -4 -60 -18 62 29 -57 -45 36 45 -16 -57 -9 47 14 -52
3473 -52 -39 40 54 -25 -64 9 66 9 -65 -22 50 41 -34 -49 19 52 3 -55 -13 48 26 -45 -53 26 69 0 -62 -4 66 31 -54
3504 -54 -38 40 53 -28 -63 7 60 19 -62 -43 47 47 -43 -63 8 69 7 -71 -30 47 44 -39 -45 17 58 -5 -60 -20 71 30 -45 -49
3536 -49 30 58 -23 -65 2 59 15 -46 -36 36 31 -30 -63 0 61 16 -57 -30 46 34 -35 -46 16 47 -12 -56 -18 43 29 -40 -50
3567 -50 31 41 -8 -61 -12 58 40 -37 -30 40 51 -15 -62 6 50 16 -48 -34 43 45 -19 -54 5 59 7 -57 -23 48 38 -29 -52
3598 -52 23 53 -2 -49 -22 54 35 -32 -50 23 54 -5 -59 -4 67 23 -46 -33 35 48 -13 -55 -3 49 32 -45 -37 37 60 -21 -58
3629 -58 14 59 5 -59 -18 42 40 -30 -44 14 49 -4 -64 -19 44 40 -31 -43 30 52 -4 -58 -10 61 26 -52 -41 33 42 -12 -61 -2
3661 -2 69 24 -54 -42 48 44 -39 -60 21 57 7 -59 -16 47 34 -34 -50 21 53 -10 -63 -23 57 33 -38 -44 37 58 -10 -50 1 55
3693E5l1p2K0O6J5o1m4N6N7m8o8L0P0np4pM3M9m5n4K0O8qo0rO4L3m9p3O1N6j6
3725C9q8PP3J8o0l7N7N1k7o6kP6J9p4m6P1M5l5p3K5P4oo9j4N3L5l9n7K3P6j8p3
3757d2j1O9M3o1n0L3O5j3p8kP9J0o7l4N8N6l5o3J3P5J0p1k8O1M0l9o1K2Q4j4p5
3788b6j3N5N6o6n6K2O6kp3qP2L2p6m3N0O1k3o9OO2J6o3l9N8M9k3q1K2O8J3o8l5
3820e6N5N4m4o1K5Q4j2p8k2P4L3m2o3K5Q8k2o8j1O1K8n7n6N1O2k4o9jO8K6o6l6
3851e4N7M6l5p4L3O1Rp0k3O4M1l5o8K3P5qp5nN7L2m9n0L8O0j7o9qO1K9o0m2N4
3883bM8j2p0rQ2J0o1m9O2N6m0o7K2P1Oq4pM8M9m5n7K6O7oo1j8N8L1m8m8M0O4k4
3916C2o1j9O1K5m6m1L8N4k9o3JO5L1o9k9N0N3l2o5MQ0Jo3k4O2M1n3n3L0O7j0p4
$$ plain form
3693 55 24 -48 -28 38 53 -8 -52 4 61 13 -55 -25 45 40 -34 -41 2 51 6 -48 -28 40 32 -28 -37 27 60 11 -62 -1 55 39
3725 39 -49 -42 31 49 -11 -48 9 60 33 -33 -35 41 60 -14 -60 11 56 21 -52 -27 47 41 -28 -42 11 46 7 -50 -27 49 31 -42
3757 -42 -53 16 59 -2 -52 -19 46 33 -45 -47 32 42 -25 -59 -1 55 20 -43 -30 45 55 -16 -44 17 57 18 -43 -21 63 49 -26
3788 -26 -39 16 72 6 -50 -28 38 36 -37 -45 27 59 -17 -60 -10 51 28 -41 -35 27 43 -20 -59 -1 48 25 -56 -34 34 47 -21 -56
3820 -56 -1 53 9 -52 -27 57 45 -33 -55 19 52 10 -53 -28 60 38 -30 -41 20 48 -9 -65 -14 48 24 -45 -46 22 48 -18 -54
3851 -54 3 49 14 -60 -27 34 43 -27 -50 14 55 20 -48 -25 50 42 -33 -38 19 51 2 -48 -10 50 33 -36 -44 17 46 -14 -56 -2
3883 -2 46 34 -36 -45 37 47 -14 -63 -1 55 15 -52 -30 41 47 -37 -44 4 53 8 -49 -23 44 38 -23 -41 17 48 0 -48 -8 56 32
3916 32 -29 -48 13 38 -8 -49 -11 43 14 -49 -48 17 48 -21 -50 0 53 21 -44 -40 40 41 -22 -46 16 57 4 -49 -19 48 38 -36
3948c6pO5K6m7n6M9N2j9o3nN7K8o0m0N2O0m2o3J0P7on5l7N1N5m5n0J9O1No6j8
3980d8P0K1l0o7L4O0j0o3ON3K3m8m2K8O9m0m9j2O9J6n3l3L6N7k9n8PN3J7o4k3
4011e0M3N0m0n9K3N3Ro2j5N2M8m3n2K4N6Jo2k2O3L3n0n4M1N6k6o2kO6K2o6k8L2
4043b1N4k7n3NP1J3o9l3N4M7l6n7K3N9%m9k4N2L4m2m5L1N9np0j5O8K2n3m2K9N7
4075C7j6n7kO2K1n0m0L9M8k2o5MO8J5o6l5N5M7l9n3K9N4jo0j7N6L1m0n5L0P2j3
4107C7o7nM4L8n6m0M5N5l9n8J3O8Mm9l7M9M9l4o7J4P1j1n7k4M8M8n0m6K7O6po7
4139c8k0P2K4l5m8L1O3j8o9%O0J8l9l6L5M7l2n4PO1Nn3k6M7M3k9o5J2O8nn3j5
4171d2M9K6l0m4K2L8Mm4k8N6K5l5n3L4N9k2o1ON8J9m3m3M7N5l8n4PO0J1n1l2L6
$$ plain form
3948 -36 -43 22 48 1 -55 -6 46 27 -36 -41 16 44 -16 -56 -4 56 14 -49 -39 38 32 -23 -60 -9 46 1 -49 -30 31 36 -30 -48
3980 -48 22 43 13 -54 -20 40 30 -33 -27 26 49 1 -41 -13 56 16 -33 -45 24 40 -13 -46 -10 47 18 -40 -33 20 37 -27 -50
4011 -50 -7 43 3 -56 -33 20 29 -33 -48 4 52 9 -43 -19 37 38 -24 -46 17 50 0 -54 -13 43 17 -45 -47 19 41 -25 -53 -21
4043 -21 33 6 -47 -42 29 42 -27 -60 -6 41 5 -52 -29 30 30 -19 -43 9 43 1 -44 -13 46 41 -29 -44 24 46 -7 -49 -20 37
4075 37 21 -36 -38 24 45 -5 -45 -6 42 20 -45 -41 27 42 -24 -59 -4 43 4 -49 -20 34 33 -27 -44 12 43 3 -52 -22 50 37
4107 37 -30 -35 9 47 -9 -49 -4 51 12 -46 -33 35 39 -10 -47 2 51 17 -50 -36 35 24 -33 -57 -9 39 -11 -57 -30 36 29 -38
4139 -38 -58 14 38 3 -45 -14 49 31 -38 -38 22 40 1 -35 0 47 15 -39 -32 29 34 -19 -45 2 45 16 -49 -37 31 26 -27 -42
4171 -42 7 33 3 -41 -19 19 23 -21 -49 7 32 -3 -56 -22 37 15 -46 -40 18 37 -6 -49 -2 53 15 -39 -32 28 39 -12 -44 -8
4203hN5l4n4RO5%n9j8L1N1m1m3J8N6jo2qN8L5n3m5L8L9j1n3KO2J4n2l7L3N5k8
4236A4m6NN3J5n6k6M6L2k0n0MO1J0o7j2M8L3l7m4K4M5nm5k2N2K1l9l2K8M3qn7
4268c2jN7J9m3m1M6L9k6m2rO2J1n5j4M2L2l5m2J1N7lo0oL7M0m9m6K9M8ln2j2M9
4301HJ9m3l1K6M8Lo7pP2J0m8k4K7M6k3n1LO2Pm7k9M4M4l1m6KM4Pm7j4M0M1n2m1
4335d8K7M5mm0k5M9L4m3k9OO7k4m6lN6J9m2m5L7M4k0l9%L6J1l4k9M2L8j8n1J1
4367a8N1Mn2l0N1L2l6l8J3L9Mn2j5N7K6l3m6L3M9k0o2J7M1K6m6k7K5L7pn7NO1
4399C2Qn2k0M0L3l0m4J0O3j2l7k4M8K3k7m4K1M3j0m7j3M8L2n2l3K6N3j8m0rM6
4430A4Rm3j4K4L8j8m3J2M2Rn2j2L4L2k7l9J6M4ql8j0L8K8m2k8NN7j0m8pL7K9l5
$$ plain form
4203 -8 47 13 -41 -32 33 33 -26 -44 -13 38 -3 -46 -28 28 27 -35 -43 15 50 -3 -48 -10 29 18 -35 -33 29 43 -9 -46 -13 42 14
4236 14 -32 -27 26 41 -15 -41 5 37 17 -33 -29 32 42 -25 -37 11 44 7 -37 -13 32 27 -18 -40 12 33 -6 -38 -10 33 25 -32
4268 -32 -33 24 43 0 -41 5 44 18 -24 -33 29 40 -15 -29 13 45 10 -32 -21 36 33 -27 -33 4 44 -5 -51 -22 26 23 -29 -41 8
4301 8 27 -16 -47 -21 27 30 -37 -44 28 38 -10 -34 -7 39 16 -35 -32 30 37 -10 -39 5 49 18 -28 -26 18 25 -22 -36 4 45 -7 -48
4335 -48 -21 24 20 -20 -45 4 38 -5 -34 -28 39 15 -31 -34 22 41 -1 -46 -9 35 15 -24 -24 12 23 -11 -40 2 40 22 -29 -18
4367 -18 33 37 -15 -45 6 38 2 -36 -23 16 20 -32 -47 10 36 3 -43 -10 39 19 -43 -26 15 41 -5 -32 -7 30 23 -34 -29 32
4399 32 40 -12 -32 8 41 11 -33 -23 40 28 -9 -33 15 38 11 -33 -12 31 21 -26 -39 9 41 -11 -44 -18 35 17 -23 -32 14
4430 14 23 -20 -34 -10 28 10 -33 -21 21 30 -22 -34 0 32 5 -34 -18 26 18 -20 -30 8 36 -6 -34 -29 28 18 -30 -37 0 29 -6
4463fl7L1M2j9l3nM2Mk0m2L6L7k1l2mM5J1m5k8N5K4k1m2J6K8%l9j7N0K4l8k5J1
4496a8M9nn4PK4K5l8k2MM6j0l9kN0Ol4l2K7L1km0MM7Lm7pL0M2l2m3J5L9Ln0%L0
4532GJ8k7k8J6L3Nm5mM1J5k7m2K8L0j0l1qM4K1m8j6K3M3k9l3MM2Ol6k6M4K3k2
4565A1m0K0L8km3j4M3K5l9j7NM2j6l7pL3L0m1k6K6M5j8m5QL3J2m3k0L1K7k2m0
4597d1K4L2J2m3qL2K8k7k7%M4Km8nL6J5l3j9K0K9lm2ML7Kl1k7L3K2ml4jL9J3l7
4632fk1K2K7j9m5K7K5J5m6j3M2J2j5l8K2K3J3m4oM2lrk8K1K5pk2j9M4Ql1l6L0
4665a0L4k5k7QL3Pk5k3K6K4k5k5LL5J1l8k1L4K9k0k8kM8j3m4OK9K3j9k2PL5nl5
4699a5j1L6J8l4k7K4K9j2m3J4M2Nl6k8L4J4j0l6J6K8J5n4nL7L0l0l0J7L6j2l5
$$ plain form
4463 -6 -43 -12 30 11 -22 -27 15 19 -1 -43 -7 30 9 -23 -27 18 29 -16 -44 11 35 14 -28 -12 16 16 -23 -40 10 34 -4 -29 -18
4496 -18 31 26 -28 -21 3 28 -10 -32 -28 18 8 -31 -33 17 23 -11 -43 -16 15 13 -27 -23 24 27 -20 -27 3 45 13 -30 -15 24 27 -23 -23 7
4532 7 25 -2 -30 -14 19 24 -21 -25 16 31 4 -38 -10 20 10 -21 -29 15 36 -12 -28 -5 38 9 -24 -20 22 28 -8 -34 10 33 11
4565 11 -29 -9 29 27 -16 -30 13 38 -1 -18 -13 29 13 -24 -31 2 32 -9 -35 -9 36 18 -27 -19 14 26 -17 -37 -6 21 -1 -41
4597 -41 -17 15 27 -16 -24 8 36 9 -18 -18 26 28 -20 -25 11 26 -7 -26 -6 23 20 -22 -18 19 21 -10 -37 -4 18 14 -20 -21 18 31 -6
4632 -6 -27 -5 22 3 -42 -15 10 25 -21 -34 8 20 5 -33 -11 12 25 -19 -25 17 14 5 -23 -2 23 16 -6 -25 19 27 -4 -40 -10
4665 -10 24 -1 -28 -20 13 20 -5 -28 -2 22 -3 -28 -25 10 21 -17 -38 -4 25 5 -23 -25 23 10 -34 -28 1 24 5 -17 -10 25 20 -15
4699 -15 -26 10 28 -6 -33 -9 20 8 -35 -21 21 26 -10 -38 -4 10 0 -36 -20 8 23 -31 -36 1 31 1 -29 -12 24 12 -23
4730b3KK7J8k3k4RL9ql6pL3J7l4j7L3J5j7l1J4K2jj9k3L1J9j8j4OJ7rj4qL0K4
4764C0k9k7J8J9Mk3pK7Pk4j3J7K5j8l1NM3ml0j3K8K5k8j8jL2oj8j7J6K0ll4J2
4798a6K8Nl4ONJ9j6k5K1J6Jk5j1L1J3j7k2K7J5mk3pK7J2m1MRK2nk9qL6J1k4k0
4833a9K4J5j5l0J3J8Ok0j5L4J4k6k8J6K1Lk6j0L5J3k3k0J5K4j1j8%K5Lj9j7J4
4865dK5rk2jK9Pk5k2L2J4j3l1MK8Jm1LK4J8j6k5J0K8ll3KL3Mj7k2K4J7rk2mK6
4901A0J2j5k6K5Qjl1RK2kk4j1J9K0j4j7J6O%k3JJ1J6j7j3OK8ql5J6J4Nj0k0J5
4936hJ5oj2nK3J1k7j0K8Oj0j9QJ9%k4nJ6J4qj9lK6lj0j5K2Pk2qJ5ONk0JJ3Kkk0
4975a9J2J2Nj8oK2J2k1l0K9J9j0k0J2J5Jk1j0QL1j6k4NK1jk1mJ5J3j5j0lL6j9
$$ plain form
4730 -23 -21 6 24 1 -23 -14 25 17 -19 -26 7 24 -10 -27 6 21 4 -27 -13 9 8 -11 -34 -3 16 -2 -16 -10 7 -2 -16 -24 6 30
4764 30 1 -26 -8 11 15 -8 -15 12 19 -5 -18 -1 24 6 -25 -20 23 19 -11 -24 4 29 1 -17 -18 14 8 -10 -27 -11 9 6 -28 -16
4798 -16 12 17 -17 -11 -6 13 -3 -28 -7 9 10 -15 -26 5 18 1 -21 6 21 17 -6 -13 14 26 -15 -11 -2 20 15 -14 -22 14 25 1 -19
4833 -19 5 20 5 -25 -12 6 12 -8 -23 11 25 -1 -29 -13 8 11 -15 -25 10 23 0 -20 -5 19 8 -10 -10 15 18 -1 -18 -4
4865 -4 21 12 -10 -11 18 25 0 -22 10 24 11 -20 -16 12 13 -28 -25 -1 17 1 -24 -14 14 11 -22 -20 13 17 0 -22 2 19 10 -12 -16 10
4901 10 22 7 -19 6 14 13 -18 -9 13 11 -13 -24 -5 15 1 -16 0 6 6 -17 -16 -5 11 -6 -19 -13 15 7 -28 -12 2 7 -3 -23 -8
4936 -8 7 1 -11 -16 7 18 -9 -19 9 15 5 -14 -6 13 13 -11 -16 0 14 6 -13 -16 10 7 -3 -18 4 11 -11 -19 -4 2 7 -13 -12 1 3 1 -19
4975 -19 -7 5 10 -8 -14 8 20 -1 -31 -2 17 7 -13 -1 14 15 -6 -16 -8 23 7 -17 -12 9 8 -13 -17 -2 11 -4 -14 -17 19 0
5009@k3KK5Pj7rMK0lk1mL4jrk4L1Nj8j6J1J9mj1j2K4Orl0J5J9Jk7jK7Oj8k2K3
5047@kNk5LJ7Nqk1K1K1k0j1mK7J4k5j2K3Rj2j3KNJ5k1PLPj0j2OJ5j3j6J0QJ5k0
5085gKmRNk5J1J7Ok9j1J6K1rk0jK4Lj5pJ1J2mqoJ3Lj1j6K5KoqKJ3Mk1MKJ5j8q
5126a4QMJ5k6nK2%nk2J2J4Nj8%J2Mj4j0J2J6oj8J0KRj3k1L5J2j8k2K1Ojj0qJ3
5163AOrj1KK3nj5j2J4J1k0j4J7J1%k2J2J8Kj3rJ5J0Ll1NL3j5qj8K3Jj4mNK5qk3
5201a4kK4J0k2nJ0Qrk2QJ5Loj6J6Lj4qJ0J1Kj0qPJ5ql1L2P%j1J0oJ3nj7PJ5Ok8
5241a0OJ1Lok2K4Mj4j3PJ3Jj2nJ3nkj2PJ2jonJ5Rj2j8K2rMnMnJ3Lk1J4J4j0j1
5281eMPMoj7J0J3Mj7lK3j7qmJ0Rmj6jJ2K4m2jJ8J6j3j1J8qPlj8K1JJj7jK4oj6
$$ plain form
5009 0 -23 -21 4 11 -6 -15 -11 9 6 -15 -19 15 14 5 -19 12 17 -1 -17 -6 13 9 -2 -14 10 16 7 -23 -8 11 12 -15 -16 11 17 -1 -23 0
5047 0 -2 3 -22 -19 -2 3 -5 -26 -5 16 -4 -15 -19 8 22 -3 -15 8 17 5 -8 -6 -1 14 -7 0 3 10 0 -12 -6 9 -4 -20 -10 -2 13 -7
5085 -7 -5 -9 0 5 -20 -9 8 14 -15 -26 -10 11 2 -18 -19 5 8 -7 -14 -3 9 5 -3 -9 4 7 -4 -20 5 7 1 -7 -5 8 12 -9 -5 -3 12 -6 -14
5126 -14 -6 -2 13 -13 -18 4 4 -1 -23 -11 3 8 -10 -10 2 6 -8 -18 -6 10 4 -14 -4 -2 7 -6 -27 8 20 2 -20 1 7 6 -4 -12 1
5163 1 7 -2 -13 -11 12 7 -8 -20 -6 5 -15 -29 -12 -1 -1 -23 -11 7 9 -4 -13 2 12 15 -16 -11 22 7 -1 -19 4 5 -9 -13 -8 17 9 -14
5201 -14 -16 8 18 -4 -9 1 9 0 -22 -14 1 4 -2 -18 -2 1 -13 -21 -11 0 2 -8 -16 -9 6 -2 -33 -1 6 6 -5 5 -1 12 7 -10 -3 12 18 -10
5241 -10 -4 7 10 4 -18 6 10 -4 -17 -10 3 4 -8 -13 0 -5 -7 -19 -12 0 -1 -7 -12 3 12 0 -18 4 -5 -1 -6 -2 -7 6 9 -12 2 16 6 -5
5281 -5 -1 6 10 4 -13 -3 10 14 -3 -6 17 0 -8 -12 -2 7 3 -13 -14 -2 22 -20 -21 -3 13 0 -11 7 -1 6 3 -15 6 7 8 -9 -10 14 8 -8
5321hrJ9J1j6j1J4%J8l5J2lJ4j2j1J9JKl2J4J2Kj8JJ3Ljj6NJ5jrkOJ4j4qOJ8q
5360Ek0J5J2Nj6j1NJ9pj8J0KOrlRNj1JjJPk1LJ1Kj4oJ4QoolJ9oj3JJ7Nj4rJ2L
5403CQqoMJ1Jj2qK3j4%rJ1Kj2kM%Qj2OqJ2j6NNMonMNJkqJ0Mj1JJQPj2LKPmoQo
5452AJ4nj4LJ2kj8QkKkoJNlrOMRk2J4ONj5KKJ9jj9Rj1J6qj9J8J3j3j5jL3jj6k
5495bLPjj1jPQj7qJ6J4k9lJ7Oj3k%J9qj5NJJ4kolJ1J0k3OOKj0kJ4mJ%j0QOkk0
5539a1JJ9lj0oJ4Lk0LJ0NokNJj1%kMLjmOOnJNJ6j9%kNoJ1j1RJKlj1kJ1jqmJ3o
5586@j0J0pMOnJkJ2mnkQNj7jQQj2RLj0%MrJ0L%j2LJ7j0kJMLj7JQLJonLM%j1Ol
5635eJj4J9NKj0NkMmKLLkklJ%rJJ3Pj7j2J3nOnOPo%j2MRmj5J3J1j0nj0K1Kj4L
$$ plain form
5321 -8 -17 2 13 -3 -14 0 0 18 -17 -5 -8 6 -6 -17 2 3 5 -27 -13 -1 1 -17 -16 -3 0 -1 -17 -12 3 2 -7 -9 -3 11 -3 -11 -5 13 5
5360 5 -15 0 12 17 1 -10 -5 14 7 -11 -1 1 7 -2 -5 4 9 -2 -1 -2 -1 6 -15 -12 -1 1 -13 -19 -5 3 -3 -9 -12 7 1 -12 -11 6 11 -3 -12 0 3
5403 3 11 3 -3 1 12 13 1 -7 16 2 2 -7 4 6 -6 -8 -4 -4 4 -8 -2 -10 2 -14 -9 -4 0 -6 -11 -7 -2 -1 -3 -11 -1 3 -8 -7 -6 2 9 -3 0 2 9 5 -1 7 1
5452 1 15 10 -4 -1 11 9 -9 -1 -3 -1 -3 -9 -8 -3 -6 -15 -9 -5 4 -18 -4 2 7 -8 -6 -4 15 14 -5 4 -7 9 1 -18 0 13 0 -15 -16 17 16 0 -2
5495 -2 1 8 7 -4 -5 2 10 -7 -15 1 15 -14 -17 0 6 -7 -9 -9 10 2 -13 -8 -7 7 5 -1 -4 7 17 -6 0 6 8 -2 -4 10 6 7 7 -3 5 11 9 -11
5539 -11 -10 9 6 -4 -10 4 7 -13 -10 0 5 -1 -3 2 3 -8 -8 -10 -6 -3 -4 -8 -2 4 -1 0 5 21 2 2 0 5 -1 10 -1 8 9 11 8 -3 -5 6 5 -3 -7 6 0
5586 0 -10 0 -7 -3 3 -2 -1 -3 9 5 0 -2 6 11 -6 -7 1 9 -3 6 9 -1 -1 3 -6 4 7 7 -5 -2 15 5 3 4 8 11 -6 -5 3 6 7 1 -4 -1 3 3 -8 -2 -5
5635 -5 -4 -18 1 6 8 -2 3 1 5 1 3 6 9 7 5 2 3 3 -6 -5 8 15 -2 -14 -1 -6 0 -5 1 8 2 2 -10 -6 3 -1 -16 -3 8 -2 -7 -17 4 6 -8 -5
5681eNKjqKLO%j2QO%jKK0j2k2J2JnKpQQj3nlJ4ljqNQk2jQJ0nJkNlJ1lqLQrKRp
5732Clk%J4qkNJkRpjj1J0Rk2J2%rkJkJ0pkPNpj2LnJ4nnJ0J7rnM%okJR%Lj6MJ5
5781A4Mj1kLJ3k1jJ1pj%j0RJpqJ0J2j2prK0jj7J0J5Qk4qL1j0rOj2J9nqnNJ5Lk8
5823a4J9Oj1mJ2lMpoMKr%J1Kj0q%lJ8oj2OJ0nqOJ0mjMnJ3j3nJ1kJ2j5J%Qql%J9
5869A6j8KOpNlj1%J2Kj6LLjNkOmLl%%lKQqNLqJOJlOJ5k2PQj0pjKlLJ1j2pOMKk
5920B%okPOj4MoJ3poOKqkJ7nkoJ7l%j0J1kqPqKJ2Nk2QJ3pqKJ%pkLJ5j0j6JJ9l
5968CrkNQj8J0jRjj7J2RJj0qJ0J8j4%j1J4Knj7K0jmrLQlokJ5j0jqJ0OnnqK6mr
6013AqPKJj1KjMrJ6j3K0rrJ3nJ8j7qK1j2nLLj%pJ4rrPmOKqJMnJKjJ1j2QqPoJk
$$ plain form
5681 -5 0 2 1 -7 -5 -2 4 4 -8 0 6 6 5 7 27 15 -7 5 6 1 3 -4 4 12 -1 -6 -9 5 2 1 -7 -2 6 -16 -17 -9 1 -4 -3 -5 0 -3 8 5 -3 0 8 -1 1 10 3
5732 3 0 -2 -2 12 4 2 7 8 6 15 8 7 -4 6 15 -7 5 5 -4 -6 -5 -7 3 -4 -6 1 6 -1 -13 -10 -15 -1 -6 -11 -1 16 7 2 6 6 0 -2 -1 8 8 11 -5 -1 14
5781 14 18 7 5 8 21 0 -1 10 3 2 2 -8 1 2 -5 -13 -3 9 -3 -10 -19 1 0 -17 -7 8 16 -8 -16 15 5 -4 2 -10 9 4 -4 -9 -4 11 14 -14
5823 -14 5 11 0 -4 8 5 9 2 -4 0 2 -7 -7 4 6 -4 -12 -12 -15 3 -3 -15 -9 1 -4 -12 -6 4 0 -1 3 -2 11 -2 -7 4 2 14 -1 0 0 8 0 -3 -3 16
5869 16 -2 0 6 -1 4 1 -10 -10 2 4 -12 -9 -6 -7 -2 -4 2 -2 1 -2 -2 -2 -5 -3 5 -3 2 5 -3 -2 4 5 2 8 23 1 8 16 6 -1 -2 0 -3 0 11 -1 -8 -2 2 4 2
5920 2 2 -4 -6 1 7 -7 -3 -9 4 -3 -9 -3 -1 -9 -11 6 1 -1 -7 10 7 7 -3 8 6 -2 5 -3 -1 11 16 -6 2 15 8 0 2 3 3 -4 -6 -3 12 2 -14 -13 6 3
5968 3 -6 -8 -3 5 -13 -3 -4 5 4 -13 -1 8 9 -1 -9 1 19 5 5 -6 8 10 5 -12 8 7 3 -6 -3 5 2 -4 -6 9 -1 -2 -10 0 6 1 -4 -12 14 10 1
6013 1 -7 0 2 3 -8 -6 -7 -3 -12 4 -9 11 2 -7 6 1 19 2 -6 15 3 -2 1 4 3 3 -4 10 1 -8 -1 -5 1 3 -5 -4 0 -5 -4 -2 -3 8 -4 4 -4 3 -3 -2 -4
6062dNnJ0rMONnqJ2kkLkj9J8LjqOnNpj0J0PrmOJjjjLJ1j4pMJ2%j0RJ0k0JLjJ5
6110A4rnMPkLmMjPj9PJ3j0j8J5L%j7J9JOk2jkP%j5J3J0lj6J2J6nj6KMQrnkJ2k
6154DJnOJ1j3j2%K1roj2J8Nj5mR%MqpOQmlQnJ3k6K2o%%LmMPmlLJmRpOkl%Oj3P
6204GJo%NjmqJ4j0jkjPj4J6lj3LRoNnJ1jj1J8jj6J5JoJOnOKroRPJoJNkj7kJ4n
6253Cj9K3kj0j2OJ4KjrmPKq%K1mlj2K1Jj6JJPqJ3j5J3mkj5K0Qmk0NJ3mj2jK3k6
6296gPmJRj0LpJ6jj6LJ6%jj9RJ1lj0J0J8j1j2pJ6MKqqRmjj4K2loj2J5jj4Oj0M
6339hK1nj9OOmojJ7onlJ3Jj7ONLoOoJ8j0pRlNj0J0mLMllLnLqq%OlOjmNQj1%lJ4
6390InqLJ0%j1jQJ2j8J%J4j0oOOJpnOMnJj3J0moPJ5jk7J0J4j2Oj0JLOj3J2oJ5
$$ plain form
6062 -4 1 -4 6 -3 1 7 12 7 -1 11 9 7 10 8 -11 7 10 9 1 7 2 7 0 -10 0 7 -2 -6 0 1 0 -1 -2 1 12 -2 -9 -5 7 7 -3 6 16 -4 -3 0 -1 14
6110 14 5 0 4 11 9 12 8 12 11 18 -1 6 19 9 -9 6 9 9 -8 11 12 18 -4 -5 -7 0 0 -15 -2 8 5 -11 1 17 12 -4 -2 2 10 1 -4 -6 6 4
6154 4 5 0 6 17 4 -8 -8 13 4 -2 -14 4 9 -6 -10 -1 -1 3 -5 -12 -6 2 -2 -5 3 -2 11 -15 7 1 1 1 4 0 4 11 7 4 7 8 4 13 6 12 10 7 7 13 0 7
6204 7 8 2 2 7 6 2 -6 8 -2 -3 -5 -6 1 -13 3 0 -13 -10 -1 -7 -2 -7 4 3 -8 10 9 -7 8 9 3 4 10 5 11 13 4 -2 7 14 15 9 10 15 13 -4 -6 8 3
6253 3 -16 7 5 -5 -17 -11 3 5 4 -5 -9 -2 0 -8 -8 13 9 6 -6 15 16 0 1 2 9 1 14 -1 12 8 6 -9 11 19 15 -5 0 13 9 -3 -4 19 -7
6296 -7 0 -4 -3 6 -4 -1 -8 8 7 -9 -6 10 10 9 -10 -1 10 7 -3 7 25 14 2 -5 11 15 17 9 1 10 6 5 -9 13 10 4 -8 7 6 -8 -2 -12 -8
6339 -8 13 8 -11 -5 1 -3 -9 -10 7 1 -4 -7 6 7 -10 -4 1 4 -2 4 -2 16 6 -1 8 5 10 0 10 6 9 13 10 7 10 5 8 0 -8 -8 -2 -5 1 0 -4 1 9 -2 -2 -5 9
6390 9 4 -4 -1 9 9 -2 -3 5 17 -1 0 0 14 4 -2 4 10 11 4 -1 5 9 4 5 -8 2 -2 -8 -1 14 13 -14 -4 10 -2 4 -6 -5 -2 4 -9 3 -3 12
6434A2j4lJ6rNj1mK2jj2QkRljk0J7Mj0oQn%JOP%j4mJ9j8%jkJ1j5Q%QoplLJ4k0
6479a3mL0pnlMJ0MojKljj4J0J0oj5lK6Kl1J9lJpmMJ0ojj2J1PlkmJ3j2lMklJ1p
6524cJ9k3Pm%MRPj3J0kLj2RJj7QLj0kJ3krj0J5lkJLqPnmRpMnJ4%Lrj2K5lljMQ
6572A7j9mJ4kOjjjPj0j2jJ6jj9J2J4rj1qJ1Rk1RJ1j0kj2PJ6jJj7K2Jjj0J9lj0
6612FrJJ8mnnLQPj4kJ8%l5J0RJrQOj5J3nmJ0oj3R%KKmrK4nrKJ0j0jkJ7pojKNn
6660FJ3k2RRj1kMJo%mPj0%J0koPqlOjlLKJj2OL%PnMQj4PJ0pj0MJ0qJ%mJ1loQj2
6710bQqpJ4Nj7kMll%J1Jj6KkPJ0mj3J7nPpJ7kqj0kJ8lj4LRjj0%J2j0K0l2J3J1
6753HKj8lJ2%j3kK1kkj6LOMPk0J1NlqMJ0Kj1KJ1J1k0oPMj1%OLLoj2RQnj5J3NM
$$ plain form
6434 12 -2 -5 11 2 7 -4 -8 14 13 1 9 7 16 13 12 -8 9 13 3 -3 5 0 0 1 7 14 14 0 -4 15 -3 -3 -4 -6 5 -10 -2 -2 6 0 -7 -10 -7 7 -13
6479 -13 -17 13 6 1 -2 2 12 16 10 9 11 8 7 -7 3 13 7 -8 -11 15 17 -14 5 2 3 -4 -8 -4 6 0 -1 -13 -2 5 2 0 -4 9 -3 -6 -2 -4 -7 4 -3
6524 -3 16 -7 0 -4 -4 0 9 16 3 13 11 14 2 11 12 -5 3 6 -4 -6 7 5 -4 -14 1 -2 -4 -3 0 -8 -1 -6 -10 -1 -8 -4 -9 5 5 8 -1 -13 12 9 6 5 9 17
6572 17 -2 -6 8 6 12 11 10 9 16 6 -6 -7 9 8 -11 1 15 6 -5 -13 -2 7 -14 -5 6 -4 -6 -18 -11 5 4 5 -12 10 11 10 0 19 16 6
6612 6 -3 -2 16 12 7 2 5 13 20 6 4 22 22 -13 -3 6 7 -2 6 12 -3 10 5 1 11 5 -8 1 1 3 5 1 -8 16 11 2 4 14 4 3 1 18 11 5 4 6 11 6
6660 6 19 -3 6 15 4 2 6 7 1 1 -3 4 -6 -6 4 2 -4 3 -5 -8 -2 -3 -6 -3 -1 0 -12 -6 -3 -3 4 -1 3 11 -3 4 14 7 -3 1 11 3 4 4 0 11 8 2 10 -2
6710 -2 6 -2 -9 5 10 -7 -9 -5 -8 -11 -11 0 1 -15 -13 -15 -8 2 -2 -15 2 -3 4 -3 14 12 4 -6 -8 10 7 -7 -4 5 4 -6 -6 6 -4 16 -16 -3 8
6753 8 10 -8 -11 1 1 -12 -14 7 5 3 -13 -10 -4 0 7 -13 -2 3 0 -8 -4 6 8 -3 -1 10 21 1 -5 2 6 -5 -5 1 4 7 1 -11 -2 6 1 -14 -1 4 8
6798HqrNMnPqQj1OkJ1Lk6OPJ2j5MRJlkPOj0KLrNpk%LKj1J1J2qj9PJ1j2j7K6np
6845a0NLOpkpJ1KoQnOJmpJ7njJ%J5k4MJ2qmOlj3NJjRMrj0PJ5j2k4J8Npl%J3rN
6893bpMJ0qO%KNj2mNJ8j6jJ3lnoKJ1rjj1OMkrKK2k1rRJ9rj0j1L2k4PqkPJ4j4m
6938a0J1Rj5mNQmmOK5k3Jjj1J2j2O%Pj0OjjJj0rJ6J5j4pLJ0lj5N%LJQj4J1Nk4
6981a8J1J2k%rOJ3k1J5m%LmNMKrmJnMoNLomRmj1J2Mjj7J3POk4QJ%jkOQLj4PmJ7
7030A5j7KJ1Kj3jKJ1mpOmnlomK2jj6NmJ6j1j6J2J3Kj4MNoJj1K8qjmLJ2j1nQKM
7074A4j0JOj0JLQ%j6J6k4J7Nj2j4QK1k3kLRJk1K0Kmj2KJJ7Kk1J5KJ3k6MJ0KoK
7115DLklqJ5Loj0MQNqloLQllJ6j8LpOpMNOqj1OOj5J6nj%%%kJ6lj0LJ2jlj1Qjk
$$ plain form
6798 8 0 -9 -4 0 -5 2 -6 2 -9 -3 -5 6 9 -17 -11 -4 8 -7 -3 6 7 4 2 9 15 5 7 10 1 6 -1 -3 -3 0 2 -9 2 14 6 -13 -6 5 -7 -24 2 -3 -10
6845 -10 -5 -2 4 -3 -5 -12 -1 1 -5 3 -2 4 5 1 -6 11 6 5 6 6 21 -3 1 13 5 1 7 4 -9 -4 -3 -4 5 9 0 -10 -3 12 0 -24 -6 -1 -8 -11 -11 2 -7 -2
6893 -2 -9 -5 5 -3 3 3 5 10 -2 -6 -1 17 1 0 13 10 5 -1 1 12 3 2 -9 -3 1 -1 -10 -8 14 -7 -16 -7 12 3 -7 -18 14 -10 -3 -11 -13 -6 8 -6 -10
6938 -10 1 10 -5 -9 -4 4 0 -4 2 27 4 5 4 -7 5 -7 -1 -1 6 -4 2 1 0 1 -9 -18 -2 13 -1 -8 -5 5 2 -13 -8 -8 -5 -4 4 -10 1 6 -18
6981 -18 -7 5 3 3 -6 0 13 -8 7 3 3 6 2 7 11 13 4 0 1 -4 0 -6 -1 2 -4 -8 1 -3 -14 -2 2 1 -16 -3 4 10 -14 -6 -5 -5 -6 -8 -2 6 9 -5 2 -2 15
7030 15 -2 0 11 13 0 -1 1 12 8 1 7 3 -2 -5 -11 -15 7 6 -10 -5 -9 7 -4 -20 -8 5 7 -7 -3 2 -4 -3 -14 14 6 5 1 4 16 5 0 8 10 14
7074 14 4 5 11 1 2 5 13 13 -3 13 -11 6 11 -1 -15 -7 14 -9 -11 -8 1 2 -19 1 3 -1 -13 -11 -10 7 9 -12 3 5 18 -8 -4 6 8 2 4
7115 4 7 5 2 -6 9 12 6 -4 0 8 13 5 2 -4 -1 7 4 1 17 -1 2 -5 1 -6 -2 3 9 1 -10 -4 2 -13 3 -2 -3 -3 -3 -3 -5 11 8 -2 1 13 12 9 -2 6 5 3
7165CnJ0njQj0Jkp%OjLj0LJ6j7NJ0j1MMlPnlOlNqqLQJ2j5NMmj0NOLj9J3mM%op
7214a0J2nJj7J6Rj7%jPnlKONnKmPOj1LRRj6rJ7Pj8jQOj0l%%%J1rj0J4J0k7KK4
7259A2j5Lj1J9j0loK0pKj1OQj1NmMJJllLJ7j4kJ0lj7OJ5j1lpRkKnLmMj8J9pkK
7304h%JOkKnjMKlL%KqRkpkJ2MqlNNKj0KlOrJ4oppMNOqjkOjj4KJ3Mj1NKkNmn%J3
7359EJjj0K3k2RnRj3p%K9k2JPoNmOoj0J5onlR%j6J7Nj1j7QK7j1pJ2j0MLKLPj1
7403DJj2J9nj3NORj1jLJj5mPJQj2kRPpj5QlJ3j8J0MqjPOqmP%j1J2Qj3J2MnoJ2
7449IlooJ6Lj4NjLqjnKqMJQKrmJ4l%ok%KnJ3oOpLQMroOQLj1QpRqj6K2o%lJ2qJ
7502DpmJ2j9J1KlmJ0j3OnOKlOKqKLJpjRKJjqJ6noloJ2j4nK7%j5oJ1nMkNNj9Kr
$$ plain form
7165 3 -2 8 3 2 10 0 1 -1 -8 -8 -2 -3 0 -10 -7 9 -8 -3 7 -4 0 4 1 8 3 0 6 3 8 0 -8 -5 3 15 0 5 9 5 -5 0 6 9 -10 3 -1 3 3 -3 -10
7214 -10 2 -3 -2 -19 -3 6 -11 -11 -12 -5 -10 -13 -11 -5 0 -5 -3 -7 0 6 -5 -2 7 16 0 -9 8 15 -3 -4 4 10 0 -3 -3 -3 -3 8 -1 -11 3 13 -14 -12 12
7259 12 -3 0 -11 8 -2 -5 -11 9 2 4 -7 -1 7 -4 1 -3 1 2 3 0 -3 0 17 3 1 11 8 -9 -3 12 1 -2 -9 0 -2 0 -5 -2 -6 -2 -20 -1 -8 -10 -8
7304 -8 -8 -7 -1 -3 -1 -6 -7 -3 -1 -4 -1 -1 1 -7 2 0 -7 -9 3 7 -1 -4 1 6 8 -2 0 -3 3 -6 8 2 -5 -12 -8 -3 3 -5 -6 -8 -2 -3 -17 -15 -2 2 -9 -4 -2 -4 1 -3 -8 -8 5
7359 5 6 5 -5 18 -4 5 0 9 -4 -11 -11 18 -4 -3 4 -2 3 -1 5 -1 -11 4 -2 -7 -10 -1 -1 -17 0 5 -6 -23 -15 12 1 -6 6 -4 0 3 5 8 15 4
7403 4 5 -7 12 7 -6 -1 5 14 3 2 5 6 -9 -13 -6 -5 3 -9 -11 -2 5 -2 -17 -9 -12 1 -17 -7 -3 -11 -12 -5 1 -7 -11 -4 -4 -15 -3 5 -8 4 8 3 -3 9
7449 9 6 0 -6 10 13 -1 4 3 6 -2 -3 -8 -6 -14 -10 -9 -1 1 -8 -12 2 -1 -1 -7 -9 -9 -7 -12 1 -5 1 -6 -3 5 9 0 -6 0 8 11 0 8 1 10 2 -14 8 2 2 -1 11 3 4
7502 4 -3 -7 5 -14 -3 -1 -4 -8 2 -11 -5 -10 -4 -2 -5 1 3 -5 -3 0 1 -6 -7 2 4 5 4 -4 12 7 1 -2 -8 4 -10 -15 12 12 -3 -9 2 -3 1 -1 4 9 -10 -8 -17
7551a7J0jJ2j3NjllpJ8Kj1jLJ4j2LmJ4pJj%J1ooJ0JqqnJ0joKJ5rpkjJ0%mj5J6
7596bmqjJ3p%PJNj2OmRrrOJJ0%kJ2Jmj1RmkPj3J2Lk0QljMrJ1rPplRqQkkPnKL%
7648@oMNnLkJpOLmJJ1j1Okk%qOjOpqRJKmjLJj1RrRnKOJ4k8K0rLj0J6Kl%qjKQn
7701BpJ1Mj9J7k2J8j8jOMNrNj1QjrJPrRj1J3Oj4P%J2lj2NNkLmJ0j1kPOoJ0j2%
7746bOkj2L%NLj2%Qk%LlLP%j3LOj3JJ3nj0J7Lj1mOmOJ1j2QOoljlJ3ppJ0j0lRp
7794b%jj0J0nKjjLLlkj2J6Pj1mRKJjJ1mlQoPnj0nPjMlMnpMJ1mjj0PMj1%JQqpQ
7845fJJKJj5K5j3omJ3Jj2J1PlklJ0j6J2MoOkqKpQKj2MJ2j4QKjPj6MQj5JKNKkj0
7892a2JRllPMlKj5RMQjKojNk%%lKnJ4lj8QO%j8RLlqPJLrQNj0MoJ0mOj1J2kJ0q
$$ plain form
7551 -17 -7 -8 4 -9 -4 -5 -8 -11 -18 0 2 -9 -10 -7 7 -5 -2 -6 8 1 2 1 1 12 6 0 10 11 3 -5 -10 0 -1 -7 -5 10 1 -6 -8 -9 1 1 -3 -18 -2
7596 -2 -6 -14 -15 -2 -9 -9 -2 -1 4 -8 -2 -6 3 -6 -15 -9 -8 2 2 0 12 13 9 -2 7 3 1 8 -5 7 10 -10 -2 -5 -6 -2 -11 0 -9 -2 -9 -12 -3 -11 -3 -5 -7 0 -5 -3 0 0
7648 0 -6 -2 3 -2 1 -1 0 -7 -1 2 -2 -1 10 -1 5 3 1 1 -7 -1 -2 4 -3 -11 -2 -1 1 -3 -4 -1 0 -11 -2 -11 -2 -7 -5 1 15 -13 7 -2 1 -9 7 9 6 6 -2 -3 -1 7 2
7701 2 -5 6 10 -9 8 -14 4 -14 -15 -9 -5 0 -9 -4 -15 -7 -8 -17 -16 -9 -18 -9 -20 -7 -1 -15 -8 -8 4 1 -11 -6 -1 -3 0 -4 6 -5 -7 0 6 0 10 -2 -2
7746 -2 4 2 -10 -7 -7 -2 1 -11 -11 -3 -5 -5 -2 -5 -2 5 5 -8 -5 1 -12 -11 2 -3 -13 4 7 -4 -8 -2 -6 0 11 -1 7 13 7 4 3 0 13 6 -1 9 -1 -4 5 -2
7794 -2 -2 -3 -13 -3 -8 -6 -7 -8 -5 -2 -5 -7 -19 -3 4 -7 -11 -2 0 1 0 11 7 4 12 6 13 8 -2 -7 0 -1 3 0 4 -1 -8 -4 7 3 2 -8 -1 3 -8 -8 -7 1 -7 -14 -6
7845 -6 -5 -4 -2 -1 -16 9 -4 -10 -14 -1 0 -12 -1 6 3 1 -2 8 -8 4 8 2 8 6 -2 0 -7 1 3 -9 -5 7 -7 1 3 2 9 -7 -3 5 -10 -9 -7 -2 0 -2 -12
7892 -12 -11 -2 -5 -8 -1 3 0 2 -13 -4 0 8 7 9 3 2 7 5 5 5 2 4 -1 13 10 -8 0 6 6 -12 -3 0 -3 -11 -4 -3 0 -9 -1 4 -6 -2 -8 2 -2 4 -7 5 3 13 5
7943ELPj0JlmJJpkJ0kmjOLj1lJ8rqPqMlJ0qj4J3l%KjLjRkOloOnjJJ2j6PLNqkM
7995BoMJ0j0j1R%j2J4j0J3p%R%okj3PJknJ6knkj%KJnJ4lJk%J0%mj5J5mRj2PrO
8042BqOj0JkpK2j5%LMkPMj4lOq%J4Kj2oJ1J1j1NNpMnMlOqJ%JkKJl%qqJ5Jk%%m
8093a0NnQLqM%jjjmQMPj3lJ0Pj3MJ0KnmoNNjjmPpmJ4j3o%J5j1kMRj7mNJ5pj1J2
8142APj5J0jpJJ0Lj4NQmLlJ%KnjlKopK0kj0JqQPoJljj1J8j0OJ5j3n%loJ8kMj5
$$ plain form
7943 5 8 15 5 6 3 -1 0 1 -6 -8 2 0 -4 -5 1 4 -7 -10 8 -1 -9 -2 -10 -6 -9 1 -7 -21 -8 -11 -11 -9 -10 -7 -8 1 -1 5 2 -4 2 -3 -4 -3 9 -7 0 3 8 0 -2 2
7995 2 -4 0 10 0 -11 -2 -2 -14 0 -10 3 -4 -4 5 5 -1 -3 -16 -9 -8 -10 -15 1 -1 -6 -8 -9 -9 -7 -6 -11 3 0 1 -1 -1 9 9 5 -10 5 1 10 -2 5 -4 2
8042 2 -6 0 -10 -9 -11 -18 4 -11 -11 -8 -4 -6 1 5 -9 -12 -6 -14 -14 0 2 -10 -16 -5 6 -5 0 5 -2 2 -3 1 -2 4 -4 -3 -3 -2 -4 -2 -1 -4 -4 -12 -20 -5 -4 -6 -6 -6 -10
8093 -10 -5 -10 -2 1 -7 -3 -3 -4 -5 -6 -10 -2 2 9 -4 -7 3 10 -3 1 11 13 8 4 -2 3 8 7 6 2 9 2 -2 12 -1 -7 -7 8 -3 -5 -1 8 -9 -13 -8 7 0 -11 1
8142 1 8 -7 3 2 -5 -4 6 9 -5 0 8 4 7 4 5 5 7 2 1 -2 0 -6 -13 7 5 -5 -4 -12 -4 3 -3 -2 -5 -6 -17 1 -9 -3 12 -1 -6 -6 -9 -15 3 1 5 -10
8190a0R
8191a
$$ Imaginary data points
##PAGE= N=2
##DATA TABLE= (X++(I..I)), XYDATA
0@%%%%%%%%%%%%%%%%Nj3J6j6J6j6K4l2L2m0M8m9N7p1P9q8J04j20J34j50J68j85
38i7K07k31K58k90L22l54L90m30M75n25N79o39P03p74Q53r40J038j148J272j415
58g46J581j774K002k280K628l071L661m497N775p985J2842m1773L1599Q3697q5822
73d163n9492N5932N9176m0240l9603P244K9670J7778j1466m8534J343O9077J1395
86D8117q7581j6656R3931K2203r4447k2159Q3524K2403o7069j9491M3051J7601
98B3427j7287j4692j0098J3650L4346j2802n4852J3509O8359j4170p4698J5342
110b9966P2834j5607o4034J5015M9179j2580l0515Q539J0137k734R311m269k5919
123b0609J1913L7849j9423m4080K5876M4223l0513l8849L2698K8956l2057j6153
$$ plain form
0 0 0 0 0 0 0 0 0 0 0 0 0 0 0 0 0 0 5 -8 8 -8 8 -8 16 -16 16 -24 24 -25 32 -39 40 -48 56 -64 70 -80 88 -97
38 -97 110 -121 137 -153 169 -185 205 -225 250 -275 304 -335 368 -406 447 -493 545 -603 669 -746
58 -746 835 -939 1063 -1217 1411 -1660 2001 -2496 3279 -4706 8136 -33637 -2038 81659 -4163
73 -4163 -63655 -7723 51453 11213 -28390 -21146 8524 26302 14836 -33698 -32355 36722 48117
86 48117 -39464 -56120 37811 60014 -34433 -56592 26932 49335 -17734 -37225 5826 23427
98 23427 6140 -8552 -18650 -5000 29346 16544 -38308 -24799 43560 29390 -45308 -29966
110 -29966 42868 27261 -36773 -21758 27421 14841 -15674 -7135 3002 268 9579 5310 -20609
123 -20609 -8696 29153 9730 -34350 -8474 35749 5236 -33613 -915 28041 -4016 -20169
135b0169K8507K432k2372J0273J4331k0334n071K6549m354k8112J2980K4983j9934
148b91j7672K4625P311k6650M672K5936j6635k2870K6936J7913l4169j1847L7206
161A4465N448l5553L70K9154m901j8645P665N219q444R656P394k4347m825L7156
175A9812J436m6467K082N1220m942n0754O394M5114n968l4819L437K0987R64n138
189C358o889j1142J3543K6169j9944l8517K5070M6992k8022n0944K8163N0107
201C7944k4987m4753J8534L5641r205k3793k197J0572J4645K768k6830j5011L7393
214A0721K5067m5096l2148M8853L5894m8098l6289M2553L3633l2588k8578J9037
226g039K1883l158j4474j3472P130K9208n32m2380m765N1640Q629n5985j1008
$$ plain form
135 -20169 8338 10770 -11602 -1329 13002 -7332 -12403 14146 9792 -18320 -5340 19643 -291
148 -291 -17963 6662 13973 -12677 -8005 17931 1296 -21574 5362 23275 -10894 -22741 14465
161 14465 19913 -15640 -15270 13884 8983 -9662 -1997 3222 -5222 4434 11828 -12519 -17344 19812
175 19812 21248 -25219 -23137 28083 23141 -27613 -21219 23895 17927 -16892 -13455 7532 8496 3358
189 3358 -3531 -14673 -1130 25039 5095 -33422 -8352 38640 10618 -40326 -12163 37944
201 37944 12957 -31796 -13262 22379 13174 -10619 -12816 -2244 12401 15169 -11661 -26672 10721
214 10721 35788 -9308 -41456 7397 43291 -4807 -41096 1457 35090 2502 -26076 -7039
226 -7039 14844 11686 -2788 -16260 -9130 20078 19546 -22834 -27599 24041 32670 -23315 -34323
239c4323N5009J2071m8772j2155L8009J1686k3864j1103P843J0628Q397j0489
251B937k3288J0703L5272j1089m3336J1341M6789j1183m5484J0294L9822q445
263A4333l0578N507J8952j514o291l234n928Q391J6524j3497k4361J7955K8798
276B5057k1252k9493K2913K6639k2694k0867K0414J3096j6279m449J0543l830
288b02l859J0662l165j5272R891J7038j5481j5897J9467J2066k1367o224K1103
301H760p03j8733P744J4666j3857r463J8160L802k0027J623J9111o167j5490R284
315a290R467j0679j820J0323o595q398J4812N284k1861j561K6895k143k9209N177
329a1598K8538o991k4825P191J8473n618j0080K412N67K042R058p165j7901J2296
$$ plain form
239 -34323 20686 32757 -16015 -28170 9839 21525 -2339 -13442 -5599 5029 13426 2937
251 2937 -20351 -9648 25624 14535 -28801 -17460 29329 18146 -27338 -17044 22778 14333
263 14333 -16245 -10738 8214 6700 409 -2825 -8753 -362 16162 2665 -21696 -3741 25057
276 25057 3805 -25688 -2775 23864 1170 -19697 717 13813 -2466 -6915 3628 -202
288 -202 -4061 6601 3436 -11836 -1945 15093 -388 -16285 3182 15248 -6119 -12343 8760
301 8760 8057 -10676 -2932 11734 -2123 -11586 6574 10376 -9651 -8028 11083 4916 -10574 -1290
315 -1290 8177 -2502 -4322 6001 -594 -8992 5820 11104 -10757 -12318 14577 12434 -16775 -11598
329 -11598 16940 9949 -14876 -7685 10788 5170 -4910 -2498 -1931 111 9169 2004 -15897 -3601
343c601K4985j6647k9613J9437L1343k0135l0163J8409K6248j4166k0130P695
355f338J2527M18m291r349l723J8166J0910k5824j6585L1354K0412l4001k2251
368b8575L3360K2150k9279k0421K2056J7348j2323j3487J027R253J0726n116k1778
381a5059J325L0956J850l7295m278M0092O041l9092p143L4321P859k6303q307
394a5033J5914Q698m202r081p640R552J8385j0008k7001J0296L2684j0272l4934
407b2642R651L3661q298k9186O051K2137k965j3403q44L971N154N064r480j2852
421a3981J3452J8638j6564k1930J8440K2563j8740k0680J7402J6702j4447j1256
433a0401J0074N170m748P81j037n894O706R552j1742j1395J5588J1276j7886r334
$$ plain form
343 -3601 21384 4737 -24876 -5439 25904 5769 -24394 -5985 20263 6097 -14033 -6338
355 -6338 6189 6607 2316 -7033 -10756 7410 18320 -7504 -24089 7265 27677 -6324 -28575
368 -28575 4785 26935 -2344 -22765 -709 16639 4316 -9171 -8144 1109 11835 6719 -15059
381 -15059 -13734 17222 19072 -18223 -22501 17591 23632 -15460 -22603 11718 19577 -6726 -15033
394 -15033 881 9579 5377 -3704 -11344 -1792 16593 6585 -20416 -10120 22564 12292 -22642
407 -22642 -12991 20670 12372 -16814 -10763 11374 8409 -4994 -5838 -1867 3287 8351 -1129 -13981
421 -13981 -529 18109 1545 -20385 -1945 20618 1878 -18802 -1400 15302 855 -10401
433 -10401 -327 4843 95 876 -161 -6055 651 10203 -1539 -12934 2654 13930 -3956 -13290
447a3290J8445N895j7171j582J4298k940j0097O956N185r917p2J1351m656j0982
461h577Q441Q862j0908n172J1744M55j1023M747Q855r747n708J3942J960j6741
475h870J718J7782m785j6900O782J4166p387r825O477M405m168J666P24p611L332
490b494J2880p409j6991J0950J9478j3368k0131J4206J8884j3218j5997J0366
502b844J1726n828o641O3J184O354M037j2692q554J8252J2001k2262j4130K4182
516D848J4913k3670j4403K0661J2868j5309j0595Q127P949J62n212q779K671J6802
530A1033m62k3396j366K7831K733k9606l819K8559M649k4743n407J8583O112j0708
544go819J952P568O839q258j4761Q769K1066q973k5116Q715K6617p851k5508O293
$$ plain form
447 -13290 5155 11050 -6121 -7703 6595 3655 -6442 514 5699 -4218 -4290 7061 2405 -8577
461 -8577 -136 8726 -2182 -7354 4390 4845 -6178 -1431 7424 -2323 -8031 5911 7871 -8870
475 -8870 -7152 10630 5845 -11055 -4273 9893 2506 -7319 -842 3563 -605 1061 1785 -5826 -2494
490 -2494 10386 2977 -14014 -3064 16414 3046 -17085 -2879 16005 2787 -13210 -2844
502 -2844 8882 3054 -3587 -3524 -2340 4014 8051 -4641 -13195 5057 17058 -5204 -19334 4848
516 4848 19761 -3909 -18312 2349 15217 -92 -10687 -2560 5389 5551 339 -8440 -5769 11033
530 11033 10571 -12825 -14191 13640 16373 -13233 -17052 11507 16156 -8587 -13994 4589 10701 -7
544 -7 -6826 -4874 2694 9533 1275 -13486 -4717 16349 7376 -17740 -9025 17592 9741 -15767 -9474
559i474K1982m034j6512J125R796K225k583n857m338R376J0282j2417j4712J4661
573d80J7210j5762j7694J5514J6300j3841j3293J0824R216o679m688J825K33L299
587A984L573q099o376J2154P893j5026q068J6381O980j6112m931J4273K283j1115
601d206N31P014l049k451M952k156n799O142N622r175m368J0966K233j1336N48
616d532J0317l574q089O402M999q672j495J0022j951j0272M851R297o821p211
630f729P550M248p001p25N234l053k381O541j023r402M517J1442p631j2369R845
645i37J2173j0805j0867J0310Q651q314n787N001K610p24O08m094l526Q784N937
660I020j2908p660J5894Q567j7309q704J6923Q174j4695p139J0801N775n560m358
$$ plain form
559 -9474 12508 8474 -8038 -6913 2883 5108 2525 -3332 -7670 1706 11988 -429 -15141 -480
573 -480 16730 968 -16726 -1212 15088 1247 -12046 -1222 7994 1315 -3373 -1548 -1315 1984
587 1984 5557 -2542 -8918 3236 11129 -3897 -11965 4416 11396 -4716 -9647 4626 6909 -4206
601 -4206 -3675 3339 290 -2161 2791 635 -5164 978 6600 -2575 -6943 4023 6256 -5080 -4532
616 -4532 5785 2211 -5878 524 5523 -3149 -4644 5378 3427 -6845 -1994 7303 482 -6729
630 -6729 821 5069 -1932 -2657 2577 -476 -2857 3684 2661 -6741 -2224 9218 1587 -10782 -937
645 -937 11236 431 -10436 -126 8525 211 -5576 -575 2035 1311 1919 -2175 -5701 3083 9020
660 9020 -3888 -11548 4346 12913 -4396 -13100 3823 11997 -2698 -9837 964 6739 1179 -3179
674c179m48K996O637j759j2406Q16J7115o8k0236n06K1387J053k0494j657J7607
689F858K385j3011l330P193M436p49n703n609O897J1347p881j5842Q433J8655
703A4079q357j9606P578J8660n986j6006L689J1979p93p113k448J921N770L055
717F422q850p341J1327J0544j2954j2407J3479J2849j2812j1941J0938R939q016
730A177p134M264M004m5q50m261j895Q182L987j1354n226J3454N542j4238n013
745i406J3597L837j1644k254Q591N57m805R08P31k061L296K538o654k413R100
760C918J684j0425m36J0449j054r289K652P143m050m334N091J207n552J855N303
775D162m403m386O134K896o865r79O516j163n190L306K996n187k69O546k581p268
$$ plain form
674 -3179 -3627 -631 6006 4247 -8159 -7343 9772 9704 -10532 -11038 10349 11402 -9092 -10749 6858
689 6858 9243 -3768 -7098 95 4531 3782 -1921 -7530 -633 10714 2833 -13009 -4576 14079
703 14079 5722 -13884 -6306 12354 6368 -9638 -5949 6030 5237 -1876 -4324 -2403 3367 6422
717 6422 -2428 -9769 1558 12102 -852 -13259 220 13069 257 -11684 -746 9193 1177
730 1177 -5957 -1693 2311 2266 1416 -2845 -4740 3442 7429 -3925 -9151 4303 9845 -4393 -9406
745 -9406 4191 8028 -3616 -5870 2721 3278 -1527 -619 112 -1949 1347 3885 -2769 -5182 3918
760 3918 5602 -4823 -5259 5190 4136 -5153 -2501 4642 592 -3742 1349 2556 -2996 -1141 4162
775 4162 -241 -4627 1507 4403 -2462 -3441 3075 1912 -3278 28 3024 -2163 -2432 4114 1533 -5735
791e735N110P344p033o723Q026N501p890l816O591J945m262j3J114j775K489L197
807D070o029m170R092M692j1309m804J2383M518j2104l964J0447L282p603k590
821d089L826J992M91j484m907J155Q899r01j2148P57J4215n53j4920K76J4143
836F752J99j2013q65Q686J790m552k948J7M148M472n304q456O244J1574o814j3502
852a0572O818J4102o182j3324M856J1343k900q388M46M849K305j060n062k547
866e316P537N641r516p902J0693R209j0943r505J0170Q834q405p414N798N449
880D330k594l257r01J075M325Q81p368k393R747L348j1165l718J1516L558j0747
895c363k966Q963K109o333j210L192L36K39K67l516n35O226M53q148m6R112o22
$$ plain form
791 -5735 -625 6719 -314 -7037 989 6490 -1400 -5216 1375 3320 -942 -955 159 -1616 873 4070
807 4070 -1959 -6129 2963 7655 -3654 -8458 3925 8443 -3661 -7625 2822 6104 -1499 -4089
821 -4089 -263 1729 2220 736 -4171 -3016 5883 4982 -7166 -6409 7806 7253 -7667 -7391 6752
836 6752 6951 -5062 -5927 2759 4549 -3 -2951 -2934 1214 5686 382 -8074 -1830 9744 2930 -10572
852 -10572 -3754 10348 4166 -9158 -4302 7041 4141 -4247 -3801 1048 3353 2293 -2769 -5316
866 -5316 2221 7862 -1654 -9556 1137 10346 -597 -10102 68 8902 497 -6917 -1119 4330
880 4330 1736 -1521 -2422 -1347 2978 3859 -3509 -5902 3845 7193 -3972 -7690 3826 7384 -3363
895 -3363 -6329 2634 4743 -1590 -2800 392 728 967 1234 -2282 -2817 3409 3862 -4286 -4332 4780 4158
912D158r030J378P974k128o069K683L599k942q58K811j770k282L963J431n474
927b556k82O104r62n876K215M825l303l108M091R79m511J253M510l318m055M855
943H61L255n714k185N763R83m969K26L401j333j208K196j302k754L842K960o045
959b023k861P657K524q468k043Q348J474p229r74N256N92k603l91m88L82L656
975B809n76o467Q46Q661j098j0046J253J0446j219r779R14Q167k93n779o13K856
991H2J705L78k940l444M079O121n025q175N602R402n701r725N218R124m123p748
1007e170K490N759m29l362j887P86M224J642o278l738P926N280q864o201R022
1022A200O439q301o048O744N159m496l961J805K540J160j132m042r6O476J072
$$ plain form
912 4158 -4872 -3494 4480 2352 -3717 -1034 2565 -377 -1235 1576 -194 -2476 1487 2918 -2556
927 -2556 -2838 3266 2304 -3572 -1357 3468 165 -2943 1148 2127 -2384 -1131 3379 61 -3994 861
943 861 4116 -1598 -3783 1980 2963 -2006 -1780 1621 288 -920 1276 -26 -2780 1062 4022 -2023
959 -2023 -4884 2773 5297 -3171 -5214 3134 4608 -2621 -3595 1661 2253 -350 -741 -1229 -847 2809
975 2809 2233 -4234 -3388 5273 4175 -5871 -4618 5828 4609 -5170 -4256 3911 3618 -2161 -2774 82
991 82 1787 2165 -775 -4219 -140 5981 956 -7219 -1617 7785 2084 -7641 -2423 6701 2578 -5170
1007 -5170 -2680 3079 2650 -712 -2599 -1813 2411 4053 -2225 -5963 1963 7243 -1621 -7822 1200
1022 1200 7639 -662 -6710 34 5193 697 -3264 -1459 1081 2241 1109 -2933 -3029 3447 4519
1037D519q334j687R324K004r414k015Q599J819o964j513M724J185k075r21p02
1052a451P85L309q12n407R47O852j161p540J431P383j641o483J751M939j706k945
1068a749J456P13r67J437K84l244N12M517j364n102K152M978k775m194L179K868
1084B701l291j203L102n74k583K185J835l458r22M179j0m306Q97L765j617k678
1100a978K128J136k325O29K250k414j913L970J404n101q02N672K21n594K59M864
1116B406n55l526O23J733m55L31P8k464M50M362j016n848J516O747j856o985J938
1133b521O501j678n404J107L778k55j726q77m22K068K529l228m265M140N589m715
1149F21o363M860O487m458o054L558N109k186l773M56K164J468m98l384j091N070
$$ plain form
1037 4519 -3815 -5502 3822 5826 -3588 -5603 2996 4815 -2149 -3662 1062 2247 172 -749 -1451
1052 -1451 -666 2643 1831 -3576 -2629 4223 3062 -4478 -3047 4336 2695 -3788 -2037 2902 1196 -1749
1068 -1749 -293 420 -547 890 1174 -2070 -1558 2959 1595 -3507 -1355 3623 848 -3346 -167 2701
1084 2701 -590 -1793 1309 735 -1848 337 2172 -1286 -2208 1971 1961 -2345 -1448 2317 700 -1978
1100 -1978 150 1286 -1039 -410 1840 -574 -2487 1483 2887 -2214 -3016 2656 2877 -2717 -2458 2406
1116 2406 1851 -1675 -1052 681 226 557 635 -1829 -1379 2983 1967 -3881 -2365 4382 2526 -4459 -2521
1133 -2521 3980 2302 -3102 -1995 1783 1528 -198 -1075 -1497 571 3100 -128 -4393 -253 5336 621
1149 621 -5742 -882 5605 1147 -4907 -1349 3760 1574 -2199 -1743 421 1889 1391 -1993 -3084 1986
1165A986K419o319l441P038M058p102m267O473M117n188l662L381K975j187k143
1180h62j148J262L431m84n351j49O714O43p455r50P445J096o715j132N341J135
1196B821l483j131J319J155R16j246k950J382M587j524n669J649O103j701n903
1211c675J627N157j432l891J055K282n16n83r0j098P87K495j466l492K078L970
1227C208k509l952K746L436k734k505K467J317j961k0J284j218m58K193l71k814
1243a891J137L003j761k723K138K043k302j036K187j71j802J366J246k444n76
1258a586L227r5l622P00L560j087l108J299K225j241j036R41k95m34J647j96k831
1275a932Q16L773j388m329J762M468j912m143J738L421j285k353N39J068L75L26
$$ plain form
1165 1986 4405 -1914 -5355 1683 5741 -1361 -5628 845 4962 -226 -3888 -507 2468 1281 -862
1180 -862 -2010 -748 2683 2199 -3152 -3301 3413 4056 -3399 -4349 3096 4192 -2523 -3655 1686 2821
1196 2821 -662 -1793 -474 681 1597 351 -2599 -1217 3370 1846 -3823 -2174 3929 2228 -3675
1211 -3675 -2048 3109 1677 -2214 -1159 1123 607 24 -66 -1164 -377 2118 652 -2840 -762 3208
1227 3208 699 -3253 -507 2929 195 -2310 157 1474 -487 -507 777 -441 -899 1294 923 -1891
1243 -1891 -754 2249 488 -2235 -97 1946 -356 -1392 795 624 -1178 188 1434 -1010 -1586
1258 -1586 1641 1546 -2076 -1376 2184 1097 -2011 -712 1513 272 -764 177 -118 -552 1095 899 -1932
1275 -1932 -1116 2657 1269 -3060 -1298 3170 1258 -2885 -1147 2274 989 -1364 -825 243 618 944
1291I44j389j650K358K775l156l601L677M063l817m147L564L836k848l222J788
1306h25K341m38j316j092K97K575O77l895j496M892K053n397k427N429K567m922
1322i77k539L922K333k497k002P96J610J002j202k705P97M158m26n182J23N692
1338B903J43n654l96N086O15m020q36K579J058r40j273p59J479K311j664l552
1354b920J791M376j813m713J728M554j501l955J155K982o41j766J9M57O51P89
1370A193j307j865J916K596k336l019K612L002k614k678K380K050j915j230J260
1385D5L42n14N46l04j241J066J723j692j919K093J840k278j454K208Q61j883j53
1402g14J365n98p15J280K1j800O37K067j188k067J528J795j632j286J501N75j122
$$ plain form
1291 944 -445 -2095 263 3038 -118 -3719 -42 4021 204 -3943 -379 3457 609 -2613 -825
1306 -825 1516 1078 -238 -1330 -1033 1542 2219 -1676 -3172 1720 3773 -1624 -4051 1378 3945 -977
1322 -977 -3516 406 2739 242 -1760 -964 646 1648 446 -2259 -1462 2696 2270 -2912 -2789 2903
1338 2903 3046 -2608 -3004 2082 2697 -1323 -2159 420 1478 538 -735 -1494 -15 2296 632 -2920
1354 -2920 -1129 3247 1434 -3279 -1551 3003 1502 -2453 -1298 1684 1043 -723 -704 -247 404 1193
1370 1193 -114 -1979 -63 2533 197 -2822 -210 2792 178 -2500 -120 1930 15 -1215 45
1385 45 387 -127 419 115 -1126 -60 1663 -29 -1948 145 1985 -293 -1747 461 1322 -561 -714
1402 -714 651 53 -662 618 639 -1161 -524 1543 355 -1712 -184 1611 -21 -1307 194 769 -353
1419c53K12N85j022Q4J722p42k259J329K555j729k591J889K378j786j931J412
1435b47J307p83n72j7k29Q94R64j725j586K402K064k874k314L018K370k833k224
1452b385K332J883j504j435M78Q92O84l40j818j95K812O68l575j027L988J271
1468B729m015j391L625J432k884j388J815J328n62j207p83J087K028r27l102P80
1484a435L860n91m236L77M196j16l757j82K960N23j913q59O85J201N42j497j665
1501a907J703K586j821l191J783L473j616l391J296K972q53k300L33J429K82m73
1517C05r12m32J478J218j928j787K221K132k348k194K241K012j933j614J407J102
1533I68p68m87L2r9O81N91j317r61J823J138k121j142K167R86j991o80J620K84
$$ plain form
1419 -353 -141 444 -578 -494 1228 486 -1773 -444 2111 382 -2209 -320 2058 272 -1659 -247
1435 -247 1060 277 -295 -312 -541 353 1317 -408 -1994 408 2472 -402 -2716 302 2672 -161 -2385
1452 -2385 -53 1830 326 -1109 -631 261 945 605 -1213 -1408 1404 2072 -1503 -2530 1458 2729
1468 2729 -1286 -2677 948 2380 -504 -1892 -77 1251 689 -518 -1301 -214 1814 887 -2215 -1435
1484 -1435 2425 1834 -2402 -2025 2171 2055 -1702 -1884 1076 1599 -314 -1173 -488 713 1255 -242 -1907
1501 -1907 -204 2382 561 -2630 -847 2626 1010 -2381 -1085 1887 1034 -1266 -933 496 778 305
1517 305 -607 -1039 439 1657 -271 -2058 163 2295 -53 -2247 -6 2006 73 -1541 -134 968
1533 968 200 -287 -255 -354 327 918 -399 -1360 463 1601 -520 -1662 505 1491 -500 -1180 440 724
1551G24j052J28M21n12K22Q33q42r96J278J048j567r23J620O77j458l24J100p6
1569C01o14N04K1q64N51J156j076j309J442J321j597j209J557R56j281o30Q12
1586D1K33j75J59n17n13J164Q31j739j049K139J155k296j179K201J107j825r71
1603a234J223P80m58n53l87L14J231o4j973j48K514L44k824n04K850O32k578p43
1621a578K051Q20j309q74M15R04N16r19j408Q99K154q41k688P14K972n52k943
1638a667L13K664l3k110l00J362O91n30j022l33J327J126j539j790J660K233j656
1655C96k426J466K400j140k158P07J694j84j116l70M66R06J67j370p30J719J176
1672A603j940j432J953J551j801j468J469J265j000r59M48N66J70j96p49j58J244
$$ plain form
1551 724 -328 -200 221 -291 -69 764 -78 -1074 204 1252 -315 -1238 382 1059 -399 -723 377 301
1569 301 -313 191 212 -652 -101 1055 -21 -1330 112 1433 -164 -1373 184 1140 -141 -771 41
1586 41 274 99 258 -259 -772 392 1223 -516 -1565 574 1729 -567 -1746 455 1562 -263 -1234
1603 -1234 -11 769 311 -242 -629 -315 916 852 -1121 -1269 1245 1589 -1235 -1739 1111 1743 -835 -1578
1621 -1578 473 1293 -16 -890 -475 429 945 26 -1382 -483 1671 830 -1858 -1144 1828 1276 -1667
1638 -1667 -1354 1310 1277 -833 -1133 229 920 390 -632 -965 362 1488 -51 -1841 -181 2052 396
1655 396 -2030 -564 1836 696 -1462 -755 939 755 -361 -731 -265 641 808 -562 -1292 427 1603
1672 1603 -337 -1769 184 1735 -66 -1534 -65 1200 200 -759 -311 255 425 229 -520 -678 566
1689E66M40j613o05J798O73j805o36J627N22j279l49Q03J28k46O7l08k25Q00L40
1708F98j179l84J396L67j443k71J292J40j002K9N81j86j18L49l74m49P92N14j089
1727c37n36J248M91j240l92J065K59p56q3K94n3J93K13o88l30J115M19j440m45
1746a003J572M61j548m45J324M25r47l76M32L29J44k85p23K18J249j57j649R4
1764h85J881kj925r7J771K17j420l63R41M97l44o29k91P48Q65q04j379Q16J748
1783A345p69j929O25J954m37j785J76J444J33r86m52M34P92J15j064o24J260J065
1801A297j362j399J362J558j195j609R59J469n93j204J48Q68L17m65p70N2J147
1818E80L30j427o37J567Q69j573r72J404R92j130r16P36P58k64n52k21L24O85
$$ plain form
1689 566 1006 -607 -1212 586 1259 -546 -1182 445 967 -312 -661 142 270 24 91 -217 -442 358 698
1708 698 -481 -865 531 898 -545 -816 476 616 -386 -357 224 38 -80 269 -105 -554 238 752 -337
1727 -337 -873 375 866 -374 -766 299 558 -198 -281 13 -40 153 366 -322 -652 463 882 -558 -1003
1746 -1003 569 1030 -518 -963 361 786 -161 -537 -105 224 368 83 -640 -422 827 670 -979 -885
1764 -885 996 994 -931 -1028 743 960 -460 -823 118 615 271 -358 -649 99 964 160 -1219 -403 1345
1783 1345 576 -1353 -728 1226 789 -996 -820 624 757 -229 -681 -247 545 660 -404 -1028 232 1297
1801 1297 -65 -1464 -102 1456 261 -1348 -389 1080 487 -717 -569 299 616 151 -619 -567 580
1818 580 910 -517 -1154 413 1282 -291 -1263 141 1133 3 -913 -177 581 317 -235 -456 -132 553
1836E53j04j060r8J325K42j444l47J421L87j257l87R73L50n86k86J73J97K65j23
1855A94o44O1R34nj116k0J147M4j058l5Q40J8n28kJ76l5K10L6n59j9P86L1r40
1878d84k2R51J8q50kO32j3l32K6k2j5L58J8o67j7R01M4j041l5J029N8r16r3P04
1902B30J22l72k01L7K25L39k57o84K82R68k83j145K27J210j64j139N5R50Q7o58
1922a71k55L11L99R6n50m54O55P82p14j036P00J184o07j209M61J115k45r27j3
1941d78O70K81l44n56QP87L01r70n71J053Q04j047r25R34R77p51r30M72Q04j36
1961C83o40k06M24N51j93q45m2J072K35j170m19J182N35j078n86Q42O05n42n53
1980d45J81M74J82l64n18K51Q02j47r81K3J086O8j053j51R16K21p14k49M15K81
$$ plain form
1836 553 449 -611 -709 616 858 -586 -933 488 875 -382 -769 204 554 -32 -318 -145 52 317 194
1855 194 -450 -389 545 540 -576 -596 551 595 -463 -498 342 360 -168 -170 6 -29 181 217 -342 -361 425 456 -484
1878 -484 -506 445 463 -387 -389 243 230 -102 -76 -98 -113 245 263 -404 -421 480 524 -517 -552 477 535 -381 -474 230
1902 230 352 -20 -221 -184 41 380 123 -561 -279 689 406 -739 -512 698 534 -605 -550 400 487 -171
1922 -171 -426 -115 284 380 -170 -624 31 813 99 -937 -237 947 340 -869 -408 707 462 -465 -478
1941 -478 192 473 129 -427 -419 368 669 -301 -872 181 985 -62 -987 -53 924 173 -757 -285 519 383
1961 383 -257 -463 -39 512 319 -526 -568 504 739 -431 -850 332 867 -211 -797 45 650 108 -445
1980 -445 -264 210 392 28 -490 -239 563 416 -565 -542 544 612 -441 -592 324 545 -169 -418 -3 278
2000B78j04l00j90K76M62k57o70K25P94j66q45J21P86n7o45k7M57P7j96j23o9
2021a73J62L19j97n11K25O15j95o65J60O35j25n12N7L29%j00p6j22J24L45j78
2042A17n15K05O15j97o48J60O15j25m69K1L16O5j09j58j14K53L22l15n12L65O24
2063E16l59o75L10O63k02o06R2M51O5k69k32O8L66J56m76l60N75M97n96o04N46
2084g4O67m42o61K94N73r0m51j28K91L41j23n27n0O80K02p57l52P79M55p17n13
2105f03N89N18l80n06J45M49J10l59l45K50N59j28p31J5Q28R9q46j90P65K69o28
2126a20l33M19L67j84l65o7L49L11l27n02K55O61j91p34J08P33ro53p9N24J64
2147C27l46k23J16K87R5l24k74L26M33l16n37K90N51k12n55J36M77m5l36p2J95
$$ plain form
2000 278 174 -126 -316 -40 422 165 -505 -280 514 348 -497 -376 410 353 -292 -319 138 215 19 -104 -173
2021 -173 -11 308 111 -400 -175 440 245 -420 -260 375 250 -262 -205 124 124 24 -52 -174 -50 295 117
2042 117 -398 -193 422 225 -423 -263 352 227 -242 -221 95 160 51 -107 -221 32 354 39 -473 -108 516
2063 516 157 -518 -208 455 253 -353 -261 190 255 -14 -246 -178 188 344 -132 -492 83 580 -16 -620 -74
2084 -74 593 151 -510 -216 357 267 -184 -312 -21 320 197 -330 -380 300 502 -255 -607 172 627 -90 -603
2105 -603 -14 504 124 -382 -237 212 322 -37 -382 -132 427 299 -432 -417 411 510 -336 -526 239 508 -120
2126 -120 -453 -34 333 149 -216 -283 66 377 50 -452 -197 464 273 -461 -353 380 371 -282 -361 163 327
2147 327 -19 -242 -126 161 256 -68 -342 -16 417 101 -436 -146 405 193 -362 -226 251 206 -130 -202 -7
2168gJ48j6k38j32K92K68l21l68L18M11k77m07K22L56j25k67K6J52Q5l1j79r8
2190a88K46K24l02l03K94L68k89l41K05L22j26k43J7J40R3k9k11q0K89J92l50
2211g2k76L73L24l39l39K69L26j56l03N8K15Q3j26k32L2L52P6m31j68M70K46m71
2233h9k82L98L21l04l07J47K90Qk42j69J84L04q9m40RN12O8n34j52N07K17m28
2255g1k65L10L01j60l12jK73J96k65l25K05M48j50n15Q7N33Rn17p6M36J34k93
2277a8k13J48K71ml00j57L15K76k75l89K31M53j74m63Q6M30ml60p9K51J63j22
2299F6k36oK91J31l14k30L11K98k78l22J91L52j40k97L9K58L3j68j20P1K05K3
2321A58k67j11K86J88l13k04K70K31k05k35J25J93k5j51o6R0J53k2k25l8K64J04
$$ plain form
2168 -7 141 125 -113 -245 47 315 -6 -374 -56 355 78 -329 -107 249 124 -143 -117 35 120 89 -90 -188
2190 -188 58 282 -20 -323 -29 339 50 -291 -86 236 110 -133 -116 24 117 88 -123 -203 86 278 -72
2211 -72 -348 25 349 10 -329 -60 266 110 -193 -135 80 163 37 -195 -163 189 265 -166 -334 136 382 -89
2233 -89 -371 27 348 44 -263 -116 174 182 -60 -229 -45 259 170 -270 -261 251 319 -215 -367 140 357 -71
2255 -71 -336 -26 275 115 -197 -198 75 271 6 -319 -114 334 184 -331 -244 289 298 -219 -295 141 275 -18
2277 -18 -231 -83 188 184 -116 -273 42 318 43 -346 -115 338 164 -299 -213 217 213 -147 -226 25 188 66
2299 66 -170 -176 115 246 -68 -298 13 311 33 -289 -98 254 114 -183 -144 114 147 -21 -141 -70 135 158
2321 158 -109 -220 66 254 -59 -263 7 238 33 -202 -77 116 91 -60 -126 -36 117 95 -130 -168 96 200
2343B00k90j42K65J78k13j84J37J77n0j47m1J02J27m5k05rK64N5k83j08K81J48
2365B17k52j59J78J70r1j54k2J38J15j03k14O9K81k4l19j7L20N8l01j08K44J50
2387A76j60j70O7J83N5j95j55J67K43j35l00J00L32m2l34k4L03Q2k39j37J54J83
2409A54n4k16n0K21J44k14k33K08K80j62l07R9L07l3k88j7K22J00j51j73O9K17
2431A23K5k55r7K65J64k47k04J99K39j40k46P2K24J1j94q2J21J62o4k12JK50O5
2454A80k63j12K46J50k12j78J62J76q2j63oJ31Q7j05j48O7J94k7k21k6K37O3k13
2477f3q8J77J09j17j19N0J11K3r3r8Q8J40n7j78J6K13kk03l1J79N5j25p8O3J07
2502G9oj11o2J03J20r4j61O1J95k3j98pJ74L9j59n3R0J03l0j13m2J26R0j22j37
$$ plain form
2343 200 -90 -232 33 211 -2 -186 -49 128 78 -69 -110 -8 119 74 -131 -140 124 179 -104 -212 69 217
2365 217 -35 -194 -16 154 63 -91 -113 25 140 37 -177 -108 173 149 -170 -187 133 191 -110 -218 26 176
2387 176 16 -154 -87 96 151 -44 -199 -32 211 76 -224 -124 208 166 -168 -192 111 193 -46 -183 -29 154
2409 154 100 -116 -166 55 199 -15 -248 -40 240 78 -229 -130 177 144 -144 -161 61 161 10 -163 -94 123
2431 123 148 -107 -204 61 225 -22 -226 -27 212 72 -174 -102 122 133 -61 -143 -22 140 76 -136 -135 115 180
2454 180 -83 -195 51 201 -11 -189 -27 149 67 -96 -102 29 116 11 -137 -70 124 97 -124 -150 87 150 -63
2477 -63 -151 26 135 18 -101 -51 60 83 -10 -108 -20 120 63 -115 -99 114 112 -91 -122 57 112 -13 -91 -28 79
2502 79 73 -38 -100 3 123 29 -132 -71 124 101 -97 -104 70 109 -50 -103 -13 90 60 -53 -95 31 121 -1 -138
2527a38J02J80p8k01N8J95nj86l4J35P2p9j21K6J50L2j65r1J70J50j78j58J19
2550d5J90p8j89L3J58L3j34p8Q0J37k8j79qJ94M7j80j11J71J45j45j73J08J72
2573A20n0j57j4J31Q5j02j39O7J68j3k05k9K05P6j96j00J65J09j06j27N5J24O
2596G3j12p7J18J21r7j48N2J85j2j95j4J78M6j43p9Q5J01m0r9k5J13P3r6j28Q8
2621c2J47o0j65L6J63rj44j6R1P2o7q4J2J09K2r4q9J07J08r1j18O3J41m7j28J3
2647f0J14K1p9o0L9R0Kj04m9J04Q7j06r9Q2J16p0j18K3J19Oq9m7N1Q5j5j12j2
2674h1J30O3j51p6J25R8r4j19O9J26l1j06j6Q5O2n6j09K8J38Jj51l8J58O5j42
2699b2q9J12J02q7r7K7J14J9j08o0P7J16o7j37K5J62%j67k5J54M6j13p6Q1R7l9
$$ plain form
2527 -138 -36 144 66 -135 -77 118 113 -73 -107 28 100 21 -100 -74 76 108 -57 -148 22 172 -6 -164 -45
2550 -45 145 67 -122 -89 69 102 -32 -110 -30 107 79 -100 -108 86 133 -47 -158 13 158 13 -160 -52 120
2573 120 70 -87 -101 30 115 13 -126 -59 109 96 -109 -138 67 143 -53 -153 12 121 15 -112 -57 67 73
2596 73 -39 -116 2 123 26 -122 -70 115 103 -92 -106 72 118 -25 -104 -19 82 42 -57 -82 31 104 8 -120 -32
2621 -32 115 55 -110 -74 89 80 -64 -80 11 83 16 -68 -56 53 75 -19 -108 -1 107 16 -102 -39 102 55 -73 -60
2647 -60 54 75 -4 -64 -25 65 67 -37 -86 18 105 -1 -100 -18 98 28 -90 -67 52 58 -31 -78 -27 58 43 -69 -81
2674 -81 49 112 -39 -115 10 108 14 -105 -36 90 59 -47 -63 22 84 28 -81 -53 85 86 -65 -103 55 120 -22
2699 -22 -111 1 103 16 -81 -54 60 79 -29 -89 -12 104 37 -100 -75 87 87 -80 -105 49 95 -18 -94 -13 84 45
2725D5j03j7J05Q0j06j14Q6J36n8j52K5J63j7j31k8J14O5q1p8K2J04Oj02n4J11
2750B1Q8j07j11Q4J25o3j20J8J17Mr8k8O4O7l4r4nJ07M8j23n7J03Q9r2r0N8R5
2777F6j7r2oO0N1m5p3MJ02Pj04l7J19M3j00n8P0P0m3p2J5O1J8n0n2M3O9rr6j2
2807f8J14K9j09m3R8N0p4o2M2O4On5n0O0O0j9j10RJ26%j26j7R5N2q7n8O2O5k2
2836C2q2j0P4M6m9j09O5J10m7j23K2J23J7j12m4J03M2m5o2LQ2L4r7n8J01P6p8
2863A4j11N2J48n2j33J9J08K0r2n1P1P6k9r9nJ02N1j16p5J15Q1p9j07N4J05l4
2889C3r3NQ1L9o7p6M3R8j0j16j5J26L8j29n5J09Q2q4p0L4Q4j1p5l2O1O1m1r0K1
2918d9J06Rj22l0J29L2j01n4P8N8l1p9NO6M2n7p6N5Q8l1r9J1J05J0r8l5P6M1m2
$$ plain form
2725 45 -58 -75 30 110 4 -110 -24 112 54 -98 -73 90 73 -58 -86 28 93 12 -66 -44 60 66 -36 -90 21
2750 21 109 2 -109 -25 100 37 -83 -65 52 56 -42 -70 -6 61 27 -67 -72 35 83 -40 -97 6 95 3 -87 -29 66
2777 66 49 -43 -49 11 62 17 -56 -52 50 57 -47 -84 35 78 -22 -80 -10 60 17 -55 -40 21 39 -11 -63 -20 49 40 -56 -68
2807 -68 46 75 -34 -77 21 71 -3 -65 -23 41 47 -8 -58 2 62 43 -67 -58 68 68 -58 -75 20 72 -15 -73 -11 54 32
2836 32 -50 -60 14 60 11 -98 -33 77 30 -93 -71 52 69 -43 -87 16 58 13 -49 -46 36 70 -27 -85 16 92 14
2863 14 -97 -45 103 51 -82 -63 45 65 -27 -78 -7 69 40 -59 -64 38 89 -27 -102 13 94 15 -92 -38 67 33
2889 33 -60 -55 26 65 -2 -78 -35 63 53 -63 -78 48 86 -43 -98 11 93 9 -61 -27 57 46 -29 -61 0 61 20 -70 -49
2918 -49 57 66 -56 -86 43 75 -26 -80 -2 56 25 -54 -49 17 59 2 -74 -19 69 38 -61 -50 55 65 -33 -68 8 49 7
2947Gn1J5O2kn1m2O3N9n1q5L7R2j5j01NQ3J7n7l9L1O0k0m3l4P1M8o1p4N1R6m3
2978B8r2J4J03lp9j9N1M4k3n9j7P3M3q1n8P7P7o4r9N4R1k1q9j3P3M9n9o6L0Q3
3008D8Jr1l6J03N9r9p7Q8Q4o0r1K9R5ro7m4P3N8k8j00QJ13K7j26m3J15O1j02p6
3037h7Q1Q8m6r7MP6L4o3o4N1R7l5j11J4J11K0j16l3R5M8p1o2M0O9mp0l8P5O2n0
3067A8r7N8J02m0j07J0J09J3r6m3P5M9l7n8nP4M5r4m5O1Q7o4q7L1J03k4q7j0P7
3096A8L5m6m9J7O5Kp4l3Q1N5o4p3N8P9m4q0K1O9Kn2k6K9N3rp0j7Q4K8p5n4P7N9
3128F6n5p4M0O9j0p1j8M8N4l0p2J5P9K6q8l7Q6M6p5p0N6P7k0o4j8N9L7m7o6L8
3158a9Q1j0j01qJ08J0r5m2Q3O1o2o4L1P5jq2k2N3P0m9p9K2J00Mj12rR7M3r9n3
$$ plain form
2947 7 -44 -29 33 31 -20 -62 1 60 9 -76 -39 53 38 -63 -58 25 42 -15 -54 -23 37 17 -26 -60 11 59 -2 -76 -25 71 28
2978 28 -64 -50 53 50 -29 -48 3 47 24 -35 -52 21 64 -17 -75 2 79 15 -84 -30 61 40 -49 -62 11 60 1 -65 -35 48
3008 48 49 -42 -78 25 84 -15 -92 -4 80 20 -71 -42 53 44 -23 -67 6 64 36 -64 -56 57 84 -42 -85 30 91 -11 -87
3037 -87 -6 82 36 -61 -57 19 53 -10 -74 -23 74 39 -72 -58 53 73 -43 -76 19 67 -4 -66 -26 43 39 -31 -69 6 68 18
3067 18 -79 -21 81 41 -66 -56 53 66 -30 -73 2 51 14 -44 -49 25 70 -24 -69 -8 79 15 -72 -41 62 38 -49 -59 18
3096 18 53 7 -42 -25 40 42 -32 -65 16 71 7 -66 -8 71 27 -53 -32 37 39 -13 -39 -10 43 34 -36 -53 31 59 -16 -70 7 66
3128 66 11 -63 -23 46 36 -35 -53 -5 49 19 -53 -38 41 67 -21 -58 28 74 -1 -71 -15 62 42 -22 -40 19 56 9 -57 -19
3158 -19 62 52 -49 -57 51 61 -34 -76 7 68 6 -58 -27 48 47 -35 -57 -4 66 17 -62 -40 60 64 -48 -57 40 83 -16 -69
3188f9O3O8k7p8nP2L6n8o7O3R1n2j00J0J05K4j15k6Q4M0o2o0L5P1Qr1k4P8O2q4
3218hp1N0R4l7r0J5R5Mq2k6N5O1l3p5KQ5K4p8n5P8P5o6p7L8P6j0p8j8O5L8l7q0
3250f6L6P0J0p8l5Q7L9o9o9O9O4l3p3PO6J5n3m1N2M7oq7JQ1K9q6k8O1N0n2o0M1
3282a1O5j2o4j6M9M7m7p4L0P9Jq6k1P9M4p9m7N2O0k8o6LO2L5o2n4N3O6k9q5PR4
3314D5J5r6l7R4L0m6n0K0O7Qp9k5O2N7o7o1L5Q2qj03PP8K7p4n0O2O1k5o8j6Q5
3345C0L0p9n0P2P1n5q1K9Q1Pp8l5Q6L5n4o5L2P9nq2j7P7M6p2o6M9R3o0p6K2O8
3376C2J3o4l5M7O4l3q7J8Q4J8r1k4O6M5n2o7M7N7po9j4O2N1n7o2K9Q9j4r0qQ5
3407C3L2p6m8O5N2k9p7MP3J4o5l8N2O3k2r3MR8Kp7k2O3M9n2n2K9N6Ko4k9P4L6
$$ plain form
3188 -69 -6 62 35 -43 -48 24 60 2 -65 -2 89 37 -63 -53 52 76 -39 -65 19 59 -3 -63 -28 43 51 -40 -64 14 76 -8
3218 -8 -79 -29 65 28 -62 -47 48 52 -30 -56 -1 60 27 -48 -46 39 63 -15 -70 8 83 17 -60 -22 54 44 -34 -52 13 51 14 -66
3250 -66 -30 40 50 -28 -63 24 63 -6 -75 -6 58 25 -48 -41 25 40 -13 -54 -2 45 39 -48 -47 34 63 -23 -51 10 60 8 -52 -11
3282 -11 54 42 -22 -38 11 58 11 -63 -33 46 47 -39 -60 19 63 -16 -63 -11 49 21 -45 -42 20 55 -7 -61 -8 58 29 -56 -49 45
3314 45 60 -36 -73 21 51 5 -45 -25 42 50 -29 -54 8 65 -2 -63 -28 54 46 -57 -50 28 55 -19 -69 -7 54 29 -39 -55 30
3345 30 60 -19 -69 3 74 19 -62 -33 48 55 -23 -58 28 63 9 -56 -24 55 50 -32 -49 28 74 2 -64 -15 78 18 -58 -36 32
3376 32 45 -19 -54 -7 57 24 -63 -45 39 57 -34 -58 8 53 1 -66 -19 38 31 -38 -52 10 61 4 -58 -29 60 46 -44 -52 33
3407 33 65 -11 -59 6 58 29 -48 -44 29 43 -22 -60 -8 55 33 -60 -56 42 44 -33 -55 8 57 5 -47 -18 38 40 -24 -53 21 57
3439E7m7o6M7O9j4q7mQ5K0p0m4M8N2k1n8j2P2K7p0n3O2P7m2r2K8P4J3p9k3O2M3
3470E4m2o1K6P7op2k8O4N5o1n9L7P3j7q7J4O4K0n7m8M2O3k1q0%R2K5q6m8P0O6
3501F9o5o5L4P5np6j7P0K4l5o8K4Q7kr0j4Q1L1o9n4O5O0l3p4J4P6Ln6m4N2P9n2
3533B5p6NP9K2q4l7Q8L3l7o9K8O9op2j3N8L4n1n9L6Q4j3q3k0R1L2p3m8N6M5k1
3564B3o8J1O1L0o5n2P0N3k6r5J9R2lp4l8O5N4n0n6J9O8j1n9k4P0M6o3n2L4O1K
3595D2r0jP4K5n7m5L9O9k3p5%N9L2n9n3O2O5l9p1K4O1J8p5l0N3N6m6o9K8P4po8
3627b7j7N9M2o0o7M7P2k3o4j5Q2L1o8n5M6Q2l4p9QP8K4p7m5O5O1n4n5J6P9qp3
3658b9j9P0L3l9q4M6P5rp6j3P1K2n0n5L5P2k3p7NO4K7p1l3M5N6k5o5RQ0K1q3k3
$$ plain form
3439 57 10 -56 -9 60 46 -41 -45 40 60 -10 -54 -6 46 25 -33 -45 27 54 -16 -69 -7 70 28 -64 -36 38 51 -28 -51 11 54
3470 54 12 -49 -23 54 48 -24 -52 12 67 6 -53 -16 57 40 -47 -33 31 51 -6 -54 -12 51 30 -50 -50 42 67 -19 -67 3 69
3501 69 4 -61 -27 48 43 -33 -50 20 44 9 -59 -35 52 50 -40 -54 27 58 -11 -65 0 60 27 -47 -33 43 46 -10 -54 -2 77 25
3533 25 -51 -46 33 55 -29 -66 22 55 18 -51 -23 46 40 -32 -45 13 47 -4 -63 -27 57 44 -39 -59 32 64 -9 -57 -1 44 23
3564 23 -45 -34 27 57 -8 -60 10 63 37 -58 -39 53 50 -24 -62 3 57 7 -49 -30 38 27 -32 -56 14 60 -3 -55 -21 40 42
3595 42 -48 -49 25 50 -7 -52 -13 56 33 -42 -42 17 49 -10 -63 -1 64 25 -46 -22 39 57 -18 -48 5 61 15 -54 -26 48 41 -27
3627 -27 -44 15 57 -3 -70 -23 49 26 -38 -53 29 60 -8 -63 -17 65 31 -48 -40 38 62 -15 -60 5 66 12 -43 -27 52 44 -29
3658 -29 -48 22 55 16 -68 -22 53 44 -32 -45 26 48 -2 -57 -22 50 27 -50 -45 19 46 -25 -58 -13 43 18 -47 -38 42 63 -20 -43
3690d3O3M5n5o3L3O3Mp7k7P6L8m0p2L1P7j5q9mO4M2n9m9M4O0j6p7%P0K3p2l7M9
3722a3O9m3o8K8P0oo4l3N8O0m4m9QO4J5p2l3O8M5o0m6K4O9j3q0oP3K6n2o2M7P3
3754E3k7p4%P2K3o9m5O1N1l0o4QO2J5n7l0N5M0k4p0K1P4no7k5P7L3m8n7J7P4j4
3786C0o0j3O2L8o5l5K5O7k3p7jQ3K2q2l6M9O0k6p6J6P0Qo7j9M8O3m4o6K9P3%q4
3818c1j0O1L2n3m6L3O1k1o6mO7M7p3n2M1P4l8p0OP9Jn7k9M8N3m0o8K0P8kn5m7
3850f1O5L4k8o1L4O1lq0lP6J4l9n3L6O1j9o9j0O8K9n7n1N5N6l6o6MO7J8n8m0N0
3882fM8k7o2NP5Pp1k0N1O2n9n6K5P1ko7k4N7M1n1n2L7O2j9n6j1O8L2p7l0N1M6
3914D8l6n9oO5M2p2l7M7N4l6n5J2P4Jo7l5O9N2m8o1K4Q0k0p1j4P0L1n2m0K5Q0
$$ plain form
3690 -43 20 65 10 -53 -20 43 47 -30 -57 19 57 17 -55 -24 53 38 -51 -55 9 51 -8 -57 -13 47 31 -46 -46 24 47 -25 -62 -13
3722 -13 56 13 -55 -27 43 37 -27 -60 -2 58 14 -35 -27 37 52 -20 -53 15 60 0 -46 -22 47 34 -46 -52 21 47 -5 -67 -20 53
3754 53 26 -48 -48 24 47 -22 -67 -6 45 15 -49 -41 21 36 -21 -51 4 44 20 -50 -29 45 40 -27 -52 25 58 10 -47 -30 44 30
3786 30 -30 -43 19 57 -8 -43 -18 49 26 -51 -52 31 53 -29 -65 -16 44 18 -58 -42 28 36 -31 -50 -2 61 17 -49 -20 53 53 -31
3818 -31 -41 20 52 -1 -47 -14 47 26 -40 -44 23 70 -3 -55 -14 60 22 -48 -42 37 38 -19 -48 0 53 13 -55 -35 43 41 -14 -61
3850 -61 4 38 10 -51 -17 44 41 -39 -42 34 48 9 -44 -8 53 34 -35 -45 23 52 -5 -56 -1 55 19 -47 -43 24 42 -16 -56 -6
3882 -6 42 15 -47 -42 33 40 -31 -51 0 62 3 -53 -28 43 41 -26 -50 7 48 -3 -55 -18 44 25 -31 -42 26 58 -19 -49 2 48
3914 48 12 -47 -53 12 54 -18 -55 -8 46 10 -45 -33 41 42 -25 -60 9 61 13 -48 -24 56 36 -35 -49 21 52 0 -40 -15 65
3945F5l0p0mQ0J4o3l1L6N8l5o2QO3Kn1k8M6N3n0n1K3O1Rp0j1M3M8n9n0L6O4op2
3978c4KM9L3m5m0L5M1j3o9%P1K3n4l3L8N9l9o4J6N7J9p9j6M6N1m2o6L4N9j5m2
4009a8l2O4L3m0n2L4M7j4o2pN8L1l8n9M5O3k3p5J1N9K1o0l4M6O4l4p7K2O0J0n8
4040a5l4N5M3m5n0J7O3Mo7j9O3L0m1n2L2N4lo3j3O0K8n0m6M5L5j1n5kO2K3n6l5
4072d3M1N4k3o2PO2Mo3l0N3N0m6o4J4Q1ko4l0P6L3m0o5N3N0k8n2j2N5L0m8l9L7
4104a1N7k5o3mP3J5n3l5M7N9m4o1K4O2Jo3j6M8L6l8o4L1O0nn4rM6K8m2m7L8M5
4136C6j3n2j4N7L1m7l8L5N3l2o3J8N7K1o4j7N0L0l3n5J4O0lm9j9M1L0k7n4K4N0
4167B7No4j4N6K1m1l6K9N1j0n0j4O1J9m3l3K5M7k1o2J5O0J3m3l6M0N5l3n7J5M8
$$ plain form
3945 65 35 -35 -39 41 55 -8 -39 -3 55 20 -42 -34 29 31 -20 -48 -2 51 1 -50 -27 34 43 -27 -38 5 53 -6 -56 -20 44 38 -34
3978 -34 -32 17 50 5 -35 0 41 28 -41 -41 30 53 -1 -34 4 63 24 -40 -24 33 52 -27 -43 3 54 12 -54 -20 39 24 -18
4009 -18 -50 14 47 7 -45 -11 36 22 -40 -47 11 42 4 -55 -10 53 30 -45 -34 25 46 -14 -48 -2 62 28 -49 -27 33 43 -15
4040 -15 -49 6 49 4 -46 -29 34 38 -29 -48 15 45 4 -48 -16 38 35 -28 -41 19 47 -3 -49 -4 31 20 -35 -37 25 48 -8 -43
4072 -43 -2 52 29 -33 -26 36 40 -23 -53 0 50 4 -60 -46 35 33 -31 -61 15 48 8 -57 -4 46 18 -34 -46 9 39 -9 -48 -11
4104 -11 46 21 -42 -46 27 42 -11 -46 1 60 16 -45 -21 41 42 -21 -37 11 47 9 -55 -24 36 31 -23 -32 14 42 0 -47 -9 36
4136 36 23 -29 -43 14 45 -2 -40 -5 48 16 -47 -29 28 49 -15 -32 18 48 15 -40 -26 34 31 -18 -37 4 34 7 -47 -23 27
4167 27 32 -32 -46 10 31 -10 -46 -17 34 24 -26 -40 21 40 -3 -36 -11 36 15 -47 -32 28 41 -2 -38 2 57 24 -33 -18 30
4198C0J4o5k8N0M7l9n9K7P2k2n2k1O4J8l9m8L6M0Oo7LO0J4m2m6M0M7j0n9jN0J6
4230C6n0k6L8N2l2n7J3O0Jn1k4N4L7n0l8J4N5%p0JM7L3m2m4K8M7kn9j3O0K1m8
4262ik8L8M1j8o0NM4K9n8k0M5L3j7n7K2M0Pn7j4N2J6l6l2J6N4j7l7j9N5K3m1m5
4294d5M8L4j6n1jO0lm4k6M3L6j6o1J6M9J0m9k7L6M8l7m1J6M8Pm5k3L7L8l7m1K2
4326a5N0Km9k5L8L5m6l5L0M5j3m3oM1J6l3k7J9L6rl4KM0Lk5k8L3L1k3m4K3M2l
4359B8l2l0L7L8k6m4J3N5on0rL6K1l7l8L5M5j4n3mM7K3m0l1L4L9k1n8J1M9J3n4
4391b3j7M6L2j8m5J0M4ml1l1M5M1n2l5K9M6j7m1rM3K9m6l8K8M5j7m6JM3Rm0k7
4423d6L1M5k4m6J0N2kl6k7M0K0j1l6ON9rl9j4L7K5k9l4K2M5mm9qL9J8k5m3L6K6
$$ plain form
4198 30 44 -21 -49 1 48 9 -50 -23 49 27 -25 -46 18 36 -3 -51 -15 25 31 -36 -33 27 41 -1 -47 -7 40 30 -29 -30 20 36
4230 36 -14 -40 -2 50 18 -39 -26 34 35 -16 -40 14 51 1 -37 -23 32 32 -38 -37 10 43 1 -43 -15 32 30 -29 -42 18 39 -9
4262 -9 -37 1 42 24 -36 -31 13 42 -16 -36 9 42 25 -32 -10 30 37 -20 -34 18 34 -2 -34 -18 36 19 -18 -37 18 41 0 -45
4294 -45 3 37 21 -30 -31 29 26 -18 -44 -1 35 19 -42 -26 23 33 -16 -43 -7 41 4 -37 -21 27 34 -11 -34 3 41 4 -37 -15
4326 -15 35 37 -12 -37 1 36 -10 -45 -15 30 17 -26 -32 9 25 -8 -35 -16 20 11 -23 -21 19 22 -3 -31 2 33 10 -34 -11 31 28
4359 28 -4 -34 3 41 15 -29 -16 39 33 -17 -26 10 31 -6 -44 -9 36 22 -31 -35 12 35 -5 -36 -2 37 16 -42 -31 18 31 -23
4391 -23 -40 6 38 20 -25 -15 29 25 -6 -37 8 49 -3 -38 -9 37 20 -21 -30 13 42 -4 -42 -14 31 14 -32 -31 12 21 -19 -46
4423 -46 -15 30 6 -40 -30 22 20 -16 -43 -3 17 6 -30 -24 35 26 -13 -27 10 35 6 -28 -6 39 35 -14 -22 17 35 10 -33 3 29
4456B9j2l6nM9Kl1l7L8M7l3m0J4L3Ol0k3L1L0k9l7J6M2Ol8k3M7L0l0l4RM2j7l0
4489a4j2L3K4k7k9J5M4j3l5pN0J2n3j7K8K6j5l4KM4Pm5k5M0L7j6m7J9K6J2l8j6
4521b4L6K0k5l8L1L6rn0LL4J5l0l3M3K0j2l6%N0rl5k3K4M5j6m2LL9nl1k0L6L3
4554C0k8l7J9M6j2m6KL7K9l9k6J0L6ml3j0N8Ql5k8J9M8k0m4NL5Pl5j9L1L0k9k7
4587b2kN0Mm1j8M3J6l5k3K6K7j3k3pL6K1l7k8K3L5j3m0MM1oj5k7L8K9k5n3J9L4
4620A8Ml3j8K6L1k3k2mM4rl6j1L4J9j4l2K5L1j6j8j7L0Rj9k9K6K7Jm3KL5K5m2
4653Ak6K4K1ll7jM3Nk7k4J8K9j5l3RL1Ll5qL3J0k3j7jM1nk9j6L4K8k3m2K1M6q
4688B4m0jL8kk3k1J1M6j5l4kM0Nk9k8K7K5j7l4NM3Rm5j8L7K7l2k3PM2rk8j7M0
$$ plain form
4456 29 17 -19 -24 25 27 -4 -41 -3 44 11 -29 -15 18 24 -6 -29 2 32 3 -34 -18 24 30 -8 -31 16 46 16 -18 -9 33 16 -14
4489 -14 -26 7 31 4 -25 -10 34 21 -14 -21 29 41 -12 -29 -1 25 10 -24 -22 22 29 -16 -41 -1 36 20 -27 -8 18 30 -8 -24
4521 -24 12 32 7 -31 0 36 27 -23 -20 14 29 -1 -34 9 29 17 -19 -19 31 22 -13 -36 -12 33 17 -25 -22 17 12 -19 -39 -3 30
4554 30 2 -35 -16 30 18 -28 -26 11 40 1 -25 -15 21 17 -16 -26 32 40 5 -23 -4 44 24 -20 -15 20 27 -8 -27 4 34 5 -22
4587 -22 -24 26 30 -11 -29 14 30 -5 -28 -2 25 12 -11 -18 18 39 2 -26 -3 32 19 -21 -17 24 18 3 -24 14 43 18 -35 -16 18
4620 18 22 -11 -29 -3 28 5 -17 -21 23 14 -22 -33 1 20 6 -26 -1 30 14 -4 -21 9 18 -1 -30 -4 23 24 -19 -17 18 43 1
4653 1 -25 -1 20 17 -20 -21 22 27 0 -24 -6 23 8 -25 -16 15 18 -17 -25 8 18 -5 -22 -23 18 13 -16 -32 2 30 7 -35 -14 32 24
4688 24 -16 -17 21 19 -4 -25 -14 32 17 -17 -19 21 26 -3 -31 -4 21 4 -30 -25 18 27 -18 -36 1 28 -4 -27 -20 22 13 -15 -32 8
4722HK6m1k0J8L6j2l4J0L2Kk1k5J4L3j6k9J1K8Kk8j2J7K7j8l0ML4Ll9LJ5K9k4
4755Cl8J9K8Nk9pK9Pk4k4K9J7ol7MK8J7k6k5L7K1j4l3J2K5Pl8kJ8K6j7k5NK5J
4790A8l0pJ2K6j2l1J6K3jk8mK2Rk3j6J7K2ok0kJ9K0k4j8K0K6j5l3RL8Jl1k3K6
4824@K6j7j9mL9jl4j2L3J6k8k8J6K9lk2j0J5J8rk5OL1j1k3JK9K2m0j7K4J9ql0
4858a7LL3Ok4j3K4kJ1l3nL2mk1nK8K0l6k8L1K5j5l7QK8J9l0k1J3K6mk7KK7J1l2
4893gj2L0J1j1k7JK4J5k6kNJ3j3j6nM3Qm3jK3Jpj7PJ9jk2pJ2K1j2l2K1J6jk8R
4930a1K0%l4MJ7J4j1pKJ7Pk7LNJ3pj4LK7pj7j1K0J0j6j7OJ9Pl1nL0lj2mnL3j6
4968Bj4KJ7Rk3j8K3J3Rk3nJ5J5k1j1J5J7j6k7K7RJ1l7nJ9K0k4j0RK2mk1qJ3J7
$$ plain form
4722 8 34 -7 -27 -9 27 15 -19 -9 23 25 4 -21 -7 26 10 -19 -8 20 22 -6 -18 -1 26 8 -22 -18 16 19 -20 -17 -2 27 3
4755 3 -35 -16 12 17 -12 -19 10 17 -7 -31 -2 15 9 -28 -24 4 21 -5 -30 7 28 14 -19 -7 18 25 -13 -15 3 29 12 -13 -8 17 18
4790 18 -12 -19 -7 19 7 -24 -8 15 14 -14 -18 4 13 -10 -26 -9 13 7 -13 -15 4 24 0 -18 2 28 13 -20 -11 27 28 -3 -26 0
4824 0 26 9 -10 -14 25 24 -10 -22 11 27 -1 -29 -13 16 13 -9 -19 -4 14 5 -20 -14 17 6 -17 -16 13 35 -5 -22 2 21 13 -17
4858 -17 -14 19 25 1 -12 12 10 21 -12 -17 15 11 -10 -15 13 33 -3 -31 0 25 10 -27 -19 9 28 -2 -23 -10 16 12 -15 -13 14 25 -7
4893 -7 -19 11 22 11 -16 -15 9 24 -2 -4 1 14 1 -15 -20 23 31 -12 -13 10 11 4 -13 -6 13 12 -10 -17 -5 16 4 -28 -7 9 8 -20 -11
4930 -11 9 9 -25 -21 -4 10 -1 -8 -6 11 18 -9 -6 -1 12 5 -9 -6 21 14 -3 -14 6 16 0 -17 -11 8 15 -16 -21 9 6 -6 -10 -15 18 2
4968 2 -12 -10 7 16 -7 -25 -2 11 20 -3 -8 7 22 1 -10 5 22 6 -21 6 15 26 -11 -16 3 23 -1 -11 -2 20 16 -5 -13 0 17
5003A7k1j7J2K1Kk6LRJ5k4j5J9K4j1j7kK4Ok8nJ7J8j0j8J7NJ2l7mK0J0j0k4J8
5037@J9ol2LK2J0j0k4J5J5Qk4pK2jk1oJ9K5k1k0OJ9Rk7j0K9Oj7qMK1j2qkRK0k2
5075Cj6J4J0Lk3j2L0qpj2K2Qmk5OQJ0j7j0J9K2k4j8J3K7j1j9MRQkk0%L1rj0j1
5112a1K0jj1jJ0J3j3oqJ7Qj5j0JJ8j1j1%J0Rmj4J2N%k2MJ0Pmj5QK3j2j3JK3lk5
5151a1JJ0J2j8oNK3j0lqJ0K3j6k2J7Rok5NJ8Ok2j1J5J4oj9PJ0J1j6j1J4N%j2N
5188bK2mk7J4QJ3j8rJ1PrqMJ6Jj9j3J0K0pk2J4J0nk4NK1%mj7QOJ2l4QJ7jjj4L
5228hK3j1pQPQj1j2J3NMj8pJ8Nk1j1J6J4qj0OLLJj4J0J1j5nmJ4Lj6j1J5J0j1%
5267cRO%nnLk%MlJ4opjnK1j1j8J2Olj3jJ3J7j5j0mJ3prKJ0Qj7%J7Jkj2jK8j7j8
$$ plain form
5003 17 -4 -21 -9 12 14 -12 -9 0 15 -9 -24 -5 19 8 -9 -11 13 19 -9 -14 3 21 11 -7 10 15 27 -10 -14 6 16 6 -18 0
5037 0 19 13 -19 -16 6 16 6 -18 -3 12 20 -4 -11 11 10 -11 -17 2 27 6 -14 -8 11 20 -7 -17 12 18 1 -7 -3 18 6 -2 -4 5 25 3
5075 3 -13 1 11 14 -9 -21 9 1 -6 -18 4 12 8 -17 -11 -3 7 -10 -20 -1 21 -3 -21 -8 19 8 -11 -7 2 10 8 -12 -12 19 10 0 -11
5112 -11 9 8 -3 -4 6 19 6 0 -8 9 17 2 -8 -7 11 0 -11 -11 -1 8 4 -10 2 7 7 -15 -11 -1 6 2 -13 -5 18 6 -7 -6 17 14 -11
5151 -11 -10 0 12 -6 -12 -7 16 6 3 -5 5 28 12 -10 7 16 10 -15 -10 8 14 -8 -19 -4 10 4 -15 -8 2 13 -3 -14 0 5 5 -7 -2
5188 -2 20 16 -11 3 11 24 6 -3 8 15 6 -2 2 18 19 0 -13 -3 17 10 -12 2 12 7 -17 -12 9 9 5 -12 -4 2 14 -20 -12 5 4 3 -11 -8
5228 -8 15 4 -3 5 12 20 9 -3 10 15 19 1 -6 12 17 -4 -15 1 15 7 -3 3 6 9 10 -4 6 17 2 -3 -7 7 10 -6 -17 -2 8 -3 -3
5267 -3 6 12 12 7 2 5 3 3 7 4 18 12 5 4 -1 20 9 -9 3 9 6 -7 -8 5 22 7 -3 -7 6 -1 -10 -8 2 10 -7 -7 10 11 9 -3 -4 24 7 -11
5311a1KK0Nnj6QJ3oj8JK0%pqNJ1qmpJ1Nrj4J3KrrJK2jj4oJ7Nj3pJ4JMj1mJ3Lj6
5355gj0RL3j7j3QMKj8J5LKj1j0lK7nj6JJ6jj1j0LK4j1mlJ5j2lmLJ2lj2MJ3qqj
5396gOK0j6onJ9nqLNLplKPonNProMKQMrj1QKjrLQRj2lJ1pLoRQrk4K5m%KkmNNj8
5449iOJ5nLj9J1Oqk%JjMk0J5Pj5mJ3PqljJ2jjoOQNl1MK5omk0KK6roKR%j4qK6o
$$ plain form
5311 -11 -9 11 16 11 -5 3 16 10 -8 -7 13 13 6 -2 3 14 6 2 -5 6 11 2 -12 1 3 -6 -15 -14 8 7 -7 -13 4 9 -4 -11 3 4 8 -3 -7 6 9 -7
5355 -7 -17 -8 25 8 -5 3 7 9 -9 6 9 11 0 -10 -13 14 9 -7 -6 10 9 -2 -12 -9 15 4 0 -3 12 0 -3 -7 -4 8 5 -7 -3 10 2 -6 -7
5396 -7 -1 19 3 -3 -8 11 6 -2 1 6 9 2 -1 1 8 2 -3 2 9 0 -6 -2 0 8 12 3 -8 0 2 1 -8 -5 3 12 0 -3 8 1 4 -2 7 15 6 -18 7 3 3 5 3 -1 4 9 -9
5449 -9 -3 12 7 10 -9 2 8 0 -2 -2 -1 -2 2 -18 -3 4 -11 -15 -2 5 -3 -6 -7 5 4 3 -3 3 11 16 -15 -11 14 8 4 -16 -14 12 3 -3 -1 8 8 -6 -14 12 6
$$ [...]
8191F
##END NTUPLES=NMR FID
##END=
