##TITLE=1H_LY-DMAA.Per.3.9
 CDCl3
 8 sc, 
 11.02.2022
##JCAMPDX= 6.0         $$ Bruker NMR JCAMP-DX V2.0
##DATA TYPE= NMR FID
##DATA CLASS= NTUPLES
##ORIGIN= UXNMR, Bruker Analytische Messtechnik GmbH
##OWNER= root
$$ XWIN-NMR		Version 3.5
$$ Fri Feb 11 11:33:12 2022 Russian Standard Time (UT+4h)  she@DPX200
##.OBSERVE FREQUENCY= 200.131346
##.OBSERVE NUCLEUS= ^1H
##.DELAY= (6, 6)
##.ACQUISITION MODE= SIMULTANEOUS
##.ACQUISITION SCHEME= undefined
##.AVERAGES= 8
##.DIGITISER RES= 18
##SPECTROMETER/DATA SYSTEM= spect
##.PULSE SEQUENCE= zg30
##.SOLVENT NAME= CDCl3
##.SHIFT REFERENCE= (INTERNAL, CDCl3, 0, 15.7039)
##AUDIT TRAIL= $$ (NUMBER, WHEN, WHO, WHERE, WHAT)
$$ ##TITLE= Audit trail, XWIN-NMR		Version 3.5
$$ ##JCAMPDX= 5.01
$$ ##ORIGIN= Bruker BioSpin GmbH
$$ ##OWNER= she
$$ F:/spectra/data/she/nmr/H-F/1/audita.txt
$$ ##AUDIT TRAIL=  $$ (NUMBER, WHEN, WHO, WHERE, WHAT)
(   1,<2022-02-11 11:31:42.14 +0400>,<she>,<DPX200>,
      <created by zg, POWCHK disabled, PULCHK disabled
       configuration hash MD5:
       00 E9 B6 7A A2 85 ED C7 34 08 36 98 17 FE 4E 26
       data hash MD5: 16K
       52 0D 3F 02 2F 1F 2B 42 6C 36 F8 EA B4 12 31 47>)
$$ ##END=
$$ 
$$ hash MD5
$$ 2C 31 14 FC 1D 1F F4 4C A9 91 7F DC 67 17 BB C4
##$RELAX= 
##$RELAX= 
##$RELAX= 
##$RELAX= 
##$RELAX= 
##$RELAX= 
$$ Bruker specific parameters
$$ --------------------------
##$DU= <F:/spectra>
##$EXPNO= 1
##$NAME= <H-F>
##$PROCNO= 1
##$TYPE= <nmr>
##$USER= <she>
##$AMP= (0..31)
100 100 100 100 100 100 100 100 100 100 100 100 100 100 100 100 100 100 
100 100 100 100 100 100 100 100 100 100 100 100 100 100 
##$AQSEQ= 0
##$AQ_mod= 1
##$AUNM= <au_zg>
##$AUTOPOS= <>
##$BF1= 200.13
##$BF2= 200.13
##$BF3= 200.13
##$BF4= 200.13
##$BF5= 200.13
##$BF6= 200.13
##$BF7= 200.13
##$BF8= 200.13
##$BYTORDA= 1
##$CFDGTYP= 0
##$CFRGTYP= 5
##$CHEMSTR= <none>
##$CNST= (0..31)
1 1 145 1 1 1 1 1 1 1 1 1 1 1 1 1 1 1 1 1 1 1 1 1 1 1 1 1 1 1 1 1 
##$CPDPRG= <>
##$CPDPRG1= <>
##$CPDPRG2= <>
##$CPDPRG3= <>
##$CPDPRG4= <mlev>
##$CPDPRG5= <mlev>
##$CPDPRG6= <mlev>
##$CPDPRG7= <mlev>
##$CPDPRG8= <mlev>
##$CPDPRGB= <>
##$CPDPRGT= <>
##$D= (0..31)
0 1.2 0 0 0 0 0 0 0 0.06 0 0.03 0 0 0 0 0.0002 0 0 0 0 0 0 0 0 0 0 0 0 
0 0 0 
##$DATE= 1644564701
##$DBL= (0..7)
120 120 120 120 120 120 120 120 
##$DBP= (0..7)
150 150 150 150 150 150 150 150 
##$DBP07= 0
##$DBPNAM0= <>
##$DBPNAM1= <>
##$DBPNAM2= <>
##$DBPNAM3= <>
##$DBPNAM4= <>
##$DBPNAM5= <>
##$DBPNAM6= <>
##$DBPNAM7= <>
##$DBPOAL= (0..7)
0.5 0.5 0.5 0.5 0.5 0.5 0.5 0.5 
##$DBPOFFS= (0..7)
0 0 0 0 0 0 0 0 
##$DE= 6
##$DECBNUC= <off>
##$DECIM= 32
##$DECNUC= <off>
##$DECSTAT= 4
##$DIGMOD= 1
##$DIGTYP= 9
##$DL= (0..7)
0 120 120 120 120 120 120 120 
##$DP= (0..7)
150 150 150 150 150 150 150 150 
##$DP07= 0
##$DPNAME0= <>
##$DPNAME1= <>
##$DPNAME2= <>
##$DPNAME3= <>
##$DPNAME4= <>
##$DPNAME5= <>
##$DPNAME6= <>
##$DPNAME7= <>
##$DPOAL= (0..7)
0.5 0.5 0.5 0.5 0.5 0.5 0.5 0.5 
##$DPOFFS= (0..7)
0 0 0 0 0 0 0 0 
##$DQDMODE= 0
##$DR= 18
##$DS= 0
##$DSLIST= <SSSSSSSSSSSSSSS>
$$ [...]
##$SUBNAM2= <"">
##$SUBNAM3= <"">
##$SUBNAM4= <"">
##$SUBNAM5= <"">
##$SUBNAM6= <"">
##$SUBNAM7= <"">
##$SUBNAM8= <"">
##$SUBNAM9= <"">
##$SW= 18.0517287032376
##$SWIBOX= (0..15)
0 0 2 0 0 0 0 0 0 0 0 0 0 0 0 0 
##$SW_h= 3612.71676300578
##$TD= 16384
##$TD0= 1
##$TE= 0
##$TE2= 300
##$TE3= 300
##$TEG= 300
##$TL= (0..7)
0 120 120 120 120 120 120 120 
##$TP= (0..7)
150 150 150 150 150 150 150 150 
##$TP07= 0
##$TPNAME0= <>
##$TPNAME1= <>
##$TPNAME2= <>
##$TPNAME3= <>
##$TPNAME4= <>
##$TPNAME5= <>
##$TPNAME6= <>
##$TPNAME7= <>
##$TPOAL= (0..7)
0.5 0.5 0.5 0.5 0.5 0.5 0.5 0.5 
##$TPOFFS= (0..7)
0 0 0 0 0 0 0 0 
##$TUNHIN= 0
##$TUNHOUT= 0
##$TUNXOUT= 0
##$USERA1= <user>
##$USERA2= <user>
##$USERA3= <user>
##$USERA4= <user>
##$USERA5= <user>
##$V9= 5
##$VALIST= <valist>
##$VCLIST= <CCCCCCCCCCCCCCC>
##$VD= 0
##$VDLIST= <DDDDDDDDDDDDDDD>
##$VPLIST= <PPPPPPPPPPPPPPP>
##$VTLIST= <TTTTTTTTTTTTTTT>
##$WBST= 1024
##$WBSW= 4
##$XGAIN= (0..3)
0 0 0 0 
##$XL= 0
##$YL= 0
##$YMAX_a= 66385
##$YMIN_a= -64081
##$ZGOPTNS= <>
##$ZL1= 120
##$ZL2= 120
##$ZL3= 120
##$ZL4= 120
##$ABSF1= 10
##$ABSF2= 0
##$ABSG= 5
##$ABSL= 3
##$ALPHA= 0
##$AQORDER= 0
##$ASSFAC= 0
##$ASSFACI= 0
##$ASSFACX= 0
##$ASSWID= 0
##$AUNMP= <proc_1d>
##$AZFE= 0.1
##$AZFW= 0.1
##$BCFW= 1
##$BC_mod= 2
##$BYTORDP= 1
##$COROFFS= 0
##$CY= 11.3945322036743
##$DATMOD= 1
##$DC= 2
##$DFILT= <>
##$DTYPP= 0
##$F1P= 2.36226072786647
##$F2P= -0.459571619588291
##$FCOR= 0.5
##$FTSIZE= 0
##$FT_mod= 4
##$GAMMA= 1
##$GB= 0.15
##$INTBC= 1
##$INTSCL= 1
##$ISEN= 128
##$LB= 0.24
##$LEV0= 0
##$LPBIN= 0
##$MAXI= 10000
##$MC2= 0
##$MEAN= 0
##$ME_mod= 0
##$MI= 1.114404
##$NCOEF= 0
##$NC_proc= 0
##$NLEV= 6
##$NOISF1= 3.799351
##$NOISF2= 2.8
##$NSP= 1
##$NTH_PI= 0
##$NZP= 0
##$OFFSET= 15.70392
##$PC= 1
##$PHC0= -16317.21
##$PHC1= 21.40078
##$PH_mod= 1
##$PKNL= yes
##$PPARMOD= 0
##$PSCAL= 0
##$PSIGN= 0
##$REVERSE= no
##$SF= 200.130013532006
##$SI= 16384
##$SIGF1= 3
##$SIGF2= 2
##$SINO= 400
##$SIOLD= 16384
##$SREGLST= <1H.CDCl3>
##$SSB= 0
##$STSI= 0
##$STSR= 0
##$SW_p= 3612.71676300578
##$SYMM= 0
##$S_DEV= 0
##$TDeff= 0
##$TDoff= 0
##$TI= <>
##$TILT= no
##$TM1= 0
##$TM2= 0
##$TOPLEV= 0
##$USERP1= <user>
##$USERP2= <user>
##$USERP3= <user>
##$USERP4= <user>
##$USERP5= <user>
##$WDW= 1
##$XDIM= 8192
##$YMAX_p= 0
##$YMIN_p= 0
$$ End of Bruker specific parameters
$$ ---------------------------------
##NTUPLES= NMR FID
##VAR_NAME=  TIME,          FID/REAL,        FID/IMAG
##SYMBOL=    X,             R,               I
##VAR_TYPE=  INDEPENDENT,   DEPENDENT,       DEPENDENT
##VAR_FORM=  AFFN,          ASDF,            ASDF
##VAR_DIM=   8192,          8192,            8192
##UNITS=     SECONDS,       ARBITRARY UNITS, ARBITRARY UNITS
##FACTOR=    0.0002768,     1,               1
##FIRST=     0,             0,               0
##LAST=      2.2672688,     0,               0
##MIN=       0,             -64081,          0
##MAX=       2.2672688,     66385,           0
$$ Real data points
##PAGE= N=1
##DATA TABLE= (X++(R..R)), XYDATA
0@%%%%%%%%%%%%%%%%%%%%%%%%%%%qJ6j6J6j6J6j6J6j8K6l2L2l2L6m4M8m9N5o2
$$ 0 0 0 0 0 0 0 0 0 0 0 0 0 0 0 0 0 0 0 0 0 0 0 0 0 0 0 0 -8 8 -8 8 -8 8 -8 8 -10 16 -16 16 -16 20 -24 24 -25 30 -32
46c2O9p7Q4r2J01j11J22j33J47j64J83k07K35k67L06l54M19n09O35q32J168j842
$$ -32 37 -40 44 -48 53 -58 64 -69 78 -86 97 -110 125 -142 164 -190 229 -280 355 -477 691 -1151
68a151L678j7200m9408O4677N8096n1863n3810L3960M3415j2523k9158q543J1584
$$ -1151 2527 -14673 -64081 596 58692 6829 -46981 -13021 30394 17871 -11287 -19830 -8246
81h246K8244O288m3623k3467N3980L7197n8113m6774N6414N0690m9130m9274L7849
$$ -8246 19998 26286 -17337 -40804 13176 50373 -7740 -54514 1900 52590 3460 -45814 -7965
94g965M2525k3717l1717Q756J8021N697l288j8026j0958K7446K3103l3152l1915
$$ -7965 34560 10843 -20874 -12118 5903 11600 8312 -9714 -20672 6774 29877 -3275 -35190
107c5190L5146L6627l3557l6974K9125L3201k2622k6086J4984J6624p222o223
$$ -35190 -44 36583 3026 -33948 -4823 28378 5756 -20330 -5346 11278 4056 -2167
119b167J4l882N904J2562j0326j8916J3080K2380j4273k2841J4157K0585j3014
$$ -2167 -2153 -6035 -131 12431 2105 -16811 -3731 18649 4376 -18465 -4308 16277 3263
132C263j6178J1276J0418r124m195O965j664m837O500K861r800j108J1407m66
$$ 3263 -12915 -1639 8779 -345 -4540 2425 761 -4076 2424 5285 -4515 -5623 5784 5318
146E318j1344J874R792l146p195M183M052n103p89N701k145n958M342N856n614
$$ 5318 -6026 -4152 5640 2494 -4701 -518 3534 -1569 -2358 3343 1198 -4760 -418 5438 -176
161a76n377N944M544n333l414M042K071k223n98K32q16J684K020l252k925M285
$$ -176 -5553 391 4935 -398 -3812 230 2301 78 -520 -288 -1104 580 2600 -652 -3577 708
177G08L427m699l596M493L435l799l026K632K408j191j757l45J146J836o51l092
$$ 708 4135 -564 -4160 333 3768 -31 -3057 -425 1983 792 -965 -1310 -164 1672 1021 -2071
193b071L26M044j23m583P6M703m8m372J3L676J13k637l72J382P35Jj261j392J792
$$ -2071 -1745 2299 2176 -2407 -2331 2372 2324 -2048 -2035 1641 1754 -883 -1255 127 862 863 -398 -1790 2
212BK653k335l722K746M424k966m762K915M693k556m209J886L380r47k234j31
$$ 2 2655 320 -3402 -656 3768 802 -3960 -1045 3648 1092 -3117 -1231 2149 1202 -1032 -1163
228a163R11J321M96k429j774L362K861l986l599M222L953m063l972L517L576k629
$$ -1163 -252 1069 1565 -864 -2638 724 3585 -401 -4000 222 4175 112 -3860 -343 3233 604
244F04k895J485J960k24r60j057m4K175R09l045j576L616J976l773k119L625K011
$$ 604 -2291 -806 1154 930 -30 -1087 -1131 1044 1953 -1092 -2668 948 2924 -849 -2968 657 2668
261B668l079j712K317J290j357q04L37L26O74L2j539k58K155L36k544k82K629
$$ 2668 -411 -2123 194 1484 127 -677 -340 -14 660 692 -847 -1105 1050 1386 -1158 -1440 1189
278A189R8k474J32K067l61j502N61Q10o40q6O04n74m01J124Q1j477L30J644p75
$$ 1189 1287 -1187 -1055 1012 651 -851 -290 520 -120 -206 398 -176 -577 547 628 -849 -519 1125 350
297C50j570J191J306j521r04J727L69j770J62J620o82j318J072Q76j339l13J389
$$ 350 -1220 -29 1277 -244 -1148 579 948 -822 -660 960 278 -1040 32 908 -431 -744 645
314F45k62j238Q36R08j336m20J733j16j986P18K083j225k017J641J804j865j458
$$ 645 383 -855 -19 889 -447 -867 866 750 -1236 -518 1565 340 -1677 -36 1768 -97 -1555
331a555J862R89j652m49J186j24n89O76j51j219Q98J660j579j984K100K164k407
$$ -1555 307 1296 -356 -805 381 257 -332 344 193 -1026 -128 1532 -47 -2031 69 2233 -174
348a74k168K445K048k225j710J751J276j061o84K49P1N89O07j377j234K001J747
$$ -174 -2342 103 2151 -74 -1784 -33 1243 182 -502 -253 -182 407 1014 -363 -1597 404 2151
365B151k404k139K528K337k384k388J994K158j381j770O15J222J70n60r08j42
$$ 2151 -253 -2392 136 2473 89 -2299 -305 1853 472 -1298 -683 539 709 149 -759 -901
381i01J505Q64j921j435K108J852j982k110J698K132j230j933O66J564r6j057
$$ -901 604 1468 -453 -1888 220 2072 90 -2020 -322 1810 580 -1353 -687 877 781 -276
397b76m37M75Q53R4j114o26J190J009j110j264Q86J332n58j249K06J061J35p63
$$ -276 -713 -238 615 709 -405 -1031 159 1168 58 -1206 -320 1012 454 -795 -589 472 607 -156
415a56l95M44N58j24n75j17M56K97k60l84nL50K91k65n30J11P01L7p86j54P28
$$ -156 -551 -107 451 327 -248 -365 91 388 128 -256 -261 89 380 115 -415 -304 397 434 -352 -506 222
436B22J87n37j72K61Q1O3J17m13l20P55N38j002p00J159Q14j200p95J112O79r16
$$ 222 409 -128 -300 -39 42 105 222 -191 -511 244 782 -220 -920 239 1053 -147 -942 170 849 -67
456f7m53N91J58k65K00j31n45M73Q48p92j071J024J151j178j110J233R35j183
$$ -67 -520 71 229 -36 164 33 -512 -39 809 17 -1054 -30 1121 -57 -1167 66 1001 -182
474a82o34J041K90q10R0N78m55k80P55Jr44K84J015n37r62P64P76r45n26J054
$$ -182 -816 225 515 -295 -205 373 -82 -362 393 394 -550 -266 749 212 -750 14 790 -155 -681 373
494C73K09j123R2J107l71j025N49Q71o62o40O63L48n54l2M01l08j68O38l1r29
$$ 373 582 -541 -449 658 287 -738 -189 682 20 -620 43 391 -163 -195 206 -102 -270 368 337 -592
514e92K21J150l44j255L93J301l99j189L02R67j43o85k8L13J85O5l34m13L98P39
$$ -592 -371 779 435 -820 -427 874 475 -714 -412 555 412 -273 -301 12 197 262 -72 -485 -87 652
534F52m45r36L62J066k55j053R8R62Q3p69k53N26M08k54m97oN37J98n13l40M12
$$ 652 207 -729 -367 699 444 -609 -511 451 534 -235 -488 38 446 192 -305 -311 226 424 -89 -429 -17
555a7L99k75m05J15L42M1k49j94J52L14o5m01K5M57j9m55Q7M35j84l89L13L30
$$ -17 382 107 -298 -183 159 200 -49 -243 -91 223 158 -243 -218 239 220 -235 -148 287 103 -286 27 357
577C57m36k38N24J40n50m8N00n2l83J51J51k39Q0L34l80m36O73M93r23n13J083
$$ 357 -79 -317 207 347 -203 -251 249 197 -186 -35 116 -123 -43 291 -89 -525 148 641 -282 -795 288
598B88N14j124m59J062L68q54k31N91N1k19J49j53l39N05N35q41o62J073P19j191
$$ 288 802 -322 -781 281 649 -205 -436 155 206 -13 136 -17 -356 149 684 -157 -819 254 973 -218
618b18p29J181O33j092m48Q63K11n85M1K60k91N0N29l48o99O09P58p54p44Q49
$$ -218 -947 234 867 -225 -673 190 401 -184 -143 117 -174 -124 405 57 -642 -33 725 -29 -773 76
638G6O46q38m33P57J96o37Q5M77l38l22N53J66o99k8P24r8o63J83M99k50k69K85
$$ 76 722 -116 -549 208 404 -233 -148 329 -9 -331 222 388 -311 -339 385 287 -376 -193 306 56 -213 72
660G2J7l23K68L37n01l54O83L66p57l62P41L51o23l00L92K50j08j99j77J04M51
$$ 72 89 -234 34 371 -130 -484 199 565 -192 -554 187 538 -85 -385 7 257 149 -50 -227 -123 328
681C28oo88j22Q46K15r00l11Q41L93o74m33M22M50j23m13j95L76N00k85p41J70
$$ 328 322 -366 -488 358 573 -327 -638 203 596 -78 -511 -89 361 238 -175 -370 6 506 221 -520 -350
702c50R28o4r88n5R51J42q08k31N81K78l02l20rK97L13k79o05K68Q06k33r28K01
$$ -350 578 514 -474 -529 422 564 -244 -475 106 384 82 -238 -247 50 363 84 -521 -253 553 320 -608 -407
724d07R57j26r13Q7P81j6n70j7L11O9k1j11k67J57N15j76p51K27Q60k25r42K12
$$ -407 550 424 -489 -402 379 363 -207 -224 87 156 135 24 -243 -86 429 253 -498 -271 589 364 -578 -366
746c66R26k06q29J50O54j08m15M8J27J9J44n3m00R0O41j11p98J22Q78r4q77O9
$$ -366 560 354 -475 -325 329 221 -194 -146 -19 0 144 91 -309 -219 422 311 -487 -365 513 419 -458 -389
768c89Q01m6o28QM15J0j65k8q1pL12N5n20j02O41J64p20k07O94K55o21k52M82
$$ -389 412 366 -262 -254 161 171 6 -22 -103 -110 202 257 -263 -365 276 440 -280 -487 207 462 -159 -411 71
791G1K26k83j80J03R4P7L5k26j95L51L40m12m74M22N58l84o10L13N87k34m91J10
$$ 71 297 14 -166 -63 31 108 143 -83 -278 73 413 1 -473 -51 507 123 -487 -174 413 179 -312 -202
813b02L91m2k07k7%O3K21o2m22N7N94k8p10K7P64j0p53J3O79n4n40Q5L59j40j71
$$ -202 189 147 -60 -87 -87 -24 197 135 -287 -230 364 336 -374 -347 417 407 -346 -333 346 292 -248 -163 196 56 -115
838a15J95m4k49K30K71m31k52N76K08o88j03P46op60J49P31k76o35L83N28m59
$$ -115 80 36 -213 17 288 -143 -395 181 389 -299 -402 344 338 -422 -273 458 182 -453 -70 458 -1
859al62N00J56m35L3L51k65k11M82Ro71J76Q16l48r25M62R65n64r04N39Q05m84
$$ -1 -363 137 293 -142 -109 242 -23 -234 248 257 -414 -238 578 230 -695 -233 732 168 -736 -197 608 124
881A24o03L69L44j99k7J6k99J68O37l32r05M48J129n06j243N14J213m16j111K99
$$ 124 -479 -110 234 35 8 24 -275 -107 530 198 -707 -259 870 364 -879 -365 848 432 -679 -380
901c80Q67j46n38j8J32J67K79l05o66L74J002l99j220L75J299k78j262J69J091
$$ -380 487 341 -197 -215 -83 84 363 58 -608 -234 768 369 -851 -476 823 545 -717 -548 543
920E43m5p86o6M13J58j8k25l60K35O93k15r35J46J077q4j073nR59O8p26j30M41
$$ 543 498 -288 -354 59 217 199 -26 -386 -151 542 327 -608 -462 615 531 -542 -547 412 480 -246 -376 65
942F5J59j27j34j87J04M38j9o37m5P38J20p33j79O31K14m62k20K63J53m7p8j69
$$ 65 224 97 -37 -224 -120 318 299 -338 -383 355 475 -258 -437 194 408 -54 -274 -11 142 95 17 -152
964a52k9L43J14m43k25M77K90m16l38L25L36j90k73J1J93J51m9k93m0L48J89l74
$$ -152 -181 162 276 -167 -392 85 375 -41 -379 -54 282 92 -181 -170 23 174 125 -168 -208 140 329 -45
986d5k87L50L43k45l97J31L70K2l34j65K30K86j26l74nM05J08l84k03L11K93k04
$$ -45 -332 18 361 116 -281 -150 220 242 -92 -257 -27 259 133 -241 -246 159 267 -117 -320 -9 284 80
1008H0l27O2L40P6k99k03K47L15j75l67J11L77k8l44l2K65Q3j81j26N9J56M6j50
$$ 80 -247 -185 155 231 -68 -271 -24 291 116 -251 -140 237 209 -135 -167 98 181 0 -126 -67 89 135 -15
1031a5j52J42K22j44k68J33K86j29k54J36J77j25j00J23K0j12O3Q7j29o0J75O
$$ -15 -167 -25 197 53 -215 -82 204 75 -179 -43 134 9 -91 32 52 -60 3 90 -39 -99 76 82
1053H2j90O3J65j20j33J76Q9k53j5L04o3l29J28L16j60k77J92K05j74j25J63j3
$$ 82 -108 -45 120 0 -133 43 132 -121 -136 168 105 -224 -96 220 60 -217 -25 180 6 -119 44 31
1075C1r1J39L0k56M1L58j08m39J62M77k33m39K38L81k42k99K17J58j65qJ03j60
$$ 31 -60 79 109 -147 -106 252 144 -295 -133 344 111 -328 -90 291 49 -250 -33 125 -40 -48 55 -105
1097a05j0K97p9m00J67M69k29m85K86M64l04l94L15K83k83j49K33jj66J50Q0k88
$$ -105 -115 182 103 -297 -130 339 110 -375 -89 375 71 -323 -8 275 -8 -157 76 75 -91 59 139 -149
1119a49L4L59j37m14K38M04l22l70L76K79l95j84L98N6l53O6K99j75j88K58O9
$$ -149 -115 244 107 -307 -69 335 13 -357 19 298 -97 -281 117 173 -180 -114 185 10 -178 80 149
1140A49k96O6K99j86k70L06K14l97j25M60K4m94O2M83j42m31J98L18j96k23K00
$$ 149 -147 -81 218 32 -238 68 282 -115 -240 220 244 -250 -188 295 153 -278 -80 238 42 -181 19
1161A9O1j55J00R0k57pL84o9m97J68N36k03n65K39N20k19m40J70L12q7j64Nj9
$$ 19 80 -75 25 115 -142 -149 235 166 -331 -163 373 170 -395 -156 364 145 -295 -125 187 100 -64 -59 -78
1184g8J00J87j84l46K57M67l12n37L22N81k98n46K23M65j15l49J0J85J11%k30
$$ -78 22 209 25 -321 -64 403 91 -446 -124 457 159 -387 -164 301 186 -163 -153 32 143 143 -87
1205h7j61L10L04l60m29L82M95l62n27K99M95k05m10O9K97N0j56j71rK78J67l35
$$ -87 -248 62 366 6 -423 -41 454 92 -435 -136 359 154 -256 -187 110 160 4 -167 -176 102 269 -66
1227f6l00L85L83l73m26L40M24k51l74J66K82n4j61o2K9J55R7k48k16K95K90l14
$$ -66 -366 19 402 29 -397 -57 367 116 -258 -92 190 136 -25 -87 -58 97 194 -54 -270 25 315 1
1249Al42K93L56k72l05K10K20j24j31N0QK6J02q4j96J45K59j60k95J98K90j98
$$ 1 -341 -48 308 36 -269 -59 161 37 -94 -44 -36 -10 92 8 -188 -43 216 56 -239 -41 249 51
1271E1k51J87J91j50j17J18Lp4Q5L6j70j0K42m1k58M6K76o5k62R5J85r7j25J19
$$ 51 -200 -13 178 28 -89 29 32 -42 43 79 -91 -101 141 100 -158 -112 164 99 -163 -68 117 20 -105 14
1295A4M2j07L4J06j21r5J82R1k29o5K29N5k40k1K17lj69K7J30p9l6Q4k4r5P8J20
$$ 14 56 -51 -17 89 -32 -127 55 146 -83 -148 81 136 -104 -125 92 89 -80 -53 77 -2 -38 46 22 -73 5 125
1321A25j28j17J53J27j90j07J88R7j77q2J67M0j32j6R6k9n4M7K0r3K3J26o8j49
$$ 125 -3 -120 33 160 -30 -137 51 148 -29 -111 56 96 -36 -52 44 15 -39 8 28 -65 -42 84 16 -133
1345a33R1J69j14j65J39J29j12j17J38P7j22j8R1j3j02Q7Q1j29n9J80K2j92oK08
$$ -133 -42 127 13 -152 -13 116 4 -113 25 102 -20 -38 53 40 -62 25 106 -23 -82 98 120 -72 -78 130
1369A30l5k05O3J53r2j09J12M4j31J2J55p7j66J30J77k00j58K29J43k21j05K06
$$ 130 95 -110 -47 106 14 -95 17 61 -70 -58 97 20 -146 -16 161 -39 -197 32 175 -46 -151 55
1391E5N5j56NJ04p2k0J31m4j85Q8K44j49k77J80K81j91k65J80K10j41j54R4O2
$$ 55 110 -46 -41 63 -9 -29 102 58 -127 -39 205 56 -221 -41 240 49 -216 -36 174 33 -121 -27 35
1414C5l8M1pj47O2K31r8k99J27L38j31l52J23L21r6k52N6J79l6p2km7L5J53m9
$$ 35 -3 38 31 -116 -54 177 79 -220 -93 245 114 -238 -115 206 110 -142 -86 93 57 -15 -17 -64 -29 124 75
1439G5k42N9L02o2l13M3L05mk86J3J97Kj05rJ2jQ4Lj57j4K20J1k37l6K21N0j97
$$ 75 -167 -108 194 132 -181 -138 167 163 -123 -110 87 89 -16 -25 -13 -14 70 73 -84 -98 122 133 -104 -140 81 131 -66
1466f6n0J45J9o0plj6N7N1j00q1J37R6j38j02J31R8r3p9N4M8Opm4m6P0Q4q5j24
$$ -66 -116 29 48 -12 -19 -22 -38 19 70 -30 -111 26 122 -16 -118 13 111 18 -61 -7 41 47 40 -4 -50 20 104 19 -105
1495a05Q7J45p2j47K4J23J0j04m3O7O7Oj07o4J15R8q2j45O9J71l0j69lJ45N8r7
$$ -105 -18 127 55 -92 -68 55 65 -39 -82 -15 52 58 -49 -113 2 100 18 -127 -58 113 83 -86 -89 56 114 17
1521A7r9N8J17J2j32o4J12J08q9j53N4J66j8j55l9J32Q2j00j11N1J15J2j20n9
$$ 17 -82 -24 93 105 -27 -91 21 129 40 -113 -59 107 89 -66 -105 27 109 9 -102 -51 64 76 -44 -103
1545a03J00R1n7j21J8J29L1j19p5R6J09o4j18L4J09J5j09l8O5P5l1p7qO6O8o6
$$ -103 -3 88 31 -90 -72 57 88 -31 -106 -10 99 35 -83 -49 60 75 -34 -72 -7 68 37 -40 -48 18 86 20
1571B0r0L2J22Qj54j5J27M5j10n4P2N5j7n9k5K4Q0nj37j3J56M6j85o1J77Q2j63
$$ 20 -70 -38 84 92 -62 -77 50 95 -15 -69 3 58 41 -18 -43 -19 61 56 -81 -94 62 108 -77 -138 39 121 -42
1598d2q3J36O2o2l9JJ1O1J0r3o3J64Q6j91j01K07J09k09r8J76Q5j43n2Q8Mk9K4
$$ -42 -125 11 73 11 -28 -27 -16 45 55 -38 -101 63 149 -42 -143 64 173 -36 -134 42 127 -16 -68 20 24 -5 19
1625A9m6o3J15Q8j64j05J94J09k12j09K19J02k01o3J70L1j30K0N9m5J7P0n6r9
$$ 19 -27 -90 25 113 -51 -156 38 147 -65 -174 45 147 -54 -117 53 84 -46 -26 33 -12 5 75 19 -80
1649h0J16J13j71j18K01J05k19q3K17M4k06jJ56l3j17O6N3q9OJ09o4j04J14R3
$$ -80 36 149 -22 -140 61 166 -53 -136 81 125 -81 -82 74 41 -76 -10 43 -46 -40 69 5 -99 15 108
1673A08j61p1J99L8k08j3K20j8k00N0J59n8j33Q6O0p5mQ0n9n6J12J7j48PJ84l9
$$ 108 -53 -124 75 113 -95 -108 112 94 -106 -56 103 45 -88 -2 58 -17 -21 59 0 -56 56 73 -75 -68 116 77
1699G7k02O2J90n7j76P0J48p3j06O1K5j1J6or1M0J29n4j72O7J98p9j87N3J88l7
$$ 77 -125 -63 127 70 -106 -36 112 39 -67 -6 19 8 24 18 -73 -33 96 42 -130 -63 135 56 -131 -78 110 73
1725G3j57J5J24kn3k9pN2Q1q1j13Q5J47o0j79N0J79m8j47LJ11L3q1m1jP4M2r7
$$ 73 -84 -69 55 53 0 -29 -36 16 97 16 -97 -12 135 75 -104 -54 125 77 -70 -67 44 77 -4 -45 -46 28 70 -27
1753b7p5P0J27p3j43N1J51k9j25J0Q9K8n1l7j2O1O9o1j01O1J24l9j34J8J32j5
$$ -27 -102 -32 95 22 -121 -70 81 52 -73 -63 26 54 3 -34 -46 15 84 23 -78 -17 107 68 -66 -48 84 69
1779F9r4j0M8K1mk5o5L7J01k5j44K0J51Lj48j1J25K0r3k4L6K9K4k2q6J5J25J4
$$ 69 -25 -35 13 34 30 5 -60 -23 78 53 -91 -71 80 83 -65 -76 49 69 -24 -48 -12 17 41 19 -67 -52 73 87
1807H7j59l4J82M9j73o9J44P9j01o5L7N4K2j7r2PJ24L6j61q9J91J14j92j05J38
$$ 87 -72 -106 76 125 -48 -117 27 106 5 -60 -23 31 53 36 -56 -49 75 111 -50 -139 52 166 -26 -131 7
1832GJ14j01j14N5P9Pl6p1J2J03L9j42p3J46J15j37j44J28J54j09j31N4J23j9
$$ 7 121 20 -94 -39 40 47 11 -60 -48 55 94 -48 -121 25 140 3 -141 -13 141 32 -99 -45 78 59
1856E9p0k5L2M9K9r1o3J04R4p9j37Q5J45p9j39M2J25k4r9lM7L5l0l5l2N4N6m7
$$ 59 -11 -36 -4 45 74 -17 -80 24 118 39 -98 -13 132 53 -86 -44 81 57 -42 -45 2 37 7 -28 -60 -6 50 3
1884Cr4N4J20m0j14J9J30k6j03MQ8J1m5k1J7J8K4l2m8L2O2j3r4PJ10j2r7%Q2N
$$ 3 -91 -37 83 43 -71 -52 78 52 -51 -47 41 52 7 -14 3 21 45 13 -35 -3 59 46 -48 -41 69 57 -40 -40 42 47
1914D7p5k7N3K5jm1oK4K9j4o0PQ6rp5rP8J9o2l5O7L1n1k8K0L2J6l3l2J8M9lo8
$$ 47 -28 -55 -2 23 22 -19 -25 -1 28 14 -46 -39 47 38 -37 -46 32 51 -11 -46 21 52 1 -27 -7 25 41 8 -24 -6 43 40 -28
1947b8PN6K0o7m1O0M8n6m5L3M8j2l0k2J6L9j0n0pO1K7o7m0N4M7l7m7L1M0j2l3
$$ -28 -21 35 55 -12 -53 7 55 -1 -46 -13 35 23 -7 -29 -13 26 16 -34 -41 20 47 -20 -60 -6 41 4 -43 -12 28 16 -17
1978a7nK6K7mm4pM6L1m2m2L1N2l5l6J8K2J5k4k6KL7Qm8l3M9L7m0l9J6M8k8k8P
$$ -17 -22 4 31 27 -17 -24 22 53 11 -31 0 52 17 -19 -1 21 36 12 -14 -12 25 33 -15 -48 1 38 -2 -41 -25 23 -5 -33 -26
2011b6J9K4jk7j6L4M4k9n3K5N4j4n7J4M9j4l1jJ4K3lj9k8K3L2j5o3J3N3Oo2j7
$$ -26 -7 17 16 -11 -27 7 51 22 -31 -6 48 34 -23 -9 40 26 -5 -6 8 31 28 9 -19 4 36 21 -42 -29 24 30 -32 -49
2043d9N8K4m2k6K2K7kj4k3K1L4om4j0N3K3m6l0M9J7k5l3K7J8nj6j3OK8%k8j8M2
$$ -49 9 33 -9 -35 -13 14 12 -2 -25 -4 30 24 -20 -30 23 46 0 -30 19 36 11 -22 5 23 18 2 -11 -5 23 23 -5 -23 19
2076A9K4k9m4K0M2k0l0j0L2J3k9j7J7K1Jk8j2K0L0rm3KM7J0m6qL2L2l7j7J8J4
$$ 19 43 14 -30 -10 32 12 -18 -28 4 17 -12 -29 -12 9 10 -18 -30 -10 20 11 -32 -30 17 27 -19 -27 5 37 0 -17 1 15
2108A5Loj8OJ9Rl3j8M5J8l7l8L4O3m8n8K0M7nm6KK4Rj3j2qJ8K9j3n2K6O5k8p7
$$ 15 18 12 -6 0 19 28 -5 -23 22 40 3 -35 -1 62 14 -44 -24 23 18 -28 -26 -2 7 -6 -18 -26 -8 21 8 -44 -18 47 19 -58
2142e8L6P6k6o8L3M8k1k6jJ6LJ8j3m1J1O4l2p9L1R9l7r4K7P6j9o3QM9j5j9J5k8
$$ -58 -22 54 28 -40 -7 41 20 -6 -7 9 12 30 17 -24 -13 51 19 -60 -29 70 33 -61 -34 42 23 -40 -32 17 2 -17 -2 -30
2174c0J7L3jo9J3R1j6r9J5R6j6p9K6N0ql6RJ9j6PK2m1k4P0J1p6mP9Nq9PQ1l5m4
$$ -30 -13 20 19 -50 -37 54 38 -61 -46 50 34 -45 -19 31 23 -13 -4 15 -1 6 28 -13 -37 33 44 -32 -36 43 48 -41 -34 47 12 -32
2208c2L0L0l7j1L5k0m1L3M1n1j7N2J7p3J0O1j7n1L3M2m1k9M8J5m9NN8k3l5K3L4
$$ -32 -2 28 -9 -20 15 -5 -46 -13 28 -23 -40 12 29 -44 -34 27 10 -41 -8 34 -7 -36 12 27 -22 -17 41 18 -17 6 40
2239D0l6k3N5j5m3K0M2m5l6L9L7n9k0N6Rn5J5K8j6k8K2K4l4KM1k4l2M8L3n0m2
$$ 40 4 -19 36 21 -22 -2 40 -5 -41 -2 35 -24 -44 12 21 -34 -19 9 -7 -35 -13 11 -23 -21 20 -4 -36 12 45 -5 -47
2270d7P1J5n7JM6Jm0J9J8k4NK3j3m1K0L5l8k9L8K8m1k5M0Jk9J5J8l0LL3j2l4M
$$ -47 24 39 -18 -17 29 30 -10 9 27 3 8 31 18 -23 -3 32 -6 -35 3 31 -10 -35 5 6 -23 -8 10 -20 -17 16 4 -30 -26
2303b6N2j0m2J5L2j2j7J8j0lK3J3m7j0N6Om8k5N8K5n3j7L3J4j9rqNK8%m9rN2K3
$$ -26 26 16 -26 -11 21 9 -8 10 0 -3 20 33 -14 -24 32 38 -10 -35 23 48 -5 -22 11 25 6 -3 -11 -6 22 22 -27 -36 16 39
2337C9o3k4N5L5m9n1M9K7j4k5j6K7L9jo3LO1L8q4l4O3M7l7n6L2N1j3o0nM8L0k3
$$ 39 -24 -48 7 42 -7 -58 -9 18 4 -21 -37 -10 29 28 -35 -32 29 67 -17 -51 12 59 22 -34 -2 49 36 -24 -29 19 49 26
2369B6m6k0O3K6o2n0O0N7m5p3K4P6oo6j8N7L7m6m0J6N0J5n5k6L6O3k1o8PO7Rn6
$$ 26 -20 -40 23 49 -13 -63 -3 54 9 -64 -40 36 30 -36 -54 3 40 -6 -46 -30 20 35 -20 -46 -10 53 32 -36 -29 38 47 -9
2401il3N5L7k9n4J2O1Pn4l8M2M8k7n7j5P0J7n2m2M3O9l8n6J5N1J2n1k8K5N1jo2
$$ -9 -42 13 50 21 -33 -21 40 47 -7 -45 -3 45 18 -39 -54 16 33 -19 -61 -18 51 13 -43 -28 23 35 -16 -44 -19 32 31 -31
2433c1lO4J8m0n7M1P1k8o9J0N4J2m8l4L7L3jm8j4M9L5l9m5K1N8k2n8kN7J5m6l7
$$ -31 -34 30 48 8 -49 -8 63 35 -34 -24 30 42 -6 -40 -3 30 29 -19 -33 16 51 12 -33 -12 46 24 -34 -36 21 36 -10 -47
2465d7L2M6k1l3jK4L8m2m2K0N4Kn2j8O9K2o1k2M3L7k1n1NM7J0k7k8J6M1qo0nN4
$$ -47 -15 31 10 -23 -24 0 38 -4 -46 -26 28 30 -22 -40 29 51 -10 -32 11 48 27 -24 -19 28 38 11 -17 -1 40 32 -28 -33 21
2498B1J6m7l1K9M6k7l5%L6J5k9k8J9K0J4l0k6L8L2j8n3K7M8nm9J1L4J8l4k0NK2
$$ 21 37 -10 -41 -12 34 7 -28 -28 8 23 -6 -34 -15 5 19 -11 -37 1 33 15 -38 -11 37 32 -17 -6 28 46 12 -8 -3 19
2530A9Jk4j6K2L4k1l6RL6%m3j1L7J7k3k9J9J4Nl1qJ8K5kl3rM4Lk3j7K5K8j5l9
$$ 19 20 -4 -20 2 36 15 -21 -12 24 24 -19 -30 7 24 1 -28 -9 5 10 -21 -29 -11 14 12 -21 -30 14 17 -6 -23 2 30 15 -24
2564b4J5L6j1nj3QORk8lK1J2j5j5%K8nl9PK9ooj8LJ4Mj2j3J5L2k1l6J4K0J1l1
$$ -24 -9 27 16 11 -2 6 12 21 -7 -10 11 23 8 -7 -7 21 16 -23 -16 13 7 1 -17 -14 0 4 -8 -21 -6 26 5 -31 -17 3 14 -17
2600a7LJ7Omj6NJ8Moj3QJ9jk8lK2Nj6pLK7j5j3rQJ0ok2OJ4Kj0k2J8J3rp%K3Lj4
$$ -17 -14 3 9 5 -11 -6 12 16 10 -3 5 24 23 -5 -8 14 19 3 -4 -1 26 11 -2 -11 -3 7 1 -21 -15 -1 1 -9 -31 -13 0 -9 -16 -16 7 10 -4
2641dmJ2J%mnPK0kk6QPPj5N%OlrOLqQk3NJ2j0qnJ1RrqKJ0Oj0lQJnJ0n%J9j5j2
$$ -4 -8 4 5 5 1 -4 3 23 21 -5 3 10 17 2 7 7 13 10 1 7 10 2 10 -13 -8 4 -6 -14 -19 -8 1 -8 -16 -14 -4 2 -8 -11 -3 -2 -7 3 -2 -2 17 2 -10
2688a0J4J4oj2KJ2pKrJJ8j2Oj0nQmmj7J5J1j1j1RRj0Pj3PO%KmrJ5Rk6J4%NqPK
$$ -10 4 18 12 0 2 14 7 9 0 1 19 7 13 3 -2 6 2 -2 -19 -4 7 -4 -15 -6 3 -7 0 -13 -6 0 0 2 -2 -11 4 13 -13 1 1 6 -2 5 7
2731GNnlKM%oj7PK4rj2j2K8%qk6J1J6j0%Jj3J7Jj7OLJ0k2mJ7J8ok2J1J9j2rJ3
$$ 7 12 7 4 6 10 10 4 -13 -6 18 9 -3 -15 13 13 5 -21 -10 6 -4 -4 -3 -16 1 2 -15 -9 -6 4 -18 -22 -5 13 7 -15 -4 15 3 -6 7
2771GoRlj8J2J3Rj2k7K2K0j5j7lK5mj8JnJ0kpj8J8K2k0k1QL6j0k9jL2%j6j1J9
$$ 7 1 10 7 -11 1 14 23 11 -16 6 26 11 -6 -9 16 12 -6 -5 -10 0 -2 -9 -27 -9 13 -7 -28 -20 16 6 -23 -24 8 8 -8 -19 0
2808@NpJqJ8J4rj4oK8Jk0j0K4J2l3pJ9NmloKQoj1pK2J2l2j5K8J9k8j3J6RjrMj
$$ 0 5 -2 -1 -9 9 23 14 0 -6 22 23 3 -7 17 29 -4 -11 8 13 9 6 0 2 10 4 -7 -14 8 20 -12 -27 1 20 -8 -21 -5 4 3 -6 -2 -3
2849cMQJj2QJ4nk5J2K3j7j5QJ1mj5J6MplkkKJ1Kk5lJ1Qk5jK2Kk2OJ1nnoJ6rKJ7
$$ -3 1 9 10 -2 6 20 15 -10 2 25 8 -7 1 12 8 -7 9 13 6 3 1 -1 1 12 14 -11 -14 -3 5 -20 -21 1 3 -19 -13 -2 -7 -12 -18 -2 -11 -9 8
2892HnjMJ3k9J5%JPpJ0j4KLJ3j1j5J0lJj5QJLk%j3NJ4mj6J7Mj0pLK2pk0PJ7pp
$$ 8 3 2 6 19 -10 5 5 6 13 6 16 2 4 7 20 9 -6 4 1 2 -13 -5 -4 -1 -3 -3 -16 -11 3 -1 -17 0 4 -6 -13 -10 12 5 -15 -8 9 2 -5
2935eJ2OpRj3OQJlk4J0K3qj9lJ7Qj8j5K9j3rRpNNLk3LJ9pk2OK5J0l0NJ4jjj6O
$$ -5 7 13 6 15 2 8 16 17 14 -10 0 23 15 -4 -7 10 18 0 -15 14 1 -8 1 -6 -1 4 7 -16 -13 6 -1 -23 -17 8 18 -12 -7 7 6 5 -11 -5
2977eJ4Qkj7LK1Ll1jK3Rk9oJ2J8rj5nK0J2j1j8oK0Rl6j2L3Qj9k0K4J6j0j3KJ1
$$ -5 9 17 15 -2 1 22 25 -6 -7 16 25 -4 -10 2 20 11 -4 -9 11 23 12 -6 -12 8 17 -19 -31 2 10 -9 -29 -5 11 1 -12 -10 1
3014AJ5j0rj9L0Qj5j2K7J3j5k0RJ2j0mmOJ5Nk1j3K0J0l1j4J5J4%j2j5K6jkj0R
$$ 1 16 6 -3 -22 8 16 1 -11 16 29 14 -6 3 15 5 1 -3 3 18 23 2 -11 9 19 -12 -26 -11 3 3 -9 -24 2 1 -1 -11 -2
3050bN%j1j1J3K3pk3JL5j2j5kK1Qk4lJ2PKj2j1J6Qoj3lK4Kk2j8J8J0j3j0JRJ4
$$ -2 3 3 -8 -19 -6 17 10 -13 -12 23 11 -4 -6 15 23 -1 -4 8 15 17 5 -6 10 18 12 -1 -4 20 22 0 -18 0 10 -3 -13 -12 -3 11
3088A1j8oKJ7qqJRJ6j8j1J3J4lrnJ7qRj8rK9Pj7j0J7Qj3plJ6%j8j2J0J5Jj8jP
$$ 11 -7 -13 -11 6 -2 -10 -9 0 16 -2 -13 0 14 11 2 -3 14 6 15 -3 -12 17 24 7 -3 14 22 9 2 -1 15 15 -3 -15 -5 10 11 -7 -8 -1
3128a%mj3RPLk1RKJ8nk5PJ9JkrJJ9jomRNmj8OJ9pj1pJ1J3k4mmJ0J4j5j9NK9j6
$$ -1 -1 -5 -18 -9 -2 1 -20 -11 -9 9 4 -21 -14 5 6 4 -5 -4 15 14 8 4 13 18 14 -4 2 21 14 3 -4 7 20 -4 -8 -12 -2 12 -3 -22 -17 12 -4
3171dj7jJ7J4j6j2NK8rj7OQJ2j0j1JK5Pl3jK1J0j6j1K1Mkl0jK4Lpk6JL0rk2j1
$$ -4 -21 -22 -5 9 -7 -19 -14 14 5 -12 -6 2 14 4 -7 -6 19 26 -7 -8 13 23 7 -4 17 21 19 -11 -12 12 15 8 -18 -17 13 4 -18 -29
3209b9K8Opj7J4Rjj7j9L5Rj3k3QK5Mj2j8J3K4j2k3J6J8Oj5k1J4L0k1k4MJ3K0l0
$$ -29 -1 5 -2 -19 -5 4 3 -14 -33 2 11 -2 -25 -17 8 12 0 -18 -5 19 7 -16 0 18 24 9 -12 2 32 11 -13 -9 4 24 -6
3244foPJ7Jl9KL3Pj8j4K1Lrk1jJ9J3j8j2J1K3Jl1LL0J1k2j2J0L2k3j6nK7J3j8
$$ -6 -12 -5 12 13 -26 -24 9 16 -2 -16 5 8 -1 -22 -23 -4 9 -9 -21 -10 13 14 -17 -14 16 27 5 -7 3 35 12 -4 -9 18 31 13
3280A3k5PK8j2k3jJ6Lj5rQJ7j1j9jJ1K0qj9J5LMj5OPPj9JJ0RjmrJ2J2j9LLJ3J
$$ 13 -12 -5 23 11 -12 -13 3 6 -9 -18 -10 7 -4 -23 -24 -13 7 -1 -20 -5 -2 2 -13 -7 0 7 -12 -11 -1 8 7 3 -6 6 18 -1 2 5 18 19
3320A9j3mJ6qjj5QJ6Jk8%J5j5Rj8LK5oj9MJ1kOk7J6J3Lj4m%K0kj2LJ7Lmk2J0L
$$ 19 6 2 18 10 9 -6 2 18 19 -9 -9 6 -9 0 -18 -15 10 4 -15 -11 0 -2 4 -23 -7 6 9 -5 -9 -9 11 9 -3 0 17 20 16 -6 4 7
3360GRqrJ6oKj3MjKj6nJ6J6j8qPJ6j5knkNlkMJJjrRJ3KnjJ0MrPnpLMJjJKmJ1p
$$ 7 16 8 -1 15 9 11 -2 2 1 3 -13 -18 -2 14 -4 -12 -5 11 -4 -6 -11 -13 -8 -11 -13 -9 -8 -7 -8 -17 -8 5 7 2 1 11 15 6 13 8 1 4 8 9 8 9 11 7 18 11
3410A1j3J1j5%J0j0qLoJJ2j2JJ3OrjnRJ1j3L%N%oRQJmqMK0j3pJ0nRj5qnJ2Jj4
$$ 11 -2 9 -6 -6 4 -6 -14 -11 -17 -16 -4 -16 -15 -2 4 -5 -6 -11 -2 9 -4 -1 -1 4 4 -2 7 15 16 12 4 8 28 15 8 18 13 22 7 -1 -6 6 7 -7
3454gMJ6qj5%NN%j5pJ7J3oj1J3KplQQkrqJ0MRj6%K2nj3nkPQj9MQJ4rk1QJ2pj0
$$ -7 -3 13 5 -10 -10 -5 0 0 -15 -22 -5 8 2 -9 4 6 -1 -4 4 12 10 1 -7 3 7 16 0 0 22 17 4 -1 -3 4 12 -7 -3 5 19 10 -11 -3 9 2 -8
3499h%J1Nj6nJ1Omj6NjNj0jOJ2kJj1J4J1j4oJ2J1qmMOkJjj0jJ3j9JJ2monRmqJ1
$$ -8 -8 3 8 -8 -13 -2 4 0 -16 -11 -12 -7 -17 -18 -12 0 -2 -1 -12 2 13 -1 -7 5 16 8 4 8 14 12 13 12 2 1 14 -5 -4 8 4 -2 -7 2 -2 -10 1
3544Aj1Pljj5J2J1mjj1J9lJpQMMj0KJ2%rlJKRj2J1j6OmpJ1jpnjR%j1mJ0MnojP
$$ 1 -10 -3 -6 -7 -22 -10 1 -3 -4 -15 4 1 2 -5 3 7 11 1 3 15 15 6 3 4 6 15 3 14 -2 4 0 -7 4 3 -4 -9 -10 -1 -1 -12 -16 -6 -2 -7 -13 -14 -7
3591glKM%Ojk1J7J0o%%kROk2J1NnlMNjJj4J0KQl0J7NkrnkRnj0PjJ1pqJ0LrRJk
$$ -7 -10 -8 -4 -4 2 1 -20 -3 7 1 1 1 -1 8 14 -8 3 8 3 0 4 9 8 9 -5 5 7 15 -15 2 7 5 -4 -9 -11 -2 -7 -17 -10 -11 0 -7 -15 -5 -2 -11 -2 -1 -3
3640cLmjKOKpJJ2Lj0pJ2%j3PkRoMj4NLJjmnK%lLpPj7QNjO%NqPkLJ%jKRNNj4lK0
$$ -3 0 -4 -5 -3 3 5 -2 -1 11 14 4 -3 9 9 -4 3 1 10 4 8 -6 -1 2 3 2 -2 -7 -5 -5 -8 -5 -12 -5 -22 -14 -9 -10 -4 -4 1 -7 0 -2 1 2 2 1 3 12 17 22 8 5 25
3694B5k2J5j0lJm%J0jm%j1LpOj0J3j0%KmMllJ2qJ2jqKKJ2nnQ%NMj0KLKpLoNn%
$$ 25 3 18 8 5 6 2 2 12 11 7 7 -4 -1 -8 -2 -12 1 -9 -9 -7 -11 -7 -10 -13 -1 -9 3 2 -6 -4 -2 10 5 0 8 8 13 17 7 9 12 14 7 10 4 9 4 4
3742DmOjknl%lj%KJLj5K2j3PKrPlkRO%rO%jpPOpJJ0kqqJ1J1j1mMj3LJ0ppMnKo
$$ 4 0 6 5 3 -2 -5 -5 -8 -9 -9 -7 -6 -3 -18 4 -9 -2 0 -9 -2 -5 -7 2 8 8 -1 5 5 4 -3 4 10 3 4 14 12 4 -4 7 18 7 3 7 -6 -3 7 0 -7 -3 -8 -6 -12
3794a2RqpjJ7pMj3J0%MJJKLlKNpPJlJ2nrMKJPj3kJkqMLKkj3MRkr%KLPqlJ1mkL
$$ -12 -3 -11 -18 -19 -2 -9 -5 -18 -8 -8 -4 -3 -2 0 3 0 2 7 0 7 8 5 17 12 3 7 9 10 17 4 2 3 1 -7 -3 0 2 0 -13 -9 0 -2 -11 -11 -9 -6 1 -7 -10 1 -3 -5 -2
3847bLLlOnNPkqJJ3qjKJjj1mOLJ5j4j8J5mmmKkJ0j2LOQj8Rj0J3jj3lJ4J0j2kl
$$ -2 1 4 1 7 2 7 14 12 4 5 18 10 9 11 12 11 0 -4 2 5 20 6 -12 3 -1 -5 -9 -7 -9 1 -11 -8 -2 6 -12 -3 -13 0 -1 -14 -17 -3 7 -5 -7 -10
3893a0J0KmNoJ9k0QQJNj5KLllKoJ1%j7nJ2J0j3j0J2%j1NpKJ0j0JLQRj6nLJ0Np
$$ -10 0 2 -2 3 -3 16 -4 4 12 13 18 3 5 8 5 2 4 -2 9 9 -8 -13 -1 9 -4 -14 -2 -2 -13 -8 -15 -13 -3 -13 -12 -9 -1 8 -8 -13 -10 0 5 -2
3937bRLPj6rK0Lomj0J2jmJMO%j7JmLJ0j9MJ6qj8PkJkjK3jnkqJ3Oj9J0O%ljNLo
$$ -2 7 10 17 1 -8 12 15 9 5 -5 7 6 2 3 7 13 13 -4 -3 -7 -4 6 -13 -9 7 -1 -19 -12 -14 -13 -15 -16 7 6 1 -1 -9 4 10 -9 1 7 7 4 3 8 11 5
3985E%%J3j3J1j6kQj2jkJ0lj0oPQRj7J2kKj1pJ0JJ2qMM%J0j1KKppJ1rJ4lKJMk
$$ 5 5 5 18 5 16 0 -2 6 -6 -7 -9 1 -2 -12 -18 -11 -3 6 -11 1 -1 1 -10 -17 -7 -6 6 -2 2 6 6 16 5 7 9 2 -5 6 -3 11 8 10 11 15 13
4030A3JomKkpLMj%j0nJ3j2LJLmm%mJ1JoJ5ooJ4nLKj2J2JrOjkN%kK%rPj2J7j1j
$$ 13 14 8 4 6 4 -3 0 4 3 3 -7 -12 1 -11 -8 -7 -4 -8 -12 -12 -16 -5 -4 -10 5 -1 -7 7 2 5 7 -5 7 8 -1 5 4 2 7 7 5 7 7 -2 5 -7 10 -1 -2
4079bkMMoj1OJJ0j5QKj0OMpO%j0J8pJ2njmOokJ8j3KJrJ3JKnkPqKMj2J0j5QnNJ
$$ -2 -4 0 4 -2 -13 -7 -6 4 -11 -3 -1 -11 -5 -1 -8 -2 -2 -12 6 -1 11 6 5 1 7 1 -1 17 4 6 7 -2 11 12 14 9 7 14 6 8 12 0 10 -5 3 -2 3 4
4127Dj5J1nj1K0qnPNpKj1J1Pmj0J1OLoOkknMLNlj2K1rnj0J3pLqnKlPrR%jj0NK
$$ 4 -11 0 -5 -16 4 -4 -9 -2 3 -4 -2 -13 -2 5 1 -9 2 8 11 5 11 9 7 2 6 9 14 11 -1 20 11 6 -4 9 2 5 -3 -8 -6 -9 -2 -11 -2 -2 -3 -13 -8 -6
4175f%pPK5k0Pj6RJ0JklrJ2OrPNmKooN%LrKnj%%LrQj1QoJ2nlKLrOMMpjLKJ2j2
$$ -6 -6 -13 -6 19 -1 6 -10 -1 9 10 8 5 -4 8 14 5 12 17 13 15 9 3 8 8 11 2 4 -1 -2 -2 -2 1 -8 0 -11 -3 -9 3 -2 -5 -3 0 -9 -3 1 5 -2 -3 0 2 14 2
4227BKRPkmjj5OpLPkjQj9J8j3j2PQprJ8lrNmJ0j9J0%QLj4OoJ1j0QLMkKkLrJ4q
$$ 2 4 13 20 18 14 13 -2 4 -3 0 7 5 4 12 -7 11 -2 -14 -7 1 -6 -15 3 0 -9 -4 -8 2 -17 -7 -7 1 4 -10 -4 -10 1 -9 -1 2 6 4 6 4 7 -2 12 4
4275DOOj5QlmNKoQnkoKlmOrNrOQpJOLopRjMoQ%lLMkQjj7J4lK0rrJ%QojNj5Oqm
$$ 4 10 16 1 9 6 2 7 9 3 11 6 4 -2 0 -3 -7 -1 -10 -5 -14 -8 0 -7 -6 0 3 -3 -10 -1 -2 2 -4 4 4 1 4 8 6 14 13 -4 10 7 27 18 9 10 10 18 12 11 16 1 7 -1 -5
4331eNjLJm%JkrQ%LnjOKJKjPmnjPJ3j0nPMnLrjJkmKoKNQmj6J0jj4MLMJmKOpLk
$$ -5 0 -1 2 3 -1 -1 0 -2 -11 -3 -3 0 -5 -6 0 2 3 5 4 11 7 2 1 8 21 11 6 13 17 12 15 6 5 6 4 0 2 -4 -2 3 11 7 -9 1 0 -14 -10 -7 -3 -2 -6 -4 2 -5 -2 -4
4387doJ7j2J0mkJ0Oj7P%MKqLPJolkjmjJ1kmjnPj1j%KJ2j3%JOj2oJ1lQkQKMj%J
$$ -4 -10 7 -5 5 1 -1 9 15 -2 5 5 9 11 3 6 13 14 8 5 3 2 -2 -3 8 6 2 1 -4 3 -8 -9 -9 -7 5 -8 -8 -7 -1 -13 -19 -8 -11 -3 -5 3 5 9 8 8 9
4437IkMoNnOj0QmmKJ0j1NmJJk0J4Rj0j2mJ2kklNJ0mj4%K2mo%J0jJjlJ3lppQJ7
$$ 9 7 11 5 10 5 11 1 9 5 1 3 13 2 7 3 4 5 -15 -1 8 -2 -14 -18 -6 -8 -10 -13 -8 2 -2 -16 -16 6 2 -4 -4 6 5 6 5 2 15 12 5 -2 6 23
4484B3oj3P%jj2OLJorOKjmjjJlJrK4j0JmjOpOj0J0MrP%JJlJ%J0JNj1%LqNoJ4r
$$ 23 17 4 11 11 10 -2 4 7 8 2 -7 -1 1 0 -4 -5 -6 -5 -8 -7 -16 8 -2 -1 -5 -6 0 -7 -1 -11 -1 3 -6 1 1 2 3 0 1 1 11 12 17 6 6 9 1 6 0 14 5
4535ERj2LKj0MrKKj0N%Qj1MMljnNJ%QmRpP%Pj5jJ4j0MOjplJJrJ1rjJLlKNoOnq
$$ 5 14 2 5 7 -3 1 -8 -6 -4 -14 -9 -9 -1 -12 -8 -4 -7 -8 -13 -8 -7 -7 1 -3 6 -1 6 6 13 -2 -3 11 1 5 11 10 3 0 1 2 -7 4 -5 -6 -5 -2 -5 -3 2 -4 2 -3 -11
4588a1jkPj2K0j0J0ojQMrNLkJkMQpLrOJJKpl%JPj3mRorJ3j2PqOoQJj1RPj%lPj
$$ -11 -12 -14 -7 -19 1 -9 1 -5 -6 2 6 -3 2 5 3 4 2 6 14 7 10 1 7 8 9 11 4 1 1 2 9 -4 -8 1 -5 -14 -1 -13 -6 -14 -8 -14 -6 -5 -16 -7 0 -1 -1 -4 3 2
4640BoJjJ6mp%%MMPk7J3mRj0RlkrQp%kJ4j1J1oj0%NlmkJ1LnpRNj4NJ3j7J3q%J0
$$ 2 -4 -3 -4 12 8 1 1 1 5 9 16 -11 2 -2 7 -3 6 3 1 -8 0 -7 -7 -9 5 -6 5 -1 -11 -11 -6 -9 -13 -15 -4 -1 -6 -13 -4 1 -13 -8 5 -12 1 -7 -7 3
4688CNjqNJjQj2%NOj9PlJ3oqrQKkLljj0JkJ0JqOJJ0nLmpJ5nKNJJlRnmjj0J3Lj3
$$ 3 8 7 -1 4 5 4 12 0 0 5 11 -8 -1 -4 9 3 -5 -14 -6 -4 -6 -3 -6 -7 -17 -16 -18 -8 -7 -15 -9 -8 2 -3 0 -4 -11 4 -1 1 6 7 8 5 14 9 5 4 -6 7 10 -3
4740ckLLjokrJ3Lj4J0lpLoNRkoJ1okLKnKLLLJ%OLlRj3oJnJ3Pj7nJ4pnlOlJkjN
$$ -3 -5 -2 1 0 -6 -8 -17 -4 -1 -15 -5 -8 -15 -12 -18 -13 -4 -6 -12 -1 -7 -9 -6 -4 -9 -7 -4 -1 2 3 3 9 12 9 18 5 -1 0 -5 8 15 -2 -7 7 0 -5 -8 -2 -5 -4 -6 -7 -2
4793bj2MKpMNj4J2JmJ1j2PJ1qlJ3nklLOPnljrJ2Qj3m%kJ0j0Rj5LKoMm%nJ2qNn
$$ -2 -14 -10 -8 -15 -11 -6 -20 -8 -7 -11 0 -12 -5 6 -2 -5 8 3 1 -2 1 7 14 9 6 5 -4 8 16 3 -1 -1 -3 7 -3 6 -9 -6 -4 -10 -6 -10 -10 -15 -3 -11 -6 -11
4841a1pQLkPMLj3NRn%J0qLNmQlj4J0rMJqP%Pj4QpnJ3j0%oKNrJ3j0LPqnONnLoJ0
$$ -11 -18 -10 -7 -9 -2 2 5 -8 -3 6 1 1 11 3 6 11 7 15 12 -2 8 -1 3 4 -4 3 3 10 -4 4 -3 -8 5 -5 -5 -11 -9 -4 -13 0 -10 -7 0 -8 -13 -7 -2 -7 -4 -10 0
4892@lJLoJ0pPJj%kkmnJ3qRljj0j0J9qlQrNKJj3K%NjPnKNjLkNkjo%RMLkl%oRj
$$ 0 -3 -2 1 -5 5 -2 5 6 5 5 3 1 -3 -8 5 -3 6 3 2 -8 -18 1 -7 -10 -2 -11 -6 -4 -3 -16 -14 -14 -9 -10 -3 -8 -6 -1 -2 1 -1 4 2 1 -5 -5 4 8 11 9 6 6 0 9 8
4947HrkPjjrJ2j1J0lnn%jkkJLqJ0LLKnJkJ7qkOj0J4kK%Kj3NJ2pmJ0nlrLJlJ2j4
$$ 8 -1 -3 4 3 2 -7 5 -6 4 1 -4 -9 -9 -10 -12 -14 -13 -10 -18 -8 -5 -2 0 -5 -4 -6 11 3 1 7 -3 11 9 11 11 13 0 5 17 10 6 16 11 8 -1 2 3 0 12 -2
4997brOkJ2j1pKJ1r%nPjMKknQJmNPoqJ5kO%qjQpjnJ4j1JpLmoKJKOonRlkNKJpN
$$ -2 -11 -5 -7 5 -6 -13 -11 0 -9 -9 -14 -7 -8 -4 -2 -4 -9 -1 0 -4 1 8 2 -6 9 7 13 13 5 4 12 5 4 -1 13 2 3 -4 -1 -5 -11 -9 -8 -6 0 -6 -11 -2 -5 -7 -2 0 1 -6 -1
5052alJOmqJ1MlmJ3nJlLJlkMOnjoQj0OQj8nJ4JooKLnqPNkJoLOLj0jOJ3roJ7Lk
$$ -1 -4 -3 3 -1 -9 2 6 3 -1 12 7 8 5 8 9 6 4 8 14 9 8 2 10 0 6 14 -4 -9 5 6 0 -6 -4 -1 -6 -14 -7 -2 -4 -3 -9 -6 0 3 -7 -8 -2 11 2 -4 13 16 14
5105A4%KqMnjnjJ5j3lONj6LOJrojOOj6J2JkqJ4j5PMN%oLOLj0PJnJlmJ0QmNk0J2
$$ 14 14 16 8 12 7 6 1 0 15 2 -1 5 10 -6 -3 3 4 -5 -11 -12 -6 0 -16 -4 -3 -5 -13 1 -14 -7 -3 2 2 -4 -1 5 8 -2 5 6 1 2 -1 -5 5 13 9 14 -6 6
5155FJnLkmlNlNpJLj3j0J2lNKklJ6qnPrRJjLPj2J4nJPj2jnOJ0KlnNKj5p%J9qo
$$ 6 7 2 5 3 -1 -4 1 -2 3 -4 -3 0 -13 -23 -11 -14 -9 -7 -9 -12 4 -4 -9 -2 -11 -2 -1 -2 1 8 -4 10 5 6 13 1 0 -5 1 11 13 10 5 10 12 -3 -10 -10 9 1 -5
5206eQJnnNj5QmQNnqmJ3OkKmjJ2qOqQlQ%rnJQjKJj6J5lj1Nq%PJkpkPoqJ3Pj2J3
$$ -5 3 4 -1 -6 -1 -16 -8 -12 -4 1 -4 -12 -16 -3 3 1 3 -1 -2 10 2 8 0 8 5 13 13 4 -1 0 8 7 9 10 -6 9 6 -5 0 -8 -8 -1 0 -2 -9 -11 -4 -10 -18 -5 2 -10 3
5259CnLjMlMoJkRpJKNNnJkJkKqPLj0MJrPkJrQj3ljORoj3PJ1j1KNMNpjjJ2JjMj
$$ 3 -2 1 0 4 1 5 -1 0 -2 7 0 1 3 8 13 8 9 7 8 6 8 0 7 10 0 4 5 -4 3 1 2 -7 1 -12 -15 -16 -10 -1 -7 -20 -13 -2 -13 -11 -6 -2 3 -4 -5 -6 6 7 6 10 9
5314I%qQkjKJjp%lJLPj1Kk%njoJ2mKoLjkkJJMMMnRk%nlRmOQ%pkMon%j%j0NJ3j4
$$ 9 9 1 9 7 6 8 9 8 1 1 -2 -1 2 9 -2 0 -2 -2 -7 -8 -14 -2 -6 -4 -10 -7 -8 -10 -12 -11 -10 -6 -2 2 -3 6 4 4 -1 -4 5 1 7 15 15 8 6 10 4 -1 -1 -2 -2 -12 -7 6 -8
5371h%KmrJ2oKQrpQJ2qkoJ2lOjjOKj3J0NlnQKlp%MkMRrqklOK%qMK%kqkP%qJ0p
$$ -8 -8 -6 -10 -19 -7 -13 -11 -3 -12 -19 -11 1 -7 -9 -15 -3 -6 0 -1 -2 4 6 -7 3 8 5 0 8 10 7 0 0 4 2 6 15 6 -2 -4 -7 -1 1 1 -7 -3 -1 -1 -3 -11 -13 -6 -6 -14 -4 -11
5426a1RmjLKJ6j6RlNrPmPK%pNOLqqJ2j7QkkNj4RmKnKkqOMmj2NQLjJ0pQl%qQnJ0
$$ -11 -2 -6 -7 -4 -2 14 -2 7 4 9 0 7 3 10 12 12 5 10 16 19 11 3 15 -2 6 4 2 7 -7 2 -2 0 -5 -3 -5 -13 -7 -3 -7 -19 -14 -6 -3 -4 6 -1 7 4 4 -4 4 -1 9
5479Ij4J6qJ2j4J5rlKj2MLLj0PkLkj0MJpPrRKpJ1Jj2LQrNmLLKJLkQnRmmmMNkj0
$$ 9 -5 11 3 15 1 16 7 4 6 -6 -2 1 4 -6 1 -1 2 0 -10 -6 -5 -12 -5 -14 -5 -3 -10 1 2 -10 -7 1 -8 -3 -7 -4 -1 1 2 5 3 11 6 15 11 7 3 7 12 10 0
5530@oJ2Qj1Kj0jLkLmoOnmJ6nm%JrJ3KljjLJ0qQjLkjoQ%OmJlNjoj1j2J2LlMLn
$$ 0 -6 6 14 3 5 -5 -6 -3 -5 -2 -6 -12 -6 -11 -15 1 -4 -8 -8 -7 -16 -3 -1 -4 -5 -6 -3 7 -1 7 6 9 7 6 0 8 8 14 10 11 8 13 12 6 -5 -17 -5 -2 -5 -1 2 -3
5582coKKLlj0NPKl%NpjJ2j1NpJ0lNJ0nqMNoLqOjjk%mPkqpJOnrNLJ0j0Rj2NlKN
$$ -3 -9 -7 -5 -2 -5 -15 -10 -3 -1 -4 -4 1 -6 -7 5 -6 -1 -8 2 -1 4 14 9 1 5 10 4 7 -1 5 4 3 1 1 -3 4 2 -6 -13 -12 -6 -11 -20 -15 -12 -2 -12 -3 -15 -10 -13 -11 -6
5635fmPOnjLJ1j3mJ8jjolLoLMPo%mkkmQrJj1J2noNMjmRpOmrJ0nLRnOKLjJpJ3j5
$$ -6 -10 -3 3 -2 -3 0 11 -2 -6 12 11 10 4 1 4 -2 1 5 12 6 6 2 0 -2 -6 2 -7 -6 -17 -5 -10 -16 -11 -7 -8 -12 -3 -10 -4 -8 -17 -7 -12 -9 0 -5 1 3 6 5 6 -1 12 -3
5689cJ9j1mRnJoMj0RMjj2lKnON%jlLLj5Nj0J5JnkKOoMPk%J0knPkNpkjLMj1Mln
$$ -3 16 5 1 10 5 6 0 4 -6 3 7 6 -6 -9 -7 -12 -6 -1 -1 -2 -5 -2 1 -14 -9 -19 -4 -3 -8 -10 -8 -2 -8 -4 3 1 1 11 9 4 11 9 14 7 5 4 7 11 0 4 1 -4
5741dQRrjmkJpnJ0Jj6OJRj4J9r%J0pL%Kkj0J5PojjjLM%pOqJNmOlm%lj%njpKjJ
$$ -4 4 13 4 3 -1 -3 -2 -9 -14 -4 -3 -19 -13 -12 -3 -17 2 -7 -7 3 -4 -1 -1 1 -1 -11 4 11 5 4 3 2 5 9 9 2 8 0 1 6 2 8 5 1 1 -2 -3 -3 -8 -9 -16 -14 -15 -14
5795a4nPJNNjlPj3J0PrlJ4rNMJPKj6nQOLj2PkkKqKkoLmJ2j1Mkmj%mPNk2J9OpJ0
$$ -14 -19 -12 -11 -6 -1 -2 -5 2 -11 -1 6 -3 -6 8 -1 4 8 9 16 18 2 -3 5 11 14 2 9 7 5 7 -1 1 -1 -7 -4 -8 4 -7 -3 -5 -9 -10 -10 -14 -7 -2 -24 -5 1 -6 4
5846DjkkQlOMrMjMkmPKq%jkJqlPrNnKqJ1mrMkJ1j0J1j0J2qJ1mqOOjLMOrjj1K2
$$ 4 3 1 -1 7 4 10 14 5 9 8 12 10 6 13 15 7 7 6 4 5 -3 -6 1 -8 -3 -8 -6 -14 -3 -7 -16 -12 -14 -3 -13 -2 -12 0 -8 3 -1 -9 -3 3 2 5 9 15 6 5 -6 16
5898A6j7M%JOj1J4j5MmkRlj6J4k0J5MnmRpnRjNqQj3J0oJ0%j1OJ4ojJ1knJ1j3L
$$ 16 -1 3 3 4 10 -1 13 -2 2 -2 -4 5 2 -14 0 -20 -5 -1 -6 -10 -1 -8 -13 -4 -5 0 -8 0 -13 -3 -9 1 1 -10 -4 10 4 3 14 12 7 18 5 8
5942H%jmkMkjLmJk%Jj3J9j6Lk%J5j2j1J4mj0PJ2kklMNpLjjJLJ0j0LOOj2JKKrL
$$ 8 8 7 3 1 5 3 2 5 1 2 0 0 1 -12 7 -9 -6 -8 -8 7 -5 -16 -2 -6 -16 -9 3 1 -1 -4 0 5 -2 1 0 -1 0 3 13 3 6 12 18 6 7 9 11 2 5
5991ELj1J0j5lLLMpJ0j2nlKJ7rK%J0j3rJ0kNJ1oLJ5j6mJ0JLpoLj%JQrJLlnOKj2
$$ 5 8 -3 7 -8 -11 -8 -5 -1 -8 2 -10 -15 -18 -16 1 -8 -6 -6 4 -9 -18 -8 -10 -5 6 0 3 18 2 -2 8 9 12 5 -1 2 1 1 2 10 1 2 5 2 -3 3 5 -7
6039gk%Oj1J5opMPj1LRn%OMoPmJ0ojOojmPlJ4j8RnjljJqJkNopR%Oj7J0qJ2qLJ1
$$ -7 -9 -9 -3 -14 1 -5 -12 -8 -1 -12 -9 0 -5 -5 1 5 -1 6 2 12 6 5 11 5 4 0 7 4 18 0 9 4 3 0 -1 0 -8 -7 -9 -4 -10 -17 -8 -8 -2 -19 -9 -17 -5 -13 -10 1
6091Aj6J3lQoMlLNrPmR%npJ2Kr%QkJnj1PJ4k2Nj1OO%%lQmjpkJ1pj0J7jKqOQj3
$$ 1 -15 -2 -5 3 -3 1 -2 1 6 -3 4 0 9 9 4 -3 9 11 2 2 10 8 9 4 -7 0 14 -8 -3 -14 -8 -2 -2 -2 -5 3 -1 -2 -9 -11 0 -7 -17 0 -1 1 -7 -1 7 -6
6141fKJ3jNmmNoKmQj4J3JrloJ0knnQoKj9J1OOmpQnMqOJmLjlORkjMJRqnJ0j7K0
$$ -6 -4 9 8 13 9 5 10 4 6 2 10 -4 9 10 1 -2 -8 2 0 -5 -10 -2 -8 -6 -25 -14 -8 -2 -6 -13 -5 -10 -6 -14 -8 -7 -11 -8 -9 -12 -6 3 1 0 4 5 14 6 1 11 -6 14
6193A4j6jMkqJ0kOoKmj2J0qPpMnKRk%Jj0J1Pnj3J1J4j5J4j3O%MjnNjmOqjJlOj0
$$ 14 -2 -3 1 -1 -9 1 -1 5 -1 1 -3 -15 -5 -13 -6 -13 -9 -14 -12 -3 -5 -5 -4 -14 -3 4 -1 -14 -3 11 -4 10 -3 3 3 7 6 1 6 5 1 7 -1 -2 -1 -4 2 -8
6241hmRMrkkkOLJqJ3j3jPKJ1j1nM%j%J5prJ8q%rMR%m%%jpKOoJnK%pKPj6KLMj0
$$ -8 -12 -3 1 -8 -10 -12 -14 -8 -5 -4 -12 1 -12 -13 -6 -4 7 -4 -9 -5 -5 -6 -6 9 2 -7 11 3 3 -6 -2 7 7 3 3 3 2 -5 -3 3 -3 -2 -7 -5 -5 -12 -10 -3 -19 -17 -14 -10 -20
6294b0OjJPjpjJ0KMKJnKJOnQplMOrJ6rpJ%Kj1J2lmLnmLlRj4%%NpJ2kkRrQj2J8
$$ -20 -14 -15 -14 -7 -8 -15 -16 -6 -4 0 2 3 -2 0 1 7 2 10 3 0 4 10 1 17 8 1 2 2 4 -7 5 2 -2 1 -4 -8 -5 -8 1 -13 -13 -13 -8 -15 -3 -5 -7 2 -7 1 -11 7
6346Gr%nJJPLmmkKJ3mmMkkLjolLJj4NLpNNj0MJj0KJ6lrOLLjj0J0l%J4j2NrJ5o
$$ 7 -2 -2 -7 -6 -5 2 5 1 -3 -5 -3 10 6 2 6 4 2 5 4 -2 -5 -2 -1 -15 -10 -7 -14 -9 -4 -14 -10 -9 -19 -17 -1 -4 -13 -7 -4 -1 -2 -12 -2 -5 -5 9 -3 2 -7 8 2
6397BmLmJ1n%oMjQlnqK%JnpkQMnlLJ0lj1QlLKPnLJmOMoLKKrRkoLkKMnnJLrnnR
$$ 2 -2 1 -3 8 3 3 -3 1 0 8 5 0 -8 -6 -6 -5 -10 -17 -19 -11 -7 -12 -15 -12 -2 -5 -16 -8 -11 -8 -6 1 -4 -1 0 -4 2 6 0 3 5 7 -2 7 5 -1 2 0 2 6 1 -4 -3 0 -9 -14 -19 -10
6455a0LpoJ0moNmQJpPMJjkQNpPj2RPnJ0j4K%oJQJOk6OJ2pjOrO%o%%%klPlpPMo
$$ -10 -7 -14 -20 -10 -14 -20 -15 -19 -11 -10 -17 -10 -6 -5 -6 -8 0 5 -2 5 -7 2 9 4 14 0 2 2 -4 -3 5 6 12 -14 -8 4 -3 -4 2 -7 -1 -1 -7 -7 -7 -7 -9 -12 -5 -8 -15 -8 -4 -10
6509a0PnJ5q%pRoP%QqQj3J6%nrj0J5jp%Op%oLQmjjmJmJ0j6J2lNpJ1j0NlLmlK1
$$ -10 -3 -8 7 -1 -1 -8 1 -5 2 2 10 2 10 -3 13 13 8 -1 -11 4 3 -4 -4 2 -5 -5 -11 -8 0 -4 -5 -6 -10 -9 -13 -3 -19 -7 -10 -5 -12 -1 -11 -6 -9 -6 -10 -13 8
6558HmqJ0LrLOpkOrkOJ4j6kj%KOpmLpj1J3%Oj6KJRjJJ4j9O%RkjNMlpJ3qKj2J3
$$ 8 4 -4 6 9 0 3 9 2 0 6 -3 -5 1 15 -1 -3 -4 -4 -2 4 -3 -7 -4 -11 -22 -9 -9 -3 -19 -17 -16 -7 -8 -7 7 -12 -6 -6 3 1 0 5 9 6 -1 12 4 6 -6 7
6608GnQj5J5j2MoJ6pj3Rj4J2nLkpLj%PqJnMOj0J0qPN%rRQrJ9j9RrJ0p%KQj6MM
$$ 7 2 10 -5 10 -2 2 -4 12 5 -8 1 -13 -1 -6 -3 -5 -12 -9 -10 -10 -3 -11 -10 -15 -11 -5 -15 -5 -13 -6 -1 -1 -10 -1 7 -2 17 -2 7 -2 8 1 1 3 11 -5 -1 3
6656C%q%Olmo%jjkRmJKj%nMlO%OlLnQOqKMJ4j7OJrJmNlnJ7j5JMnJjnj4J6pNNj1
$$ 3 3 -5 -5 1 -2 -6 -12 -12 -13 -14 -16 -7 -11 -10 -8 -9 -9 -14 -10 -13 -7 -7 -1 -4 -1 -6 2 8 0 2 6 20 3 9 10 1 2 -2 3 0 -5 12 -3 -2 2 -3 -2 -3 -8 -22 -6 -13 -8 -3 -14
6711a4KoJ2KlJpJ3jjljRjLoQp%%%J0qlMJnJ2l%j0ljKj1J1MqjkKPkj2P%OmkLMJ
$$ -14 -12 -18 -6 -4 -7 -6 -13 0 -1 -2 -5 -6 3 2 5 -1 7 0 0 0 0 10 2 -1 3 4 -1 11 8 8 -2 -5 -6 -4 -15 -4 0 -8 -9 -11 -9 -2 -4 -16 -9 -9 -3 -7 -9 -6 -2 -1
6763aqOnQNnkJ0Lj7J0kjL%nLmmMpLJkO%j3Pj2QknJ0mOjlKJ4j4ORj0J1j0jjJ0l
$$ -1 -9 -3 -8 0 5 0 -2 8 11 -6 4 2 1 4 4 -1 2 -2 -6 -2 -9 -6 -5 -7 -1 -1 -14 -7 -19 -11 -13 -18 -8 -12 -6 -7 -10 -8 6 -8 -2 7 -3 8 -2 -3 -4 6 3
6812CMqLRj0NMj5LJmKOJj1PpkRLj0Kkjj0OnJ9jjj2kLJ3qRLj2J7rJ1nq%K%Rj6J4
$$ 3 7 -1 2 11 1 6 10 -5 -2 -1 -5 -3 3 4 -7 0 -7 -9 0 3 -7 -5 -7 -8 -18 -12 -17 2 1 0 -12 -14 -11 2 -6 3 6 -6 11 2 13 8 0 0 2 2 11 -5 9
6861IrN%%qMj2LPJj6OKkKqJ0J%nQmmQQkkoOJ2nnPJj5OJ4omj1J0jJ0qmjjnKoNq
$$ 9 0 5 5 5 -3 1 -11 -8 -1 0 -16 -10 -8 -10 -8 -16 -6 -5 -5 -10 -2 -6 -10 -2 6 4 2 -4 2 14 9 4 11 12 -3 3 17 11 7 -4 6 5 15 7 3 2 1 -4 -2 -8 -3 -11
6913a1kL%J0KkJqqQrJ3qJ6k0J2nJ2JkkR%j0NKJpOq%NKnkJrJJ1j0mJ5j1jJkMmm
$$ -11 -13 -10 -10 0 2 0 1 -7 -15 -7 -16 -3 -11 5 -15 -3 -8 4 5 3 1 10 10 0 5 7 8 1 7 -1 -1 4 6 1 -1 0 -9 -8 3 -7 -11 4 -7 -8 -7 -9 -5 -9 -13
6962a3J0j7QPMmkkOMkPlJ4j6Rj0J3j5RQqMLj0qNjNlpk%jkO%lMnrNNkmOKRmlNo
$$ -13 -3 -20 -12 -5 -1 -5 -7 -9 -3 1 -1 6 3 17 1 10 0 13 -2 7 15 7 11 14 4 -4 1 0 5 2 -5 -7 -7 -8 -10 -4 -4 -7 -3 -8 -17 -12 -7 -9 -13 -7 -5 4 0 -3 2 -4
7014dJ0kKMnj2J0KK%Np%j0QlJ4rKj1oJ4j1%mMnOJLj9J0KPj4Nj2J1J3mPonJ2%M
$$ -4 6 4 6 10 5 -7 3 5 7 7 12 5 5 -5 3 0 14 5 7 -4 -10 4 -7 -7 -11 -7 -12 -6 -5 -2 -21 -11 -9 -2 -16 -11 -23 -12 1 -3 4 -2 -7 5 5 9
7060IqKjJ5j2j0PkRj7PMj7J4pk%JjoRrjKNNpk%J3qmRNj1Rlj%mJ4j0POpPkomPk
$$ 9 1 3 2 17 5 -5 2 0 9 -8 -1 3 -14 0 -7 -9 -9 -8 -9 -15 -6 -15 -16 -14 -9 -4 -11 -13 -13 0 -8 -12 -3 2 -9 0 -3 -4 -4 -8 6 -4 3 9 2 9 7 1 -3 4 2
7111BmJpJ1j1%kLJ%%lMj2KkKMRpJJPljqQnLQmOjKKmJ1mjkmRmnoMoMjPj1PlJqm
$$ 2 -2 -1 -8 3 -8 -8 -10 -7 -6 -6 -6 -9 -5 -17 -15 -17 -15 -11 -2 -9 -8 -7 0 -3 -4 -12 -4 -9 -6 2 -2 4 3 5 7 3 14 10 9 7 3 12 8 3 -3 1 -5 -1 -2 5 -6 1 -2 -1 -9 -13
7167a3Nj1M%NkMPoNk%k%M%PPmkMJLj1KkJ3qkkoN%kkmjJlLpMNplOMj2J2rJ1%oJ
$$ -13 -8 -19 -15 -15 -10 -12 -8 -1 -7 -2 -4 -4 -6 -6 -2 -2 5 12 8 6 10 11 14 3 5 3 16 8 6 4 -2 3 3 1 -1 -5 -6 -5 -8 -5 -12 -8 -3 -10 -13 -7 -3 -15 -3 -12 -1 -1 -7 -6
7221fPOpJL%J1j2kJ5jp%j2PmnL%LrJ1j2JMMllMj0MkRmLjMrkJ0RnrPpJ3nJKJ3j0
$$ -6 1 7 0 1 4 4 15 3 1 16 15 8 8 -4 3 -1 -6 -3 -3 0 -9 2 -10 -9 -5 -1 -4 -7 -3 -13 -9 -11 -2 -6 -3 -4 0 -9 -11 -1 8 3 -6 1 -6 7 2 3 5 18 8
7272HLmKolPmlRj4LnQ%p%pOkN%qj3J1J4qPnJ2j1O%rNL%%%PrNPo%Oj3MK%KLp%l
$$ 8 11 7 9 3 0 7 3 0 9 -5 -2 -7 1 1 -6 -6 -13 -7 -9 -4 -4 -12 -25 -14 0 -8 -1 -6 6 -5 1 1 -8 -3 0 0 0 0 7 -2 3 10 4 4 10 -3 1 3 3 5 8 1 1 -2
7326bOj4Nj3LJ4k0J0LkkjNkQpNPj1MKNp%NLKkPj6J4LqqQlRkNoj7J1Lj1%JJrNj3
$$ -2 4 -10 -5 -18 -15 -1 -21 -11 -8 -10 -12 -13 -8 -10 -2 -9 -4 3 -8 -4 -2 3 -4 -4 1 4 6 4 11 -5 9 12 4 -4 4 1 10 8 13 7 -10 1 4 -7 -7 -6 -5 -14 -9 -22
7376b2J8qMJ%NPj5OmJ0MkJnQj3MmROpnMoOOo%ljMjkj3RjjqNOmnNpNJ0plLJ2k2
$$ -22 -4 -12 -8 -7 -7 -2 5 -10 -4 -8 2 6 4 5 0 8 -5 -1 -5 4 10 3 -2 2 -4 2 8 2 2 -1 -2 2 1 -1 -14 -5 -6 -7 -15 -10 -4 -8 -13 -8 -15 -10 0 -7 -10 -7 5 -17
7428a7J5LmJ1j2NlQqN%QMj2J3j4qJ0nqJ8j4jLj1lQoklJ5qJRmkmKMPpQlNQknL%
$$ -17 -2 1 -3 8 -4 1 -2 6 -2 3 3 11 15 3 16 2 -6 4 -1 -9 9 -5 -6 -3 -14 -17 -9 -15 -17 -20 -5 -13 -12 -3 -7 -9 -13 -11 -7 0 -7 1 -2 3 11 9 4 7 7
7477GpKjJ2%%j6KJLJ4j1m%j2OnlMKmmmRLJ1j0mMmRrJ0jjjLNmkNLJNJj0J2j0Qo
$$ 7 0 2 1 13 13 13 -3 -1 0 3 17 6 2 2 -10 -4 -9 -12 -8 -6 -10 -14 -18 -9 -6 5 -5 -9 -5 -9 0 -9 1 0 -1 -2 1 6 2 0 5 8 9 14 15 5 17 7 15 9
7527ImmN%qKj0PKo%Nj2RjnQplN%Kk%qJ3JKjJ0rJKL%MlKJoJ4j2j4J2Kj0mNjJ6j6
$$ 9 5 1 6 6 -2 0 -10 -3 -1 -7 -7 -2 -14 -5 -6 -11 -3 -10 -13 -8 -8 -6 -8 -8 -16 -3 -2 0 -1 9 0 1 3 6 6 10 7 9 10 4 18 6 -8 4 6 -4 -8 -3 -4 12 -4
7578dpJ1j0NJqQnKkOJpMPqkJRO%jj2K1j2NrJ0MMj3N%llJLj6J3pMqnJ4j1kJ0po
$$ -4 -11 0 -10 -5 -4 -12 -4 -9 -7 -9 -3 -2 -9 -5 2 -6 -8 -7 2 8 8 7 -5 16 4 9 0 10 14 18 5 10 10 7 4 5 8 -8 5 -2 2 -6 -11 3 -8 -10 0 -7 -13
7627a3kJ2MolPPj2ROnKJLnN%Km%mJ1j1M%j1QPmNj2jjrkPmkQj8J2NrJ5nnJ5qML
$$ -13 -15 -3 1 -5 -8 -1 6 -6 3 9 4 6 7 10 5 10 10 12 8 8 4 15 4 8 8 -3 5 12 8 13 1 0 -1 -10 -12 -5 -9 -11 -3 -21 -9 -4 -13 2 -3 -8 7 -1 3 6
7677FJojLM%pOkJ8j0kJj%JkjKolkRk1QMOj3O%jRj1J%j5K3MrpLKMj1J8o%J2pj3
$$ 6 7 1 0 3 7 7 0 6 4 22 12 10 11 10 10 11 9 8 10 4 1 -1 8 -13 -5 -1 5 -8 -2 -2 -3 6 -5 -4 -4 -19 4 8 -1 -8 -5 -3 1 -10 8 2 2 14 7 -6
7727fJ4Qj2QqkKjMNj1kJ5j6J%oMkKlNqNJMj0J0k%Qj1KKQj2NmMKKNrLMoJJ3pJn
$$ -6 8 16 4 12 4 2 4 3 7 12 1 -1 14 -2 -1 -1 -7 -3 -5 -3 -6 -1 -9 -4 -3 1 -9 1 -1 -1 7 -4 -2 0 8 -4 1 -3 1 3 5 10 1 4 8 2 3 16 9 10 5
7778EKkkJo%jnjJ0j2kmJ4Kj9PRMjlj%NLj1LJ1oJ3kLrKmLoPKmKNj7J0lj6J6Jj4
$$ 5 7 5 3 4 -2 -2 -3 -8 -9 1 -11 -13 -17 -3 -1 -20 -13 -4 0 -1 -4 -5 -5 0 3 -8 -5 6 0 13 11 14 5 7 3 6 0 7 9 5 7 12 -5 5 2 -14 2 3 -11
7827a1Oj2J4OnmJ%njOoJ0rNpmJ3MNKrLlOKMmjkNLj4PqJ0l%pNj3J2mQqj1QRj4Q
$$ -11 -5 -17 -3 3 -2 -6 -5 -5 -10 -11 -5 -11 -1 -10 -5 -12 -16 -3 1 6 8 -1 2 -1 5 7 11 7 6 4 9 12 -2 5 -3 7 4 4 -3 2 -11 1 -3 5 -3 -14 -6 3 -11 -3
7877cMmMnjMlKRoo%LJ3noLMKKJkmjKnKJjjj1jNlmmKJJ1j4OpnOlJ9j5NlJ2N%no
$$ -3 1 -3 1 -4 -5 -1 -4 -2 7 1 -5 -5 -2 11 6 0 3 7 9 11 12 10 6 5 7 2 4 5 4 3 -8 -9 -4 -7 -11 -15 -13 -12 -1 -15 -9 -16 -21 -15 -18 1 -14 -9 -12 0 5 5 0 -6
7931fNmQmNQmlNjj5J7rOj3J4j0%lKMjpmknJ1MrQqL%KLnJ1mKj1pJ1J6qPoOjlLL
$$ -6 -1 -5 3 -1 4 12 8 5 10 9 -6 11 2 8 -5 9 -1 -1 -4 -2 2 1 -6 -10 -12 -17 -6 -2 -11 -3 -11 -8 -8 -6 -3 -8 3 -1 1 -10 -17 -6 10 2 9 3 9 8 5 8 11
7982A1j0Kkjk%MlPj1qMMqkQJmKmMNj6NNnNJ1n%O%j0JJ0LMLpJm%%kjJPj1Nk%mK
$$ 11 1 3 1 0 -2 -2 2 -1 6 -5 -13 -9 -5 -13 -15 -7 -6 -10 -8 -12 -8 -3 -19 -14 -9 -14 -9 2 -3 -3 3 3 -7 -6 4 7 11 14 7 8 4 4 4 2 1 2 9 -2 3 1 1 -3 -1
8035aqLj0J3j0KOjqKJ1j8J0KklLJ4pKMoJ3pJKJ4k2J5j2nJ6jqkkoJ3nPqrkJ0j4
$$ -1 -9 -6 -16 -3 -13 -11 -5 -6 -14 -12 -1 -19 -9 -7 -9 -12 -9 5 -2 0 4 -2 11 4 5 7 21 -1 14 2 -3 13 12 4 2 0 -6 7 2 9 1 -8 -10 0 -14
8080a4JLmkKN%nNNoLJ1j0MMkQnrJ3NoMplQkJLkqQmqJLpMLqL%j2K0qnLjJnKPOj1
$$ -14 -13 -10 -14 -16 -14 -9 -9 -14 -9 -4 -10 -7 4 -6 -2 2 0 8 3 -6 7 12 6 10 3 0 8 6 7 10 8 0 8 4 -4 -3 0 -7 -3 0 -8 -5 -5 -17 3 -5 -10 -7 -8 -7 -12 -10 -3 3 -8
8135hJnQlPJ1kj1LQp%lMJKoPljjrOJqmKJ%oQrPKjkrJ3Rj3%J8nJjkJ%J4omPj2L
$$ -8 -7 -12 -4 -7 0 11 9 -2 1 9 2 2 -1 3 4 6 0 7 4 3 2 -7 -1 0 -8 -12 -10 -9 -9 -15 -7 -16 -9 -7 -8 -10 -19 -6 3 -10 -10 8 3 4 3 1 2 2 16 10 6 13 1 4
8189DJ2r
$$ 4 16 7
8191G
$$ Imaginary data points
##PAGE= N=2
##DATA TABLE= (X++(I..I)), XYDATA
0@%%%%%%%%%%%%%%%%%qJ6j6J6j6J6j7K5l2L3m1M8n6O4p2Q1q9J04j20J36j52J69
$$ 0 0 0 0 0 0 0 0 0 0 0 0 0 0 0 0 0 0 -8 8 -8 8 -8 8 -9 16 -16 17 -24 24 -32 32 -40 41 -48 56 -64 72 -80 89
39H9j86K06k30K56k82L10l45L82m19M61n09N63o20O83p54Q31r19J020j133J265
$$ 89 -97 109 -121 135 -147 163 -182 200 -219 242 -267 296 -324 359 -395 436 -483 537 -596 669
59F69j422J606j828K107k465K938l609M633o407J0320l3755K4840O8758o6068
$$ 669 -753 853 -975 1132 -1333 1605 -2004 2629 -3778 6542 -27213 -2373 66385 317
73C17n1805L9698N2276k5910l4609N6K2200J7346j336l7670j4129M8606L1658
$$ 317 -51488 -11790 40486 14576 -20033 -19977 2223 19569 18233 -19437 -33566 15040 46698
86D6698n7568m1930N7381M9998n3906n0213M3491M6859l1372l7271J5976K5362
$$ 46698 -10870 -52800 4581 54579 673 -49540 -6049 40810 9438 -27833 -11857 13505
98A3505j610j0488j2368l841K2999J7525l0889k7865L4537L4910l4822l7281L1627
$$ 13505 11895 1407 -10961 -14802 8197 25722 -5167 -33032 1505 36415 1593 -35688 -4061
111d061L5627k6114k9954J8851K1584j1077j1429L464J021L128Q489q341j6080
$$ -4061 31566 5452 -24502 -5651 15933 4856 -6573 -3109 -2088 1040 9529 1188 -14892
124a4892J1896K1004j3864k2994J4351K2017j3687j8601J2196J3406j0212p310
$$ -14892 -2996 18008 4144 -18850 -4499 17518 3831 -14770 -2574 10832 620 -6690
136f690Q059J200n917M273L830q326j948J0826L00j1576J210J0724k526q608L702
$$ -6690 1369 2569 -3348 925 4755 -3571 -5519 5307 5607 -5969 -4759 5965 3439 -5169 -1467
151a467N649m682k398N432p69n870L325N940n107n676N886N003n742l999M748
$$ -1467 4182 -500 -2898 2534 1765 -4105 -780 5160 53 -5623 263 5266 -476 -4475 273
166B73K757l161j319J233j32P79J462k512k510L851L244m575l552M682L550m223
$$ 273 3030 -131 -1450 -217 -349 430 1892 -620 -3130 721 3965 -610 -4162 520 4070 -153
182a53l247L258K713j937k093M25J431J101q99k509M69L613k10m385R1M704n4
$$ -153 -3400 -142 2571 634 -1459 -1034 397 1498 599 -1910 -1441 2172 1962 -2423 -2332 2372 2318
199B318m585L5M086M2l198k10K050N43p00r73p06J528K045k072l219K548M111
$$ 2318 -2267 -2232 1854 1896 -1302 -1512 538 1081 381 -592 -1298 230 2275 203 -3016 -468 3643
216C643k888m650K971M761k763m523K257L841j461k841M33J573P46k02j900j144
$$ 3643 755 -3895 -924 3837 1074 -3449 -1192 2649 1188 -1653 -1220 353 1099 897 -1003 -2147
232b147K928K360l717l266M177L826m196m001L841L805l094l271K086K432q73
$$ -2147 781 3141 -576 -3842 335 4161 -35 -4036 -195 3610 516 -2755 -669 1763 890
247H90j465m32M45J629M91k656j274L360J809l747k085L742K101l379j883K735
$$ 890 -575 -1007 -562 1067 1558 -1098 -2372 988 2797 -950 -3035 707 2808 -571 -2454 281
263B81J514j842j030Q47N65J93j35j108j71J871L27k384l37K629J94k605J6K289
$$ 281 1795 -47 -1077 -230 335 528 393 -715 -886 985 1312 -1072 -1409 1220 1414 -1191 -1175 1114
281A114k57j808M66J140o14m48O23k37n29Q72K52j326J27J594n49j619R88J471
$$ 1114 857 -951 -485 655 41 -407 216 -21 -550 322 574 -752 -625 969 420 -1199 -211 1260
299A260j349j115J645O57j776r6J724m35j488Q86J105j232o08J373L0j343N50
$$ 1260 -89 -1204 441 1098 -678 -774 950 515 -973 -87 1018 -214 -822 551 581 -762 -212
316b12J081j091o96J547J46j876M15K067r91k063J477J927j778j637J902J238
$$ -212 869 -222 -918 629 775 -1101 -686 1381 390 -1673 -196 1731 -47 -1684 218 1456
332A456j778p31J452J71r06M06K35r63N21J441j245j852J859K090k282k192K437
$$ 1456 -322 -1053 399 570 -336 70 305 -658 -137 1304 59 -1793 66 2156 -126 -2318 119
349A19K131k376j888K015J524j449r78O63L90J72K84r92r08J706J501k225j963
$$ 119 2250 -126 -2014 1 1525 76 -902 -239 151 323 607 -385 -1293 413 1914 -311 -2274
366b274K510K257k499k384K229K276j707j990J002J511k37r08n46J86J236N03
$$ -2274 236 2493 -6 -2390 -161 2115 408 -1582 -580 931 694 -214 -760 -574 662 1165
382A165j739j155K030J669k046k012J879K139j466k054R55J789l79j322j89P77
$$ 1165 -574 -1729 301 1970 -76 -2088 -209 1930 464 -1590 -635 1154 775 -547 -736 41
398D1O73j86j021l70J187Q14j180j143J006J303p31j329L79J166l8r13k83N99
$$ 41 714 528 -493 -863 324 1138 -42 -1185 -179 1124 393 -936 -557 609 571 -342 -625 -26
416b6M92k77n70rN47K35l76l47J36L79J52k96m15J73O55m0p69r0P62J83o64j91
$$ -26 466 189 -381 -390 157 392 16 -331 -195 184 336 40 -375 -202 453 413 -356 -446 316 499 -165 -356
438c56M17J25j18Lk35k15N84M18q79o40J099P74j200q09J161P69j021n72P71L27
$$ -356 61 186 68 71 -164 -379 205 623 -256 -896 203 977 -223 -1032 129 898 -123 -695 76 403
458D03m39J5P2l76L02P09o40r74R21J117j102j157J200J033j211q02J105M75r32
$$ 403 -36 -21 51 -325 -23 686 46 -928 -7 1110 8 -1149 51 1084 -127 -929 176 651 -281
477b81j00P12k89m38O25J48q70J49J005m08r95O49Q90q50o63R95L79j090p7J127
$$ -281 -381 331 42 -396 229 377 -493 -344 661 253 -742 -93 797 -53 -716 279 658 -432 -509 618
497F18k33j086M59R60o03p91O68N07o22j96M77j32l00M76R3q04J36J058k97j210
$$ 618 385 -701 -242 718 115 -676 -8 499 -123 -319 158 26 -274 202 295 -509 -373 685 388 -822
517h22M06J282l92j244L43J092k30q31P7M81J13j32k64k52L82N73m36q54M07J012
$$ -822 -416 866 474 -770 -427 665 435 -396 -319 162 275 143 -121 -373 9 582 146 -708 -301 711
537G11l28j081J80J015J2q86j71O50L58l92m58J24N34J15n25k67M56L90l47m09
$$ 711 383 -698 -518 497 509 -377 -548 102 460 68 -390 -266 268 383 -142 -409 47 437 90 -319
557c19K02L82n0k97j30K05K48j11l62K7M30k2m58M2M48j32m15K54L53l63k94M85
$$ -319 -117 265 215 -82 -212 -7 241 130 -232 -205 225 203 -255 -213 235 103 -312 -58 295 -68 -362 123
579A23K07n36j01N30Lm40J02K73j87l0K91k52l87N35M56q02n17J008N26j110n09
$$ 123 330 -206 -307 223 226 -214 -112 161 -26 -56 235 -17 -404 131 587 -215 -732 276 802 -308 -817
600h17J093M32r74k94P22J50m13N4M1k45L36M42o70o06R64O98j136p37J210O81
$$ -817 276 708 -266 -560 162 312 -101 -47 -6 -251 85 527 -143 -749 215 913 -223 -960 250 931
620I31j164n34R84L28p33j01M26j70j03M17k08o26M80P46o81p74Q01P27q58n34
$$ 931 -233 -767 217 545 -188 -289 137 -33 -136 281 73 -553 -73 673 -8 -782 19 746 -112 -646
640f46Q05L29p14m7N75k16l98M62K46o47r0P22m3p13J31O05k27m02K62J41l08
$$ -646 159 488 -226 -273 302 86 -312 150 396 -251 -341 381 338 -375 -244 361 134 -268 -6 135 -173
661a73J22L46l98l54N90L73p35l57P52L72o86l42N25K95k40k36k8J49L38n8n83
$$ -173 -51 295 -103 -457 133 506 -229 -586 166 538 -148 -490 35 330 90 -146 -174 -25 313 255 -328
682c28n2P76J57q76k73Q76L50p75m09N45M45k87m37m8M04L53l39o18K33Q37j26
$$ -328 -380 396 553 -323 -596 280 630 -145 -554 -9 436 149 -288 -336 68 421 82 -536 -303 534 408
703D08r57K3R74R2q77j72P00K40m34k94J45L02J73k99m63K73P04k46q81J91R73
$$ 408 -549 -526 448 540 -337 -509 191 431 -3 -297 -152 150 323 24 -439 -166 538 292 -589 -398 575
724E75j52r66J21Q40n2o70j4M48N8j79q4j18J43L96j76o22J91Q27k27r27K19R48
$$ 575 423 -543 -422 418 366 -304 -318 130 188 9 -75 -193 -50 346 170 -452 -261 566 339 -588 -369 579
746E79k05q87J76P35j32n33P8K67k0Rl6k84P9N24j11p03J14Q47j04q89R2Q52n1
$$ 579 374 -513 -337 398 266 -267 -189 78 58 67 31 -253 -174 350 239 -464 -350 497 393 -496 -404 448 397
769C97p24K7N30%k82j9L8LK09K0m22o9N75J16o94j80P08K27o58k63N45K51l82
$$ 397 -327 -300 230 230 -52 -71 -33 -30 179 199 -223 -292 283 399 -295 -475 233 460 -198 -461 84 335 -47
792d7k24K06J41rk4j55j03K85K69l70m11M38N17m11n85L49O09k71n49J64M57q8
$$ -47 -271 -65 76 67 43 -112 -215 70 339 -31 -442 -4 513 102 -483 -134 475 204 -345 -181 276 188
814A88k93mR0L4J19p0l21O1N03m7o58L2P32%p63QP30l4o12O5M73j17k72J73P8
$$ 188 -105 -109 -19 15 134 64 -257 -196 307 260 -398 -366 366 366 -397 -389 341 307 -305 -240 233 116 -156 17 95
839I5k34J36K65l39k55N02K23o38j61P32N3p82Q6P44j98p01L36N88m21m60M86
$$ 95 -139 -3 262 -77 -332 170 393 -245 -406 326 379 -403 -317 427 229 -472 -136 452 31 -429 57
860E7K69m74n8M04j53k76L80J11n85P9P45k62q85M10R62n22r51N45Q74n27p22
$$ 57 326 -148 -206 198 45 -231 149 260 -325 -246 499 237 -648 -238 724 202 -749 -204 670 143 -579
881e79M38M82k87j93J12j36Q6M57k41p74M01J034m85j185N07J259m73j184L70
$$ -579 -141 341 54 -139 -27 -163 -77 380 139 -635 -234 800 315 -870 -363 896 423 -761 -391
900c91R93k23p06M6L43J02O7k52m73L36Q45m10j111L78J280l21j306K25J183j04
$$ -391 602 379 -327 -281 62 164 231 -21 -494 -158 687 277 -834 -456 824 503 -803 -578 605 501
920E01r40rO20J14k17j95j77K40N38k20q13J72J023j15j086L6J014O0q61j22N95
$$ 501 -439 -448 172 286 69 -126 -303 -63 475 255 -558 -386 637 522 -564 -528 486 546 -315 -437 158
941A58J52k99j59k1J15L10o5n46rO95R7p57j68P21J96n68k10L86J81j50j25o2
$$ 158 310 11 -148 -169 -54 256 191 -355 -364 331 428 -329 -497 224 420 -148 -358 28 209 59 -66 -128
963a28L1K71P6m12j60M60K62m59l18L70L44k53l13Q5K43P9j42k32J7L25J21l68
$$ -128 -97 174 250 -162 -322 138 400 -59 -377 -7 337 84 -229 -144 99 178 36 -196 -179 146 267 -101
985a01k42L63L31k90l90J88M06n5l70q8K82K45k01l37N6M00O1m11j57L49K50k61
$$ -101 -343 20 351 61 -329 -141 265 210 -160 -248 34 279 78 -259 -203 197 258 -153 -310 39 289 28
1007B8l13J40L37ll17j53L03K55k22l34J43L92o2l84J2L14N4k20j15J23J33Kj55
$$ 28 -285 -145 192 189 -128 -281 22 277 55 -279 -136 256 194 -190 -178 136 190 -30 -145 -22 111 113 -42
1030d2j17J48K01j49k61J33K94j50k69J32K10j25j38J22N8j05K0J02r9n9J46L4
$$ -42 -159 -11 190 41 -220 -87 207 57 -212 -80 130 5 -133 -11 47 -58 -38 64 -35 -94 52 86
1052H6j74K6J87q0j55J60J00k21m8K77k0l13Q5L13j34l15J70K45j89j57J59N1
$$ 86 -88 -62 125 45 -110 50 150 -71 -119 158 138 -175 -90 223 89 -226 -56 189 0 -157 2 53
1074E3j22O9O5j98J2L04p8l99J52M55k03m53K38M23k41l43K39K13j88o6J20p4
$$ 53 -69 0 65 -133 -121 183 105 -294 -142 313 110 -343 -105 318 77 -266 -27 186 -2 -68 52 -22
1096b2o1K30m0l50J20M37j98m84K63M76l00m32L25L24l01k06K69O0k05Q7J17k18
$$ -22 -83 147 107 -243 -123 314 116 -368 -105 371 71 -361 -36 288 -13 -219 50 110 -95 -8 109 -109
1118a09k2L29r1l82J82M22k79l95L36L38l98k34L96J32l98J3L33j28k48K23J48
$$ -109 -131 198 107 -275 -93 329 50 -345 -9 329 -69 -303 93 225 -173 -160 173 45 -203 20 168
1139A68k90nL11j18k96K43K54l54j69M41P0m76K0M87j06m51J69L69k11k71K05
$$ 168 -122 -127 184 66 -230 13 267 -87 -256 185 255 -221 -201 286 180 -271 -102 267 56 -215 -10
1160a0J34j80NJ27j76m6L22m8m35J14N28j83n55K23N55k33m63J83L84j30k40O2
$$ -10 124 -56 -51 76 -100 -146 176 128 -307 -193 335 152 -403 -180 375 142 -321 -138 246 116 -124 -62
1182f2O3N6R0j40k50K18M03k90n20L17N52k95n67K49N09j75m12P0K60N3r2j64
$$ -62 1 57 147 7 -243 -25 378 88 -432 -115 437 142 -425 -176 333 158 -254 -184 76 129 37 -127
1204a27q3K78K33l40l79L89M71l72n17L47N12k61m53J38L54j1k24j20Q3K23R1
$$ -127 -210 68 301 -39 -418 -29 442 70 -447 -100 412 151 -302 -164 190 179 -45 -165 -82 141 232
1225B32l33k14L61L36l79m09L52M38l10m06K26L22q2k46NR5J21J8j98j54K53K64
$$ 232 -101 -315 46 382 3 -406 -54 384 74 -332 -106 216 134 -112 -107 -12 109 127 -71 -225 28 292
1247B92k97l29K98L54k83l23K32K67j73j79R9O6j5L7m5j38J12K20j57k69J88K91
$$ 292 -5 -334 -36 318 35 -288 -56 211 38 -141 -42 24 9 46 1 -137 -25 195 38 -231 -43 248
1269B48j97k60J79K25j69j51J43M9r5L6O2j36k3J96k0k38L9K71p1k77R0K24j00
$$ 248 51 -209 -30 195 26 -125 18 67 -28 8 70 -66 -89 107 87 -151 -112 159 88 -189 -99 125 25
1292B5j54J04Q4j07nJ21q2j03J53J05k03p5K38N7k42l8K25Pj82KJ57m2q2N5J4
$$ 25 -129 -25 59 -48 -53 68 -14 -117 36 141 -62 -137 101 158 -84 -122 103 110 -72 -70 87 45 -37 18 32
1317C2r5N4J04j14j22J53J12j66j21J89J01j79r9J83M2j21l3J08Mp4M3L6p4J4
$$ 32 -63 -9 95 -19 -141 12 124 -42 -163 26 127 -52 -151 32 74 -47 -80 28 32 -42 1 37 -37 -23
1341b3J12n9j29Q4J40j03j53J18J51j27j36J34R3j27n0J13Lj04N1Q8r9p1J50L7
$$ -23 89 30 -99 -15 125 22 -131 -13 138 11 -125 9 102 -25 -75 38 41 -63 -12 76 -23 -94 56 93
1365I3j86j3K06j8k05N5J80p6j52J08Q3j19k1J51o1j57J30J52j59j74K06J55k24
$$ 93 -93 -106 100 82 -123 -68 112 36 -116 -8 75 -44 -65 86 25 -132 -2 150 -9 -183 23 178 -46
1388d6j25K18Q5j79k8J34l7o0R7pj51O8K13j33k52J60K85j91k76J92K44j76j90
$$ -46 -171 47 132 -47 -75 59 22 -38 59 52 -99 -31 182 49 -203 -43 242 51 -225 -33 211 35 -155
1411a55J20J08q3pK0r8L3J91q4k55J05L25j30l45J42L36j18k75P9K26n7j19K0
$$ -155 -35 73 -10 -17 3 -95 -62 129 45 -210 -105 220 90 -255 -113 223 105 -170 -91 135 78 -41 -21
1434b1J0J1J01l4k05N8K64n4l22N5L24l3l23L1K34j6j53jO5QL3mj23nJ89K5k25
$$ -21 -11 0 101 67 -138 -80 184 130 -192 -137 187 154 -169 -138 96 80 -73 -74 -9 -1 32 28 -95 -100 89 114 -111
1461a11l6K37M9k28l1J86K6j05k0L5MK1L0q5n5J25P1j34j01J36R1j06r2Q2M8k1
$$ -111 -147 90 139 -89 -120 66 92 -13 -33 2 6 27 57 -28 -83 42 113 -21 -122 14 105 -1 -93 -11 37 16
1487A6k0k2k2N9P5q8j07R6J21p0j50N3J40l0r1k6O6N3j3q9l3J03Q5r4j43R1J59
$$ 16 -4 -26 -48 11 86 -2 -109 -13 108 38 -112 -59 81 51 -40 -66 0 53 40 -49 -82 21 106 12 -131 -40 119
1514A19l9j67KJ56M0j25p8P6J08j6j28k8J23R1j15j34P6J58m6j60nJ44L9j01j07
$$ 119 80 -87 -85 71 111 -14 -92 -16 92 76 -52 -80 43 134 19 -115 -39 119 73 -87 -92 52 91 -10 -117
1539a17P5J07j2j19l7J15P2q7j04N2J21Qj28m0J09Q8o7j20L5J45j0j06n1R6O5
$$ -117 -42 65 53 -66 -103 12 84 -3 -107 -55 66 74 -54 -94 15 103 36 -84 -49 96 86 -20 -71 25 90
1564I0m5p6j2P5L5o8p9M3J08j0j54pJ44K9j28m0Q6N5l1n4j7N7N0j1j10j1J53N4
$$ 90 45 -31 -43 32 67 -1 -80 -37 71 61 -93 -100 44 73 -55 -95 -9 46 15 -39 -56 1 51 40 -70 -81 72 126
1592A26j94n0J90O8j64p9J44O1r7n5L8L4J8Rr8l9J48O2j82j00K18R8j88j17J86
$$ 126 -68 -118 72 140 -24 -103 41 102 5 -50 -12 22 40 49 -49 -88 60 122 -60 -160 58 156 -32 -149 37
1617C7Q1j56o5J08M2m5j0ql9P5O8j26r6J69J21j99j28K12J20k15q3J95M7j51l
$$ 37 118 -38 -103 5 47 2 -8 -16 -55 20 88 -38 -134 35 156 -43 -171 41 161 -54 -137 58 105 -46 -49
1642d9Q7k4l3P3m2q1R6J10j49j16J89R7k06r3K13O4k11j8J70k1j39N5P2p0k5Q8
$$ -49 38 14 -19 54 12 -69 27 137 -12 -128 61 158 -48 -141 72 136 -75 -93 77 56 -83 -28 44 -26 -51 37
1668C7k8j10R3R1j23q5J79O4k06j7K08%j95J8J98o5j43Q8R1r9j8O6m2n1Q3M2j43
$$ 37 9 -101 -8 83 -40 -125 54 118 -88 -105 103 103 -92 -74 124 59 -84 4 95 -4 -22 44 2 -49 34 76 -67
1695f7oJ67j0k14L2K23o6j97O8J69p5j18N5P4l7j2J5m4J8J08m4j45N8J85p0j94
$$ -67 -73 94 84 -130 -98 125 59 -138 -70 99 24 -94 -39 35 -2 -14 1 -43 -25 83 39 -106 -48 137 67 -127
1721a27N8J99m7j72K7J35j1q6j8L3L6N0q8q2P7J33o5j83O7J75m5j72K9J35Nq8
$$ -127 -69 130 83 -89 -62 73 62 -24 -42 -9 27 77 -11 -93 -16 117 52 -131 -64 111 66 -106 -77 58 63 -25
1747b5l6L7O0J1q2o0Q9J01p3j34P6J43m7j39K4J05J0o6k8J5N4L0n9q1O2J18m6
$$ -25 -61 -24 36 47 -35 -95 -6 95 22 -112 -36 107 60 -79 -55 50 60 -6 -34 -19 35 65 6 -75 -13 105 59
1774E9j46M8J30k2j08oO9Qj3m2j6K6P8l5j22K1J44j2j39j5J31L3j12k0N5M9k4
$$ 59 -87 -39 91 69 -39 -45 24 32 19 -23 -39 -13 65 30 -92 -71 73 61 -78 -93 38 71 -41 -61 -6 43 19
1801A9k0n1K3J05Nj51j7J77M9j86o5J66O3j14p0O4N5j0l6n7J2J01J9j53o6J78
$$ 19 -1 -52 -29 76 81 -70 -87 90 139 -47 -112 54 117 3 -67 -3 52 42 6 -51 -39 62 81 -72 -138 40
1827D0Q9j72j16J58J24j28j18P8J07j2p2l0K4Q9J8j20n4J43R9j46j30J31J53j23
$$ 40 129 -43 -159 -1 123 -5 -123 -45 62 50 -22 -52 -28 61 79 -41 -95 48 147 1 -129 2 155 32
1851C2j41Q4J17l0r0j2L8M7lp0n4J06O7p9j30J02J30q0j52O0J44l7j13K2O3J1
$$ 32 -109 -25 92 62 -28 -40 -2 45 42 -28 -82 24 91 12 -118 -16 114 34 -118 -58 86 49 -64 -42 21 32
1877C2l3l0rM7N5o4p0N8R7m5j20M3J18k1j07PR2kn7j9M1J6mj2l5J6O4l5p4RJ07
$$ 32 -1 -31 -40 7 62 -2 -72 -14 83 38 -82 -39 79 58 -49 -42 50 48 -9 -28 13 29 25 13 -22 -6 58 23 -51 -42 65
1908F5k2j01jJ01Ko5k7N2J3k1j6mJ7K8k6l5J1O1Nq2J0P2J7p4j3O9K9n5l7L2K8
$$ 65 43 -58 -59 42 44 -21 -48 4 17 -4 -20 -24 -7 21 -5 -40 -29 32 37 -45 -35 37 54 -20 -33 36 65 10 -27 5 33
1939C3%l0k1K4L4po0k0P1J1p1k3O8L3o2m2M6N2l8k3j3L7K3j5l9j4O8K2o1l0O6
$$ 33 33 3 -18 6 40 33 -27 -47 24 35 -36 -59 9 42 -20 -62 -16 36 -2 -25 -38 -1 22 7 -32 -46 22 44 -17 -47 19
1970A9L9n3m3K9N7k2l6j1K9K1rl9j0M6K0n2l0M8L3l4m6K9L3%l4qJ3L4j0k6k5L9
$$ 19 58 5 -38 -9 48 26 -10 -21 8 29 20 -19 -29 17 37 -15 -45 3 36 2 -44 -15 18 18 -16 -24 -11 23 13 -13 -38 1
2002AL5l8n1M2L9rm1J0L2mj2k6RK6J9j7m6K8M0lo7J2N7Nm4j8L2J2j6k1j1K1K4
$$ 1 36 -2 -53 -11 28 19 -22 -12 20 16 4 -22 -13 13 32 15 -31 -3 37 34 -33 -21 36 41 -3 -21 11 23 7 -14 -25 -4 20
2035B0mo1KO3Mp0LN4Qm5k0M1K2j9j7lJ4M7qo0JO0J3n0k3N2K7l9l0L0K3j2l4%J5
$$ 20 16 -45 -43 20 24 -46 -43 11 19 -26 -46 -5 17 -2 -19 -22 -8 39 31 -29 -28 32 45 -5 -28 24 51 12 -18 12 35 23 -11 -11 4
2070DJ4Mm0j7M2J8l4l4L1L9l0m3K0M3ml0j3L4LJj2j9L4K0k2l1J0L7J5m9j5L9J8
$$ 4 18 22 -18 -35 7 25 -9 -43 -12 27 -3 -46 -26 17 13 -17 -30 4 7 8 -4 -23 11 31 9 -22 -12 25 40 -9 -24 15 33
2103C3l8k5L2K7j5k0pRK3j2k9jK5K8n1k8M8M8m2n5L5M5j6m0NM3qj6j4rL1K5k0
$$ 33 -5 -30 2 29 14 -6 -13 -4 19 7 -22 -23 2 30 -21 -49 -1 47 5 -50 -15 30 14 -26 -21 22 14 -2 -16 -25 6 31 11
2136A1m9K9N8l0p7M1P6m2o2K4O1j9m2J3J3KJ2j5l7NO6k1p5J5R7l0q4K6P8l1o2
$$ 11 -38 -9 49 19 -58 -17 59 17 -45 -21 40 21 -21 -8 5 7 19 4 -33 -28 38 17 -58 -43 54 24 -60 -34 44 13 -49
2167d9J9N1j6k3JlNM5j5m8J0P5nr3K5Q0j7r0K3P3k2n1J3K9rj0K1k7j7M0J9p9j3
$$ -49 -30 21 5 -18 -17 -20 -15 30 15 -33 -23 52 47 -46 -21 59 42 -48 -25 48 26 -25 -12 17 8 -2 19 -8 -25 15 34 -45 -58
2200e8R4jq6JR2k8p2L8M0l9j8M0Ql3NM6k8l6O2J3o3MN5mn9L4M8m2l9L6L1n8j5
$$ -58 36 35 -51 -50 42 14 -58 -20 20 -19 -37 3 11 -22 -17 29 1 -35 27 40 -23 -19 36 32 -27 7 55 13 -26 10 41 -17 -32
2233c2O1j0m6KN1l2k4M4Km4J1L9k2n2N1L7n8j3N6J4o4jN1Kn3K2L0l0%K6j2l4L3
$$ -32 29 19 -27 -25 26 -6 -30 14 16 -28 -17 22 0 -52 -1 36 -22 -35 21 35 -29 -30 21 23 -30 -8 22 -8 -8 18 6 -28 5
2266EM4m4l9N1M0p0j3N2%l6J0J4j3j9M1j4m1K0L9l5l3L3L5n3nL3Nk4OK3j9j5L7
$$ 5 49 5 -34 17 57 -13 -26 26 26 -10 0 14 1 -18 23 9 -32 -12 27 -8 -41 -8 27 -26 -31 2 7 -17 -11 12 -7 -22 15
2299A5jm5J3N1j4k9JL0mk0K0Kk3K2Ol3kM6Jn8qN9%m8j7M0K0l6j6J3KJ6kl8lN2
$$ 15 14 -31 -18 33 19 -10 -9 21 17 -3 17 19 -4 18 24 -9 -11 35 36 -22 -30 29 29 -19 -36 4 24 -12 -28 -15 -13 3 1 -37 -40 12
2335A2L1p2k4N7N0p4k6N5M0k9l4KL6K0k8m1%N4K3o5m1O6N6o6o2M8N9k3o9kN6K8
$$ 12 43 -29 -53 4 54 -20 -46 9 49 20 -14 -12 24 44 16 -25 -25 29 52 -13 -54 12 68 2 -60 -12 47 24 -45 -47 9 37
2367C7l3l4lO3Qo4l5O0N8n2p4K3R6j3o5j1O1K8m8k7MO1Km3m0M4O2m7o4K6P1Jp6
$$ 37 4 -30 -33 30 38 -26 -61 -1 57 5 -69 -46 50 37 -28 -39 22 50 2 -25 -21 40 42 -1 -41 3 65 18 -46 -20 51 52 -24
2400b4k3N6L3l5m3J2N2Lm3l9M0M8k6p0J4P2J5o9k9N8M2m0o0K4N9J0n2j9M4L5j0
$$ -24 -47 9 42 7 -36 -24 28 31 -12 -51 -11 37 11 -59 -45 27 42 -27 -56 2 44 4 -56 -32 27 37 -15 -34 10 45 35
2431C5p0%P1J4n0m1N4M1k2o9K2N6jo3j9M3L4k7m5JM5J3m3l9M5N7l3o3QO2J6m5
$$ 35 -35 -35 36 50 0 -41 13 54 32 -37 -15 41 40 -23 -42 1 35 8 -37 -36 9 22 -21 -60 -15 42 9 -54 -46 16 32 -13
2463a3l2N6K6j9m4NM5J0l0l2K9N0k1n8jN3K5n3l6M4L6k4n4K0L1Ql0j7J0L1qm2
$$ -13 -45 11 37 18 -26 -21 24 34 4 -28 1 51 30 -28 -29 24 49 -4 -40 4 40 16 -38 -18 13 21 -9 -26 -16 15 7 -35
2495c5lM4K1m7l8M0M9l4l6J7M0%k4oJK9%l1rL6L1m1l7K4M3j4l6mN6Km0j3J1K4
$$ -35 -38 6 27 -20 -58 -18 31 -3 -39 -22 18 18 -6 -12 -11 18 18 -13 -22 14 45 4 -33 -9 34 20 -16 -20 36 38 -2 -15 -4 20
2529B0nl0j4K4K5rl5LM6rl8j4M5Ql4pK2J8j2l1J1K0K8j9k9QL2Nl3j6L8J7j6m3
$$ 20 15 -15 -29 -5 20 11 -24 -21 25 16 -22 -36 9 17 -17 -24 -2 16 4 -27 -16 4 32 13 -16 -8 24 29 -4 -20 18 35 19 -24
2563b4K3L4j5k2kK2jj2j4rK2J2k2k1J1K4j7k3NJ8J6j4j7OK9qj0qJ1K5j4k5J0L3
$$ -24 -1 33 18 -4 -6 16 15 3 -11 -20 2 14 -8 -29 -18 6 -11 -34 -29 -11 5 -9 -26 -20 9 1 -9 -17 -6 19 5 -20 -10 23
2597B3Kk1j2K1J5k0j1PkJ3oj2mK1lj9mJ0J1j2j8K0Nj0pjJ0J0nNj8J9Jnj5J4K0
$$ 23 25 4 -8 13 28 8 -3 4 2 15 9 -3 -7 14 11 -8 -12 -2 9 -3 -21 -1 4 -6 -13 -14 -4 6 1 6 -12 7 8 3 -12 2 22
2634B2k0mLJ4nj5MMPMj8mJ9Jqk2J5J7Jk3mJ4KJj5O%Mj2JjMNj3KK1jj3%QlKpRl
$$ 22 2 -2 1 15 10 -5 -1 3 10 14 -4 -8 11 12 4 -18 -3 14 15 -8 -12 2 4 5 -10 -4 -4 0 -12 -11 -12 -8 -3 -16 -14 7 6 -7 -7 1 -2 0 -7 2 -1
2679aPJ0j1%PKpj2QRJj9%J1J0j4nQjqq%kJ3mlj0J6Moj3PPjKPkNqlJ1KJ2mj0N%
$$ -1 6 16 5 5 12 14 7 -5 3 12 13 -6 -6 5 15 1 -4 4 3 -5 -13 -13 -15 -2 -6 -9 -19 -3 1 -5 -18 -11 -4 -5 -3 4 2 7 -1 -4 7 9 21 17 7 12 12
2726A2oplJ2jj0j0J7MqklK%pj2LJ4J0k1lJ1M%kJPkKNj7J2Nrj4J3L2k7nJ1Rlj7
$$ 12 6 -1 -4 8 7 -3 -13 4 8 0 -2 -5 -3 -3 -10 -22 -19 -5 5 -16 -19 -8 -4 -4 -6 -5 2 0 2 7 -10 2 7 -2 -16 -3 29 2 -3 8 17 14 -3
2769cJ5nmRqj4J3Rj2k1J8J7j1l3OK8Jk0J1pJ3oj7j3K2J7Kk4jL0nl0OK9Ok8kJ3
$$ -3 12 7 3 12 4 -10 3 12 0 -21 -3 14 3 -30 -24 4 5 -15 -4 -11 2 -4 -21 -34 -12 5 7 -17 -18 12 7 -23 -17 12 18 -10 -12 1
2807AJ3j0KmONJj9j3L7Lk9j3L3ll1mJ2J9k5KrJ9KJrj8K1J0%l2L1K1k4k1K9J4j6
$$ 1 14 4 6 2 8 13 14 -5 -18 19 22 -7 -20 13 10 -21 -25 -13 6 -19 -17 -26 -7 -5 -4 -13 -31 -10 0 0 -32 -1 20 -4 -25 4 18 2
2845Bj2J0RmKjmLJ8k5qK1lj0j7J0K8j2k7JJ0J%onJ1mMj3MK8j1k0MK3kj8QJ9qj9
$$ 2 -10 0 9 5 7 6 2 5 23 -2 -10 11 8 -2 -19 -9 19 7 -20 -19 -9 -8 -8 -14 -19 -8 -12 -8 -21 -17 11 0 -20 -16 7 5 -13 -5 14 6 -13
2886a3J8pLPpKnOJ4j5j0J7Jk1NJ2lj6J0Knj1OQqpJ1rLMLllRpJ%K0roqK5mk0J7
$$ -13 5 -2 1 8 1 3 -2 4 18 3 -7 10 11 -10 -5 7 4 -12 -2 0 -5 -16 -10 -2 -10 -17 -6 -15 -12 -8 -5 -8 -11 -2 -9 -8 -8 12 3 -3 -11 14 10 -10 7
2931GLnj2J1lNJnMoJ9j8pLJ9nl1J1J8qk8QJ1nLj0J7qJ4pj2J4J9qj5nK3Pl1QK4
$$ 7 10 5 -7 4 1 6 7 2 6 0 19 1 -6 -3 16 11 -20 -9 9 1 -27 -19 -8 -13 -10 -20 -3 -11 3 -4 -16 -2 17 9 -6 -11 12 19 -12 -4 20
2972B0Mk0j1LJ7jlk8K2J1Nl7ML3nk7pK6Lj4j8J2J0Nj0k0K1J2pj1j9N0Ol2j0K6
$$ 20 24 4 -7 -4 13 12 9 -19 3 14 19 -18 -14 19 14 -13 -20 6 9 -5 -23 -11 -1 4 -6 -26 -5 7 0 -11 -30 20 26 -6 -16 10
3008A0J6j5j8J3%Rj4JNJ2Jj5k1J9K2j3m0K6J9j3j7pRJ7j4kj3K5Lj0k6K2K1j5k7
$$ 10 26 11 -7 6 6 15 1 2 7 19 20 5 -16 3 25 12 -28 -2 17 4 -13 -20 -11 6 -8 -10 -23 2 5 -5 -31 -9 12 -3 -30
3043c0PK8Lk4pK4Mpo%K2Rj4k0J0K9jl4LK7Jk0j6OPJ6k4j1J1J4nk1jK3%j9j1OK2
$$ -30 -23 5 8 -16 -23 1 5 -2 -8 -8 14 23 9 -11 -1 28 27 -7 -4 23 24 4 -12 -6 1 17 -7 -18 -7 7 2 -19 -20 3 3 -16 -27 -21 1
3082Aqj7J4J2klj2J0J5mj1MNJ3lj6PJ9j0j4JJJ8oj9KQJmj9J1J2pj7LJ0Kkj1RJ0
$$ 1 -7 -24 -10 2 0 -3 -15 -5 10 6 -5 -1 4 17 14 -2 5 24 14 0 1 2 20 14 -5 -3 5 6 2 -17 -6 6 -1 -18 -15 -5 -3 -5 -16 -7 3
3123CoqLMNJj7J6Rjj9OJ0KpmjJ7J2j9oQJ0j6%j3J5LJk3LQNk1oL1qnj2mL0qj0r
$$ 3 -3 -11 -8 -4 1 2 -15 1 10 9 -10 -4 6 8 1 -3 -4 13 25 6 0 8 18 2 2 -11 4 7 8 -15 -12 -4 1 -20 -26 5 -3 -8 -20 -24 6 -2 -12 -21
3167b1J5J7j4j0OJ4orjK2Qj4j4QJ0Mj1kOJ1jj8qL0Kl2k1K2K2j3k2KK3kj5rRKJ2
$$ -21 -6 11 -3 -13 -7 7 1 -8 -9 13 21 7 -7 1 11 15 4 2 8 19 18 0 -8 22 24 -8 -29 -7 15 2 -20 -18 5 3 -12 -21 -12 -10 2
3206Bj7oJ5K6k6j5QJ9pj2kK4J7j9k1J2K0nj8NJ2J4j8j9J4K4jm2KJ9J4j1j8%J7
$$ 2 -15 -21 -6 20 -6 -21 -13 6 -1 -13 -15 9 26 7 -14 -2 18 13 -5 0 12 26 8 -11 3 27 26 -16 -14 5 19 8 -10 -10 7
3241Gjj8j7K4J8j4k7JL6mj9nJ7RJ0l1MK4J0k2kJ1J8j1j8j0K9lqk6K9J1j3j5%J0
$$ 7 6 -12 -29 -5 13 -1 -28 -27 9 5 -14 -19 -2 7 17 -14 -10 14 24 2 0 11 29 18 0 -10 19 16 8 -18 11 22 9 -6 -6 4
3277DKj0j3J6J8j5k2kK1Nj6j6J6J7pqlJ6Joj8K2RoplJ0QnoMK9j4j5j9K8Pj7Jm
$$ 4 6 -4 -17 -1 17 2 -20 -22 -1 4 -12 -28 -12 5 -2 -10 -13 3 4 -2 -20 2 11 5 -2 -5 5 13 8 2 6 35 21 6 -13 15 22 5 6 2
3317BJ7rj4qJ7Nj4rJ2Qrk3J4MMLnkJ2orLQJ0qOj3J9nr%OJ6qj1kJ4mmrMMKj1KN
$$ 2 19 10 -4 -12 5 10 -4 -13 -1 7 -2 -25 -11 -7 -3 0 -5 -7 5 -1 -10 -7 1 11 3 9 -4 15 10 1 1 7 23 15 4 2 16 12 8 -1 3 7 9 -2 0 5
3363Ej1Lj1POkpKJ1Kj9L%jQj0PJ0MklrQJ0oj4J1QLonQRnk6J4NLj4KKnQjj0J2j1
$$ 5 -6 -3 -14 -7 -1 -3 -10 -8 3 5 -14 -11 -11 -12 -4 -14 -7 3 7 5 2 -7 1 11 5 -9 2 10 13 7 2 10 19 14 -12 2 7 10 -4 -2 0 -5 3 2 -8 4 -7
3410glMKLrJLrJ4KpPj0LLpJ1Pmj3J6PjqkO%Pj0MnJkj1J9mkk2%J8Kj0qPPPl7J4
$$ -7 -10 -6 -4 -1 -10 -9 -6 -15 -1 1 -6 1 -9 -6 -3 -10 1 8 4 -9 7 14 13 5 3 9 9 16 6 10 5 6 4 -7 12 8 6 -16 -16 2 4 -6 -14 -7 0 7 -30 -16
3458a6lJ1Mj2MJ8lj0oJ7OnmJQJ1j4mJ0J4j4j7J3Rqj1j1J0PqnkmO%j7J8jLj6J8
$$ -16 -19 -8 -4 -16 -12 6 3 -7 -13 4 10 5 1 2 10 21 7 3 13 27 13 -4 9 18 10 -1 -12 -2 5 -3 -8 -10 -14 -8 -8 -25 -7 -8 -5 -21 -3
3499c%KjrJ5JJj1RpK5j9mOPJk2RJ5Qk2kJ1JnpLL%j8JNJ0j1JQlKrlROnj0QMJ0k
$$ -3 -3 -1 -2 -11 4 5 6 -5 4 -3 22 3 -1 5 12 13 -9 0 15 23 1 -1 10 11 6 -1 2 5 5 -13 -12 -7 3 -8 -7 1 -2 0 -9 -12 -3 3 -2 -12 -4 0 10 8
3547Hj5J0OMj0nJ1nMoQOmj3%KPmoOJ1nolQJj7%JJ0rj3J7n%jLj1J4ljJ0KjrNRR
$$ 8 -7 3 9 13 3 -2 9 4 8 2 10 16 12 -1 -1 1 8 4 -2 4 15 10 4 1 9 10 -7 -7 -6 4 -5 -18 -1 -6 -6 -7 -4 -15 -1 -4 -5 5 7 6 -3 2 11 20
3595B0j5mOJ3j4%mJ2omPmqMo%jPoj1J0mPk4QOMj2%J6Mj1MnJ8%j0PlkMKLjJ4j5
$$ 20 5 1 7 20 6 6 2 14 8 4 11 7 -1 3 -3 -3 -4 3 -3 -14 -4 -8 -1 -25 -17 -11 -7 -19 -19 -3 1 -10 -6 -11 7 7 -3 4 1 -1 3 5 8 7 21 6
3641FPj4ROj0kJ1oj2MLQj6K%%J2rj6PROj1NoJ2rNlJ6qqRJ0pJjpJ2Kj0lMJ%jON
$$ 6 13 -1 8 14 4 2 13 7 -5 -1 2 10 -6 -4 -4 -4 8 -1 -17 -10 -1 5 -6 -1 -7 5 -4 1 -2 14 6 -2 7 17 10 11 10 3 15 17 7 4 8 9 9 8 14 19
3689A9j2mPmkm%NknNj3J1j3PqOM%oRJljjKNMj0QMOpQqQJj0KJ4j3KroJ7j1rNmM
$$ 19 7 3 10 6 4 0 0 5 3 -2 3 -10 1 -12 -5 -13 -7 -3 -3 -9 0 1 -2 -3 -4 -2 3 7 -3 5 9 15 8 16 8 16 17 7 9 23 10 12 3 -3 14 3 -6 -1 -5 -1
3739aj3QJjLo%KKLkoK4k1nLOMJ4j1PJ0oj%j2J2oPJJ%j8JKKJmoMkN%NojkrMMRj5
$$ -1 -14 -6 -5 -6 -3 -9 -9 -7 -5 -2 -4 -10 14 -7 -12 -9 -3 1 15 4 11 21 15 14 14 2 14 8 15 16 17 17 -1 0 2 4 5 1 -5 -1 -3 2 2 7 1 0 -2 -11 -7 -3 6 -9
3791iJ4j7K0j6%MNMoRj6J0KkRqJ2o%MLmj0%KJ4rp%Mj5J4j6J3olLJ0j1%nmJ0kk
$$ -9 5 -12 8 -8 -8 -4 1 5 -1 8 -8 2 4 2 11 3 15 9 9 13 16 12 2 2 4 18 9 2 2 6 -9 5 -11 2 -4 -7 -4 6 -5 -5 -10 -14 -4 -6 -8
3836hjJ5rMrJ0ORj5LPMqqpK2jj2NpJ5lj0qRKnj1J2J%kj9J5Ok0JPJ4qnkNJ5j0m
$$ -8 -9 6 -3 1 -8 2 8 17 2 5 12 16 8 0 -7 15 14 2 7 0 15 12 2 -6 3 5 0 -11 1 2 2 0 -19 -4 2 -18 -17 -10 4 -4 -9 -11 -6 9 -1 -5
3882eJ1jJ0j2OPjlkqJ2mmoJ4j1moJ0J2pj1nJ7jj2LPrmKKnJ1qJmJ8j2Mj5J8mJ4
$$ -5 6 5 15 3 9 16 15 12 10 2 14 10 6 0 14 3 -1 -7 3 15 8 -3 -8 9 8 -4 -1 6 -3 -7 -5 -3 -8 3 -5 -4 -8 10 -2 2 -13 5 1 15
3926A5lJPpLnPrQj0jJMj1J1pmnLKLlq%J0j1Pj5J2Qnj1jRjNj2J4kMlOMMj5KQjN
$$ 15 12 13 20 13 16 11 18 9 17 7 6 7 11 0 11 4 0 -5 -2 0 3 0 -8 -8 2 -9 -2 -17 -5 3 -2 -13 -14 -5 -6 -1 -13 1 -1 3 0 6 10 14 -1 1 9 8 13
3975A3j4JJ7Mqj2J0Mjk0KKMlrPPj3JjNjmrJ0OKj3RnMJ1j3J3MnNljkLNjJ%j3RO
$$ 13 -1 0 17 21 13 1 11 15 14 -6 -4 -2 2 -1 -10 -3 4 -9 -8 -9 -4 -5 -9 -18 -8 -2 0 -13 -4 -9 -5 6 -7 6 10 5 10 7 6 4 7 12 11 12 12 -1 8 14
4023A4onjnkjqJ0lMRj2jMnj3J5J0j1LRrJ7rmoJ2RJj3OKKpmLQj4J0JkmPKnoj%k
$$ 14 8 3 2 -3 -5 -6 -14 -4 -7 -3 6 -6 -7 -3 -8 -21 -6 4 -7 -4 5 -4 13 4 0 -6 6 15 16 3 9 11 13 6 2 5 13 -1 9 10 8 4 11 13 8 2 1 1 -1
4072aOlloLMkm%nJ4Jj1RojPkLrJ1mkJ0QjrQpRpKj2JPj1kNnOpJ%pMKnRkKm%OnK
$$ -1 5 2 -1 -7 -4 0 -2 -6 -6 -11 3 4 -7 2 -4 -5 2 0 3 -6 5 1 -1 9 17 16 7 15 8 17 10 12 0 1 8 -3 -5 0 -5 1 -6 -5 -5 -12 -8 -6 -11 -2 -4 -2 -6 -6 0 -5 -3
4127cj0J5qQkpJ4k%jlJ0qmQPqKkkmJ4k2J0LqmKoJ3j2OoNnl%JRj4MKJ0j%lJ1Mr
$$ -3 -13 2 -6 2 0 -7 7 5 5 4 1 11 3 -1 7 14 6 8 6 4 0 14 -8 2 5 -3 -7 -5 -11 2 -10 -4 -10 -5 -10 -13 -13 -12 -3 -17 -13 -11 -1 -2 -2 -5 6 10 1
4176AP%kPqRn%plN%oKkRjqkJJ0kj1jlKjJ0j4J0j1J4jJjnpQmJ8Jk0J7l%rPRMrp
$$ 1 8 8 6 13 5 14 9 9 2 -1 4 4 -2 0 -2 7 6 -2 -4 -3 7 5 -6 -7 -10 -8 -9 1 -13 -3 -14 0 -1 0 -1 -6 -13 -5 -9 9 10 -10 7 4 4 -5 2 11 15 6 -1
4227aNOKk3J4Oj0kJmKqMm%nQoMJj5J0OlPoOLj2J9j3J1nR%MJpMKKMj3RqJoOj1j
$$ -1 4 10 12 -11 3 9 -1 -3 -2 -6 -4 -12 -8 -12 -12 -17 -9 -15 -11 -10 -25 -15 -9 -12 -5 -11 -5 -2 -14 5 -8 3 -2 7 7 11 12 5 9 11 13 17 4 13 5 6 0 6 -5 -6
4277fmJ0%qJOj3MJ1m%pJ0nkJRJj3kJ2mJ0rMqPJ1m%KJ0j6LL%j2J5j0kJqPnMjj5
$$ -6 -10 0 0 -8 -7 -1 -14 -10 1 -3 -3 -10 0 -5 -7 -6 3 4 -9 -11 1 -3 7 -2 2 -6 1 12 8 8 10 20 4 7 10 10 -2 13 3 1 2 -6 1 -4 0 -1 -16
4324a6J7prRLoNQj1lMkJ0kMPmkmJ2Jj1%KOj3KQMmojKPJLj9J4mlpOj4QknKpjJ6
$$ -16 1 -6 -15 -6 -3 -9 -4 4 -7 -10 -6 -8 2 0 4 11 7 5 1 13 14 3 3 5 11 -2 0 8 12 8 2 1 3 10 11 14 -5 9 5 2 -5 1 -13 -5 -7 -12 -10 -17 -18 -2
4374bpmMnJ1NpMOjLkMJ2j2MoQjlkqLKpNpLnjMPj2jmnQJ1j1KOmj1J4mQlm%J1Lj0
$$ -2 -9 -13 -9 -14 -3 2 -5 -1 5 4 7 5 9 21 9 13 7 15 14 11 9 1 4 6 -1 4 -3 0 -5 -6 -2 5 -7 -8 -12 -17 -9 2 -9 -7 -1 -5 -16 -2 -6 2 -1 -5 -5 6 9 -1
4426aQJ%rLMLMklqJ5nojRj4KlKO%mqNqPj3PJ%JNrJ0JmNmPlJ0rJ0j3J1PlokoJ1
$$ -1 7 8 8 -1 2 6 9 13 11 8 0 15 10 4 3 12 -2 0 -3 -1 5 5 1 -7 -2 -10 -3 -16 -9 -8 -8 -7 -2 -11 -1 0 -4 1 -3 4 1 11 2 12 -1 10 17 14 8 6 0 11
4478A1o%%NJj3Rj4J1pjrJ5nJj7PJ0JnJjLj3J7Mjl%lnK0pNLQnqRj4QpnNNlrLLj1
$$ 11 5 5 5 10 11 -2 7 -7 4 -3 -4 -13 2 -3 -2 -19 -12 -2 -1 -6 -5 -6 -3 -16 1 5 4 1 1 -2 -7 13 6 11 14 22 17 9 18 4 12 5 0 5 10 7 -2 1 4 -7
4528gn%PmPoOmLoj0J9mJNqJ0LrRpN%lmRNpJ0oKpJj0J0mJ4j4MJj5Oj0RPMk0QQj0
$$ -7 -12 -12 -5 -9 -2 -8 -2 -6 -3 -9 -19 0 -4 -3 2 -6 4 7 -2 7 0 5 5 2 -2 7 12 5 15 9 11 4 5 -5 5 1 15 1 5 6 -9 -3 -13 -4 3 7 -13 -5 3 -7
4578glKQrKOoJ0j0%LJ2qJ2ooQNmKoQj0ONJnoLj3RRkj1oj1JJ8K%j4KNj1RKl%Jr
$$ -7 -10 -8 0 -9 -7 -1 -7 3 -7 -7 -4 8 0 12 6 0 8 13 9 11 5 13 3 9 14 15 10 4 7 -6 3 12 10 -1 -7 -18 -17 1 3 3 -11 -9 -4 -15 -6 -4 -7 -7 -6 -15
4628a5J9jl%J0j3J5n%QlJ1k2RJkrRrNLrJ4j3jj1NlLkNpJ6j8oJ0OpRrKKN%K%PJ
$$ -15 4 3 0 0 10 -3 12 7 7 15 12 23 1 10 11 9 0 9 0 5 8 -1 13 0 -1 -12 -7 -10 -7 -9 -4 -11 5 -13 -19 -9 -3 -10 -1 -10 -8 -6 -1 -1 1 1 8 9
4676IrJ3j3OQj3J0%ooLjJRmMmoKjj1QpQmkjoJ2L%pkNJJJPJ0mpj8J5N%rOK1k3M
$$ 9 0 13 0 6 14 1 11 11 5 -1 2 1 2 11 7 11 7 1 3 2 -9 -1 -8 0 -4 -6 -7 -13 -1 2 2 -5 -7 -2 -1 0 1 8 18 14 7 -11 4 9 9 0 6 27 4 8
4726HNNpn%kkOj2pK1olj0RNpj0OoLMPj3J3kMj2J6j5MjJ5ljkNkJ5rqRljjmmkOk
$$ 8 13 18 11 6 6 4 2 8 -4 -11 10 4 1 -9 0 5 -2 -12 -6 -12 -9 -5 2 -11 2 0 4 -8 8 -7 -3 -4 11 8 7 5 10 8 23 14 6 15 12 11 10 6 2 0 6 4
4776DJMn%Lj1lJ5j9PPj6Rk%JJ2%okK1j9OJ%mJ4kOqJj0MKOj1%NpMlKJj0LKJ0j4
$$ 4 5 9 4 4 7 -4 -7 8 -11 -4 3 -13 -4 -6 -6 -5 7 7 1 -1 20 1 7 8 8 4 18 16 22 14 15 5 9 11 17 6 6 11 4 8 5 7 8 -2 1 3 13 -1
4824aMMk0J2kp%KRq%PpQoJ1KrNnPMNrpK2j7%J5j1kjNj0QrljNrJ5loO%pRj7J1l
$$ -1 3 7 -13 -1 -3 -10 -10 -8 1 -7 -7 0 -7 1 -5 6 8 -1 4 -1 6 10 15 6 -1 21 4 4 19 8 6 5 10 0 8 -1 -4 -5 0 -9 6 3 -3 3 3 -4 5 -12 -1 -4
4874dPj4QNllPMLKr%P%mKPjPnlqLOlj0Ol%Jj5J2nj1RK%lpJ6%j7J0jJ1rPlJ0rJ0
$$ -4 3 -11 -3 2 -1 -4 3 7 10 12 3 3 10 10 6 8 15 14 21 16 13 5 8 14 11 1 7 4 4 5 -10 2 -3 -14 -5 -3 -3 -6 -13 3 3 -14 -4 -5 6 -3 4 1 11 2 12
4925A2oJ3j4lmJ0LOj4NJjK%mKKj3J5j7JO%Non%lK0qppLNj0N%LPj3J3OjnNJ3j1
$$ 12 6 19 5 2 -2 8 11 17 3 8 9 8 10 10 6 8 10 -3 12 -5 -4 2 2 7 1 -4 -4 -7 13 5 -2 -9 -6 -1 -11 -6 -6 -3 4 -9 4 10 9 4 9 22 11
4972A1JknQQj1jjLLlmlJ0pnMkOnnj3J7j5JJ6rJNj0PkJ1qnJ1kJ2rLK%j0Q%lOj1
$$ 11 12 10 5 13 21 10 9 8 11 14 11 7 4 14 7 2 6 4 10 5 0 -13 4 -11 -10 6 -3 -2 3 -7 0 -2 9 1 -4 7 5 17 8 11 13 13 3 11 11 8 14 3
5020CPkJr%Qoj4J4pJ8j8Nj3J1MLj9J4nPmnK0qmmNJ0rLmPnOLnnNjMolQj2N%rRj
$$ 3 10 8 9 0 0 8 2 -12 2 -5 13 -5 0 -13 -2 2 5 -14 0 -5 2 -2 -7 13 5 1 -3 2 12 3 6 2 9 4 10 13 8 3 8 7 11 5 2 10 -2 3 3 -6 3 2
5070BpNlpMj0Rj2OQNmqNJ7j6NJJ0j4MjJ0KLj5kJ3mjJ1r%Lj7R%%kJ2k3%OjkQrJ
$$ 2 -5 0 -3 -10 -6 -16 -7 -19 -13 -5 0 -4 -12 -7 10 -6 -1 0 10 -4 0 -1 9 11 14 -1 -3 10 6 5 16 7 7 10 -7 2 2 2 0 12 -11 -11 -5 -6 -8 0 -9 -8
5118hKpnJ3lqJ9l%KlOOrOO%kj0ONMLnmn%PmkKplNklLjmpKLkJ0kmlPpNnKMJ0pN
$$ -8 -6 -13 -18 -5 -8 -16 3 0 0 2 -1 5 11 2 8 14 14 12 2 8 13 17 20 15 11 6 6 13 9 7 9 2 -1 4 2 -1 2 1 -3 -10 -8 -5 -7 3 1 -3 -6 1 -6 -1 -6 -4 0 10 3 8
5174HoJ2Kj3NM%Oj0jMnkJPnlkjJ1j3JlJ0j1oRo%LPmrlLO%LkOj2J2kOnJ%J2ojo
$$ 8 2 14 16 3 8 12 12 18 8 7 11 6 4 5 12 7 4 2 1 12 -1 0 -3 7 -4 -10 -1 -7 -7 -4 3 -1 -10 -13 -10 -4 -4 -1 -3 3 -9 3 1 7 2 3 3 15 9 8 2
5225BmK2k3PQj5QL%Qk1J0nlKKj5J0%nlONj1LL%JLRlnKNmnJ4krOMJ1j0j1jJ6no
$$ 2 -2 20 -3 4 12 -3 5 8 8 16 -5 5 0 -3 -1 1 -14 -4 -4 -9 -12 -6 -1 -12 -9 -6 -6 -5 -2 7 4 -1 1 6 2 -3 11 9 0 6 10 21 11 0 -1 15 10 4
5273DJj1JPjOj3%J3j2nJ1onKJ0j5J9j2NnMNqMQjNljJ0j6MJ0kmq%NJLj2lNmj2J3
$$ 4 5 -6 -5 2 1 7 -6 -6 7 -5 -10 1 -5 -10 -8 2 -13 6 -6 -1 -6 -2 3 -5 -1 7 6 11 8 7 17 1 5 15 13 9 1 1 6 7 10 -2 -5 0 -4 -16 -3
5320cj1QpOm%pJ1j2K3qmNMkOkkJ4j4PKj2QJNjJNj0nLMNmPj2Rlkl%l%kj1J7nkr
$$ -3 -14 -6 -13 -7 -11 -11 -18 -7 -19 4 -4 -8 -3 1 -1 5 3 1 15 1 8 10 -2 6 7 12 11 12 17 7 2 5 9 14 10 17 5 14 11 9 6 6 3 3 1 -10 7 2 0 -9
5370iONMqQj3RKlpJ2lkNJ2Mj0j1J4j0kjJ3rpJ0pJ3j6PqLMmlmJ2j8NnQMnJnLQo
$$ -9 -3 2 6 -2 6 -7 2 4 1 -6 6 3 1 6 18 22 12 1 15 5 3 2 15 6 -1 9 2 15 -1 6 -2 1 5 1 -2 -6 6 -12 -7 -12 -4 0 -5 -4 -9 -6 2 -4
5418d%JmQnjJ2LOmK%Jjpj4J7qJ5j3Jj4MJPKKnKoLjj6J7nQj1lRrNJ3j5LkLJ1j7
$$ -4 -4 -3 -7 1 -4 -5 7 10 16 12 14 14 15 14 7 -7 10 2 17 4 5 -9 -5 -4 3 5 7 2 4 -2 1 0 -16 1 -4 4 -7 -10 -1 -10 -5 8 -7 -4 -6 -3 8 -9
5466iPJ3rPKMllKkmJj3J5nQk0RJjjoMk%Mj0J2j4KNmJ0klMQqMlJ0Mj0JOLJj1%R
$$ -9 -2 11 2 9 11 15 12 9 11 9 5 6 -7 8 3 11 -9 0 1 0 -1 -7 -3 -5 -5 -1 -11 1 -13 -11 -6 -10 0 -2 -5 -1 7 -1 3 0 10 14 4 5 11 14 15 4 4 13
5516A3KjjjjJmj0NOkkmnjQj2JP%mOrJ1j1KPjJ1mjkMNJpMk%mRloNKlJ1lj7J1Kq
$$ 13 15 14 13 12 11 12 8 -2 3 9 7 5 1 -4 -5 3 -9 -8 -1 -1 -5 1 -8 3 -8 -6 1 0 11 7 6 4 8 13 14 7 11 9 9 5 14 11 5 10 12 9 20 17 0 11 13 5
5568Ej4%J9j5Lj1KlJ5nnJ5%jMlKmj6J2NPqQj5J1Lj1JJ4mjMmoOpJ2j4NjlklOpp
$$ 5 -9 -9 10 -5 -2 -13 -11 -14 1 -4 -9 6 6 5 9 6 8 4 -12 0 5 12 4 12 -3 8 11 0 1 15 11 10 14 10 4 10 3 15 1 6 5 2 0 -3 3 -4 -11
5615a1QqRj1NNJJnJ4qJknK1j0kpJ3joPnQjPqKRj8J0m%n%mPnp%jLjo%ROrJlKmJ8
$$ -11 -3 -11 -2 -13 -8 -3 -2 -1 -6 8 0 1 -1 -6 15 5 3 -4 9 8 2 9 4 12 11 18 10 12 21 3 13 9 9 4 4 0 7 2 -5 -5 -6 -3 -4 -10 -10 -1 5 -4 -3 -6 -4 -8 10
5668A0j2KJ7j9NjRMJmoNknlJ2mJ3rj0NLj2OnpPJroJ4ok%MjmPnMOKMlrJ6j7J9j2
$$ 10 -2 0 17 -2 3 2 11 15 16 12 6 11 9 4 1 13 9 22 13 3 8 11 -1 5 0 -7 0 1 -8 -14 0 -6 -8 -8 -4 -5 -9 -2 -7 -3 3 5 9 6 -3 13 -4 15 3
5717CmLJ8j3kMjOlNj3lJ0j4J1nKqMkjMj0NrJ3mnjNLrJ0kLjkQNnJ2j0MM%KpRqJ
$$ 3 -1 2 20 7 5 9 8 14 11 16 3 0 10 -4 7 2 4 -4 0 -2 -3 1 -9 -4 -13 0 -4 -9 -10 -5 -2 -11 -1 -3 0 -1 -3 5 10 5 17 7 11 15 15 17 10 19 11 12
5767A2kjJpKNn%RmnJ3k2Nq%qQoROjnnOoJK0j2JJ1j2J4nNj5K0rOlnLoOpl%qPjL
$$ 12 10 9 10 3 5 10 5 5 14 10 5 18 -4 1 -7 -7 -15 -7 -13 -4 2 1 -4 -9 -3 -9 -8 12 0 1 12 0 14 9 14 -1 19 10 16 13 8 11 5 11 4 1 1 -7 0 -1 2
5818BJqNMj2K%pRJNmK%Lp%OrRJ1lqJMOnMKKqllJ1qNNopRj3OmoNJPrl%lMKmoJ1
$$ 2 3 -5 0 4 -8 -6 -6 -13 -4 -3 2 -2 0 0 3 -4 -4 2 -7 2 13 10 2 3 7 13 8 12 14 16 8 5 2 13 5 10 15 9 2 11 -2 4 0 -6 -1 0 7 -2 -5 -5 -8 -4 -2 -6 -12 -1
5874arKLnJ6pJ0qJ3pJ5j1j0J3nlN%kKqJ4rmjkLokjQrOlqmOLpONnjJ5Jj7QKpJ1
$$ -1 -10 -8 -5 -10 6 -1 9 1 14 7 22 11 1 14 9 6 11 11 9 11 3 17 8 4 3 1 4 -2 -4 -5 3 -6 0 -3 -11 -15 -9 -6 -13 -7 -2 -7 -8 7 8 -9 -1 1 -6 5
5924EM%mmK1onJj0J3q%rJ3j5OJ0j4Kkj3J1j5K2qmkJ1j2PljJ0jkOojPnLoK2ppj
$$ 5 9 9 5 1 22 16 11 12 2 15 7 7 -2 11 -4 2 12 -2 0 -2 -15 -4 -19 3 -5 -9 -11 0 -12 -5 -8 -9 1 0 -2 4 -2 -3 4 -1 2 -4 18 11 4 3
5970CJmJ1JNj6LPLoKjrJj3J0JJrNmJpLN%rNMJlKmRJ2qJ3nooJ6j6J1jKoJO%j8Q
$$ 3 4 0 11 12 17 1 4 11 14 8 10 9 0 1 -12 -2 -1 0 -9 -4 -8 -7 -14 -11 -6 -6 -15 -10 -6 -5 -8 -6 -10 -1 11 3 16 11 5 -1 15 -1 10 9 11 5 6 12 12 -6 2
6021BQoKmkJnm%%%KOj2RKpKKOpJjKNnJ2Mk1J9JklOj%j7J8%j0mNJOj0nKmJ1j1L
$$ 2 10 4 6 2 0 1 -4 -8 -8 -8 -8 -6 0 -12 -3 -1 -8 -6 -4 2 -5 -4 -5 -3 2 -3 9 13 -8 11 12 10 7 13 12 12 -5 13 13 3 -1 4 5 11 1 -4 -2 -6 5 -6 -3
6072cj6J1mJ4j2JJ3j4NlJ5qrJ1MoJ1NmMj1lJ9mj3Rj4lK2pKqJ0qrnJ2jqRRj2kl
$$ -3 -19 -8 -12 2 -10 -9 4 -10 -5 -8 7 -1 -10 1 5 -1 10 15 11 15 4 1 20 16 3 12 -2 -5 17 10 12 4 14 6 -3 -8 4 3 -5 4 13 1 -1 -4
6116dJM%rRM%oJMkLj%lmJ8oO%mMJjqk%LqkQJ0plMkqJ2j2pON%jKJKonJ1lrLjJ2
$$ -4 -3 1 1 -8 1 5 5 -1 0 4 2 5 4 4 1 -3 15 9 15 15 11 15 16 15 7 5 5 8 0 -2 6 16 9 6 10 8 0 12 0 -7 -1 4 4 3 5 6 8 2 -3 8 5 -4 -1 -2 10
6171A0mJJkJ5poONooMm%R%j1mKmMJ0j7J2j2JPj6J0j2PjJqJ3j0J1kL%rnRJ4jm%
$$ 10 6 7 8 6 21 14 8 14 19 13 7 11 7 7 16 16 5 1 3 -1 3 13 -4 8 -4 -3 4 -12 -2 -14 -7 -8 -7 -15 -2 -12 -1 -3 0 0 -9 -14 -5 9 8 4 4
6218DPj9J6lLrKRlPo%rmJQpmKMnOklNpj0J4o%LkJOKJKOoJOJj3QNjjJj0QlMnqJ2
$$ 4 11 -8 8 5 8 -1 1 10 7 14 8 8 -1 -5 -4 4 -3 -7 -5 -1 -6 0 -2 -5 0 -7 -17 -3 -9 -9 -6 -8 -7 -1 1 2 4 10 4 5 11 12 -1 7 12 11 10 11 1 9 6 10 5 -3 9
6273IpOj4JPrJ0j2kJN%OopJ1j2RL%qROMoLJ4j7nOJQKj2J2rOqMj1%kJJ2j3pMMN
$$ 9 2 8 -6 -5 2 -7 3 -9 -11 -10 -5 -5 1 -5 -12 -1 -13 -4 -1 -1 -9 0 6 10 4 7 21 4 -1 5 6 14 16 4 16 7 13 5 9 -2 -2 -4 -3 9 -4 -11 -7 -3 2
6322BojPppOj1J9j5J5MrPoM%rJ6oLKlPOmj1J0j6KPkjkkO%ppJ1KqoJ0j6J1pL%m
$$ 2 -4 -5 2 -5 -12 -6 -17 2 -13 2 6 -3 4 -2 2 2 -7 9 3 6 8 5 12 18 14 3 13 -3 -1 6 4 3 1 -1 5 5 -2 -9 2 4 -4 -10 0 -16 -5 -12 -9 -9 -13
6371a3J3j2L%QmMkRKpQjnKOlm%J4j4JJ0kmLoj1%JqP%mMJj0MRJkj4J2jLJoL%jK
$$ -13 0 -12 -9 -9 -1 -5 -1 -3 6 8 1 9 8 3 5 11 8 4 4 18 4 5 15 13 9 12 6 -5 -5 -4 -12 -5 -5 -9 -5 -4 -14 -10 -1 0 -2 -16 -4 -5 -2 -1 -7 -4 -4 -5 -3
6422cRLmKL%lLlnPOojkPpj0PNnjlJkrLNknMJqKjJ0mK%MNLJ1j3Mkj2J2JPj0LKq
$$ -3 6 9 5 7 10 10 7 10 7 2 9 15 9 8 6 13 6 -4 3 8 3 2 -1 0 -2 -11 -8 -3 -5 -10 -6 -5 -13 -11 -12 -2 -6 -4 -4 0 5 8 19 6 10 8 -4 8 9 16 6 9 11 3
6476CkNLqQmj1NkkNmolmJ1kM%pOPlKn%Q%P%mkpJ2PmqKO%rrJ0OnKj3NNknkJ1j8
$$ 3 1 6 9 1 9 5 -6 -1 -3 -5 0 -4 -10 -13 -17 -6 -8 -4 -4 -11 -5 2 -1 1 -4 -4 4 4 11 11 7 5 -2 10 17 13 5 7 13 13 4 -5 5 11 6 8 -5 0 5 3 -2 -4 7 -11
6530a1Q%kmjOnOlmMPLrKlMLmK0j2J2njkJ%KJpjlOpPj1KkmLlNkrOlPNj5J1nNKj
$$ -11 -3 -3 -5 -9 -10 -4 -9 -3 -6 -10 -6 1 4 -5 -3 -6 -2 1 -3 17 5 17 12 11 9 10 10 12 13 6 5 2 8 1 8 -3 -1 -3 -7 -4 -7 -2 -4 -13 -7 -10 -3 2 -13 -2 -7 -2 0 -1
6584amJ1mLnJ5p%JkONor%J3%j4QJj1NLpmlLpJ2nqQokLj2J7mKMJk%oLOjKMJ0on
$$ -1 -5 6 2 5 0 15 8 8 9 7 13 18 12 3 3 16 16 2 10 11 0 5 8 1 -3 -6 -3 -10 2 -3 -11 -3 -9 -11 -8 -20 -3 -7 -5 -1 0 -2 -2 -8 -5 1 0 2 6 16 10 5
6636ElJRnKMmKpLoLqJ0Jj1LJrNjkLjnJ3j0mKO%qRjLmMKPJKkJlMmNj1LJ6k4PmL
$$ 5 2 3 12 7 9 13 9 11 4 7 1 4 -4 6 7 -4 -1 0 -9 -4 -5 -7 -4 -5 -10 3 -7 -11 -9 -3 -3 -11 -2 -3 0 -4 0 2 9 10 12 10 11 8 12 8 13 2 5 21 -3 4 0 3
6690CLom%KnLpmNLmN%mJ0oOKkojLRKJ%j0JL%J0JnNj4J1knNj3Rjj0J3j2J0pKKO
$$ 3 6 0 -4 -4 -2 -7 -4 -11 -15 -10 -7 -11 -6 -6 -10 0 -6 0 2 0 -6 -7 -4 5 7 8 8 -2 -1 2 2 12 13 8 13 -1 10 8 3 8 -5 4 3 -7 6 -6 4 -3 -1 1 7
6741Gj1p%J2pQkm%PlPj5J4P%olQoJ0qnNPnj2O%Mj4NLjMponNj5J9j2OMpjLRj0J0
$$ 7 -4 -11 -11 1 -6 2 0 -4 -4 3 0 7 -8 6 13 13 7 4 12 6 16 8 3 8 15 10 -2 4 4 8 -6 -1 2 1 5 -2 -8 -13 -8 -23 -4 -16 -10 -6 -13 -14 -11 -2 -12 -2
6791bj0J1j0J4mJ4mlkoJ3kkQj3kJ1Jj3J2ponKQpOj0PlokMj4PJ0Pj3KnJ2rLOjL
$$ -2 -12 -1 -11 3 -1 13 9 6 4 -2 11 9 7 15 2 0 11 12 -1 11 4 -2 -7 -5 3 -4 2 -8 -1 -4 -10 -12 -8 -22 -15 -5 2 -11 -9 -14 -2 -11 -8 -2 -3 0
6837@jkRjJpJ3jKjkKnJPpjjKj7Pj4J7jkrMojQmOmklJ0%Kj3J0LPrKL%MKmqLJ7q
$$ 0 -1 -3 6 5 6 -1 12 11 13 12 10 12 7 8 15 8 7 6 8 -9 -2 -16 1 0 -2 -11 -7 -13 -14 -6 -10 -4 -8 -10 -13 -3 -3 -1 -14 -4 -1 6 -3 -1 2 2 6 8 4 -4 -1 16 8
6890Hj9J3Qj1Qpj1J5qlkJ0j1MlLj2J5pMMokQ%j0J0lKJ2j0MOmj3J7KjLkJ1j1Ln
$$ 8 -11 2 10 -1 7 0 -11 4 -4 -7 -9 1 -10 -6 -9 -6 -18 -3 -10 -6 -2 -8 -10 -2 -2 -12 -2 -5 -3 9 -1 3 9 5 -8 9 11 10 13 11 22 11 14 9
6934InKK%qJ5k5J0rJ7nj1oMPj1KNkoKRjKoNJ3jLj8J2pJ2Oj1mJ0rkR%jKqMkJj3
$$ 9 4 6 8 8 0 15 -10 0 -9 8 3 -8 -14 -10 -3 -14 -12 -7 -9 -15 -13 -4 -5 -3 -9 -4 9 8 11 -7 5 -2 10 16 5 1 11 2 0 9 9 8 10 2 6 4 5 -8
6982hNpJJmQOnj2J4rmOlMlPPj6JOM%JM%mNnQLj2Rj2K0j3J5j4MLpQj2Pj9J0Lm%
$$ -8 -3 -10 -9 -8 -12 -4 2 -3 -15 -1 -10 -14 -8 -11 -7 -10 -3 4 -12 -11 -5 -1 -1 0 4 4 0 5 0 8 11 -1 8 -4 16 3 18 4 8 11 4 12 0 7 -12 -2 1 -3 -3
7031cqR%j4J6Jj0RKjmL%OkMJmmRpJ4rMlojPnkjqQjMj1K%jj1J2rLOllNKj6J0J4
$$ -3 -11 -2 -2 -16 0 1 -9 0 2 1 -3 0 0 6 4 8 9 5 1 10 3 17 8 12 9 3 2 9 4 2 1 -7 1 0 4 -7 -5 -5 -6 -17 -5 -14 -11 -5 -8 -11 -6 -4 -20 -10 4
7082Dj1J2lKm%%J3npQqQJMklKnNKmrQjqJ3j0%rNRj2Pj8J0JmQnP%j0J3Oj0KM%N
$$ 4 -7 5 2 4 0 0 0 13 8 1 9 1 9 10 14 12 9 11 6 11 13 9 0 8 7 -1 12 2 2 -7 -2 7 -5 2 -16 -6 -5 -9 -1 -6 1 1 -9 4 10 0 2 6 6 11
7132A1MkMlNjpJPnklpmQJpjkOj3KJQj5N%qJJ0MpPjlJ1j7K0oKoPKoNMkMLnjkOk
$$ 11 15 13 17 14 19 18 11 12 19 14 12 9 2 -2 6 7 0 -1 -3 3 -10 -8 -7 1 -14 -9 -9 -17 -16 -6 -2 -9 -2 -3 -6 5 -12 8 2 4 -2 5 7 1 6 10 8 12 15 10 9 7 13 11
7186A1nPqj1J5jjrNj2J1oJj2J1jnJ0MqjMLjqLR%pJ0okJ1On%qNKkMj1JMlJj2Qj
$$ 11 6 13 5 -6 9 8 7 -2 3 -9 2 -4 -3 -15 -4 -5 -10 0 4 -4 -5 -1 2 1 -7 -4 5 5 -2 8 2 0 11 17 12 12 4 9 11 9 13 2 3 7 4 5 -7 1 0
7235@jMrJN%%nnMKPnrMJ1p%NNJqOj0QoJ9j4OkKnJ4poLjNj7J2j0J0lJkmnj2J5m
$$ 0 -1 3 -6 -5 0 0 0 -5 -10 -6 -4 3 -2 -11 -7 4 -3 -3 2 7 8 0 6 -4 4 -2 17 3 9 7 9 4 18 11 5 8 7 12 -5 7 -3 7 4 5 3 -1 -6 -18 -3 -7
7285g%lR%MqLkKPkjKOljjN%K%nQ%jp%Oj4J2Jj7NlnMMr%NKOjq%J0j1K%JMMrJ1j0
$$ -7 -7 -10 -1 -1 3 -5 -2 -4 -2 5 3 2 4 10 7 6 5 10 10 12 12 7 15 15 14 7 7 13 -1 11 12 -5 0 -3 -8 -4 0 -9 -9 -4 -2 4 3 -5 -5 5 -6 -4 -4 -3 1 5 -4 7 -3
7340cJ5OpOmj4OjJJ0r%JrNPrlKjj0J1nomONmlQ%KnQjroQM%LmPmQ%pMnLJ0j3Om
$$ -3 12 18 11 17 13 -1 5 4 5 15 6 6 7 -2 3 10 1 -2 0 -1 -11 0 -5 -11 -15 -9 -4 -8 -11 -3 -3 -1 -6 2 1 -8 -14 -6 -2 -2 1 -3 4 0 8 8 1 5 0 3 13 0 6 2
7394BnOnMj3J5kpoKLpJlK0j4NnJLoOJjKjPkN%pJ4oMj0KljJ4rMpknJ0kKnRj7LP
$$ 2 -3 3 -2 2 -11 4 2 -5 -11 -9 -6 -13 -12 -15 5 -9 -4 -9 -8 -5 -11 -5 -4 -5 -3 -4 3 1 6 6 -1 13 7 11 1 3 0 -1 13 4 8 1 -1 -6 4 2 4 -1 8 -9 -6 1
7446ArkJPj3kJ0LMj2LJQj2J2j2J0LNKKmmPnnQJ0j5KmKmKOqMj0rJ7mnJ9k7K%O%
$$ 1 -8 -10 -9 -2 -15 -17 -7 -4 0 -12 -9 -8 0 -12 0 -12 -2 1 6 8 10 6 2 9 4 -1 7 17 2 4 0 2 -2 0 6 -2 2 -8 -17 0 -4 -9 10 -17 -15 -15 -9 -9
7494ijQpkRjMrP%P%Mm%LjPj2J3k%mnm%LoL%OMj3LpnJ0j9MJRkNj0J5lPj2JJ1nk
$$ -9 -10 -2 -9 -11 -2 -3 1 -8 -1 -1 6 6 10 6 6 9 8 15 3 16 14 14 10 5 1 1 4 -2 1 1 7 11 -2 1 -6 -11 -1 -20 -16 -15 -6 -8 -3 -13 2 -1 6 -6 -5 6 1 -1
7546amJ3jJ0j9J5n%lO%%rkLj0J2jJ0rmJ1j1rPnPk1PQjJoLkJ3j0LJ0mnJ1LlPoP
$$ -1 -5 8 7 17 -2 13 8 8 5 11 11 11 2 0 3 -7 5 4 14 5 1 12 1 -8 -1 -6 1 -20 -13 -5 -6 -5 -11 -8 -10 3 -7 -4 6 2 -3 8 11 8 15 9 16
7593A6j2oQ%pJ1%%%rnJ4j4JjJ3j6J3%j2QkklPjoPJlj5K5j7Qj2J2MN%lOnMj0J3
$$ 16 4 -2 6 6 -1 10 10 10 10 1 -4 10 -4 -3 -4 9 -7 6 6 -6 2 0 -2 -5 2 1 -5 2 3 0 -15 10 -7 1 -11 1 5 10 10 7 13 8 12 2 15
7638A5olnJ0k1J4QrlJ4j2jj1%J5j3K%MonOOoJ5j4PloJ1nJjlLPNj3J1J%qnRJpL
$$ 15 9 6 1 11 -10 4 12 3 0 14 2 1 -10 -10 5 -8 -6 -6 -2 -8 -13 -7 -1 -7 8 -6 1 -2 -8 3 -2 -1 -2 -5 -2 5 10 -3 8 9 9 1 -4 5 6 -1 2
7685BJMnJj5NjJ0njKj0jNlLQk1NOLlPkPo%J2oqNJ0jmlN%nRqJL%jqNlj1Rjjj4O
$$ 2 3 7 2 3 -12 -7 -8 2 -3 -4 -2 -12 -13 -8 -11 -8 0 -21 -16 -10 -7 -10 -3 -5 2 -4 -4 8 2 -6 -1 9 8 4 1 6 6 1 10 2 3 6 6 5 -3 2 -1 -12 -3 -4 -5 -19 -13
7738a3NjNlnlNljNpQNmKRjjJ5k0RjRlJ0j5J4j0JnNoOj0J0n%krJlKNj0%J4oj1l
$$ -13 -8 -9 -4 -7 -12 -15 -10 -13 -14 -9 -16 -8 -3 -7 -5 4 3 2 17 -3 6 5 14 11 21 6 20 10 11 6 11 5 11 1 11 6 6 4 -5 -4 -7 -5 0 -10 -10 4 -2 -13 -16
7787a6J9lknMJJRKklqOJMnJ3njJkp%lRjjKj1QJj7KLj3PRkJnQpLkJ1%JnkKjPnJ3
$$ -16 3 0 -2 -7 -3 -2 -1 8 10 8 5 -3 3 4 8 3 16 11 10 11 9 2 2 -1 8 7 6 8 -3 5 6 -11 -9 -6 -19 -12 -3 -5 -4 -9 -1 -8 -5 -7 4 4 5 0 -2 0 -1 6 1 14
7841A4qoQj1J5MnkmPnpMJ0oj1pRoJ%J%Llj1J2KJpkJQmLKNkjLJkRj3OmMJlJOnP
$$ 14 6 0 8 -3 12 16 11 9 5 12 7 0 4 14 8 -3 -10 -1 -7 -6 -6 -5 -5 -2 -5 -16 -4 -2 -1 -8 -10 -9 -1 -5 -2 0 5 3 2 5 6 4 13 0 6 2 6 7 4 5 11 6 13
7894A3nnqLMLj1LJpMlKnJQoLQlmPkKKMrjO%Rn%jOjJj0J1mrKJ1lj1%Rjj1j%OKj0
$$ 13 8 3 -5 -2 2 5 -6 -3 -2 -9 -5 -8 -6 -11 -10 -2 -8 -5 3 0 -4 3 1 3 5 9 0 -1 5 5 14 9 9 8 14 13 14 4 15 11 2 4 15 12 1 1 10 9 -2 -3 -3 3 5 -5
7948eLqNNj4J5mjnqRJ7j6RMlPlnjQklJ2knJl%pJ0pmLl%J2j8LjRj6mJ4NPj4qLk
$$ -5 -2 -10 -5 0 -14 1 -3 -4 -9 -17 -8 9 -7 2 6 3 10 7 2 1 9 7 4 16 14 9 10 7 7 0 10 3 -1 2 -1 -1 11 -7 -4 -5 4 -12 -16 -2 3 10 -4 -12 -9 -11
7998a1J2rRNnqJ6qPl%NqJ6qNpKOrJ0j3%Oj6jOJKmj7MQJpJ1kmMnjOjlPnP%qOOJ
$$ -11 1 -8 1 6 1 -7 9 1 8 5 5 10 2 18 10 15 8 10 16 7 17 4 4 10 -6 -7 -1 0 2 -2 -19 -15 -7 -6 -13 -2 -4 -8 -4 -9 -10 -4 -5 -8 -1 -6 1 1 -7 -1 5 6
8050Fl%MllNllLpOJLoLpPj8PnKKkJ3j0%RnnOmjLJ1j0jJ3k%kPOjj6J1JJpLjmMm
$$ 6 3 3 7 4 1 6 3 0 3 -4 2 3 6 0 3 -4 3 -15 -8 -13 -11 -9 -11 2 -8 -8 1 -4 -9 -3 -7 -8 -5 6 -4 -5 8 6 6 4 11 17 16 0 11 12 13 6 9 8 4 8 4
8103DmNKoLj1KQqLpqPoJ5kkqJ1poJ0MoMkJ4Nj7N%LmK1rpJ3j1oQMj2lOmJ0mj1J1
$$ 4 0 5 7 1 4 -7 -5 3 -5 -2 -9 -17 -10 -16 -1 -3 -5 -13 -2 -9 -15 -5 -1 -7 -3 -5 9 14 -3 2 2 5 1 22 13 6 19 8 2 10 14 2 -1 5 1 11 7 -4 7
8152GrlLr%NLKqlOQj0NPMrMlNjoJ6j0J%JLmPrMOj2J6qj0Jj1
$$ 7 -2 -5 -2 -11 -11 -6 -3 -1 -9 -12 -6 2 -8 -3 4 8 -1 3 0 5 4 -2 14 4 5 5 6 9 5 12 3 7 13 1 17 9 -1 0 -11
8191a1
##END NTUPLES=NMR FID
##END=
