##TITLE=1H_LY-DMAA.Per.3.7
 CDCl3
 8 sc, 
 11.02.2022
##JCAMPDX= 6.0         $$ Bruker NMR JCAMP-DX V2.0
##DATA TYPE= NMR FID
##DATA CLASS= NTUPLES
##ORIGIN= UXNMR, Bruker Analytische Messtechnik GmbH
##OWNER= root
$$ XWIN-NMR		Version 3.5
$$ Fri Feb 11 11:15:43 2022 Russian Standard Time (UT+4h)  she@DPX200
##.OBSERVE FREQUENCY= 200.131346
##.OBSERVE NUCLEUS= ^1H
##.DELAY= (6, 6)
##.ACQUISITION MODE= SIMULTANEOUS
##.ACQUISITION SCHEME= undefined
##.AVERAGES= 8
##.DIGITISER RES= 18
##SPECTROMETER/DATA SYSTEM= spect
##.PULSE SEQUENCE= zg30
##.SOLVENT NAME= CDCl3
##.SHIFT REFERENCE= (INTERNAL, CDCl3, 0, 15.7039)
##AUDIT TRAIL= $$ (NUMBER, WHEN, WHO, WHERE, WHAT)
$$ ##TITLE= Audit trail, XWIN-NMR		Version 3.5
$$ ##JCAMPDX= 5.01
$$ ##ORIGIN= Bruker BioSpin GmbH
$$ ##OWNER= she
$$ F:/spectra/data/she/nmr/H-F/1/audita.txt
$$ ##AUDIT TRAIL=  $$ (NUMBER, WHEN, WHO, WHERE, WHAT)
(   1,<2022-02-11 11:13:58.46 +0400>,<she>,<DPX200>,
      <created by zg, POWCHK disabled, PULCHK disabled
       configuration hash MD5:
       00 E9 B6 7A A2 85 ED C7 34 08 36 98 17 FE 4E 26
       data hash MD5: 16K
       60 CB 3D 24 BF D2 EA AC E7 6C 30 3C 24 32 20 EE>)
$$ ##END=
$$ 
$$ hash MD5
$$ 69 E3 C4 A8 9C EB 40 C9 DA FA AD 45 CC 75 33 4E
##$RELAX= 
##$RELAX= 
##$RELAX= 
##$RELAX= 
##$RELAX= 
##$RELAX= 
$$ Bruker specific parameters
$$ --------------------------
##$DU= <F:/spectra>
##$EXPNO= 1
##$NAME= <H-F>
##$PROCNO= 1
##$TYPE= <nmr>
##$USER= <she>
##$AMP= (0..31)
100 100 100 100 100 100 100 100 100 100 100 100 100 100 100 100 100 100 
100 100 100 100 100 100 100 100 100 100 100 100 100 100 
##$AQSEQ= 0
##$AQ_mod= 1
##$AUNM= <au_zg>
##$AUTOPOS= <>
##$BF1= 200.13
##$BF2= 200.13
##$BF3= 200.13
##$BF4= 200.13
##$BF5= 200.13
##$BF6= 200.13
##$BF7= 200.13
##$BF8= 200.13
##$BYTORDA= 1
##$CFDGTYP= 0
##$CFRGTYP= 5
##$CHEMSTR= <none>
##$CNST= (0..31)
1 1 145 1 1 1 1 1 1 1 1 1 1 1 1 1 1 1 1 1 1 1 1 1 1 1 1 1 1 1 1 1 
##$CPDPRG= <>
##$CPDPRG1= <>
##$CPDPRG2= <>
##$CPDPRG3= <>
##$CPDPRG4= <mlev>
##$CPDPRG5= <mlev>
##$CPDPRG6= <mlev>
##$CPDPRG7= <mlev>
##$CPDPRG8= <mlev>
##$CPDPRGB= <>
##$CPDPRGT= <>
##$D= (0..31)
0 1.2 0 0 0 0 0 0 0 0.06 0 0.03 0 0 0 0 0.0002 0 0 0 0 0 0 0 0 0 0 0 0 
0 0 0 
##$DATE= 1644563637
##$DBL= (0..7)
120 120 120 120 120 120 120 120 
##$DBP= (0..7)
150 150 150 150 150 150 150 150 
##$DBP07= 0
##$DBPNAM0= <>
##$DBPNAM1= <>
##$DBPNAM2= <>
##$DBPNAM3= <>
##$DBPNAM4= <>
##$DBPNAM5= <>
##$DBPNAM6= <>
##$DBPNAM7= <>
##$DBPOAL= (0..7)
0.5 0.5 0.5 0.5 0.5 0.5 0.5 0.5 
##$DBPOFFS= (0..7)
0 0 0 0 0 0 0 0 
##$DE= 6
##$DECBNUC= <off>
##$DECIM= 32
##$DECNUC= <off>
##$DECSTAT= 4
##$DIGMOD= 1
##$DIGTYP= 9
##$DL= (0..7)
0 120 120 120 120 120 120 120 
##$DP= (0..7)
150 150 150 150 150 150 150 150 
##$DP07= 0
##$DPNAME0= <>
##$DPNAME1= <>
##$DPNAME2= <>
##$DPNAME3= <>
##$DPNAME4= <>
##$DPNAME5= <>
##$DPNAME6= <>
##$DPNAME7= <>
##$DPOAL= (0..7)
0.5 0.5 0.5 0.5 0.5 0.5 0.5 0.5 
##$DPOFFS= (0..7)
0 0 0 0 0 0 0 0 
##$DQDMODE= 0
##$DR= 18
##$DS= 0
##$DSLIST= <SSSSSSSSSSSSSSS>
$$ [...]
##$SUBNAM2= <"">
##$SUBNAM3= <"">
##$SUBNAM4= <"">
##$SUBNAM5= <"">
##$SUBNAM6= <"">
##$SUBNAM7= <"">
##$SUBNAM8= <"">
##$SUBNAM9= <"">
##$SW= 18.0517287032376
##$SWIBOX= (0..15)
0 0 2 0 0 0 0 0 0 0 0 0 0 0 0 0 
##$SW_h= 3612.71676300578
##$TD= 16384
##$TD0= 1
##$TE= 0
##$TE2= 300
##$TE3= 300
##$TEG= 300
##$TL= (0..7)
0 120 120 120 120 120 120 120 
##$TP= (0..7)
150 150 150 150 150 150 150 150 
##$TP07= 0
##$TPNAME0= <>
##$TPNAME1= <>
##$TPNAME2= <>
##$TPNAME3= <>
##$TPNAME4= <>
##$TPNAME5= <>
##$TPNAME6= <>
##$TPNAME7= <>
##$TPOAL= (0..7)
0.5 0.5 0.5 0.5 0.5 0.5 0.5 0.5 
##$TPOFFS= (0..7)
0 0 0 0 0 0 0 0 
##$TUNHIN= 0
##$TUNHOUT= 0
##$TUNXOUT= 0
##$USERA1= <user>
##$USERA2= <user>
##$USERA3= <user>
##$USERA4= <user>
##$USERA5= <user>
##$V9= 5
##$VALIST= <valist>
##$VCLIST= <CCCCCCCCCCCCCCC>
##$VD= 0
##$VDLIST= <DDDDDDDDDDDDDDD>
##$VPLIST= <PPPPPPPPPPPPPPP>
##$VTLIST= <TTTTTTTTTTTTTTT>
##$WBST= 1024
##$WBSW= 4
##$XGAIN= (0..3)
0 0 0 0 
##$XL= 0
##$YL= 0
##$YMAX_a= 65829
##$YMIN_a= -63580
##$ZGOPTNS= <>
##$ZL1= 120
##$ZL2= 120
##$ZL3= 120
##$ZL4= 120
##$ABSF1= 10
##$ABSF2= 0
##$ABSG= 5
##$ABSL= 3
##$ALPHA= 0
##$AQORDER= 0
##$ASSFAC= 0
##$ASSFACI= 0
##$ASSFACX= 0
##$ASSWID= 0
##$AUNMP= <proc_1d>
##$AZFE= 0.1
##$AZFW= 0.1
##$BCFW= 1
##$BC_mod= 2
##$BYTORDP= 1
##$COROFFS= 0
##$CY= 11.3945322036743
##$DATMOD= 1
##$DC= 2
##$DFILT= <>
##$DTYPP= 0
##$F1P= 2.36226072786647
##$F2P= -0.459571619588291
##$FCOR= 0.5
##$FTSIZE= 0
##$FT_mod= 4
##$GAMMA= 1
##$GB= 0.15
##$INTBC= 1
##$INTSCL= 1
##$ISEN= 128
##$LB= 0.24
##$LEV0= 0
##$LPBIN= 0
##$MAXI= 10000
##$MC2= 0
##$MEAN= 0
##$ME_mod= 0
##$MI= 1.114404
##$NCOEF= 0
##$NC_proc= 0
##$NLEV= 6
##$NOISF1= 3.799351
##$NOISF2= 2.8
##$NSP= 1
##$NTH_PI= 0
##$NZP= 0
##$OFFSET= 15.70392
##$PC= 1
##$PHC0= -16317.62
##$PHC1= 21.40078
##$PH_mod= 1
##$PKNL= yes
##$PPARMOD= 0
##$PSCAL= 0
##$PSIGN= 0
##$REVERSE= no
##$SF= 200.130013532006
##$SI= 16384
##$SIGF1= 3
##$SIGF2= 2
##$SINO= 400
##$SIOLD= 16384
##$SREGLST= <1H.CDCl3>
##$SSB= 0
##$STSI= 0
##$STSR= 0
##$SW_p= 3612.71676300578
##$SYMM= 0
##$S_DEV= 0
##$TDeff= 0
##$TDoff= 0
##$TI= <>
##$TILT= no
##$TM1= 0
##$TM2= 0
##$TOPLEV= 0
##$USERP1= <user>
##$USERP2= <user>
##$USERP3= <user>
##$USERP4= <user>
##$USERP5= <user>
##$WDW= 1
##$XDIM= 8192
##$YMAX_p= 0
##$YMIN_p= 0
$$ End of Bruker specific parameters
$$ ---------------------------------
##NTUPLES= NMR FID
##VAR_NAME=  TIME,          FID/REAL,        FID/IMAG
##SYMBOL=    X,             R,               I
##VAR_TYPE=  INDEPENDENT,   DEPENDENT,       DEPENDENT
##VAR_FORM=  AFFN,          ASDF,            ASDF
##VAR_DIM=   8192,          8192,            8192
##UNITS=     SECONDS,       ARBITRARY UNITS, ARBITRARY UNITS
##FACTOR=    0.0002768,     1,               1
##FIRST=     0,             0,               0
##LAST=      2.2672688,     0,               0
##MIN=       0,             -63580,          0
##MAX=       2.2672688,     65829,           0
$$ Real data points
##PAGE= N=1
##DATA TABLE= (X++(R..R)), XYDATA
0 0 0 0 0 0 0 0 0 0 0 0 0 0 0 0 0 0 0 0 0 0 0 0 0 0 0 0 0 -8 8 -8 8 -8 8 -8 8 -10 15 -16 16 -16 20 -24 24 -26 30 -32
46 -32 37 -40 44 -47 53 -58 65 -71 79 -88 99 -111 126 -142 166 -193 229 -281 356 -478 691 -1150
68 -1150 2523 -14607 -63580 502 58177 7045 -46570 -13324 29986 18050 -10941 -19788 -8601
81 -8601 19529 26669 -16354 -41214 11726 50801 -5845 -54918 -281 52940 5708 -46027 -10019
94 -10019 34604 12472 -20659 -13088 5438 11807 9096 -9015 -21695 5229 31128 -983 -36574
107 -36574 -2904 37975 6119 -35286 -7855 29491 8352 -21153 -7264 11715 5073 -2202
119 -2202 -2181 -6430 -1080 13230 3877 -17964 -6119 20079 7084 -20067 -6992 17973 5636
132 5636 -14565 -3416 10315 698 -5823 2228 1759 -4644 1802 6561 -4289 -7354 6009 7272
146 7272 -6669 -6054 6658 4072 -6101 -1606 5171 -1138 -4242 3536 3180 -5585 -2427 6708 1659
161 1659 -7114 -1164 6499 687 -5146 -282 3235 -90 -903 605 -1329 -1010 3443 1575 -4850 -1942
177 -1942 5745 2358 -5848 -2554 5282 2578 -4176 -2466 2624 2128 -957 -1718 -796 1107 2198 -588
193 -588 -3366 -7 3993 465 -4160 -818 3945 1129 -3259 -1251 2418 1410 -1302 -1389 265 1444
209 1444 771 -1412 -1616 1403 2218 -1411 -2619 1300 2658 -1249 -2587 979 2202 -741 -1774 278
225 278 1158 195 -543 -775 -39 1404 636 -1904 -1019 2388 1411 -2593 -1541 2685 1652 -2442 -1549 2014
243 2014 1367 -1376 -1125 529 744 289 -448 -1216 12 1894 243 -2517 -555 2801 712 -2865 -810
260 -810 2650 865 -2128 -752 1514 709 -663 -495 -105 398 945 -200 -1540 80 2008 -3 -2237
277 -2237 -68 2182 18 -1991 -55 1503 -77 -1018 61 358 -148 184 114 -723 -55 1094 -31
294 -31 -1282 214 1341 -329 -1158 553 935 -653 -532 800 165 -803 233 760 -559 -649 725 407
312 407 -858 -201 743 -147 -608 404 291 -733 22 955 -401 -1120 731 1208 -929 -1164 1107 1084
330 1084 -1048 -835 935 568 -616 -203 226 -194 216 548 -731 -945 1102 1156 -1492 -1397 1615 1422
348 1422 -1675 -1429 1477 1238 -1149 -973 677 627 -70 -171 -502 -246 1130 739 -1573 -1120 1926 1442
366 1442 -2064 -1659 1979 1693 -1727 -1654 1204 1359 -661 -1067 -78 512 695 -39 -1359 -560 1786 1073
384 1073 -2068 -1495 2124 1798 -1935 -1887 1608 1857 -1045 -1539 469 1162 212 -606 -794 6 1261 563
402 563 -1617 -1132 1695 1473 -1697 -1779 1410 1747 -1107 -1688 594 1341 -149 -935 -323 405 703 153
420 153 -937 -604 1087 1054 -1019 -1276 901 1428 -627 -1366 351 1176 -41 -876 -244 442 393 -96 -527
439 -527 -337 464 583 -410 -812 204 865 -24 -826 -171 696 351 -459 -425 243 473 39 -379 -196 255
459 255 350 -49 -404 -168 371 347 -312 -581 144 657 -44 -759 -125 691 184 -629 -259 421 233 -218 -174
480 -174 -16 80 284 60 -457 -158 660 279 -754 -319 820 337 -808 -292 712 172 -633 -71 424
499 424 -113 -298 182 48 -329 96 334 -346 -363 528 305 -683 -200 833 109 -877 46 941 -119 -851
519 -851 240 787 -246 -577 246 348 -202 -53 109 -281 -49 552 -74 -889 82 1062 -145 -1219 103
538 103 1198 -77 -1137 -2 916 104 -594 -161 244 244 179 -220 -535 228 903 -135 -1111 36 1243
557 1243 94 -1222 -231 1066 316 -855 -412 490 401 -153 -388 -248 284 535 -166 -779 2 920 179
576 179 -916 -308 854 444 -640 -479 436 497 -156 -418 -93 308 283 -185 -447 -2 477 123 -474 -289
596 -289 338 335 -228 -397 32 372 116 -305 -225 227 293 -94 -270 25 223 99 -72 -124 -49 168 243 -153 -380
619 -380 117 461 -89 -540 -6 486 2 -430 -80 212 28 -59 -29 -178 -38 368 73 -554 -109 702 174
640 174 -729 -151 758 178 -623 -94 509 61 -298 35 90 -119 136 183 -363 -274 507 233 -681 -257 715
661 715 165 -769 -119 720 -8 -624 88 491 -169 -311 245 147 -232 83 251 -263 -165 480 108 -622 7
682 7 752 -111 -823 179 809 -259 -790 242 631 -236 -479 123 234 -50 12 -87 -291 190 542 -253 -733
703 -733 338 900 -312 -951 291 948 -184 -829 72 631 65 -388 -213 71 302 197 -403 -530 399
722 399 720 -413 -903 312 932 -208 -895 76 770 105 -541 -213 301 351 -1 -400 -252 453 503 -422
742 -422 -669 368 747 -271 -772 134 653 -35 -527 -132 294 203 -98 -306 -143 318 306 -351 -443 311 517
763 517 -265 -497 227 467 -115 -311 69 200 21 -6 -59 -121 113 253 -147 -342 144 341 -195 -367 163
784 163 256 -214 -202 172 44 -206 33 157 -167 -135 258 99 -304 -24 332 -8 -285 86 252 -124 -145 204
806 204 48 -239 63 261 -176 -278 224 239 -303 -228 304 149 -332 -115 266 19 -208 41 135 -121 -27 188
828 188 -55 -227 156 277 -221 -256 274 280 -288 -251 285 200 -266 -156 190 77 -138 -27 52 -70 18 109 -84
851 -84 -180 141 230 -175 -263 204 287 -173 -273 179 268 -123 -205 100 167 -46 -74 23 -19 -19 92 -13 -190 -19 220
876 220 9 -293 -60 280 47 -292 -53 239 28 -171 21 122 -61 -20 151 -30 -192 124 286 -133 -305
897 -305 196 363 -176 -315 167 261 -150 -186 93 24 -86 125 23 -314 -33 436 -8 -574 -10 621 4
918 4 -633 -7 564 26 -433 -11 256 9 -15 51 -186 -73 433 132 -598 -186 717 222 -796 -249 740
939 740 234 -662 -216 467 128 -278 -61 17 -76 209 188 -421 -282 604 359 -699 -401 754 391 -705
959 -705 -355 614 260 -466 -141 273 -22 -98 167 -121 -316 258 401 -416 -466 488 449 -546 -400 548 290
980 290 -499 -139 444 2 -339 165 250 -274 -128 385 34 -405 98 400 -203 -326 285 201 -382 -97 415
1001 415 -66 -483 169 472 -281 -480 319 400 -321 -322 274 194 -190 -35 84 -112 56 291 -139 -426 266
1022 266 570 -281 -627 304 649 -264 -606 175 490 -74 -348 -61 116 144 64 -255 -310 286 467 -316 -617
1043 -617 262 684 -184 -681 89 630 50 -476 -135 318 247 -97 -291 -114 318 323 -294 -487 224 573 -145
1064 -145 -618 1 553 86 -482 -202 311 259 -145 -301 -40 286 198 -244 -326 163 408 -57 -432 -49 394
1085 394 140 -313 -220 202 268 -66 -275 -72 224 160 -178 -246 88 270 2 -269 -107 221 175 -141 -232 51
1107 51 262 61 -237 -121 211 204 -134 -227 50 226 39 -173 -120 106 175 -23 -231 -74 241 145 -246 -229 185
1130 185 241 -145 -246 58 206 10 -143 -75 67 148 36 -172 -97 214 192 -196 -221 204 253 -147 -235 128 200
1153 200 -77 -162 8 67 17 -7 -87 -83 115 122 -166 -195 184 206 -218 -202 207 183 -188 -139 183 104 -122 -30 95
1178 95 -8 -7 63 -43 -88 139 116 -201 -124 243 102 -297 -108 292 73 -303 -66 246 18 -209 -8 106
1200 106 -26 12 37 -117 -39 220 44 -308 -35 379 49 -409 -32 412 26 -367 -26 272 14 -167 -19
1221 -19 38 -1 92 -12 -240 -3 334 6 -413 -4 463 18 -452 -11 410 23 -301 10 198 4 -50 7
1243 7 -90 -11 222 11 -338 -13 397 -5 -452 -25 416 -18 -392 7 291 -35 -179 32 52 -41 79 50
1265 50 -172 -46 285 46 -332 -21 362 20 -347 17 316 -26 -239 51 126 -93 -41 81 -60 -118 124
1286 124 83 -216 -92 230 51 -270 -31 236 -25 -198 66 137 -100 -51 156 3 -159 66 174 -97 -161
1307 -161 144 143 -137 -90 127 38 -101 19 44 -93 -24 136 -26 -216 46 220 -83 -237 77 206 -61 -181
1329 -181 38 112 5 -32 -27 -55 68 143 -94 -212 105 272 -85 -295 61 292 -38 -268 -6 187 51 -107
1351 -107 -86 5 117 107 -132 -212 133 285 -121 -329 94 348 -50 -323 1 256 60 -169 -94 48 116 41
1373 41 -162 -177 140 241 -157 -333 93 339 -74 -358 12 296 31 -237 -75 125 109 -24 -121 -82 115 205
1395 205 -89 -264 84 337 -29 -322 3 302 32 -252 -73 161 62 -93 -94 -29 53 99 -55 -201 4 235
1417 235 10 -284 -42 278 64 -242 -82 203 87 -124 -65 60 51 28 -14 -89 -12 157 53 -187 -81 200
1439 200 105 -203 -131 167 113 -154 -114 85 65 -53 -58 -12 -3 46 59 -91 -88 118 133 -116 -150 132 166 -116 -155 98
1465 98 130 -74 -97 34 60 -30 -14 -7 -58 25 96 -42 -148 43 175 -55 -185 54 179 -58 -151 47 128 -31
1489 -31 -69 39 27 -33 31 31 -87 -32 118 20 -150 -30 162 -11 -179 0 152 -30 -136 29 93 -61 -41 68
1513 68 2 -81 35 89 -69 -80 116 84 -118 -47 143 20 -131 20 116 -47 -112 83 69 -112 -60 115 14 -143
1537 -143 -9 115 -40 -107 53 55 -74 -27 79 -26 -96 71 106 -104 -106 151 108 -139 -93 155 90 -128 -52 87
1561 87 16 -50 9 0 -66 34 90 -95 -137 108 141 -147 -172 125 157 -124 -147 85 109 -42 -61 5 3 29 50 -78 -95
1588 -95 93 155 -106 -180 98 180 -87 -176 59 143 -36 -118 -3 41 32 7 -55 -71 63 125 -60 -157 50 184 -21
1613 -21 -170 5 145 18 -106 -36 61 46 -12 -53 -62 19 85 -21 -143 -27 130 23 -139 -69 111 72 -67 -62 32
1638 32 71 14 -51 -55 28 85 18 -94 -35 125 84 -76 -92 60 97 -21 -86 -22 78 39 -50 -72 -3 75 20 -97 -78
1665 -78 59 94 -48 -114 21 112 27 -88 -42 85 77 -32 -71 10 81 46 -45 -63 53 104 -9 -107 -23 98 43 -90
1691 -90 -72 68 68 -40 -75 -3 56 25 -43 -57 -9 76 29 -85 -61 68 65 -70 -86 40 80 -13 -70 -7 34 13 -2 -25
1719 -25 -32 41 68 -36 -84 28 100 -6 -84 -4 84 15 -65 -10 18 28 30 -7 -54 12 102 8 -118 -25 122 34 -112 -43
1747 -43 88 39 -70 -52 18 14 16 -9 -70 -32 93 33 -119 -59 132 69 -131 -67 125 68 -69 -36 58 39 2 7 -23 -30
1775 -30 75 68 -96 -90 116 94 -129 -110 115 82 -116 -79 73 33 -66 -24 18 -28 1 49 -59 -86 75 100 -76 -89
1801 -89 110 100 -102 -68 108 63 -95 -17 92 -8 -58 49 32 -67 -7 70 -37 -87 45 72 -85 -75 92 50 -102
1826 -102 -32 121 4 -110 19 86 -27 -73 45 53 -54 -16 56 -11 -45 50 26 -79 -7 104 -1 -131 12 132
1850 132 -32 -119 23 110 -21 -82 30 45 -9 3 15 -34 8 84 2 -102 10 127 -11 -140 10 138 -14 -118
1874 -118 -7 84 10 -56 -23 8 19 30 -30 -82 24 102 -22 -121 17 135 10 -109 -10 116 41 -59 -27 51 59 5
1900 5 -47 -36 39 76 -30 -98 18 103 -4 -112 -21 96 28 -85 -59 33 37 -17 -60 -33 48 55 -35 -77 20 95 3 -82 -3
1929 -3 81 51 -43 -33 17 51 22 -49 -45 51 69 -32 -84 -7 66 -3 -73 -36 46 24 -25 -41 -19 33 43 -27 -71 6 95 1 -85
1960 -85 -20 96 37 -68 -34 47 45 -1 -36 -22 29 69 -8 -82 -4 113 37 -121 -37 114 53 -82 -58 51 58 -20 -44 -24
1988 -24 34 70 3 -99 -33 105 46 -118 -73 105 79 -101 -91 50 73 -36 -63 -15 22 41 7 -83 -33 92 54 -100
2014 -100 -91 101 102 -78 -100 73 106 -19 -76 7 56 20 -14 -42 -19 53 42 -65 -80 65 104 -70 -117 37 93 -34
2040 -34 -94 7 61 0 -34 -26 -10 35 33 -25 -36 44 73 -32 -79 27 86 -15 -73 20 67 -6 -36 8 28 10 -11 -8 -21 -1
2070 -1 33 -25 -70 4 58 -15 -67 -8 48 -4 -65 0 34 -1 -31 -3 5 -6 7 -3 -19 1 36 -4 -39 14 46 -1 -41 -4 51
2101 51 1 -54 -4 21 2 -14 -10 -1 8 22 -10 -29 11 50 0 -49 2 49 11 -43 -19 36 19 -27 -26 -7 21 -5 -24 -32 8 35 -6
2134 -6 -51 -14 49 25 -46 -32 34 45 -34 -34 26 39 10 -29 -18 9 35 7 -35 -10 48 25 -55 -44 38 43 -35 -57 5 22 -5 -34
2166 -34 -26 -2 6 4 -41 -34 34 41 -34 -43 14 67 -6 -38 15 50 24 -22 -15 -1 19 16 -26 -36 10 54 -14 -53 -6 52 6 -60 -16 25
2200 25 13 -26 -28 -11 9 17 -8 -47 -8 50 5 -59 -23 54 23 -39 -36 35 31 -6 -23 -14 12 33 -2 -27 -13 48 36 -49 -42 50 50 -33
2234 -33 -45 25 55 -11 -31 -18 14 32 13 -39 -25 29 46 -33 -52 20 62 -13 -69 -12 54 8 -39 -18 12 6 -10 -28 -25 27 52
2265 52 -13 -50 3 61 13 -56 -6 51 26 -27 -25 18 30 -4 -18 -18 -5 42 6 -50 -22 43 21 -53 -40 25 34 -23 -38 4 20 2
2297 2 -17 -15 0 19 8 -21 -20 32 46 -21 -41 21 60 -8 -61 -7 40 2 -38 -19 17 13 6 -17 -34 5 32 -4 -59 -1 43 14 -63
2330 -63 -21 42 21 -29 -36 8 22 2 -15 -14 9 26 13 -36 -28 40 21 -32 -39 33 37 -38 -25 31 31 -29 -19 -2 -8 -4 14 -5 -32 13
2364 13 34 -17 -41 20 35 -31 -39 17 27 -18 -31 11 -1 -10 -6 12 -17 -17 32 1 -57 -6 51 -8 -43 9 28 -9 -31 20 21 -24 2
2397 2 29 -13 -26 28 29 -26 -24 35 23 -36 -17 30 -1 -27 -6 8 -27 -11 17 -16 -46 0 25 -18 -50 18 47 -35 -37 17 16 -18 3
2430 3 12 4 -9 21 18 -30 3 49 5 -49 10 54 -8 -54 1 42 -15 -28 -2 8 -4 -11 -4 -33 -14 30 7 -51 -15 43 1 -50 -17
2463 -17 37 3 -35 -4 20 -9 -3 14 -7 -2 27 13 -26 -20 36 23 -49 -20 25 18 -30 -14 9 1 -14 12 -6 -13 0 14 -24 -26 8 12
2497 12 -20 -25 11 8 -14 -19 8 -6 -17 1 -2 -27 -10 31 -1 -23 9 16 6 -15 -9 7 8 6 13 -1 -1 21 2 -23 -7 35 5 -30 -22 24
2533 24 20 -14 -22 4 11 -13 -18 -27 -1 22 -9 -39 -21 26 20 -31 -24 20 39 -8 -26 -7 27 23 -14 -11 2 41 25 -29 -21 37 32 -26 -40 28
2569 28 45 -14 -50 -16 22 14 -26 -38 0 32 15 -45 -30 40 32 -28 -53 1 42 -1 -42 -20 34 25 -16 -38 -5 52 23 -25 -38 19
2601 19 43 -7 -48 0 50 17 -47 -34 33 36 -24 -38 -7 39 13 -45 -37 15 37 -9 -50 -19 38 28 -36 -53 21 39 -1 -56 -9
2632 -9 37 18 -32 -39 13 34 11 -40 -24 34 44 -28 -36 21 56 5 -36 -10 40 36 -29 -31 4 44 4 -28 -21 13 22 -18 -48 -8 49 1
2666 1 -57 -24 32 20 -23 -34 6 31 7 -31 -21 18 30 8 -33 0 38 25 -34 -16 32 26 -15 -25 9 36 8 -15 -21 8 17 3
2698 3 -23 -15 25 15 -27 -30 11 37 6 -31 -1 27 10 -14 -11 16 14 5 -16 -16 19 26 -5 -27 10 33 3 -12 -5 23 8 -15 -14 -1 18
2733 18 4 -15 -10 5 14 -8 -22 0 17 -2 -30 -23 12 7 -21 -13 11 8 -4 -8 -3 0 4 -6 -15 -1 0 -5 -11 -16 14 12 -13 -15 14 14 -2 0 5 5 13
2774 13 7 0 -4 6 25 -2 -7 16 16 -5 -10 5 9 0 2 -4 4 7 -2 -7 -3 -2 0 1 0 -4 2 -2 -1 -1 14 9 -9 0 12 14 4 6 6 9 5 10 -2 -6 7 11 -3
2821 -3 -22 -6 -3 -4 -6 0 8 -15 1 -4 -2 1 -3 -3 9 -4 5 8 -15 9 13 2 4 10 12 3 5 9 3 9 3 3 4 4 15 5 0 -4 1 7 -3 -4 8 10 -4 2 1
2868 1 -4 4 1 -9 -4 2 3 -7 -5 0 17 -5 -6 -6 6 11 -1 2 6 5 4 4 -8 7 2 6 -6 1 19 19 4 11 3 11 -3 7 19 18 -6 0 2 -1 11 3 -8
2913 -8 -11 11 -1 -6 -11 4 3 -4 2 -6 9 5 4 7 4 9 16 3 -10 8 9 4 -5 -1 10 -1 -9 -2 14 14 -4 -9 -7 3 4 -2 -14 -2 7 -9 -14 -2 9 -2
2957 -2 -8 -8 3 7 -4 -8 -14 11 6 10 7 5 14 8 -8 -3 11 5 6 2 7 11 7 7 -3 9 9 12 2 -5 9 17 1 -8 4 21 -1 -1 7 13 -3 0 8 -5 -1 7
3003 7 4 -10 5 9 7 -2 -4 9 1 -9 -4 1 6 12 0 2 7 17 15 10 -1 15 14 7 -1 14 11 0 -1 11 5 -4 -10 -1 6 11 11 -15 -6 8 12 -11 -16 2 15
3048 15 4 -7 -5 6 5 3 9 -1 11 20 3 2 11 29 5 6 6 22 11 -9 -5 10 8 0 6 -11 -4 12 3 -10 -2 6 0 -5 -9 1 8 -15 1 6 6 1
3090 1 0 1 -3 2 10 3 -5 13 14 -2 -14 9 11 11 0 7 20 8 2 6 11 5 12 -5 -11 5 17 -3 -15 -6 9 2 -1 13 10 6 -5 1 -5 -1 11 -1 -16
3133 -16 -6 12 0 -17 7 11 21 -11 -1 8 13 14 8 11 13 13 -2 -5 5 16 23 -3 -6 13 22 -2 -5 12 12 -2 -8 -1 0 -2 -2 -1 2 5 12 -1 -12 -2
3175 -2 7 9 6 1 2 6 4 10 16 2 18 2 2 6 18 13 0 2 13 21 -8 -2 9 13 -1 0 0 8 -4 -13 0 -12 -5 5 -9 -15 4 13 -9 -8 -3 8 6 9
3219 9 0 12 13 10 5 -20 -4 12 7 -14 -5 11 12 0 4 10 14 -6 5 2 6 -3 -2 -5 -9 8 1 -13 -12 5 17 0 -17 3 13 6 -10 -3 9 13 -2
3260 -2 -11 1 17 19 -11 -3 15 29 1 -10 7 24 5 -9 2 9 8 0 -2 -1 19 8 0 -20 7 18 -4 -18 2 13 5 -8 -10 -1 10 -3 -10
3297 -10 -1 11 14 1 -21 -5 22 4 -11 -14 27 23 -6 -3 16 25 9 2 3 17 14 -1 -12 -2 31 8 -5 0 11 5 -13 -17 -5 14 -6 -25
3333 -25 -14 12 1 -4 -21 -10 10 16 -16 2 20 18 1 -13 8 14 13 -14 -6 5 9 1 -21 6 14 14 -6 -8 13 12 7 -15 1 19 11 -15 -9 -4
3371 -4 4 0 -10 -4 3 6 -8 -14 0 7 0 -10 -5 6 8 -3 -1 9 12 6 -12 -8 15 16 14 -5 -6 10 5 -1 -9 10 15 -5 -13 0 13 8 -4 -9 -1 10 -9
3414 -9 -13 -6 0 -4 -13 -7 -1 9 -2 -15 -8 0 10 13 -7 -1 7 -3 -2 0 2 9 9 3 -1 14 6 -8 -2 3 7 6 -11 -10 4 2 -5 -9 -5 -10 -5 -9 -6 -17 -1 -4 -11 -15 11
3463 11 13 -11 -12 -10 -1 4 -10 -1 5 11 -5 -5 11 6 5 -5 4 4 -2 5 -11 -2 1 -4 -10 -9 -3 3 -3 -7 -4 4 5 -2 -6 3 19 0 -7 -10 1 5 -3 -10 -12 13 7 -14 -4
3512 -4 6 11 -8 -1 6 20 11 -1 4 16 18 7 -21 -7 19 7 -8 -6 5 11 -4 -22 -13 10 11 -3 -9 -2 6 4 -13 -15 8 9 -5 -21 -6 17 10
3551 10 0 2 13 14 -6 -22 9 13 5 -6 -12 16 11 8 -9 9 9 10 -3 -7 25 15 -1 -9 0 10 0 -7 -14 -6 14 -4 -8 -2 10 5 -13 -6 6 2
3591 2 0 -13 2 20 11 4 -9 6 16 12 -13 2 20 10 -7 2 9 12 3 2 8 12 4 -3 -5 19 16 -6 2 -10 1 3 1 9 3 12 -4 -3 -4 3 20 -7 10
3634 10 8 9 9 -2 -4 20 12 -6 7 7 24 9 8 3 22 5 2 3 9 19 11 -2 -6 21 4 -13 -4 1 6 -3 -10 3 2 7 -10 -4 -6 5 -9 4 0 3
3676 3 -3 -2 -3 11 17 4 -4 1 10 5 4 6 18 16 3 -2 12 19 7 -2 -3 -2 7 -6 -14 1 -2 -5 1 -11 3 -12 -2 -14 0 8 9 -15 -4 -8 8 -4 0
3719 0 8 10 11 2 3 6 2 16 7 5 10 5 -2 7 4 17 0 -1 8 6 0 -8 -4 4 -1 -3 1 -4 8 -1 1 -12 -10 -2 3 -5 8 0 2 13 9 8 4 -5 12 4 6 3 6 12 4 9 7
3772 7 6 -2 6 -6 4 -8 0 5 -5 -4 1 7 -5 2 -7 -6 -6 -1 -6 -2 -9 -13 3 -8 -16 -13 -1 0 -5 1 -21 -2 -9 0 6 -7 -2 7 7 11 18 7 2 -1 5 9 6 -1 -3
3821 -3 12 12 6 -6 -1 5 2 -3 -2 5 -2 -6 -10 -17 -2 -9 -8 -10 3 -7 -2 -3 -3 5 -9 -3 8 10 1 5 -1 4 8 2 4 -6 4 6 -3 5 -7 1 -3 -4 -10 7 3 -10 -1
3870 -1 -8 0 4 0 -8 -6 -1 2 -3 -2 3 -7 -5 -7 -3 2 9 -5 4 1 4 2 -3 1 10 9 -1 5 11 13 9 2 5 12 8 -1 0 9 -3 -11 -6 -6 1 9 -6 0 3 -9 4 -2 -1 10 -2
3923 -2 -8 4 8 10 4 -5 6 9 6 0 2 1 10 6 0 -1 5 5 -6 7 8 -3 -5 -5 5 2 1 -10 1 -5 -1 -5 -2 -2 -10 9 4 -7 5 5 -5 0 -2 7 -5 3 2 6
3971 6 -1 11 5 8 17 4 5 -2 14 12 3 9 -1 4 7 -1 -2 10 12 0 2 5 5 -3 -13 4 8 1 -13 -13 -4 13 -1 5 -12 6 6 -12 -5 -8 11 1 -5 -6 9
4016 9 4 -2 -1 1 4 -1 -8 8 19 11 2 -2 3 3 3 2 -6 -7 2 4 -9 -4 10 2 -8 1 4 5 -7 -6 2 9 0 -8 -6 -3 6 -4 -1 14 -6 -1 8 12 5 14 3 11 2 7 7
4067 7 6 8 9 7 11 3 3 -1 1 1 -1 -4 7 7 0 -5 -5 -3 -1 3 2 -9 0 3 -1 1 13 14 -1 -1 -1 9 4 10 14 2 10 5 -4 10 10 4 8 11 6 2 4 9 2 10 -2 -2 3
4120 3 -1 0 0 0 10 9 0 -7 -1 0 4 -10 -2 1 4 2 7 9 13 6 3 -1 6 1 8 -3 2 12 0 8 -3 0 3 1 -4 -7 -9 3 3 -3 -18 3 -5 -6 -7 -12 -13 -15 1 -6 4
4171 4 4 -3 -21 -7 -7 -12 -10 2 4 4 0 11 -2 8 3 -2 9 4 1 1 -7 -4 3 -2 -5 -2 2 -2 -7 -7 -3 0 -2 -11 -6 -9 -6 -14 -11 -15 -1 -1 -7 -6 -6 0 4 -14 -8 1 2 -3
4223 -3 10 9 2 1 1 -1 10 10 -3 -4 1 1 8 -3 -3 5 0 -9 -8 2 -2 -8 -5 -12 -6 -8 -10 3 3 4 -4 -8 2 7 8 -4 1 4 9 -9 -9 1 2 -3 -4 -8 -14 5 -6
4272 -6 -10 8 4 11 2 3 8 4 -7 -11 3 4 -3 -9 -10 6 -3 -9 -2 -3 -3 -1 -7 -4 -1 1 -1 -2 -6 3 -3 -9 -2 6 5 5 -2 11 4 10 2 6 6 10 -2 1 -10 5 8 -10 -9 10
4324 10 10 0 -3 -6 0 4 -13 -5 -1 3 0 -4 5 -3 -2 0 0 11 3 -7 -3 -2 4 3 3 11 8 18 0 -6 -1 14 9 -7 0 7 -1 0 2 2 5 -3 -11 -9 -8 0 -3 -1 -1 -4 -4 -12
4376 -12 -6 1 2 6 -16 8 6 9 7 -4 -5 4 -1 9 3 -1 9 -1 9 8 7 6 -16 -6 -1 5 10 6 2 13 -9 -10 -8 14 2 -7 -12 -1 1 -7 -7 0 -3 9 -7
4421 -7 -9 1 -10 -5 -7 -2 12 -6 0 8 -4 4 1 5 4 12 -2 -1 11 5 14 8 11 4 2 -5 -3 1 15 5 -4 -11 2 -1 -5 -6 -7 4 -1 -3 7 -7 -6 1 0 3 1 0
4469 0 21 2 12 7 3 11 8 20 19 5 7 13 12 8 5 4 9 4 12 10 5 16 6 4 6 -6 -7 7 -9 -6 -2 11 -4 3 3 -6 -5 -4 6 -4 9 0 -5 4 10 9
4515 9 8 7 4 5 5 2 -1 1 5 1 10 6 4 15 6 1 -2 2 4 -5 1 -1 -7 0 2 5 -3 3 3 6 -3 3 -4 -2 -6 2 11 2 -2 -5 4 10 11 5 -6 7 9 12 6 10 11 4 3 9 4 7 -9
4572 -9 -2 3 -1 -5 -11 4 1 -6 -8 -16 -6 0 1 -2 0 -3 -5 5 -2 -3 1 8 0 -2 4 14 -1 11 2 18 11 -3 5 11 5 7 -4 9 -4 -5 4 2 -1 6 -3 -12 1 -3 -3
4621 -3 -4 -2 -4 2 -9 -11 -6 -2 6 -5 1 6 0 -1 -3 5 8 4 4 7 -3 0 11 10 11 5 10 -1 2 2 11 0 -2 9 10 6 -4 6 -1 8 10 0 -3 8 -7 0 -7 -2 9
4670 9 -6 -11 -10 2 -2 -2 -6 6 -3 1 1 -3 9 14 0 5 16 12 -1 13 6 13 13 3 4 8 4 -2 -3 11 -11 -4 -8 -3 -6 -1 -7 -16 3 -12 12 -4 -3 2 -3 -1
4716 -1 6 -3 3 0 2 -6 -2 3 3 3 -4 10 6 1 7 5 7 5 -5 -1 0 6 1 -3 -6 -5 -4 -11 -4 -9 -7 -13 -3 -1 -3 -10 -7 0 -2 -4 -7 -10 -2 0 4 -1 -4 -1 -3 -3 4 -3 3 -1 4 8 9 5
4774 5 -8 6 1 2 0 -7 -1 6 5 1 1 -3 -3 -6 0 -3 -7 -9 -8 -5 -10 -3 0 -3 -3 -9 -6 -3 -1 2 2 6 -1 0 -2 5 1 6 6 2 12 12 1 -6 1 8 -8 -2 5 9 -8 -3 3 -6 -8
4829 -8 -9 -2 -4 -4 -1 -5 -7 -9 4 4 -9 3 -4 2 2 -3 7 6 2 4 -1 2 3 3 7 12 -1 7 9 2 6 5 -4 -3 3 5 1 -2 -4 -1 -6 6 -2 2 2 1 12 5 -9 -4 -3 -4 2
4882 2 -5 -5 6 1 10 10 6 -6 -4 15 0 0 14 10 2 8 9 9 9 7 6 4 18 6 8 -2 -5 6 4 3 -5 6 -5 1 0 0 11 -3 -1 2 -6 -1 3 9 4 4 7 5
4930 5 11 -3 8 14 7 4 -3 0 6 11 7 13 5 13 8 7 10 7 11 4 8 -4 2 3 -6 -5 2 -5 0 -2 1 -6 -16 -2 5 3 -1 2 10 -2 7 17 0 5 1 8 3 8 0 1 2 10 3
4983 3 9 3 0 6 14 -9 6 -8 -11 -4 -8 -3 -6 -1 1 -1 -5 -5 -3 9 -14 5 2 0 -9 2 1 -7 3 3 -1 -5 5 8 10 12 11 4 6 -4 3 -5 7 11 -1 12 -6
5030 -6 -16 16 7 -5 3 -9 14 -8 -10 4 1 1 -14 -4 1 -2 -7 -2 -2 2 -6 1 -2 -6 -3 -1 7 13 2 -3 10 9 18 -1 10 11 -1 8 9 2 5 9 3 -4 5 -1 0
5077 0 -5 0 2 -6 -3 -4 2 1 -11 -4 -3 5 -10 -2 -2 -2 -1 2 -2 0 9 10 4 -1 2 7 8 6 11 11 5 -9 5 1 -8 6 -1 -7 3 -1 -8 -9 0 -15 -11 1 -1 -4 -4 -2 -4 -7 -4
5130 -4 4 -1 2 0 5 -2 2 -8 3 -2 -1 3 17 8 7 7 0 -2 -13 7 15 9 0 1 0 4 0 2 0 6 -5 -8 1 9 -7 -3 -12 0 0 -5 1 0 -2 5 0 0 6 3 10 3 3 2 8
5183 8 6 11 3 10 5 1 9 9 5 5 2 9 5 5 2 -8 7 9 -6 -9 -7 -10 9 -11 -3 -3 -1 -4 -2 -4 -7 -1 2 -2 -9 6 10 4 -1 5 8 9 6 1 5 1 14 -4 5 4 1 10 -6
5236 -6 3 -2 2 -1 -8 1 -1 -5 -9 -8 -2 -3 -6 -5 -2 -9 -11 -3 -6 2 -3 -5 -5 -10 8 -2 0 5 -4 -5 2 -4 2 1 13 -1 -3 10 9 1 -3 -9 3 4 10 4 -10 -5 4 0 0 -2 -6 -10
5290 -10 -5 1 -5 -5 0 0 -5 -7 -6 -5 -15 -3 -9 6 8 0 -2 1 -6 4 8 -7 10 1 2 1 9 8 5 8 -3 2 -2 1 0 -2 -10 -3 6 1 -4 2 10 -4 -1 3 1 -3 -3 -6 0 11
5342 11 -3 9 -1 2 7 12 6 -1 0 1 -5 2 3 9 1 1 7 17 9 3 2 -2 -1 3 0 5 -8 -10 -8 -10 -10 -11 -4 -4 1 -1 -8 -9 -7 -9 -6 6 -11 4 2 1 10 3 0 -4 1 9
5394 9 1 2 -2 6 3 -1 -7 -7 3 -9 -7 -5 -3 -9 -1 -5 -6 -9 5 -3 0 -2 -12 -7 2 -7 -11 -2 -1 -12 -14 -2 9 4 0 5 -4 -1 4 9 7 3 -2 -4 0 3 3 9 8 6 -5 4 -9
5447 -9 -9 0 2 -6 -10 -3 -5 -6 -2 0 -6 -2 -7 -1 -5 3 -5 -1 -7 -5 1 1 5 -2 6 4 -5 -2 5 -1 1 6 -4 -2 0 -4 6 1 -4 5 4 0 -1 -4 -3 -5 -2 -1 -8 -3 3 4 5 -2 -6 5 0 2
5505 2 -3 9 -2 -2 0 5 3 11 3 7 1 14 7 9 -4 -4 11 6 0 -4 7 5 12 3 1 -1 3 -11 -6 17 -6 -9 -1 3 -4 -6 -3 -6 -7 -11 -7 -8 -5 -4 9 3 0 -6 6 -4
5555 -4 4 -11 3 0 3 -4 2 5 3 3 0 2 -3 -2 1 0 1 4 -7 -2 5 -3 6 -9 4 0 -9 -4 -9 3 -8 -2 -4 -2 -5 -3 -10 7 11 -5 4 3 7 0 6 7 9 0 9 0 9 3
5607 3 7 5 10 2 6 7 3 -3 -4 6 -6 -3 1 -8 1 5 -10 -1 -4 -4 1 -4 -10 2 4 1 -2 -3 11 1 -5 5 4 12 -8 -5 9 10 2 2 9 0 7 6 -5 3 8 -12 1
5656 1 -1 -9 -5 -7 -3 -7 -5 -6 0 4 4 -1 -10 6 -12 5 -3 4 2 5 3 -3 2 1 -1 -2 12 7 11 -1 4 10 2 4 7 9 10 3 6 14 4 1 3 5 1 1 1 7 -7 -2 -7 1 -3 -7
5710 -7 -12 -1 -14 -11 -9 -1 2 7 1 5 -2 10 14 4 17 12 8 18 13 7 12 2 15 10 0 1 5 -7 -1 3 3 2 0 0 3 0 -12 -7 5 -2 -1 -1 0 2 -1 -5 7 -5
5758 -5 5 -12 -4 10 1 7 16 3 14 9 8 4 -2 3 3 4 11 11 8 1 -2 1 2 -8 -18 -8 -8 -9 2 -13 -5 -3 -7 -1 1 -4 -7 -6 -4 -7 5 -5 2 -5 4 4 6 9 -8
5807 -8 2 3 11 12 12 17 9 8 15 0 5 8 0 0 1 8 8 1 7 -2 0 -5 -9 -13 -5 5 -12 -6 -3 -13 -10 -4 -6 -2 -3 -1 -1 5 1 2 -2 -2 1 6 10 7 10 8 0 7 7 8 1 6 1 0
5863 0 3 -2 -1 -1 3 -1 5 1 -3 -11 -8 -1 -10 0 -4 -13 -11 3 -9 -9 2 0 0 1 -2 2 11 -5 5 2 3 13 7 0 6 3 9 3 -7 4 3 1 3 -2 7 3 -9 -4 -5 -3 -9
5914 -9 -5 -10 -9 7 -2 -10 -3 5 2 -7 -7 -13 -8 -1 -3 -1 -5 -3 -2 11 1 2 2 -2 -3 6 2 5 5 7 6 5 -2 -5 9 -1 4 -11 0 -1 -1 -17 -15 -1 -3 3 -5 -8 -7 -1 -5 -8
5966 -8 -10 -5 0 4 -2 8 0 -2 10 10 4 -1 5 8 9 8 19 6 3 1 -2 12 -3 -2 0 -10 3 -4 12 2 2 -8 1 3 -5 5 -2 -1 12 -3 -1 -1 3 7 7 12 13
6013 13 14 5 4 8 6 8 2 8 10 4 6 5 9 10 10 7 0 -10 -5 2 6 2 -3 -7 -4 2 4 -1 -3 -2 -5 0 -4 -10 -12 -4 7 -13 -3 9 -2 -5 5 0 8 3 0 -1 3 10 -6 7
6065 7 0 4 -3 2 10 11 8 5 5 -4 -9 0 -3 -13 -7 -3 -3 -15 1 -3 -7 -8 -10 -6 -3 -7 -1 5 -2 -1 -4 4 5 2 1 -3 -2 7 0 -1 -3 5 8 1 -2 9 5 -4 -3 6 0 -3 -5 3 -9 -6
6121 -6 -11 -5 -1 -6 -17 3 0 -5 3 2 10 -2 -6 14 6 12 10 6 5 11 16 5 5 1 5 5 1 6 -1 12 1 -1 -7 -5 -6 -5 -7 -1 -1 -11 -1 1 -1 -9 1 -11 0 -9 -5
6170 -5 -5 1 -5 -5 1 -6 -13 -7 2 -7 -3 -7 -7 -6 2 3 -4 -6 0 4 0 6 -1 -3 1 6 -8 0 0 1 3 -1 -5 5 -11 -1 -2 -10 -1 8 -18 -7 -15 -4 -2 -1 9 -5 -3 1 4 5
6222 5 5 4 8 10 11 3 1 4 5 9 4 12 2 7 10 0 -3 -5 11 -3 -4 -5 5 5 -4 -4 -5 -12 -5 -12 0 -1 -5 -2 0 -13 8 -2 0 3 -5 3 10 4 6 -1 9 2 -3 -1 1
6273 1 0 -3 10 -4 -1 5 4 0 -4 0 -2 -6 -3 -3 -1 -4 -3 -12 -3 -2 -4 1 -5 -2 -17 -4 -4 -7 1 -2 -6 -6 -6 -4 7 5 -5 -3 9 -2 5 11 14 -2 3 -6 2 2 -4 5 -6
6324 -6 2 -3 4 5 7 3 -9 -3 -13 6 -9 -6 -4 7 -14 -4 6 2 -10 -17 0 -2 -3 -5 -2 -5 -3 8 2 1 1 16 -2 2 -6 4 1 -3 2 -7 -1 1 -11 -6 -6 -3
6370 -3 -12 -10 -8 -3 -2 -6 -4 -7 -3 -13 -13 4 -2 -3 -4 -11 -1 -7 7 4 6 9 4 7 -2 3 8 14 -2 1 11 -3 4 -2 7 1 7 4 -12 -3 -1 -8 0 -2 -7 -11 -8 -2 -6 5 -4 -5
6422 -5 -2 4 0 -1 -5 -8 -5 7 8 3 -5 6 6 -7 3 6 0 -10 0 -2 3 -1 12 1 7 5 6 -8 1 -3 -10 -5 -8 -8 -4 0 -2 5 -1 -8 -3 -1 -6 -1 -10 -5 2 -2 6 7 -2 7
6474 7 -3 5 4 10 1 3 2 10 4 6 2 -10 0 -6 1 1 11 1 -3 -4 -6 -7 -7 -6 -9 -7 -13 -19 -3 -13 -8 -2 0 -7 4 -5 -4 3 1 5 5 6 5 3 8 3 -6 2 -4 6 8 7
6526 7 6 5 -5 -4 -1 0 0 -2 1 -7 -6 -10 -12 0 -8 1 -6 -1 -6 1 2 -1 -2 7 -6 -4 1 1 3 -7 2 1 -3 -6 2 8 -3 -5 8 -1 4 -10 -6 1 -11 -5 2 -1 -9 -8 -8 1 0
6579 0 -11 -8 -17 -18 -14 -1 -8 -6 2 -8 -1 0 7 1 -5 -3 -11 1 -4 -8 -1 5 3 -16 2 -4 5 0 7 2 9 -2 -2 -8 -4 -9 -3 -7 -1 -11 -11 -7 -10 -12 -7 -6 -17 -10 -6 -5 8
6630 8 1 -6 -4 -5 -2 1 -2 -2 0 -3 9 -8 4 -4 0 3 2 -2 -3 6 -2 2 -10 -5 13 2 2 0 0 0 -8 -7 -6 -12 1 -3 -6 -6 -2 5 -4 -21 4 -8 0 7 -8 2 -10
6679 -10 1 10 1 4 -2 10 4 2 4 3 4 4 5 6 10 -4 -2 9 1 -7 -4 1 -16 -6 -11 -12 -9 -8 -4 -12 -5 -11 -12 -5 -7 -5 -1 0 -2 3 -3 -9 6 -2 15 3 -4 15 17 -2
6729 -2 4 -2 1 8 0 7 6 -4 5 4 4 -3 2 0 -1 -8 -9 -7 0 -13 -7 -7 -16 0 -7 -3 2 1 3 -17 -1 1 -4 6 6 10 3 -2 9 9 8 7 0 4 14 6 0 2 -4 10 1 7
6781 7 9 -3 16 -2 -4 -8 -8 -7 -4 -4 -1 -7 -1 6 -8 2 5 3 -4 11 -3 0 -3 7 9 11 1 3 2 -2 10 10 2 2 -8 -2 6 6 9 -5 6 4 0 2 -3 -1 3 15
6829 15 -2 1 -7 0 1 -8 -15 -3 -2 -7 11 -1 0 2 -1 1 4 0 0 -1 -1 4 10 0 5 4 -3 -1 -5 19 2 14 2 -6 -15 2 0 4 0 1 -7 -8 -7 -3 -17 -5 -14 -13
6877 -13 -5 0 -6 1 -8 -9 2 -6 7 -5 8 5 3 -2 2 0 -5 5 -3 -11 -3 1 -5 2 11 -8 -2 2 1 -9 -2 12 -3 0 -8 -7 0 -10 -2 -13 -8 2 5 -6 -2 -4 -14
6924 -14 -8 -2 -9 -4 3 -5 4 12 11 -1 -3 0 13 8 14 1 9 0 8 -4 8 13 -15 -5 -5 0 11 0 -2 -5 -14 -1 0 -11 -7 -1 1 -4 2 3 5 -15 -14 -11 -4 -7 -6 -4
6972 -4 -2 8 -11 6 -5 3 -5 6 -2 5 0 0 -6 -2 -3 1 -4 4 5 1 -5 -10 -9 -12 2 -8 2 -5 -12 4 -5 -4 -6 -1 -5 3 3 -7 -10 1 8 -2 4 5 -9 3 4
7019 4 17 9 10 0 7 6 1 3 2 13 -8 -5 0 2 -11 1 5 -1 8 -5 6 4 -6 -7 -4 -6 -5 6 5 1 3 1 0 -9 -1 -5 3 6 -8 -12 7 2 11 -5 6 -7
7065 -7 1 1 -2 2 -8 1 5 -3 2 -4 -5 -2 -3 -3 -9 -2 -1 -11 7 0 2 -13 9 -13 0 -3 -3 3 -3 -2 8 -6 6 7 2 1 3 9 5 7 7 17 3 2 3 11 0 3
7113 3 10 2 -2 4 -1 -7 1 2 -3 -3 -8 4 0 -13 -1 1 -11 -12 -3 1 -2 -15 6 6 -8 6 8 16 2 5 2 7 -1 9 6 8 15 -1 -5 2 6 -5 2 -3 3 11 2 6 -6
7162 -6 2 -7 -14 4 3 -5 -5 -5 -12 1 -7 -3 -3 6 -2 -2 -4 10 -2 -3 -1 7 2 10 9 2 7 1 8 0 3 5 6 1 10 6 3 3 1 -3 -2 4 -12 -4 -3 -9 -12 -13 9 -9 2 -3 0
7215 0 -1 -5 8 5 2 -3 -4 10 5 -1 -4 2 2 3 1 4 -5 1 4 4 7 10 -10 3 21 7 2 -1 6 -2 2 -8 -11 -1 3 -2 -4 -1 -11 -5 -4 -6 -11 3 1 2 4 -5 -5 0 7
7266 7 -5 4 5 9 5 6 11 3 7 -2 0 -1 0 -2 0 -7 -5 -1 -4 1 -1 0 1 -2 -10 5 -1 -3 -6 -6 -4 -1 -9 2 3 -1 -5 -6 1 -12 7 8 2 8 0 1 7 2 1 7 -4 7 -5
7319 -5 4 7 3 -2 2 2 0 2 -4 -19 1 -4 7 5 -2 -1 -7 -1 4 0 -3 6 -9 -3 7 6 0 5 -6 -1 8 4 7 2 4 -13 7 9 0 2 -4 8 9 6 -1 -2 2 -5 2 -2 -2 -10
7371 -10 -1 -3 -1 0 -9 -12 -17 -9 -1 -5 -4 -8 -11 1 -1 5 12 8 -6 1 -1 2 1 7 5 14 -3 -5 5 8 5 -3 13 6 10 3 13 3 -6 1 -3 -1 5 -1 -4 2 -10 -3 -1 -3 -4 -14
7423 -14 8 3 7 -1 3 7 10 10 -1 -2 2 7 8 7 14 6 12 2 -5 7 -5 -1 0 12 -4 -2 -13 1 -2 3 13 4 -6 -7 -2 3 0 -6 -8 -8 -7 0 3 3 6 -11 6
7470 6 2 -5 -12 -4 2 15 5 15 8 9 12 -2 4 10 0 0 3 7 7 -3 4 3 4 -1 -8 -6 1 6 -2 -4 -1 -4 -3 1 -3 -10 -1 2 9 9 8 11 6 8 16 9 10 -1 11 -1 5 1
7522 1 11 6 19 11 10 0 7 9 9 -1 -3 4 4 5 8 -3 -3 2 1 4 -4 5 0 6 3 -2 7 10 -7 -2 10 2 6 3 5 6 4 12 20 1 13 7 4 8 10 7 10 1 10 8 6 10
7574 10 7 11 -6 -8 5 -7 4 -4 5 2 -4 2 5 0 0 -4 -1 -3 4 1 1 10 4 9 1 6 0 8 -3 1 6 9 2 5 13 1 -1 7 9 6 7 -1 2 4 3 2 -2 -8 2 1 -4 1 -4
7627 -4 -8 2 0 4 1 4 5 -5 1 -5 1 4 -10 9 9 9 -1 9 6 2 8 2 5 7 2 8 4 -7 -2 4 12 1 7 -6 4 4 -3 -12 -1 3 5 1 -1 1 -2 9 -1 1
7675 1 -2 -3 2 -3 8 11 12 10 9 -6 5 14 4 5 -2 -8 5 0 0 -2 0 4 -2 -1 -2 0 5 1 8 -2 5 2 2 -4 -6 -9 -7 -2 -4 0 -2 -11 11 6 6 10 6 -4 20 8 0
7726 0 6 8 4 8 3 11 5 7 7 5 3 10 -3 11 -2 1 4 9 5 -1 6 0 -8 1 -7 -2 1 0 3 -3 -2 1 8 4 2 2 2 9 2 -2 15 3 8 10 2 9 8 7 4 8 5 -4 9 3 -1
7781 -1 -3 4 12 6 3 -1 -2 -1 1 -6 4 -9 4 -5 -1 9 0 1 8 4 1 -1 -1 10 10 -1 3 10 4 4 9 14 8 8 18 9 10 10 10 10 8 -2 12 1 -7 2 2 -10 -3 1
7831 1 6 11 -1 4 -3 8 10 7 -1 2 -2 -5 -2 15 12 18 8 10 3 9 17 4 5 3 4 17 9 5 16 9 3 0 8 3 6 5 4 -2 0 -2 -1 0 -2 -10 1 4 5 2 3 -3 -3 10
7883 10 -3 -4 0 15 13 6 18 3 3 15 10 15 7 9 7 18 12 11 11 8 -6 2 12 3 0 0 9 10 2 -2 2 10 -7 -10 3 -2 -5 3 11 8 2 -1 5 14 5 7 -1 8 5 -3
7933 -3 2 1 7 13 8 11 11 1 9 10 7 9 12 3 8 -2 6 3 4 -2 -2 6 7 0 -5 2 7 1 6 4 2 7 -5 -2 -2 0 -7 5 7 5 7 6 8 -2 6 7 6 10 9 12 6 4 3 9 4 10
7989 10 9 3 4 0 -7 -6 -7 -6 -5 -5 0 6 -3 0 -6 -2 5 -6 3 0 -1 -1 1 1 -1 12 6 14 3 9 5 7 6 8 9 5 2 -1 6 9 -1 3 0 3 0 -3 4 5 -5 4 -8 -6 -1 -2
8043 -2 9 5 4 -4 -7 7 -2 -3 10 6 15 -5 5 10 16 4 9 14 8 5 0 1 -3 14 -1 8 6 3 0 -2 7 6 5 -8 -4 3 -1 -6 -3 2 3 1 -3 -6 8 -2 -6 -2 10
8092 10 4 1 0 5 -1 7 12 13 7 -4 4 9 10 4 7 13 9 -2 17 3 6 1 6 -1 -4 1 4 -1 4 0 1 10 3 0 7 -5 1 -5 -10 -7 6 10 6 18 8 0 0 12 14 14 2
8143 2 7 12 7 19 7 11 0 3 5 -2 1 7 -9 2 5 -7 0 -12 3 -10 -10 -1 -5 -5 -2 -2 7 1 9 -1 8 7 -2 -1 1 3 6 13 -2 4 1 -4 13 8 3 -2 0 17
8191A7
$$ Imaginary data points
##PAGE= N=2
##DATA TABLE= (X++(I..I)), XYDATA
0 0 0 0 0 0 0 0 0 0 0 0 0 0 0 0 0 0 0 -6 8 -8 8 -8 8 -9 16 -16 16 -24 24 -32 32 -40 41 -48 56 -64 70 -79 88
39 88 -97 106 -121 133 -146 162 -179 199 -218 241 -265 292 -321 355 -393 433 -481 532 -593 661
59 661 -746 845 -965 1118 -1320 1591 -1984 2604 -3740 6481 -26933 -2324 65829 509
73 509 -51052 -12037 40077 14853 -19668 -20056 1898 19359 18604 -18698 -33948 13843 47136
86 47136 -9163 -53211 2536 54966 2927 -49812 -8211 40971 11340 -27727 -13176 13161
98 13161 12495 2028 -10728 -15737 7069 26862 -3237 -34365 -1114 37791 4590 -37066 -7179
111 -7179 32787 8304 -25493 -7937 16584 6334 -6817 -3617 -2267 586 10144 2583 -15864
124 -15864 -5114 19343 6744 -20354 -7200 19209 6404 -16457 -4663 12449 2035 -8100
136 -8100 726 3685 -3533 115 5704 -3160 -7080 5292 7486 -6411 -6745 6789 5201 -6385
150 -6385 -2832 5700 265 -4672 2394 3707 -4641 -2782 6239 2000 -7065 -1441 6865 875 -5940
165 -5940 -513 4199 65 -2113 321 -237 -809 2457 1302 -4180 -1728 5407 2205 -5826 -2421 5691
181 5691 2627 -4748 -2510 3472 2336 -1806 -1934 61 1405 1515 -871 -2873 241 3697 194 -4175
197 -4175 -682 4060 951 -3662 -1220 2861 1339 -1858 -1376 810 1450 329 -1380 -1176 1463 1998
213 1998 -1352 -2402 1396 2696 -1265 -2644 1145 2417 -891 -2019 503 1442 -88 -901 -534 197
229 197 1042 304 -1693 -864 2141 1214 -2521 -1494 2690 1658 -2553 -1582 2295 1515 -1674 -1214 1014
246 1014 980 -97 -558 -752 236 1592 125 -2241 -413 2684 614 -2891 -806 2759 810 -2449
262 -2449 -845 1827 735 -1111 -618 290 456 566 -263 -1237 167 1834 -7 -2118 -11 2262 78
279 78 -2104 -27 1769 -20 -1277 52 667 -124 -98 108 -500 -118 885 -2 -1226 115 1318 -267
297 -267 -1254 472 1078 -586 -710 763 386 -770 75 821 -371 -687 692 558 -805 -309 827 13
315 13 -703 266 427 -605 -173 821 -240 -1073 540 1149 -871 -1204 1036 1134 -1083 -956 1039 728 -758
334 -758 -340 468 50 44 416 -436 -702 938 1082 -1291 -1284 1564 1415 -1691 -1461 1576 1313 -1382 -1152 907
354 907 761 -415 -418 -235 -54 821 490 -1362 -918 1783 1310 -1994 -1539 2084 1727 -1841 -1658 1529 1556
373 1556 -924 -1208 308 817 413 -278 -1052 -284 1574 806 -1976 -1316 2107 1648 -2080 -1881 1780 1878
391 1878 -1354 -1724 761 1382 -117 -879 -476 338 1070 300 -1431 -837 1702 1332 -1719 -1648 1577 1779
409 1779 -1284 -1757 835 1504 -387 -1162 -100 666 520 -144 -841 -386 1030 852 -1062 -1160 992 1397
427 1397 -746 -1386 529 1315 -158 -1001 -75 689 341 -263 -464 -129 499 455 -459 -732 289 825 -137
446 -137 -894 -113 743 243 -602 -406 331 458 -92 -431 -106 354 330 -135 -352 -8 428 300 -322 -450 258
467 258 655 -86 -707 -46 744 140 -695 -243 512 234 -366 -245 78 105 122 -22 -389 -120 556 231 -703
488 -703 -297 806 357 -793 -293 788 263 -646 -110 556 13 -352 154 183 -257 39 320 -243 -379 427
508 427 325 -631 -264 736 142 -879 -50 905 -88 -910 191 831 -233 -669 258 481 -192 -169 184
527 184 -97 -80 443 5 -726 91 977 -135 -1162 119 1217 -115 -1192 21 1025 34 -772 -140
545 -140 418 215 -21 -225 -357 240 743 -172 -1012 112 1227 45 -1231 -150 1183 283 -978 -368
563 -368 683 412 -326 -416 -69 318 370 -248 -684 60 831 65 -947 -256 892 380 -765 -442 560
582 560 519 -272 -455 55 412 233 -214 -342 120 484 89 -474 -207 415 310 -294 -388 110 369 19 -364
603 -364 -202 240 247 -179 -309 41 239 37 -169 -106 21 159 167 -148 -288 156 457 -73 -485 60 538 31
625 31 -434 -29 341 52 -146 -48 -66 2 259 26 -482 -107 621 126 -737 -175 733 159 -696 -146 573 91
647 91 -401 -6 206 -60 46 163 -238 -220 452 257 -600 -262 694 208 -762 -152 724 54 -692 33 544
668 544 -143 -413 202 232 -254 -26 262 -176 -188 377 158 -541 -37 715 -39 -780 167 840 -210 -799 256
689 256 703 -242 -573 165 337 -103 -126 -30 -169 107 400 -244 -664 298 830 -320 -935 313 978 -231
709 -231 -878 160 769 20 -487 -112 261 278 95 -354 -351 425 633 -418 -809 349 903 -281 -939 122
729 122 817 -7 -696 -172 417 272 -155 -380 -126 435 389 -423 -575 405 740 -300 -743 229 732 -64
749 -64 -579 -41 420 183 -202 -263 -19 314 224 -357 -394 317 475 -311 -536 228 483 -177 -397 96 268 -23
771 -23 -106 -29 -41 96 202 -98 -286 169 368 -162 -350 204 320 -196 -236 183 120 -188 -4 161 -121 -148 206
794 206 113 -290 -59 327 25 -298 61 282 -90 -184 186 106 -198 16 261 -108 -259 208 263 -278 -240 305
816 305 177 -342 -154 281 53 -263 -7 148 -94 -82 139 -13 -213 107 249 -182 -258 263 298 -263 -237 306
838 306 242 -248 -155 249 139 -161 -45 104 -13 -20 81 -63 -157 114 194 -181 -270 176 255 -209 -298 171 257 -154
862 -154 -243 118 188 -60 -95 51 53 8 81 29 -119 10 225 38 -244 -23 295 60 -290 -58 250 33 -228
885 -228 -31 138 -51 -83 92 -6 -173 63 245 -132 -311 166 344 -173 -335 185 312 -136 -208 132 116 -86
907 -86 60 64 -210 -23 373 14 -508 -2 603 -1 -637 -15 606 12 -504 -31 346 20 -136 28 -75
928 -75 -36 318 125 -507 -150 684 208 -752 -241 784 248 -716 -233 558 166 -391 -111 144 -23 80 114
949 114 -332 -234 509 328 -660 -381 747 418 -728 -363 689 321 -506 -174 386 69 -175 120 11 -236
969 -236 186 371 -344 -448 457 457 -534 -445 541 332 -546 -235 454 53 -408 70 282 -233 -191 334 78 -386
991 -386 42 419 -134 -351 255 289 -318 -147 416 13 -445 121 492 -223 -474 306 436 -339 -376 288 256
1012 256 -248 -134 125 -44 -29 198 -109 -368 198 506 -277 -591 307 643 -276 -639 225 556 -115 -418
1032 -418 12 241 101 -32 -209 -195 269 379 -304 -549 284 642 -234 -696 147 662 -32 -561 -87 408
1052 408 213 -199 -267 -12 322 235 -310 -393 267 536 -188 -602 76 592 31 -543 -159 385 215 -240 -306
1073 -306 25 289 122 -272 -282 196 380 -115 -425 17 424 107 -351 -162 272 254 -136 -249 6 258 124
1094 124 -202 -204 141 264 -46 -278 -71 220 126 -192 -222 78 232 -13 -267 -103 218 164 -186 -211 99 230
1116 230 -7 -184 -70 152 161 -54 -193 -10 256 131 -235 -175 222 234 -164 -250 92 240 -29 -186 -57 98
1138 98 101 -34 -176 -76 187 139 -211 -211 198 242 -198 -248 142 239 -95 -187 49 110 13 -28 -46 -39 106 105 -145 -155
1164 -155 168 188 -201 -206 201 194 -203 -159 190 112 -149 -78 109 14 -41 43 -11 -60 106 117 -150 -109 230 124 -270
1189 -270 -105 300 81 -316 -85 263 30 -234 -23 138 -10 -50 11 -58 -37 170 49 -265 -46 365 54
1210 54 -386 -24 427 46 -371 -3 344 33 -220 -10 111 12 17 -5 -175 -17 280 -22 -402 -20 424 -6
1232 -6 -485 -25 416 0 -360 -21 255 -2 -119 -6 -4 5 174 26 -265 1 385 25 -421 7 451 2
1254 2 -398 19 341 -27 -246 23 100 -49 -17 30 -126 -64 220 25 -308 -40 357 11 -368 -5 334 -26
1276 -26 -279 40 196 -54 -86 96 -5 -92 108 97 -176 -85 232 69 -254 -47 245 -1 -226 21 164 -78
1298 -78 -113 122 30 -144 30 174 -79 -175 125 151 -134 -112 143 68 -110 -8 76 -77 -41 109 -4 -190 32
1321 32 211 -78 -261 66 216 -76 -202 44 150 -24 -69 -11 6 56 99 -65 -160 111 258 -91 -276 88
1343 88 316 -48 -281 12 224 15 -160 -85 38 99 42 -150 -180 125 230 -145 -328 94 330 -71 -335 21
1365 21 299 26 -220 -72 122 113 8 -136 -89 166 229 -132 -284 123 356 -80 -357 37 319 7 -268 -59
1387 -59 169 78 -84 -128 -57 111 127 -128 -259 67 287 -56 -338 13 330 9 -288 -59 204 62 -131 -80
1409 -80 33 72 75 -64 -141 30 212 -6 -264 -25 276 58 -262 -69 220 75 -173 -79 87 59 -8 -37 -64
1432 -64 11 127 24 -167 -65 197 93 -213 -128 182 107 -175 -128 96 79 -86 -70 3 13 20 17 -88 -89 96 110
1457 110 -120 -130 123 163 -104 -142 117 155 -70 -113 58 84 -29 -25 7 -30 13 66 -51 -138 28 148 -73 -196
1481 -196 37 156 -76 -187 38 127 -57 -105 33 46 -38 15 32 -49 -20 112 31 -124 -2 166 18 -167 15
1504 15 175 -16 -148 31 112 -47 -78 54 12 -98 -3 64 -76 -96 87 61 -133 -65 119 30 -130 -7 126
1527 126 -45 -106 64 95 -96 -71 123 28 -138 -9 135 -20 -119 52 81 -74 -55 74 3 -103 35 98 -99
1550 -99 -105 115 105 -151 -102 136 95 -136 -53 113 33 -75 -8 28 -48 9 74 -84 -116 93 121 -154 -167 135 147 -134
1576 -134 -164 99 121 -71 -88 26 38 27 15 -53 -63 90 144 -96 -156 106 191 -77 -191 61 159 -51 -133 -1
1600 -1 71 5 -30 -47 -53 47 80 -78 -157 32 157 -36 -184 2 150 8 -119 -23 87 56 -22 -42 -8 49 77 -14
1626 -14 -98 6 144 27 -131 -38 115 56 -100 -70 44 56 -12 -68 -43 24 53 -13 -106 -34 88 52 -101 -96 70 92
1652 92 -47 -105 1 89 28 -67 -56 21 82 2 -84 -47 77 82 -61 -100 33 107 5 -112 -39 89 50 -68 -74 29
1678 29 79 16 -79 -60 52 72 -24 -103 -2 97 29 -107 -73 67 47 -58 -91 11 63 5 -62 -46 20 60 11 -82 -41
1705 -41 67 67 -71 -74 62 96 -29 -57 13 48 18 -10 -28 -1 38 57 -38 -81 31 87 -21 -112 -6 81 -4 -70 -30 28
1733 28 9 -12 -36 -62 1 73 -3 -113 -10 125 37 -119 -27 121 45 -68 -29 63 40 13 0 -31 9 95 37 -106 -54
1760 -54 130 63 -140 -81 115 69 -110 -74 58 37 -29 -29 -24 -31 48 52 -89 -77 122 93 -122 -97 142 92 -113 -70 103
1787 103 68 -66 -16 40 -4 -6 34 -21 -67 56 91 -80 -91 102 91 -110 -91 117 60 -98 -37 93 3 -58 16 52
1813 52 -48 -15 68 -8 -93 43 76 -63 -77 83 60 -106 -47 111 13 -115 15 117 -20 -77 54 66 -52 -20
1837 -20 56 -6 -51 50 50 -61 -16 102 24 -114 12 136 -16 -132 24 118 -37 -98 12 52 -27 -42 8 -20 -11 53
1863 53 -12 -95 16 130 -6 -125 23 147 -2 -111 4 113 20 -66 3 41 28 24 -24 -41 34 86 -25 -127 7
1888 7 119 -10 -141 -8 108 13 -108 -52 56 24 -29 -53 -27 46 52 -35 -86 32 100 -9 -106 -11 116 26 -86 -38
1914 -38 51 54 -25 -53 -15 55 43 -47 -68 21 87 -12 -83 -2 70 19 -59 -34 35 43 2 -49 -35 36 57 -32 -73 15 79 3 -90
1945 -90 -8 53 17 -40 -33 3 37 24 -16 -51 18 84 -9 -89 -1 105 29 -70 -18 75 43 -13 -31 -3 33 45 -16 -81 -4 92
1975 92 13 -120 -48 117 44 -101 -67 57 41 -36 -61 -19 23 42 -22 -79 -13 110 39 -117 -60 121 92 -90 -73 92
2001 92 88 -29 -65 21 45 38 -9 -56 -14 86 50 -105 -75 97 84 -108 -114 68 95 -55 -88 16 59 -3 -29 -34 -4 47
2029 47 42 -56 -63 65 95 -60 -93 55 105 -30 -93 33 83 4 -44 1 20 28 26 -26 -43 31 59 -32 -77 21 77 -32 -78
2058 -78 13 71 -8 -61 -3 31 -8 -11 -12 -17 10 18 -15 -51 3 38 -10 -65 12 59 -4 -44 9 48 5 -22 8 21 16 15 10 -10 17 42
2092 42 6 -34 9 49 -8 -44 4 50 -11 -50 -6 28 5 -35 -16 -2 0 0 -10 -29 11 29 -11 -41 5 49 14 -41 -10 56 31
2123 31 -22 -13 35 28 6 -12 -8 18 35 4 -42 -8 50 20 -49 -33 45 29 -48 -34 16 32 -7 -34 -19 4 22 -4 -43 -12 42 26
2155 26 -45 -38 46 41 -19 -36 30 41 5 -20 -6 23 21 -9 -28 -14 27 33 -27 -53 18 46 -31 -48 -6 37 7 -33 -18 6 11 -2 -32
2188 -32 -27 18 43 -17 -59 -11 48 4 -62 -22 42 9 -32 -25 -10 20 13 -18 -41 5 53 13 -45 -17 61 35 -45 -21 32 40 -19 -28 4
2221 4 21 11 -8 -46 -24 42 4 -61 -43 36 24 -53 -62 12 40 -20 -47 -10 14 16 -2 -36 -13 41 50 -32 -44 36 63 -17 -58 21
2253 21 60 15 -50 -7 27 31 9 -21 -15 21 37 -23 -60 -3 68 -4 -73 -13 52 15 -50 -25 23 20 -5 -25 -6 16 32 7 -44 -9
2285 -9 51 25 -41 -21 46 41 -17 -33 22 42 8 -30 -6 12 20 -1 -32 -23 26 34 -29 -48 15 43 -19 -68 -1 41 -3 -34 -17 19 16
2318 16 2 -8 -16 6 35 -14 -52 -4 53 -4 -47 -26 48 28 -33 -15 32 23 -10 3 7 14 24 11 -20 -13 46 33 -38 -33 43 33 -46
2351 -46 -34 29 17 -31 -29 -7 -1 -9 4 -14 -22 17 25 -21 -31 23 52 -6 -34 36 50 -11 -11 12 37 -7 7 23 -1 -1 32 12 -34 2
2385 2 42 0 -49 7 38 -13 -40 7 15 -21 -22 14 -12 -36 18 15 -26 -35 26 22 -27 -18 43 20 -30 0 29 -9 2 25 16 -30 -3 43
2419 43 -11 -38 24 44 -21 -33 16 19 -15 -23 11 -6 -16 20 -2 -25 -12 27 -1 -54 4 44 -19 -53 3 40 -13 -41 1 21 -8
2450 -8 2 3 -10 2 35 15 -42 8 53 29 -45 -3 55 16 -28 8 29 -2 3 7 0 -13 15 24 -37 -27 33 10 -47 -17 35 4 -39
2483 -39 -16 14 -7 -24 2 -5 -16 -7 19 -14 -20 17 37 -7 -9 33 29 -15 -11 17 10 9 1 14 -18 -2 28 -3 -26 1 22 -1 -38 -16 -1
2518 -1 -14 -7 -9 -13 -13 12 -10 -18 -18 31 8 -32 -18 36 29 -16 -17 13 26 -11 -14 -14 10 14 13 -24 -3 31 30 -36 -31 27 36 -27 -33 2 27 7 -28
2557 -28 -24 4 23 -1 -39 -29 25 18 -42 -41 15 39 -19 -44 -4 39 12 -25 -30 8 34 16 -30 -17 41 29 -25 -49 14 47 4 -42
2589 -42 -11 52 33 -22 -29 9 46 10 -29 -23 38 30 -21 -48 -7 49 1 -55 -35 27 29 -32 -48 -15 30 4 -36 -27 19 36 -11 -51 -2
2622 -2 56 22 -23 -35 47 51 -4 -39 5 57 22 -27 -30 18 44 -17 -46 -19 38 17 -40 -46 10 37 -12 -55 -22 34 16 -36 -25 21
2654 21 44 6 -24 -8 26 36 -25 -38 14 57 15 -39 -12 46 25 -22 -27 12 29 -3 -36 -19 16 18 -10 -40 -10 30 13 -33 -25 22
2686 22 27 -20 -38 8 29 -5 -24 -22 11 13 0 -29 -9 20 17 -21 -32 22 22 -14 -19 10 30 -1 -17 6 10 13 2 -10 -10 17 16 -20 -27 11
2722 11 16 2 -29 -9 25 1 -32 -8 -4 6 -3 -28 -11 0 -2 -17 -29 -3 20 1 -21 -8 24 27 -18 -10 12 19 -3 -7 6 11 23 -1 5
2757 5 -4 19 17 -6 -13 9 18 -15 -19 -2 5 -9 -18 -9 -7 1 -8 -3 -6 -4 4 -10 -7 3 14 -2 -18 14 19 10 -3 7 14 10 4 3 -1 2 16 0 11 2 15
2800 15 -3 -9 -5 -8 6 -23 -9 1 -4 -12 -6 -4 -2 -8 7 4 -10 3 -4 -10 -8 -3 2 -7 -7 13 11 -2 11 4 6 0 5 3 -12 -9 11 13 1 10 4 8 -1 -5 2 5
2846 5 -9 -2 1 1 -4 -1 -6 -8 2 -1 -16 -11 6 9 -12 -14 6 10 -4 0 -5 10 8 3 -6 -1 8 21 -1 -2 10 17 11 7 15 14 8 -5 10 4 -4 8 1 -8 5 -1
2892 -1 -13 -19 -2 -4 -11 -14 -10 0 2 -5 -9 -3 6 2 -2 3 -12 11 4 0 11 4 13 -3 -2 1 11 7 0 12 7 14 -4 -4 0 5 4 -3 -9 4 6 -17 -12 2 -4 -1 -15
2939 -15 -9 6 6 -3 -2 -2 19 3 -7 -3 2 4 1 -5 -1 18 13 -4 3 7 10 2 1 5 4 7 -4 3 9 6 0 -1 4 15 6 -14 -9 -4 -7 -12 -8 -19 -5 -2 9 -18 -7
2986 -7 -7 0 -3 -4 1 5 9 -13 0 -1 17 14 10 8 6 13 1 9 14 19 13 1 11 15 2 -13 -8 5 1 -7 -4 -7 -3 2 -7 -18 -18 -10 1 -13 -18 8 5 -4 -6 -1 6 2
3034 2 6 14 4 13 8 2 -5 9 13 -2 -7 7 17 12 -9 6 -1 0 -18 11 -2 1 4 0 0 2 6 -16 -16 -11 12 2 -14 4 13 -3 7 -8 0 -2 2 2 -9
3077 -9 -2 22 7 -11 -6 15 11 -5 -18 6 12 -1 1 -5 -4 0 16 5 -1 8 11 -8 -14 4 12 -9 -21 -1 2 1 -13 -15 -5 -9 -8 -12 -19 1 7 1 -13 4
3119 4 10 5 -6 4 7 5 0 -2 6 7 9 9 -3 -4 17 -7 -2 -10 10 10 -15 -17 -2 3 -10 -19 -15 -12 -5 -4 -15 -23 -10 -2 -21 -8 3 -1 -15 -9 1 11 4 1
3163 1 10 2 1 6 4 -1 3 18 4 -11 2 17 -6 -1 -5 -5 -3 -3 -19 -13 -6 -8 -3 -11 -7 8 1 -16 -13 0 2 -7 -6 4 7 -10 -9 3 9 14 7 -1 -2 3 10 -7 -5
3210 -5 6 19 -2 -23 1 14 13 -4 -10 2 -14 -7 -2 -17 4 4 -15 -19 -11 11 -1 -18 -13 14 9 -21 -11 -7 1 -5 0 -8 -4 6 1 -11 -8 22 22 2
3250 2 1 10 20 -1 -7 -5 10 12 -5 -6 11 9 6 -7 -6 11 0 -12 -18 -6 11 -11 -28 -10 7 -3 -18 -22 -3 14 10 -4 -15 12 25 7 -9
3287 -9 -5 27 0 -8 6 17 24 -5 -3 -3 10 15 3 -10 4 24 4 -12 -9 18 -3 -23 -20 3 3 -13 -24 -16 4 -3 -16 -15 12 16 -6 -14 3 3
3325 3 14 -10 -2 3 18 12 4 -5 18 17 11 -4 8 20 12 -7 -7 8 5 -5 -23 6 20 4 -11 -20 10 8 -8 -28 -4 5 4 -17 -10 5 10 0 -9
3364 -9 -9 13 7 -13 1 8 9 11 2 -2 19 14 -6 -5 14 25 10 -3 2 18 12 -11 -20 -4 5 -11 -9 -6 -5 -3 -9 -12 -2 -6 -10 -12 -6 4 -1 -13 -11 1 8 -1
3408 -1 -10 -8 10 16 -1 -3 -6 9 22 1 -4 5 8 1 -2 -3 9 14 -10 -12 0 4 -1 -13 -5 -5 -10 -7 -21 -8 7 2 -12 -16 -10 3 -3 -4 -1 10 -7 -2 -5 7
3452 7 11 -2 -8 -4 -3 5 -5 -9 6 5 9 -3 -1 13 12 8 -18 -6 13 3 -10 -11 -1 1 -4 -10 -16 -5 3 -13 -13 -7 -5 0 -5 -14 -4 11 -7 -7 -9 4 7 5
3496 5 -11 9 13 10 1 2 4 14 -3 -4 2 15 -2 -10 -9 4 2 -14 -18 -3 10 -3 -18 -21 0 5 -14 -28 -10 -4 9 -11 -8 3 7 -9 -11 -8 3 18
3536 18 -1 5 1 11 15 -5 1 15 5 -4 -9 5 11 12 -10 5 14 4 -1 -13 -2 9 -7 -9 -13 10 -1 -12 -30 -5 8 -4 -22 -6 10 4 -12
3573 -12 3 5 12 5 -3 -2 15 23 7 -5 -1 14 -2 -6 2 5 15 -1 -10 -1 13 8 -3 -9 4 7 -8 -22 -8 7 6 -17 -19 1 6 -4 -9 -11 8 10 -11
3614 -11 -4 16 2 3 -12 5 12 9 5 -8 3 9 -1 -3 8 22 8 -9 -7 8 12 -5 3 5 13 4 -16 -10 -6 5 -1 -20 -7 10 -5 -4 -11 -8 0 -6 -9
3655 -9 -2 -5 1 4 9 18 9 3 2 7 10 -1 1 5 -4 11 0 -1 4 6 5 -6 -12 4 4 3 -7 -9 1 -15 -1 -6 4 2 -6 -10 -5 -9 8 -10 -8 0 -5 -7 -12 -5 8 7
3703 7 -2 3 11 9 1 3 2 11 0 -8 2 3 6 12 -10 -16 -4 3 -13 -3 -1 -1 -6 -2 0 3 2 -14 -5 -6 -11 -3 -20 -12 3 -7 -9 -5 3 -1 7 0 2 7 -2 -2 3 5 -7 9
3753 9 7 6 -3 4 4 8 7 8 -3 -7 -1 -1 -4 -3 -14 2 -8 -14 -17 0 -9 -15 -9 -10 0 -2 -11 -3 2 0 -8 3 -2 3 0 8 8 4 1 3 3 7 4 0 10 8 7 -11 -1 6 3
3804 3 -4 -3 -14 2 -10 -8 -17 -2 -7 -17 -2 -14 -10 -7 -7 -1 -5 -11 -3 5 4 1 8 4 6 4 -8 6 -4 11 20 5 13 4 21 6 2 -1 -2 1 9 -6 -7 -3 -8 -1
3850 -1 -2 -9 2 -4 -4 -12 0 1 -7 -8 2 5 -2 -8 -6 -1 12 -7 -4 3 11 4 11 -4 4 9 2 -1 -2 19 0 2 2 3 0 8 2 0 16 -5 -3 -2 3 -4 -8 -10 -5 -7 -4 -6 -7
3901 -7 -12 -7 0 0 -7 3 3 -4 0 2 -5 1 13 9 14 7 7 5 -1 14 8 6 8 3 2 -14 -2 11 0 -3 -12 -9 8 4 -10 -6 9 -5 0 -16 -13 6 1 -12 6 2
3947 2 10 7 13 11 9 5 8 12 8 11 1 -1 2 15 6 3 4 8 11 -9 7 3 12 11 -3 -5 -1 -3 9 -3 3 3 -6 -6 -5 -2 -2 -5 1 -3 7 1 3 -3 1 0 -1 2 4 9 9 -3
3999 -3 8 10 3 -9 -3 2 3 7 5 7 -1 -5 -5 -2 4 0 -2 2 -13 2 -8 -15 -9 -5 -2 3 -4 -3 0 -3 3 5 0 3 -1 14 -4 2 4 -10 -2 1 7 2 10 6 2 8 10 6 -2 5 -2
4052 -2 1 -9 2 -2 -2 -3 -2 -8 -1 -9 -8 -11 -5 -1 0 -5 -6 2 -11 -1 7 4 -7 8 16 12 6 3 5 12 9 0 6 3 4 9 4 5 7 -2 -2 8 12 -5 -4 1 -2 -1 -1 13 7 -6
4104 -6 -8 3 -2 -3 1 -7 4 -1 -6 -6 3 9 10 -2 15 9 12 11 4 18 10 5 -1 17 16 7 7 16 -2 5 12 6 2 9 2 -5 5 -2 -9 1 0 9 -2 -3 -4 -13 -3 -8 2
4153 2 4 -4 3 10 3 7 4 13 9 -1 4 5 12 3 7 12 3 -2 5 3 9 7 6 6 -3 -3 3 -3 0 -10 -15 -8 -10 -7 -3 -8 -11 -7 -3 -2 7 -2 -8 7 4 4 10 13 3 16 0 1 6 9 14
4208 14 8 14 14 3 0 9 0 10 6 1 1 12 5 -8 -1 -1 1 -17 -10 -13 -13 -8 -14 0 6 1 1 -8 0 8 11 -2 2 1 8 -3 3 6 19 3 11 9 20 15 4 0 11
4255 11 28 8 4 -7 7 -6 1 -6 1 5 -13 -6 -3 -3 -1 0 -5 -8 -2 2 2 -4 2 12 -12 -5 11 11 2 0 7 7 8 3 11 13 21 11 2 4 12 10 6 5 4 9 -1 -6 -5
4304 -5 0 5 4 -3 5 6 -6 2 -3 0 -4 -4 -4 0 8 -3 -8 0 4 6 0 -3 3 8 1 -2 3 5 14 4 -2 9 15 9 8 9 5 -1 -11 0 8 9 15 -3 1 0 6 4 -8 -4 -4 -2 3
4357 3 12 6 -3 -7 3 4 11 -9 0 4 12 11 -3 1 -5 19 7 9 9 7 15 6 4 12 8 11 0 5 -6 16 -4 4 -3 2 3 0 -5 -4 3 -7 -1 -5 2 -9 -3 -4 1 -5 -13 0
4407 0 9 1 11 5 3 10 16 9 1 9 19 12 9 6 10 5 7 8 -11 14 -2 1 5 2 -1 -13 -7 -17 -1 -1 -9 1 6 1 -6 0 6 -2 1 2 -3 6 12 -3 15 10 10 9 12 -2
4457 -2 6 12 16 14 11 7 5 -5 1 -1 4 0 -12 -7 -4 -9 6 -3 -12 -4 -16 0 -10 -15 -2 -6 -5 4 1 -9 4 1 -6 -3 0 5 9 8 5 11 14 7 -5 10 0 13 8 3
4505 3 0 12 1 5 -2 7 -2 2 1 5 4 2 -8 -7 -5 -4 -11 -9 1 0 -7 -19 -12 0 4 0 -4 1 8 1 0 12 1 4 11 3 -1 11 4 0 12 5 6 7 4 -7 0 -10 0
4554 0 -3 3 -4 -3 -1 0 -12 -18 -12 -18 -7 -3 -3 1 -7 -5 -4 -10 -4 10 0 -1 2 -2 10 13 6 6 8 6 2 3 12 11 2 -5 -6 0 -8 -6 -5 -2 7 -7 2 -3 -5 -2 -16 -5 5 4
4606 4 2 -6 -1 14 0 -8 -4 -1 -4 -12 -2 3 1 -4 -6 -10 4 10 1 5 8 1 3 0 4 1 7 0 -7 2 1 1 -13 -2 6 -2 -9 -11 -2 1 -4 -5 -20 -11 -4 -9 -2 -12 2 -2 2 2
4658 2 2 0 4 -6 -4 -3 6 6 0 11 6 10 5 10 12 6 9 2 1 8 -5 -12 2 4 -10 -6 -12 -7 3 -8 -9 -8 -7 -5 -9 -6 4 0 -3 -1 -3 11 8 3 1 8 0 1 3 13 15
4709 15 2 12 12 2 0 5 -5 -1 12 -1 -7 -1 -4 2 -1 -16 -9 2 -5 -14 -11 0 3 -7 -8 3 -9 6 1 5 -5 0 17 0 7 10 10 -5 3 -1 14 5
4751 5 9 19 3 6 0 6 2 7 -3 0 -7 4 5 2 2 -8 -3 -8 4 -2 -3 1 0 -2 -7 -2 5 5 0 0 5 -5 -5 -6 4 2 2 2 0 13 1 5 6 5 6 4 4 -3 -5 -3 -2
4802 -2 -14 -6 4 -7 -3 -4 1 -14 -10 -3 -16 -3 -11 -7 -7 -7 -2 -7 -5 -6 1 3 7 4 7 5 0 7 8 9 1 12 4 6 7 10 -1 5 -3 8 4 4 -4 -7 1 -5 -8 0 -10 -16 1
4853 1 -18 -8 0 0 3 1 0 1 1 2 2 8 7 6 14 7 7 10 0 2 10 9 5 8 6 5 8 -1 5 10 6 1 5 -2 5 0 -9 0 -11 -12 -3 -2 0 -6 1 -9 -1 -2 -5 -1 6 -1 1 7 1 -2
4909 -2 -1 -5 9 3 6 -4 11 9 6 7 0 8 7 -1 5 -1 -3 -1 0 -7 -1 1 -1 -15 -10 -14 -6 -8 -3 -9 3 -1 -3 4 5 1 8 0 -3 3 10 15 6 1 4 3 7 9 6 11 4 8 12 10 4 10
4965 10 -1 17 4 2 2 -10 -7 -4 -18 -3 4 6 0 -13 -12 3 -8 0 -3 -9 5 3 -4 3 2 -5 8 7 14 1 21 8 7 15 15 8 6 8 -3 12 0 6 7
5008 7 -1 0 4 3 -2 -6 3 3 10 -4 -7 2 -1 -9 -11 -6 -2 -7 -9 -4 5 3 3 -6 -3 -2 10 -1 2 4 9 9 6 14 -3 4 -8 1 2 4 6 -4 8 5 11 -4 -16 -3 0 -7 -9
5059 -9 -10 -18 -3 -14 -5 -1 0 1 -7 0 -3 2 -10 -2 -5 3 7 1 2 -2 6 -8 9 2 -1 3 8 7 4 3 6 4 2 7 3 -6 -3 5 1 -4 0 -2 0 -2 -3 2 -13 -2 -11 -4 3 -5 -6 2
5113 2 5 3 9 12 1 6 21 4 6 9 -2 6 7 4 14 9 11 -4 -1 10 10 4 11 6 -1 -1 0 0 7 -2 2 -2 4 4 -5 7 -1 0 -5 -1 2 3 2 1 7 4 2 14 1 5 8
5164 8 13 13 11 9 3 1 3 7 0 6 17 6 -3 0 10 5 -3 11 1 0 -6 3 -2 3 -7 -9 -5 -5 -1 -3 6 1 7 -2 5 4 18 -4 6 -1 13 9 8 5 2 7 8 2 -4 11
5214 11 0 -2 -2 3 -1 -4 -8 6 -4 -1 1 -16 -1 -7 -12 -2 -2 -6 -4 -6 -6 6 7 7 3 9 4 5 3 20 8 3 9 3 14 4 6 0 7 7 18 10 13 -1 8 7 -4
5261 -4 5 -5 -2 3 -7 -8 -6 1 -13 -8 -11 -6 -13 -2 -10 -1 1 4 3 4 5 1 1 -2 9 5 12 2 11 2 10 2 0 2 12 1 7 3 9 -1 1 -2 2 -4 -1 -5 -1 -7 -3 -12 -2
5312 -2 -10 -3 -2 -11 -12 0 6 2 1 2 3 -1 2 8 -5 3 13 9 5 14 9 2 8 13 6 3 8 0 -2 0 1 -7 -8 -4 -5 -4 -8 -3 -2 -7 -5 -3 -11 5 -1 -5 5 3 10 0 1 3 3 6 11
5367 11 10 10 11 9 7 6 10 12 9 5 9 -4 14 3 12 10 1 7 4 -12 10 1 3 -6 -7 -3 4 -1 -8 0 2 -9 6 -5 0 -7 5 -2 -5 0 4 -10 -5 8 -3 5 7 10
5415 10 0 11 8 14 12 8 7 8 0 9 8 -4 -1 -5 -1 6 -13 3 -4 -3 -5 -9 -11 0 -9 -4 -3 -3 -5 1 1 -4 -2 -1 -1 0 -4 5 3 13 8 10 6 9 3 7 8 -4 -3 4 0 4
5467 4 9 8 7 -8 1 -3 2 -5 -12 -4 -8 -15 -10 -8 0 -3 -9 0 -11 3 -4 -5 3 2 -1 -2 3 4 8 11 1 6 -7 2 3 10 5 10 1 1 -3 -5 -6 -5 -6 -5 -6 -17 -2 -8 -10 -12 -11 -10
5521 -10 -8 -8 6 -3 -3 0 1 -6 -2 2 -7 0 7 -7 5 2 -8 7 8 -3 -2 -1 4 2 6 2 11 2 -7 -3 -5 -2 -8 -2 -6 -1 4 -3 0 1 -5 1 -6 -2 -14 -9 -7 -9 -10 -5 -10 -5 -4
5574 -4 2 -4 -6 1 17 14 -7 -1 13 4 10 2 -3 4 0 0 2 4 11 -2 -3 -6 -7 -3 -1 1 -4 -8 1 -13 -5 -8 -6 -6 -6 11 3 4 4 8 3 -5 2 -10 7 1 9 4 6 -2 14 5
5626 5 10 22 0 6 15 6 0 2 11 7 3 1 2 8 -2 7 -4 3 4 3 -3 4 -1 -4 4 -8 11 -11 5 4 3 7 5 16 10 10 12 18 9 10 15 16 3 3 6 5 9 9 10 4 5
5677 5 2 -4 2 -3 -10 0 0 2 0 -3 -10 -3 -1 -8 0 -9 -10 1 -17 -9 -7 8 2 1 16 4 4 10 8 7 11 -1 8 3 0 -1 -4 2 -4 -4 -9 -4 6 -7 -2 -7 -5 -2 -6 -9 -4 -2
5729 -2 -12 -14 -8 -3 -18 3 -12 1 1 -1 -4 2 10 0 4 10 10 12 5 11 1 -5 4 1 -10 0 3 1 4 9 -7 -12 -12 1 -5 3 -8 -14 -2 -2 -2 0 -14 -10 -1 -1 3
5776 3 7 4 -4 1 -8 -6 -3 5 -2 3 5 5 0 16 6 12 5 6 10 16 16 -5 16 -4 6 1 4 -1 7 -4 1 -2 -1 -11 1 -6 -15 -4 -3 -9 -2 -8 11 0 3 4 4 -4 4
5825 4 -5 6 4 7 6 6 8 0 19 9 6 1 6 1 16 3 2 1 3 -2 4 0 0 2 -5 -8 -4 -3 -13 3 -15 -5 -5 -7 -6 2 4 0 2 6 2 1 -4 1 8 10 2 -10 -6 4
5875 4 10 1 6 0 4 -5 -10 6 -7 -3 14 2 -6 -1 11 4 0 5 -1 0 -1 -11 -7 -8 3 2 6 -1 -1 -7 -4 -7 0 9 -4 -6 2 1 7 9 0 12 12 7 -3 10 4 0 -3 1
5925 1 2 3 2 -7 1 -9 -11 -7 -6 -2 -6 -9 -4 -8 -4 -8 -5 1 -6 -7 5 4 -1 -1 -4 -4 1 11 9 -3 10 8 2 4 7 4 14 3 -1 13 4 -3 3 -2 -3 -4 -4 -2 -9 -2 -4 0 -7
5978 -7 -12 -9 1 -5 -10 -6 -9 -2 -4 -8 -6 4 -1 8 2 2 6 0 8 6 6 1 5 9 14 7 4 4 12 7 3 -4 -3 -3 5 0 -11 -4 2 -5 -3 3 -6 -12 -7 -6 -3 1 -4 -10 -1 6 3 -6 -6 4 9
6035 9 6 6 5 13 4 17 8 4 11 7 5 6 7 8 -3 -2 1 6 1 -5 -2 -4 -5 0 -1 0 7 5 -12 -14 4 -11 -9 -6 -2 -1 1 2 4 1 -8 0 4 23 11 1 10 2 7 10 9 1 11
6088 11 8 5 7 4 14 11 -1 -2 9 -7 1 -12 -2 -10 7 -8 4 4 -2 2 9 5 -6 7 4 9 6 6 4 6 5 2 7 15 13 6 7 11 8 6 16 -1 6 5 -2 11
6134 11 5 3 7 1 -1 -1 -7 -9 -7 0 1 3 -9 -8 -4 -2 1 -3 -9 6 -1 7 -3 6 8 5 12 8 7 6 0 2 7 3 8 0 12 5 3 12 8 6 -5 -3 -10 6 -2 2 -9 -6 -4 -7 -10
6187 -10 -17 -8 -8 -7 -9 -4 -7 -3 -6 6 -4 -1 4 12 9 12 16 6 5 5 1 2 12 13 3 16 13 13 3 7 5 0 -6 -2 -5 -6 10 -6 5 11 -13 0 4 -11 -6 -6 -4
6234 -4 2 5 3 0 -2 3 1 12 11 14 2 8 4 12 3 5 9 17 13 8 8 2 12 4 5 2 7 8 4 1 1 0 -2 -8 13 8 1 -3 -5 -12 0 7 -1 1 2 8 6 1 6 13 4 3 3 9 15 5
6290 5 1 6 9 5 3 10 8 3 9 7 -6 -2 -1 1 -2 11 -4 -2 4 0 -3 -3 -1 6 1 4 1 -2 6 4 6 -5 9 4 9 5 -2 19 10 6 4 7 -1 10 16 14 14 11 7 -4 5 5 9
6343 9 9 1 -3 -6 -2 8 -4 -4 1 0 0 4 7 2 -5 9 1 14 5 -6 12 -2 13 4 14 3 15 3 9 4 0 13 12 11 1 7 12 0 0 13 -3 -6 3 -1
6387 -1 -3 5 -1 4 -8 5 -4 -2 -4 -2 5 6 3 -1 16 6 6 6 4 3 6 1 14 2 14 2 13 14 6 4 8 12 -1 9 9 16 7 4 1 6 8 5 5 0 -4 -1 2 -7 -4 -1
6437 -1 14 -1 4 -2 13 -5 3 -3 6 4 13 10 13 4 5 8 22 10 18 6 5 15 6 14 4 13 -4 4 6 10 8 5 -1 -3 -2 10 5 -7 2 -1 -14 1 -2 -7 6 -1
6483 -1 -3 -6 6 16 14 10 -11 15 10 1 2 13 14 12 22 18 5 14 2 0 3 2 12 4 6 0 6 -4 5 0 6 -1 5 1 3 0 -11 2 3 3 8 -1 3 5 6 3 5 8 5
6532 5 9 9 2 0 12 12 8 5 8 19 -1 9 9 5 6 7 4 0 7 15 1 8 5 6 7 5 10 -5 -7 4 7 -8 -4 -4 -4 4 -3 -2 -1 9 -3 3 -5 6 3 8 4 16 9
6581 9 9 20 17 24 7 -1 2 10 5 11 8 4 4 -6 -1 6 8 7 -4 -7 -5 1 -4 3 2 6 -4 3 2 0 6 6 9 11 6 7 4 15 7 4 14 10 9 13 5 4 4 9 6 10 11 19 3
6634 3 1 -2 -2 10 1 6 -3 4 -1 6 -7 1 8 4 -6 2 3 -9 1 -3 8 6 5 10 3 6 2 12 11 7 5 -1 11 5 9 11 -5 -4 3 8 7 10 3 9 3 -4 2 2 1 4 -8
6685 -8 -2 -1 -1 -1 -8 0 4 11 8 7 8 1 2 17 5 7 21 9 11 16 9 1 16 18 13 13 14 6 8 9 1 12 7 10 1 6 -2 14 3 2 -7 0 -8 -5 -10 -1 3 3 11 9 1 3 6
6738 6 5 3 -1 -1 0 1 7 -1 10 12 10 14 15 11 8 5 2 12 2 6 9 5 7 0 4 0 2 -3 -6 -8 -3 -8 8 1 -5 -1 1 6 8 8 -2 1 5 5 -2 11 9 7 1 12 7 5 10 0
6792 0 5 -1 9 9 2 20 5 13 3 9 10 -5 -1 2 2 1 -9 -1 -3 -2 -4 4 5 -12 9 2 5 0 -1 3 7 4 8 6 3 2 20 9 20 7 4 13 23 13 15 13 5
6839 5 16 7 4 5 13 12 1 1 0 0 -5 1 -3 1 -5 3 3 0 -5 -5 4 -1 12 3 23 15 11 12 3 19 5 12 8 2 12 11 10 1 2 -5 -2 7 8 -5 3 1 -5 2 -1 -7 -12 2
6891 2 -6 -3 1 -5 -6 3 -8 0 -4 -2 -11 -6 3 7 6 0 5 12 8 4 8 1 4 4 16 8 21 15 1 5 -1 4 8 -4 5 8 6 -1 -2 2 3 -3 -9 4 -6 -4 -1 2 2 8 2 2 3 8
6945 8 9 -2 6 -1 11 6 9 6 6 8 15 11 2 15 17 16 11 9 11 18 8 12 4 9 -2 -5 -4 -2 0 4 -4 -4 0 -2 1 2 -8 -2 -3 10 2 4 9 2 8 8 13 16 10 4 20 23 12
6998 12 11 20 9 5 5 4 2 14 4 12 9 3 4 2 4 3 2 1 3 -6 0 0 0 -11 -4 -3 -14 -9 -5 2 7 8 8 6 14 11 13 12 1 6 14 15 6 4 11 9 17 6 4 7 8 7 12
7051 12 12 7 8 14 0 -1 7 2 2 0 11 -2 0 -2 -1 -2 2 8 3 2 2 -2 8 8 17 3 7 11 11 6 11 11 4 11 8 5 5 4 -8 12 8 15 3 8 0 -5 -14 6 -3 -9 -1
7102 -1 -2 0 -9 -3 -11 5 -7 4 -6 -5 0 -1 0 -3 5 2 0 -1 8 7 11 5 7 8 4 4 -2 9 5 -2 6 0 4 6 0 1 -9 -12 -4 -7 0 -4 -15 -2 -5 -4 -5 -6 -2 -8 5 -5
7154 -5 6 -9 10 8 2 0 -2 6 7 12 9 2 10 10 5 4 6 7 -2 -4 -1 0 0 -2 9 -3 4 9 5 2 -4 0 2 6 4 -4 -1 -1 8 5 0 -3 -7 17 5 8 1 13 10 13 5 15
7206 15 10 1 9 12 5 11 7 7 8 -1 12 0 4 5 0 -1 9 -14 -15 0 12 -14 1 -10 -6 -5 -3 5 -6 -4 2 2 -3 -2 3 6 -1 9 -4 3 6 6 10 4 11 18 17 7
7254 7 6 -2 -1 6 -4 0 4 3 0 3 0 -3 11 -5 -3 -9 8 9 0 -6 0 13 -3 -6 -4 -1 8 -1 4 2 3 7 8 10 14 14 10 9 15 15 4 7 9 6 16 11 12 2 4 9 2 9
7306 9 -5 3 -12 2 -2 -4 -2 1 1 -4 -7 1 -3 8 14 12 3 9 0 15 9 6 13 20 7 8 -3 2 8 7 2 9 9 -9 10 7 2 -7 -10 -3 -1 -9 11 1 -5 -4 -1 1 -7 -3
7356 -3 -6 -5 1 -3 -1 -7 -4 -1 7 3 1 11 13 5 4 8 8 22 7 10 10 -1 -4 -5 13 9 11 3 1 6 -10 4 6 10 -3 -1 0 6 -8 -4 -6 3 3 0 -6 -5 -1 3 2 -9 -3
7407 -3 12 11 5 1 -5 10 12 11 17 12 8 2 9 8 5 10 8 9 0 -5 4 6 0 0 3 8 -7 1 4 -2 -2 10 5 -4 3 -6 3 14 13 11 3 1 5 6 11 5 14 6 14 3 7 10 10 8 11
7462 11 4 19 9 1 12 2 -2 12 9 1 0 3 -3 -2 2 -10 -1 1 5 -4 -4 9 -2 2 -6 3 4 -3 3 -2 5 0 0 3 0 10 12 3 10 21 4 7 7 7 3 12 4 4 1
7511 1 0 -1 -5 2 -8 -12 -6 -6 -3 -5 0 -3 -15 -3 -7 -10 8 -2 -2 -2 5 10 2 10 11 18 8 3 7 7 12 8 7 9 6 20 2 9 7 1 13 -1 9 13 13 -1 3 -7
7559 -7 -1 -3 -3 -2 -2 2 6 11 0 15 13 -1 6 6 11 5 11 6 9 7 2 5 6 14 12 10 9 4 12 5 10 6 0 6 3 10 7 -9 -3 -1 -11 -4 -16 0 -5 1 -5 3 -7 -8 4 5
7611 5 -2 -9 7 2 6 3 3 4 11 15 2 10 8 7 12 6 7 4 10 8 -1 5 6 7 3 4 2 2 0 6 4 0 1 -5 -16 -8 -4 -5 -13 -5 -1 -3 3 2 -2 15 8 7 7 0 11 7 6 -3 9
7666 9 8 13 12 10 6 1 -7 0 4 -3 0 0 8 -4 -6 3 0 0 0 -5 1 -6 -4 -9 -4 3 -1 12 -7 11 0 6 11 -3 4 8 6 3 2 1 2 1 -4 12 10 9 9 8 15 1 0 13
7718 13 0 5 3 5 5 -2 3 -1 5 3 -3 -12 2 -9 -4 -2 7 -5 5 8 3 12 9 1 6 5 2 2 14 19 22 18 16 10 10 4 9 6 3 7 12 9 6 8 3 13 -6 -9 4 -1 11
7769 11 -1 -4 -3 -8 0 -7 -3 -1 0 3 9 10 0 8 14 17 2 2 6 -6 7 7 4 1 3 10 -4 4 5 -2 8 -2 -2 -4 -9 -7 2 4 0 2 -9 -2 -4 -7 9 1 -2 -2 -5 4
7819 4 5 7 -4 5 -1 2 -4 -1 -2 13 14 3 7 3 6 8 4 2 -1 11 0 10 0 -3 -1 1 0 -7 -4 -3 2 4 0 -8 0 2 -7 -3 -4 -5 -1 7 -3 0 3 7 3 1 0 5 3 13
7871 13 -3 0 5 11 -2 4 7 1 4 -2 2 11 1 -3 7 -3 -8 -10 0 -5 -23 -2 -1 -3 -7 -5 2 4 -4 -8 4 5 0 5 8 5 3 3 2 -4 11 6 0 12 13 8 8 16 6
7920 6 11 14 0 5 -4 12 9 6 -3 -2 0 -5 -4 -8 -2 -5 -9 -1 -6 -9 -8 -4 -8 2 -10 6 -4 5 4 3 10 10 15 9 0 6 11 5 13 20 16 5 7 12 11 16 3 5 -4 -1 0 5 4
7973 4 -1 -12 -2 5 -13 3 0 1 -9 -2 -11 -14 -3 -4 9 5 5 3 5 9 1 1 15 9 6 7 13 4 5 11 10 10 6 5 5 -6 -7 -8 -6 1 -6 6 -10 -8 -3 -3 -1 3 -4 -5
8023 -5 -4 -9 7 9 2 -1 -5 7 8 4 18 8 -1 5 3 4 6 0 7 6 5 6 9 -2 5 -8 -4 4 2 -3 -3 -1 -5 -8 0 -6 9 5 -7 -15 2 6 -1 -13 0 6 -1 1 4 3
8073 3 -2 3 9 4 7 10 -2 -3 9 3 6 18 6 18 16 14 10 4 -1 5 6 4 -4 -3 3 9 4 -1 -3 -2 3 0 -1 -3 1 -3 4 5 4 -5 6 1 5 9 6 6 10 14 11 13 15 -1 15
8126 15 13 12 5 6 6 3 5 -5 -1 12 1 3 -10 1 5 -4 1 -6 6 -6 0 0 1 5 11 5 -4 -6 7 1 5 8 7 12 3 8 4 10 5 0 6 3 3 10 6 8 7 6 1 10 1 0
8178 0 -3 -6 11 7 3 2 -7 -5 2 -2 2 -7 -3
8191c
##END NTUPLES=NMR FID
##END=
