##TITLE=1H_LY-DMAA.Per.3.6
 CDCl3
 8 sc, 
 9.02.2022
##JCAMPDX= 6.0         $$ Bruker NMR JCAMP-DX V2.0
##DATA TYPE= NMR FID
##DATA CLASS= NTUPLES
##ORIGIN= UXNMR, Bruker Analytische Messtechnik GmbH
##OWNER= root
$$ XWIN-NMR		Version 3.5
$$ Wed Feb  9 13:48:51 2022 Russian Standard Time (UT+4h)  she@DPX200
##.OBSERVE FREQUENCY= 200.131346
##.OBSERVE NUCLEUS= ^1H
##.DELAY= (6, 6)
##.ACQUISITION MODE= SIMULTANEOUS
##.ACQUISITION SCHEME= undefined
##.AVERAGES= 8
##.DIGITISER RES= 18
##SPECTROMETER/DATA SYSTEM= spect
##.PULSE SEQUENCE= zg30
##.SOLVENT NAME= D2O
##.SHIFT REFERENCE= (INTERNAL, D2O, 0, 15.7039)
##AUDIT TRAIL= $$ (NUMBER, WHEN, WHO, WHERE, WHAT)
$$ ##TITLE= Audit trail, XWIN-NMR		Version 3.5
$$ ##JCAMPDX= 5.01
$$ ##ORIGIN= Bruker BioSpin GmbH
$$ ##OWNER= she
$$ F:/spectra/data/she/nmr/H-F/1/audita.txt
$$ ##AUDIT TRAIL=  $$ (NUMBER, WHEN, WHO, WHERE, WHAT)
(   1,<2022-02-09 13:47:33.37 +0400>,<she>,<DPX200>,
      <created by zg, POWCHK disabled, PULCHK disabled
       configuration hash MD5:
       00 E9 B6 7A A2 85 ED C7 34 08 36 98 17 FE 4E 26
       data hash MD5: 16K
       D8 F9 45 BF 9E 8B 3F DC A9 68 C0 71 43 7E 42 B9>)
$$ ##END=
$$ 
$$ hash MD5
$$ 7B A6 CB 27 3B 4D 4A C4 D7 8E 0E 41 EE 4A 14 C8
##$RELAX= 
##$RELAX= 
##$RELAX= 
##$RELAX= 
##$RELAX= 
##$RELAX= 
$$ Bruker specific parameters
$$ --------------------------
##$DU= <F:/spectra>
##$EXPNO= 1
##$NAME= <H-F>
##$PROCNO= 1
##$TYPE= <nmr>
##$USER= <she>
##$AMP= (0..31)
100 100 100 100 100 100 100 100 100 100 100 100 100 100 100 100 100 100 
100 100 100 100 100 100 100 100 100 100 100 100 100 100 
##$AQSEQ= 0
##$AQ_mod= 1
##$AUNM= <au_zg>
##$AUTOPOS= <>
##$BF1= 200.13
##$BF2= 200.13
##$BF3= 200.13
##$BF4= 200.13
##$BF5= 200.13
##$BF6= 200.13
##$BF7= 200.13
##$BF8= 200.13
##$BYTORDA= 1
##$CFDGTYP= 0
##$CFRGTYP= 5
##$CHEMSTR= <none>
##$CNST= (0..31)
1 1 145 1 1 1 1 1 1 1 1 1 1 1 1 1 1 1 1 1 1 1 1 1 1 1 1 1 1 1 1 1 
##$CPDPRG= <>
##$CPDPRG1= <>
##$CPDPRG2= <>
##$CPDPRG3= <>
##$CPDPRG4= <mlev>
##$CPDPRG5= <mlev>
##$CPDPRG6= <mlev>
##$CPDPRG7= <mlev>
##$CPDPRG8= <mlev>
##$CPDPRGB= <>
##$CPDPRGT= <>
##$D= (0..31)
0 1.2 0 0 0 0 0 0 0 0.06 0 0.03 0 0 0 0 0.0002 0 0 0 0 0 0 0 0 0 0 0 0 
0 0 0 
##$DATE= 1644400052
##$DBL= (0..7)
120 120 120 120 120 120 120 120 
##$DBP= (0..7)
150 150 150 150 150 150 150 150 
##$DBP07= 0
##$DBPNAM0= <>
##$DBPNAM1= <>
##$DBPNAM2= <>
##$DBPNAM3= <>
##$DBPNAM4= <>
##$DBPNAM5= <>
##$DBPNAM6= <>
##$DBPNAM7= <>
##$DBPOAL= (0..7)
0.5 0.5 0.5 0.5 0.5 0.5 0.5 0.5 
##$DBPOFFS= (0..7)
0 0 0 0 0 0 0 0 
##$DE= 6
##$DECBNUC= <off>
##$DECIM= 32
##$DECNUC= <off>
##$DECSTAT= 4
##$DIGMOD= 1
##$DIGTYP= 9
##$DL= (0..7)
0 120 120 120 120 120 120 120 
##$DP= (0..7)
150 150 150 150 150 150 150 150 
##$DP07= 0
##$DPNAME0= <>
##$DPNAME1= <>
##$DPNAME2= <>
##$DPNAME3= <>
##$DPNAME4= <>
##$DPNAME5= <>
##$DPNAME6= <>
##$DPNAME7= <>
##$DPOAL= (0..7)
0.5 0.5 0.5 0.5 0.5 0.5 0.5 0.5 
##$DPOFFS= (0..7)
0 0 0 0 0 0 0 0 
##$DQDMODE= 0
##$DR= 18
##$DS= 0
##$DSLIST= <SSSSSSSSSSSSSSS>
$$ [...]
##$SUBNAM2= <"">
##$SUBNAM3= <"">
##$SUBNAM4= <"">
##$SUBNAM5= <"">
##$SUBNAM6= <"">
##$SUBNAM7= <"">
##$SUBNAM8= <"">
##$SUBNAM9= <"">
##$SW= 18.0517287032376
##$SWIBOX= (0..15)
0 0 2 0 0 0 0 0 0 0 0 0 0 0 0 0 
##$SW_h= 3612.71676300578
##$TD= 16384
##$TD0= 1
##$TE= 0
##$TE2= 300
##$TE3= 300
##$TEG= 300
##$TL= (0..7)
0 120 120 120 120 120 120 120 
##$TP= (0..7)
150 150 150 150 150 150 150 150 
##$TP07= 0
##$TPNAME0= <>
##$TPNAME1= <>
##$TPNAME2= <>
##$TPNAME3= <>
##$TPNAME4= <>
##$TPNAME5= <>
##$TPNAME6= <>
##$TPNAME7= <>
##$TPOAL= (0..7)
0.5 0.5 0.5 0.5 0.5 0.5 0.5 0.5 
##$TPOFFS= (0..7)
0 0 0 0 0 0 0 0 
##$TUNHIN= 0
##$TUNHOUT= 0
##$TUNXOUT= 0
##$USERA1= <user>
##$USERA2= <user>
##$USERA3= <user>
##$USERA4= <user>
##$USERA5= <user>
##$V9= 5
##$VALIST= <valist>
##$VCLIST= <CCCCCCCCCCCCCCC>
##$VD= 0
##$VDLIST= <DDDDDDDDDDDDDDD>
##$VPLIST= <PPPPPPPPPPPPPPP>
##$VTLIST= <TTTTTTTTTTTTTTT>
##$WBST= 1024
##$WBSW= 4
##$XGAIN= (0..3)
0 0 0 0 
##$XL= 0
##$YL= 0
##$YMAX_a= 36757
##$YMIN_a= -35877
##$ZGOPTNS= <>
##$ZL1= 120
##$ZL2= 120
##$ZL3= 120
##$ZL4= 120
##$ABSF1= 10
##$ABSF2= 0
##$ABSG= 5
##$ABSL= 3
##$ALPHA= 0
##$AQORDER= 0
##$ASSFAC= 0
##$ASSFACI= 0
##$ASSFACX= 0
##$ASSWID= 0
##$AUNMP= <proc_1d>
##$AZFE= 0.1
##$AZFW= 0.1
##$BCFW= 1
##$BC_mod= 2
##$BYTORDP= 1
##$COROFFS= 0
##$CY= 11.3945322036743
##$DATMOD= 1
##$DC= 2
##$DFILT= <>
##$DTYPP= 0
##$F1P= 2.36226072786647
##$F2P= -0.459571619588291
##$FCOR= 0.5
##$FTSIZE= 0
##$FT_mod= 4
##$GAMMA= 1
##$GB= 0.15
##$INTBC= 1
##$INTSCL= 1
##$ISEN= 128
##$LB= 0.24
##$LEV0= 0
##$LPBIN= 0
##$MAXI= 10000
##$MC2= 0
##$MEAN= 0
##$ME_mod= 0
##$MI= 1.114404
##$NCOEF= 0
##$NC_proc= 0
##$NLEV= 6
##$NOISF1= 3.799351
##$NOISF2= 2.8
##$NSP= 1
##$NTH_PI= 0
##$NZP= 0
##$OFFSET= 15.70392
##$PC= 1
##$PHC0= -15948.95
##$PHC1= 10.80078
##$PH_mod= 1
##$PKNL= yes
##$PPARMOD= 0
##$PSCAL= 0
##$PSIGN= 0
##$REVERSE= no
##$SF= 200.130013532006
##$SI= 16384
##$SIGF1= 3
##$SIGF2= 2
##$SINO= 400
##$SIOLD= 16384
##$SREGLST= <1H.CDCl3>
##$SSB= 0
##$STSI= 0
##$STSR= 0
##$SW_p= 3612.71676300578
##$SYMM= 0
##$S_DEV= 0
##$TDeff= 0
##$TDoff= 0
##$TI= <>
##$TILT= no
##$TM1= 0
##$TM2= 0
##$TOPLEV= 0
##$USERP1= <user>
##$USERP2= <user>
##$USERP3= <user>
##$USERP4= <user>
##$USERP5= <user>
##$WDW= 1
##$XDIM= 8192
##$YMAX_p= 0
##$YMIN_p= 0
$$ End of Bruker specific parameters
$$ ---------------------------------
##NTUPLES= NMR FID
##VAR_NAME=  TIME,          FID/REAL,        FID/IMAG
##SYMBOL=    X,             R,               I
##VAR_TYPE=  INDEPENDENT,   DEPENDENT,       DEPENDENT
##VAR_FORM=  AFFN,          ASDF,            ASDF
##VAR_DIM=   8192,          8192,            8192
##UNITS=     SECONDS,       ARBITRARY UNITS, ARBITRARY UNITS
##FACTOR=    0.0002768,     1,               1
##FIRST=     0,             0,               0
##LAST=      2.2672688,     0,               0
##MIN=       0,             -35877,          0
##MAX=       2.2672688,     36757,           0
$$ Real data points
##PAGE= N=1
##DATA TABLE= (X++(R..R)), XYDATA
0@%%%%%%%%%%%%%%%%%%%%%%%%%%%%%%%jPj4J6j6J6j6J6j6J6j7K1k8L2l2L2l5M3
49B4m8M9n5O2o7P5q3R2j04J18j35J54j79K12k55L19m19N88r38J897q988k8196
71c5877L1628L6128k0738l4400Q661K6728K386j4687r784m56J2726J5779j0427
84G667k9141M074L7891M759m1345j3657L9008K0712l1957k4141K1551K2963j0051
97H333j7015l41P376P824M471j1474j6364J1150K6569p397l3325J513L5719M766
111B1805l3504r771K7477J2121j8951j1283R524P120q18m40n871p687R669J5705
125A5096j0544k2200R015K6105n999k6927K687K4682k1j9911j066J3615L47o954
139b075K159Q77n736L889R750o984j3452Q481J5978q689j6961Q168J6175p548
$$ y = [0, 0, 0, 0, 0, 0, 0, 0, 0, 0, 0, 0, 0, 0, 0, 0, 0, 0, 0, 0, 0, 0, 0, 0, 0, 0, 0, 0, 0, 0, 0, 0, -1, 6, -8, 8, -8, 8, -8, 8, -8, 8, -9, 12, -16, 16, -16, 16, -19, 24, -24, 25, -30, 32, -35, 40, -43, 49, -55, 63, -72, 82, -97, 115, -140, 179, -240, 348, -590, 1307, -7681, -35877, -4249, 31879, 11141, -23259, -14598, 12130, 14516, -171, -9955, -10411, 2315, 18094, 7667, -21474, -17400, 20491, 25250, -16095, -29752, 9256, 29968, -1989, -26130, -4579, 18384, 8333, -8682, -9023, -1647, 6177, 10648, -826, -17190, -6040, 20529, 13132, -20193, -18680, 17039, 21805, -11699, -21470, 6007, 18128, -823, -12106, -2582, 4538, 3720, 3280, -2591, -10278, -609, 15096, 4552, -17648, -8633, 17472, 11473, -15454, -12767, 11915, 11894, -8017, -9083, 4532, 4879, -2075, 84, 961, -4775, -886, 8864, 1880, -11572, -3091, 12887, 4198, -12763, -4595, 11580, 4032]
153D032j3943P223J0653p441o908Q213L214r316K9J0387k549j1012M495J0913
167G990n982r934P332Q217q722n985J0299L600j2001j483J3546j22j4623J054
181f814J4782j524j3804J770J1565k181q258L120M320m928j82P468l386j0526
195h578N944J3675p079j6227O826J7607n384j7231L291J4942j278j0832JN382
209A059n2O66J644o466m712J0997Q746j3729j2974J4190J6449j2526j8289R218
223e779J7884n085j4929J144R736J684k898k702m414J575J1253J462j6441n751
237a3261J9183J0356j9184j4194J6547J6253j2007j5898O522J2828j227p494k754
250d330M77M768P028m453j3859K011J8942J942k1446o371K1073J0237j7968j2497
$$ y = [4032, -9911, -2688, 7965, 524, -6384, 1829, 5043, -4273, -4244, 6143, 3594, -7418, -2923, 7990, 2008, -7926, -594, 7623, -1099, -7084, 3215, 6815, -5186, -6669, 6877, 6755, -7868, -6814, 7968, 6444, -7360, -5590, 5975, 3794, -4464, -1344, 2976, -1952, -2134, 5334, 1948, -8578, -2634, 11041, 3962, -12265, -5439, 12168, 6784, -10447, -7156, 7786, 6508, -4324, -4323, 1059, 1007, 1673, 3317, -3149, -7861, 3136, 11882, -1847, -14821, -631, 15818, 3292, -14997, -5779, 12105, 7020, -7909, -6765, 2971, 4655, 1757, -945, -5359, -3784, 7469, 8931, -7510, -13261, 5922, 16278, -2906, -17100, -553, 15700, 3693, -12205, -5683, 7145, 5918, -1576, -4330, -3853, 915, 7943, 3490, -10369, -8358, 10584, 12526, -8920, -15291, 5782, 16019, -1949, -14446]
264a4446J2864J2461o742r856P70M999L960J406o667q413P058J4720n260j9336
278a2482J890K1429K094k0775n658J7555P829j2398p979O333N966m47j934m387
292b964l221P340Q830q290j3757P313J7159m943j8486J996J7483P21j4462k482
306g763R902K826m699j617l99r98M614M447p372q127Q601J1253q287j3242O933
321c928J3714n002j2544L201R934j922o378J570K401k182J448L518m614n247O744
336G13O932p877q149Q044Q527p614p992O880O539o156m419N686J976n546N28N604
352C676k681n703M397N685n546n357O297M576o695l367O973J839p235k06P518
367D171j351p793K582P868l407p641L798O874l886n524L889L567l973j198M370
$$ y = [-14446, -1582, 10879, 4137, -5719, -4949, 50, 4010, 5416, -1251, -9664, -2606, 12114, 6854, -12482, -10592, 10837, 12931, -7844, -13502, 4053, 11882, -516, -8495, -2162, 3804, 3357, 1423, -2964, -6185, 1155, 9985, 1695, -12062, -4749, 12410, 7467, -11019, -9023, 8460, 9181, -5281, -7763, 2139, 4965, 266, -1351, -1750, -2748, 1866, 6313, -1059, -9186, -585, 10668, 2381, -10861, -3928, 9786, 4784, -7760, -4559, 5375, 3453, -2925, -1355, 1046, -1136, 312, 3830, -784, -6031, 713, 7645, -232, -8381, -337, 8190, 576, -7416, -536, 6003, -153, -4572, 1114, 3090, -2456, -1928, 3676, 995, -4708, -311, 5374, -172, -5529, 768, 5344, -1351, -4718, 2255, 4094, -3141, -3347, 4171, 2820, -4973, -2391, 5477, 2070, -5571, -1773, 5101, 1215, -4309, -420, 3147, -826, -2024, 2346]
382B346j386n057L733O132n543p350O606Q432o784q950O133Q661m918p367L483
397a829N074k272j934J595j711j690N242K594q196m141J0133N968j0790p576J0103
412E70Q492q233q331N693O832k893m127N48L66J005L849j371p894N31J1149J229
428G415j3110l485J3412N602j2081o993R323P197n768n884J997L180J247O58l410
443g00m996M194R130l527j2403J815J4179N54j4173k878J2448M507r305m943N277
458h21L991j121j660k526j752N049N581o185r241N888J2029m446j3415K282J3145
473F798Rj1259j764Q059K554m042k129p0M60L751K119o327n142P634P998p565
489A084j0125O354J1058m456j0595K386Q716o83n814k56K290J74J336P93m451
$$ y = [2346, 960, -4097, -364, 5768, 225, -7125, -519, 7913, 1129, -7821, -1688, 6973, 2055, -5312, -1829, 3245, 973, -961, 634, -1077, -2767, 2475, 5069, -3127, -7268, 2865, 8833, -1957, -9533, 570, 9062, 829, -7502, -1809, 5023, 2130, -1997, -1449, -1083, -78, 3771, 2400, -5494, -4963, 6186, 7415, -5695, -9180, 4232, 9834, -2247, -9240, 83, 7280, 1512, -4372, -2375, 805, 2052, 2710, -700, -5696, -1502, 7628, 4101, -8302, -6487, 7692, 8246, -5927, -8805, 3643, 8150, -1155, -6098, -821, 3170, 2049, 389, -2137, -3889, 1160, 6741, 556, -8685, -2797, 9232, 4786, -8629, -6347, 6798, 6807, -4452, -6216, 1843, 4397, 355, -1774, -1844, -1384, 2367, 4486, -1841, -6983, 651, 8649, 1084, -9041, -2687, 8371, 3915, -6680, -4294, 4422, 3739, -2075, -2331, -41, 133, 1469, 2262, -2189]
504b189k444O684M375p831o131P929P271p102p529N776O775m238n135K924K774
519A909k041n5J754k644j981M889K550o470l256P279L777p351l917O852L511n973
535a167k567M988J196m098M65L407k148k931L659K631m810k312N459J961n732
550a999j405N675N84n410M36N050j608m706K700M397l633m065M243L640m505l015
566c621M479K065m188p95L830p45l482K396L364l985l382N261L598o074l843O282
582A160L957n892l750M993L016l788j732K518j39j434K301P47m515o20O407J044
598D273p762j767Q298K608p921l219O749L320m903k720K809J319p46P71q64l258
614c013J792N694j904p763J312R069k45r408r76Q632J954o898k368M464J993j742
$$ y = [-2189, -4633, 2051, 6426, -1405, -7536, 393, 7664, 562, -6967, -1191, 5584, 1346, -3789, -865, 1909, -132, -187, 1567, -1077, -3058, 1831, 4381, -2089, -5345, 1934, 5711, -1640, -5557, 1295, 4806, -1167, -3734, 1254, 2450, -1648, -1183, 2224, 76, -2855, 804, 3435, -1375, -3687, 1772, 3733, -1999, -3404, 2271, 2855, -2555, -2119, 2931, 1323, -3383, -683, 3714, 81, -3984, 259, 3899, -606, -3621, 858, 2923, -1265, -2060, 1770, 1025, -2457, -61, 3303, -682, -4064, 1197, 4795, -1279, -5122, 1160, 5117, -775, -4525, 468, 3484, -304, -2036, 482, 343, -1091, 1210, 1957, -2558, -3178, 3229, 4273, -3489, -5256, 3042, 5650, -2271, -5490, 1259, 4579, -324, -3044, -235, 1084, 338, 1109, 245, -3013, -1221, 4473, 2569, -5194, -3882, 5187, 4942, -4466, -5442, 3190, 5144, -1754, -4122, 342, 2335, 593]
630E93p48q57j247K901L672m070o092M296Q091l608r297K322R432p89q384n64
646d349O326J382l599j360N44M43K299J205m497l296N732N432n954p167N262Q100
662F503l877q047K284O889p70m846k34K198M96P21Ol376j192N425K702o588m277
679e983O820N519o217o119M963N874l412m810J942K958q20n92K39j880k85M131
695B328Q86n817j750O722K698o833l380O238L610n127l240L784K235k463p42J386
711E35j045p17K817M54m343n52N385P88n850j057N787J135n260r27M434L70l438
728a484M94K505j549j659K634J018l561n57M245K29m602J14M579m85m281R69L780
745B389j609l174K292K547k971j997L531J480l868j025L953N31l754O9L315p77
$$ y = [593, -155, -1012, -2259, 642, 4314, 244, -5848, -1552, 6539, 2931, -6366, -4044, 5388, 4599, -3785, -4349, 1977, 3359, -240, -1600, -1056, -613, 1686, 2891, -1606, -4902, 830, 6262, 308, -6859, -1597, 6503, 2626, -5421, -3137, 3752, 2982, -1864, -2098, 100, 596, 1317, 1323, -2053, -3245, 2180, 4882, -1706, -5983, 837, 6356, 139, -5980, -1017, 4857, 1445, -3365, -1423, 1535, 715, 123, 362, -1518, -1803, 2328, 3214, -2603, -4353, 2369, 5067, -1766, -5146, 1092, 4702, -425, -3665, 119, 2354, -109, -851, 535, -510, -1227, 1590, 2044, -2299, -2851, 2534, 3322, -2528, -3585, 2202, 3337, -1923, -2850, 1584, 1954, -1484, -990, 1515, -34, -1693, 941, 1959, -1602, -2159, 2086, 2315, -2287, -2173, 2406, 1921, -2360, -1391, 2389, 780, -2394, -102, 2445, -526, -2523, 1008, 2488, -1380, -2405, 1548, 2079, -1675, -1606, 1709, 932]
761I32k750J624K161k547j642L488J274m251j085M726J025m850r70M555P95l856
777a371m53K915k11j819J144P70k315O4L552n58m676P05N490n51n793J67N613
794B673K29m849m17L570K82j993K58L51j239J118K474k145l876K681N028k633
810A512n832K138O039j360n595N62M503Mk841j64R20j83J029J031k652k203L753
827F61L484m179m601L968N343l274n453K253M883j208l661L64J858O2J65L4k148
844a449o51L789J634m890k715N270L690m985m298M157M349k975l737J737K521
859A447o69p89Mj137J86K961J31m430q26N341J614n557k354N167K757m290k708
876c152L086K106j816j040P26l77L0J924l76l336L26M433K2n056m78N142Q85m701
$$ y = [932, -1818, -194, 1967, -580, -2222, 1266, 2540, -1711, -2796, 1930, 2955, -1895, -2865, 1690, 2485, -1371, -1824, 1091, 880, -939, 205, 975, -1340, -1276, 2276, 1718, -2958, -2253, 3237, 2686, -3107, -2940, 2673, 2902, -1947, -2364, 1206, 1488, -505, -247, 104, -1135, -17, 2457, 312, -3564, -883, 4145, 1512, -4320, -2182, 3857, 2497, -3098, -2536, 1967, 1971, -870, -1034, -114, -297, 732, 1763, -889, -3092, 661, 4145, -34, -4635, -667, 4676, 1402, -4051, -1798, 3085, 1877, -1784, -1420, 438, 500, 665, 699, -1449, -2100, 1689, 3323, -1567, -4282, 988, 4678, -307, -4605, -448, 3901, 926, -2811, -1074, 1447, 778, -11, -7, -1144, -958, 2003, 2134, -2296, -3122, 2219, 3833, -1724, -4078, 1089, 3846, -444, -3152, -66, 2040, 224, -816, -90, -467, -437, 1487, 1111, -2225, -1899, 2534, 2556, -2500, -2978, 2164, 3049, -1652]
894a652j075L846R44k770m36J639l92o12J420j69k489O15L425q06m062P59M325
911B510o03m191N25L684n65k904P96J991j188j097J756K75k332L62K826p99l146
928b100J055L243j249l086J409K667j600k122J851J502k159q66K467L02k717J68
944a235K836n26k800Q60K558j138k124J465J591j847r81K279M05k730P4L102m09
961A380l350O10L335p12l100P75K586q97j830J083R72j470n5J952p38k518J333
978f44L062j627l458J661L636j489l452J210K913r05k066P56R76q12K03J112j314
995b38j631K183K248k705k868K841L302k627l453K145L184j524k513R35J475n17
1011B37j79L83j178n69K403J022l289j643L770K251l767k700L353K801k611k505
$$ y = [-1652, -2727, 1119, 2063, -707, -1143, 496, 104, -508, 912, 743, -1746, -1131, 2294, 1488, -2574, -1815, 2510, 1907, -2284, -1759, 1925, 1360, -1544, -748, 1243, 55, -1042, 714, 989, -1343, -981, 1845, 1046, -2100, -1045, 2198, 949, -2137, -728, 1939, 339, -1783, 68, 1570, -589, -1455, 1012, 1314, -1403, -1235, 1601, 1075, -1725, -865, 1693, 555, -1569, -104, 1487, -360, -1341, 938, 1343, -1387, -1313, 1789, 1380, -1970, -1360, 1975, 1263, -1837, -1062, 1524, 627, -1203, -120, 852, -618, -673, 1279, 541, -1977, -644, 2418, 791, -2667, -1006, 2630, 1141, -2311, -1101, 1812, 907, -1159, -403, 573, -239, -36, 1076, -238, -1869, 314, 2562, -143, -3011, -170, 3132, 505, -2948, -803, 2381, 857, -1656, -721, 754, 237, 58, 441, -737, -1306, 1097, 2119, -1170, -2813, 957, 3208, -559, -3259, 94, 2895, 284, -2221]
1027b221J749J766r15o64K69o30L4J971j8l103l22L898Q43m234j374M097J763
1044B909l522j847K624J590j630r29O69n4Q7J223n60k364O50L323m55l963N0M173
1062A974L81l926p08L288Q03k365n95J319Q3l28P30m62j644R92K524j190l203
1079b327J121L583q63l615N77L248l55k570K65J710m52p66Q20j30j333Q34J875
1096A622j307k360J498K706j530k773J429K601j268k182J171J560j121q32J206
1111D20J02j400N75J631j097j842J450J981j650j954J690J773j711j396J674R14
1127A160j672l84J715j92j770O80J811j061j807J337J692j503j433J586J074j644
1143d11o02J712P4j789M40J874q76j962J204K000j394j920J424J723j390j348
$$ y = [-2221, -472, 1294, 379, -285, -16, -646, -612, 1359, 1341, -1762, -2084, 1814, 2657, -1577, -2951, 1146, 2909, -613, -2460, 164, 1754, 124, -805, -136, -190, -103, 1120, 560, -1804, -1154, 2169, 1714, -2249, -2199, 1974, 2355, -1571, -2279, 1009, 1812, -553, -1148, 171, 254, -74, 656, 194, -1450, -458, 2066, 876, -2327, -1206, 2377, 1514, -2101, -1524, 1724, 1369, -1201, -936, 774, 322, -444, 376, 246, -1087, -253, 1622, 315, -2045, -547, 2159, 629, -2144, -715, 1886, 618, -1564, -393, 1167, 46, -786, 420, 522, -878, -303, 1328, 231, -1611, -161, 1820, 170, -1784, -94, 1679, -32, -1428, 246, 1160, -512, -896, 819, 627, -1143, -463, 1348, 287, -1520, -183, 1509, 6, -1427, 159, 1233, -411, -1013, 699, 773, -1016, -576, 1298, 422, -1540, -336, 1664, 270, -1650, -226, 1497, 107, -1241]
1159a241J320Q16j238j87J229m66j329J102J472j576j667J889J817j971j902J880
1175e2J785j623j463J303R19r97k22P67n80o97J371P60k027r80K499J221k660
1192f76j439K569J500k201j382J694J017j111l93N85l68k23J235N1k024r8K659
1209A395K93l005n95L045Q43k771r97K220R19j529n84P64Lr6P37l89j521O19K263
1228A614o05k804M02L075r1l003j83K612L66j961l33J168P7l60M19l85j045R12
1246a25J699j173k275J190K662j020k783P29K599m46k145K55J453k20o56L75j27
1263hp21Q35J131j305j588J568J959j590k178J439K178j185j926R12J442o98q04
1280e39O04Q8o54N98Q20j149j069J550J305j733j460J738J486j599j346J396J025
$$ y = [-1241, 79, 895, -343, -530, 699, 233, -1096, 6, 1478, -98, -1765, 124, 1941, -30, -1932, -52, 1733, 110, -1353, -50, 869, -128, -350, 417, -163, -860, 511, 1271, -756, -1736, 763, 1984, -676, -2115, 454, 1954, -247, -1629, 65, 1082, -29, -422, 163, -205, -428, 807, 858, -1166, -1264, 1395, 1688, -1317, -1912, 1133, 1976, -795, -1792, 428, 1347, -182, -766, -2, 1, -95, 642, 253, -1268, -649, 1614, 1009, -1795, -1393, 1682, 1591, -1412, -1595, 1017, 1383, -578, -911, 257, 334, -26, 393, 8, -1037, -125, 1574, 401, -1874, -684, 1978, 958, -1825, -1096, 1503, 1057, -1088, -833, 620, 400, -256, 119, -8, -729, 106, 1237, -68, -1656, -88, 1871, 281, -1897, -458, 1720, 535, -1391, -479, 963, 265, -539, 65, 153, -501, 97, 917, -232, -1301, 249, 1554, -179, -1639, 99, 1585, -14, -1360, 36, 1061]
1297A061j182n48R82K3q99N43Q55j033q98J422R13j639r23J718Q52j675o87J548
1315D33M13j377n1J208l49j073P47R70j067q90J333P84j454o73J502N10j449k50
1333g33J327n8j205M19J072p87r88J105R07j336q59J466P59j475o23J378M03j230
1351d58o4J007k93q45P44P11j175o16J510O16j733o26J816O15j713n51J493L96
1369H34j169j25Q07k67m84P54K07j228p5J642N3j952j17K066K27j991l04J730
1387F08L06j325j89Q35q5l32M82r0r62L72J457n14j832M81K079l51k109J74J919
1406I24k7j538k9J007m6m05K77j44o57O23J078r31j481J037J828j003j967Q00
1424f54J936n75j662L41J209k18o22K15j8l68N85O44j049r79J327J290j394j526
$$ y = [1061, -121, -669, 313, 336, -563, -20, 835, -198, -1096, 326, 1239, -400, -1323, 395, 1247, -428, -1115, 433, 846, -531, -582, 626, 277, -796, -49, 921, -146, -1036, 297, 1081, -373, -1046, 456, 966, -483, -733, 594, 536, -669, -250, 822, 35, -953, 152, 1059, -277, -1136, 330, 1089, -386, -1009, 369, 772, -458, -522, 485, 192, -653, 91, 802, -373, -989, 521, 1137, -596, -1222, 594, 1209, -504, -1055, 438, 834, -335, -460, 347, 80, -404, 350, 557, -671, -746, 896, 949, -1003, -1120, 946, 1173, -818, -1122, 608, 914, -411, -600, 235, 150, -182, 300, 210, -752, -380, 1077, 563, -1269, -788, 1291, 940, -1169, -995, 924, 897, -641, -670, 337, 291, -114, 163, 19, -638, -15, 1063, 132, -1349, -312, 1516, 513, -1454, -654, 1282, 707, -955, -614, 595, 377, -245, -30, -48, -416, 169, 813, -236, -1215, 112, 1402, 8, -1518]
1442a518J307J614j089j500Q11J201n48p22L75J70l22M19M04r34n69J319P76j522
1460c28r93J567J084j441j086J207R28r52n92O52J82m75L15L64p85l57J184L99
1478H73j438n02J591N59j546n68J403M68j150k74Q87Lo37L46M34p11k90J033K34
1497G15j285k10J402J95j408j57J294O7j114Q9Q99l19o69N54M75q17l10J017K01
1516F19j163r9J201L8j185P9J067k10r04L96P03n99n15Q20L45j022k10J156J26
1535F43j210o1J195l7j059J42Q68k79o49M89M18p27j97R50N0j158N3J280q8j322
1555f99Q5J231r0j060J38P94k46m75M01J73o46J09Q95l09j116L94J318m15j383
1574i01L67J329k79j129K08Q56k13m65K82P4m56L02O59n77r17P60J143q39j274
$$ y = [-1518, -211, 1403, 314, -1186, -375, 826, 278, -444, -69, 101, -221, 198, 602, -332, -901, 418, 1194, -328, -1321, 246, 1330, -111, -1197, 10, 938, -14, -606, 46, 228, -247, 68, 432, -353, -710, 474, 873, -565, -1067, 524, 1083, -463, -1031, 372, 840, -310, -584, 303, 306, -331, 15, 449, -262, -552, 481, 715, -570, -780, 622, 817, -591, -748, 546, 613, -501, -412, 487, 168, -501, 53, 528, -289, -599, 418, 619, -544, -643, 558, 596, -589, -510, 557, 347, -557, -161, 542, -57, -572, 248, 593, -429, -639, 517, 643, -567, -628, 567, 530, -529, -387, 481, 202, -447, 42, 460, -267, -464, 486, 536, -622, -569, 711, 623, -699, -614, 617, 527, -533, -395, 399, 153, -322, 79, 252, -394, -285, 610, 301, -815, -421, 897, 482, -901, -534, 795, 516, -613, -405, 451, 238, -227, 55, 129, -327, -25, 634, 57, -860, -100, 1043, 204, -1070]
1593a070P64J298o48j168M54R14l09n55K49J18k76L21M01o95n90R76Q01j089r91
1612a095J081J103r63j056P52Q96n23o06L23K32k21J92K29o38k87R57M40j193
1630c77o09J286P20j215p64J014P28p97n35N25K67l06J06J56n04r8Q62J30j143
1649e54k05J291K96j294l80J187L86r80l01P07J41m35J24K00m15m6P12k9r63M5
1669e13J138j1j186m6J141M6r77k8P75q2n15K27K68m25q0O23o7q17J53R51j86
1690C89j013K06R76k14q54K38O66k95m57M09K44n29m2O67j08p72K24Q41k80q53
1710e57L21P83l44o60L60M98m33l07N24J14o39O0P18j82p98K66Q02l05p68L34
1730b13O49l36n01L93K96m42q4N18q1o42K55P38l43q07L96Q13m07p47L75O21l54
$$ y = [-1070, -306, 992, 344, -824, -370, 544, 235, -320, -71, 47, -229, 92, 493, -202, -792, 184, 985, -104, -1095, -14, 1089, 126, -930, -178, 718, 195, -411, -88, 144, -77, 115, 344, -294, -581, 376, 816, -377, -986, 300, 1020, -195, -959, 55, 783, -14, -549, -24, 243, -63, 43, 199, -305, -403, 459, 589, -554, -759, 532, 828, -466, -846, 341, 727, -253, -554, 153, 294, -141, -17, 183, -232, -278, 434, 405, -558, -513, 625, 614, -572, -618, 523, 569, -408, -436, 339, 257, -258, -31, 237, -188, -268, 355, 288, -529, -376, 575, 389, -624, -418, 558, 344, -510, -272, 394, 99, -358, 51, 295, -234, -276, 391, 283, -489, -265, 576, 296, -557, -236, 547, 203, -457, -97, 401, -32, -339, 185, 299, -340, -280, 438, 256, -542, -276, 526, 221, -547, -213, 436, 100, -401, -8, 288, -154, -238, 280, 199, -443, -188, 550, 207, -600, -204, 609, 202, -545, -170, 451, 97]
1751I7m27L35J94l61N0M45k97n37M71O52o04p23O33P64n87p36N09O02m01m16L17
1772b0J71k85J23K86l93l44O14M45p64n48Q25O16p82o21O50N86n14m35L60K22
1792A92k29N9J47l47j41O18J93q21k79R41L59r39m42Q44M46o92l68M81K07k82
1812e3J3J14k82j0N58k6p87nR31R3r98j48R44K14p92k21N83J65l55JJ49k16M0
1835h8M22j24o52J69Q11j61r01Q9Q99l1q24lO52jm36N8K08j84j7L55j63n09K62
1858a69O65k99p53K98P84k62p22K17N94j84m08J93K13k49k4L66j88m30K95N29
1878D66l67o00L89O18l87n65L32M77l15l32L08J62l30J7L67j71m21K98M63l77
1898C2m91M12M81m07m32L93L25l75j87L61M7l69J22L71k44m12L62M21m13m13M22
$$ y = [97, -330, 5, 199, -162, -112, 333, 36, -501, -30, 622, 18, -705, -72, 692, 105, -631, -122, 480, 79, -337, -20, 151, -134, -11, 275, -118, -462, 152, 597, -167, -715, 110, 726, -56, -677, -27, 559, 45, -390, -30, 192, -37, 22, 169, -178, -319, 299, 492, -329, -608, 333, 692, -247, -689, 155, 601, -91, -459, 22, 229, -53, -40, 74, -208, -218, 340, 314, -473, -478, 453, 546, -452, -600, 344, 558, -234, -455, 128, 293, -62, -61, 88, -128, -88, 334, 210, -442, -273, 538, 377, -524, -435, 464, 433, -391, -394, 258, 257, -179, -121, 87, -97, -114, 241, 78, -431, -169, 496, 197, -556, -258, 526, 264, -458, -241, 353, 169, -239, -46, 167, -82, -106, 260, 72, -358, -63, 466, 99, -501, -112, 506, 119, -446, -114, 363, 48, -284, 24, 186, -144, -127, 240, 69, -352, -54, 409, 32, -459, -47, 434, 27, -405, -12, 313, -62, -249, 112, 159, -210, -88, 283, 39, -373, -11, 410, -3, -416, 6]
1919FM07m29l17L90K17l65n5L24j08l30K63L31l71l72M56L83m88l91M79L45m32
1940e7k75L57J72l03pK59j57k44L40K50m73k62N60K96n93l05N54L10m74k50L60
1961E8J55k59mJ64j63j22L40J02n20j01O16J35o61j85O42K07n55k08M33J29k87
1982h4jJ38j47j3L15m5m83P6O10m9o73mO96M9o22p1M76P6l22k0J52j04PK34j20
2007G1l81J79N25k09o17J79O59j26o25O7N10k3l70L5J92r3j1J76j33l01K61M06
2029C71l12n05L20N57k79n49K24M90j76l50J17K21j26l6J69j44k25K71L04l59
2049a7l79L96M30l85m40L39L85k76l04K18J74j82l1J73j23j98K53K36l42k82M03
2070D8L03m05l21L91K88l34k08K83J05k23J8J95j31j98K62J93l51j97L89K26m17
$$ y = [6, 413, -16, -333, 57, 274, -91, -146, 178, 70, -260, 3, 334, -37, -409, 47, 430, -58, -449, 30, 375, -57, -332, 25, 197, -106, -113, 146, -11, -255, 85, 335, -138, -400, 160, 456, -137, -442, 112, 422, -52, -302, 58, 213, -46, -50, 114, -49, -171, 169, 271, -249, -350, 266, 401, -260, -445, 197, 404, -151, -359, 74, 203, -84, -85, 53, -94, -107, 208, 163, -320, -244, 366, 317, -356, -360, 336, 385, -237, -308, 168, 244, -78, -98, 54, -50, -43, 191, 71, -310, -131, 394, 185, -432, -253, 406, 280, -345, -278, 232, 209, -161, -126, 66, -27, -38, 138, 5, -296, -35, 371, 59, -446, -126, 431, 152, -397, -173, 317, 141, -209, -92, 129, 3, -33, 136, -8, -233, 38, 342, -17, -396, 0, 430, 45, -395, -56, 329, 53, -251, -33, 141, -41, -72, 101, -22, -220, 33, 269, -73, -355, 48, 351, -54, -375, 16, 304, -30, -238, 45, 150, -73, -55, 140, 9, -189, 73, 266, -85, -282, 107, 333, -84]
2091h4k13L99J50l46r4K83lk31J00J94k16j65L01J56l74j53M04J56l95j37L66
2112I8J11l11l5K49o4j82J57J47k46j23L52R6m05j05M23J05m01q4L39O3k88kK11
2135A05r9j25J81P2k88l7L81J4m37j4M42M4m30m4L62K4k65LJ75q2o8J73mk80P2
2160a25L67r3m34R3M64p1m51M5L93j3k96L2J68o6m2J38o9k21J50L07k04l73J92
2183a09M25j82m32J32L76q0l07O3J87p4m3R4p7j48J88K24k54k89K84L48k85l56
2205c15K25L65j81k81J27J93r7n5Q5p4j08J86J44k84k02L41K34l40k72L10K68
2226B69k69k36K05J64j47o4J03n6p9J74P8k60j12L42J62l72j83L51J96l01j65
2247b00K33J16j75k7J08o6p2J71M5k51o2L27O8l54q2L49P9l06q1K52L6j86K5J14
$$ y = [-84, -297, 102, 252, -94, -188, 95, 92, -139, -39, 155, -61, -226, 75, 231, -143, -296, 108, 264, -131, -268, 98, 209, -102, -137, 112, 48, -134, 23, 170, -76, -199, 153, 249, -156, -261, 162, 267, -134, -218, 121, 184, -104, -106, 105, 6, -119, 62, 134, -154, -191, 190, 204, -233, -247, 195, 239, -191, -235, 127, 151, -114, -111, 64, -18, -86, 87, 83, -197, -125, 242, 149, -285, -192, 272, 201, -250, -205, 188, 175, -121, -89, 79, 13, -29, 109, 40, -181, -31, 276, 72, -301, -109, 316, 134, -298, -166, 210, 130, -177, -114, 73, -1, -44, 50, -27, -175, 13, 237, -17, -306, -22, 326, 41, -315, -90, 275, 94, -187, -60, 133, 36, -19, 66, -8, -116, 70, 214, -70, -272, 69, 303, -37, -309, 1, 269, 0, -236, -31, 133, -14, -78, 25, -31, -110, 64, 142, -118, -230, 112, 274, -98, -281, 70, 266, -35, -200, 33, 149, -26, -53, 55, -11, -83, 88, 133, -118, -180, 147, 215, -139, -221, 128, 207, -99, -180, 72, 108, -78, -53, 61]
2271F1q6p3J72K9k46j5L00K6l31j9L25J5k93oK53k8j73N8J15j27l6J86Lk38MK94
2297A70j5l12K1K93k4k52J8K05n3j34Q7P4j55pK00l8k47N5K81p3k90O5K81o4k33
2322a47P3J61o8r6J15J6j46M7K02j04k29J21K78j32k70J12K62r9k17P6J63q4p6
2345d2R2k8j15Q8J65j63k06J74K48j83k61J57K59j23k34J09J54p6p5P9k5p8J08
2368B4J16j81j41K21J92k45k10K26K24j94j98J39J56j16n8O6j7o5J16N4j84q2
2390a57K46J06k73j42K68J63k39j54J80J13j15o9P3j4m0J00K3j66l1K36M6k71
2412a17o9K80R9k65r6K20P8j56l6Q7j3l9Q7Rj71L1K15k4k60J5K64Ok61k0K13K3
2438A00j63j4J01l1k9O8j0j31L9J92l8k39M7K44l0k39L2K13k8j60L2J07n8l0Q4
$$ y = [61, -25, -98, 74, 103, -143, -158, 142, 168, -163, -182, 143, 158, -135, -141, 112, 84, -89, -31, 84, -43, -79, 107, 110, -128, -124, 170, 155, -157, -136, 157, 133, -119, -101, 104, 51, -83, 4, 78, -77, -84, 116, 78, -169, -114, 167, 94, -196, -131, 150, 86, -147, -74, 87, 19, -77, 38, 54, -92, -45, 157, 53, -176, -55, 223, 91, -179, -67, 195, 96, -121, -45, 118, 34, -42, 50, 22, -93, -5, 160, -3, -209, -35, 213, 30, -231, -74, 185, 62, -172, -63, 91, 15, -60, 19, -6, -84, 24, 140, -41, -182, 39, 231, -14, -224, 2, 226, 32, -166, -27, 129, 13, -45, 21, 4, -61, 55, 109, -75, -157, 89, 195, -78, -220, 48, 211, -28, -182, -2, 111, -4, -73, 0, -14, -54, 46, 69, -97, -128, 108, 154, -117, -186, 94, 193, -72, -168, 52, 130, -26, -62, 25, 12, -27, 60, 69, -102, -71, 144, 120, -140, -125, 139, 145, -116, -136, 77, 100, -63, -77, 24, -7, -36, 32, 22, -109, -70, 122, 84, -155, -108, 136, 106, -133, -101, 112, 84, -76, -44, 63, 5, -25, 59]
2463E9j4j21N0J65q2j87P4K10q0k07O1J77m9j49N9O9o5k3R7l8j14O3J61r1j77
2488a52R6J99r6j92J04J47q5r6Q3L9p5J2J00p1j16J16J31j36j48J36J67j34j45
2511a16J06J20q8p9N7K7o9L4P1q7r4J35J16j68j25J54J45j50j24J19J09r1o5P7
2535A4Ro6O4M5j03o3J46R7j83r9J83J05j67j11J60Q4j12o3Q6jm6N2L0j17k1J57
2561H0L1j96o2K02P3j87q2J61P6j30n6Q7J1l2M0Mq3RJ48j2j82QJ96K9j97m4J77
2588F9M1j34l2Q7J1m4L2nq0K2J32n5j68N6J77l6j89QJ77Mj52%R5km7L9j2o3M9
2617b0J12o7j43P8J74p1j68N9J50l5j32L5R1l3m4M1k3m4M9Q2r2j05R5J25j00j24
2643a10P6J37q3j09N9P7m3m6M3nn3O0O6r4r1J18J06j16j10J07J06q2q9N8N8m5
$$ y = [59, 45, -76, -26, 139, 57, -130, -56, 154, 74, -133, -72, 105, 56, -93, -34, 35, -30, -53, 44, 6, -108, -45, 116, 25, -152, -56, 143, 47, -145, -41, 106, 21, -75, 8, 47, -28, -16, 84, 13, -103, 13, 144, 8, -140, -4, 163, 29, -116, -10, 110, 22, -57, 0, 27, -42, -8, 63, -24, -118, 17, 133, -35, -160, -6, 139, -11, -135, -16, 93, 2, -63, 14, 23, -43, 21, 66, -37, -100, 46, 143, -40, -139, 44, 149, -18, -129, 31, 115, 3, -60, 26, 25, -21, 31, 61, -56, -77, 80, 111, -85, -147, 55, 128, -59, -141, 20, 96, -34, -90, -3, 8, -24, 16, 20, -63, -54, 94, 82, -100, -92, 104, 133, -64, -108, 69, 110, -24, -56, 31, 42, -2, 30, 25, -55, -33, 99, 44, -124, -68, 109, 73, -116, -108, 69, 73, -79, -79, 16, 14, -33, 6, -6, -69, -20, 92, 25, -118, -40, 134, 63, -105, -46, 104, 69, -63, -28, 63, 30, -14, 27, 4, -40, 9, 91, -1, -106, -11, 114, 14, -110, -34, 103, 20, -89, -30, 47, 4, -42, 1, -4, -57, 3, 69, -25, -116, 2, 108, -8, -118, -11, 95, 13, -76, -18, 40, -5]
2669ej3N3k2n3O8O0j14n3J01R6j24j02J33O4q5p0M9N2n5KM1m4k7O8L6j01o0J30
2697B5N5j18p6J32N1r7n0R4K6o3QM0m3rP6J6j06k6J30L7j43m2J38L0r8m7P9J4
2725C3m0J2J1o1QQ0j2j27K0J38Lj42oJ22J5r7k3Q3J1m6K2Nl6J9P1k7j06M3J27
2754A00l0j40OJ37Pj21lP9km5J2Ok8K4N6n1r6O1J17n9j30M2J25k7j03QP8Jm5N
2784a6J8l7M0N2p7o5P9R2p1j00P4J06n6j06M9O3j9m2K9Mk5K7L3o2m3P0P1r4q8
2813i4R5P3p3p5M7P4m3m7K4Ok3L8K2n6l2R4L7q9n4J00P4r6n8O6N2l8l9K3Rj5L1
2844C3J7o3k0P2K0p6m7R1M3r5l9P1J8m0k7L1jk0L3J0o2QQ3j0q1j1R2L0r2l1R7
2875C4J7o5kL2rj9N0j8n2J9P1j0q7%Q5qq0lP0On0j6L8j5jL3j0p2M3O1k4q6J9J00
$$ y = [-5, -18, 35, 13, -40, 28, 88, -26, -79, 22, 118, -6, -108, 25, 89, 4, -66, -17, 35, -20, -18, 23, -21, -48, 20, 56, -45, -105, 25, 80, -38, -114, 18, 69, -28, -78, 16, 42, -21, -13, 27, -16, -25, 51, 67, -39, -65, 65, 102, -41, -83, 55, 85, -13, -60, 19, 33, -7, 5, 16, -45, -37, 43, 31, -96, -76, 62, 65, -77, -83, 39, 54, -43, -66, 17, 28, -18, 4, 9, -27, -8, 63, 36, -70, -27, 100, 70, -70, -64, 73, 80, -41, -44, 35, 33, -12, 0, 6, -22, 2, 58, 7, -89, -28, 89, 30, -100, -58, 67, 40, -63, -55, 23, 24, -21, -16, 2, -35, 5, 57, -20, -85, -6, 86, 15, -85, -11, 95, 39, -67, -18, 45, 26, -16, 13, 17, -8, 19, 52, -10, -53, 17, 88, -6, -94, 1, 74, 1, -74, -27, 47, 4, -43, -19, -13, -36, 2, 24, -32, -64, 30, 67, -22, -76, 24, 98, 2, -56, 10, 62, 24, -15, 8, 17, 2, 33, 50, -13, -33, 39, 59, -17, -64, 27, 70, -25, -64, 7, 25, -15, -42, -11, -12, -32, 1, 11, -51, -43, 40, 30, -51, -62, 30, 60, -32, -63, 34, 51, -14, -16, 16, 7, -12, 38, 20, -32, -13, 58, 48, -39, -39, 46, 38, -42, -45, 25, 31, -19, -35, 3, -12, -13, 20, 10, -62, -19, 42, 18, -68, -49, 51]
2909E1k8o9MO4On0OK2j5RK6j4m4M2O0l2q6L5R0l7q0QP8j7l9NJ4nPOk7m0M8N2n5
2944eo6N0P8m8p4L2P1k5m0NL1j2K4Jl1j4N2L3o9m2O0O4m9p0N9L4k1l9J2J3Pj1
2976A0Ml1rN7On7m5P0L8n7n4O0N1n0k9K3K1j6J9kk5oN7pn8mO8K2p2j9O0M1n2k3
3010iK2J8k3lRk7oM7Jo8kO7J1p2j2N2K6n7mNL4j3jrrMM9k7n1K0O8j8n6MN2J8m8
3047hqL7knQql0K0L3j3o1K1O6k3n6kO2rm6PK5nk6J8pj7J3M0l3m9L3N7k0n3J3N8
3083C0%m0%K7LjnqrJ7L6m8m1M3N4m2n7K3N8k8m2J8J3llnjj3K9J1m2l0N0L4l4m4
3119e0L3N6k8l7J5L1j7Kmj5J0L0Mm7j3N0K9m6l5M3K9k8l3K4PK%j0j1kK6j2l0j2
3153c9N2J9m9j9L9K0k9l2K8J9k2RPj0mL3qm5J7N3ll9j9M9J4m0j2K5J9l0J%rJ4
$$ y = [51, 23, -46, -42, 22, 28, -22, -16, 6, -9, 0, 26, 12, -32, 10, 70, 38, -48, -13, 77, 40, -40, -32, 46, 29, -10, -5, 9, 4, 11, 17, -10, -50, -2, 50, -5, -71, -21, 57, 9, -65, -33, 38, 13, -27, -22, 9, -3, 21, 22, -9, -23, 29, 62, -7, -49, 11, 75, 26, -44, 15, 49, 28, -11, 1, 14, 21, 10, 14, -17, -26, 31, 37, -20, -65, 5, 43, -14, -68, -8, 43, -7, -36, -13, 8, -8, 11, 9, -16, -22, 35, 28, -30, -34, 34, 56, -16, -35, 25, 66, 14, -9, 13, 31, 8, 5, 14, -13, -19, 28, 29, -39, -41, 26, 37, -35, -47, 5, 31, -26, -30, -25, 9, -4, -5, -14, -23, -19, 30, 3, -48, -28, 40, 22, -34, -30, 22, 40, -8, -16, 21, 19, 14, 22, 14, -16, 4, 37, 24, -37, -16, 50, 27, -29, -31, 31, 22, -24, -17, 8, 3, -23, -5, -12, -29, -16, 24, -9, -58, -25, 32, 12, -41, -28, 30, 30, -10, -10, 17, 20, 19, 14, 6, -3, 14, 50, 2, -39, 4, 58, 16, -41, -18, 40, 12, -30, -12, 1, -2, -5, -10, -11, -24, 5, 16, -26, -56, -6, 28, -6, -50, -17, 39, 11, -26, -11, 20, 3, 5, 1, -14, -4, 26, 30, -17, -30, 20, 49, 3, -32, 11, 40, 12, -21, 3, 10, 12, 12, 2, -9, -11, 15, 3, -27, -39, 13, 32, -17, -36, 3, 23, -6, -38, -10, 9, -13, -4, 3, -7, -11, 22, 14, -31, -14, 39, 36, -3, -22, 27, 41, 1, -11, 14, 33, 3, 4, 4, -5, 9]
3187IJ5j3m2J8L0mm0j3N0Pm6mK2J6j7lK%J5J9j8k7K8L7j5n5J1M9km3J2K6Rj7j1
3222EJ1j6K0Nj9l0K3L1k3n1L2K9lm2LK6Rk2lO%jK6k6k3M3K1k5l9L5L2k0k7J6K9
3257C2jk0lK%KJ0k7j5L2K9l4k9J7K9k0l2J1K7qj9LKMLJ6j4j3J9J7m0nK0K8k7k1
3293b5K3K0oj6LNJ1Qnk1J1K5jm1kL9Mk9j1OJ5j5nLljQnj9LL2j1l5PL0J8m5nK3
3332gK1qk1J5KJ2Qj0l3L8J7j1l1JM2qk2rK2Loj3MpMJj7l%L1j9k5OM2j1m2QK3J0
3371Gj2oRMnJ6j3rJ3K5k6j9J7L5j8l7K4J8j2j0Rj%Lmj7j0K5J2k6j3J1L1k5k2P
3407a9J6Oj5LJ1oJMj6LJ6J2l1KK2K4k6j7J8J0kjLj0LNmj1mJ4J3l1j2K8K0l5k2
3444b8J9J6qj8jPJ1%j8JJ7J2jk4%L5lj5j0RK8rj1JQOnrj0J1Qlk2kL2j1k8lJ7J1
$$ y = [9, 24, 11, -31, -13, 17, 13, -27, -40, 10, 17, -29, -33, -11, 5, -12, -15, -13, -13, 2, 21, 3, -24, 4, 41, 26, -29, -18, 31, 29, -14, -2, 24, 33, 16, 5, 16, 0, 20, 25, 6, -24, -1, 30, 7, -44, -12, 17, 14, -28, -25, 1, 10, -12, -15, -9, -9, -10, 16, -10, -33, 10, 31, 6, -33, 2, 34, 14, -13, 3, 32, 31, 11, 8, 10, 10, 12, 22, -5, -20, 12, 41, 7, -22, -5, 24, 4, -28, -17, 10, 2, -17, -14, -12, -8, -5, 11, -3, -16, 3, 20, -20, -25, -5, 23, -4, -25, -2, 18, 12, -4, -1, 4, 15, 23, 18, -3, 8, 33, 32, -9, -11, 28, 32, 3, -8, -2, 13, -2, -7, -4, -7, -8, 0, -5, -24, -21, 11, 0, -35, -28, 2, 20, -25, -30, -7, 14, 6, -15, 0, 2, 14, 22, 12, -21, 17, 34, 23, -8, -7, 35, 27, 5, -4, 18, 21, 15, 2, 6, -1, 3, 4, -13, -16, -16, 15, -4, -29, -23, 19, 8, -34, -26, -3, 7, -5, -11, -2, 2, -3, 13, 0, -9, 4, 29, 3, -16, 1, 36, 18, -19, 5, 23, 11, 1, 10, 9, 9, 12, 8, -9, -19, 6, 18, -8, -21, -10, 21, -4, -26, -19, -3, 3, -12, -9, 2, -4, -3, 1, -15, -12, 4, 16, -15, -13, 9, 33, 7, -10, 8, 18, 16, 15, 18, 8, 11, 16, 12, 1, -3, 11, 24, -7, -19, 9, 29, -6, -28, -9, 7, -1, -19, -20, -13, -2, -2, -20, -19, -2, 10, 9, -15, -15, 20, 17, 2, -8, 1, 29, 20, 9, 10, 18, 24, 19, 10, 0, 11, 19, 16, -6, -8, 24, 13, -15, -18, -1, 10]
3484A0qj3LKJ3j9%OoJ3Jj9PK7j8onJ3J9j6mJ0%J0J0k3oJ2J9j6k5K6J4j0k5MK1
3521B1pj9PqJ5Jorj5K5nj2mJ1J3j2k7K2J5Mk5RQRk%j4J1J4Lj7j8K8J3j3k3J5K1
3559B9j4j5mOLKj2lMPOk7lJ2K4l2lQJ9j6rPQOp%j1RK5j0mj3L3nnk0K2Qj0ljjK
3602A2j3NllK5j7j4qK2nj7%PMorJ0J0kJ%j2K1Lok0J2K8rj4nJ3J6j0j4PjJ4j6l
3642CJNOk1JRRmk1MJ7jj7mJ2POk0%MQJmj9J3J3qj2J1J7qj0lK1J1j3KnoJ7Kj6j2
3685dK1Npk1J7p%pj2J1Rj7KkJJ5pj3mJ2J0j2jMK2j0mpJ3MJqQmPlj1KMJ0j4mJ4
3728A3jpj3lJ2Qj0k1J0PMj3qJ2J3pj5jJ9J0j1rOJ2jnJ0j0J7pjj9J4J4roj3K7J1
3767B9j2j9PJ0pj3ljJ1ponROlj3MQOl1J2%RNmj0J6JJmJNRqMKQKokPj0Qj1QpJ1
$$ y = [10, 2, -11, -8, -6, 7, -12, -12, -6, -12, 1, 2, -17, -10, 17, -1, -7, -12, 1, 20, 4, 0, 10, 10, 20, 30, 7, 1, 13, 32, 16, -9, 17, 31, 21, -4, 0, 21, 14, -5, 2, -6, 9, 10, 4, -5, -20, 5, 0, -12, -16, -5, 8, -4, -31, -9, 6, 10, -15, -6, 2, 11, 9, 9, -5, 6, 20, 23, 6, -12, 16, 29, 16, -7, 8, 29, 15, 0, -4, 2, 5, 7, -5, -8, -4, 3, 9, -18, -21, -9, 15, -17, -20, -12, 7, -9, -18, -11, -3, 3, -4, -4, -15, -6, 19, 9, 5, -8, 25, 20, 15, -5, 17, 25, 15, 12, 11, 10, 12, -1, 4, 1, -2, 23, 6, -8, -16, 6, 1, -16, -16, -9, -5, -11, -20, -10, 0, -2, -1, -1, -13, 8, 11, 5, -15, -3, 25, 16, 2, -3, 10, 26, 16, 2, 9, 8, 22, 6, 3, 4, 9, 15, -6, -5, 4, 13, 9, -12, -8, 9, 8, -9, -13, -1, 6, 12, -8, -8, -4, 4, 5, 1, -18, -5, 8, 0, -12, -1, 16, 8, -2, -5, 16, 27, 14, 16, 11, 5, 22, 24, 8, -4, 17, 22, 15, -6, 11, 4, 4, -3, -15, -4, 5, -12, -10, -12, -11, 4, -3, -16, -20, -8, 2, -10, -11, -7, 15, 5, 1, -6, 7, 11, 12, 4, 12, 8, 15, 12, 1, 3, 7, 17, 3, -1, 13, 12, 5, -8, -11, 1, 9, -1, -22, -12, -5, -1, -14, -22, -10, 3, -4, -19, -20, -1, 9, -2, -11, -5, 7, 6, 1, 11, 1, 18, 11, 10, -9, 5, 19, 10, 4, -9, 18, 29, 17, -2, 5, 15, 8, -5, -8, -9, 2, -5, -11, -16, -7, -1, -4, -17, -13, -5, 1, -30, -18, -18, -9, -4, -8, -18, -2, -1, 0, -4, -3, 2, 11, 3, 7, 9, 17, 19, 13, 11, 18, 8, 16, 5, 13, 6, 17]
3814A7nqpMQj8oJ0%jqqJ2LorJ7lmK%%MOJj1J7J6j9KJjJJ2lj4J6Lj7kPknj0kLJ0
3861Coj4NLOj3olJ8Mj0qQRLj2%J5M%lMLJnjJ2nJooMQ%j6J1Jjj4qJ2Oj2pNJQkp
3910a0nPJ3j2j1JK4nj2JQO%j1LJ6Noj5jJ4J0nj2nK2j5LkNMrj2rJ9nkomK0j2oj1
3953b2J8jmmjJ4oKj0J6nJ1ljJ1Ooj2QKJ1j8OkmJ1qoqJ0mnj1QJkJLjLj5kQJM%j
4000gmJ5jlkJJ5Kj8PRjl%%LKqjNmMppLJ3prlKMkj2lJ9n%j4KPJLj1J2J7oj4RPJ
4050A1j4J5rRJj3ROOj0PmmMmnPnJ0j1rmJ0lj2LJ1Jk0jMoJ6oKOKpLj0K2OoNoPQ
4097B2oj0QqLo%J1rKj2%OKnjoOPkk1J4Rj1KmPOoqJ5%MopKJ1Lnj3J0J1kkj2J0L
4144A2OplJ4rj9PlRkj1Q%nKj7lJ0JjpRJ0npOJ1mmRj4J4J1j1jJ0kMmmKLPj2rJ0
$$ y = [17, 12, 4, -3, 1, 9, -9, -15, -5, -5, -6, -14, -22, -10, -7, -13, -22, -5, -8, -12, -10, -10, -10, -6, 0, 1, -10, 7, 23, 4, 6, 7, 6, 7, 19, 16, 2, 18, 21, 4, 2, 9, 7, 2, -8, -10, -7, 3, -3, -17, -12, -9, -3, -16, -22, -25, -7, -3, -13, -21, -13, -4, -1, -13, -13, 2, 6, 6, 3, 7, 10, 11, 6, 5, 17, 12, 13, 7, 1, 5, 13, 13, -3, 8, 9, 8, -6, -14, -2, 4, -8, -15, -10, -9, -1, -3, -10, -15, -8, 5, -7, -18, -17, 7, 2, -10, -9, -1, 5, 5, -6, -3, 13, 18, 12, -3, -4, 10, 20, 15, 3, -2, 20, 5, 8, 6, 11, 15, 6, -6, -15, 4, -1, -3, -9, -13, 7, -5, -11, -22, -4, -5, -9, -13, -14, 0, -6, -4, -14, 2, -3, 8, 5, 4, 15, 21, 15, 3, 11, 13, 24, 6, 12, 10, 6, 17, 9, 3, -5, 5, 1, -4, -15, -7, -6, -8, -7, -4, -5, -2, -17, -19, -11, -10, -6, -6, -7, -11, 4, 3, 0, -2, -1, 14, 16, -2, 5, 14, 13, 10, 10, 10, 13, 15, 7, 6, 11, 7, 11, 4, -3, 0, 13, 6, -3, -6, -4, 0, -2, -14, -17, 2, -3, -3, -17, -15, -8, -7, -4, -15, -3, 14, 8, -6, 3, 10, 11, -3, 12, 3, 12, 13, 0, 9, 15, 21, 11, 18, 14, 10, 14, 10, 5, 12, 7, 17, 6, -3, -7, 3, 0, -12, -9, 2, 3, -17, -18, -14, -20, -4, -10, -8, -2, 0, -7, -4, -14, 8, 14, 8, 13, 7, 14, 22, 16, 6, 14, 6, 9, 3, 3, 14, 5, 7, -5, -5, 1, 3, -2, -3, -9, -3, 4, 2, -19, -5, 4, -7, -5, -9, -2, 4, -2, -10, 5, 5, 9, 3, -4, -2, 9, 12, 7, -6, 4, 15, 13, 11, -1, 9, 12, 18, 11, 8, 22, 13, -6, 1, -2, 7, 5, -6, 2, 2, -3, -1, -18, -21, -11, -10, -11, -18, -9, 1, -4, -11, -5, 6, 2, -2, 7, -7, 7, 18, 7, 6, 16, 14, 18, 14, 10, 12, 15, 22, 10, 1, 11]
4190A1Lj1rR%Nj0moJ4nj2llJ6ok%OlJ3j0jORj5J1KLRpKnJ2Oj8ONnkoJKPj2j0M
4237cJpPj1%Lkj7J4OmNnJJ6oj1MJ7lNpJ%Rl%rOJ1jj5K1j6nJKQj0JpJnJ5j6Nmo
4285a3kjRK%pNoJ4jrJlJ6rJKJ5mKlJJ2nj0%mJ0qLkKkpjmKkLo%koMjnJ3qmRJNl
4338fnQJ0Kj7J3JOj0J0j2NJ3rj2NJ4qrJK%Rj8Qj1J6j9LlJmOoJPLmMlOKkpKQPm
4386DjPMOj1OJ3j3kOj2oJ2%qoOLmnK%j0QkPnnkQnKj2QOKj0QlKPnJ1OOj8MjJ0k
4436A6Nnj0J7j6%rQlqkoJ4Mj7NlkJ2ommKJ1olJ4kllMNJ0pLJ%%j5K3pK1j7j3oK2
4482B0j3LmO%j6J4j7nJ1j7NJQjqMJN%j0QRj0J2j9J1J0j5J1%MmJ6j1pO%k%nMlP
4526Ij2jJNmoKNj0PpLK%klJ2oj7J8J2j9K2j0JkKKPj0NJ2Jj2PJ1rkjLnqNmj2J0
$$ y = [11, 14, 3, -6, 3, 3, 8, -2, -6, -12, 2, -3, -15, -18, -21, -5, -11, -13, -13, -7, -10, 3, -7, -8, -2, 7, -8, 3, 5, 8, 17, 10, 12, 7, 19, 25, 7, 13, 18, 13, 11, 5, 6, 8, 15, 3, -7, -3, -2, -9, -2, -13, -13, -10, -12, -29, -15, -9, -13, -8, -13, -12, 4, -2, -13, -9, 8, 5, 10, 3, 4, 4, 13, 10, 10, 1, 7, 18, 17, 2, 23, 7, 2, 3, 5, 13, 3, 4, -3, -2, -7, 8, -8, -3, -7, -13, -15, -16, -7, -5, -5, -12, -7, -13, 1, 0, -9, -8, -11, 5, -4, -3, -1, 14, 10, 12, 9, 10, 22, 17, 7, 7, 3, 13, 5, 8, 6, 8, 6, -1, -2, -6, -4, -6, -3, -9, -9, -11, -17, -13, -14, -19, -6, -14, -18, -9, -8, -3, -6, -11, -3, 7, 9, -8, 5, 6, 12, 2, 12, 0, 5, 18, 9, -3, 2, 16, 8, -1, 0, 2, 2, 11, -7, 1, -10, 6, -13, -10, -13, -12, -16, -10, -16, -15, -8, -5, -9, -5, -8, -2, 0, -2, -9, -7, 1, 8, 4, 3, 10, 14, 20, 9, 15, 28, 15, 13, 19, 7, 1, 13, 13, 5, -1, 5, 8, 4, -1, 1, 1, -9, -1, -3, 4, -1, -6, -8, 0, -5, -3, -15, -7, -1, 1, -9, -1, -4, -2, 5, 0, 11, 17, 23, 5, 9, 8, 18, 16, 21, 16, 6, 23, 7, 7, -2, 6, 3, -5, -7, -13, 1, 5, -12, -7, -10, -12, 0, -6, -10, -14, -12, -1, -7, -10, 4, 2, -1, -4, 0, 5, 15, 8, 11, 12, 12, 12, -3, 20, 13, 34, 17, 4, -2, 20, 7, 10, 6, 12, 12, -4, 10, -7, -12, -1, -18, -13, -12, -4, -5, -13, -9, -8, -3, -3, -13, -5, 4, -6, 6, -13, -2, 8, -7, 4, 4, 8, 4, 20, 9, 2, 8, 8, 6, 6, 1, 5, 2, 9, -3, -4, -3, 2, -2, -8, -6, -1, -11, -4, -11, -8, -6, -6, -8, -11, 1, -5, -22, -4, 8, -11, 11, 1, 2, 0, 2, 4, 11, 1, 6, 18, 19, 7, 14, 25, 16, 14, 13, 16, 11, 3, 8, 4, -8, 2]
4572BlJlKKqj0J3oJjQj1kJ9j5LoK3lpJmN%J2kjjJ4j2qK0j5J8j8mJ4j1lmlKlqM
4618hJpJPMqKMoNnPJMkLMKkLj3J3KNnjOKjJj4NoLKnnjPj2kN%nKqPJ1j9RnjNOp
4673iKJ1kML%qJ1QooJ1j0%KQj8J4plO%npLkjrQpOnjj2OLJ%%PMjj1OPoPJkRkpQ
4726IMpJ6moKoQlj2J1j3m%Qj2NnLnqJ9j0PkjjmMnQlLOjR%nJ0qlMjk%J2j0J2mj
4776A4rOj1J0mqPkJj3JJPpLOj0OnrJ6k0K4jnJ1lrR%pJ1lKJ0JpkJk%jjmoJNj0M
4825boMlOnkMpjoJ0j2P%PJ2j7LRKkPLpJ0pKl%J5ppKjjqlROj2KMmj6PqLlJ3qJk
4877a2lkJ2LkJ1pj2K0Lj0MNJo%LNnnRNj0p%Rj1Lj0Mj%nPlQpj5J5nnLMOMj0kJ4
4925CqJ5j2%RqMkMMj1J1Mj1J2kmJ3pqOkppKrJ0qLJlnMOj8RJMlNQplKQQrPPmkl
$$ y = [2, -1, 0, -3, -1, 1, -7, -17, -4, -10, -9, -10, -2, -13, -15, 4, -11, -8, -14, 9, 6, -1, 0, -4, 1, 1, 13, 11, 10, 9, 23, 11, 3, 23, 8, 26, 8, 4, 18, 7, 4, 0, -3, -1, -4, -12, -8, -7, -14, -13, -6, -2, -10, -8, -4, -10, -5, -10, -3, -2, 2, 0, 3, 7, 9, 7, 10, -3, 10, 12, 17, 12, 11, 17, 19, 18, 19, 5, 10, 4, 7, 9, 4, -1, -2, 5, -7, -9, -4, -4, -9, -7, -15, -8, 3, -16, -7, -12, -13, -8, -2, -9, -7, 4, 2, 6, 9, 9, 1, 12, 20, 14, 8, 19, 9, 9, 11, 19, 1, 15, 8, 5, 11, 11, 6, -1, 2, 0, -1, -10, -2, -9, -3, -8, -9, -21, -15, -12, -11, -11, -11, -4, 0, -1, -12, -6, 1, -5, 2, 3, 1, 10, 8, 1, 9, 13, 6, 22, 18, 12, 14, 8, 16, 13, 1, 12, -1, -5, -5, 3, -9, -4, -9, -6, -11, -19, 0, -10, -3, -5, -6, -7, -11, -7, -12, -4, -7, -4, 2, 1, 10, 10, 5, 15, 7, 4, 8, 7, 5, 5, 17, 7, 19, 15, 14, 5, 11, 0, 10, 6, -2, 5, 3, 4, -9, -8, -7, 0, -7, -4, 2, -8, -2, -7, -16, 0, -20, 4, 3, -2, 9, 6, -3, 6, 6, -1, 10, 7, 9, 19, 20, 13, 11, 12, 10, 10, 9, 8, 4, -2, -1, 4, -6, -2, -8, -4, -7, -1, -6, -8, -4, -11, -12, -18, -8, -20, -13, -13, -6, 6, -11, -8, 1, 3, 1, 8, 11, 4, 14, 7, 9, 6, 6, 21, 14, 7, 9, 8, 7, -1, -4, 5, 11, -1, 1, 5, 1, -15, -8, -16, -13, -16, -3, -11, -10, -12, -15, -17, -5, -2, -4, 7, 0, -12, 8, 11, 1, 5, 10, 11, 5, 5, 8, 13, 8, 3, 12, 17, 7, 0, 0, 9, -2, 1, -9, -5, -6, -6, -11, -4, -7, 1, -6, -21, -6, -11, -16, -13, -9, -3, 1, -9, -11, 3, -5, 10, -2, -2, 7, -1, 3, 1, 5, 9, -2, 9, 13, 2, 14, 12, 8, 21, 14, 6, 12, 10, 3, -4, -2, -11, -1, -9, -6, -5, -8, -13, -9, -3, -21, -12, -11, -7, -10, -5, 3, -4, -7, -5, 3, 11, 2, 9, 16, 12, 10, 7]
4977GJ1oLj1J1qNjLklonJ6kj6J2lj0Kj2J1Lj1J4j4mOJkNJ4j3kLLJ1J3j7QmLlQ
5021A8pMoMLpKqKPpmPqJ2rjPj1qjoJ3KlMkJMn%NoOMJ0qJ2kjk%J0nj2NKqK%%nq
5074dJ3j1KRrMrOj2nJ4mo%%J0nmPRjpLRMNoPj2J1LoMnKkRj9Qj4QljJ0j5%MoLr
5124a1NkkJ3j1pPOLnMJ%RoNLnlQMj0NKmNPn%lj4J1OlrpQJj2L%oRolLllOPokKK
5178cKPkQj3J2J4j0jJrJ1kJ0krJ1j3Rj8KmJpJ6nj1jJKJJj0%LmQmOJPmqJ2Plmj
5226ERRk6J0LJMRj2kJjLplLj9J7pJ%jmqKKrRRKkj0KPJ4kpQnNjjMMJj7K4rJNj3
5277HJ1j4NojM%Rj1nLj8KQJoLj%Onkj1PJ2OqNljMN%oLJ2j3J3JlqQj2LOpQopQq
5328aOJj9PnlLmNklKjONlRNKj1J0%%Lj2QQOj6J5lmOj5KLj2kNlj1J7j5J2lmj2M
$$ y = [7, 18, 12, 15, 4, 15, 7, 12, 11, 14, 12, 9, 3, -2, 14, 12, -4, 8, 5, -5, -3, -15, -4, -1, -12, 2, -12, -16, -10, -9, -11, -6, 8, -5, -7, -4, -1, 10, 23, 6, 14, 10, 13, 10, 18, 11, 15, 9, 13, 16, 9, 11, 3, 5, 12, 5, 1, 8, 0, 12, 3, 2, 9, -2, -10, -11, -17, -4, -2, -5, -1, -3, -2, 2, -3, -3, 2, -4, 2, 6, 16, 8, 20, 18, 17, 15, 15, 25, 20, 8, 13, 15, 7, 9, 9, 9, 4, -4, 9, -2, 0, 9, 0, 4, -5, 1, -11, -16, -2, -6, -12, -12, -12, -2, -7, -11, -4, 5, 4, -3, 0, 9, 13, 18, 12, 19, 7, 18, 21, 15, 19, 14, 16, 14, 23, 4, 12, -2, 6, 3, 2, 12, -3, -3, 1, -5, -2, -11, -6, -8, -10, 3, -8, -15, -8, -2, 1, -4, 0, 1, 1, 10, 4, 9, 12, 7, 4, 12, 16, 6, 11, 13, 9, 14, 21, 16, 16, 13, -1, 10, 16, 13, 4, -3, 5, 6, -6, -3, -3, -9, 0, -6, -9, -6, -9, -12, -6, 1, -5, -7, -5, -3, -1, 6, 4, 12, -1, 11, 25, 15, 14, 15, 6, 17, 15, 25, 23, 14, 25, 12, 21, 3, 5, 1, 2, -5, 11, 6, -5, -6, -5, -3, -2, -1, -11, -11, -8, -12, -4, -8, -2, -1, 6, 2, -6, 6, 13, 10, 6, 5, 14, 23, -3, 7, 10, 11, 15, 24, 12, 10, 11, 10, 13, 6, 3, 6, -13, 4, -3, -2, -2, -3, -7, -15, -13, -11, -20, -11, -2, 0, -2, -12, -10, -3, 11, 9, 2, 10, 5, 10, 9, 8, 12, 16, 17, 0, 24, 15, 16, 21, 8, 19, 5, 10, 4, 3, 7, 7, 16, 5, 0, 3, -15, -13, -5, -4, -10, -7, -8, -8, -2, -7, -9, -20, -13, -1, 5, -3, 2, -1, -2, 2, 7, 7, 1, 4, 16, 3, 16, 17, 14, 6, 14, 2, 5, 11, 4, 12, 6, -1, 7, -1, 5, 6, -13, -6, -11, -14, -11, -15, -10, -12, -15, -13, -14, -8, -3, -6, 3, 8, 10, -1, 9, 9, 9, 12, 0, 8, 16, 22, 6, 21, 18, 14, 20, 5, 7, 10, -2, -4, 1, -2, -13, 4, -11, 1, -2, -6, -18, -14]
5376a4lQqKJJ3lpOkJ3oMmMJLPrlJ%LJ2j6KlPMokJpmoRMkommQkrOjKlJOoRKoMK
5432aJ6j7RKqKJ0j0MNJNLj3MJmoOj1Nj3kJ2mlKoJ1oNk1MOLJ2j5MqJ3JlJ0LKLm
5479IkNMJkooQj4MOqQj7J4pjKpRljlkojJJ1jjJnlJ0%pK1o%JqOKJ3lpmmJ8j1jM
5531A1lkJpNqqJLnmJlJ8j1kJKj%kPLQjlQllML%kPrJ2kqJ0k1J5l%jmooLJ4qj0k
5583a1J0j1MpkJ2pKNj3J7j5NP%J0j2JnJ4JPKNJJj1J3nj6MkjMkJj5J1Lj1MMpMj7
5628a8OQpMqJ3j2QlOMMpLlJ1j0QPmLN%j2JQpNnpoJ1qMmKLq%pONlJj3J0JqQoRk
5680dLJPlj0O%QjJ2j1kQnLK%n%j0RpJjkqPj1J3nj4LRlmKLQpj0K3jj2QjjJ2%Jl
5730HqJ5nlJ2Nnj2kMjNqoJoOJ1j6jOonkJj1LJJ1kLmJ7j2J2jllPmJ9j8Oj2J8oQ
$$ y = [-14, -17, -9, -17, -15, -14, -1, -4, -11, -5, -7, 6, 0, 4, 0, 4, 5, 8, 15, 6, 3, 4, 4, 7, 19, 3, 5, 2, 9, 13, 7, 5, 6, -1, -5, -11, -2, 2, 0, -6, -10, -14, -6, -8, -17, -11, -12, -10, -13, -12, -6, -12, -3, -1, -7, -3, -1, 15, -2, 7, 9, 1, 3, 13, 3, 7, 12, 13, 18, 21, 8, 12, 13, 9, 3, 9, -2, 3, -10, -12, 0, -4, -7, -5, -11, 0, -6, -1, -22, -18, -12, -9, 3, -12, -8, -16, -3, -2, -5, 5, 8, 10, 13, 9, 7, 12, 16, 17, 15, 9, 3, 11, -3, 1, 7, -1, 7, -10, 4, -3, -4, -2, -9, 0, -3, -4, -7, -9, -15, -16, -15, -4, -5, -6, -5, -10, -13, -3, -3, -10, 11, 5, 5, 6, -2, 4, 6, 19, 16, 9, 5, 1, 19, 8, 7, 11, 8, 6, 7, 0, 5, -3, -11, -10, -7, -12, -16, -15, -18, 0, -11, -13, -12, -10, -11, -11, -13, -6, -3, 5, 4, 1, 9, 6, 3, 7, 10, 10, 8, 15, 6, 18, 16, 8, 18, -3, 12, 9, 9, 8, 4, -2, -8, -5, 9, 1, -9, -11, -1, -12, -8, -15, -17, -5, -12, -10, -5, -18, -1, -16, -11, -4, -4, 6, -6, -5, -10, 4, 5, 12, 14, 19, 20, 21, 10, 23, 18, 2, 6, 4, 3, 7, 5, 6, -9, 2, 5, -6, -2, 2, -5, -1, -18, -12, -4, -11, -7, -15, -2, -14, -6, -9, -3, 1, 5, -2, 1, -2, 9, -1, 7, 14, 10, 13, 18, 18, 6, 7, 15, 8, 13, 8, 1, -5, 6, -2, 2, -2, 0, 3, -5, -5, -12, -6, -1, -4, -3, -16, -6, -5, -13, -5, -11, -2, -4, -1, 0, 7, 4, -6, 0, 0, 8, 7, 19, 8, 6, 14, 9, 12, 14, 14, 9, 9, -1, 8, 1, 2, 1, -1, -9, -2, -13, 0, -5, -19, -16, -7, -10, -14, -12, -9, -1, -8, -18, 5, 4, -8, 0, -1, -2, 10, 10, 11, 8, 0, 15, 10, 7, 19, 24, 19, 7, 5, 9, 8, 13, 5, -1, 0, -6, 0, 11, -5, -6, 0, -6, -11, -13, -12, -23, -20, -19, -8, -10, -7, -11, 6, -6, 6, 5, 2, -1, 6, 2, 21, 3, 9, -3, 15, 9, 17]
5777A7jmqJ3lopMlJjnQj5PjolJ2qpNJ2noMNqJ6j2j%NRKoJ1j2ONpQjj4KRlNNj3
5827EoKjMj1%NqmJ5j3Nj0LJpJ3LkLLjMj4J8j5J6JKqNMOnMmkllQj6LmLnKlll%%
5878a3OrLO%lPMj2JPRppJ1JLmJ3j7J0mQpNrN%Pj0klMj0JlNj3LNljMLonnQRj0K
5929a3MJ0rNlj%JNlJ0%qJRmlQLnLLj2J1j4J%joLmjpMrKJ4mLj4RQj4J3KKLqLPJ
5980Ej3J5j2J8Nj3J1nloP%jOj8Qj2Q%mpKLmjo%Rn%MLkJRj5MJ0Pj1MNlmJ4lOjn
6029A0%JKj0J7j3nMLj6J4q%j0Oj0NJqPl%lj0J9NLMj3RjkNKLOlNj2OOjLmlKj1L
6077EJljKlmj0O%mNNqq%LjJ0%%lNrJ3QqRj1J7j1J6j1MlMljpL%rOmLKppJ0kjNj0
6129gqlJ0rjQL%Pj3J6OmKkKQj0kQpLJ%NNqlKpRj6NPkjOqkpO%Oj2mKQmpQjKpQL
$$ y = [17, 16, 12, 4, 17, 14, 8, 1, 5, 2, 3, 2, -3, 5, -10, -3, -4, -10, -13, -1, -9, -16, -11, 1, -4, -10, -6, -1, -9, 7, -5, -6, -6, -1, 8, 10, 4, 15, 3, 9, 14, 7, 15, 14, 0, 2, 11, 8, 13, 18, 5, -1, 1, 0, 4, -7, -7, -2, -10, -14, 1, -12, -7, -17, -14, -13, -20, -7, -4, -6, -3, 0, -1, 3, -11, 7, -8, 8, 9, 11, 3, 8, 12, 18, 13, 17, 13, 11, 8, 5, 13, -3, 0, -4, -1, -6, -4, -7, -10, -13, -13, -13, -7, -16, -13, -7, -7, -10, -3, 1, -11, -10, -3, 6, -1, -8, 3, 4, 7, 3, 16, -1, 9, 5, 13, 6, 11, 2, 7, 7, 14, 4, 2, -1, 3, -7, -6, -9, -4, -17, -14, -9, -12, -13, -9, -6, -12, -17, -22, -14, -5, -15, -13, -9, 1, -8, -3, -6, -7, -7, -6, -1, -4, 6, 6, -2, -1, 8, 4, 1, 9, 12, 7, 10, 13, 1, 12, -2, -1, -1, -2, -8, -5, -9, -10, -17, -13, -22, -20, -6, -10, -7, -21, -12, -4, -18, -5, -3, -1, 2, -6, -3, 4, 5, -8, 7, -5, 13, 18, 5, 16, 11, 8, 2, 9, 9, 8, 14, -4, 4, -8, 0, 0, -4, -11, -9, -6, -10, -11, -17, -17, -8, -13, -13, -9, -6, -8, -7, 2, -13, -9, 1, 8, -3, 1, 6, 3, -1, 13, 10, 16, 15, 10, 10, 11, 13, 3, 20, 7, 2, 6, 9, -7, 7, -1, -1, -11, -5, -15, -10, -9, -17, -10, -13, -13, -16, -26, -7, -2, 1, 5, -8, 1, 0, -2, 3, 5, 8, 14, 11, 16, 4, 10, 16, 15, 18, 14, 11, 13, 2, 5, 6, 3, 2, 4, 1, -3, -13, -7, -7, -11, -6, -1, -9, -17, -17, -14, -15, -5, -5, -5, -8, -3, -12, 1, 9, 1, 10, -1, 16, 5, 21, 10, 14, 11, 15, 12, 11, 4, 7, 7, -2, 4, 0, 3, 5, -2, -9, 1, -1, -2, 3, -7, -15, -18, -8, -17, -18, -10, -7, -7, 0, -13, 3, 9, 5, 7, 5, 7, 15, 5, 3, 11, 4, 7, 8, 8, 13, 18, 10, 7, 9, 2, 11, -5, 0, 7, 5, 4, 10, 2, 0, -7, -1, -1, 5, -7, -11, -9, -1, -5, -12, -4, -5, -3, -10, -2, 1]
6184AJJ1j7J5J%pkOLj0QmJ4j1Oj2RLoLp%ojnNoJ1j0kNMrNJPoNjj1QLOnLpLJ5l
6234A4%mjJ1nj1QJ3j4JJmmOk2QN%mj3mK2pmMj3J3j1QQnjO%kJ4oKnRnMLj1J0Mo
6281A2LjJKnknm%lLJpJ0k0J2lKnQlj0OMnJ3mjmJ5mnJPnJ6j3RpJ2j5PJJmLLkno
6331DJOj2jPm%qKNj0LoJ5kolJ7j5J8pkpPOkMk%MLqkJ1oJ2rmNj1KJoMmLj2J4ko
6381c%j0PjkMLrJ0rJ5o%JkJ8onJ0%mkJ2j1LOlNj6Qmj0QlLJqpJ3rRpjKmrmJ4Mk
6431akOJlMKMlnNlJOMRj1KLqjNj0pJ8oMojj0J0poJ0onkmQqNNj2OKMJ0pMj2K2%
6482A4j0R%%j1PmP%jOknlmRj2PlOj1pRj6MMQj1Rj%nnJ4nlOk%kO%J4rkQKrRkPp
6534A3jl%j0P%jrKlmj%LLj6MJ2LoM%%oMKoJ2qMMJNMjnRq%LNmnOpPrJJpKMj1JJ
$$ y = [1, 2, 13, -4, 11, 12, 12, 5, 3, 9, 12, 2, 10, 6, 20, 9, 15, 3, 12, 15, 9, 12, 5, 5, -1, -2, -7, -2, -8, 3, -7, -9, -4, 0, -9, -4, -3, 4, -2, 3, 2, -9, -1, 2, 8, 3, 6, -1, 2, 17, 14, 14, 10, 9, 20, 15, 4, 12, 25, 11, 12, 13, 9, 5, 11, -11, -3, 2, 2, -2, -15, -19, 3, -4, -8, -4, -17, -4, -15, -7, 1, -4, -5, 1, 1, -1, 13, 7, 9, 4, 13, 8, 12, 15, 4, 14, 18, 12, 15, 14, 15, 17, 12, 10, 5, 1, 1, -2, 1, 2, -5, 5, -15, -3, -6, -4, -9, -1, -4, -14, -8, -4, -9, 4, 0, -1, -5, 10, 6, 1, 2, 9, 4, 20, 7, 16, 9, 21, 6, 13, 14, 15, 11, 14, 17, 15, 10, 4, 5, 11, -1, -2, 5, 1, 1, -7, -5, 0, -10, -7, -13, 2, 0, -6, -9, 8, -7, 11, 4, 2, -5, 2, 8, 6, 10, 8, 8, 12, 15, 7, 5, 16, 10, 22, 13, 9, 14, 3, 5, 6, 0, 4, 0, 3, -9, 5, 3, -3, -3, -13, -6, -7, -9, -5, -2, -11, -1, -10, 5, -1, -1, 0, -2, 16, 10, 5, 15, 15, 11, 9, 21, 10, 13, 19, 16, 21, 5, 13, 9, -1, 7, 4, 7, 8, 0, -7, 6, -3, 6, -1, -2, 0, -4, -13, -17, -3, 1, -1, -3, 3, 4, 1, 5, 7, 11, 8, 3, 8, 5, 6, 12, 16, 25, 14, 16, 19, 11, 10, 15, 5, -2, 16, 10, 14, 8, 7, -3, 7, 0, -6, 4, -2, -7, -9, -13, -5, -13, -8, -3, -15, -9, -7, -3, 7, 0, 4, -8, 14, 14, 4, 13, 13, 13, 2, 9, 5, 12, 12, 11, 17, 15, 10, 7, 3, 12, 0, 7, 4, 10, -1, -8, 1, -15, -11, -7, 1, -10, -1, -2, -2, -7, -12, 2, -3, -6, 0, -2, -2, -4, 2, 2, 16, 7, 5, 13, 15, 6, 15, 13, 20, 13, 12, 9, 9, -1, 6, 6, 5, -4, -2, -5, -9, -10, -10, -7, -4, -20, -16, -4, -1, -7, -3, -3, -3, -9, -5, -3, -9, 3, -5, -1, 3, 4, 9, 13, 12, 7, 16, 8, 8, 11, 16, 12, 7, 13, 6, 13, 4, 5, 6, -1, 1, 5, -6, -5, -4]
6589doP%qJ6k3J3Lj6J8lMKoOJL%N%Nj7J6nmJ0LnJlkmKmJj0PkMnpJ4j3KpKjMJl
6639hJQ%qJ1nlJ0%MKLj1LOjNkJ3j6l%%Lk1J3JjmL%loKrJQnJOpJ2olM%J4j8QRo
6690EJ0%qnQ%oNNpNjMqmMJqKJ5qj5L%lpNNpP%j1J3oJQmMNlMOj3%NJPJkJLoNKr
6745InMMmmpPNooQj2mN%jmK1rnmmmJ3JOl%J2j0MJQjMq%O%prOPpLooJ4omqJ6j8
6798hOl%MKj%nJ0j0JK%J2nj0J2nMJNj4J7rJ0Nqj2J6J%j0%jnJ7j4j1J3oj1PkoJ
6843a0jnJ4jnOrPNKoNLj3J3rNKkJ2J0j1mLOj1JJLqN%Qj3KKnj4KMJjmKQqMrjOJ4
6894FkrQnKOLmPkkPpmNLMj2PJJrJmLM%mjnMprRj2MKN%lQnJ1omNO%PnLj3OPLp%
6951GJ5kr%j0NJ0pj6K4nj1J1j9jKMnNMj3jKQqJ2mmMlQjPqJ3pMPknkNNj5kOkkJ
$$ y = [-4, -10, -3, -3, -11, 5, -18, -5, -2, -18, 0, -3, 1, 3, -3, 3, 4, 7, 7, 12, 12, 17, 0, 16, 11, 7, 17, 20, 15, 16, 13, 11, 7, 9, 5, 6, -4, 3, 1, 5, 0, -7, 7, -6, -4, -11, -9, -10, -6, -5, -8, -7, 1, 1, -7, 4, -1, -4, 6, 6, 10, 12, 15, 4, 7, 13, 12, 17, 15, 28, 12, 9, 9, 9, 12, -9, 4, 5, 4, 0, 3, 3, 0, -6, -4, -13, -12, -4, -9, -8, -2, -9, 3, -3, -6, -2, -2, 12, -6, 2, 11, 5, 15, 15, 7, 2, 10, 10, 4, 9, 14, 7, 12, 11, 15, 7, 3, 7, 8, 0, 2, 17, 9, -6, -3, -3, -6, -13, -8, -3, -10, -3, -3, -14, -1, -7, -6, 2, -2, 2, 7, 4, 8, 14, 1, 1, 6, 7, 14, 15, 13, 14, 17, 11, 16, 18, 9, 4, 8, 12, 8, 4, -3, 4, 9, 3, -3, 5, -7, -11, -6, -6, -7, -11, 10, 1, -4, -8, -12, -16, -3, -2, 4, 1, 1, 13, 3, 7, 8, 16, 15, 19, 11, 11, 17, 17, 10, 1, 7, 14, 7, 10, 4, -2, 12, 6, 2, -6, 10, -8, -2, -5, -5, -1, 1, 0, 0, -5, 5, -5, -4, -2, -2, 10, 5, -5, 7, 2, 6, 7, 12, -2, 15, 6, 16, 21, 13, 1, 17, 18, 18, 8, 8, 7, 2, 19, 5, -6, 7, 1, -10, -3, -5, -11, -10, -11, -16, -2, -3, -8, -2, -11, -4, 1, 3, -3, 2, 5, -8, 5, -4, 1, 3, 1, 13, 23, 12, 8, 11, 17, 6, 7, 8, 11, 3, 8, 8, 16, 3, 5, 7, 2, -12, -10, -6, -5, -6, -10, -8, 0, -8, -4, -13, -14, -8, 6, 4, -5, 3, -2, 0, 6, 9, 5, 12, 10, 8, 15, 8, 4, 9, 12, 16, 4, 11, 12, 13, 4, 5, 1, 4, 8, 8, 4, 3, -2, 2, -5, -14, -5, -17, -13, -11, -6, -6, -9, -1, -6, 5, -1, -5, 0, 6, 6, 13, 8, 11, -2, 4, 11, 14, 7, 7, 22, 20, 11, 11, 1, 6, 16, 9, -7, 17, 12, 1, 12, -7, -8, -6, -2, -7, -2, 2, -11, -12, -10, -2, -10, 2, -2, -6, -2, -5, 3, 2, 9, 1, 14, 7, 11, 18, 16, 11, 9, 14, 19, 4, 2, 8, 6, 4, 5]
7000EoRoJKprNkJj1J7pmJqJ7pKMQpkjoJ4OMklOpPjMj1QklKOopJj5J2nlmOJrN%
7054gPj6J4m%RqlKLN%jOjOoLkPqjJ1oNkKj0pRmjLmllRoolJ3pqN%pML%%MJKMoJ3
7110A0LLj0KnmJ7j1jPjPnj1LKJj2pJ5m%mmLjJj1LRpLOKkkJ0oJmPLLqJ5mqJ0Ml
7160A5Jmp%OrMkj4J0kPnKMpMoj8J8%kj2LKJ2Rj8OmRKkO%jkOrjRNnN%mj0jpLRq
7212cRpMrJ4j3rLKMlj0J0JpjRJrJ5jklL%J1mRojKpOj1J9oj4J8j1Oj2l%QOj0j0
7259a2OmLkJ3j9mK0j7QLj0PJ0r%J2K%mLJnNNqJ1j0MpKNj%%j1J1Nj0jkj0KkjKL
7306fm%mPjkJ3qPMoJ4j2nLJ1Kj3QjN%oLmjLpLj%Mj5nK0j3qOJj4Pn%NOPkj1OOJ
7357bj1RN%Rkj1MNNpK%LmJ0j0LqK%Nkkj0lRjNj4KKJjQpj%lOL%MqJ5%joJn%J2p
$$ y = [5, -1, 8, 2, 3, 5, -2, -11, -6, -8, -7, -18, -1, -8, -12, -11, -19, -2, -9, -7, -3, 5, -2, -4, -5, -11, 3, 9, 13, 11, 8, 14, 7, 14, 13, 17, 6, 14, 12, 9, 11, 17, 11, 4, 5, -10, 2, -3, -6, -10, -4, -3, -12, -7, -7, 0, -16, -2, -6, -6, 3, -5, -8, -6, -3, 2, 2, 1, 7, 6, 12, 6, 9, 7, 14, 6, 5, 16, 10, 15, 13, 15, 5, -2, 7, 3, 2, 5, 1, -2, -5, 4, -2, -8, -11, 2, -5, -13, -8, -8, -15, -11, -8, -8, -8, -4, -3, -1, 3, -3, 10, 13, 16, 6, 8, 3, -1, 16, 5, 4, 11, 10, 17, 12, 1, 4, 6, 7, -5, -12, 3, -1, -1, -5, -9, -6, -7, -6, -17, -14, -5, -12, -9, -3, -1, -3, -5, 5, -1, 0, -4, 3, 6, 9, 1, 16, 12, 4, 14, 18, 15, 16, 12, 5, 5, 11, 2, 6, 4, -10, 0, -2, 5, 0, 2, 6, -1, 3, -3, -21, -3, -3, -5, -17, -14, -12, 0, 9, -9, -3, -7, 2, 4, 2, 8, 8, 7, 5, 11, 2, 1, 10, 15, 10, 15, 15, 11, 1, 0, -7, -4, 5, -3, 6, -1, 3, -6, 8, -5, -14, -11, -9, -5, -8, -18, -8, -7, -14, -15, -6, -5, -14, 1, 0, -2, -5, -2, -2, 9, 5, 14, 8, 7, 9, 2, 8, -3, 16, 10, -4, 14, 3, 9, -3, -6, -6, 2, 8, -2, -12, -6, -10, -7, -9, 4, -15, -19, 1, -16, -8, -5, -15, -8, 2, -7, -7, 5, 7, 7, 3, 6, 7, 2, 7, 12, 4, 15, 5, 9, 2, 4, 9, 8, 8, 8, -3, 8, 13, 3, 2, 0, -10, -8, -10, -11, -9, -6, -10, -10, -14, -7, -8, -10, 3, -5, 2, 6, 0, 14, 2, -3, 0, 11, 13, 0, 8, 7, 12, 12, 6, 9, 5, 4, 7, 0, 3, 2, 2, 6, -9, -14, 6, -7, -15, -9, -8, -22, -15, -20, -20, -15, -9, -2, -4, -15, -9, -3, -2, -13, -4, 1, 1, 10, 8, -3, 1, 6, 11, 4, 6, 6, 9, 5, 15, 5, 8, 0, 2, 2, 7, 5, 3, -7, -10, -1, -2, 3, -11, -9, -7, -6, -7, 1, -6, -7, -7, -10, -4, -1, -1, 3, -5, 10, 10, 9, 3, 4, -1, -1, 11, 4]
7410DN%OjjKjkoKJqmPqJnnJ3j9J0j1J8nmkMkqJ4Oj2JPJ1oOkNmkMlOk%lkNkJoK
7463Ekjl%J0qpr%LPqKkmMJ5j0LMjrJ1Ln%NPJjOnnKqK1pmmJ1rmOj6LkKrNJkoj%
7517a5J1plJ4pNpOqOJ1Mj0OljJ4nOoKnOOj4JmPj5LPKqjmjj%rMjPnj%mJ2nOPj5
7568a2NNjjJ1MlojR%Pj2Lj5MRKj9K4j2mLJJjqNMqrPKmkjL%QnpMkRPkRooRrMOj5
7622fOKLjkPqK%kpqjNMnJM%nnRJKjrNNqOmJ0KmJ7j4RKjlPll%lnL%Mj1Rq%Oj1L
7678drQnJjlOj6K6lj1QklPlnQnLKMkL%jjOkNrQkKjko%Pj7%J7j6MoMJmJlQr%Kj
7733a1QoLQJPjNj5MLLj%OmKlNj4JQm%oJpJlJmJ1j3J2Pj0jqJ1omR%RjnKJ1j3OQ
7784A3rMkoJ4Jj4J4rnmQnkjMpMkMrlOKnkJ3k5J8j0LPnMlJJQPpmPQLnjkOnpNLP
$$ y = [4, 9, 9, 15, 14, 13, 15, 14, 12, 6, 8, 9, 1, -3, 4, -4, -3, -8, -13, 0, -19, -9, -20, -2, -7, -11, -13, -9, -11, -19, -5, 1, -11, -10, -3, 8, 2, 8, 6, 11, 7, 5, 9, 6, 12, 10, 10, 7, 5, 10, 8, 9, 3, 5, 3, 2, -1, -1, 9, 1, -6, -15, -15, -12, -5, -13, -11, -13, -17, -13, 2, -8, -5, -1, -2, -11, 0, 3, -2, -2, 3, 10, 11, 10, 16, 11, 6, 8, 0, 21, 14, 10, 6, 17, 8, 4, 10, -6, -3, -5, -3, -12, -7, -6, -8, -14, -15, -15, -4, -11, -14, 0, -7, -2, -9, -3, -11, -5, 6, 10, 0, 6, 3, 2, 16, 11, 17, 11, 13, 8, 14, 20, 6, 7, 3, 10, -5, -2, 5, 7, -1, -2, -6, -7, -8, -8, -17, -13, -14, -7, -12, -13, -13, -17, -5, -10, -4, 3, -12, -7, -2, -3, -4, 7, 11, 8, 2, 1, 10, 10, 17, 5, 8, -7, -3, 6, 8, -11, 13, 1, -3, 0, 1, 2, 1, -7, -2, 2, -6, -15, -8, -6, -10, -12, -13, -10, -10, -2, -7, -14, -10, -12, -3, 4, 2, 11, 5, -1, 8, -1, 3, 9, -6, 0, 2, 5, 4, 2, 9, 1, 3, 3, 1, -6, -14, -15, -10, -6, -11, -10, -6, -6, -11, -16, -7, -6, -4, -5, -14, -9, -4, -12, -6, -10, 0, 2, -2, 15, 1, 10, 12, 11, 8, 15, 12, 9, 9, 6, 1, 4, 4, 8, -3, 6, -2, -2, 4, -7, -4, -13, -5, -10, -9, -10, -13, -7, -23, 3, 0, -11, -3, -5, -8, -1, -4, -9, -1, -6, -3, -1, 3, 1, 4, 4, 3, 2, 8, 6, 11, 2, 10, 8, 10, 9, 7, 1, 1, 8, -9, -9, 8, -8, -4, -10, -6, -5, -9, -8, -11, -3, -12, -12, -10, -11, -3, -9, -6, 2, 3, 10, 9, 14, -1, 3, 6, 9, 8, 8, 14, 10, 12, 9, 14, 0, 1, 9, 5, 5, -1, 0, -7, -6, -9, -8, -12, -1, -14, -2, 5, -5, -6, -14, -3, -9, -13, -4, -4, 5, 4, -1, 1, 12, -1, 5, 13, 4, 8, 6, 0, 14, 15, 1, 15, 6, 1, -3, 5, 0, -2, -3, 1, -6, -2, -4, 0, -9, -12, -6, -4, -9, -11, 2, -23, -5, -15, -12, -5, -10, -6, -9, -8, -7, 1, 8, 1, -3, 4, 12, 15, 10, 9, 7, 13, 8, 1, 6, 9, 16]
7837A6ook0J2jJ0Kj1LoNn%pQ%%oNlnJ4%pjJ9j1MKj0K6j6LqQoLQoMpkJ4j3Onj5
7884a1J1jkMnlkKKlJJKj2RJmMOpKMJ0npnJ9jj4QM%Rmj0KkLkkNmj0O%jjlqQpQm
7937iLpMjLNjJM%LMmpPpJ2qLkJ4mj3J2nJlPmkj3J2j0kJmkkJNmJ5j4QnjOlKK%%
7989bPmMNj0KNLmLNqMmPpk%LqMrJ1qNplKJKL%j1KMJpOKj0J6JokJ8mjLmQm%lML
8044A6kpJqJ4nJj2jKJmJnLjL%rOJKnJ4j2KJ1r%nJ0MLjjjoJ1mkJ2qmnjNM%mj0J
8095dLjmqJ0LJrrJ1J2k3J1mQ%KKRmp%LLLLnJ3nPj9J2mlJ%lLoqjJ3j4mNkkLMKr
8146a1PqL%J5ppRNjmJ7roPpJ4kj4NMMPrlpRoqPKJj7J5nMj4J7j8LNOMj8J7
$$ y = [16, 10, 4, -16, -4, -5, 5, 7, -4, -1, -7, -2, -7, -7, -14, -6, -6, -6, -12, -7, -10, -15, -1, -1, -8, -9, 10, -1, 3, 5, -5, 21, 5, 8, 0, 8, 2, 5, 13, 7, 11, 4, 2, 16, 3, 9, 4, -11, 0, -1, -3, 1, -4, -7, -9, -7, -5, -8, -7, -6, -4, -16, -7, -6, -10, -6, 0, -7, -5, -1, 9, 4, -3, -8, 11, 10, -4, 4, 8, 8, 17, 13, 3, 5, 3, 6, 4, 2, 7, 3, -7, -1, -1, -2, -3, -6, -14, -6, -13, -5, -9, -6, -13, -9, -10, -7, -2, -3, -2, 2, 2, 5, 9, 5, -2, 5, -2, 10, 2, 5, 3, 17, 13, 0, 12, 7, 8, 5, 12, 8, 6, -7, 5, -5, -7, -6, -10, -12, -14, -13, -8, -12, 3, -11, -3, -8, -9, -3, -6, -4, -2, -2, -2, 5, 1, 5, 10, 0, 2, 7, 10, 6, 9, 14, 6, 10, 6, 13, 6, 4, 4, 7, -1, 3, -6, 5, -3, 2, -5, -8, -6, -5, -3, 0, 0, -11, -9, -5, -4, -11, -5, -3, -13, 3, 4, -2, -4, 14, 10, 9, 12, 8, 16, 12, 12, 9, 13, 16, 14, 7, 8, 0, 14, 9, 10, -2, -3, -1, 0, -4, -3, -8, -5, -6, -3, -3, -12, -6, -5, -3, -8, 6, -6, -4, 7, -2, -2, -7, 3, 7, 10, 9, 8, 7, 1, 12, 8, 6, 18, 10, 6, 1, 0, 5, 9, 9, 5, -5, -4, -1, -2, -6, -14, -4, -1, 0, -9, -18, -7, 5, -18, -7, -11, -3, -3, -1, 1, 10, 6, -1, -1, 2, 5, 8, 11, 6, 19, 14, 21, 2, 14, 10, 7, 8, 8, 5, 8, 2, -6, -7, 6, -8, -12, -7, -9, -11, -8, -4, -2, -11, -4, -12, -9, -9, 6, -1, -8, 1, 6, 5, 1, 18, 9, 3, 10, 3, 17, 15, 1, 6, 10, 14, 21, 12, 9, 2, 11, 5, -3, 4, 6, 7, -10, 5, 0, 4, -10, 7, -11, -8, -3, 3, 7, -11, 6]
8191F
$$ Imaginary data points
##PAGE= N=2
##DATA TABLE= (X++(I..I)), XYDATA
0@%%%%%%%%%%%%%%%%%%%%JrJ6j6J6j6J6k1K9l2L2m0M8m9N7o5P3q1Q9j04J13j22
42f5J38j54J70j86K07k31K56k80L06l39L75m14M57n05N60o23O95p80Q81j004J158
63F22j354J615j985K549l536N729j9093J1528M0682l0345l3337J2649L2876m205
77A4395k0012p588Q256J1124Q934j2805k2316P162L4624k21l9950r662M1136J7234
91C0311l5754k3226K7256K3967j5630k0720M715J2404M633j699j0067j0584J1863
104b531K1753r571l0496M664L5075J753l5163p500L0893J1362k3458j2109J4240
117a088R592m962m053k898l501Q112J1787j0465j9207J0003K4524p644k6945M320
131a2425K6162j196k2550p53J6895R39j0252P12L799l829J723P753n643j1693
$$ y = [0, 0, 0, 0, 0, 0, 0, 0, 0, 0, 0, 0, 0, 0, 0, 0, 0, 0, 0, 0, 0, 1, -8, 8, -8, 8, -8, 8, -13, 16, -16, 16, -24, 24, -25, 32, -33, 40, -41, 48, -56, 57, -65, 73, -81, 89, -97, 110, -121, 135, -145, 161, -178, 197, -217, 240, -265, 295, -328, 367, -413, 468, -536, 622, -732, 883, -1102, 1447, -2089, 3640, -15453, -3925, 36757, 6412, -26925, -14276, 18600, 14395, -5617, -13205, -4949, 6175, 15109, 2304, -20012, -12850, 21774, 21553, -18397, -28059, 13077, 30311, -5443, -28669, -1413, 22554, 6924, -13796, -9081, 3323, 7956, 6257, -3810, -14394, -2531, 19222, 9651, -20845, -16181, 18894, 20647, -14516, -22016, 8877, 20239, -3219, -15328, -1088, 8504, 3542, -511, -3409, -6910, 1202, 12989, 2524, -16683, -6680, 17844, 10200, -16745, -12425, 13737, 12541, -10009, -10762, 6133, 7072, -3180, -2468, 1331, -2498, -775, 6978, 1335, -10358]
145a0358P922J4901q706j6663Q472J6759p846j5227P317J2382p262q819P755N014
159E641q763j529R874j369j0775L590J1067n269j0531O666R176p994p135R508
173B157M784j1125k499J2814O22j4158O60J4828j337j4461J633J2834j925j0031
187e204K550O337l933k249O103j729q925M803J2130o687j5066P127J7098o217
201F138j7634M385J6355k246j3077N19Q247J69k377O69l670l028Q918O648j2626
216b610j0898J4230J4862j3624j7630J1020J8385p193j6714L020J2573M82o477
229e74k468p46K421P987k54j4100l486J8147Q102j9539j2431J8168J5510j4476
243B261j6406R295J4711l800j0417r77M090M070L245m907j0605L463J6687j79
$$ y = [-10358, -2436, 12465, 3759, -12904, -4432, 12327, 4481, -10746, -3429, 8953, 1691, -7128, 627, 5641, -3122, -4651, 5223, 3854, -6921, -3331, 7736, 2467, -8064, -1398, 7778, -216, -7351, 2157, 6941, -4184, -6683, 6131, 6753, -7405, -6745, 8083, 6746, -7715, -6082, 6752, 4827, -5204, -2654, 3683, -250, -2499, 3604, 1875, -7050, -2247, 9883, 3196, -11870, -4743, 12355, 6138, -11496, -7111, 9244, 6998, -6079, -5560, 2687, 2856, 479, 1148, -2522, -5550, 3368, 10016, -2610, -13508, 722, 15584, 1960, -15670, -4650, 13735, 6542, -10172, -7152, 5421, 5903, -574, -3042, -3788, -1367, 6620, 6366, -7734, -11220, 6927, 15029, -4510, -16941, 1227, 16737, 2261, -14145, -4850, 9861, 6061, -4356, -5333, -1243, 2827, 6072, 1165, -9440, -5977, 10710, 10531]
257A0531k0547m158K1604Q469j9831j1603J5611J2798r832j1468L667P694J779
270D714j885n603m919P169J1699o415j7286L719K0721P5k1460l995J9447O945
284A2926j5167q183R420P213l278m198k158n00O101O075q087j1427Q020J5713
298A2470o266j8089L504J8265n45j6214j753J2327K855p349k424K098M37K644
312A960K647o183o317Q184R776q615j2433P714J3676n980j3329M062J1395k456
326D101q225J622M412j759m02K784l149m333N801O122p435p620Q059Q458p910
341E26q379P254P348o505n544N887L205n579p33N565j652n665L613N738n032n574
357e527N965N031o515m026O865K637p103j027P387o01p653K011P874l060p824
$$ y = [10531, -10016, -14174, 7430, 15899, -3932, -15535, 76, 12874, 3042, -8426, -4759, 2935, 4714, 2829, -2774, -7693, -524, 11175, 4760, -12526, -8807, 11914, 11989, -9471, -13466, 5981, 12926, -2241, -10424, -1004, 6209, 2931, -1267, -3425, -3925, 2176, 8251, 164, -11263, -3243, 12470, 6204, -11885, -8381, 9884, 9339, -6875, -8628, 3699, 6554, -795, -3219, -1121, -684, 1960, 4607, -1576, -7893, 291, 10067, 1452, -10981, -3267, 10409, 4429, -8900, -4838, 6557, 4101, -4124, -2502, 1910, 151, -251, 2533, -616, -4949, 852, 6974, -461, -8081, -22, 8436, 526, -7853, -599, 6749, 244, -5300, 587, 3792, -1787, -2520, 3045, 1393, -4272, -659, 5079, 47, -5527, 438, 5469, -1046, -5072, 1793, 4430, -2673, -3700, 3687, 3086, -4567, -2556, 5318, 2258, -5566]
372e566L659P323l894o270L877M634l918k439M124r8m690K609N590m735o734O186
388c42P922o783q780O557Q955n574q159M221O325k827l582J844J46j540L516K015
404C914o805l311R310N044j0646o844J0601Q153r301q562P020P751m261n659J647
419a949K368L71J726j335n926J089R677K58j2332k324J3475M606j2944o440J0849
434A169P264p608o743L856M714k96j365k521k785L977P115m021j0922K791J3493
449H118o67j4385j769J3531L815j1016m882P362M625l164k967p98M5L952L653
464E453n812p482O196J0776n281j2922L401J3498j122j2408r79R797K285o104
478g04k516J972J440K024P46n195l617P166O640p753r192P088J0762n460j0990
$$ y = [-5566, -1907, 5416, 1522, -4748, -871, 3763, -155, -2594, 1530, 1432, -3258, -649, 4941, 206, -6528, -342, 7580, 797, -7983, -1426, 7529, 1955, -6204, -1983, 4342, 1515, -2067, -223, -77, -1617, 1899, 3914, -2891, -6202, 3108, 8152, -2494, -9338, 1263, 9416, 115, -8447, -1427, 6324, 2063, -3596, -1949, 419, 790, 2516, 1181, -4745, -3656, 6021, 6279, -6053, -8377, 5098, 9704, -3240, -9680, 1169, 8433, 825, -5918, -2062, 2652, 2356, 991, -1530, -4315, -338, 6777, 2756, -8166, -5375, 8118, 7451, -6934, -8703, 4828, 8643, -2373, -7255, 107, 4732, 1568, -1399, -2197, -2152, 1800, 5453, -359, -7841, -1645, 9131, 3850, -9072, -5671, 7827, 6705, -5703, -6682, 3115, 5400, -704, -3220, -1248, 192, 2216, 2962, -2233, -5850, 1316, 7956, 203, -8989, -1901, 8861, 3401, -7589]
493g589L411R798j468p375J01M099L44m64K04l005j563N690L407p398n302Q000
509H90O807p617p518O482P269m984o025L532M005k404j446J859j331j811L842
524A550K223n762k908O968L538p399l895P153L759o436l108N479J942m556l82
539a834L733j341l125K948K759m274k478N191K160n627j708N733J044n568p5N220
555B758j007m881K176M540l207m243L983L859m415l368M516K581m338j482L992
570A464N6l648J564L399l206l352M680L479n726l723O258L941o152l895N502L434
586D075m407k443L138Q63j935J194J027l442o40N529P61p173j378Q135K207q238
602b727k959P424L358n893l114L873K123j736l44j20j989J431M503j941o802J679
$$ y = [-7589, -4178, 5620, 4152, -3223, -3122, 977, 1321, 857, 1061, -1944, -3507, 2183, 5590, -1808, -7110, 890, 7697, 80, -7438, -956, 6313, 1329, -4696, -1164, 2841, 437, -1009, 850, -481, -2292, 1550, 3773, -1989, -4897, 2071, 5609, -1790, -5685, 1468, 5227, -1209, -4317, 1162, 3104, -1452, -1834, 1899, 558, -2567, 381, 3140, -1134, -3612, 1579, 3739, -1888, -3596, 2137, 3181, -2387, -2462, 2758, 1751, -3130, -954, 3586, 379, -3864, 119, 3978, -437, -3805, 711, 3292, -1046, -2528, 1464, 1520, -2128, -564, 2835, -371, -3723, 957, 4436, -1290, -5013, 1245, 5186, -966, -4861, 641, 4075, -332, -2775, 363, 1226, -709, 485, 1512, -1930, -2570, 2959, 3720, -3453, -4831, 3304, 5511, -2727, -5686, 1738, 5096, -797, -3911, -38, 2085, 349, 5, -115, -2104, -673, 3830, 1889, -4913, -3234]
618c234Q543q07r388l72R154J518p882k247N732K308l137j496M06j89J977K449
634C335l625m894M294P195m054q826L030R500j547r034O7P460J058m995j496K066
650d66J028R23L11l516k226N242M379n958o394N705P748m622q234L102P595j481
666C136n980J88L585M57p28l18k125n13M514J893o096l511O820M963o612n911
682f238N655O101m201n455K658L939j313j832M58o66k02L077N23n070j271O354
698B517K245o875l091O618L569n738l470M464K802l095j539J887j27j000J951
713A118N33l625m69M922O71n711r20N866J132n582j084M887O78l946M4K943j005
730D52k051K076J333l116p65L932L85m452o6M636k88m463P34M049j296l461J945
$$ y = [-3234, 5309, 4502, -4886, -5258, 3896, 5414, -2468, -4715, 1017, 3325, 188, -1308, -902, -1091, 886, 3335, -290, -5184, -890, 6305, 2251, -6575, -3545, 5955, 4408, -4626, -4559, 2901, 3959, -1036, -2532, -466, 562, 1485, 1796, -1720, -3946, 1296, 5675, -283, -6677, -972, 6776, 2154, -6080, -2978, 4617, 3136, -2844, -2656, 929, 1386, 658, 340, -1785, -2298, 2216, 4109, -1987, -5498, 1322, 6285, -327, -6238, -583, 5518, 1317, -4138, -1480, 2459, 1146, -686, -228, -894, -1096, 1981, 2504, -2566, -3837, 2517, 4762, -2113, -5204, 1414, 4983, -755, -4225, 239, 3041, -54, -1593, 294, 167, -833, 1118, 1651, -1974, -2443, 2479, 3150, -2561, -3481, 2385, 3517, -2065, -3149, 1738, 2416, -1530, -1486, 1457, 452, -1599, 477, 1810, -1306, -2071, 1861, 2246, -2206, -2272, 2364, 2076, -2387, -1653, 2396, 1100, -2361, -416]
747d16K848k639k266L263J727l734j257L951P78l885k60L564m00l050J185K445
763A854k069j882L023J454l878j168M544J032m845r87M763Q99m268o39L408J52
779A393k370O37J280j715l16K923l59m142O78N118o56n712L70N787K5n280l62
796b701M277M01k807o7J168o98M26J834j674l185K478M491k723n494K430O012
812D168j776n901R46N122k54l719j47J893M3P1N70j902j583L273K866m058m079
829d467M166N022l669n473K797N253j704m357P43K816q3q80p9j169l00L035J095
846B746m439k153N158L223n195m066M622M392l576m130K354L197j165j688K69
861d51j58J64K069o8l761m43M968J212n527j996N432K591m767k808L706K468k438
$$ y = [-416, 2432, -207, -2473, 790, 2517, -1217, -2474, 1477, 2255, -1630, -1890, 1674, 1274, -1776, -591, 1854, -215, -2097, 926, 2380, -1498, -2666, 1878, 2910, -1935, -2922, 1841, 2740, -1528, -2167, 1241, 1393, -977, -340, 940, -775, -1091, 1832, 1473, -2669, -1991, 3127, 2471, -3241, -2871, 2916, 2941, -2339, -2701, 1576, 1977, -830, -897, 271, -427, -1, 1833, 159, -3026, -548, 3943, 1220, -4274, -1844, 4168, 2392, -3509, -2563, 2559, 2305, -1414, -1561, 332, 375, 446, 1016, -886, -2469, 804, 3670, -388, -4467, -301, 4721, 1052, -4421, -1624, 3629, 1925, -2432, -1689, 1127, 1044, 164, 85, -1084, -1384, 1651, 2746, -1693, -3846, 1312, 4535, -660, -4726, -104, 4288, 712, -3418, -1064, 2133, 968, -720, -451, -609, -445, 1624, 1556, -2205, -2648, 2320, 3532, -1995, -3991, 1441, 4032, -735, -3543, 163, 2631, 193]
878A93j631J235L49k91J153k73k660L97L957j83m821k40N172P03m971j021M325
895A393J054l331p30K197N4j092Q82J97j977M30K998p45l796P78M266p01m313
912b436N66L965n28l316O45K464r71j529J464O55k033P4K591n81l021R53L226
929B188j166l177J324K894j489k423J718J804j991j173K311N65k606n1K793l73
945A148k835O91K695r93k367J304J878j659j283K068O80k502j29K913k62l235
961a888N33L380o83l250P41K872q30k227R72J410j261n00J673l65k225J065K781
978B198j509l275J673L586j615l562J354L220j043k521Q17J531p45l81R26p95
994a41j325J784J927k495k560K822L116k799l407K399L373j845k897J213K031
$$ y = [193, -1438, -203, 146, -145, 1008, 735, -1925, -1528, 2429, 2246, -2575, -2815, 2357, 3060, -1911, -2932, 1393, 2447, -884, -1614, 583, 637, -455, 427, 624, -1353, -923, 2075, 1330, -2466, -1688, 2578, 1877, -2436, -1870, 2095, 1567, -1749, -1104, 1360, 389, -1140, 324, 979, -1054, -980, 1611, 1030, -1991, -1038, 2188, 1022, -2155, -831, 2063, 574, -1849, -131, 1673, -318, -1491, 820, 1385, -1221, -1272, 1521, 1148, -1687, -996, 1699, 706, -1661, -357, 1521, -138, -1421, 647, 1327, -1175, -1304, 1609, 1347, -1888, -1355, 2025, 1342, -1908, -1167, 1705, 875, -1352, -380, 1030, -231, -731, 942, 577, -1648, -583, 2198, 689, -2586, -913, 2673, 1058, -2504, -1150, 2070, 1027, -1494, -677, 854, 109, -272, 654, -141, -1466, 318, 2245, -250, -2810, 12, 3128, 329, -3078, -679, 2694, 849, -2048, -835, 1196]
1009A196o96q48M20n07m34J823P62k892j317L591J974l830k510L605K800l018
1025A19k703K189K180j312j251N52K9p2J317q1k572j22L544N68m122j126M220
1042A357J598l846j841L097J773k151j282J136M74k59O26l49j800O34K884n88
1058A463l690K62M124J73m120n69L654P94k862p36J836L66q11L15j08j182P76
1075c15K088j131k883J184L439j006l646P25L474m47k943K98K157l35j231N94
1091B2L12j060N13J597j095k149J432K571j558k770J476K745j357k425J203J885
1107A342j114j211J156M71j310K52J527q54j739J294J922j556j985J674J877j707
1123C9j589J674J173j663o51J696P6j750M56J790q91j818J221J749j439j561J559
$$ y = [1196, 500, -348, 72, -435, -869, 954, 1716, -1176, -2493, 1098, 3072, -758, -3268, 337, 3137, 119, -2584, -395, 1785, 473, -778, -226, -197, -269, 1048, 967, -1605, -1727, 1817, 2385, -1737, -2863, 1357, 2955, -891, -2732, 365, 2138, -13, -1295, -159, 315, 56, 682, 333, -1467, -833, 2051, 1463, -2227, -1965, 2159, 2332, -1788, -2357, 1297, 2091, -771, -1507, 329, 695, -116, 199, 91, -1091, -315, 1773, 642, -2241, -1057, 2382, 1376, -2270, -1545, 1929, 1482, -1461, -1163, 994, 659, -572, 22, 334, -726, -213, 1384, 289, -1860, -428, 2143, 585, -2185, -709, 2036, 679, -1746, -543, 1342, 228, -983, 173, 644, -666, -414, 1113, 259, -1480, -186, 1736, 180, -1805, -131, 1746, 39, -1550, 124, 1297, -366, -1017, 679, 755, -995, -539, 1251, 360, -1458, -237, 1512, 73, -1488, 71]
1140G1J269j621q43J668L36j712J72J823o57j934J057J988j293j984J425J827
1156A592j419j556J359J084j261n17J223j40j276Q00J393j362j575J772J755j973
1172a01j877J978J859j781j642J480J213j135n92Q69j80p05R84P11j728q59K295
1189G89J085k603j349K649J501k419j478J955J223j399p39Q48M2l93P95J20j639
1206a012n3K371J76k869m27L063P31k938r39K519R80j875p75J126L35m26L38j75
1224A50j128N31J933o65k561N19K983k56l086n4K854L02k318l82J570K43p45J46
1242C6l2p18O70J365j070k001J219K497j123k765Q69K756o04k405L37J812k29
1259F14j044K66K58n24M99R16j104j363J477J792j602k098J539K207j325k062
$$ y = [71, 1340, -281, -1124, 544, 880, -832, -660, 1163, 506, -1428, -371, 1617, 324, -1660, -235, 1592, 173, -1383, -24, 1060, -201, -718, 505, 365, -911, -111, 1282, -80, -1655, 117, 1872, -101, -1978, 0, 1859, 78, -1564, -84, 1129, -6, -598, 271, 91, -614, 370, 1081, -647, -1506, 789, 1874, -729, -2078, 571, 2072, -347, -1825, 130, 1353, -46, -785, 63, 105, -288, 507, 627, -1012, -1065, 1306, 1482, -1387, -1814, 1249, 1980, -958, -1897, 622, 1602, -273, -1048, 78, 413, -13, 325, 150, -978, -447, 1486, 821, -1740, -1221, 1762, 1506, -1580, -1634, 1220, 1522, -796, -1178, 392, 635, -110, 36, 4, -714, -44, 1321, 251, -1750, -531, 1966, 843, -1922, -1053, 1703, 1099, -1306, -969, 843, 614, -430, -164, 94, -430, 69, 985, -119, -1482, -5, 1787, 185, -1913, -374, 1833, 508, -1554]
1275a554J050J691p86j139O23M77o18K34P36r01r39J366J205j676j404J761J501
1292A627j691j441J507J204j280q11J090K91r21K59Q77q07q67J243R15j555r24
1309a284J699Q90j702p91J624N68j488k37J292j32j154N41J021r24r08J213Q21
1326A049j397p46J501N92j475l86J396J00j266K47J129o06j025R58R53j232q83
1343a091J410Q24j497p02J440N21j310k54J112j10r26N42P58r62o59J350O27j648
1361e75o22J789O33j783n87J613M96j342k71R92p1o34N06L35r94j31J451M3j806
1380i58r0K039J56k051k65J874L38j553k56J070N9n64K79J22p24K49J214m65j662
1399a188N19J986m30k118K56K050q7j771j9J287Rp20J54J24m70M03Q66p87j301
$$ y = [-1554, -504, 1187, 401, -738, -115, 362, -256, -22, 714, -187, -1126, 240, 1445, -231, -1635, 126, 1627, -64, -1505, 2, 1206, -74, -885, 205, 496, -425, -166, 711, -96, -963, 280, 1195, -360, -1284, 415, 1305, -397, -1188, 436, 1004, -484, -721, 571, 439, -715, -174, 847, -77, -985, 228, 1049, -348, -1094, 407, 999, -476, -862, 534, 634, -632, -385, 744, 138, -887, 71, 1024, -208, -1091, 319, 1143, -354, -1056, 384, 905, -405, -659, 453, 343, -583, -41, 717, -245, -904, 446, 1073, -575, -1197, 592, 1225, -558, -1145, 468, 964, -378, -649, 343, 272, -362, 144, 479, -515, -646, 805, 848, -958, -1048, 991, 1147, -904, -1169, 705, 1043, -510, -766, 304, 363, -201, 78, 200, -524, -275, 939, 474, -1188, -669, 1317, 887, -1231, -975, 1075, 988, -783, -802, 485, 494, -226, -72, 52, -418, -15, 851, 64, -1237]
1418a237J010J673j038j915R09J963o75j813M54J457k66r29K03L16k89L07N07
1435F37q50q01J230J140j412j424J373J598j215j590R55J374o88r73M55M55l46
1452h2J29L53o89m72J146O80j446r04J586J050j512j109J339J017j078p74P89
1469B3L98n54O7M03n45l58R99L68j339m56J537N40j584n74J483N49j290m10J032
1488B89J58p47J74N04n16l64Q83K61j161k23J344J98j396j92J355J26j214j0J028
1507D97k12p73M25N72o84l86R26K43j091j61J205O5j207K2J142j38r87K94Q07
1526E59m98o05P14M27r32k77J081J74j186r5J211Nj131Q1R67k11p60L88N23o04
1546a69k87Q28J23j067J7J239q3j313R2J303r1j149J10R31j87o24K95L27n23j9
$$ y = [-1237, -227, 1446, 408, -1507, -598, 1365, 690, -1123, -669, 788, 522, -407, -204, 112, -177, 130, 637, -213, -1014, 216, 1356, -56, -1480, -107, 1491, 276, -1314, -359, 1015, 327, -646, -191, 264, -82, 47, 400, -289, -761, 385, 1065, -381, -1285, 301, 1351, -161, -1270, 69, 1086, 8, -766, 23, 421, -133, -66, 337, -208, -566, 433, 801, -538, -994, 543, 1083, -501, -1075, 408, 957, -333, -743, 289, 447, -300, -126, 378, -138, -502, 381, 642, -519, -742, 602, 800, -596, -788, 567, 693, -521, -531, 497, 285, -488, -63, 509, -175, -561, 365, 608, -483, -644, 561, 626, -581, -559, 583, 445, -542, -248, 559, 61, -544, 170, 597, -335, -612, 469, 643, -543, -638, 573, 578, -553, -472, 495, 284, -476, -88, 435, -169, -456, 372, 495, -572, -555, 684, 601, -712, -620, 683, 592, -557, -447, 484, 297, -327, -32, 295, -228, -247]
1566b47P66k16j025L68J212m10j361L87J386l35j256K51J013k10o66K41K68l50
1584a84J24N56m59q07P13J033q15j214Q13J298p13j255N46J060l69p55K67L43
1602A82k48J00L28n23m94Q50P01j055r00J097J059j022j092Q60R91o36p61M22
1620a41M16k58j0K05m34k29Q11L54j096n22J255O60j250p70J132P62r16o49O61
1639a9L97m03p2K24l09j16O96R0j004j55J230K54j303l55J255L91j082l60Q38
1658A97K39n64k6L09k67j07N62oq53M8J058k7j180j0J179N6j081l4Q67no29J12
1680a62M12l10j75N31j1p30J33Q79j84r79K08R92k14r25K24P68k73n66L40L42
1700C00m57j34N90l3p07J57Q00k41q54K99Q33l32p21L50N86m07l92M79K03n75
$$ y = [-247, 519, 303, -722, -354, 858, 448, -913, -526, 860, 525, -731, -480, 533, 323, -343, -102, 166, -184, -60, 496, 37, -770, -57, 976, 161, -1053, -240, 1058, 345, -910, -364, 696, 327, -428, -161, 182, -66, 34, 362, -161, -655, 195, 896, -159, -1059, 38, 1097, 75, -1017, -157, 834, 198, -563, -141, 275, 17, 7, 212, -222, -451, 360, 714, -382, -904, 351, 1011, -239, -1009, 123, 885, -31, -680, -19, 378, -25, -97, 127, -182, -298, 398, 488, -516, -671, 559, 813, -490, -845, 410, 801, -281, -641, 197, 436, -128, -154, 155, -112, -219, 343, 337, -516, -468, 590, 563, -617, -627, 552, 608, -473, -507, 360, 355, -274, -162, 250, -60, -235, 296, 285, -445, -312, 567, 383, -596, -388, 604, 390, -535, -311, 457, 184, -382, -42, 300, -157, -291, 299, 266, -441, -284, 516, 275, -579, -280, 553, 221, -500, -150, 436, 29, -363, 116, 319, -256]
1720b56j4O60j18p60K23Q06k88p88L17P14l35n82L55L99l99k04M89qn93J89P01
1741E08l19p82L90Q17m13p84L88P01l58n34L33L20l51o9M03j84m97M02N96n62
1761Eo87O35P42o26p39N52O80m64n15L71K87k79l9K80k52k99N02L81o97m87P96
1782A47N85q06o39P33O13o01n13M31L40k93q1J79j95j57M92J60p23k32R02L21
1802F63r53l98R02M40p69m02N86K94l79j07J88j34o1M18j3o77LQ78L1r68j20R59
1824C81K00q74k25P00J79m61q3K53j13n3L22q4n36J56P34j54q73J25R14o2q63
1845d17J5P21J3n26J1L23j18j06K51q8m24K24N83k89p14L01P80k81p55K26O77
1866D07j89n14J81L18k30j02K98q9l93K31N11l53n65L88O13m00n98L72N22l35
$$ y = [-256, -270, 390, 272, -488, -265, 541, 253, -535, -218, 496, 161, -421, -66, 333, -66, -270, 219, 211, -382, -193, 508, 189, -593, -203, 614, 201, -583, -195, 506, 148, -386, -53, 267, -84, -153, 250, 66, -431, -29, 567, 5, -682, -47, 695, 69, -670, -118, 562, 98, -417, -46, 241, -38, -77, 203, -49, -348, 154, 535, -162, -649, 147, 732, -74, -713, 20, 633, 32, -481, -50, 290, -3, -84, 95, -100, -257, 235, 395, -328, -560, 342, 663, -290, -688, 214, 654, -115, -517, 69, 363, -16, -123, 65, -69, -130, 288, 275, -402, -399, 479, 510, -458, -578, 381, 581, -293, -518, 182, 361, -100, -183, 70, -43, -96, 226, 142, -394, -238, 496, 342, -531, -406, 508, 446, -417, -402, 319, 332, -194, -183, 140, 22, -84, 167, 79, -345, -121, 462, 173, -541, -240, 540, 259, -496, -270, 407, 218, -296, -115, 203, -27, -129, 169, 80, -313, -82, 429, 76, -489, -101, 512, 112, -486, -114, 408, 73]
1886G3m01L08K34k98p3L45j05l92K46M48l42m74L94N04m23m62M03L79l70k64L58
1907H8J15l53L4L62j90l84K96M31l99m36M37M18m30l76M06K71l71j34L54k0l37
1928b18J79L38l14l58M27L79m77l94M97L71m53l24L93K30l34p9K60p8k41K57K31
1949B92m23k41N13K86n89l00N81L24n39k87M39K00l10q5K15p6j42K64J07m40q2
1970b93N65J15o57j52O72J87o14j98M93J64l49q8K19o6r1K53j9m07O1N56o3o57
1992c69J2P06K9o70n4N46R3m06n3K31l1q1J73p2l17J67M59k06n83K08O46j56o45
2015c73R2N81m9m52J8K89n1j06J28n3k43K13L54k86m69L22N31k99n64K55N21k00
2037A59m28J44K89j21j17J37n8k01K16K68l26l39L80M16l98m39L70M18l05l43
$$ y = [73, -328, -20, 214, -84, -157, 188, 83, -309, -63, 385, 43, -431, -37, 467, 44, -418, -15, 364, -6, -270, 88, 203, -150, -116, 246, 56, -328, -32, 399, 0, -436, 1, 419, -11, -387, 19, 290, -81, -215, 139, 119, -218, -39, 299, -15, -373, 54, 433, -44, -438, 59, 430, -23, -347, 46, 276, -58, -137, 123, 45, -196, 61, 292, -131, -372, 141, 427, -162, -462, 119, 443, -96, -383, 56, 256, -54, -139, 76, 0, -142, 122, 229, -211, -293, 272, 387, -270, -422, 250, 437, -177, -375, 118, 282, -67, -155, 64, -2, -93, 160, 141, -266, -205, 351, 288, -369, -357, 349, 378, -292, -346, 200, 293, -113, -166, 65, 34, -47, 126, 54, -263, -96, 363, 157, -426, -218, 428, 272, -373, -281, 300, 251, -201, -183, 106, 55, -51, 77, 24, -219, -6, 348, 62, -407, -85, 446, 147, -417, -162, 359, 159, -269, -125, 164, 43, -74, 63, 5, -196, 20, 288, -38, -377, 3, 419, 21, -418, -48, 370, 65, -278]
2057b78K49K21j92r8J74l9j76J75K18l03k59L85K85m20l10M04L03l63k56L10J61
2078A91k51n1K14q5j90K15J78l04j91L75K14m02k24L99J98l62j39L08N9k65N1
2099f2K14j53j77K55J55l45j56L96J59m04j54L94J16l47n3K73rk15J17J47k10
2120e9j19L00J02l76r6M12J16m24j11L89P3l12l5K45m8j64J37Q7k33m1L37J8m07
2143b09k6M48M2m46m1M05L6l24j5K25m1j22J26K6k31O2L10q1m12J04M36o8m66
2166b62N1M32l5l45J9K36m7j05R5j6j64J13K65j81l41J96L99j80m34J61M18j19
2188A56l48Q8K43o5j20P7j8j18J31J89k40k56K81L14k79l65K58L73k25l18J60
2209h2K27r5j40J04j2q5J36J18k47j59L15K19l43k67L44K64k77k77K35K10j77
$$ y = [-278, -29, 192, 0, -98, 76, 37, -139, 36, 254, -49, -308, 77, 362, -58, -368, 36, 339, -24, -280, 30, 191, -60, -111, 103, 18, -172, 43, 221, -83, -274, 101, 315, -87, -311, 88, 286, -76, -215, 93, 152, -113, -62, 152, -1, -178, 77, 232, -113, -269, 127, 286, -118, -272, 122, 238, -109, -162, 111, 102, -113, 4, 151, -59, -178, 122, 224, -152, -248, 164, 280, -144, -255, 134, 207, -105, -140, 105, 57, -107, 30, 117, -116, -157, 180, 198, -209, -235, 213, 255, -191, -232, 173, 209, -115, -130, 95, 54, -68, 58, 84, -147, -85, 225, 144, -268, -164, 272, 204, -262, -211, 221, 186, -159, -140, 96, 49, -56, 39, 23, -141, -28, 237, 56, -285, -89, 310, 130, -304, -143, 275, 156, -192, -104, 139, 74, -46, 31, 13, -105, 26, 215, -25, -281, 0, 314, 35, -330, -72, 301, 76, -242, -82, 145, 50, -90, 14, 2, -83, 53, 171, -76, -235, 80, 299, -44, -311, 33, 297, 20, -257, -22, 188, 11]
2230A1j04J06Mq1J15P6k19r2L03J20l52j57L58J77l25j74K74J43k02q0J40k3q5
2253f7J20N9k14n9K93O1l42p3L51R2l27r2K90N0k19kJ45n7q3J31M8k07k6K80J9
2278A71l20j8L33J6l11j2K58qk05M8J36r4p6J52K8k24KK69j0l02QL14j9k71J5
2303a20K37m0j66P8R3j07m0J73j4k33N7K63n9l04P2K87n9k57M8K15p7j34R0O0
2327F3j19jJ65o5k10J09K50j21k78J18K95j12k53Q6J93o3j31Q5L2j10N5J33j04
2350A7j84J62K20j78k59J66K77j54k45J21J88r5j07O8K4p5P3J02j43j37K05J61
2372B07k32j98K25K29k09k20J75J76j24j13P7L6p3P7M9j55o0K24Q6k57j34K75
2394F1J56k51j56K03J45j44j00J06K4n9N0K2j36k0K13K3k47n9K81P8k71j03K44
$$ y = [11, -93, 13, 17, -64, 51, 127, -92, -184, 119, 239, -113, -270, 88, 265, -60, -234, 40, 183, -19, -99, 41, 18, -67, 53, 112, -102, -161, 132, 193, -149, -222, 129, 221, -106, -198, 92, 142, -77, -79, 66, 9, -74, 57, 105, -102, -128, 152, 171, -149, -167, 166, 182, -129, -141, 117, 109, -96, -48, 88, -6, -82, 70, 98, -126, -124, 145, 135, -167, -159, 155, 136, -135, -120, 117, 77, -89, -11, 82, -25, -65, 108, 94, -139, -82, 181, 122, -182, -110, 177, 118, -139, -91, 124, 47, -87, 3, 63, -56, -57, 108, 43, -167, -58, 192, 71, -207, -89, 206, 94, -159, -73, 120, 57, -74, 11, 43, -67, -12, 121, 17, -167, -5, 215, 37, -222, -56, 221, 67, -178, -57, 131, 36, -71, -3, 21, -54, 19, 121, -22, -159, 46, 207, -25, -223, 2, 231, 22, -198, -23, 153, 29, -84, -7, 29, -44, 33, 82, -73, -133, 91, 177, -80, -214, 61, 217, -34, -190, 13, 158, 14, -86, 20, 44, -15, 35, 57, -79, -99, 114, 137, -110, -169, 112, 190, -81, -184, 60]
2417F0Q9j80o5J16Pn5M7%j00J0J89j7k45J3K68Nk60k0K45L0k08pJ28ro9N6K1j23
2445g4L6J64n5k09M8K45n0k45L5K16j5j87J9J28l7n8O2J4j13M4J35n6j89Q2K12
2470A52q0k14P3J90n4j63O0J04o4l3O9mj12O2J33r0j75J06J85j06j83J06J55r1
2494B6j18P3Q0p8j0P8k5j13Q2J27j15j53J31J58j32j45J00J51j02r7O3N9n6RO6
2519E9o5r1J16J06j43j17J57J33j50j37J30J21j12q7Q5M9o0KN4p5m6J25O1j75
2543f0q0J83J02j73j25J63R8j25p2P9M6n2K4J9o8j7J28L3j74m8K03O1k09o5J74
2568D5Q1j43o8J05K6n2MK8p0J5J16j7j70jJ90J3k01k4J94K9j54l4J18K3o4J1K5
2595B5n5K1Q7l1j47M8J69l2j85J7J87nj65%J21j0o6J4Rn0M2Q0n7j21Q0J47p4j66
$$ y = [60, 149, -31, -96, 20, 27, -28, 19, 19, -81, -71, 118, 101, -144, -131, 137, 142, -118, -138, 107, 137, -71, -78, 50, 41, -28, 28, 49, -74, -38, 126, 71, -138, -90, 155, 105, -140, -105, 111, 96, -91, -72, 56, 19, -39, 23, 37, -76, -32, 103, 47, -142, -60, 152, 72, -142, -69, 121, 67, -96, -36, 68, 4, -29, 40, 36, -76, -14, 119, 29, -146, -40, 145, 39, -144, -38, 117, 26, -92, -19, 61, -17, -27, 51, 26, -87, -5, 122, 7, -146, -15, 143, 11, -134, -34, 117, 15, -82, -19, 40, -16, -7, 59, -6, -97, 19, 125, -18, -135, 22, 155, 5, -132, -2, 119, 7, -80, 5, 54, -6, -4, 50, -25, -71, 54, 115, -60, -140, 43, 145, -28, -153, 10, 108, -17, -89, -10, 36, -16, 8, 27, -41, -58, 70, 103, -71, -119, 84, 145, -64, -129, 45, 126, -17, -85, 20, 46, -6, -2, 26, -44, -29, 87, 70, -100, -101, 89, 102, -99, -123, 71, 100, -54, -88, 30, 53, -11, 0, 25, -30, -9, 78, 47, -100, -52, 117, 85, -100, -83, 104, 99, -66, -66, 55, 45, -21, -7, 2, -48, -6, 74, 17, -104, -24, 123, 49, -117]
2623a17O4J63m2j58L1J16k3o1J8K2m8K9P6p7q7Q4J24j04j38J00J41p2j34O0J07
2648G4n1n5K9K1l8L7M6p1p9J03J00j20j08J13J12j00j02P6P7n9m3M8j1m0M5N3
2674E7q7n9J15P5j29p4J14Q9j06p4P7O8p0k1N1j5k8L8L7p3o2J27M5j13p8J23P5
2701A02j27n5R6L3o3j6M6l1j5N6K0q8k2J26J7j31m1J46K6r6n3R2L1n8qK7k0j0
2729a6O0nr9OJ33j0j36JJ34Lj14k6R6L0q0J0K8k7OM6k3r3K9J27l7j30K2J37j6
2758E6j13oR7Qo0oL4k4J1M2k0q9O2J01o8j13N0J29l9j19K6J05k3n9jL6k6K7K5
2787D3m6o2P3Q2j01p6P2J10p1j02M5P8k4p3K8K5mPK1n1l2P6O2q5q2R8P7q0q3P4
2817aO5m8n2L3K7l4K2J9n4j7O0L8p4o6J02O0r1p3Q8M4m4m8M1J7k3J2J7m0k1P7
$$ y = [-117, -53, 110, 68, -90, -59, 57, 34, -27, -9, 13, -35, -6, 70, -7, -94, -10, 114, 10, -128, -28, 113, 41, -93, -33, 74, 23, -32, -3, 18, -20, 17, 63, -8, -87, 16, 116, -4, -112, 1, 113, 13, -89, -13, 64, 5, -38, 10, -1, -41, 4, 57, -30, -89, 26, 101, -28, -102, 12, 101, -5, -79, -2, 66, -4, -25, 26, 11, -17, 21, 58, -15, -77, 50, 95, -18, -96, 27, 102, -25, -80, 16, 49, -14, -30, 16, -15, -30, 26, 46, -42, -64, 62, 79, -52, -93, 53, 79, -17, -70, 22, 53, -5, -13, 14, -6, -16, 44, 39, -60, -54, 79, 69, -67, -66, 68, 71, -43, -69, 27, 57, -23, -13, 15, -12, -6, 40, 17, -76, -47, 80, 43, -87, -65, 72, 56, -57, -63, 34, 42, -18, -24, 10, -14, -3, 39, 19, -70, -8, 93, 25, -88, -38, 91, 52, -67, -41, 64, 41, -18, -19, 17, -9, 18, 43, -3, -65, 8, 90, -11, -87, -15, 95, 24, -78, -33, 45, 21, -52, -24, 1, -3, 4, 25, -26, -58, 18, 80, -5, -87, 11, 88, 8, -75, -1, 64, 16, -36, -3, 24, -10, 12, 31, -23, -40, 20, 58, -16, -82, 20, 80, -11, -84, 4, 48, 4, -44, -3, 14, -9, 3, 20, -20, -41, 36]
2847C6J8q8k9R5M7j03m0Q2L7n8k8M1Qj9J0%l5j1Q2Mr1qQ9K8j00l1Q5K2n8j1L4
2878Hj1qK7nn3K2N8lr4J3J01pq1k5R4Kn6qL4jk0L6j7m4K9O2k7q3K2J01k0r4PQ5
2912D4qn5lK5PpJ5k4l5K8O7m8p3N0P2l1q4J9P6qm8qL2Oj1J7k4k4M6L0m1m9N8O2
2946G3m9p3L4O9k3o2J9L1mj4K1l4k3N2L2o8l6N9N4n3p3N9N9l6n1K0L7j1j1Lj4
2977a3mM7Mm8l7P5L8o8n5N6O4n8l2K9K0j1j5J4k6OM2J0p0j0P1K3p0k3O3K6n9l1
3009d2N2Kj0kmrnM5Mo5MO3J4o7k5P2J4m2k6M2J7k7Pkj6J3L4k2m6J0O0qo5nN4J9
3045C8n8JK0Rj3j3Nj8K8K4j2l6K0M6%q3J3O1Kn2JL9Mk3nJ0k0J7L2m5k5L2N4l7
3079A6o1K9N4j1n1MK4J0k5J1mj5K6J1k7l8M5M4l8n0L6O0l6l8J3L9j6j7J3j5mJ2
$$ y = [36, 54, -34, -63, 32, 79, -24, -64, 18, 55, -3, -31, 10, 18, -1, 9, 9, -26, -37, 45, 49, -42, -50, 39, 67, -33, -64, 21, 43, -15, -26, 8, -3, -11, 16, 11, -42, -20, 38, 35, -59, -46, 55, 48, -33, -58, 36, 38, -18, -26, 8, 7, -13, 23, 6, -38, -9, 53, 26, -57, -35, 66, 46, -48, -41, 44, 36, -19, -22, 3, 10, 3, 18, -6, -41, -13, 54, 6, -67, -17, 55, 24, -60, -41, 35, 27, -21, -29, 3, 9, -2, 15, -9, -33, 13, 43, 2, -47, 11, 73, 24, -49, -15, 54, 31, -31, -12, 19, 15, 1, 22, -12, -35, 17, 49, -19, -55, 4, 58, 5, -68, -9, 50, 14, -37, -17, 20, 9, -2, 1, -13, -17, 30, 34, -14, -51, 24, 62, -6, -61, -5, 59, 1, -31, -2, 18, 7, -8, 6, -20, -14, 28, 38, -32, -42, 29, 52, -18, -41, 22, 48, -11, -42, 10, 12, 2, 0, -4, -13, -18, 27, 31, -34, -30, 33, 47, -20, -45, 27, 41, -1, -27, 15, 32, 5, 12, 10, -6, 7, 41, 19, -27, -17, 43, 35, -30, -35, 19, 38, -20, -19, 1, 10, -3, -16, -11, -29, -1, 23, 11, -25, -5, 41, 41, -42, -29, 32, 34, -18, -17, 22, 26, 3, -2, 8, -12, 5, 37, -8, -33, -1, 53, 16, -45, -16, 38, 27, -24, -20, 4, 14, -11, 0, -4, -19, 7, 18, -9, -47, -2, 42, 4, -46, -10, 50, 14, -24, -11, 28, 12, -5, 8, -7, -11, 1]
3111AK0l4k0N0K5n8k6L8M7l7l0K4J3ml%plQJ1l7mM7J4m9l3M5L7l7l3K4L1j1po
3146djLK9j4k0j4N0Om8k4N0L2n2j8K9J9j2j3nlJ5Mok8J4L7j2m6%N2Pm1qK4L1k2
3182A1k3J1LLK7k5j9nM4nm4LN0Km4LK4Pj9j9K4kQJj7j5K0L0k6m2J4M7j3k1qL1
3218A6Nk4j%nJ1J5k6j0K5J0j6l1J1N1j3l6OM0j2j5qJ0jNmpj5J9K4k6k5K1L4j3
3253A5l1JL6nk0j1J4j0J9pj8%K6J6l6k0L1K5j8l3K5K0j3j2MjOK2j0k4LL1Kk0k1
3288a4K9K0l5k3K9Pj5o%J4Nj1pj7J0L4ol7qM3Lj7k1K4K3j6k4J9J3j1J0mj2jK0
3323A8Kl7%K9J3k7k5L4Pj9rRPMj4mqJ9J9j7k0RK8%k9pK3J1k1j3K7MOlj4rJ6J8
3361B7k3k6K5K4j2l4KM2rj1j7K2qRj2j1oJ0L3l3j1K0K4l1j9QL3rj7j1J5NKOk3
$$ y = [1, 21, -13, -33, 17, 42, -16, -42, -4, 43, 6, -24, 0, 13, 9, 6, 6, -1, -4, 4, 15, -22, -26, 21, 35, -14, -47, -2, 35, -2, -35, -11, 20, 9, 2, -4, -5, -2, 27, 13, -7, -21, 29, 35, -13, -37, 13, 45, -7, -25, 4, 23, 11, -2, -7, -10, 5, 9, 3, -25, -11, 26, 14, -32, -32, 20, 27, -14, -22, 2, 33, 11, -12, -1, 2, 5, 32, 7, -12, -17, 27, 22, -22, -19, 31, 33, -11, -8, 16, 23, 4, -15, 9, 7, 15, 16, -1, -16, 4, 34, 8, -34, -20, 27, 14, -7, -15, 16, 21, -3, -4, -4, -9, 2, 17, -9, -19, 6, 16, 0, -31, -20, 31, 18, -18, -12, 28, 16, 1, -7, 3, 2, 7, 3, -4, -19, 0, 24, -2, -27, -6, 28, 15, -16, -15, 21, 16, -4, -15, -1, -11, 8, 1, -17, -17, 9, 25, -11, -31, 0, 25, 7, -26, -1, 19, 6, -6, -2, -3, 3, 25, 15, -9, -6, 25, 27, 7, -14, 15, 35, 0, -23, 6, 13, -2, -8, -8, 6, 11, 0, -7, -24, -14, 20, 14, -23, -31, 12, 15, -2, -23, 1, 24, 8, -16, 3, 16, 5, 15, 11, -1, -2, 18, 20, -17, -17, 12, 25, -2, -27, 7, 14, -5, -14, -5, 2, 6, -8, -12, -20, -1, 18, 1, -19, -10, 18, 18, -11, -18, 5, 16, -5, -18, 9, 13, 19, 16, 2, -7, 9, 27, 4, -22, 3, 27, 15, -19, -17, 25, 16, 5, -12, 10, 2, 11, -1, -12, -18, -8, 25, -8, -19, 1, 25, -6, -25, -17, 16, 7, -10, -21, -6, -1, 1, 7, -16]
3396a6QJ3J1k4j8K9J5k7oRK1mk0JJ8Kkqj5OK0Ok1j4K6Qj6j9J6J9rk2nK4j0Oj0
3433hnJ1J7qj8NK4J1k9j6J9K7j6j2%MQmj0rJ0J5j0j3KK3Mk6rJ6Rj7qJJ8Jj4Mj3
3472a6K1Oj0j3jL1pj1j1K3J0k0k5K7NkOj5lMRjj0kK7nl0kK7lk2KJ0J7j2rlKJ8
3511A2jk8kJ5K1rk5J3J4%j9j1K9Mj2%rNJ8Kj7j8J5K8j9k6J9J8jk5lJ9J2jj9nM
3548bJ3%j7j5K0J1j6j4QL2j7nj6K4Nnj0%RM%k0jK5J4k9nJ1J0j0j4KJ0Rj5loQJ7
3587A2kj7pL1j2j8%J3Npj1PJ7j1OmlOQj3lKJ9ok6RK0%j5j3J3M%qL%J5j1jJrL1
3629B5j5k2mK7J1k8nJ2Njqj2J0LonlOJ8kk0J5J1Rk3j0J5J0pj5%RJ7nj7oJ5Mj3
3668ejjJ6kj9oJ5jj1J4k0J9Qrkj1J6J2k0rRK3j3krJ1mQ%mQMj4MlJ6qj2rLJ7jk5
$$ y = [-16, -8, 5, 16, -8, -26, 3, 18, -9, -15, -6, 15, 11, -9, -8, 10, 12, 10, 2, -13, -7, 13, 19, -2, -16, 10, 18, 2, -17, -1, 18, 9, -13, -18, 6, -4, 2, -8, -13, -2, 15, 7, -11, -6, 18, 29, 0, -16, 3, 30, 14, 2, 2, 6, 14, 10, 0, -9, 1, 16, 6, -7, -5, 18, 22, -4, -13, 3, 12, -5, -13, -12, 6, 7, -7, -3, -16, 5, 11, 1, -12, -13, 18, 11, 0, -11, 12, 22, 2, -23, 4, 9, 7, 13, -2, -5, -1, 8, 7, -3, -5, 22, 17, -13, -15, 12, 9, -13, -11, -1, 16, 4, -5, -8, -6, 12, 11, -17, -19, -4, 17, 8, -17, -4, 10, 10, -9, -20, 9, 13, 1, 1, -8, -3, 15, 17, 0, -18, -3, 25, 6, -20, -1, 17, 16, -9, -12, 7, 19, 18, -1, -6, -2, 11, 11, -6, -21, -1, 10, -6, -20, -12, 20, 3, -2, -18, 6, 11, 6, -4, -4, 5, 9, 9, -11, -12, 13, 27, -2, -7, 4, 14, 4, -10, -8, 2, 11, -4, -7, -13, -5, 12, 10, -7, -14, 17, 5, -13, -13, 0, 5, -2, -13, -6, 11, 0, 6, 2, -1, 5, 13, 0, -3, -1, 18, 12, -14, -5, 15, 15, 0, -13, 0, 4, 4, -4, -1, -1, 14, 3, 2, 3, -6, 25, 10, -12, -16, 11, 22, -6, -11, 1, 6, 5, -3, -15, -5, -2, -8, -13, -16, -10, 8, 6, -14, 1, 12, 21, -2, -12, 3, 13, 6, -9, -9, 0, 17, 12, -5, -11, 4, 8, -5, -6, -7, 9, 7, -12, -18, -3, -4, -15, -1, -21, -2, 6, -3, -5, -16, 0, 12, -8, -17, -8, 15, 2, 0, -9, 2, -2, 6, 6, 2, 10, 14, 0, 4, 1, 17, 9, -3, -12, -9, 8, 7, -18]
3711a8JK4Lj4%%JjRk3RJ0Lmj5J9Jnj5RPJ6j7M%NKKk9J3J8pj7LJ3J1k2rJ2J2pj0
3753fNqK3j2j1pJ3Knj1J7PPj9pJ0KNqnNJ4j3j0J6MOnj2NJjNmJ3Jj1j5QQK%j0m
3797eJ0J1j3j0%OPokmLNj0oJ5LknkJ9lj6kQJ0Kj9LOJ1j6kOkJ0oj4QROk5kNJ0Q
3842Ik0jK4pj0K%KJ2lj3RLkj0NpJ8qjJLRoj3J1J5pj0j0J4nplJJ2mojpJ9pj7MM
3887hOOj1jJ9mj0j2OQJ2j6LO%n%lJ3kKj0kQkKKlOKj3lJRjj0lJJ6oj6LMJ7j3%J
3934anJ3j6%J5Qj2j0jJ5KoNlMm%j2J4OmmKmkPp%Mo%j%jJKj2J2LNqJPNmj2PjLp
3984bPl%MpmJ3Nk0oJ5J0Kj7OOolKj2J6Nqj3JJ8lj3lRJ0j2NnMMJj3MPoPJmkJ7j9
4031bMJ1Jj0pJ0j4J3Lj3JLJlkJQrqqQJ3rj0J2Plj4KJ4LoomJ7jj0mjJ6MpPMmJl
$$ y = [-18, -17, 7, 10, -4, -4, -4, -3, -4, 5, -18, -9, 1, 4, 0, -15, 4, 5, 0, -15, -6, 1, 17, 0, 4, 4, 9, 11, 13, -16, -3, 15, 8, -9, -6, 7, 18, -4, -13, -1, 11, 4, -6, -1, -9, 14, 2, -9, -16, -3, -1, -6, -17, 0, 7, 14, -5, -12, -2, 0, 5, -3, -8, -3, 11, -2, -12, 4, 8, 14, 9, -3, 2, 3, 2, 7, 3, 16, 17, 6, -9, -1, 7, 9, 9, -1, -5, 5, 16, 3, -7, -7, -1, 6, 0, -2, -6, -3, 2, -8, -14, 1, 4, 2, -3, -5, 14, 11, -5, -7, 1, 11, 13, -6, -3, 3, 14, -2, -4, 2, 0, 10, 4, -10, -2, 7, 13, -12, -14, -9, 1, 9, -11, -12, 12, 5, -5, -3, -3, -1, 11, 8, -5, 4, 7, 5, -5, 0, -7, 11, 3, 2, 3, 6, 15, 9, -4, 7, 22, 15, 5, -5, 9, 4, -3, -6, -5, 7, 3, -3, -4, -11, 8, 1, -16, -12, -8, -2, 4, -7, -8, 11, 7, -3, -15, -9, -1, 11, -5, -2, 4, 4, -1, -1, -4, 9, 7, 9, -1, -3, 5, 3, 5, 7, 4, 10, 12, -1, -4, -3, 6, 5, -5, -8, -7, 9, 3, -13, -10, -6, 11, -2, -2, -1, -6, 7, -9, -9, 6, 14, 2, -8, -9, 6, 8, 2, 7, 4, 8, 4, 4, -8, 6, 12, 8, 4, 6, 2, 0, 7, 0, 0, 4, -2, -2, -3, -3, -4, -3, -1, -13, -1, 2, 7, -1, 0, 7, 12, 8, -4, 3, 2, 5, -2, 5, 2, 2, 6, -1, -5, 8, 13, -7, -13, 2, 12, 14, -3, 3, 9, 3, 0, 2, -10, 6, 11, 3, -10, -9, 9, 6, -7, -10, -1, 9, -3, 2, -3, 1, 5, 6, -7, -3, 4, -2, 5, 6, 2, 0, 17, -2, 2, 13, 14, 4, -3, 7, -7, 6, 9, -4, -3, 0, 1, -2, -4, -3, 5, -4, -12, -20, -12, 1, -8, -18, -6, 1, -2, -16, -14, 0, 3, -3, -9, -13, 4, 3, -7, -11, -12, 4, 8, 1, 8, 12, 8, 9, 6]
4078FmOnOj0KkJnPn%KkknOMj1OQKJj5kJ0J1j6PJmLjlMJJ0plLlljkJ3j3JnNPlk
4130anNJ0q%nRnommJ4j0MKMKjj0LK%mj2K1J6j0jj6J7Pokj2QMmJoPLj0KpRNj6l
4178a3J1KppOQMoj1NPRj0mJ8rmj0J1lJ4j4lJ3oJ1rj1J5n%OnjMoj1MPJ%j2MPpJ1
4224Dj2QoRj1JkJ7j0nNPkpRlRj0J1j0M%ljoJ8qpj1NJ7lpJlPj1kJJ1LnpJkOKj3
4272a1J3%pLj0K0qmJ3lNlLj9RMQj8NmRr%nJ4lmKj0LJ2j1kJJjJ0rJOnj%KNrONr
4321eK0j4j2J6oJ8j5NOjj0j0jJ2KqMkOlLr%Mj3J0j4MPJqRKNnOjkJkmJ2%n%mQk
4369ELokJ0NrmnJ6krkLmJj9J3JMlKKMLknLMpqLNMMj5J6nNLj3J3llj0J7mn%Kj1
4419ePjJllJ9k1NoJ6oJqPoOj4kJ2LqlJ0LQqjJ0lJmlJ%PLj4J3mrj0QKlOj0J1kJ1
$$ y = [6, 2, 8, 3, 9, -1, 1, -1, 0, -5, 2, -3, -3, -1, -3, -5, -10, -4, 0, -11, -5, 3, 5, 6, -9, -11, -1, 10, -6, 1, 2, -2, 1, 0, -3, 1, 2, 12, 5, 2, 5, 2, -1, -2, -4, 9, -4, -3, -8, -3, 4, 1, -1, -6, -1, 9, 1, 1, -4, 5, 0, -6, -10, -14, 0, -10, -6, -4, 0, 2, 1, -9, -6, -4, -4, -8, -20, 1, 17, 7, 6, -10, 7, 14, 8, 6, -6, 2, 6, 2, 3, -3, 4, 7, -3, -1, -8, 1, 6, -10, -13, -2, 0, -7, -14, -8, 0, 4, -2, -13, -8, -1, 8, -2, -6, 12, 3, -1, -11, 0, -3, 11, -3, -6, 7, 1, 12, 3, -8, 7, 2, 2, 8, 3, 2, 6, 0, -11, -7, 0, 1, 1, -11, -7, 0, -7, 4, -8, 0, -6, 3, -8, -7, -9, 8, -2, -7, -2, 5, 3, -4, 5, 2, 11, 1, 12, 2, 6, 6, 3, 2, -4, 14, 6, -1, -12, -7, 10, 7, 0, 1, -2, 5, -6, -8, -7, 4, 7, 2, -5, -4, -6, 0, 2, -11, 2, 2, -5, -2, -12, 8, 0, -4, 9, 6, 11, 8, 11, -8, 1, 5, 13, -5, 0, -4, 5, -4, -4, -9, 5, 2, -2, 0, -10, -7, 5, -6, -8, -7, -6, -7, 3, -6, -5, 1, -4, -5, -5, -3, 2, -7, -1, 4, -5, 15, 1, -11, 5, -1, 17, 2, 7, 13, 12, 2, -8, -9, 3, 5, -3, 1, -1, 5, 2, 5, -4, -4, 0, -13, -3, -17, -13, -6, -5, -13, -4, -2, 3, -2, 4, 3, 1, 2, 0, -4, 8, 8, 3, 3, -1, 7, 5, 8, 2, 0, 10, 15, 6, 2, -3, 13, 11, 2, 0, 3, -1, 0, -19, -6, -5, -1, -4, -2, 0, 4, 7, 5, 0, 3, 7, 0, -8, -5, 0, 4, 8, -7, 9, 4, 9, 12, -1, 12, 9, 6, -4, 13, 9, 4, 4, 6, -5, 2, 1, 2, -1, -4, 15, -6, -1, -7, 9, 3, 4, -4, 3, -3, 3, -11, -13, -1, 2, -6, -9, 1, 4, 12, 4, 3, 13, 10, 11, 7, 4, 5, 5, 12, 15, 1, 14, 10, 1, -9, -1, 1, -2, 4, -6, 5, 3, 14]
4468A4k2PLj2PJjMKJnOkOj7NJKLmMjMnLklJ3JnlJlqOKOolPPk2J3j2J0%lQj1JP
4519Ej0qJ6%J4j4j0kJ1JkMkJ2krqKRoJ0qjQPqj4M%%mKOmk%Rj2jLkKjLKMJj5Nq
4569a3J0kJ8j1lLnKLKj1K2j5ONj8kJ2JrMJ1pjNj1mKLMOrLj5NJ2Jp%NJlmLKJlJ1
4617A0njmjKoRnMNj3Nm%OqnJ6j5J2qMQqLpQkllKJ0j3J7j1KkmJ0Jm%pJ1nmJ8qJ
4666HqJKMknPpKkkJ6j8%JL%oMJ%MkpkJ4JPj6LJkJ0mLjjLnJ0j2J4j8J2nkmkqJ5
4716Ep%MomNjQpONj0JnJ2jj4RQqNrNOnj0ONoPj0MJ0j0KlNNmoLLj2J3pkNmPrNN
4768DmKrMj1J7lMjq%OlRr%Mk%Nl%LLnJo%nRkmlQnLolNj2OJ0lJKnlQj%OJLOj6Q
4824FlQoqRpLrKPnkkLLo%MkLJ1j0j%J0qj1J4j4J6ppJ5pNmJ2%j1MqO%NjJrOKo%
$$ y = [14, -8, -1, 2, -10, -3, -2, -3, 1, 3, 4, -1, 5, 3, 9, -8, -3, -2, 0, 3, -1, 3, 2, 6, 1, 4, 2, -1, 12, 13, 8, 5, 6, 3, -5, 1, 3, 9, 3, 0, 7, 14, -8, 5, -7, 3, 3, 0, 8, -3, -2, 5, -5, -13, 3, 3, 17, 3, -7, -9, 2, 3, 1, 5, 3, 15, 13, 4, -4, -2, 7, 1, 11, 3, 2, 10, 17, 9, -5, -1, -1, -1, -5, -3, 3, -1, -3, -3, 6, -6, -7, -4, -6, -4, -5, -2, 0, 4, 5, -10, -5, -13, -3, -5, 13, 2, -1, 2, -3, -1, 2, 4, -7, 15, 0, 6, 11, -7, -9, 3, 4, -5, -1, 10, 3, 2, 7, -4, -8, -6, -3, 1, 7, -2, 1, -14, -9, 3, 4, -3, -3, 2, 3, 0, -4, -1, 1, 2, -1, 10, 5, 4, 0, -1, 1, -5, 4, -1, 3, 8, -5, 0, -4, -4, 2, -6, -11, 5, -10, 2, -6, -2, 6, -2, 1, -6, 2, 0, -3, -6, -4, 6, -7, 10, -1, 1, -1, -5, 5, 6, 2, 2, -5, 6, 1, -3, 15, 7, 8, 0, 1, 3, 7, 5, 0, 7, 0, 2, 0, -2, 14, -4, -4, -3, 0, 0, -6, -2, -1, -1, 3, 1, -6, -8, 6, 7, 14, -2, 1, 2, 0, 10, 6, 9, 8, 7, 10, 5, 15, 3, 17, -1, 11, 6, 4, 0, -2, -10, 5, -2, -2, 2, -4, -8, -3, -4, 4, -3, 3, 8, -2, -1, -6, 6, 5, -9, 0, 8, 0, 5, -4, 1, 7, 2, -8, -2, 3, -3, 4, -6, -2, 8, -2, 0, -3, 2, 7, 3, -3, 0, 3, -9, 4, -3, -5, 0, -4, 3, -6, -1, 4, 0, 2, -7, -3, -14, 3, 0, 4, 3, -5, -5, 1, -2, 7, -2, -2, 2, 0, 0, 5, 2, 2, 5, 8, 3, 4, -2, -2, -7, 2, 0, -4, -7, 1, -4, -1, -7, -10, -5, -17, -11, -1, -4, -3, -1, -6, -9, -1, -2, -2, 4, 5, 8, 14, -2, 6, 3, 11, 5, -3, 6, -1, 2, -7, -5, 2, -3, -5, -7, -4, -1, -7, -7, -3, -5, -2, 9, -1, -2, -2, 8, 0, -11, 3, -11, 5, -2, -9, 6, -1, 4, 0, 12, 12, 1, 5, -3, 3, 3, 8, 7, 8, -1, 5, 7, 1, 1]
4875AKRmrj%J1j3NOrLoQkJ1j4jjJRoK%LKLj2KJ2plJj0RjkLOmlm%%O%NqQr%mlM
4929dKQjj3J0oj0QOjqRLJQj9%J7j1JNNllpMRj1LPpLkJ4k7J4j2J0KpJN%pqJ5mM
4977CoR%jnjJ5kj3MJMkPj0kKLNmjkkkJ2pnQmL%j0OJrlRllNjJJnJ2pkoMkPmJ0r
5031aJnQjkjlNnPPmj4JOkPNjqLpLnkPjj0J1%mLoM%Pj4J1LnqNPJj0J0rPMJmJ0o
5084Fn%lOnmJ1%rRmrkMnpLjJ3ojKQm%nJ2nrPjOqJ8j9J5KoNmj4J1j1RNnRqlOnQ
5136GmKqnKJjMLpJnKRjqMJ1lMj4JQj0NPmOMoj1PKLJ1j8KJ1oj1%Pj0jJ1j0KlRm
5186dm%J4j0KQk0J4kMjNNj0JJ7j3%LrJJ0ljMrKj7K1moKkJLMpJNokpJ6qPjPrmJ3
5236A1lj3JORKj5ML%kNjJnLoNkmoNRrKnNLlj4J2oQj6KRjPj1NJkoPRPorQKj0Rk
$$ y = [1, 3, 12, 8, -1, -2, -2, 9, -4, 1, 7, -2, 1, -5, 3, 1, 12, -2, -3, -4, -3, 6, 0, 2, 2, 5, 7, 10, -2, 0, 12, 5, 2, 3, -7, 2, 1, -1, 2, 8, 4, 1, -3, -3, -3, 3, 3, 8, 0, 8, -1, -1, -5, -8, -4, -2, 6, 5, -8, 2, -4, -14, -6, 0, -1, -9, 0, 3, 4, 12, -7, -7, 10, -1, 0, 5, 10, 7, 4, -3, 1, 10, -1, 2, 9, 2, 5, 3, 17, -10, 4, -8, 2, 4, -3, -2, 3, 3, -4, -12, 3, -1, 3, -3, 6, 6, 5, 0, -1, 14, 12, -1, 3, 4, 8, 6, 13, 3, 1, 3, 6, 11, 7, 6, 4, 2, 0, 12, 5, 0, 8, 4, 7, 7, -3, 3, 4, -5, -8, 1, -2, -5, 0, -1, 0, 1, -4, 8, 1, -1, -7, -3, -5, 2, -2, 8, -1, 0, -5, 3, 2, 0, -1, -4, 1, -4, 3, 10, 6, -8, -7, -1, -3, 4, 9, 8, 0, 3, -4, -1, -6, -8, -1, -2, -12, -1, -1, -5, -2, -8, -4, -4, 3, -11, 0, 3, -2, -10, -5, 2, 3, -7, 3, -6, 1, 5, 6, 2, 12, 6, 1, 1, -2, 4, -1, -5, 6, 6, -3, 6, 2, -7, -9, -5, -10, -17, -14, -15, -2, -8, -9, -7, 1, -3, -3, -8, 4, -1, -10, -3, -4, 2, -6, 12, -7, 8, 10, 4, 9, 5, -9, 2, -9, 0, 5, 0, 9, 1, -2, 4, -1, 7, 3, 5, -3, -8, -6, -5, -6, -2, 1, -6, -5, -10, -8, 1, 0, -8, -4, 7, 4, 8, -6, -5, 3, -7, -2, 5, 1, 7, 11, 5, -6, 1, 3, 6, 17, -1, 1, 12, 6, -5, -5, 2, -8, -9, 2, -8, -6, -9, 0, -4, -8, -8, 6, -4, -2, 6, -14, 0, -2, 2, 1, 6, 11, 1, 2, 19, 6, 6, 9, 0, 1, 11, 8, 7, 11, 2, 4, -13, 8, 4, -2, 0, -2, -1, 2, 6, -1, 0, 5, -1, -3, -10, 6, -2, 5, 4, 11, 2, -2, 11, 8, -5, -4, 2, 11, 13, -2, 2, 5, 5, 3, 8, 7, 8, 3, 6, 0, 5, 3, -1, -7, -2, 7, -2, 0, -5, 0, 3, 0, -14, -2, -8, 0, -16, -14, -5, -6, 1, -10, -5, -4, -6, -12, -5, 4, 11, 5, -4, 4, 6, -4, 5, 3]
5289CQ%qkKkJnJ4j1NojOj0J6k2J0OjjomJ4j9NMNjNnKk%N%qOJkQqJKpJ1nk%J%q
5341eMpPkOj6J2JnLOj9PJ1nJRj4KPmKjNoKPomMLPrkJ2j1LL%nKLrJPJj6JNPjl%
5394AL%rJ2jkjoMoNkNPj2PnmJ2%kMqkPjkkOoqL%NJ1rJ1j3kLLj1LJrOMQk4K1lJ
5446CNkMqQj0QrRj%Ll%%LmoPlj%j2J0%JLj2LJoJ1LlqPmKJJ0j3POj6PPJ%jnPrO
5499GkjLMmljKKqNrkQj1PPJp%mKNRqKjkPj3%J4pLkkOoJ0jpJ1j0J3j1Nkj1LRLk
5551A1jj6K%QkpOj2J8nLlJ1j2llPJ3krJ3j2mLj1J3oJ0prNkK2j4kQjoKmRj1Kjn
5597dQKqkPj0LLLmoJ0mkKLJ3lkj1J7mMrJ0qrJJ2lj3NLmnLPrOOq%%lLkRjJj2QL
5649FnOoMnJ0qNj0J6olKQj2lnJ0NKOrKkJm%kkQj0kRnjpQMllOnKLj0J5rLoJLNl
$$ y = [3, 11, 11, 3, 1, 3, 1, 2, -3, 11, 0, 5, -1, -2, 4, -6, 10, -12, -2, 4, 3, 2, -4, -8, 6, -13, -8, -4, 1, 0, 5, 0, 2, 0, 0, 5, 5, -3, 3, 4, 2, 10, 2, 3, 5, -2, 9, 4, 2, 2, 3, 3, -5, -1, -8, -1, -3, 3, -13, -1, 0, -5, -2, 4, -15, -8, 3, -2, -1, 8, -6, -4, 3, -1, 1, 0, 5, -1, 1, 8, 2, -2, 2, 5, 12, 3, 1, 13, 2, 5, 8, 8, 3, 5, 8, -1, 0, 7, 8, -8, -7, -2, 5, 4, 1, 1, 4, 4, -5, 7, 6, 4, 3, -3, 1, -5, 0, -2, 3, 10, -2, 5, 0, -4, 8, 8, 6, 10, 2, 0, 7, 6, 4, 2, 8, 2, -6, -3, -3, 2, 13, 4, 15, 2, 0, 3, 6, -5, -2, -1, -10, -4, 0, 8, -16, 5, 2, 3, 8, 6, 10, 2, 10, 0, 8, -1, 8, 7, 7, 10, 7, 7, 7, 10, 6, 0, 7, 4, 3, 3, -9, 1, 1, 2, 5, -7, -4, -3, -9, 2, 5, 2, -6, 1, -3, -1, 0, 10, -3, 4, 10, -6, 1, 8, 9, 9, 8, 3, 10, 1, 7, 5, 4, 7, 11, 7, 4, 3, 5, 7, -1, 4, -5, -7, 1, -10, -3, 4, 5, -2, -2, -6, -4, 1, 10, 2, 4, 3, 1, 8, -5, -5, 9, 2, 5, 3, 1, 7, 1, 11, 10, 3, 14, 4, 17, 6, 11, 9, -2, 1, 10, 13, 11, 10, -6, -4, -4, 4, 2, -5, 1, -11, 7, 2, 5, 2, 13, 1, -2, -5, 2, 15, 13, 4, 17, 5, 1, 4, -7, 6, 0, 10, 3, -6, -1, -3, 19, 5, 3, 11, 10, 4, 6, 2, 11, 0, 2, 1, -4, 4, 6, -2, -4, 3, -7, -4, -1, 2, -2, -8, 2, -2, -4, -2, 1, 14, 11, 9, -2, 15, 11, 15, 6, 16, 8, -1, 0, 12, 9, -4, 1, 4, 0, -5, -2, 5, -4, 2, 8, 0, 0, 0, -3, 0, -2, 7, 6, 7, -5, 3, 6, 1, 7, 1, 5, 0, 10, 2, 7, -3, 13, 7, 4, 6, 14, 2, -1, -6, 4, 9, 11, 17, 8, 10, 8, 9, 5, 5, 3, 1, 9, -1, -3, 6, 1, 0, -7, 1, 5, 2, -1, 5, 0, 2, 5, -5, 10, 1, 4, -2, -1, 2, 7, 4]
5702DlrOJ0MLpkMjnKkKNJj0nKKj0J1mJOj0PNLnlOmKkmJ0Nj3QoPJ0j0lMj1P%Mo
5753F%LplJ1pqJ1qJ6rnJoKjOqNpOmNj1POjJ0kj1PKlJKKKpJ8j6LPnnLJMJj2%Mm
5805BKPmrLMj5MJMK%%MpMRl%jj2PQ%mJqJ6pmMQpKj1Nj1J2NPj0nqQpO%Pj2mJ2%
5857Ej2PmJ6j1PJj5J0kOlnJ2rPJqKQqLlMPj0p%QOj2JOolJ5k0jJ6llj7RPj0J7k
5904Glj5J4J0j7NlPJoJ0%okJ7rPj3jjjjOj3MJ0j3OJnOj5J9rMjn%MkJ4j9J1l%K
5950BjkRj%nMK%%qJjOJJqMMj2nPJMk%lMpMJ4j2KjOj6kJ9rMLnJj%Lj0KMMJJLok
6005BOjPKj4Lj2J3Kj0kJOj1QnOj6J9j2RkJLoQj0NLnlJ5pjKLMlJ%j3J4KKoqPKn
6054DKljj1J3%Lj5jJ3%lMj4J5rOj0PMoNJOLlj0Pl%J0Jj1JLJRj2mJ2plkOk%mkl
$$ y = [4, 1, -8, -2, 8, 12, 15, 8, 6, 10, 9, 4, 6, 4, 6, 11, 12, 2, -3, -1, 1, -9, 2, -2, -1, 5, -5, 2, 7, 10, 5, 2, 8, 4, 6, 4, 0, 10, 15, 2, 10, 4, 11, 21, 11, 8, 12, 1, 8, 8, 12, 6, 6, 9, 2, -1, 10, 3, -5, 6, -2, 14, 5, 0, 1, -5, -3, -4, 2, -6, -1, -8, -2, -6, -1, -12, -5, 1, 0, 10, 8, -3, 4, 6, 3, 4, 6, 8, 10, 3, 21, 5, 8, 15, 10, 5, 8, 9, 13, 14, 2, 2, 6, 2, 4, 11, 7, -2, 1, 5, -10, -6, -5, -1, 1, 1, 1, 5, -2, 2, 11, 8, 8, 7, -5, 2, 10, 10, 6, 7, -1, 15, 8, 4, 8, 16, 9, 11, 0, 5, -6, 6, 11, 18, 8, 3, -5, 3, -4, 2, 2, 9, -3, -7, 5, 5, -7, 0, -4, 12, 1, 8, 9, -6, 4, 2, 8, 5, 0, 12, 3, 10, 11, 3, 5, 13, 5, 8, 5, 9, 16, 6, -1, -1, 7, 13, 1, 2, 8, 2, -1, 14, -6, -7, 9, 6, 3, -14, -5, 2, -8, 9, 7, 4, -11, 3, 13, -4, 1, -2, 5, 6, 0, 10, 10, 4, 2, 19, 10, 17, 4, 3, 2, 1, 0, 6, -7, -3, 7, -6, 0, 1, -4, 2, -13, 6, -3, 1, 0, -5, -5, -1, -3, 11, -8, 3, 0, 0, 2, 1, -1, 8, 7, 7, 2, 6, 8, 8, 8, 0, 1, 0, 6, 7, 8, 0, 4, 8, -4, -9, -2, -1, 3, 1, 1, -2, 2, -5, -1, 13, 1, 3, 2, 8, -8, -10, 9, 0, 4, 7, 2, 3, 2, 2, 5, -5, -3, 1, 5, 6, 7, 10, 4, 2, 8, 7, 14, 16, 2, 5, -7, 6, 8, -2, -4, -3, 3, -8, 0, -5, 1, -15, 4, -8, 1, -1, 0, 3, -3, 5, -5, 0, 3, -2, -5, 10, 3, 2, 4, 7, 11, 8, 9, 9, -4, 10, 12, 14, 8, 0, 7, 9, 4, 6, 3, 2, -9, 4, 4, 7, -8, -9, 4, 4, 1, 5, -9, 6, -3, 3, -7, 0, 4, -2, 3, 4, 10, 13, 10, 0, 7, 4, 4, 14, 15, 4, 5, 8, 9, 18, 6, 2, 14, 7, 4, 2, 8, 6, 6, 2, 0, -3]
6103cJ1qoLJ6j1lMloJ8pmllJ4qMjnJ4oOlMkNnpOqkQqoJ3Kj5JJ2oJmOmkjjjJMJ
6155BlOnlO%NnjRj0kPPLqpOl%lOKMj2jQmJqKJoNJoRojPjmKkJ4RommLpj5J5Ojj1
6211cL%KOl%jOj2OjJ0k4J9qJKj9QPj0PMKN%o%JmJ1nLJKomP%Rj0%jnQnjM%oLlq
6264hJ2KpJ0jmkkmQnj2J2LoOLj4J4nlJ2jlJ3j7JjJJ6rk%J4j0KqPpj1MNMpLmJ0
6311Ij7J7opPj5P%jKmJ2qKJ%Q%MonRmPj%JrJ3j1OrKoOljJKmmJ4j8J2OqolROjj2
6363fKO%%KoKN%Nl%nn%J3rJ1pLKKKj5PmqKJOPqJ1k0J2j0NJKlPqoJ9o%MoNjq%m
6416dJ7mjpJ0oOJoNknnLMMj7J6lLrjL%krJ3j4OLkJ4qqLJ4nPj9J0jmKJLORj1Oj0
6466FmJJ1nnOnJ%%lNkrkJ0Jj6RlMkKkRrJ5kj6J5Ok0RJ1j0nlN%j%JJ3k0NJJ2j3
$$ y = [-3, 8, 0, -6, -3, 13, 2, -1, 3, 0, -6, 12, 5, 1, -2, -5, 9, 1, 5, 4, -1, 13, 7, 13, 10, 14, 12, 17, 12, 5, 11, 3, 1, 9, 1, -5, 8, 10, -5, -4, 8, 2, 3, -1, 5, 1, -1, -2, -3, -4, -3, 1, 2, -1, 5, 0, -3, 3, 3, 8, 3, 2, 11, 1, -1, 6, 13, 16, 8, 1, 7, 4, 4, 1, 7, 9, 13, 1, 0, 8, 4, 5, -3, -1, 0, -6, -1, 0, -6, 3, -3, -4, 3, 2, -2, 0, -2, 12, 21, 15, 11, 7, 10, 3, -12, 3, 9, 8, -3, 0, 0, 2, 8, 5, 5, 4, 10, -2, 4, 3, 13, -11, 8, 0, 1, 3, -16, -8, -1, -11, -4, 0, 2, 7, 7, 1, 1, 2, -2, 9, 4, 7, 8, 10, 4, 0, 7, 7, 16, 6, 6, 5, 0, 8, 3, 2, 6, 6, 0, 3, 0, -8, 4, 6, -1, 9, 8, 4, 2, 0, -4, 4, -1, -13, -1, 2, -4, 2, 5, -9, 5, 0, -3, 9, 8, 5, 18, 1, 2, 1, 2, 18, 9, 7, 7, 21, 11, 13, 5, 12, 5, -6, -2, 3, 7, 0, 3, -1, 9, -8, 9, 3, -4, 3, -12, -5, -5, -6, -4, -8, 4, -4, -2, -1, -1, 7, 7, 11, 5, 0, 9, 5, 12, 11, 11, 12, 3, 16, 5, 11, 2, 4, -2, 4, 1, 0, 1, 3, -1, -5, 9, -9, 3, 9, 1, -5, -8, 1, 7, 6, -6, -4, 2, 2, 2, 4, -2, 0, 5, 5, 10, 7, 7, 2, -3, -3, 10, 1, 12, 5, 8, 10, 12, 14, -1, 6, 2, -6, -4, -3, 3, 10, 2, 13, -7, 5, -5, 0, 1, 3, 0, 7, -1, -7, 12, 6, 6, 10, 4, 9, 8, 0, 0, -4, 13, 9, 8, 1, 11, 5, 11, 12, 6, 11, 9, 4, -1, 2, 6, 10, -7, 9, 6, 9, 0, -1, 2, 2, 0, -9, 4, -10, -4, -1, -3, 11, 3, -5, -2, 12, 7, 14, -5, 5, 4, 0, 2, 3, 6, 12, 21, 10, 16, 6, 2, 3, 14, 9, 4, 10, 5, 6, 6, 6, 3, 8, 6, -3, -5, 5, 6, -10, -1, -4, 0, -2, 0, -2, 7, -2, 13, 11, -5, 10, 16, -4, 5, 16, 6, 1, -2, 3, 3, 2, 2, 3, 16, -4, 1, 2, 14, 1]
6514AKloJ1j0J4qJo%QqnRQqPjj1%OMLMj3PjJJjJ5j8lJ0JnmQJmqJ3rmPPj5QkKl
6565ClnJ4nnNkLj2%Qj0kJ5Qj2QOLqplRLopMJKjJ1kqJ0j6MkpMJ1j5%PMj1qOJ3j2
6614gPnNPrMJ4j4RKjMj4QqJ5pmPj0Lm%oQlJ0j2kJ0j2LPj1LQj1JJLOJqPKKnJJO
6664A2qlRm%rPlMPjjOmoqJ0Lj2J1j2RJMj1J2oomlKP%mjOrPQqmQpR%KlKRj0l%M
6717I%jloMJ2j4J1j1LmNj3KLlOjKJLrKoJ4nm%Nj4K1llPJj2J9jmoJnNJKnj0J2r
6766a%mMjN%krJNmLNoKoQJ0j1NJj0Q%M%OllpRlmPj1J0Kj2J0qJ1j4OOQj0njPj1
6816cpNJ5j5NNoMqQjqKKPnoONKkPopJ3nj2OJNKMj2o%%K1j4JnlNkNj6J1njjPNl
6868@kLKJnkLPjkNJooJ4Nr%oNJ4k5J1%j2mJ1j2PllP%oKmQjj1J2JJ2j1roJ3PLn
$$ y = [1, 3, 0, -6, 5, -5, 9, 1, 2, -4, -4, 4, -4, -9, 0, 8, 0, 7, 6, -5, -5, 1, 5, 8, 12, -1, 6, 5, 6, 7, 6, 21, 3, 0, 10, 11, 6, 2, 10, 11, 7, -1, 12, 3, -1, 6, 13, -2, 6, 4, 6, 3, 0, -5, 9, 4, -1, 4, 2, 5, -7, -7, 1, -9, -11, 4, 12, 0, 8, 14, 17, 9, 2, -1, 8, 11, 5, -2, 2, 3, 5, 4, 15, 13, 5, 15, -1, 3, 1, -6, -2, 9, -6, -6, 1, 5, -6, -14, -8, 5, -7, 0, -5, 0, 7, -2, 2, 16, 2, 11, 13, 12, 16, 2, 10, 2, 17, 10, 6, 13, 3, 6, 2, 2, -4, 4, 1, 11, -1, -3, 7, -5, -2, 5, -6, -3, 5, -6, -5, -4, -1, 5, 6, -2, 5, 7, 9, 4, 5, 6, 12, 4, 1, 10, 6, 6, -3, 4, 1, 5, 12, 11, 10, 16, 12, 6, -2, 8, 11, -1, 10, -2, 7, 8, 12, 1, 13, 7, 1, -3, -6, -4, 3, 3, -1, -2, 4, -5, 2, 10, 2, -2, 6, -1, 8, 8, 10, 7, 9, 18, 8, 5, 5, 9, 9, 8, 5, -1, 3, 15, 1, 12, 1, 4, 0, 5, -8, -6, -3, -6, 0, -1, 1, 2, 5, -4, -2, -8, 6, 1, -3, -3, 2, -12, 9, 6, 3, 10, 11, -1, 18, 17, 13, 7, 8, 3, 8, 9, 11, 6, -4, 8, -1, -1, -5, -1, -2, 3, 3, 1, -8, -7, -2, -6, -3, 2, -4, -2, -8, 0, 10, -1, 4, 5, -5, 3, 3, 7, 7, 13, 10, 7, 0, 9, 6, 2, 9, -2, 8, 10, -2, 8, 0, 11, -3, 3, 9, 17, 7, 2, 1, 8, -3, -10, -5, 10, -5, 0, 5, -1, 3, -5, 3, 2, -6, -4, -2, 5, 0, -6, 0, 5, 7, 5, 12, 6, -1, 12, 7, -5, 1, 2, 7, 9, 13, 1, -5, -5, -5, 16, 2, 3, -2, -5, 0, -2, 3, -13, -2, -7, -8, -9, -2, 3, 0, -2, 1, 3, 4, -1, -3, 0, 7, 6, 4, 9, 10, 4, -2, 12, 17, 8, 8, 2, 7, 21, -4, 7, 7, -5, -9, 2, -10, -3, -6, -9, -2, -2, -8, -6, -10, -2, -3, -14, -2, -1, 11, 0, -9, -15, -2, 5, 8, 3]
6917CoLlJ7njolJ1nKnRpkJ1mmj4MOJj3JJJ9j4kN%lqJ3pKQkLkjJKJlLNoQj6L1j8
6968A0kLl%JqJ1mkj2L%pOJnM%M%KnpRJkjNKNMk1OONpQokLJ1j8NjKOok%JKmJ3j5
7022aqQk%LjKlJmmJ4j2NNLjpjjNRLqJNpRj5QnMkmNnJMoLMlmnRoJJ3j3J1rKpML
7077AKMrOoJ1LnKkpMP%nrOMqO%%LmMjj0MMrNOrjMoMLjj1J5Qj3J9j9OkK%Lj0NJ8
7130B2pj1QrlMNlOqj0J0lokJ1KqLjjOj2OpN%MpJ0JKrLlN%LqNJ5j4PNKojj1QNl
7181A0mj%mNrQOj0kLqNKpNljJJ2j2rNjJ6kNlKjOrmKN%ORk7QmOQqKj5JJ0m%knP
7234@lNj3RkRjr%QmrJ2Oj6QJ1%JmOj0J0%j2JJ0j3N%lNKpkMnPj7J2J2j3%nJ2j1
7280dMlNj3K1j5PKpJ2qKKKrJ4j9K0j%pQOj1%Mj0Mlj%qKPnKQoMkJoNnOpKjlOqO
$$ y = [3, -3, 0, -3, 14, 9, 8, 2, -1, 10, 5, 7, 2, 11, 4, 2, 13, 9, 5, -9, -5, 1, 2, -11, -10, -9, 10, -4, -6, -1, -1, -4, -12, 1, -6, -4, 4, 2, 5, 3, 2, 3, 5, 6, 3, 6, 11, 5, 13, -3, 28, 10, 8, 11, 8, 8, 9, 1, 12, 8, 6, -6, -3, -3, -10, -4, -3, -8, -4, -4, 0, 0, 2, -3, -10, -1, 0, -2, -3, 2, 4, 9, 13, -8, -2, 4, 9, 2, 10, 4, 2, 5, 16, -2, 3, 2, 4, 10, 4, 2, 2, 3, 5, 1, 14, -1, -9, -1, -3, -3, 0, -1, 1, -2, -1, -5, -9, 5, -7, -2, 3, 6, 5, -2, -3, -4, 1, 10, 13, 5, 6, 11, 4, 13, -2, 6, 1, 5, 3, -1, 4, -1, 0, 4, -2, 1, 5, 2, -2, -7, 2, -4, -3, 10, -3, 8, -1, 1, -6, -2, 1, 3, 7, -2, 4, -2, 9, 12, 7, 9, 7, 0, 4, 11, 11, 6, -3, 3, 7, -1, 5, 5, 5, 8, 4, 8, 7, -3, 1, 5, -4, 1, 7, -2, -3, 1, -5, -1, 2, 1, -10, 5, 13, 0, 19, 0, 6, 4, 6, 6, 9, -1, 4, 22, 15, 4, 12, 3, 0, 4, 9, 6, 12, 4, -6, 4, 1, -5, -7, 4, 6, -2, 1, 0, -1, 5, -7, -1, -8, -3, -3, 1, -6, 4, 5, 7, -2, 1, -2, 3, 3, 6, -2, 3, 18, 4, 11, 16, 18, 12, 11, 0, 8, 13, 10, 6, 5, 5, 1, 6, -3, 5, 11, 1, -1, 2, -6, -1, 1, -6, -1, -4, -5, -4, 8, -4, -13, -8, -9, 7, 5, 10, 7, 9, 8, 14, 5, 1, 3, 8, 8, 14, 23, -4, 4, 0, 6, 14, 6, 8, -7, -6, 4, 0, 0, -2, -7, 0, -3, 2, -11, -2, -4, 5, 4, -5, -5, 3, -1, -10, 2, 8, -8, 0, 11, 11, 12, 8, 14, 4, 14, 14, 2, 3, 13, 0, 5, 5, 2, 7, 9, 2, 0, 4, -1, 6, -11, 1, 13, 0, 0, -5, 7, -4, 0, -3, 2, -11, 10, -5, 2, 4, -3, 9, 1, 3, 5, 7, -2, 12, -7, 13, 12, 12, 5, 13, 19, 8, 8, 12, 2, 6, 3, 2, 2, -6, -4, 3, -2, 0, 8, 2, 6, 4, 5, -1, 4, -1, 5, -2, 0, -1, -4, 2, -6, 0]
7332@NPmpPlj8K3rkRp%QRpkjnKJJn%j5J1%LLj2J9j2mKj0J0OkKKj8J6PoJnJ5oj1
7381bJ1%jKpOKnkJ1j2JMNj5mMPmm%jkMmkQpJ2j6J5KkjqJ2mPPjj4LqPMjj0J0qJ8
7431A7j1lRj2Q%nmmOOj0llJNpQrOJ0ojpRMrRnQJ0j2JJ%klnJ5n%Nn%jkkLKjlLj
7484EnkmMjLJ%JQqqJ4oJMlJJmJ1kknPoJ0pLlj8K6k3%OPkj6PK2j8NqkN%Mj2Rj5
7534a5J5lLmnK0k3J7kPlkjLlrJ0OpQol%kNj0Rj3ROKj4kJ0j7J4mpOmPmPj0NJ4j1
7581aqQlQj1J0LQj2KJ4j1j1J2qROj0nJ0j0MNj0J6j4jPj2jM%%MqNplRjOkmkJ0p
7627bOjnLPMk%qLLoJKJlnnNOlLlrJ5lljqKj%Mj0PPOj0MJmQjJJnLLoOJJPk0MQj3
7684dJ1NrOnJqJllKJ3lnjlNom%J4j0jJMORjj0LRqlJRn%rJ2lj0QjnPj4Mj%LNNk0
$$ y = [0, 5, 12, 8, 1, 8, 5, -13, 10, 1, -1, 8, 1, 1, 9, 18, 11, 9, 8, 3, 5, 6, 7, 2, 2, -13, -2, -2, 1, 4, -8, 11, -1, -5, -3, -13, -3, 3, 1, 3, 5, -13, 3, 10, 4, 5, 0, 15, 9, -2, 9, 9, 8, 10, 3, 9, 11, 6, 4, 15, 3, 4, 8, 13, -2, -6, -2, 5, 1, -3, -3, -4, -6, -2, -6, -8, 0, -7, 5, -11, 4, 6, 4, 3, -5, 7, 3, 10, 17, 16, 2, 5, -3, 4, 8, 7, -3, 7, -1, 17, 6, 3, 12, 0, 8, 8, 3, -1, -5, 1, 7, -3, -6, -9, -8, -3, -10, -2, -11, -5, 5, -1, -2, -9, 0, 4, -5, 4, -1, 7, 17, 5, 6, 7, 7, 5, 2, -3, 12, 7, 7, 12, 7, 7, 6, 4, 2, 5, 7, 6, 3, 6, 5, 0, -2, -6, -2, -3, 0, 1, 1, 2, 10, 2, -6, 8, 2, 3, 7, 4, 5, 6, 2, 13, 11, 9, 4, 11, 5, 15, 8, 11, 8, -10, 16, -7, -7, -1, 6, 4, -12, -5, 17, -1, 4, -4, -6, -1, -1, 3, -9, 0, -15, 0, -3, 0, -4, -9, 11, -12, 5, 3, 10, 7, 5, 4, 7, 4, -5, 5, 11, 4, 12, 6, 3, 3, 1, 6, -4, 5, -8, 1, 7, 9, -5, -7, 3, -14, 0, -4, -11, -5, -9, -2, -6, 1, -9, -4, 10, -1, -9, -1, -4, 4, -7, 3, 6, 14, 2, 4, 18, 7, -4, 8, 0, 9, 15, 5, 0, 10, 0, 4, 9, -1, 15, 1, 0, 7, -5, -6, -2, -2, -2, 2, -6, -1, -8, -11, -2, -3, 3, 1, -3, -5, 5, -2, 4, 3, -2, 1, 8, 12, 10, 10, 2, 5, 8, 2, 3, 5, 6, 3, -2, -7, -2, 4, 1, 4, 1, -8, 7, 4, 1, 0, -8, -6, -7, -7, -3, -13, -6, 1, 7, -3, 1, 2, -2, 6, 5, 6, 7, 2, 5, 8, 2, 8, 9, 10, 17, -3, 1, 9, -4, 7, 12, 3, 9, 4, 5, -3, -2, -5, -8, -6, 7, 4, -1, -2, -5, 0, -6, -10, -10, 4, -6, -7, -6, -2, 4, 13, 12, 2, 5, 14, 6, 3, 4, 13, 8, 8, -1, 11, 8, -2, 6, 5, 0, 7, -7, -3, -4, -4, -1, 4, 9, -11]
7737a1RkMqJ3j0%pRMjkKOk%lNM%rN%jRj7J2krJpJ6j1J0o%kOj0jmRpOlllJ3o%%
7788dMnMmRmlPpLOkKOknQj2jJOJ2j7j0J7pOJj0lJ0j1QmMopKNjpPj%nQlKj%NNP
$$ y = [-11, -2, -4, 0, -8, 5, -5, -5, -12, -3, 1, 0, -2, 0, 6, 4, 4, 1, 6, 10, 10, 1, 6, 6, 5, 14, -3, 9, 7, -2, -1, -8, 8, -3, 7, 1, 1, -1, 5, -5, -6, -10, -1, -8, -2, -5, -8, -11, 2, -4, -4, -4, 0, -5, -1, -5, 4, 0, -3, 4, -3, 0, 6, 4, 6, 12, 10, 5, 13, 1, 0, 1, 7, 19, 2, -8, 9, 2, 8, 9, -1, -4, 6, -5, 3, -1, 3, -3, -10, -8, -3, -4, -11, -4, -5, -5, -10, -2, -5, -3, -4, -4, 1, 6, 13]
$$ [...]
8191F
##END NTUPLES=NMR FID
##END=
