##TITLE=1H_LY-DMAA.Per.3.5
 CDCl3
 8 sc, 
 8.02.2022
##JCAMPDX= 6.0         $$ Bruker NMR JCAMP-DX V2.0
##DATA TYPE= NMR FID
##DATA CLASS= NTUPLES
##ORIGIN= UXNMR, Bruker Analytische Messtechnik GmbH
##OWNER= root
$$ XWIN-NMR		Version 3.5
$$ Tue Feb  8 13:50:44 2022 Russian Standard Time (UT+4h)  she@DPX200
##.OBSERVE FREQUENCY= 200.131346
##.OBSERVE NUCLEUS= ^1H
##.DELAY= (6, 6)
##.ACQUISITION MODE= SIMULTANEOUS
##.ACQUISITION SCHEME= undefined
##.AVERAGES= 8
##.DIGITISER RES= 18
##SPECTROMETER/DATA SYSTEM= spect
##.PULSE SEQUENCE= zg30
##.SOLVENT NAME= CDCl3
##.SHIFT REFERENCE= (INTERNAL, CDCl3, 0, 15.7039)
##AUDIT TRAIL= $$ (NUMBER, WHEN, WHO, WHERE, WHAT)
$$ ##TITLE= Audit trail, XWIN-NMR		Version 3.5
$$ ##JCAMPDX= 5.01
$$ ##ORIGIN= Bruker BioSpin GmbH
$$ ##OWNER= she
$$ F:/spectra/data/she/nmr/H-F/1/audita.txt
$$ ##AUDIT TRAIL=  $$ (NUMBER, WHEN, WHO, WHERE, WHAT)
(   1,<2022-02-08 13:49:09.37 +0400>,<she>,<DPX200>,
      <created by zg, POWCHK disabled, PULCHK disabled
       configuration hash MD5:
       00 E9 B6 7A A2 85 ED C7 34 08 36 98 17 FE 4E 26
       data hash MD5: 16K
       44 32 BA 80 1D 03 0C 90 0E 9B D4 5C 24 2C C1 CA>)
$$ ##END=
$$ 
$$ hash MD5
$$ 81 91 30 DE 11 11 52 60 9F 78 DE 59 24 D9 CB 82
##$RELAX= 
##$RELAX= 
##$RELAX= 
##$RELAX= 
##$RELAX= 
##$RELAX= 
$$ Bruker specific parameters
$$ --------------------------
##$DU= <F:/spectra>
##$EXPNO= 1
##$NAME= <H-F>
##$PROCNO= 1
##$TYPE= <nmr>
##$USER= <she>
##$AMP= (0..31)
100 100 100 100 100 100 100 100 100 100 100 100 100 100 100 100 100 100 
100 100 100 100 100 100 100 100 100 100 100 100 100 100 
##$AQSEQ= 0
##$AQ_mod= 1
##$AUNM= <au_zg>
##$AUTOPOS= <>
##$BF1= 200.13
##$BF2= 200.13
##$BF3= 200.13
##$BF4= 200.13
##$BF5= 200.13
##$BF6= 200.13
##$BF7= 200.13
##$BF8= 200.13
##$BYTORDA= 1
##$CFDGTYP= 0
##$CFRGTYP= 5
##$CHEMSTR= <none>
##$CNST= (0..31)
1 1 145 1 1 1 1 1 1 1 1 1 1 1 1 1 1 1 1 1 1 1 1 1 1 1 1 1 1 1 1 1 
##$CPDPRG= <>
##$CPDPRG1= <>
##$CPDPRG2= <>
##$CPDPRG3= <>
##$CPDPRG4= <mlev>
##$CPDPRG5= <mlev>
##$CPDPRG6= <mlev>
##$CPDPRG7= <mlev>
##$CPDPRG8= <mlev>
##$CPDPRGB= <>
##$CPDPRGT= <>
##$D= (0..31)
0 1.2 0 0 0 0 0 0 0 0.06 0 0.03 0 0 0 0 0.0002 0 0 0 0 0 0 0 0 0 0 0 0 
0 0 0 
##$DATE= 1644313748
##$DBL= (0..7)
120 120 120 120 120 120 120 120 
##$DBP= (0..7)
150 150 150 150 150 150 150 150 
##$DBP07= 0
##$DBPNAM0= <>
##$DBPNAM1= <>
##$DBPNAM2= <>
##$DBPNAM3= <>
##$DBPNAM4= <>
##$DBPNAM5= <>
##$DBPNAM6= <>
##$DBPNAM7= <>
##$DBPOAL= (0..7)
0.5 0.5 0.5 0.5 0.5 0.5 0.5 0.5 
##$DBPOFFS= (0..7)
0 0 0 0 0 0 0 0 
##$DE= 6
##$DECBNUC= <off>
##$DECIM= 32
##$DECNUC= <off>
##$DECSTAT= 4
##$DIGMOD= 1
##$DIGTYP= 9
##$DL= (0..7)
0 120 120 120 120 120 120 120 
##$DP= (0..7)
150 150 150 150 150 150 150 150 
##$DP07= 0
##$DPNAME0= <>
##$DPNAME1= <>
##$DPNAME2= <>
##$DPNAME3= <>
##$DPNAME4= <>
##$DPNAME5= <>
##$DPNAME6= <>
##$DPNAME7= <>
##$DPOAL= (0..7)
0.5 0.5 0.5 0.5 0.5 0.5 0.5 0.5 
##$DPOFFS= (0..7)
0 0 0 0 0 0 0 0 
##$DQDMODE= 0
##$DR= 18
##$DS= 0
##$DSLIST= <SSSSSSSSSSSSSSS>
$$ [...]
##$SUBNAM2= <"">
##$SUBNAM3= <"">
##$SUBNAM4= <"">
##$SUBNAM5= <"">
##$SUBNAM6= <"">
##$SUBNAM7= <"">
##$SUBNAM8= <"">
##$SUBNAM9= <"">
##$SW= 18.0517287032376
##$SWIBOX= (0..15)
0 0 2 0 0 0 0 0 0 0 0 0 0 0 0 0 
##$SW_h= 3612.71676300578
##$TD= 16384
##$TD0= 1
##$TE= 0
##$TE2= 300
##$TE3= 300
##$TEG= 300
##$TL= (0..7)
0 120 120 120 120 120 120 120 
##$TP= (0..7)
150 150 150 150 150 150 150 150 
##$TP07= 0
##$TPNAME0= <>
##$TPNAME1= <>
##$TPNAME2= <>
##$TPNAME3= <>
##$TPNAME4= <>
##$TPNAME5= <>
##$TPNAME6= <>
##$TPNAME7= <>
##$TPOAL= (0..7)
0.5 0.5 0.5 0.5 0.5 0.5 0.5 0.5 
##$TPOFFS= (0..7)
0 0 0 0 0 0 0 0 
##$TUNHIN= 0
##$TUNHOUT= 0
##$TUNXOUT= 0
##$USERA1= <user>
##$USERA2= <user>
##$USERA3= <user>
##$USERA4= <user>
##$USERA5= <user>
##$V9= 5
##$VALIST= <valist>
##$VCLIST= <CCCCCCCCCCCCCCC>
##$VD= 0
##$VDLIST= <DDDDDDDDDDDDDDD>
##$VPLIST= <PPPPPPPPPPPPPPP>
##$VTLIST= <TTTTTTTTTTTTTTT>
##$WBST= 1024
##$WBSW= 4
##$XGAIN= (0..3)
0 0 0 0 
##$XL= 0
##$YL= 0
##$YMAX_a= 80406
##$YMIN_a= -77431
##$ZGOPTNS= <>
##$ZL1= 120
##$ZL2= 120
##$ZL3= 120
##$ZL4= 120
##$ABSF1= 10
##$ABSF2= 0
##$ABSG= 5
##$ABSL= 3
##$ALPHA= 0
##$AQORDER= 0
##$ASSFAC= 0
##$ASSFACI= 0
##$ASSFACX= 0
##$ASSWID= 0
##$AUNMP= <proc_1d>
##$AZFE= 0.1
##$AZFW= 0.1
##$BCFW= 1
##$BC_mod= 2
##$BYTORDP= 1
##$COROFFS= 0
##$CY= 11.3945322036743
##$DATMOD= 1
##$DC= 2
##$DFILT= <>
##$DTYPP= 0
##$F1P= 2.36226072786647
##$F2P= -0.459571619588291
##$FCOR= 0.5
##$FTSIZE= 0
##$FT_mod= 4
##$GAMMA= 1
##$GB= 0.15
##$INTBC= 1
##$INTSCL= 1
##$ISEN= 128
##$LB= 0.24
##$LEV0= 0
##$LPBIN= 0
##$MAXI= 10000
##$MC2= 0
##$MEAN= 0
##$ME_mod= 0
##$MI= 1.114404
##$NCOEF= 0
##$NC_proc= 0
##$NLEV= 6
##$NOISF1= 3.799351
##$NOISF2= 2.8
##$NSP= 1
##$NTH_PI= 0
##$NZP= 0
##$OFFSET= 15.70392
##$PC= 1
##$PHC0= -15951.23
##$PHC1= 13.80078
##$PH_mod= 1
##$PKNL= yes
##$PPARMOD= 0
##$PSCAL= 0
##$PSIGN= 0
##$REVERSE= no
##$SF= 200.130013532006
##$SI= 16384
##$SIGF1= 3
##$SIGF2= 2
##$SINO= 400
##$SIOLD= 16384
##$SREGLST= <1H.CDCl3>
##$SSB= 0
##$STSI= 0
##$STSR= 0
##$SW_p= 3612.71676300578
##$SYMM= 0
##$S_DEV= 0
##$TDeff= 0
##$TDoff= 0
##$TI= <>
##$TILT= no
##$TM1= 0
##$TM2= 0
##$TOPLEV= 0
##$USERP1= <user>
##$USERP2= <user>
##$USERP3= <user>
##$USERP4= <user>
##$USERP5= <user>
##$WDW= 1
##$XDIM= 8192
##$YMAX_p= 0
##$YMIN_p= 0
$$ End of Bruker specific parameters
$$ ---------------------------------
##NTUPLES= NMR FID
##VAR_NAME=  TIME,          FID/REAL,        FID/IMAG
##SYMBOL=    X,             R,               I
##VAR_TYPE=  INDEPENDENT,   DEPENDENT,       DEPENDENT
##VAR_FORM=  AFFN,          ASDF,            ASDF
##VAR_DIM=   8192,          8192,            8192
##UNITS=     SECONDS,       ARBITRARY UNITS, ARBITRARY UNITS
##FACTOR=    0.0002768,     1,               1
##FIRST=     0,             0,               0
##LAST=      2.2672688,     0,               0
##MIN=       0,             -77431,          0
##MAX=       2.2672688,     80406,           0
$$ Real data points
##PAGE= N=1
##DATA TABLE= (X++(R..R)), XYDATA
$$ [...]
857D230M568j1101m458O814M184j837l825l296L372Q080k870j2065K347J4801
$$ 4230 8798 -2303 -6761 53 4237 2400 -1425 -4721 -1349 6731 3861 -8204 -5857 8944
871H944j774j6055J133J5711m22j3848l77J0696J273o621k255K055L227K547m076
$$ 8944 7170 -8885 -7752 7959 7537 -6311 -6688 4008 5281 -1340 -3595 -1540 1687 4234 158
886A58o703M804J0059n318j2258N503J3139n302j2650M644J0933l576q207K080
$$ 158 -6545 -1741 8318 3000 -9258 -3755 9384 4082 -8568 -3924 7009 3433 -4774 -2694
900b694M851l09j217j616k344L516N314n165p509O463Q697p222q781P371P855
$$ -2694 2157 1848 631 -985 -3329 187 5501 336 -7173 -710 7987 765 -8016 -645 7210
915G210o872o043N751L705m147j068K159j493OL641k124n067L962N659n369n429
$$ 7210 338 -5705 46 3751 -396 -1464 695 -798 -792 2849 725 -4342 -380 5279 -90 -5519
931e519O220M401o475k744O119O86n212J484L823l450k187M964M51n766J167N791
$$ -5519 701 5102 -1373 -4117 2002 2688 -2524 -1040 2783 -667 -2854 2110 2561 -3205 -2038 3753
947C753k493n027L425L514l853j410L805j057l237L528K341n741j215P382O8q288
$$ 3753 1260 -3767 -342 3172 -681 -2091 1714 657 -2580 948 3289 -2452 -3667 3715 3783 -4505
963d505R27Q312j685p374K003N619j905l165J380K40m98K845o74n620J840P898
$$ -4505 -3578 4734 3049 -4325 -2322 3297 1392 -1773 -393 -153 -651 2194 1520 -4100 -2260 5638
979E638k850r432L549J0063l790r703L506Q370k634o279J280L589M51n58k364
$$ 5638 2788 -6644 -3095 6968 3178 -6525 -3019 5351 2717 -3562 -2282 1307 1758 1200 -1164
994a164k527M241N280n838p508O948R030p413r674P119R416o033q297M208O501
$$ -1164 -3691 550 5830 -8 -7516 -568 8462 1049 -8625 -1506 7910 1877 -6420 -2212 4289
1009D289j799m191r98J622L872R76o484l352Q611N285j0007o584J0408P212r843
$$ 4289 2490 -1701 -2699 -1077 2795 3771 -2713 -6065 2546 7831 -2176 -8760 1648 8860 -983
1024i83p092Q234O347n791n117K737L555O40j850l984J65O967J325r271k483J0704
$$ -983 -8075 159 6506 715 -4402 -1665 1890 2530 680 -3304 -3139 3828 5153 -4118 -6601 4103
1040D103L246j1096l575J0389L565q703l228O197K736l177k091j73J453L421q80
$$ 4103 7349 -3747 -7322 3067 6632 -2071 -5299 898 3634 457 -1634 -1807 -354 3067 2187
1055B187o223M31Q306j37r566J6R804Mr073P5P425j32n148J76K413j09M67p2l139
$$ 2187 -4036 -3605 4701 4564 -5002 -4986 4818 4822 -4251 -4176 3249 3117 -2031 -1855 558 449 916 844 -2295
1074b295M11N287q46o709J358P309j875p041K319N992k627m315K726K241k618
$$ -2295 -1884 3403 2557 -4152 -2794 4515 2640 -4401 -2082 3910 1283 -3032 -306 1935 -683
1089f83J2K180k079j539L750O90m806K36N177j205m793K081L776k784k245L266
$$ -683 -671 1509 -570 -2109 1641 2331 -2475 -2239 2938 1733 -3060 -979 2797 13 -2232 1034
1105A034M18l457J477L350l152k979M425K352n121j555N103O88m389J78L039r80
$$ 1034 1452 -2005 -528 2822 -330 -3309 1116 3468 -1653 -3208 1895 2583 -1806 -1628 1411 431
1121D31j190J618r44k055L078K280m947k278O304K121p024j804O944J441o068
$$ 431 -759 859 -85 -2140 938 3218 -1729 -4007 2297 4418 -2606 -4410 2534 3975 -2093
1136b093j067M486P09k292m04k72J89K898o1n282J2P139N0q357j10Q722K20q210
$$ -2093 -3160 1326 2035 -257 -661 -933 -744 2154 2093 -3189 -3177 3962 4012 -4345 -4455 4267 4487 -3723
1154c723m47O889P50m839j179K291J669N16k141l296K560N740k837p595K899Q759
$$ -3723 -4170 2719 3469 -1370 -2549 -258 1411 1927 -214 -3510 -950 4790 1953 -5642 -2743 6016
1170F016k716r046K236Q465j474p075M66N026P28k554j974j49L171K735m191m925
$$ 6016 3300 -5746 -3510 4955 3481 -3594 -3128 1898 2626 72 -1902 -2051 1120 3855 -336 -5261
1186e261M858O574n172p530N051P677m419p066L355N809j920m062K25K033J554
$$ -5261 -403 6171 999 -6531 -1480 6197 1778 -5288 -1933 3876 1956 -2106 -1881 152 1706
1201A706J03l279k045M741L586n744m674O283N187o234n144N594M591m435l637
$$ 1706 1809 -1470 -3515 1226 4812 -932 -5606 677 5864 -370 -5514 80 4671 236 -3401
1216c401K846K396r94j017r66l09K820J421m374k218N461K639n987k670N961K327
$$ -3401 -555 1841 847 -170 -1136 -1445 1375 2796 -1578 -3796 1665 4304 -1683 -4353 1608 3935
1232C935n328j708M195Q94k672qR17p89Q53J387k449j710L693J701m463j389M703
$$ 3935 -1393 -3101 1094 1988 -684 -692 225 -564 289 1676 -773 -2483 1210 2911 -1552 -2941 1762
1249A762P97m392k8L616q29k460J643J074k265L45K637j641k688K627K421l192
$$ 1762 2559 -1833 -1861 1755 926 -1534 109 1183 -1082 -737 1900 259 -2429 198 2619 -573
1265e73j859L333J017k970m6K210j017j122K005j46k810J370L376k432l626L172
$$ -573 -2432 901 1918 -1052 -1098 1112 95 -1027 978 832 -1978 -608 2768 336 -3290 -118
1281a18L528l480l111L320K384k662j434J599L58k46P81j260j817K714K666l896
$$ -118 3410 -70 -3181 139 2523 -139 -1573 26 384 138 919 -341 -2158 556 3222 -674
1297f74l260M720L507m989l497M744L173l920k600K567J832q50r83j064R7K970
$$ -674 -3934 786 4293 -696 -4193 551 3724 -196 -2796 -229 1603 753 -230 -1294 -1197 1773
1313A773O93m632j373N850J902o525k226O548K411n920k415M672K303k918k062
$$ 1773 2466 -2166 -3539 2311 4213 -2312 -4538 2010 4421 -1499 -3914 758 3061 143 -1919
1328a919Q29J723J402j339l505R29N260n15o472O9P090L17p001p02O225J046m848
$$ -1919 -1090 633 2035 696 -2809 -1880 3380 2865 -3607 -3538 3552 3869 -3132 -3834 2391 3437 -1411
1345a411j360L007J600q63j811j320J941L351j982m958J942O013j779o478J510
$$ -1411 -2771 236 1836 973 -838 -2158 -217 3134 1152 -3806 -1864 4149 2370 -4108 -2598
1360b598O285j110n497N93M179J9k476p08O13J386J228k005k844K505M073k831
$$ -2598 3687 2577 -2920 -2327 1852 1871 -605 -1313 -700 686 1914 -91 -2935 -430 3643 812
1376H12m789K915M976k745m686K385L886j771k728R92J354j03P5p96j382J616
$$ 812 -3977 -1062 3914 1169 -3517 -1132 2754 983 -1745 -753 601 498 573 -223 -1605 11
1392A1K431k286l102K743L358k966l175K897K577k562j699J995O45j270M51M41
$$ 11 2442 156 -2946 -203 3155 189 -2986 -89 2488 -74 -1773 222 867 -403 48 489
1408D89j421L84K167j156k564J771K581k134k228K275J554k155o41J807m03j243
$$ 489 -932 -548 1619 463 -2101 -330 2251 117 -2111 164 1718 -437 -1078 729 326 -917
1424i17J412N99k280N4K892o52l167J107L032j357k563J384J759j186p16P96m70
$$ -917 495 1094 -1186 -1132 1760 1108 -2059 -952 2080 723 -1840 -456 1303 117 -599 197 -273
1441b73k57J640l10k675Q39L466j277l877J509L919j511l559J298K810q27j767
$$ -273 -530 1110 800 -1875 -1036 2430 1153 -2724 -1215 2704 1193 -2366 -1068 1742 915 -852
1457h52J78N20N76Q08j365k034K035L084k572l819K814M205k780m157K390L732
$$ -852 -674 -154 422 1230 -135 -2169 -134 2950 378 -3441 -627 3578 798 -3359 -969 2763
1473B763j695k989P63J958L67p68j555m31K642J563l508k535M105L192m265l554
$$ 2763 1068 -1921 -1158 800 1167 399 -1156 -1587 1055 2618 -890 -3425 680 3872 -393 -3947
1489c947L996L600l340l313K294K758r86j971m76J079J903j41l173p41M155J488
$$ -3947 49 3649 309 -3004 -710 2048 1062 -909 -1385 -306 1597 1456 -1717 -2458 1697 3185
1505C185m731k046M844K381m490k464L690K335k524k020J134J554L91j028j870
$$ 3185 -1546 -3592 1252 3633 -857 -3321 369 2704 180 -1840 -706 848 1239 211 -1659
1520a659M74L143M4m107m60M647P44m715r45M340R99l524r81K383Q99j021p82
$$ -1659 -1185 1958 2002 -2105 -2565 2082 2826 -1889 -2834 1506 2505 -1019 -2000 383 1282 261 -521
1537e21l96O55J728n27k806M21L572l43l934K98L856k81l350K40K531j98j487
$$ -521 -917 -262 1466 939 -1867 -1446 2126 1783 -2151 -1853 2003 1722 -1628 -1388 1143 945 -542
1554e42J37L31o6Q05n5j774J79K484l34k848M79K868o35k520P49J888q13j050
$$ -542 -405 -74 -140 665 610 -1164 -985 1499 1165 -1683 -1204 1664 1029 -1491 -742 1146 333 -717
1572g17Q35R6p70Q26O64j623m67K175K36k422JK355k46j947M42J282o14m21P17
$$ -717 118 214 -556 270 934 -689 -1156 1019 1255 -1167 -1166 1189 943 -1004 -562 720 106 -315 402
1591D02n31p45J440P04k190o22K693M95k855l93K715K66k224j62J418J09m32o2
$$ 402 -129 -874 566 1270 -920 -1542 1151 1646 -1209 -1602 1113 1379 -845 -1007 411 520 88 26
1609B6o49M2J694k3k575nL208N6l527j25L458K24l017l83K275N48j245p34O3R13
$$ 26 -623 -581 1113 1090 -1485 -1490 1718 1774 -1753 -1878 1580 1804 -1213 -1596 679 1227 -18 -752 -689 224
1629B24J131j043k236J117L129j106l707R83L938p36l767L93L237L2k381n43J299
$$ 224 1355 312 -1924 -807 2322 1216 -2491 -1508 2430 1694 -2073 -1680 1557 1589 -792 -1335 -36
1646c6J041r7j530j091J909K149k135k994K190L502k029l672J672L483j132k952
$$ -36 1005 908 -622 -1713 196 2345 210 -2784 -594 2908 879 -2793 -1121 2362 1230 -1722
1662a722M53K164L09j192j079J81J759Q26k304j690K650K350k764k740K614K834
$$ -1722 -1269 895 1204 12 -1067 -886 873 1699 -605 -2295 355 2705 -59 -2799 -185 2649
1678B649k224k665J621K247q53j651j5R28R00j83j683n40K331J117k755j513K894
$$ 2649 425 -2240 -619 1628 775 -876 -891 37 937 754 -929 -1469 862 1979 -776 -2289 605
1695F05J731k776j716K370J553j754j204R44P78n6l08p93j64J550N41k102q00
$$ 605 2336 -440 -2156 214 1767 13 -1191 -247 531 475 167 -626 -790 760 1301 -801 -1601
1712a601K409R32k467r24K259P63j823n17J211J95m82J33k52m43R21O72j431q05
$$ -1601 808 1740 -727 -1651 608 1371 -452 -969 242 437 -45 88 -164 -607 314 986 -445 -1250
1730a250J773P98j862o89J726M98j405j92R08j60k98N08l54p93R23J008j367j134
$$ -1250 523 1321 -541 -1230 496 994 -411 -603 305 145 -153 355 1 -792 131 1139 -228 -1362
1748a362J652J105j698r62J504P32j114m09N41N6J00L56p83o97J387R77j829j194
$$ -1362 290 1395 -303 -1265 239 971 -143 -552 -11 45 145 501 -282 -979 408 1385 -444 -1638
1766a638K070J295k060j279J795J156j308r44O35O52J23k81r45q3J680M20k240
$$ -1638 432 1727 -333 -1612 183 1339 31 -913 -278 374 497 216 -729 -812 868 1288 -952
1783i52p26K593R73k678j139K474J233k008j226J315J141m62r79m68P66J366m95
$$ -952 -1678 915 1888 -790 -1929 545 1778 -230 -1456 -141 1000 538 -441 -909 -143 1223 728
1800G28k150K09K738O9l049l60L065O01k764q12K162R96j370j096M32J108N69
$$ 728 -1422 -1213 1525 1594 -1455 -1815 1250 1851 -913 -1725 437 1433 63 -1033 -601 507 1076
1817A076j072j499R69K269q15k778N84L037l20k969J8K618K93k006n96J233Q54
$$ 1076 4 -1495 -526 1743 928 -1850 -1266 1771 1451 -1518 -1500 1118 1411 -595 -1191 42 896
1834H96l42j059n63J198J358j241k011J216K417j069k587Q42K477n47k147K04
$$ 896 554 -505 -1068 130 1488 247 -1764 -548 1869 800 -1787 -945 1532 985 -1162 -958
1850i58J596J77r19n21J66Q58N57j098j188J258J642j308j909J249J930j055j756
$$ -958 638 815 -104 -625 -459 399 956 -142 -1330 -72 1570 262 -1647 -398 1532 477 -1279
1867a279P93J367m37q55M9K78L22L11o62q10R15J175j072j382J119J411j049j255
$$ -1279 -486 881 444 -411 -362 -84 238 549 -113 -923 -8 1167 95 -1287 -168 1243 194 -1061
1885a061Q76R34o18m94K85M3L5M38l46q59O08J157p76j310Q33J286p89j114O57
$$ -1061 -185 749 131 -363 -78 -35 0 438 92 -767 -159 998 222 -1088 -255 1031 242 -872 -215
1904b15P89m22l64J23r7J52N99m68r85O80J316q01j491Q34J482p33j318N33R97
$$ -215 574 152 -212 -89 -186 -34 565 97 -888 -208 1108 307 -1184 -350 1132 399 -919 -386 611
1923F11k17n75j37P1N00M58q32r43J062J343j200j597J190J688j041j620P42J395
$$ 611 394 -181 -318 -247 253 711 -121 -1064 -2 1341 141 -1456 -266 1422 381 -1239 -497 898
1941H98l38j041j21N85O11p4j071m31J421R06j651j276J729J520j613j633J343
$$ 898 560 -481 -602 -17 594 520 -551 -982 439 1345 -306 -1582 147 1667 54 -1579 -236
1958b36J587r08j408L66J120K30p23q56K99J364J65j787n84K025R30k060j181
$$ -236 1351 443 -965 -599 521 751 28 -828 -529 835 1000 -787 -1371 654 1584 -476 -1657
1975a657J902J305j540j301J006J201l83r93l01P30R47m10j501Q3J918K01k120
$$ -1657 245 1550 10 -1291 -285 916 533 -460 -761 -31 916 506 -995 -912 1006 1207 -913
1992i13m70K115O83j901q19J522Q55r84q48L60P83K76o50q69M77J388k95j757
$$ -913 -1383 732 1415 -486 -1305 217 1072 88 -760 -400 383 659 9 -860 -383 1005 710 -1047
2010a047J14J908O6j871k17J651L46j265m34P68M77j97m97l65M52Q82m05j273
$$ -1047 -933 975 1041 -830 -1047 604 950 -315 -749 19 496 299 -198 -563 -111 771 366 -907
2028i07L36J486k22j551J24J423k2j146n9P32J37k54j86k37K37O67k30j009K26
$$ -907 -571 915 693 -858 -734 689 667 -479 -538 194 331 77 -109 -346 -109 558 328 -681 -455
2047d55J212j98j270J57J164j07r13K8N64K8j45r0k88J31O79j53r98J50J198j21
$$ -455 757 559 -711 -554 610 503 -410 -382 182 210 65 -25 -313 -182 497 344 -654 -504 694 573
2067E73j255P6J137K3r16q0N57J65j31k22l31K73P61k93j108K76J324k05j399
$$ 573 -682 -606 531 554 -362 -442 115 280 149 -73 -404 -131 630 337 -771 -495 829 624 -775
2086g75P5J347L5j111j89P69L29l10m69j87N74O55o23j076O24J383n53j553M18
$$ -775 -700 647 682 -429 -618 151 480 170 -299 -486 88 743 120 -956 -332 1051 498 -1055 -637
2105f37J567k26j426lJ125K70p34n13K78P24K37r17o84J000J083r96j358Q65J523
$$ -637 930 704 -722 -725 400 670 -64 -577 -299 425 662 -255 -939 61 1144 148 -1210 -345 1178
2124A178o84j514M15J377j02j081k54O97O09k90q79j77J099O03j216r53J223J188
$$ 1178 494 -1020 -605 772 670 -411 -665 32 641 351 -528 -705 394 997 -219 -1172 51 1239
2142A239j111j310Q88J296n63j171J96R17K04n95n90K42R13J24j178m46J311P02
$$ 1239 128 -1182 -294 1002 439 -732 -536 381 585 -10 -600 -358 555 679 -499 -945 366 1068
2160A068j307q77J193R63r46r56O23Q42k28o66j71M40N61j91q69p7J104L01j219
$$ 1068 -239 -1116 77 1040 94 -862 -239 603 375 -291 -462 -22 539 348 -521 -598 506 807 -412
2179d12m72J187N88j053o28P96O05m82n04R7L58K74j95n85NQ52J66j002k88J026
$$ -412 -884 303 891 -162 -790 6 611 129 -375 -278 80 354 159 -426 -421 431 597 -405 -693 333
2199C33L90r61m09P72L85m82l21J43K27J82r0m83l6P21J60q86k63R23L46q68l65
$$ 333 723 -238 -647 125 510 28 -293 -150 77 259 169 -314 -350 371 531 -355 -618 305 651 -217 -582
2220e82O90L56m34l07J21K31J85j09n00j8P52J48r11k74R88L47r13m22P52M46
$$ -582 108 464 30 -277 -156 75 260 151 -349 -367 385 533 -378 -652 336 683 -230 -652 100 546
2240E46m83m28J58L62K02k67n39J29Q42qj022j50J127K83j101l97R36M90o77n36
$$ 546 63 -365 -207 155 357 90 -449 -320 522 514 -508 -658 469 752 -349 -746 190 680 3 -533
2260e33L40N43L7m86m38M26P76l22j036J60J221k8j254j52J182K99r71m32O64
$$ -533 -193 350 387 -99 -537 -111 665 343 -693 -533 688 660 -594 -746 436 735 -236 -668 -4
2279dN50k99o15j17O28N04n80q46N02J086l43j247J97J251kj131k06R22L88o11
$$ -4 546 247 -368 -485 143 647 67 -779 -277 809 466 -781 -584 667 665 -466 -672 250 638 27
2299B7n34K37O41J45o95n15O86Q18o13j030M80J144l40j113J22J003Q1p78k86
$$ 27 -507 -270 371 516 -179 -694 -8 810 197 -833 -353 791 451 -662 -540 463 544 -234 -520
2318e20M82M60j57o00j70O84M91p19p19O73Q77n58r45M26Q76k12p60J1N50K15
$$ -520 -38 422 265 -335 -505 179 670 -49 -768 -95 782 224 -721 -295 581 369 -391 -380 170 385
2338C85k95m16L1N35K53o36m84O54O41n92p28M80P38l37o46J44M88O8k88k52N2
$$ 385 90 -326 -295 240 493 -143 -627 27 668 76 -652 -172 566 229 -417 -273 215 283 -5 -257 -205
2359b05M01J73n14l63N64N23n53o11M73O28l44n62J65M34K1k52j99M7L60J61m95
$$ -205 196 369 -145 -508 56 579 26 -585 -112 516 172 -390 -225 209 230 -22 -221 -174 186 347 -148
2380a48l26N55M73n58n63N02N94l64n86K05M62J2l13k11J22L92Q6n50k76O30M36
$$ -148 -474 81 554 -4 -567 -65 529 165 -421 -216 246 258 -55 -266 -144 248 334 -216 -492 138 574
2401E74o32n64N62O38m38o39K68N67l6m48j99K74M23o8o08j29P32L23p75m66P21
$$ 574 -58 -622 -60 578 140 -499 -231 336 300 -148 -347 -73 350 282 -326 -455 277 600 -175 -641 80
2422H0N91o22o48M52O28j94n91n4M64L17l11n54J28P37O3q53k59Q90L96q07n29
$$ 80 671 49 -599 -147 481 287 -304 -358 106 423 112 -442 -314 423 486 -367 -626 264 660 -147 -676
2443f76O63N95m42o11J77N72J11m68l90L35O32j60q18PQ98J55q86l14Q15M33o51
$$ -676 -13 582 140 -471 -294 278 389 -79 -469 -134 498 338 -480 -473 425 580 -306 -620 195 628 -23
2464b3m96M01N30j39n11j41M26M25l50o34K19P93q0q61n7Q30J86p34k97N71L74
$$ -23 -519 -118 412 273 -238 -379 47 472 122 -512 -293 500 420 -441 -498 332 518 -216 -513 58 432
2485D32l31m14P6M20J84l97m26L43O01k31p30J31P48Qp13j16N87K14m00k98J84
$$ 432 101 -313 -237 183 367 -30 -456 -113 488 257 -473 -342 406 414 -299 -415 172 386 -14 -312 -128
2506a28L42O0l52k94L37M73k83n89J83O56p8o50j8N47J33m06k11K08K71Rl14k17
$$ -128 214 274 -78 -372 -35 438 155 -434 -251 405 327 -323 -341 206 339 -67 -278 -70 201 210 -104 -321
2528c21L08L99k86n20K20N94j21o04K9N33Q1m13j68K44K51m5l10j60L44L32l19
$$ -321 -13 386 100 -420 -200 394 273 -331 -302 231 312 -101 -269 -25 226 181 -129 -289 55 387 68
2549F8m87K72N77j82o08Q5N51O2m76j65K97K81j25l66q9M12K92m25m50L85N59
$$ 68 -419 -147 430 248 -360 -275 276 338 -138 -303 -6 275 150 -216 -305 107 399 -26 -476 -91 468
2570D68k88o41J91O28l9n61j08M28K62k58l71P5M55J32n15l16N17M69m60n80L61
$$ 468 180 -461 -270 358 319 -242 -350 78 340 82 -289 -214 241 373 -142 -458 59 528 68 -512 -151
2591a51O14k06o26M9N58R6l97k93K51M23n7n29j33N84L01n58m54M89N53l88n66
$$ -151 463 257 -369 -320 238 334 -63 -356 -105 318 261 -268 -401 183 484 -74 -528 -39 514 126 -440
2612d40K13N59k8m87j69L70L31k01m79M5N64J32o08k74N78L91m90m73L75M96k07
$$ -440 -227 332 304 -183 -352 18 349 148 -331 -286 278 410 -198 -472 106 497 7 -466 -91 405 198
2633A98m79J7M18J64l10l40J91M67n1n47j01N85K14n41l23M55L83l10m14J50L93
$$ 198 -281 -264 154 318 8 -332 -141 326 275 -272 -373 212 426 -115 -438 17 400 90 -324 -174 219
2654B19K1l27k18K43L68j28m74J1N27J16n34k19M79K93l51l36K00L45l9l03j29
$$ 219 240 -87 -305 -62 306 178 -296 -285 242 358 -176 -395 84 377 26 -310 -110 235 196 -107 -236
2675b36K44K90j76m00P3M65L9m99j43M59K40l97k75K42L20r6l12n5K64K06j90
$$ -236 8 298 122 -278 -205 260 299 -200 -343 116 356 -41 -316 -74 246 150 -162 -217 47 253 63
2696F3l51J09M53k2m86p9M79J76m21k39K99L04j62l02j9K97J79k54l28J93M24
$$ 63 -288 -179 274 252 -234 -313 166 342 -79 -318 -19 285 123 -179 -198 99 278 24 -304 -111 313
2717C13r1m98j1N06J06m68k00L71K85k37l33P8L49R6l31k61K81L91k07m84J10
$$ 313 222 -276 -287 219 325 -143 -343 28 313 76 -257 -179 170 266 -65 -326 -45 346 139 -345 -235
2738b35N32qn20j05M74K00l53k90K11L47n3l68j23L57K99l22m13K48M92j58n39
$$ -235 297 289 -231 -336 138 338 -15 -305 -94 253 200 -168 -291 66 365 43 -370 -122 370 212 -327
2759c27M6N11R1m30k10L22K97j64l70kM03J58l92k99L34M20k70m95J70M95k6m82
$$ -327 -281 230 321 -109 -319 3 300 136 -234 -236 167 325 -67 -366 -32 388 118 -377 -207 288 262 -220
2781b20p9L88K06k73k99J21L81K5m05j59L93K85l40l83K57M42j54m48M3L95R0
$$ -220 -299 89 295 22 -277 -156 225 250 -155 -314 79 364 24 -359 -102 340 186 -262 -219 176 266
2802B66l23k07K17K89p3l67n0L83J71l66k86L09L64k27l98J18L82ll32j15K52
$$ 266 -57 -264 -47 242 169 -198 -248 135 306 -60 -346 -37 327 100 -298 -180 202 199 -133 -248 4
2823DK27j31l10K3L62R6l67k01L33K89k77l39J87L45n3l34o0K72J75j92k59O9
$$ 4 231 100 -210 -187 175 271 -96 -297 36 325 48 -291 -104 241 188 -146 -206 66 241 49 -210 -141
2845a41L32K8l60j35L51K30l26k89K40L35j34l27J4K95J02k24k26J57K98m4l75
$$ -141 191 219 -141 -276 75 305 -21 -310 -70 265 131 -196 -182 113 215 -9 -235 -78 220 176 -199
2866a99m4L80J58l41k40K82K91j95l24Q5L14N4k83j74K09K80j10l71K7M06P0l94
$$ -199 -243 137 295 -46 -286 -4 287 92 -232 -147 167 221 -62 -236 -27 253 143 -228 -201 205 275 -119
2888a19j70L48K39k60l05J58L18k2l18r6K73K16k06l28J29L88l6m06p1L96J60
$$ -119 -289 59 298 38 -267 -109 209 187 -131 -227 46 262 56 -272 -143 245 209 -197 -268 128 288
2909B88l32k48K51K99j35l20J5L12J26k69k54K17L35j27l95K4M14P4l85j63L13
$$ 288 -44 -292 -41 258 123 -197 -182 130 256 -13 -267 -50 285 158 -237 -213 201 275 -110 -273 40
2930D0K33k10k90R4L17J9l00j54K59K62j97l43J15L91k6m00n6L47J56k69k28J75
$$ 40 273 63 -227 -133 184 203 -97 -251 8 270 73 -270 -155 236 210 -190 -246 101 257 -12 -240 -65
2952f5K69n5k94n6K89J76k60k53J96L16j18l58K0L55P1l06j43K22K19j33k69K2
$$ -65 204 149 -145 -201 88 264 4 -249 -53 263 145 -213 -193 162 233 -73 -216 6 225 92 -177 -155
2974a55K89Q0k72j92K27K72j71l06Q8L28Jl05r9K58J68j68k38Q0K65M1k79j49
$$ -155 134 214 -58 -250 -23 249 78 -228 -140 188 189 -116 -215 43 211 43 -195 -115 150 191 -88 -237
2996b37K66K23k12k78J38L22o1l10m0K72J25k05j97J19K62l7k80n5K65J59k54
$$ -237 29 252 40 -238 -100 222 161 -149 -189 83 208 3 -194 -75 187 150 -130 -185 80 239 -15
3017a5k19J84K85j12l17L1K97O6k51j60J83K27r6k71j0K91J01k77j82K39K46j65
$$ -15 -234 -50 235 123 -194 -163 134 200 -51 -211 -28 199 103 -168 -178 113 214 -63 -245 -6 240 75
3039G5k96Q5L10Ok82r6K33J91j66k43P0K91K3l09j17K88J83k33k47J62K82p8k89
$$ 75 -221 -136 174 180 -102 -198 35 226 60 -183 -113 178 201 -108 -225 63 246 13 -234 -72 210 132 -157
3062a57j5K54J27k20k02J46K63q0k89j7K94J18k72j95K25K47j51k62O0K58N6k38
$$ -157 -172 82 209 -11 -213 -67 196 116 -173 -190 104 222 -50 -245 -20 227 76 -186 -126 132 188 -50
3084e0j46K04K16j29k80N6K85L8k98j08K55J97k06k53J36K47k7k52o9K13J66j67
$$ -50 -196 8 224 95 -185 -129 156 194 -104 -212 43 240 34 -219 -83 164 137 -115 -184 29 195 28
3106B8k32J14K63k9k86n1K78J18k26j82J77K13q1k37kK24R5k05j75J70K18p9k74
$$ 28 -204 -90 173 144 -142 -193 85 203 -23 -205 -28 185 104 -133 -135 89 184 -21 -196 -26 192 113 -161
3129a61K5K65N5k39j45K09J88j21k36N4K30M0k21j29J84J99j39k37N2K78Qk72
$$ -161 -136 129 184 -55 -200 9 197 76 -160 -106 124 164 -57 -186 -2 197 58 -179 -127 151 159 -113
3151a13q0K36J42j70k06J03K49k1k33q2K17J61j88k07J26K43n0k62k2K54R7k23
$$ -113 -193 43 185 15 -191 -88 161 140 -93 -175 42 203 15 -192 -66 177 127 -135 -157 97 194 -29
3173b9j57J51J96m7k50rK32R9k16j66J71K10j00k57L3K61M8k48j01J76J73j26
$$ -29 -186 -35 161 114 -136 -145 87 186 -30 -196 -25 185 85 -172 -139 122 170 -78 -179 -3 170 44
3195D4k07L4K48M0k34j25K16J84j56k35J07K48j3k56n8K26J39j78j99J10K46m7
$$ 44 -163 -129 119 159 -75 -200 16 200 44 -191 -84 164 151 -105 -163 63 202 24 -175 -65 181 134
3217A34k47m4K27J25k11j80J58K28j00k38J8K20P0k00j46J62J88q5k27J5K39O3
$$ 134 -113 -157 70 195 -16 -196 -38 190 90 -148 -130 90 160 -40 -186 -24 164 79 -148 -133 106 169
3239A69k29j24J79J92j37k16N9K35J4k06j07J95J49j33j98O8K27J2k35q3K13J37
$$ 169 -60 -184 -5 187 50 -166 -107 128 142 -64 -171 24 173 40 -158 -90 137 149 -86 -169 44 181
3261A81j68j91J19K07m2k24k5K08J03j66j68J16J95m1k32j9K22R3k00j40J40J86
$$ 181 13 -178 -59 148 106 -118 -143 65 168 2 -166 -50 145 104 -128 -147 75 168 -32 -172 -32 154
3283A54p5k16J7K07O0j84j21J48J75r0k21K8K39M3k18j08J80J65j31j99O7K13
$$ 154 79 -137 -120 87 147 -37 -158 -10 165 75 -146 -118 121 164 -54 -162 18 183 52 -147 -80 133
3305A33Lk00q9J81J56j42k00P3K27k8k14n7J99J20j76j49J17J83l9k06k4J95J09
$$ 133 136 -64 -153 28 184 42 -158 -85 142 114 -100 -157 42 162 -14 -163 -46 137 98 -108 -132 63 172
3328A72j79j58J34K00r1k12K1K11O5j99j26J55J64q6j94K2J98M4j81j28J68J68
$$ 172 -7 -165 -31 169 78 -134 -113 98 163 -36 -162 -7 157 71 -123 -101 97 141 -40 -168 0 168
3350A68j21k03N5K14K1k15p9J84J37j38j75Q4J86Jj97q8K14J20j64j69J03K09
$$ 168 47 -156 -101 113 134 -81 -160 24 161 23 -152 -68 118 119 -78 -166 48 168 4 -165 -62 147
3372A47m1k10k6K06P2j62j31J17J73o4j88k1J95Q2j87j17J33J67p6k00J9K11L8
$$ 147 106 -104 -130 76 148 -14 -145 -28 145 81 -107 -128 67 149 -38 -155 -22 145 69 -131 -112 99 137
3395A37j93q6J35J54r9j81M4J93K6j99q0J66J29j13j75O5J90rj88m1J61J06j18
$$ 137 -56 -142 -7 147 48 -133 -89 104 130 -69 -149 17 146 33 -142 -77 113 104 -84 -125 36 142 24
3418B4j52O8J92k2j95m2J91Q8j53j35J03J65m5j88qJ66P2j42j23J08J43n2j92
$$ 24 -128 -60 132 110 -85 -127 64 152 -1 -136 -33 132 87 -101 -109 57 129 -13 -136 -28 115 63 -129
3441a29J6J82N1j54j07J32J41o9j77J6J84M4j68r1J31J46q5j75L2J96J5j88p8
$$ -129 -113 69 120 -34 -141 -9 132 63 -114 -98 86 130 -38 -129 2 148 63 -112 -80 116 131 -57 -135
3464a35J72J21j36j53O8J75rj87m1J51J12j28j60R3J85l9j94k6J85Q0j54j34J16
$$ -135 37 158 22 -131 -63 112 103 -84 -125 26 138 10 -150 -57 128 89 -105 -131 54 134 -20 -154 -38
3487c8J60n4j74KJ69P3j62j13J16J64q1j81J8J86M1j76r1J44J34j01j56K7J80
$$ -38 122 68 -106 -104 65 138 -24 -137 -21 143 62 -119 -101 85 126 -50 -141 3 137 36 -120 -93 87
3510H7K4j64q3J55J31j15j73P9J85k2j80o4J84R9j40j32P1J59j8j81l6J73Q9j33
$$ 87 111 -53 -136 19 150 35 -138 -59 126 104 -76 -140 44 143 3 -129 -58 101 83 -98 -134 39 128 -5
3534ej30J07J61o0j71NJ69M9j56r2J12J41o3j65J4J64N0j66p8J19J27q6j57L4
$$ -5 -135 -28 133 73 -98 -93 76 125 -31 -123 -11 130 67 -98 -84 80 130 -36 -114 5 132 46 -111 -77
3558g7J63K5j60o9J31J01r6j43N3J65Lj70n1J40J13j28j30P5J67l4j55j4J33P5
$$ -77 86 111 -49 -118 13 114 18 -125 -72 93 96 -74 -125 15 128 0 -130 -55 112 78 -77 -91 42 117
3582A17j13j16P5J45j8j62l1J64O8j50r6J05J34n7j55%J54M9j44r6J11J27n7j65
$$ 117 4 -112 -37 108 90 -72 -103 61 129 -21 -117 -12 122 65 -90 -90 64 113 -31 -127 -16 111 54 -111
3606a11K0J55M9j57q3J19J25q4j47M6J51Oj34o6J13J27r3j39L7J68Oj70n9J53
$$ -111 -91 64 113 -44 -127 -8 117 33 -114 -68 83 89 -45 -111 2 129 36 -103 -66 102 108 -62 -121 32
3630C2J14j28j43P2J68l3j55l3J37R0j24j23Q6J54m0j64rJ58N0j39r6J12J24n8
$$ 32 146 18 -125 -53 115 82 -73 -106 31 121 -3 -126 -40 114 74 -90 -99 59 109 -30 -126 -14 110 52
3654E2j48J3J56L6j49q6J19J29o7j58J5J77J3j39q4J44J14j08j36N3J48%j47n9
$$ 52 -96 -83 73 109 -40 -126 -7 122 55 -103 -88 89 102 -37 -121 23 137 29 -107 -54 94 94 -53 -112
3678a12J29J05r7j42O6J53k4j55l8J53O1j14j03Q3J34m6j30j4J29O7j14j19R7
$$ -112 17 122 25 -117 -51 102 78 -77 -115 38 99 -15 -118 -35 99 53 -77 -91 38 105 -9 -128 -31
3701c1J37n8j43L1J38K6j37n4R9J06n8j23K0J36J6j38p3J12J09q0j34M1J52j3
$$ -31 106 48 -95 -64 74 100 -37 -91 8 114 56 -67 -47 89 105 -33 -106 6 115 35 -99 -58 94 81
3725H1j39m8J31P7r4j09O2J13Pj39m7J27Q2p8j37O9J35l0j27k6J29O1j04r2O8
$$ 81 -58 -106 25 102 8 -101 -39 74 81 -58 -105 22 104 26 -111 -42 93 63 -64 -90 39 100 -4 -96 -28
3750b8J22k9j30j5J32N5j11j00R7J18n5j35J5J34K6j23o4P8J09o1j26K6J18L5
$$ -28 94 65 -65 -80 52 107 -4 -104 -7 111 56 -79 -64 70 96 -27 -91 -13 96 35 -91 -65 53 88
3774H8j31p2J19J10r7j29N8J37qj34l7J26P6q6j24M5J59j1j50k1J27P7j13j01
$$ 88 -43 -115 4 114 17 -112 -54 83 75 -59 -96 30 106 20 -104 -59 100 89 -61 -82 45 122 9 -92
3798i2P3J25m8j24rJ32N9j29q4Q2J20m3j33j0J34N3j31q4J05J15q7j18L1J18K4
$$ -92 -19 106 58 -66 -75 57 116 -13 -97 -15 105 62 -71 -81 53 106 -25 -109 -4 111 24 -94 -63 55 79
3823G9j22n9J10R6o8j26M3J36lj21n8J29Q7j02j14O2J26j4j47j7J11P5j09q9O2
$$ 79 -43 -102 8 104 36 -90 -47 89 86 -35 -93 36 123 21 -93 -31 95 81 -66 -83 28 103 -6 -95 -33
3848c3J20j7j45k4J44O3j33p7Q7J07m7j22J0J22L4j10p9Q3J20m9j36K3J20K5j14
$$ -33 87 70 -75 -99 45 108 -25 -102 -15 92 45 -77 -67 55 89 -21 -100 -17 103 54 -82 -59 61 86 -28
3873b8o4J02Q5p4r6L7J12Mj13n4J08Q5p9j05M8J08%j29m4J25O5q4r3N5J05k3j10
$$ -28 -92 10 95 21 -75 -38 74 78 -35 -89 19 104 25 -80 -32 76 76 -53 -97 28 93 9 -84 -29 76 53 -57
3900e7j6R4O9q7r8P5J05l0j26lJ14M9j09n7P2R5m1j12J0R9M3j00p5P9R9m7j16
$$ -57 -73 21 90 3 -95 -20 85 55 -71 -74 40 89 -20 -77 -5 90 49 -63 -53 46 89 -11 -86 -7 92 45 -71
3927g1K1J13K2j09n6Q8R7p5j22N1J08J9j28n4J05Q7q0j13O0J10oj22k7J13O0p9
$$ -71 -50 63 85 -24 -80 8 105 30 -92 -41 67 86 -42 -96 9 96 16 -97 -37 73 67 -55 -82 31 91 12
3953A2r7N7J06j1j25j5J09P6j00r4P6J11m8j26J0J18L1r4q0P2J02m5j23J3J23
$$ 12 -85 -28 78 67 -58 -73 36 112 12 -82 -6 105 57 -69 -59 59 90 -4 -84 -12 90 45 -78 -65 58
3978E8K5j21o0R9R0p2j09M4J15J3j31l9R3Q0o1j00L9J05J5j22l4J05Q1j07q6O6
$$ 58 83 -38 -98 1 91 19 -90 -46 69 82 -49 -88 5 85 24 -76 -37 68 83 -39 -73 32 113 6 -80 -14
4004a4J01k9j22jJ04M8q5p5N8R5k8j10rJ04N8j06p4P6Q7m7j05J4J09L3j03n5P4
$$ -14 87 58 -64 -65 39 87 2 -73 -15 80 52 -58 -67 37 95 -11 -85 -9 78 31 -74 -60 49 82 -21 -76 -2
4031bQ0n0r8MJ23J5j06m4R9O4o9r2M1R8Rj00m2R2O5o1q6K9R4Qj14k4R9O6j01q2
$$ -2 78 28 -70 -66 57 72 -34 -78 21 85 16 -76 -35 63 72 -28 -70 22 87 26 -60 -31 63 71 -43 -67 32 98 -3 -85
4061h5O2Q5j6j06j2Q9L8o5p2N0J06l2j05lJ11M0q8q4P8Q5k8j07K1Q8K8q2o2P2
$$ -85 -23 62 46 -60 -72 17 55 -10 -82 -32 74 42 -63 -66 45 85 -3 -87 -9 76 48 -59 -38 50 78 -4 -66 6
4089FR4o0r4JJ16J4j07m5R1O6o2r3K3J08Qr8n3Q5P9n6j11L9J18j8j06qR1N6r0
$$ 6 100 40 -54 -53 63 77 -30 -75 16 82 20 -73 -50 58 66 -32 -85 0 79 23 -88 -49 69 51 -55 -63 28 84 -6
4118fp5O0R3k4r5qR4N1r2p7O5R8l3j10%J10K5j04n3Q6P6n0r3J6R9J5r1o1Q2Q1
$$ -6 -81 -21 72 48 -47 -55 39 90 -2 -79 -14 84 51 -59 -59 51 76 -28 -81 5 81 31 -62 -46 53 68 -23 -84 -2 79
4148G9n8j00L5J03J2j15m4J00O2o8p5L1R4mr1k3Q7N6o7q8N7R7k6r9rQ5L9q2n6
$$ 79 21 -79 -44 59 71 -44 -88 12 74 6 -69 -38 56 52 -39 -62 25 81 14 -74 -17 80 54 -45 -54 31 70 -12 -68
4177f8O0R2l4j01KR0K6q4o2O1R4m8r1QR9J1q7l7O9N9m6p5J4R0K6q6m6P7O7m7r7
$$ -68 -8 84 50 -51 -49 41 67 -17 -79 -18 76 28 -63 -55 44 55 -32 -69 0 59 13 -62 -48 42 68 -18 -64 13 80 33 -64
4208f4M4Q2kq8l0Q0N2o9o6M0Q3jj03k2P5O0o8p9O3O9j8r8LQ7J8o0n3M6P5j5j00
$$ -64 -20 62 60 -28 -58 22 74 5 -61 -21 62 61 -42 -64 11 71 3 -76 -13 56 38 -60 -57 30 48 -12 -65 -19 56 41 -59
4239e9jR4L2q0o1P0Q4n0q9J6R7K6j00m7O7P3l7r3K3Q7K0q0n9P8P7p7p1L4Q2j0
$$ -59 -60 34 66 -14 -75 -5 79 29 -60 -44 53 79 -21 -68 -1 72 35 -58 -35 52 72 -8 -67 11 88 11 -60 -26 56 46
4269D6r5mP8M5p1p3M3P8kj00k1J00L6o9o7O5P1l0p9J4O4L3o3o0N8Q5l6j05J1J01
$$ 46 -49 -53 25 70 -1 -74 -31 47 45 -55 -76 24 60 -9 -76 -11 60 30 -49 -35 29 62 -1 -61 -3 82 46 -59 -48 53
4299E3K6r5m7O7P1n6q7K6Q6Oq7l6Q1N0m7q4K9R3jr5k4Q2M6o3o1L7Q3j2r1j0Q4
$$ 53 79 -16 -63 4 75 19 -68 -42 44 50 -37 -73 8 58 11 -73 -44 49 48 -47 -71 11 57 -6 -67 -30 53 41 -50 -60 24
4330B4K7m5o4L6P9k2p9qR0J7n3n9N1O9l8p4QP1J1o0m8N2P0m3o0MQ1Qq7k9P0M8
$$ 24 51 6 -58 -22 57 35 -44 -52 38 55 2 -57 -6 63 25 -49 -41 30 41 -19 -67 -15 55 12 -48 -44 37 45 -42 -71 -1 47
4362D7l8o4K4P2J1p8m1P6N0m4q0M3P6pp6j8O7K4m7o1M2N8Op4j9O1M5n7o0N1O6
$$ 47 9 -55 -31 41 52 -26 -67 9 59 15 -65 -22 54 47 -29 -47 20 44 -3 -64 -22 36 42 -32 -51 10 55 -2 -62 -11 55
4393E5j7r0MO7L4o9m2M0N9j7p8lP9L3p6m9O2P4m9p2J5Q1Np3j9O1M8m7p5K6Q2j
$$ 55 38 -52 -48 19 53 -16 -58 -18 41 24 -54 -57 22 55 -21 -70 -8 66 17 -55 -40 41 46 -27 -46 15 63 16 -59 -33 49 48
4425D8p6l6P5N8o2o5L6O0lq3j4Q3K6n7n5M0O0j0q1pQ5M1p7o5O1P1k8p3MP4K3n8
$$ 48 -28 -64 11 69 7 -58 -22 38 35 -48 -62 21 47 -10 -65 -25 35 25 -56 -63 22 63 -14 -79 -18 53 25 -48 -44 30 53 -5
4457en6N6O4k8p1J0P0J2o1m2O9M9n4p0K7P1j3o2k8O5N2n8o0K8Q0qq1j9O3N2p2
$$ -5 -61 -5 59 31 -40 -30 40 52 -9 -51 18 67 13 -57 -30 41 28 -34 -62 3 55 -3 -63 -35 45 37 -44 -63 0 52 -20
4488b0m2M7N2j0o1oN9K6m9n7M6O3j3p9KO7K3o6l3N3N3m2o0J6O2Lo1k8M2O2l8p5
$$ -20 -62 -15 37 27 -34 -40 19 45 -4 -61 -15 48 35 -44 -42 25 48 -18 -51 2 55 13 -47 -31 31 34 -27 -55 -13 49 11 -64
4520f4J9P5J2q0k7P6L5m6n3L0N9jo2k6O6M2m6o3K5Q7k5o0j7N8L5n5m2M0M8rn4
$$ -64 -45 30 42 -38 -65 11 46 0 -53 -23 36 35 -27 -53 13 55 9 -54 -29 58 33 -27 -44 14 49 -6 -48 -8 40 31 -23
4551b3j0N7K5n3n7M9O3j1q3LP1Qn3m7N0M7k9o2J2O0K0n7l5L7P0m1o3K2O5J4p2
$$ -23 -33 24 49 -4 -61 -12 51 40 -43 -40 31 39 -14 -61 -11 36 7 -55 -43 17 37 -20 -55 -18 52 11 -52 -30 35 49 -23
4582b3l2P0M4l5n9J2P3lo7k0O0L9m6o7K3Q2j4p6j0P0J9m8m3L2O3k4o4MN2K4n4
$$ -23 -55 15 59 24 -35 -23 50 47 -20 -40 20 59 13 -54 -31 51 37 -39 -49 21 40 -8 -51 -19 44 20 -44 -40 12 36 -18
4613a8l5M8N8l5o7J2P4J0o3j7M6K8k2o4K4O2On5l5N5L6l5o3K6P1k1o0oN0L1m7
$$ -18 -53 -5 53 18 -49 -37 37 47 -16 -33 13 41 19 -45 -21 41 47 -8 -43 12 48 13 -50 -24 47 26 -34 -40 10 41 -6
4644fj9J3L5jn2j6O0J9l9m5L9M6j4n8MN7Ql1l6L6N3m2m2LN2K9o3l0M6M5m1m3K1
$$ -6 -25 -12 23 22 -30 -46 14 33 -6 -51 -12 34 20 -38 -34 23 31 0 -36 0 53 11 -31 -28 24 53 -10 -40 6 51 10 -33 -12
4677a2M8pm7k4N1K9k8m4KN1J2m8l5N2L5l2n0K8N2j2n0j0M9K4l3m4K2N2Lo0mN1
$$ -12 36 29 -18 -42 9 38 10 -34 -32 19 31 -17 -52 0 35 3 -47 -19 33 21 -29 -39 10 34 1 -43 -21 31 34 -26 -30 21
4709B1L5n5n0M2L9rn1J1M0J3l0m6L2M0mo0kN5J9o2l4M0N0k9n0J3N3Om9j7M0L0
$$ 21 56 1 -49 -7 32 23 -28 -17 23 36 6 -40 -8 32 28 -32 -34 21 40 -22 -56 -16 34 5 -45 -32 21 27 -22 -39 1 31
4741C1k5m2J4M2K0n7k8P0J8k9n1K7N0j5m0j7N1K8m0m0J5N9ro3oM7K3m3l5M1M7
$$ 31 6 -36 -22 20 40 -17 -45 25 43 14 -37 -10 40 25 -15 -32 19 47 7 -33 -18 41 32 -31 -37 10 33 -10 -45 -4 43
4772D3k8n4KN2J0m2k3L3N2k4n3J2N2Np2j1O6K1k3n1K2M9jn2j3M2L5m3l7J5N8k0
$$ 43 15 -39 -37 15 25 -17 -40 -7 45 21 -32 -20 32 37 -35 -46 20 41 18 -33 -11 38 37 -15 -28 14 49 6 -31 -16 42 22
4804B2m9kL8K4m8k1J8M0j5k9oL2K6m6k2K5M5j0n7KN5J0n3j3M0K3on3JN0Qk8l8
$$ 22 -27 -29 9 33 -15 -36 -18 22 7 -22 -28 4 30 -16 -38 -13 32 22 -35 -33 22 32 -21 -34 6 29 23 -30 -29 21 29 1 -37
4837c7M7K9l2l5J2M8%m3j7L2L4l5k8%M4Nm3j9L6K7k8l6K0L9nm2MK9J7k2l4J6N4
$$ -37 10 39 7 -28 -16 32 32 -11 -28 4 38 3 -25 -25 19 24 -19 -38 -2 25 -3 -39 -19 20 15 -27 -23 6 23 1 -33 -17 37
4870C7pn0qL4K6l1l3L3L7k0n2J2L6J2k4l9K4L5j0l5jM6J4m7k7M4L5l9n0J5N6%
$$ 37 30 -20 -28 6 32 1 -32 1 38 18 -34 -22 14 26 2 -37 -13 22 12 -23 -24 22 36 -11 -38 6 41 2 -48 -33 23 23
4902B3m5j7M0L1k1m1J2L7J0m8j6M5K8l5l5L5L5j2n1KM7Mm4j4K4M5j0n5nN6J0n1
$$ 23 -22 -39 1 32 11 -30 -18 19 29 -19 -35 10 38 3 -32 3 38 26 -25 -23 24 28 -16 -30 -6 39 29 -26 -31 25 35 -16
4934a6k4L3M6l1l7PL4J7n3j3L7L1k1m4ON0Qn2rM4K6l8l6L6L0j3k4lK3K3k7k6N
$$ -16 -40 -7 39 8 -29 -22 12 29 -24 -37 0 31 10 -34 -28 22 30 -22 -31 13 39 1 -35 1 31 18 -6 -9 14 37 10 -16 -11
4967a1M2j6l3nM5Om6j2K4K1j1l5OL7Rl4j4J8L4j0n2J0M1J2m2pK9J5rk0%L2Ml6
$$ -11 31 15 -18 -23 22 28 -18 -30 -6 15 4 -31 -25 12 21 -13 -27 -9 25 15 -37 -27 14 26 -16 -23 6 21 12 -8 -8 24 28 -8
5001hnJ8K0j2l6RL9ml9%L0J0j0l7QL7jk5j9K6J7j3l4J4L6mn4RL8J9k9k3J1K2m
$$ -8 -13 5 25 13 -23 -14 25 21 -18 -18 12 22 12 -25 -17 20 19 -6 -25 1 18 5 -29 -15 21 17 -37 -28 10 29 0 -23 -12 10 6
5036Fj4rK6L0m0k9K3L9j3m2NL0J2k4j9K4K2j9k8JL4Rl5j7K0L2k2l4NM7rl5j9M9
$$ 6 -8 -17 9 39 -1 -30 -7 32 19 -23 -18 12 24 0 -19 5 27 8 -20 -19 15 24 -11 -28 -8 24 2 -32 -27 20 11 -24 -43 6
5070FPj6l7J9M3Kl7k4M8J7k4l7L0M2j9m2KM7Pl6k1K7K3j2k7oM4km9mK3K8k6l0
$$ 6 13 -3 -40 -21 22 24 -13 -37 11 28 4 -33 -3 39 20 -22 -20 27 34 -2 -23 4 27 15 -12 -18 26 24 -25 -29 -6 22 -4 -34
5104c4J9L9pm4lL0J7k3rmL4Nm1pK8L2l1l1K1K9k0j7J1J8K2l6k3K6RJ1l4jL7Ql3
$$ -34 -15 24 17 -27 -30 0 17 -6 -15 -19 15 20 -21 -28 0 32 1 -30 -9 20 0 -17 -6 12 34 -2 -25 1 10 21 -13 -14 23 31 -2
5139bk6L2K0k2l5J1L2%k9j4J6K7nl3J0L5Jl0j0K4K5k5k0J9J2Nj5j5J3PJ3k4pL5
$$ -2 -28 4 24 2 -33 -22 10 10 -19 -33 -17 10 5 -28 -18 17 18 -12 -22 2 27 2 -18 1 13 18 3 -12 1 8 21 -3 -10 25
5173B5Jl0qK0J3k1k5K2K0ok2nK0Rql1NL4jl5pK5L4m2j4K2J2jk2%K3J6k7k3RN0
$$ 25 26 -4 -12 8 21 0 -25 -3 17 11 -11 -16 4 13 5 -26 -21 13 12 -23 -30 -5 29 -13 -27 -5 7 6 -16 -16 7 23 -4 -27 -18 32
5209C2j1l4oL9J5l3l5L4K7k2k6JK8J8k9k1J3L6k1l6KN1rl8j3L5K3l4k0J9K9kk6
$$ 32 21 -13 -19 20 35 2 -33 1 28 6 -20 -19 9 27 -2 -23 -10 26 5 -31 -29 22 13 -25 -38 -3 20 -14 -34 -15 14 12 -14
5242a4j1K6K1k6k5J9L3mm6K0L2J2l9k0L9J1k1k2lK9%k4k3L2K1j6k9J6L6j2l8j3
$$ -14 -25 1 22 -4 -29 -10 23 19 -27 -7 25 37 -2 -22 17 28 7 -15 -18 11 11 -13 -36 -4 17 1 -28 -12 24 12 -26 -39
5274c9M2J1m0jML4qj3k4L7K3k1l0K1L0k5k0PK5Qk0j8J0K2mj7%MK2j9k1K0K2j3
$$ -39 3 14 -26 -27 -23 11 3 -10 -34 3 26 5 -25 -4 26 1 -19 -12 13 21 1 -17 -7 15 11 -6 -6 -2 20 1 -20 0 22 9
5308Il1MK3Ok1lJ4qKj9QJ0K5k6j9K6J3pl4J9K4rqmOJ3Nk6J3OJ2k6j4J9J4j1j8
$$ 9 -22 -18 5 11 -10 -13 1 -7 -5 -24 -16 -6 19 -7 -26 0 13 6 -28 -9 15 6 -2 -6 0 13 18 -8 5 11 23 -3 -17 2 16 5 -13
5345a3PJ7Ok7kPJ5j2k2J4J6Mj8k6K9J1j8j8J7K6jl6kL4Oj5j4J7K1Qm1jL0J1k5
$$ -13 -6 11 17 -10 -12 -5 10 -2 -24 -10 6 10 -8 -34 -5 6 -12 -30 -13 13 12 -24 -26 8 14 -1 -15 2 23 31 -10 -11 19 30 5
5380El0K4L1j9k6J3K6j2k0rQK5nl0%K0J6m2oM2J4l8j8K8J9nk8kK8Mj5j2KK5Nk6
$$ 5 -25 -1 30 11 -15 -2 24 12 -8 -17 -9 16 11 -19 -19 1 17 -25 -31 11 25 -13 -31 -3 16 11 -17 -19 9 13 -2 -14 -12 13 18 -8
5416hMK5Kl0j0K9J4k6nJ2J5qj3k1K6Rj9j9LM2pm5%L9Mk7j4K8KMk6RJ7Nmk0OK0
$$ -8 -4 21 23 -7 -17 12 26 0 -5 7 22 14 1 -20 6 15 -4 -23 -20 22 15 -30 -30 9 13 -14 -28 0 2 6 -20 -11 6 11 7 -13 -7 13
5454A3mk4J0J9Nk5lK2Lmj5LJ0m%rmK7qj2l%J6k7LJ5j0pNj1J3Ljj8J0J2Oj3pL0
$$ 13 9 -15 -5 14 19 -6 -9 13 16 12 -3 0 10 6 6 -3 -7 20 12 0 -3 -3 13 -14 -11 4 -6 -13 -8 -19 -6 -3 -4 -22 -12 0 6 -7 -14 16
5494A6mk8J0J4KNj1pKJ4kqkJ7qk5J7NPk5RRRj7j3QJMmk2K3Rj1l0K3K1qk4KK2J2
$$ 16 12 -16 -6 8 10 15 4 -3 -1 13 11 3 1 18 10 -15 2 7 14 -11 -2 7 16 -1 -14 -6 -5 -1 -5 -27 -4 5 -6 -36 -13 8 0 -24 -22 0 12
5535A2k2oJ4J6jk4LK7Rk6j5RL4k3l2K1K7j3k2j7L4J1k4j4jL5ppk8K2J4k0k2K6
$$ 12 -10 -16 -2 14 13 -11 -8 19 28 2 -13 -4 30 7 -25 -4 23 10 -12 -29 5 16 -8 -22 -23 12 5 -2 -30 -8 6 -14 -36 -10
5569a0L2k2k7J2J4J0j9jJ3NMl0NK1J0j9j2J7K7k3k2K7J4j8j9OJ9J2k7j9OK6pk2
$$ -10 22 0 -27 -15 -1 9 -10 -11 2 7 11 -19 -14 7 17 -2 -14 3 30 7 -15 12 26 8 -11 -5 14 26 -1 -20 -14 12 5 -17
5603a7mK3Lk4nJ9Noj6K0J3j0j%LJ4pj5mJ8%j0jJ0Qj4mJ4mnOj7LJ6mj9LK0Mk0j4
$$ -17 -21 2 5 -19 -24 -5 0 -6 -22 -2 11 1 0 0 3 17 10 -5 -9 9 9 -1 -2 8 16 2 -2 12 8 3 9 -8 -5 11 7 -12 -9 11 15 -5 -19
5644a9K0J3j9lP%knKljJ5j0j2J4K1k6mJ2Qqj7J4J6oNj1MK1j0j7qK2J0l6KJ4J5
$$ -19 1 14 -5 -8 -1 -1 -3 -8 -6 -9 -10 5 -5 -17 -3 18 -8 -12 0 8 0 -17 -3 13 7 12 1 5 26 16 -1 -9 13 23 -13 -11 3 18
5682A8k6pNPRj8KJ2Qpj8JK2jk1j4M0jk2rJ4J6j1rKK1Nj9j5K4K0j5k0qM2j4l5%
$$ 18 -8 -15 -10 -3 6 -12 -10 2 10 3 -15 -14 8 7 -14 -28 12 11 -11 -20 -6 10 -1 -10 -8 13 18 -1 -16 8 28 13 -7 -15 27 13 -22 -22
5720b2M1oj8k0J4K0rj6oJ9J1rk1J6K1rj6rK8%k8PPJ0qjJ5kmqj3K5K3l1j1K0J2
$$ -22 19 13 -5 -25 -11 9 0 -16 -22 -3 8 -1 -22 -6 15 6 -10 -19 9 9 -19 -12 -5 5 -3 -4 11 9 5 -3 -16 9 32 1 -10 10 22
5757B2j1k3PL3j9prJ1Lj0Kk2K1Oj9LJ0J7k1j2J2J5j7LKjQKjpLJ0mj7J4K6k5rJ9
$$ 22 11 -12 -5 28 9 2 -7 4 7 -3 -1 -23 -2 4 -15 -12 -2 15 -6 -18 -6 9 -8 -5 -3 -4 4 6 5 -2 1 11 7 -10 4 30 5 -4 15
5796A5Kj9PMJ0Kj5Jj1LLJ1k4MJ5oj2RJ3pllkkJ4j8mOJ6nj9JK4nrJ1Qn%j0MJ1K
$$ 15 17 -2 5 9 19 21 6 7 -4 -1 2 13 -11 -7 8 2 -10 -1 12 5 2 -1 -3 -5 9 -9 -13 -7 9 4 -15 -14 10 5 -4 7 15 10 10 0 4 15 17
5839A7j5kPMnj9J9J8j8j2kJ0mnrJ2PKj2j2K0Rk0j6L0K2l3k1L4Rj0k9K3J1J1k8
$$ 17 2 0 7 11 6 -13 6 24 6 -6 -8 2 -2 -7 -16 -4 3 5 -7 -19 1 10 -10 -26 4 26 -7 -28 6 15 5 -24 -1 10 21 -7
5875gMJ1J2mj5JPJ8l2jJ9Ql0oL7mj8plJ4jj4j0J3J4Nk1kJ4Mj2j1J5J6k5jJ1On
$$ -7 -3 8 20 16 1 2 9 27 -5 -6 13 21 -9 -15 22 18 0 -7 -10 4 3 -11 -21 -8 6 11 -10 -12 2 6 -6 -17 -2 14 -11 -12 -1 5 0
5914@j1KKJ5%k1jL2pl0K4J4oj6mK5j3nrOoLQk1LJ5j5KlJ8oqJQJ%lPj2K0poR%K1
$$ 0 -11 -9 -7 8 8 -13 -14 18 11 -19 5 19 13 -3 -7 18 5 0 -9 -3 -9 -6 2 -19 -16 -1 -16 -14 -17 1 -5 -13 -12 -4 -3 -3 -6 1 -11 9 2 -4 5 5 26
5959B6m2J5J2mnNJ3qpPj2mRmok5L6Ok3qK3mj3MjPjokLJ0lj2KJ0Qj2rJ5J1j9nK0
$$ 26 -16 -1 11 7 2 7 20 12 5 12 0 -4 5 1 -5 -30 6 12 -11 -19 4 0 -13 -9 -10 -3 -4 -10 -12 -9 1 -2 -14 -12 -2 6 -6 -15 0 11 -8 -13 7
6002GRoj0%jK3rk5PK1j0k7OK7%l3J3NMj4MNKKj5j2K2Mk0%OL0rl8K0K6oj8%J0R
$$ 7 16 10 0 0 -1 22 13 -12 -5 16 6 -21 -15 12 12 -21 -8 -3 1 -13 -9 -4 -2 0 -15 -27 -5 -1 -21 -21 -15 15 6 -32 -12 14 8 -10 -10 0 9
6043Imr%OJ2j3j2J4K1l2j6K5J0j2k0J4J1pk1J3kQOk9LJ5Kk4QK5Mk2kK8Ok3JJ4
$$ 9 5 -4 -4 2 14 1 -11 3 24 -8 -24 1 11 -1 -21 -7 4 -3 -24 -11 -13 -5 1 -28 -25 -10 -8 -32 -24 1 5 -17 -19 9 15 -8 -7 7
6081GJ0j0nj1QKLorJ6mpQJ7qj8QM%j0kLj1QNnqPJ1j3qJ3Jj5J4Qj0qPJ6j3LJ7j3
$$ 7 17 7 2 -9 -1 1 4 -2 -11 5 1 -6 2 19 11 -7 1 5 5 -5 -7 -4 -15 -7 -2 -7 -15 -8 3 -10 -18 -5 -4 -19 -5 3 -7 -15 -8 8 -5 -2 15 2
6125BmQj0MMknoJ9j1nQoPj5J4J2j2j2PJ1oj1MllJkJJ8oj6jJ2Rj0j0K3nppJ4J5
$$ 2 -2 6 -4 0 4 2 -3 -9 10 -1 -6 2 -4 3 -12 2 14 2 -10 -3 8 2 -9 -5 -8 -11 -10 -12 -11 7 1 -15 -16 -4 5 -5 -15 8 3 -4 -11 3 18
6168A8nj9J3MRrj4NPKl0MK1%j1nJ5kj3lJ0knplJ7Ppj2LK5ok9K2J2rj5JJ6Jj2J
$$ 18 13 -6 7 11 20 11 -3 2 9 11 -19 -15 6 6 -5 -10 5 3 -10 -13 -3 -5 -10 -17 -20 -3 4 -3 -15 -12 13 7 -22 0 12 3 -12 -11 5 6 -6 -5
6210eOJ7mLk1QRqj4K0jj0j6J0J4jk3pJ4kRrOlJ4j4oNJ3oqJ0JmJJ1Mj8kNJ6mlj
$$ -5 1 18 14 17 -4 4 13 5 -9 11 10 0 -16 -6 8 7 -16 -23 -9 -11 -2 -11 -5 -8 6 -8 -14 -9 4 -2 -10 0 1 -3 -2 9 13 -5 -7 -2 14 10 7 6
6254FlLQj2j1RJ0pj1J8jj2PLkoP%lolkQj0Nj0PJ5j3rJ1J2j7LJ6%j0%J3Mj2nK1
$$ 6 3 6 14 2 -9 0 10 3 -8 10 9 -3 4 7 5 -1 6 6 3 -3 -6 -8 0 -10 -5 -15 -8 7 -6 -15 -4 8 -9 -6 10 10 0 0 13 17 5 0 21
6297B1pkkr%oJ4j5RRnk5NK5ol1J7J8j3lnJ0rjKmJ9NqpJ0Qj0j5J2J9j0j8MK8j2
$$ 21 14 12 10 1 1 -5 9 -6 3 12 7 -18 -13 12 6 -25 -8 10 -3 -6 -11 -1 -10 -11 -9 -13 6 11 3 -4 6 14 4 -11 1 20 10 -8 -4 24 12
6338A2pQpQorpK3lj8oRKlj4K0Oj7qJ0J3j1j1nJ1JJ2j4KJ9Ml0J5J9jk2pJ6OoJN
$$ 12 5 13 6 14 8 -1 -8 15 12 -6 -12 -3 -1 -4 -18 2 8 -9 -17 -7 6 -5 -16 -21 -10 -9 3 -11 -9 10 14 -16 -1 18 17 -5 -12 4 10 4 5 10
6380A0pOplKOKnoQOk7PJ5j3K%Nkj4J3jj5K2j1jOMNj9J2J1j9jJ2J6j8lJ5lj5QK
$$ 10 3 9 2 -1 1 7 9 4 -2 6 12 -15 -8 7 -6 -4 -4 1 -1 -15 -2 -3 -18 4 -7 -8 -2 2 7 -12 0 11 -8 -9 3 19 1 -2 13 10 -5 3 5
6423ELnmRj3J1jj1KmRj2rJ5OkrJ4nk0J5Nj6lNOMMj1KkJ4LlNOolQJkk1J5OonLm
$$ 5 8 3 -1 8 -5 6 5 -6 -4 -8 1 -11 -20 -5 1 -1 -10 4 -1 -21 -6 -1 -17 -20 -15 -9 -5 -1 -12 -10 -12 2 5 2 7 13 7 4 12 13 11 -10 5 11 5 0 3 -1
6471aPkj0jPQk6QJ0%j8JJ5LnrPNLmn%KOj0%J3Lk1NL5k1j3J6QqJpMLLj5nPJ5k0
$$ -1 6 4 -6 -7 0 8 -18 -10 0 0 -18 -17 -2 1 -4 -13 -6 -1 2 -2 -7 -7 -5 1 -9 -9 4 7 -14 -9 26 5 -8 8 16 8 9 2 6 9 12 -3 -8 -1 14 -6
6517fj4PK2k2qJ7J6k2k%JNjj1J5QorJJ5Mj4QQRk1kLJ4%j7NJ1rKj0J1K%j5OJ3j2
$$ -6 -20 -13 9 -13 -21 -4 12 -10 -12 -12 -11 -6 -7 -18 -3 5 -1 -10 -9 6 10 -4 4 12 21 0 -2 1 15 15 -2 3 14 5 7 -3 8 10 10 -5 1 14 2
6560Brj2K3kj6mJ4qlJ0Oj2J0Kj3J3Mj0oJ8J1j0j6RJ2rj0QRrj4J4Lk%Rj3NlrJ0
$$ 2 -7 -19 4 2 -14 -18 -4 -12 -15 -5 1 -11 -1 1 -12 1 5 -5 -11 7 18 8 -8 1 13 4 -6 2 11 2 -12 2 5 3 3 12 -1 4 1 -8 2
6601Bjjj6QmJ1j8jJ9mrJ1qPmJnMJ8j4kPQmnQOMl4L1Lj0MnOllpMj3J7j1j%J6j6
$$ 2 1 0 -16 -8 -12 -1 -19 -20 -1 -5 -14 -3 -11 -4 -8 -7 -12 -8 10 -4 -6 1 9 5 0 8 14 18 -16 15 18 8 12 7 13 10 7 0 4 -9 8 -3 -4 -4 12 -4
6647dj2J8J0k5LJ7nlk1K1oJ2Jj2jJ1jjnJ7Mk0%J4jj0NQlj0J%OmpkRm%j5QJ6rl1
$$ -4 -16 2 12 -13 -10 7 2 -1 -22 -1 -7 5 6 -6 -7 4 3 2 -3 14 18 -2 -2 12 11 1 6 14 11 1 2 2 8 4 -3 -5 4 0 0 -15 -7 9 0 -31
6691c1K2K5j8k1OJ6Rj3nJ2%Kk%NOj3j2J7J9j3kmPpj%KljnNKNj4NJOj8%MOqj4J9
$$ -31 -9 16 -2 -23 -17 -1 8 -5 -10 2 2 4 2 2 7 13 0 -12 5 24 11 9 5 12 5 4 4 6 3 2 -3 2 4 9 -5 0 1 7 -11 -11 -7 -1 -9 -23 -4
6736dJj3J1LjKqRJqOj2J8J4oj9J0LpmkJ0Pj2%Kj0Rj0LJkmj2J8rNj2J1J5k4MJ3
$$ -4 -3 -16 -5 -2 -3 -1 -9 0 1 -7 -1 -13 5 19 13 -6 4 7 0 -4 -6 4 11 -1 -1 1 -9 0 -10 -7 -6 -8 -12 -24 -6 -15 -10 -22 -11 4 -20 -16 -3
6779cMrQnQqJrNJ9nj5LK3j1ojJ7qj4J2Mj4%RmMoj2QM%moJ0okk0J7J8j3j0PJ8j6
$$ -3 1 -8 0 -5 3 -5 -4 -13 -8 11 6 -9 -6 17 6 0 -1 16 8 -6 6 10 -4 -4 5 1 5 -1 -13 -5 -1 -1 -5 -11 -1 -7 -9 -29 -12 6 -7 -17 -10 8 -8
6824hMlROj1L%RKj5mJ6J0k1%J6Jj2nNJ3j2Oj3oJ8j3l%J4j3nKJ3j7pJ2J3mj4KJ1
$$ -8 -4 -7 2 8 -3 0 0 9 11 -4 -8 8 18 -3 -3 13 14 2 -3 2 15 3 9 -4 -10 8 -5 -8 -8 6 -7 -12 -10 3 -14 -21 -9 4 0 -14 -12 -1
6866aLj1RpPJ2j5PnRJo%J8j2j8J0LjkMjMJqoMJjpQlj0%J3%j1j0K1k%lMLj3J6o
$$ -1 2 -9 0 -7 0 12 -3 4 -1 8 9 3 3 21 9 -9 1 4 3 1 5 4 8 9 1 -5 -1 0 -1 -8 0 -3 -13 -13 0 0 -11 -21 0 -2 -2 -5 -1 2 -11 5 -1
6913aPj1J2kLLQj5KKMj7J6Mk1KOQj3Kj1kJ5lnj0J1Lmj7K2kj1nJ9QoqQokJ1j2R
$$ -1 6 -5 7 5 8 11 19 4 6 8 12 -5 11 15 -6 -4 2 10 -3 -1 -12 -14 1 -2 -7 -17 -6 -3 -7 -24 -2 -4 -15 -20 -1 7 1 -7 1 -5 -7 4 -8 1
6957AJ6Jk0PRmj7J1Olj2NK%j4J3M%nmj1J0Kj3oOKJ2rO%MqNJ3j4J0lJ2Jjj8QJ2
$$ 1 17 18 -2 5 14 10 -7 4 10 7 -5 0 2 2 -12 1 5 5 0 -4 -15 -5 -3 -16 -22 -16 -14 -2 -11 -5 -5 -1 -9 -4 9 -5 5 2 14 15 14 -4 4 16
7001A6Jj6PkJ2j1nnPJj2OQPj4lMnnMj0J8%j4oJ5nj0J3Pj%rK0mJN%nomMPlJ0j9
$$ 16 17 1 8 6 18 7 2 -3 4 5 -7 -1 7 14 0 -3 1 -4 -9 -5 -15 3 3 -11 -17 -2 -7 -17 -4 3 2 2 -7 13 9 10 15 15 10 4 0 4 11 8 18 -1
7047aOJ3k4PK%J2j8J4pJpJoNJ2j5j2J2%nmJ0J0j7qJ1OOj2J2mJ0kkJjrLNJ0lon
$$ -1 5 18 -6 1 3 3 15 -3 11 4 5 -2 -1 -7 -2 10 -5 -17 -5 -5 -10 -14 -4 6 -11 -19 -8 -2 4 -8 4 0 10 8 6 7 6 -3 0 5 15 12 6 1
7091ANMrNnLj1OkpRRrj3PnMNJ3j7MjJ3j3jQmR%qQnLj1J7pJ8k4qK5jj6kRklM%P
$$ 1 6 10 1 6 1 4 -7 -1 -3 -10 -1 8 -1 -14 -7 -12 -8 -3 10 -7 -3 -4 9 -4 -5 3 -1 8 8 0 8 3 6 -5 12 5 23 -1 -9 16 15 -1 -3 6 4 1 5 5 12
7140A2lj1j%j1QqJ3Lj2RmJ1mrMM%qQRklNKkkklLOOj1JRpj2lJ9oj3K1j7Jj0J7m
$$ 12 9 -2 -3 -3 -14 -6 -14 -1 2 -10 -1 -5 6 2 -7 -3 1 1 -7 1 10 8 5 10 12 10 8 6 3 6 12 18 7 8 17 10 -2 -5 14 8 -5 16 -1 0 -10 7 3
7187CKqoOmJ1nlkojLJ2Rrj1J9%jjoRJKm%J9k3lNOj3KmJ5qj2OJ2j9jJ0j5J9j6N
$$ 3 5 -3 -9 -3 -7 4 -1 -4 -6 -12 -13 -10 2 11 2 -9 10 10 9 8 2 11 12 14 10 10 29 6 3 8 14 1 3 -1 14 6 -6 0 12 -7 -8 2 -13 6 -10 -5
7233enmRJj2J1J5k3J0QPj1QjMknrPJ4j1OqJL%Lj1LoNJ0onljl%J1pj0PJ2j1jLm
$$ -5 -10 -14 -5 -4 -16 -5 10 -13 -3 5 12 1 9 8 12 10 5 -4 3 17 6 12 4 5 8 8 11 0 3 -3 2 12 6 1 -2 -3 -6 -6 5 -2 -12 -5 7 -4 -5 -2 -6
7280f%M%LoKJ8j1jL%PoOkOllJMmnjkl%jjN%nKnOpjoQJKpJ1KpRJ0j7qK3plllOK
$$ -6 -6 -2 -2 1 -5 -3 15 4 3 6 6 13 7 13 11 17 14 11 12 16 12 7 6 4 1 1 0 -1 4 4 -1 1 -4 2 -5 -6 -12 -4 -3 -1 -8 3 5 -2 7 17 0 -8 15 8 5 2 -1 5 7
7335GLoJKQrKnJ9j7nJ0rOmnMJrlQPjj3jkRopK0JllQnKkPkjjpRJKj3KJ2Kj2rJ9
$$ 7 10 4 5 7 15 6 8 3 22 5 0 10 1 7 3 -2 2 3 -6 -9 -1 6 5 -8 -9 -11 -2 -8 -15 5 6 3 0 8 3 5 3 10 8 7 6 -1 8 9 11 -2 0 12 14 2 -7 12
7387A2qqkJ0kkmmMlKpJ8j0mj7K2KqlJ3jj2LNPjJlOKj1P%J3qoO%pMKJqnj%KloJ
$$ 12 4 -4 -6 4 2 0 -4 -8 -4 -7 -5 -12 6 -4 -8 -25 -3 -1 -9 -12 1 0 -12 -9 -4 3 2 3 0 6 8 -3 4 4 17 9 3 9 9 2 6 8 9 1 -4 -5 -5 -3 -6 -12 -11
7438a1OLpomJ0OjpRmmOJ%jNJ0j6%LRQqoJ1Qk2J1pJ6npojOo%oLjoQjnkklNkLmJ2
$$ -11 -5 -2 -9 -15 -19 -9 -3 -4 -11 -2 -6 -10 -4 -3 -3 -4 1 11 -5 -5 -2 7 15 7 1 12 20 -2 9 2 18 13 6 0 -1 5 -1 -1 -7 -4 -5 -11 -3 -4 -9 -11 -13 -16 -11 -13 -10 -14 -2
7491bMj1OOllNj2J2OoLlJ%OrOJj0J1Jj8PjMnqRnNj3J1j8J6qjOJ4j1nkLJ4rOpN
$$ -2 2 -9 -3 3 0 -3 2 -10 2 8 2 5 2 3 3 9 0 6 7 -3 8 9 -9 -2 -3 1 -4 -12 -3 -8 -3 -16 -5 -23 -7 -15 -16 -10 4 -7 -12 -14 -11 3 -6 0 -7 -2
7539bMNjLnJjPjkpkJ0%j8POmlrJ3pqQqMmKkJ8plnjJ4qMjloRLjnJ2LnJqQlNJj2
$$ -2 2 7 6 9 4 5 4 11 10 8 1 -1 9 9 -9 -2 4 0 -3 -12 1 -6 -14 -6 -14 -10 -14 -12 -14 4 -3 -6 -11 -12 2 -6 -2 -3 -6 -12 -3 0 -1 -6 6 9 4 5 -3 5 2 7 8 -4
7593dlJ0jrQOJj9MJmqLlLJ1pkJqQJLJ5oj2KJ4j0LQPn%%%j1NMJLkrNLMproJ4mk
$$ -4 -7 3 2 -7 1 7 8 -11 -7 -6 -10 -18 -15 -18 -15 -4 -11 -13 -12 -20 -12 -11 -8 7 1 -11 -9 5 -5 -2 6 13 8 8 8 8 -3 2 6 7 10 8 -1 4 7 11 4 -5 -11 3 -1 -3
7645cmJj2J1JqPnjQKJQj0jJPj0J9oJmJ2opJ1rPMolNmLn%JokJPpqMMmjj1NLNMq
$$ -3 -7 -6 -18 -7 -6 -14 -7 -12 -13 -5 -3 -2 6 -4 -5 -4 3 -7 12 6 7 3 15 9 2 13 4 11 15 9 6 11 7 10 5 5 6 0 -2 -1 6 -1 -9 -5 -1 -5 -6 -17 -12 -9 -4 0 -8
7698hjJ3ljKKkpOPjmPJKj2KJ7j2n%lLLj0KJ1okqJ0Kj3%MjqJ1OqKJKK%lnJ3pQ%
$$ -8 -9 4 1 0 2 4 2 -5 1 8 7 3 10 11 13 1 3 20 8 3 3 0 3 6 -4 -2 9 3 1 -7 3 5 -8 -8 -4 -5 -13 -2 4 -4 -2 -1 1 3 3 0 -5 8 1 9 9
7749InJ2%j4QkJ0j7%QJ2j6nlKnj0JJ0J5j9J3pnJknOlOrMjmJ9ljOpJ0%noJ2J1k3
$$ 9 4 16 16 2 10 8 18 1 1 9 21 5 0 -3 -1 -6 -16 -15 -5 10 -9 4 -3 -8 -7 -9 -14 -8 -11 -5 -14 -10 -11 -15 4 1 0 6 -1 9 9 4 -2 10 21 -2
7795bKmJ7mMj0LqJ3kj3J0mLpJ2qnJj1KJ2pnKO%plJ6KMj7QlLPPpmmRjlJJkNj7R
$$ -2 0 -4 13 9 13 3 6 -2 11 9 -4 6 2 5 -2 10 2 -3 -2 -13 -11 1 -6 -11 -9 -3 -3 -10 -13 3 5 9 -8 0 -3 0 7 14 7 3 -1 8 7 4 5 6 4 9 -8 1
7845AkMmj0J0lJj0J0PMj7RmPqL%oljJPPqMPNqpkJ6OqoNNnLrKjpOJrKj4J5lkLL
$$ 1 -1 3 -1 -11 -1 -4 -3 -13 -3 4 8 -9 0 -4 3 -5 -2 -2 -8 -11 -12 -11 -4 3 -5 -1 6 11 3 -4 -6 10 16 8 2 7 12 7 10 1 3 2 -5 1 2 -7 -5 -19 -4 -7 -9 -6 -3
7898cmNqJ0oNLrkRloPKmkRNlj0J4Pj0KLj4J1KmQpNpJrRj8J0j3RoMJPonOoJLRm
$$ -3 -7 -2 -10 0 -6 -1 2 -7 -9 0 -3 -9 -2 0 -4 -6 3 8 5 -5 9 16 6 8 11 -3 8 10 6 14 7 12 5 6 -3 6 -12 -2 -15 -6 -12 -8 -7 0 -6 -11 -5 -11 -10 -7 2 -2
7950bpJQj0J5j0MJKJ0jKnJ0k3NJ%QokjnRkqJ3j1pkPJ2j4qQnOmlJ0LPk0RPmm%J2
$$ -2 -9 -8 0 -10 5 -5 -1 0 2 12 11 13 8 18 -5 0 1 1 9 3 1 0 -5 4 2 -6 7 -4 -11 -13 -6 6 -8 -16 -8 -13 -7 -11 -14 -4 -1 6 -14 -5 2 -2 -6 -6 6
7999FljMQj0kRNoj1J0lrRj1jNkLnOj1NlJQrKLlNj2KKJ2j0klK2rjJ0LnKnONnL%
$$ 6 3 2 6 14 4 2 11 16 10 -1 9 6 -3 6 -5 -6 -1 -3 0 -5 1 -10 -5 -8 -7 1 -8 -6 -3 -6 -1 -13 -11 -9 3 -7 -9 -12 10 1 0 10 13 8 10 5 11 16 11 14 14
8050A4j1NnjRprJOplKpPLj4J3jNk%oOMj4J3nQloK2qrLJ0j8J5kLnjjJ1%j5LJ0j5
$$ 14 3 8 3 2 11 4 -5 -4 2 -5 -8 -6 -13 -6 -3 -17 -4 -5 0 -2 -2 -8 -2 2 -12 1 -4 4 1 -5 17 9 0 3 13 -5 10 8 11 6 5 4 15 15 0 3 13 -2
8098bJ0omJ2kk8K3mrRp%%oJ3JmoJNLLqNOOq%J1kkKRJj0oOkj2QlKNmr%RqklkJ1
$$ -2 8 2 -2 10 8 -20 3 -1 -10 -1 -8 -8 -8 -14 -1 0 -4 -10 -9 -4 -1 2 -6 -1 5 11 3 3 14 12 10 12 21 22 12 6 12 10 -2 6 3 5 10 6 -3 -3 6 -2 -4 -7 -9 2
8150Bkj6PPn%J0MmnjNONLj0KRJj0J3j1Oj5J4joLknLj2KjQnkloRk
$$ 2 0 -16 -9 -2 -7 -7 3 7 3 -2 -3 2 8 13 16 6 8 17 18 8 21 10 16 1 15 14 8 11 9 4 7 -5 -3 -4 4 -1 -3 -6 -12 -3 -5
8191e
$$ Imaginary data points
##PAGE= N=2
##DATA TABLE= (X++(I..I)), XYDATA
0@%%%%%%%%%%%%%%%%JrJ6j6J6j6K4l2L2l8M6m8N6o5P3q8J04j13J22j40J63j84
$$ 0 0 0 0 0 0 0 0 0 0 0 0 0 0 0 0 0 1 -8 8 -8 8 -8 16 -16 16 -22 24 -24 32 -33 40 -48 56 -57 65 -75 88 -96
38i6K01k26K55k79L06l44L84m24M67n15N69o26O88p59Q38r23J020j128J249j387
$$ -96 105 -121 134 -145 161 -183 201 -223 244 -271 298 -328 360 -399 439 -484 536 -592 657 -730
58g30J548j738J961k234K575l009L591m411N661p827J2587m0937L1014Q2355q3755
$$ -730 818 -920 1041 -1193 1382 -1627 1964 -2447 3214 -4613 7974 -32963 -1949 80406 -3349
73c349n9338N3853N9381l8120l9804N692K8883J8486r286m7888k652O7226J7175
$$ -3349 -62687 -8834 50547 12427 -27377 -21685 7198 25684 16398 -31490 -34142 33084 50259
86E0259q4685k4217R0273L1003r0235l1294P9241L0701o3182k5971L9886K1371
$$ 50259 -34426 -58643 31630 62633 -27602 -58896 20345 51046 -12136 -38107 1779 23150
98B3150j4937j5015j1678J0086L5238n350n5261K673O8595q86p5057Q45P3564
$$ 23150 8213 -6802 -18480 -8394 26844 21494 -33767 -31094 37501 36615 -38442 -37597 35967
111C5967j358o5172K494N0661l179l2081L261J1451k124Q695j95k6481L776L9934
$$ 35967 34609 -30563 -28069 22592 19413 -12668 -9407 2044 -80 8615 8420 -18061 -14285 25649
125B5649q225m7956J3029M9887j7643m6040K1346L7212k3529k4835K3722J0714
$$ 25649 17424 -30532 -17503 32384 14741 -31299 -9953 27259 3730 -21105 2617 13331
137A3331k1770L303J7704j5425j1756K4336M500k9021L482K9107j1360k4779J8427
$$ 13331 -8439 -5136 12568 -2857 -14613 9723 14223 -14798 -11316 17791 6431 -18348 79
150G9J6848k3991o520K7548m768k8843J5422K7736k3992k4422K9214J9190l0361
$$ 79 16927 -7064 -13584 13964 9196 -19647 -4225 23511 -481 -24903 4311 23501 -6860
163f860j2583K7070N266j9658K117Q943q897L805J4603j7082j8769K9350K1154
$$ -6860 -19443 7627 12893 -6765 -4648 4295 -4602 -797 13806 -3276 -22045 7305 28459
176B8459l8900k1718M4510K0579m5287j8062M0931J4642l1758j0791J8602O886
$$ 28459 -10441 -32159 12351 32930 -12357 -30419 10512 25154 -6604 -17395 1207 8093
188H093k911l379j3721M42K9530J836m2811l557N2059M855n6250n935N4938P031
$$ 8093 5182 1803 -11918 -11476 18054 19890 -22921 -26478 25581 30436 -25814 -31749 23189 30220
202C0220m8152q258L6561R729k1226j1401L841J3119J4032j4668l0611J5681M4218
$$ 30220 -17932 -26190 10371 20100 -1126 -12527 -8686 4433 18465 3797 -26814 -11133 33085
215C3085j5807n3576J4766N7753j2413n6415Q566M9729l411l8479k813K3831R663
$$ 33085 17278 -36298 -21532 36221 23808 -32607 -24041 25688 22277 -16202 -19015 4816 14479
228A4479p400j6544r156K2798K4246k7672l6349L0625M4398l1075m7804K8873
$$ 14479 7079 -9465 -18621 4177 28423 751 -35598 -4973 39425 8350 -39454 -10581
240a0581M6432k3927m0710J6599L1494p441j9925k816P369J3162M845k2725j5516
$$ -10581 35851 11924 -28786 -12187 19307 11866 -8059 -10875 -3506 9656 14501 -8224 -23740
253b3740L0443K3675l5627k8689L7639L0335l6280k8727L1573K4384k3979j7993
$$ -23740 6703 30378 -5249 -33938 3701 34036 -2244 -30971 602 24986 1007 -16986
265a6986J4195J0520l111k933q111l892J8471R237k6919j2553L2668J3677l5210
$$ -16986 -2791 7729 4618 1685 -6426 -10318 8153 17390 -9529 -22082 10586 24263 -10947
278a0947j2609L4303R699l0191n554K3336Q68j4572L547M851p012M754Q974j3272
$$ -10947 -23556 10747 20446 -9745 -15299 8037 8905 -5667 -2120 2731 -4281 473 9447 -3825
292c825r131J9869P425k3892m056K5061m95k3360N583J9277j0521j3337J4528
$$ -3825 -12956 6913 14338 -9554 -13610 11451 10956 -12404 -6821 12456 1935 -11402 3126
305C126O473j7090M91J7750o676j6307J1263J2845j3834p684J4091J288j2128
$$ 3126 9599 -7491 -7000 10750 4074 -12233 -970 11875 -1959 -9643 4448 5736 -6392
318f392N629Q326j2382l287J8255k253k2580P468K4912j1582k4889J3978K2494
$$ -6392 -763 7563 -4819 -8106 10149 7896 -14684 -7216 17696 6114 -18775 -4797 17697
331A7697j4180j7895J2102J1580p895m124J971l716M922J1208j1965j7638J8240
$$ 17697 3517 -14378 -2276 9304 1409 -2715 -744 -4460 462 11670 -295 -17933 307
344C07K2332k2895k4959K5203K5271k4741k3345K1314J9489j5172j4166O863P980
$$ 307 22639 -256 -25215 -12 25259 518 -22827 -1513 17976 2804 -11362 -4499 3481
357C481K790j518j2798m571K2100R863k9564j3964L4364J6672l5837j7904L3701
$$ 3481 6271 4753 -8045 -12616 9484 19347 -10217 -24181 10183 26855 -8982 -26886 6815
370F815J7760k8097j6405J9482J4071q729j1058l188P686J5015m285k5592J029
$$ 6815 24575 -3522 -19927 -445 13626 4897 -6161 -9349 -1663 13352 9067 -16525 -15496
383a5496L3852J835l8894m218M0189O062l7573p410L1386Q328k2197q872J1001
$$ -15496 18356 20191 -18703 -22921 17268 23330 -14243 -21653 9733 18061 -4136 -13008 -2007
396b007R189J073r318j2786R282K3031r097l0746Q626L5251p811l6200O527L3569
$$ -2007 7182 8255 -1063 -13849 -4567 18464 9367 -21379 -12753 22498 14687 -21513 -14986 18583
410A8583m704k7804K280J9601O21r918l859j91P239R683j0416j7634J3085K3280
$$ 18583 13879 -13925 -11645 7956 8577 -1341 -5200 -5391 1848 11531 1115 -16519 -3434 19846
424A9846j4867k6185J5602K6185j5078k3466J3235J8504j0194j1986O193M756
$$ 19846 4979 -21206 -5604 20581 5503 -17963 -4728 13776 3582 -8404 -2211 2545
436B545j512K297l397q418Q067J2910j2138j5365J5185J5584j6923j3671J7164
$$ 2545 1033 3330 -67 -8485 -418 12492 354 -15011 174 15758 -1165 -14836 2328
449B328J0029j5885n218J3256l5r497M971N053q922l30J1373m196j1953Q059J0603
$$ 2328 12357 -3528 -8746 4510 4475 -5022 -51 5002 -3920 -4250 7123 2927 -9026 -967 9636
464I636j0926p482J2510L036j2756K143J1692p370r608J1930O766j5227l615J6788
$$ 9636 -1290 -8772 3738 6774 -5982 -3839 7853 483 -9125 2805 9571 -5656 -9271 7517
478G517N25j6293K095J3757l956r349M865L628m838K951L880r540k306J5490M35
$$ 7517 8042 -8251 -6156 7601 3645 -5704 -839 2789 -2049 902 4782 -4758 -7064 8426 8861
493H861k0082J442K2751k949k3158L768K1192l746j7022K753J0995q50l806j800
$$ 8861 -11221 -9779 12972 10023 -13135 -9367 11825 8079 -8943 -6190 4805 3955 149 -1651
507a651l833M773J1255p791j7589J0333K2269j2040k4758J2471K4935j1464k2719
$$ -1651 -5484 -711 10544 2753 -14836 -4503 17766 5726 -19032 -6561 18374 6910 -15809
520a5809Q930J8461n020j2562K5N761N537J330j1062q133J6014J3883j9691j8157
$$ -15809 -6879 11582 6562 -6000 -5975 -214 5323 6653 -4409 -12542 3472 17355 -2336 -20493
534b0493K1584K0634k1447k1160J9113J9785j4733j6778Q680J2534j533p525o002
$$ -20493 1091 21725 278 -20882 -1769 18016 3283 -13495 -4815 7719 6186 -1339 -7341
547g341K257J3243K744j9375p036K3784J0287k5973j2284K5741J2915k3042j2320
$$ -7341 -5084 8159 10903 -8472 -15508 8276 18563 -7410 -19694 6047 18962 -4080 -16400
560a6400J8121J0700j1484q363L723N722M293l049j1885O53J8277J230k2832k497
$$ -16400 1721 12421 937 -7426 -3703 2019 6312 3263 -8622 -7969 10308 11538 -11294 -13791
574a3791K5128L140k4918l251K2306L012j7583k566J1313K133m154j911l027J860
$$ -13791 11337 14477 -10441 -13692 8614 11626 -5957 -8523 2790 4923 769 -1142 -4169 -2309
588b309R628k127j4933K622J8434l294j9838L979J9075m543j6396M833J2144m733
$$ -2309 7319 5192 -9741 -7119 11315 8021 -11817 -7838 11237 6694 -9702 -4869 7275 2542
602B542o903M120J357l065L972J448q289M89J1332k622j2710M762J2376o664j0442
$$ 2542 -4361 -241 1116 -1949 2023 3471 -4818 -4329 7003 4381 -8329 -3567 8809 2145 -8297
617h297Q131P249q990l231R062j006q343M902O862p953m762R717K217j0000N10
$$ -8297 -166 7083 -1907 -5138 3924 2918 -5425 -523 6339 -1614 -6376 3341 5558 -4442 -3932
632c932Q698l172o029N498K296p239J979Q319o246q653R940Q291j2561p262J3709
$$ -3932 4766 1594 -4435 1063 3359 -3880 -1901 6418 172 -8481 1459 9750 -2811 -10073 3636
647C636N758j3120l983J0870K123p146l44K328j241L118K410q462l286J3213L735
$$ 3636 9394 -3726 -7709 3161 5284 -1862 -2206 122 -1119 1999 4409 -4053 -7339 5874 9609
662I609j6757l863J8645L727j8620l463J6653L146j2831k910P579K830j398k879
$$ 9609 -7148 -11011 7634 11361 -7259 -10722 5931 9077 -3754 -6664 915 3745 2347 -532
676e32n076L000J1217l153j6373L224K0004l091k1686K576K1271j664j8789L08
$$ -532 -5608 -2608 8609 5456 -10917 -7693 12311 9220 -12466 -9890 11381 9717 -9072 -8764
690h764J4479J425q788l460K325N615M220p567j0321R166J5283j0078j8658J0163
$$ -8764 5715 7140 -1648 -5108 -2783 2832 7052 -515 -10836 -1670 13613 3535 -15123 -4960
704d960K0188r307j9727P502J7431m852j3560J536Q619K111l113n823k371R205
$$ -4960 15228 5921 -13806 -6304 11127 6275 -7285 -5749 2870 4981 1868 -3955 -6326 2879
718B879P281j1943j1195J3699J3732j4272j4769J3570J4274j1608j2411Q538R457
$$ 2879 10160 -1783 -12978 721 14453 181 -14588 -1018 13256 1648 -10763 -2225 7232
731G232m591n874J48K059M415J580q586m636J2046O825j4371p980J5360Q070j4860
$$ 7232 2641 -3233 -3085 -1026 3389 4969 -3617 -8253 3793 10618 -3753 -11733 3627 11697 -3163
746c163p225J2972N583r861l514N892J309j505P72k958k389O871L372r928l664
$$ -3163 -10388 2584 8167 -1694 -5208 684 1993 488 1260 -1698 -4087 2784 6156 -3772 -7436
761g436J1895L172j2502k114J1859N96j0004J111P260k709l982M019N07m777K793
$$ -7436 4459 7631 -4871 -6985 4874 5470 -4534 -3423 3837 1128 -2854 1165 1672 -3105 -312
776c12M790n446m101P255K740q071q31P816j416o594L744M555n843k027P409o11
$$ -312 4478 -968 -5069 2186 4926 -3145 -3976 3840 2424 -4170 -426 4129 -1714 -3741 3668 3057
792C057q300L020Q368m893p523N936N892o032l559N095Q54l327K076Q72m861J924
$$ 3057 -5243 -2223 6145 1252 -6271 -335 5557 -475 -4034 1061 1915 -1412 664 1536 -3325 -1401
808a401P133m558q825O787R704q251r695Q678Q816p991p157O194M931l500k329
$$ -1401 5732 1174 -7651 -864 8840 589 -9106 -428 8388 397 -6760 -566 4365 865 -1464
823a464J13l75L562K933p052n142J0031O820j2083p841J2974Q149j2483p803J0642
$$ -1464 -1351 -1726 1836 4769 -2283 -7425 2606 9426 -2657 -10498 2476 10625 -1858 -9661 981
838I81O843p567n436L521L789J036j989n718K23R964J354j3402k648J5580L604
$$ 981 7824 257 -5179 -1658 2131 3167 1178 -4540 -4317 5647 7001 -6401 -9049 6531 10135
853A0135j6257m212J5322M516j2836m530R078M328m367m037p37L629N776l130
$$ 10135 -6122 -10334 4988 9504 -3332 -7862 1216 5544 1177 -2860 -3597 32 5808 2678
867B678j0201K612J3617k079j5618J465J6069p89j4966K4J2404Q20q737j763M345
$$ 2678 -7523 -4911 8706 6627 -8991 -7526 8543 7754 -7212 -7188 5216 6036 -2701 -4464 -119
882a19K739K93l670m718M472Q511n113j1303N463J2872n458j3062N038J1949m166
$$ -119 2620 2913 -757 -5475 -1003 7508 2395 -8908 -3445 9427 3969 -9093 -4055 7894 3728
897C728r683K871O609j238l045o36o05K569L923m379o540N862Q249o918q883P379
$$ 3728 -5955 -3084 3525 2287 -758 -1394 -1999 570 4493 114 -6426 -564 7685 767 -8116 -737
913g37Q439p203p038O382M907m983k401L199k53j089K649j091m449L101N475m736
$$ -737 7702 499 -6539 -157 4750 -233 -2634 565 312 -777 1872 781 -3668 -567 4908 172
929A72n646N868N012o443l635O371J740n713L89M571k510l047M281J326n479L89
$$ 172 -5474 394 5406 -1037 -4672 1699 3439 -2274 -1885 2686 176 -2871 1410 2736 -2743 -2354
945b354N907j883n507L013M356l704k523L893K22l574K306K814m676j776O634
$$ -2354 3553 1670 -3837 -824 3532 -172 -2695 1198 1420 -2154 152 2966 -1710 -3486 3148
960C148O25p928M60Q405j358p952J896O581k006m470J690J750r73J288p4m280
$$ 3148 3773 -4155 -3695 4710 3352 -4600 -2704 3877 1871 -2599 -909 841 -132 1156 1082 -3198
976c198J250O846k364q781L242R894l736j0005L730R155l138p421K024N004m57
$$ -3198 -1948 4898 2534 -6247 -3005 6889 3153 -6852 -3122 6033 2895 -4526 -2502 2502 2045
991B045k101j390j009L322L955n070o486O453Q378p276r469P355R680o684q969
$$ 2045 -56 -1446 -2455 867 4822 -248 -6734 -281 8097 821 -8648 -1293 8387 1703 -7266
1006g266N188P482l064n410M27K944K441l00n218k221P641M381r393o021J0327
$$ -7266 -2078 5404 2340 -3070 -2643 301 2742 2442 -2776 -4997 2644 7025 -2368 -8389 1938
1021A938O987j0255p223R142O809p113n781M322M396j099k702k349R66N555O21
$$ 1938 8925 -1330 -8553 589 7398 285 -5496 -1174 3222 2123 -579 -2928 -1962 3593 4214
1036D214q224j964J0124K913j1032l471J0869L622r657l436P547K988m722k411
$$ 4214 -4010 -5974 4150 7063 -3969 -7440 3429 7051 -2606 -6042 1505 4493 -229 -2640
1050b640J505J769J822j152m870O47P349k73r061O7R802J1r558K4Q336r2o364
$$ -2640 -1135 634 2456 1304 -3566 -2919 4430 4157 -4904 -4837 4965 4976 -4582 -4558 3778 3686 -2678
1067b678J48L835j68r57L5j853K44M287o18o098J105P125j633p269K097O613k489
$$ -2678 -2530 1305 1137 180 215 -1638 -1394 2893 2275 -3823 -2718 4407 2774 -4495 -2398 4215 1726
1084A726n238K715L321k693j115K413j072j893K961J134m356k26N071p30n069
$$ 1726 -3512 -797 2524 -169 -1284 1129 57 -1836 1125 2259 -2097 -2323 2748 2018 -3051
1099c051J645M361k450l064L062J343l404N39L451k347l196L867K684m848j974
$$ -3051 -1406 2955 505 -2559 503 1846 -1558 -1019 2432 85 -3111 756 3440 -1408 -3382
1114c382N206J135m837k51L796n95k163J318J51j870K010K201m075k313N719K213
$$ -3382 1824 2959 -1878 -2129 1667 1072 -1091 227 378 -1492 518 2719 -1356 -3669 2050 4263
1130D263o753j988P070J640o595j256N348Q83l449n39J034K84J604j08m158L1
$$ 4263 -2490 -4478 2592 4232 -2363 -3619 1729 2612 -837 -1376 -342 -58 1546 1438 -2720 -2689
1146b689O317K7p852p4Q653J64q594l17P643N88n940r72L643J407r05j898j941
$$ -2689 3628 3655 -4197 -4271 4382 4546 -4048 -4365 3278 3866 -2074 -3046 597 2004 1099 -799 -2740
1163b740K365M558k718o734K882Q283k846r006K502Q873j888p853R85O142J22
$$ -2740 -375 4183 1465 -5269 -2387 5896 3050 -5956 -3454 5419 3531 -4322 -3337 2805 2927
1178B927l852j349J214K576J475l708l891M571N836n082p151N177P692m791p467
$$ 2927 -925 -2274 -1060 1516 2991 -717 -4608 -37 5799 717 -6434 -1257 6435 1644 -5823
1193e823L945O506k677m981J091L067O70r41k445j116M067K857n296m198O094
$$ -5823 -1878 4628 1951 -3030 -1939 1128 1798 857 -1588 -2704 1363 4220 -1076 -5274 820
1208H20N011o340n236N982M936n088m154L692L031j961j694LL23J929R07l655
$$ 820 5831 -509 -5745 237 5173 85 -4069 -377 2654 693 -1001 -998 -675 1254 2161 -1494
1224a494j889M999K481n818k685O048K538n700k046M820J312l470m42J810m03
$$ -1494 -3383 1616 4097 -1721 -4406 1642 4180 -1520 -3566 1254 2566 -904 -1346 464 61
1239F1rJ117j685j594L111J759m133j592M658J112m616m26M057m05l087J251J783
$$ 61 52 1169 -516 -2110 1001 2760 -1373 -2965 1693 2805 -1811 -2237 1820 1415 -1672 -421 1362
1256A362j974l53K486j028k704K173K595k971k179L342J458l207n41K644m95j676
$$ 1362 -612 -965 1521 493 -2211 -38 2557 -414 -2593 749 2207 -1000 -1541 1103 608 -1068
1272a068J522M96k439P76L134j932l548K849L617l388l362L464K784l044j937
$$ -1068 454 950 -1489 -713 2421 489 -3059 -210 3407 19 -3343 121 2905 -139 -2076
1287b076K169R10r63K28n10j308J998K263l345k995M371L404m907l544M946L360
$$ -2076 93 1003 40 268 -242 -1550 448 2711 -634 -3629 742 4146 -761 -4305 641 4001
1303D001m375k926L301K231j755j417p7N28K029L20l849j058N311J654o276k078
$$ 4001 -374 -3300 1 2232 477 -940 -1017 -489 1540 1860 -1989 -3047 2264 3918 -2358 -4436
1319d436O628K335o316k429N355K398l858k194J903J906K82j529k463J105M441
$$ -4436 2192 4527 -1789 -4218 1137 3535 -323 -2517 -614 1292 1574 45 -2418 -1313 3128
1334C128o97n945K88O861J30p133n24O694Q72n602j208L968J490j962j712k47
$$ 3128 2431 -3514 -3226 3635 3765 -3368 -3892 2802 3674 -1928 -3136 832 2322 360 -1352 -1599
1350a599J880K372j960m222J969N572j872o323J651O475j322n947Q51M896k84
$$ -1599 281 2653 693 -3529 -1560 4012 2140 -4183 -2532 3943 2621 -3326 -2475 2421 2137
1365B137l358l64J562J043L20j695k078K257L508k668m528K905M966k868m922
$$ 2137 -1221 -1585 -23 1020 1340 -355 -2433 -176 3332 664 -3864 -959 4007 1139 -3783
1380c783K590M362k105l351J401K057n54o34l48p45J204J952j978k812K556L282
$$ -3783 -1193 3169 1064 -2287 -886 1171 617 -17 -365 -1110 94 2046 68 -2744 -188 3094
1396C094k890l312K969K913k740k187K312J190j657q8Q66r74j7J844q01k413J484
$$ 3094 204 -3108 -139 2774 34 -2153 159 1349 -308 -396 470 -504 -521 1323 522 -1891 -407
1413d07K613j972k460K242J921k247j111K007J27j556R23R42j875k83K630l78
$$ -407 2206 234 -2226 16 1937 -310 -1421 586 713 -843 80 1022 -853 -1136 1494 1116
1429A116l073R19L154j259k849J398K194j309j255J014J18n41J067l2k172N81
$$ 1116 -1957 -1038 2116 857 -1992 -594 1600 291 -964 50 168 -373 694 662 -1510 -929
1445i29L099j070l713J414L960j547l783J425L241j086k315N17J161J93J35r73
$$ -929 2170 1100 -2613 -1199 2761 1214 -2569 -1144 2097 1011 -1304 -787 374 567 702 -271
1461b71j427J715K587k329l498K722M049k836m238K639L991k087l404J257K492
$$ -271 -1698 17 2604 275 -3223 -501 3548 712 -3526 -887 3104 1017 -2387 -1130 1362
1476A362k08j370r57J56K106J036l117k063L834K906m230l408M193L613l719l485
$$ 1362 1154 -216 -1173 -1017 1089 2125 -992 -3055 779 3685 -545 -3953 240 3853 134 -3351
1492c351K863L055j664k384K59J540J193o13k572l05L691J147m493j795M840K249
$$ -3351 -488 2567 903 -1481 -1222 318 1511 898 -1674 -1979 1712 2859 -1634 -3429 1411 3660
1508C660m734k464M142K430l152k204J864J791l65j286j147P40K546k05l664k59
$$ 3660 -1074 -3538 604 3034 -118 -2322 -458 1333 968 -318 -1465 -725 1821 1616 -2048 -2307
1524b307M429O10m735q54M582R79l977j005K990R48j717q50L30P11J070n95k303
$$ -2307 2122 2732 -2003 -2857 1725 2704 -1273 -2278 712 1660 -57 -907 -577 134 1204 609 -1694
1541a694M74L235l68l810L12L942k70l657K45K990k06k048J72R19j07K47Rj318
$$ -1694 -1220 2015 1647 -2163 -1851 2091 1821 -1836 -1591 1399 1193 -855 -683 236 129 376 385 -933
1559i33J20K156k51k711M07K906n62k738P08K228p94j490Q41N82q22L72P34j252
$$ -933 -813 1343 1092 -1619 -1212 1694 1132 -1606 -898 1330 536 -954 -113 469 -353 19 753 -499
1577d99n60J927L60k330j33K435j21k182L42J652n37q78O65n0p24R91P19j836
$$ -499 -1059 868 1228 -1102 -1235 1200 1079 -1103 -761 891 354 -524 141 91 -633 358 1077 -759
1595g59o67K468N60k814m42K821L25k489k21J839J27r31p5q9M2J184l8k155J1
$$ -759 -1426 1042 1602 -1212 -1654 1167 1492 -997 -1218 621 748 -183 -258 -347 -305 879 841 -1314 -1303
1614a303K928L5l408q5L535J85l287l11K683M57j781o39O62Q21N28r74j692J073
$$ -1303 1625 1660 -1748 -1833 1702 1887 -1400 -1711 972 1429 -352 -991 -329 492 1020 46 -1646 -573
1632e73K705j122l455J047L881q88l899N83L562k04k829k98J884P89p15j290n00
$$ -573 2132 1010 -2445 -1398 2483 1595 -2304 -1721 1841 1637 -1192 -1490 394 1183 468 -822 -1322
1649a322J737J639k029k607K196L278k134l635J876L602j410l251P97K594p8j702
$$ -1322 415 2054 25 -2582 -386 2892 758 -2877 -1001 2601 1191 -2060 -1263 1331 1253 -449
1665d49p01O87J443L39k062j283K500K064k737k587K724K828k461k780J953K488
$$ -449 -1150 -463 980 1319 -743 -2026 474 2538 -199 -2786 -62 2766 305 -2475 -522 1966
1681A966j253j979M29J296M50n50j301j82K029Q33k554j342K847J656k867j760
$$ 1966 713 -1266 -837 459 909 359 -942 -1124 905 1738 -816 -2158 689 2345 -522 -2282
1697b282K603J663k084j385J360R91n12n38l41N0J183L58j855o78K288Q98k470
$$ -2282 321 1984 -100 -1485 -125 866 354 -184 -525 -475 708 1066 -789 -1467 821 1719 -751
1714g51r68K407Q46k076o47J534L57q50m3J27k97N98N65j206p50J621Q26j842
$$ -751 -1719 688 1534 -542 -1189 345 702 -148 -191 -64 -361 237 802 -404 -1154 467 1293 -549
1732e49p69J835O08j594l34J166K6o05L19k5o37O43R13j180j072J542J121j701
$$ -549 -1318 517 1125 -469 -803 363 389 -216 103 78 -559 84 997 -183 -1255 287 1408 -293
1750b93j057J623Q78j340n83Q55K16k31J50m46n32J087Q65j636j101J985J249
$$ -293 -1350 273 1151 -189 -772 83 299 68 218 -228 -760 327 1192 -444 -1545 440 1689
1767A689k094j293J970J214j572j048R77Q02k53m62n53J07J337K53j990n75K446
$$ 1689 -405 -1698 272 1486 -86 -1134 -157 645 392 -70 -623 -516 821 1074 -916 -1491 955
1784I55Q52k658j075K614J180k265j244J677J213r13j065LQ73R21o31j790L72
$$ 955 1807 -851 -1926 688 1868 -397 -1641 36 1249 336 -729 -726 147 1068 437 -1353 -981
1801i81K467o4k932k25L106M69k928p19K483R05j795j018R03J093Q0j099j039
$$ -981 1486 1422 -1510 -1735 1371 1840 -1088 -1807 676 1581 -214 -1232 -329 764 844 -255 -1294
1818a294J017J900q92k548P07K929m37l034J67K817J38k335m37J630P21p74r73
$$ -1294 -277 1623 731 -1817 -1110 1819 1382 -1652 -1485 1332 1470 -865 -1302 328 1049 275 -698
1835f98j15J145R68j230j710J238K235j147k527R55K557p05k332L76J893k6j271
$$ -698 -813 332 1300 70 -1640 -402 1833 686 -1841 -886 1671 966 -1366 -990 903 877 -394
1852c94l44N37O98K05r84q84J190J440j299j785J284J942j162j849R28J587o32
$$ -394 -738 -201 497 702 -282 -1166 24 1464 165 -1620 -336 1606 444 -1405 -477 1110 478
1869D78j121K59N60J37K0m92n83P98J016j014j313J123J405j098j348R72J102
$$ 478 -643 -384 176 313 333 -159 -742 56 1072 58 -1255 -132 1273 175 -1173 -201 901
1886I01p52p28M56K68j30K17j92o51M71J020o90j236Q07J308q18j213P34R61n42
$$ 901 149 -579 -123 145 15 232 40 -611 -140 880 190 -1046 -239 1069 251 -962 -228 733 191
1905A91n91K92J24J9L47l14p88N62J168p46j430Q35J515q01j439O38J186l81q04
$$ 191 -400 -108 16 35 382 68 -720 -158 1010 264 -1166 -331 1184 383 -1056 -418 768 387 -417
1924d17M7L28L21J89o62p04R59J156j158j480J213J661j138j658Q88J525n38j238
$$ -417 -370 -42 279 468 -194 -898 61 1217 59 -1421 -208 1453 315 -1343 -455 1070 532 -706
1942g06J09Q28L73l35q48j78J254O71j552j092J708J411j685j587J487J643j160
$$ -706 -597 231 604 269 -579 -757 497 1168 -384 -1476 232 1643 -42 -1629 -142 1501 341
1959C41j507O47J276q1r23n38M98J125o0j601l76J916P73k081j052J989J269j738
$$ 341 -1166 -519 757 676 -247 -785 -287 838 778 -823 -1199 717 1490 -591 -1643 346 1615 -123
1977a23j328J300J261p09j110N9Q55O31n62j246K56J727P3k037l50K143N88k041
$$ -123 -1451 -151 1110 401 -709 -650 205 836 274 -972 -716 1011 1084 -953 -1303 840 1428 -613
1995f13p55J741Q52j268q67O71Q07k8p17o09N75J147l85j590K11J840l7j893j47
$$ -613 -1368 373 1225 -43 -910 -239 568 540 -177 -786 -211 936 551 -1039 -828 1012 975 -918 -1065
2014a065J775K95j478m01J033M59m79m87j02M91O36m33j079L52J400k69j537J84
$$ -1065 710 1005 -473 -874 159 618 139 -348 -450 41 677 244 -835 -483 917 648 -889 -705
2032g05J495q4j287j3R46R0m94j74J3K13M52k32q54K41J122k19j258J88J230j39
$$ -705 790 706 -581 -594 352 442 -52 -226 -213 0 452 220 -634 -393 729 510 -748 -560 670 531
2052E31j049O9P56jl72n3p3R9M95j26q61J56J106j43j232R8J215k7j043n1P41
$$ 531 -518 -449 307 306 -66 -119 -192 -93 402 276 -585 -429 677 534 -698 -600 615 588 -455 -506 235
2073B35J29l30k07j08K72N36k96r27K83J242k39j396J46J400l7j238j16R44K54
$$ 235 364 34 -173 -281 -9 527 231 -696 -413 829 590 -806 -660 740 703 -535 -651 293 547
2092E47n31m13N9N30M18n97q85O30J238n88j479M81J584l30j501J18J281J37r34
$$ 547 16 -397 -338 192 610 13 -872 -242 996 408 -1071 -590 994 664 -837 -719 562 699 -235
2111b35m00N20O30k6q20m72R75Q78r90j239R44J469q06j535N66J457k70j241p6
$$ -235 -635 -115 515 489 -331 -803 172 1050 60 -1179 -235 1234 428 -1107 -541 916 646 -595 -671
2130f71R07M16n00p39M9R98M02j191p86J235J098j183j268J004J326p25j237L73
$$ -671 236 652 152 -587 -538 460 862 -329 -1115 120 1218 35 -1233 -229 1097 372 -865 -492
2148d92J053Mp64m00M15P84o5j054k89J250N75j304q02J244R40j088r51P81Q98
$$ -492 561 565 -199 -599 -184 600 535 -519 -808 442 1017 -287 -1089 155 1095 7 -944 -163 735
2167G35m41p37L3N40L58k95p25N5R95J84j171l93J221N40j144o14R39O29o52n56
$$ 735 294 -443 -410 130 488 193 -532 -477 518 702 -469 -862 359 899 -245 -859 80 709 57 -499
2187d99K95M15Q8k57m42R4P22Q0r21k34J035L41r95m00Q48M19o23l64L05K87O
$$ -499 -204 211 299 42 -400 -306 416 496 -425 -659 376 717 -278 -678 170 589 -34 -398 -93 194 200
2208B00j55l33K2O17J00q18k11R23K85q97l59P82L59n72l38K86K66L2j54l60M5
$$ 200 45 -288 -266 351 451 -367 -578 345 630 -267 -626 156 515 -57 -395 -109 157 189 35 -325 -280
2229b80O49P9q50k03R68L10r58l85Q41M26o21m40L31M03K9l15l77K03O93q0r37
$$ -280 369 448 -402 -605 363 673 -285 -670 171 597 -24 -464 -133 270 299 -16 -393 -190 503 423 -514
2250e14o9J081K13j125l40J036M37q27n12N11N43j56n24k39M67O11l85r09K44
$$ -514 -583 498 711 -414 -754 282 719 -108 -620 -109 434 278 -246 -485 -18 593 208 -701 -457
2269d57J156j13j233o5J230K31j085l74Q32N00m93n90J17O09L16o14o82N46R70
$$ -457 699 586 -647 -712 518 749 -336 -710 122 622 129 -461 -344 265 581 -33 -715 -169 801
2288H01m23j178K68J258r0j229r3J059K86p79m57M11N95l3o67l42O92O65o43r43
$$ 801 378 -800 -532 726 636 -593 -686 373 659 -120 -577 -166 429 396 -271 -613 79 744 101 -842
2308h42N55J101m19j150K47J081n3q89j63O43L58l12n36j5O52L29p00o05P03Q01
$$ -842 -287 814 395 -755 -508 573 520 -369 -532 111 469 157 -379 -394 258 587 -113 -718 -15 786
2328G86o33r12N07R23l31q25J07O54J10m38l00J51M85J21o06l68O56N52o25o97
$$ 786 153 -759 -252 671 340 -485 -378 276 386 -52 -352 -201 284 405 -201 -569 87 639 14 -683
2348f83N38P59m24o96K36N84l6m01j66J79L35O2m66k73N52M60n84n59N14O30m14
$$ -683 -145 614 190 -506 -270 314 278 -123 -289 -110 225 287 -179 -452 100 560 -24 -583 -69 561 147
2369A47n94K62N07q6l54j05J50K86M9m38k42N26M09n72n33N35O00m46n90K75N31
$$ 147 -447 -185 322 236 -118 -223 -73 213 262 -176 -418 108 517 -55 -588 -53 547 101 -489 -214 317
2390C17p9l92j29K20L14l4m56j80N93L56o27n10O23N99n20o37L59O04j34n29r0
$$ 317 238 -154 -283 -63 251 217 -239 -419 174 530 -97 -607 16 615 95 -542 -183 421 287 -242 -332
2411c32L66L25j85n14k5O73K18p51m13P71N43o99o41N53O50l29o21Q0N37J88m04
$$ -332 34 359 174 -340 -365 308 526 -225 -638 133 676 -23 -664 -111 539 210 -411 -331 206 394 -10
2432a0m48K22O71l5q06j65Q82L31q52m68P48N58n61n86L03N82l7m99k54L94N18
$$ -10 -458 -236 435 400 -406 -571 311 642 -210 -678 70 628 67 -519 -216 366 329 -170 -424 -30 488
2453D88k56p32J04Q68O1r01k37Q70L63p24m79N29N20k80n23j2M87K85m10n29K82
$$ 488 232 -500 -396 472 533 -368 -605 265 628 -96 -575 -46 474 194 -329 -341 146 431 21 -508 -226
2474b26P25j59q29K4Q48J24q03k33O50L48m54l96J94M46O2m13l18L71N26l00o53
$$ -226 499 340 -489 -465 383 507 -296 -529 121 469 15 -381 -187 259 321 -92 -410 -39 487 187 -466
2495d66J77P52p4p57l8O46J66m94k62K90L24o5l57j79L55L77l07n51K34O36j37
$$ -466 -289 463 389 -368 -406 240 406 -88 -350 -60 264 199 -158 -337 18 395 88 -463 -229 407 270
2516B70o45K9N93P7m64j79L13K41q6k99j03K95L11k85m66K57N63j75o05P5N76
$$ 270 -375 -346 247 324 -140 -319 -6 235 149 -150 -253 42 353 68 -398 -141 422 247 -358 -283 293
2537B93L1m86j42L29K27j36l02n6L19K67l50m09L00N51k54n95J30N94k7n11j09
$$ 293 324 -162 -304 25 252 116 -186 -242 77 344 -6 -415 -115 436 182 -413 -283 311 284 -227 -336
2558c36L87K37k09l35K1L84J95m21l72M13N20l58o07K44O56j27o05k3N05J82l58
$$ -336 51 288 79 -256 -235 149 344 -77 -449 -36 484 126 -481 -237 419 292 -313 -336 169 351 -7
2579gl17J72M23L1m99k16N11L93m81n28L96O13k87o27J32N81L6m89k09L30L75
$$ -7 -324 -152 271 302 -197 -413 98 491 10 -518 -122 491 204 -423 -291 290 326 -163 -372 -42 333
2600C33j59m95k3N53K29n86l73N47N03m49n74L06N89j36n24o5M43K48k97m00J13
$$ 333 174 -321 -344 209 438 -148 -521 26 529 80 -494 -188 401 265 -259 -324 119 367 70 -330 -217
2621b17N30N2o09j97N95L51n64m40M47M83k83n01J13M60O4l72k55K60M05j24n02
$$ -217 313 365 -244 -441 154 505 -59 -499 -52 431 148 -353 -240 220 284 -88 -343 -83 322 198 -304
2642c04l6N70J66n60k85N07L67l94l98K40M11p1l61j25K90K89j87m20Q5N08L6
$$ -304 -340 230 396 -164 -449 58 425 31 -367 -127 284 213 -148 -273 17 306 119 -301 -216 292 328
2663C28n29j73N13K56m25l24K91L34j19l30m9K85K05k07l51J13M57j6m97j04M93
$$ 328 -201 -374 139 395 -30 -354 -63 271 152 -178 -227 58 263 56 -295 -182 275 259 -238 -342 151
2684A51J87m27k59L21L10j87k98K3K87J45k51k77J50M11p6m66k3M84J28m53k02
$$ 151 338 -89 -348 -27 283 96 -202 -179 108 253 2 -275 -125 286 210 -256 -279 205 333 -120 -322
2705c22L72K67k40l07P8K96R7k82k42K15L86j60m65M4N17N8n03j54M17K46l05
$$ -322 50 317 77 -230 -152 144 241 -41 -283 -68 318 158 -307 -263 254 312 -191 -345 72 318 13
2726A3l01J50L47Jl40j68L03L37k51m31J59N20o0n33n0M95J56m13k49K92L13j22
$$ 13 -288 -138 209 210 -130 -298 5 342 91 -340 -181 339 279 -254 -304 191 347 -66 -315 -23 290 168
2748A68l62m5L76J91l48l49K94M45j92n34R9N25K6m77j48L72K63k53l38J03L78
$$ 168 -194 -239 137 328 -20 -369 -75 370 178 -356 -257 268 294 -183 -331 41 304 51 -287 -184 194
2769A94P6m04k19L71L62l15m45K13M89p3m93l3M31J53l33k57J98L47n8l96r9M11
$$ 194 270 -134 -353 18 380 65 -380 -167 322 249 -244 -277 154 307 -26 -283 -85 262 204 -192 -291 120
2791A20K22l72l39L04M15k08m44Q8M34K4l68j56K77K51j47l24QL78J08l73k39
$$ 120 342 -30 -369 -65 350 142 -302 -214 220 244 -124 -280 -3 248 101 -223 -215 163 271 -102 -341
2812c41L62K97k66l77J87L90p2l64m9L00J75j93k76Q6L52K5l64j63L59K50l06
$$ -341 21 318 52 -325 -138 252 180 -184 -233 67 242 49 -227 -141 211 236 -128 -291 68 318 12
2833A2l13K32L37j18l40%K94J22k43k29J46L10l3l69p3L73J70l30k59K72L06j81
$$ 12 -301 -69 268 150 -190 -190 104 226 -17 -246 -100 210 177 -192 -265 108 278 -52 -311 -39 267 86
2855H6l20P5L12M2k63j72J98K69q9l46KL66J12l73j90L30K64k48l07J29L35j7
$$ 86 -234 -159 153 195 -68 -240 -42 227 138 -208 -206 160 272 -101 -291 39 303 55 -252 -123 212 195
2877A95l08j12K43K29j71l29P6L75L8m10j22L63K27l11k91K21L21r9l09m0L02
$$ 195 -113 -225 18 247 76 -253 -177 198 236 -174 -296 67 294 -17 -308 -87 234 135 -174 -214 88
2898H8J58k44k70J67L56p8l99j2M07J20l80j94K89K76k04k99N5L26O9l09j88K52
$$ 88 246 2 -268 -101 255 177 -222 -234 173 293 -87 -281 8 284 80 -219 -164 162 231 -78 -266 -14
2920a4K90j77l59P3L98J7l92j27L61K08k76k67J51L13l0l12r1K74K32k46k97J63
$$ -14 276 99 -260 -187 211 228 -164 -291 70 278 2 -265 -114 199 169 -143 -234 40 272 26 -271 -108
2942a08L63p4l98j1L68J12l03j89K19K59j15k84qK93J17k65k24K19L12j69l51
$$ -108 255 181 -217 -228 140 252 -51 -240 -21 238 123 -161 -169 124 241 -24 -248 -29 283 114 -237
2963b37P0L61J6l26j26K74J91j85k37N4K79M8k77j51K49K43j98l05J22L30k5l25
$$ -237 -167 194 210 -116 -242 32 223 38 -199 -145 134 182 -95 -246 3 246 48 -257 -135 195 170 -155
2985a55o4L00J31k04k14J26K64j1k91q7K85J74k34k62J83K96j06l09kL02Q7k51
$$ -155 -219 81 212 8 -206 -80 184 173 -118 -205 80 254 20 -242 -59 237 131 -178 -180 122 209 -42
3007d2j68J76K19p9k65l1K99R2k57j99K18K68j60k88P1L01K5k70j14K23J91j27
$$ -42 -210 -34 185 106 -159 -190 109 201 -56 -255 -37 231 71 -217 -146 155 180 -90 -204 19 210 83
3029H3k60M5K80N3k86j48K71K22k19k73J31L07l3l01o7K57J53k01k30J26K73k9
$$ 83 -177 -132 148 201 -85 -233 38 260 41 -232 -101 206 173 -128 -195 62 215 14 -216 -90 183 154
3051A54l06p3K99J58k67k23K08K69j27k87K2K74Q3k41j52J80K37j07k91K8L08
$$ 154 -152 -225 74 232 -35 -258 -50 219 92 -195 -173 101 184 -57 -209 -29 208 101 -190 -162 146
3072A46O5k88j61K55K11j72k67J06K84qk58r8K24J80j72k45R3K80j3k88r8K85
$$ 146 211 -77 -238 17 228 56 -211 -105 179 171 -87 -185 39 219 47 -198 -105 175 162 -126 -224 61
3094F1J67k35k11J53K47n7k72l5K55J06k00j90J43K48n9k80j0K94Q7k64j53K02
$$ 61 228 -7 -218 -65 182 125 -147 -182 73 179 -21 -211 -68 180 121 -159 -169 125 212 -52 -205 -3
3116cK07j20k40L6K50M1k23j29J87J99j26k59N4K82J5k75r3K26J61j68k07Q9K34
$$ -3 204 84 -156 -120 130 171 -52 -181 6 205 79 -180 -126 156 171 -104 -197 29 190 22 -185 -96 138
3139A38kk31j01K17J60j55k29J03K67k4k85l1K59J14k06j71J25K22l8k34m5K36
$$ 138 136 -95 -196 21 181 26 -203 -100 167 143 -142 -173 86 200 -6 -177 -52 170 132 -102 -147 89
3161H9J13k08j94J65K36r2k64J7K67L7k23j26J86J78j16k19J2K49N1k36j27J94
$$ 89 202 -6 -200 -35 201 109 -155 -138 129 166 -57 -183 3 181 65 -154 -142 107 158 -78 -205 -11
3183a1J95j31k41P3K57J1k64q2K32J41j61j90P1K50Lk54o3K17J46j72k21J35K48
$$ -11 184 53 -188 -115 142 153 -111 -193 39 180 19 -171 -100 150 153 -101 -164 53 199 27 -194 -59 189
3206A89p1k51j7K34J00k09j56J31K19o7k48nK39Q2k31j40J76K03j27k35M6K50
$$ 189 118 -133 -150 84 184 -25 -181 -50 169 102 -146 -151 88 170 -61 -201 -25 178 51 -184 -138 112
3228A12L2k25j02J87J68j30k08N1K35L5k35r5K11J68j68k04J04K18j8k42m7J97
$$ 112 144 -81 -183 4 172 42 -166 -115 120 155 -80 -175 36 204 36 -168 -64 154 136 -106 -153 44
3250D4J40j70j85J01K19l6k34n0K36R7j87j74J46J97p1k18qK12P4j78j30J32J94
$$ 44 184 14 -171 -70 149 113 -121 -171 65 162 -25 -199 -53 144 73 -145 -153 59 133 -45 -175 -43 151
3273A51p7k18J7K20O2k14j04J61J67j09j89M6K09K2k01r3J79J42j17k08O5K15
$$ 151 74 -144 -127 93 155 -59 -163 -2 165 56 -133 -87 122 144 -57 -150 29 171 54 -154 -89 126
3295A26J4k28q6K10J28j51j83R5J97j0k31m4J98J11j49j72J11J98m0k14k5K15
$$ 126 140 -88 -174 36 164 13 -170 -75 122 112 -119 -163 35 146 -3 -175 -64 134 94 -120 -145 70
3317G0R0j90j41J38J83o5k02LK04O2j83j29J50J78r9k14L4K27K5k06j04J77J50
$$ 70 160 -30 -171 -33 150 85 -117 -114 90 152 -31 -160 -10 168 69 -145 -111 116 141 -65 -169 8 158
3340A58j27j88O3K03Nj96q9J87J43j47j84Q6K09j5k21l6J95J16j60j57J01J97
$$ 158 31 -157 -94 109 114 -82 -171 16 159 12 -172 -86 123 108 -113 -149 46 162 2 -155 -54 143
3362A43m0k12l1K07R5j69j51J23K05p9k21K5J98O2j95j08J36J64r7j89J9K03N0
$$ 143 103 -109 -140 67 162 -7 -158 -35 170 91 -130 -105 93 155 -40 -148 -12 152 55 -134 -115 88 138
3385A38j94j07J57J55j22j79N3J94Kj80p0J71J23j22j65O7J95Jk01n2J77J15j30
$$ 138 -56 -163 -6 149 27 -152 -99 95 97 -83 -153 18 141 19 -146 -79 116 117 -84 -136 41 156 26
3408B6j72R5J84l2j91k9J93P6j44j50R3J83n4j83k1J85Q5j93j13J25J70q4j75
$$ 26 -146 -51 133 101 -90 -119 74 150 6 -144 -51 132 78 -105 -126 59 144 -49 -162 -37 133 49 -126
3431a26K2J70M6j59j07J38J37p5j72L1J81L3j83p7J65J18j10j56N7J78Kj79o6
$$ -126 -104 66 112 -47 -154 -16 121 46 -126 -95 86 119 -64 -141 24 142 32 -124 -67 111 113 -66 -132
3454a32J60J23j28j45N8J87j1j92m3J71Q3j43j34R0J77m1j84k4J80P3j37j41J12
$$ -132 28 151 23 -122 -64 123 112 -80 -123 48 131 -12 -146 -56 121 80 -104 -128 52 125 -12 -153 -41
3477d1J66n4j96RJ84N9j66j05J26J48p0j81K9J81L5j67r7J45J36r2j65M4J91m
$$ -41 125 71 -125 -116 68 127 -39 -144 -18 130 60 -121 -92 89 124 -43 -140 5 141 49 -116 -72 119 115
3501A15j77o3J63J03j17j59N6J91k5j67n9J69J02j34j61R4J76k6j91k2J80Q0j53
$$ 115 -62 -125 38 141 24 -135 -79 112 87 -80 -139 30 132 -2 -163 -69 107 81 -110 -132 48 128 -25
3524b5j11J13J51o7j47k1J81N7j48j08J17J58q4j73K6J81K0j70o6J32J06q9j42
$$ -25 -136 -23 128 61 -86 -107 74 131 -17 -125 -8 150 66 -107 -81 100 120 -50 -116 16 122 33 -109
3547a09L0J60K5j65p9J50J05j04j58P7J63j4j71l7J54Q9j24j15N9J71k6j63k0
$$ -109 -79 81 106 -59 -138 12 117 13 -145 -68 95 81 -90 -127 27 116 -8 -123 -64 107 81 -82 -102
3570a02J44Q8j44j06R3J50o2j44j0J54N4j40q4Q9J34n9j55J3J56M2j57r1J20J34
$$ -102 42 130 -14 -120 -27 123 61 -83 -93 61 115 -25 -109 -20 114 55 -100 -87 69 111 -46 -137 -17 117
3594A17q7j59M6J48Rj29o5J11J15q0j42K8J77J3j67n6J35J19j17j31P2J39mj57
$$ 117 30 -129 -83 65 74 -55 -120 -9 106 26 -116 -88 89 102 -65 -121 14 133 16 -115 -43 96 92 -65
3618f5n6J57Q7j08j24N8J61k0j75l4J72Q0j50j11R5J39n5j47lJ42N0j28j01J02
$$ -65 -121 36 123 15 -109 -51 110 90 -85 -119 53 133 -17 -128 -33 106 51 -96 -99 43 93 -35 -136 -34
3642c4J35o0j57J8J56M4j55p3J28J23r7j38M3J50K1j50o5J20J20q5j69O6J68m
$$ -34 101 41 -116 -98 58 102 -53 -126 2 125 28 -110 -67 83 104 -46 -111 9 129 44 -125 -59 109 105
3666A05j77m9J45R4j21j32Q5J42k4j64k2J50P7j40j05Q2J56n0j51pJ50O6j49q7
$$ 105 -72 -121 24 118 -3 -135 -50 92 68 -96 -118 32 109 -31 -136 -54 102 52 -99 -106 44 110 -39 -126
3690a26J16J08n9j39J7J48L3j35o6R6J30q1j55N6J53jj37n4J14R1q8j33O6J21
$$ -126 -10 98 39 -100 -83 65 98 -37 -103 -7 123 42 -113 -57 96 95 -42 -96 18 109 21 -112 -46 75
3714G5%j35m7J19R7j01j20N1J46j3j65rJ17O8j08r0O9J33m4j30j0J35O6j14j02
$$ 75 75 -60 -107 12 109 8 -112 -61 85 72 -93 -102 15 83 -25 -115 -46 87 43 -87 -97 38 104 -10 -112
3739a12R1J26n1j42MJ55K8j14p0R0J00n2j31J2J22L3j27p4R4J16o7j38L6J20K5
$$ -112 -21 105 54 -88 -84 71 99 -15 -85 5 105 53 -78 -66 56 89 -38 -112 -18 98 31 -107 -71 49 74
3764G4j34m8J13Q4q2j16M6J33J0j41n1J36Q7r9j16O7J27j8j41j2J28O6j11r5P1
$$ 74 -60 -108 5 89 7 -109 -63 70 80 -61 -112 24 111 12 -104 -37 90 72 -69 -81 47 113 2 -93 -22
3789b2J32l2j52%J30N6j29r0R5J11n6j48J6J47K4j17p7R7J02n4j29J9J34L8j56
$$ -22 110 78 -74 -74 56 112 -17 -107 -12 99 43 -105 -89 58 82 -35 -112 -15 87 33 -96 -77 57 95 -61
3814f1n5J29Q9q9j15N4J34j3j16m0J12R2j05j13O2J38j8j51k5J37P2j31q8Q7J20
$$ -61 -116 13 102 13 -102 -48 86 73 -43 -83 29 121 16 -97 -35 103 85 -66 -91 46 118 -13 -101 -14 106
3839A06n3j31%J17N7j20r0Q5J19l3j49PJ39L7j37o8J11R5p8r9L4J11K6j13n9J04
$$ 106 53 -78 -78 39 96 -24 -114 -29 90 57 -92 -85 54 91 -46 -114 -3 92 14 -85 -51 60 86 -27 -86 18
3865A8R0p7j13L5J41nj21l9J07Q3j05r7N0J20j7j29k2J13N8j01q9N4J12j6j28
$$ 18 108 31 -82 -47 94 89 -32 -71 36 119 14 -83 -33 87 70 -59 -81 32 90 -11 -100 -46 66 50 -78
3890g8mJ17N1j15p4P3R9j7j24OJ10M7j02p8Q1J15n5j11NJ20K3j09n9R3P6n7j01
$$ -78 -82 35 86 -29 -103 -30 69 52 -72 -66 44 91 -11 -89 -8 107 52 -59 -54 66 89 -20 -79 14 90 33 -68
3917f8J3J13J0r3n4Q3R0o9j20L6J18Nj14n8J07Q2q8r4O1J04oj23k8J05Q4q6j13
$$ -68 -55 58 68 -25 -79 4 94 25 -95 -59 59 64 -50 -108 -1 81 -7 -101 -40 64 58 -65 -93 12 96 10 -103
3944a03P2J16l0j33MJ22M6j01q4Q0Q8j7j23JJ16N2j27q0Q7J11n9j22K3J22J6j21
$$ -103 -31 85 55 -78 -74 48 94 -7 -91 -11 77 60 -63 -62 54 106 -21 -101 -14 97 38 -84 -61 61 77 -44
3970d4n3Q8P9n6j05K4J16K2j23m3J03R1q4j13N3J26k1j18k1J18N8q6q6M9J21k3
$$ -44 -97 -9 70 14 -91 -67 49 71 -52 -95 8 99 15 -98 -45 81 60 -58 -79 39 97 11 -75 -26 95 72
3996G2j20k2J06N6r8q4O5J11m0j13KJ16K5j12n9P1J00l9j17pJ26L0j20n4Q7R4
$$ 72 -48 -70 36 92 -6 -90 -25 86 46 -67 -65 51 76 -36 -95 -24 76 37 -80 -87 39 69 -51 -105 -18 76
4022G6o5r3L2J07Mr5m4R5P1o8q1K4J12Kj00m4J03P0r0r5N3R4j8r9j7Q3N6o6r9
$$ 76 11 -82 -50 57 61 -34 -78 17 88 20 -61 -37 75 77 -23 -67 36 106 16 -79 -26 68 50 -49 -66 17 73 7 -92
4051i2O3Q6j6r8k5J02M8j00o0N9J02m1r0OQ6M0p6o9N9R3m1r0J0R1L1r6n3Q3P4
$$ -92 -29 57 41 -57 -82 20 68 -32 -92 -33 69 28 -62 -56 30 70 -6 -75 -16 77 36 -54 -44 47 78 -18 -71 12 86
4080H6o9p3K3R3J3j08m5Q1P0m3j11L2J02Qj17k7R7O1q4q1N6R7k4q6l2R6P3p9q7
$$ 86 17 -56 -33 60 73 -35 -80 1 71 28 -83 -51 51 59 -58 -85 12 73 -11 -92 -36 61 37 -49 -81 15 88 9 -78
4109g8N5R9k3j01k2J18K9r4n6O7Q2l6r7J5J02K2r4n9O8R9n2j23K4J08Mj11l3R2
$$ -78 -23 76 53 -48 -70 48 77 -17 -73 -6 76 40 -57 -42 60 82 -12 -71 -3 96 44 -79 -55 53 57 -54 -87 5
4137EO4o0r0K9J07j1r4m1J02O3o3j08O0J12l0r1j6J01L5o7o9L8R8k0r8mQ9M8q9
$$ 5 69 9 -81 -52 55 44 -50 -91 11 74 11 -97 -37 75 45 -46 -62 39 74 7 -62 -24 74 54 -44 -48 41 89 0
4166@q2P6Q5l8r0KR2J7r5l9O6O1m3p7J2R1K1r1n3P3Q2o0r0L8Q9Pr1k6P3O4o6p1
$$ 0 -82 -6 79 41 -49 -47 45 62 -33 -72 -6 55 12 -65 -53 38 59 -32 -85 -12 70 10 -80 -42 47 54 -37 -63 10 74 8 -63
4198f3M0P7Rq6m0Q8N6p9p4M3J08k3j06pR3M3r3n5M8P3j3r0j2Q7L7p5o6O6P1l2
$$ -63 -23 54 63 -23 -63 25 81 2 -72 -29 79 56 -50 -57 36 79 -14 -69 -21 52 39 -51 -63 24 61 -14 -80 -14 57 25
4228B5q6J4P8J6p0m4N2P7l3p7J3Q1L1r0m8P0P6n7q9L4Q8nq2l0Q0N1m8q6L1P2L
$$ 25 -61 -47 31 47 -23 -67 -15 62 29 -48 -35 46 77 -13 -61 9 85 28 -61 -27 61 56 -26 -56 24 75 27 -59 -28 44 47
4259D7r3k9R3M9p9p7N9R0k9r1rQ4M5p9n0M5P6j5r2lR1M1q2m8O1P4m9p0%R9Lp0
$$ 47 -46 -75 18 67 -12 -89 -30 60 31 -60 -69 15 60 -19 -69 -24 52 37 -55 -58 33 74 -8 -56 5 79 30 -40 -40 59 62 -8
4291hm9N6P9m9r4K3R6Qr1m2P1O6n9q5L8P4mq3k0P8N7o1o4K7R4k7p6j5R5L1o4o3
$$ -8 -57 -1 78 29 -65 -42 54 62 -29 -71 0 66 7 -78 -40 34 30 -53 -73 5 62 1 -63 -36 58 31 -45 -60 35 66 2 -61
4323f1O4O6k7p3j3R1J8o3n8O0N8l4p6PQ1J6q1l4N2O4m8p0J6P9No9l9O5N7m7q1
$$ -61 3 69 42 -31 -44 47 65 2 -56 4 62 28 -48 -41 40 56 -25 -59 -7 57 9 -61 -45 34 39 -30 -69 -4 53 6 -75
4354g5M1P8mp8k1P3M3o3n1L2P0Kp5j6O4N8o1o7L5R1l1p2j3P4J9o4n2N1O9m5o1
$$ -75 -34 44 40 -38 -59 14 57 -6 -57 -25 45 47 -28 -44 20 78 17 -50 -15 76 45 -27 -40 34 53 -11 -63 -12 57 12 -49
4385d9rQ0J8n9m5L9P2k7q4J2P4K0n9m0O0N2m0n9J4O5K0p5l7P4N5m3p4K6Q0j0q7
$$ -49 -58 22 40 -19 -64 -25 47 20 -64 -52 22 42 -17 -57 3 55 15 -44 -30 35 55 -20 -57 17 72 29 -45 -19 61 51 -36
4416c6%N7K7m0o1K1Q1j3p9k2Q0M5o3p0N1O9l1p5rQ5L2o8l9M2N6j7p2LR3J3p8l9
$$ -36 -36 21 48 8 -53 -32 49 36 -43 -65 15 60 -3 -73 -22 47 16 -59 -68 17 49 -19 -58 -16 40 23 -49 -46 47 60 -18 -57
4448e7O1O9m7p4K4P0kn6l0O3M9l8p5K0P2%p3m5Q3N5p7m9L1P8k4p5j1P5K6n1n2
$$ -57 4 73 26 -48 -24 46 44 -12 -42 21 70 32 -43 -23 49 49 -24 -69 14 69 -8 -57 -26 52 28 -47 -58 17 43 -8 -60
4479f0M9N8k3o6j5Q6K2n0n3N3N6k9p0J8N7K2n4m7M5N6j8o8QP4Op0n0P1N4n1o7
$$ -60 -11 47 24 -42 -57 29 51 1 -52 1 57 28 -42 -24 33 55 1 -46 -1 55 37 -31 -23 51 57 -13 -63 8 62 11 -56
4510e6K1O8qm7l2M9N4n4l9J3O7Mq5qP9K8n8m2L3O2j3n7j7N8L7n4l6K9N7j7n6q
$$ -56 -35 33 25 -22 -54 -5 49 -5 -44 -31 36 40 -45 -53 26 54 -4 -46 -13 49 36 -21 -38 20 57 3 -33 -4 53 36 -20 -28
4542b8O0J9o0l8L9M9k6n4NN0J6m9m2M5N1k2o3kP5J0o0l1O5M2l4n8J5P3Jo3k7M2
$$ -28 32 51 -9 -47 -8 41 15 -39 -34 16 32 -17 -59 -14 37 15 -48 -50 25 35 -25 -56 9 51 17 -41 -26 47 48 -15 -42 0
4574@O6m9n1J6P2kp2k5P7K5n2n2L2N9j3p0j5N8L3m3o0M2O4j8p4nQ1J1n5k9M6N3
$$ 0 66 17 -34 -18 54 52 -20 -45 32 57 5 -47 -15 44 31 -39 -54 4 37 -6 -66 -24 40 22 -52 -57 24 35 -20 -49 -3 50
4606E0m1n8NQ2lm6m0N9O3n0o3K8O3Pp5j0M7M0m6n8L0O4j1o4k3P5K0m2o6N1N0j4
$$ 50 9 -49 -44 38 35 -11 -51 8 71 21 -42 -14 49 56 -19 -29 18 58 12 -46 -16 48 37 -27 -50 25 45 3 -63 -12 38 24
4638B4p2j1O5K2m9l3M1N1po8rO1K5m9l7N0M7k3o1J4N4K2n2k4L1L8k8n0K1M5Mm9
$$ 24 -48 -59 6 28 -21 -54 -13 38 31 -37 -46 15 40 -9 -46 4 51 28 -33 -19 35 57 5 -19 12 50 22 -28 -7 38 42 -7
4670gl7O0L7m2n6K3M0nm5j5M9J7k7m1J4P3j2m5l1M5N5n5l9L6M8j0n6RM0K4l4m4
$$ -7 -44 16 53 11 -45 -22 18 13 -32 -47 2 19 -8 -49 -35 38 26 -19 -50 -5 50 -5 -44 -8 40 30 -26 -17 23 47 13 -31
4702c1K5N7Jo8j6O1J5n4k7L7M1k0n8PM9K5n1m8M4L5j4m7JN6Nn7j8N0L4k5n1K2
$$ -31 -6 51 52 -16 -32 29 44 -10 -37 0 41 21 -37 -30 19 44 -7 -55 -11 24 10 -37 -36 20 25 -32 -50 0 34 9 -42 -20
4734b0N5Ln7j5M4M2m6k6PO4Jo7j0N4K7m6m6L2M5qo1nO0J1m4l7K9N2k0o1LN7J8
$$ -20 35 38 -19 -34 10 52 6 -20 -13 51 52 -15 -25 29 56 10 -36 -4 41 33 -28 -33 27 38 -6 -43 -14 38 18 -43 -40 17 35
4767C5n4l9N4L7l0l9K4M0J2n3k7M1M6k6n7K5O0on3j5N1L0m2m1K7L7j4l9j7L7L7
$$ 35 -19 -58 -4 33 3 -36 -12 28 40 -13 -40 1 47 21 -36 -11 49 43 -10 -25 26 56 14 -27 0 37 23 -16 -33 4 41
4798D1l8m8L7M9k9n4K2M2Nm8k6L5L3k3k9J0L4K4n6j8L1M7j0n4MO7j6m3nK1M6l2
$$ 41 3 -45 -8 41 12 -42 -20 22 27 -21 -47 -12 21 -2 -31 -21 13 37 -19 -37 -6 41 31 -23 -19 48 32 -11 -16 5 51 19
4830A9m5J2N2Ln4j2K9L9l5m6K3M1j3m2mK9L3l7k7J0M0J1n2j6M3K5l0k6J4N0j2
$$ 19 -26 -14 38 41 -13 -25 4 43 8 -38 -15 26 13 -29 -33 -4 29 -8 -35 -25 15 26 -26 -42 1 26 -4 -30 -16 34 22
4861B2n5K1L2J6k8l4K3M6j1l5j0L7K1l8m8M4L6k4m2J4M3qk8l0L0K6j2m5jL9K4
$$ 22 -33 -12 20 36 8 -26 -3 43 32 -3 -13 24 45 7 -41 3 39 15 -27 -13 30 22 -6 -36 -6 20 8 -37 -38 1 25
4892B5m5l0M3L7l4m2K3M1On4OL8J9k6k8J0L9jl4k1M7K6n0k6M1L5j3n3kM3Pl4k3
$$ 25 -20 -50 -7 30 -4 -46 -23 18 24 -30 -24 14 33 7 -21 -11 28 27 -7 -28 19 45 -5 -31 10 45 32 -21 -23 20 27 -7 -30
4925c0J8L6k3l3nN6mm8rM6J7k1n2K8M7Jm8LK9L2k5m8L1M0Ln2j0N4J1k8l8L1L2
$$ -30 -12 24 1 -32 -37 19 15 -33 -42 4 21 0 -52 -24 23 24 -24 -21 8 40 15 -33 -2 38 41 -11 -21 33 44 16 -22 9 41
4958D1pn2oL9J4l7k7K6L2j0m8KM2J0m1k8L3M8l6k3J6K2Kl2mK6K8j7m3J2L8Nm2
$$ 41 34 -18 -24 15 29 -8 -35 -9 23 13 -35 -33 9 19 -22 -50 -17 31 -5 -28 -12 10 12 -20 -24 2 30 13 -30 -18 20 25 -17
4991a7JL2J7k7j7J6K5nl9%K0J7k5l0K3L1%m6oK8J1k7k3K1L2j6k8kL1L2k5l7J5
$$ -17 -16 16 33 6 -11 5 30 25 -14 -14 6 23 -2 -32 -9 22 22 -24 -30 -2 9 -18 -41 -20 12 -4 -32 -34 -3 29 4 -33 -18
5024a8M7j4k6rM3Ml8qK7K4j3k8nK5J8j9l1J7L8k1l7%M2Rl6k1K6K2k2k7PL5ll3
$$ -18 29 15 -11 -20 23 27 -11 -19 8 32 19 -9 -14 11 29 10 -21 -4 34 13 -24 -24 18 27 -9 -30 -4 18 -4 -31 -24 11 8 -25
5058b5j9L3M1l2m0K5L5nl5kM0J6k9k3K3K9rk8j2M5J9l5l7L1L8l1l1ML8qk6l1M1
$$ -25 -44 -11 30 -2 -42 -17 18 13 -22 -24 16 32 3 -20 3 32 23 -5 -17 28 47 12 -25 6 44 13 -18 -14 24 16 -10 -41 0
5091@K5k4k9jM0Qm0k1L4K4j8l5K1L9j6l0qL6J4j9j9J3K6ml0MK5L3m6j8J5M1j5
$$ 0 25 1 -28 -29 11 19 -21 -42 -8 16 -2 -37 -16 23 7 -23 -31 5 19 0 -19 -6 20 16 -14 -10 15 48 2 -16 -1 40 25
5124B5l3nL7nk3k0K2K1k1j5j0K7%ol1L5Rj7k6J1K3mj1%K5Prj4rL2Pk8kK4J6k8
$$ 25 -8 -13 24 19 -4 -24 -2 19 -2 -17 -27 0 0 -6 -37 -2 7 -10 -36 -25 -2 -6 -17 -17 8 15 6 -8 -17 15 22 -6 -8 16 32 4
5160Dk0K2L7k4j9lJ4J8k3k5J7J1Nl7pK6J8k4k1J7J6kl5PK7Lj6j7LL9%l0rM1J3
$$ 4 -16 6 43 19 0 -3 11 29 6 -19 -2 9 14 -23 -30 -4 14 -10 -31 -14 2 0 -35 -28 -1 2 -14 -31 -28 11 11 -19 -28 13 26
5195B6l1j5K5K6j2k8jK9Nj7k0J6K6j3l5ML2J4m4j4K8J9k9k0J8K1jk6j3K1K4j6
$$ 26 -5 -20 5 31 19 -9 -10 19 24 7 -13 3 29 16 -19 -15 17 31 -13 -27 1 20 -9 -29 -11 10 9 -17 -30 -9 15 -1
5227al0PL9ll2pK8K6l2k9L3K8j2k5KK4J9k4k4K1L1k0l6%M4Lm5kJ9K4k4l5K0K1
$$ -1 -31 -24 15 12 -20 -27 1 27 -5 -34 -1 27 15 -10 -8 16 35 11 -13 8 39 19 -17 -17 27 30 -15 -17 2 26 2 -33 -13 8
5261Hok5jJ3K5k9k6L0K9k0k4K0J4Lk8oK0K1j1j2jK2J6l5j4K8J8j3l7J9L0ol1K
$$ 8 2 -23 -24 -11 14 -15 -41 -11 18 -2 -26 -6 8 11 -17 -23 -3 18 7 -5 -6 16 32 -3 -17 11 29 16 -21 -2 28 22 -9 -7
5295gK1lj7j3JJ1J0k5nK0J8j8j9NK5ok2%K5NJk7QJ8J3k0pJ8Pj3j2J1K3lk4oJ9
$$ -7 14 11 -6 -19 -18 -7 3 -22 -27 -7 11 -7 -26 -21 4 -2 -24 -24 1 6 7 -20 -12 6 19 -1 -8 10 17 4 -8 3 26 23 -1 -7 12
5332A2J2j5j0PLPk4j3J9K9k4l5J0K4Kl2lJ1K1j1j5J0J8%j6pL1mnl0K4K9rk0KK9
$$ 12 24 9 -1 6 9 16 -8 -21 -2 27 3 -32 -22 2 4 -28 -31 -20 1 -10 -25 -15 3 3 -13 -20 11 7 2 -28 -4 25 16 -4 -2 27
5368B7J1k4j8J8Q%k9KK2J0k9j9K0K8k5l5J6K9j1l0jK3J2j3j6KK5K0m7j8M5K0k3
$$ 27 38 14 -4 14 22 22 -7 -5 17 27 -2 -21 -1 27 2 -33 -17 12 1 -29 -30 -7 5 -8 -24 -22 3 23 -24 -42 3 23 0
5401@k9K9K6k8j2PL1J1j6k0J8K5j7m2J5K4J3m8j1L4J7k6j7RJ2Jk5NQJ2j1k4J1
$$ 0 -29 0 26 -2 -14 -7 24 35 19 -1 17 42 25 -17 -2 22 35 -13 -24 10 27 1 -16 -7 5 6 -19 -14 -6 6 -5 -29 -18
5434a8J9j1j1JK6J1l1MJ7Rj5j8K1QRj5rRK9j4k0%K7pk6KK0Kk5qJ0PNj9%J0Oj7
$$ -18 1 -10 -21 -20 6 17 -14 -10 7 16 1 -17 4 12 21 6 -3 6 35 21 1 1 28 21 -5 -3 17 19 -6 -14 -4 3 8 -11 -11 -1 5 -12
5472a2k4J5K9rj5kQJ2j9jLJ8%jlJJ3mj4kK9Lk8MJ6jj2OpJ5qj4pJ3Rj7j9RK7Ql2
$$ -12 -36 -21 8 -1 -16 -18 -10 2 -17 -18 -15 3 3 2 -1 0 13 9 -5 -7 22 25 -3 1 17 16 4 10 3 18 10 -4 -11 2 11 -6 -25 -16 11 19 -13
5513a3pK6Kk3qQJ2lmnJ7Rj5k1K5L2j4l6RK5Nk1j0J5J9j0k7NK5J1l2k4L1J6k3j4
$$ -13 -20 6 8 -15 -23 -15 -3 -6 -10 -15 2 11 -4 -25 0 32 18 -18 -9 16 21 0 -10 5 24 14 -13 -8 17 28 -4 -28 3 19 -4 -18
5549a8J0K7pl5jK8Rj7j8J1J8rj4kJ5J8k2k4L7K0j7k2PM0j6k1KK0J4k5mRRRl2j1
$$ -18 -8 19 12 -23 -24 4 13 -4 -22 -11 7 -2 -16 -18 -3 15 -7 -31 6 26 9 -13 -6 34 18 -3 -1 19 33 8 4 13 22 31 -1 -12
5585a2K5J1j7k6J4K6j5l1J3RMj9j%K2pnj1K6%j4nNJ7j1j9J2K1k%jKJ2j1rmK4m
$$ -12 13 24 7 -19 -5 21 6 -25 -12 -3 1 -18 -19 -19 3 -4 -9 -20 6 6 -8 -13 -8 9 -2 -21 -9 12 10 10 9 11 23 12 3 -1 23 19
5623A9j4mJ7Lk2j3OK3j8Kon%%moJ3J5k2j5K6J5k3RJO%kOlPmj2RJ1J0j0j5PJ4q
$$ 19 5 1 18 21 -1 -14 -8 15 -3 -1 -7 -12 -12 -12 -16 -22 -9 6 -16 -31 -5 10 -13 -4 -3 3 3 1 7 4 11 7 -5 4 15 25 15 0 7 21 13
5664A3rKMMj0KkQlj8lK0J0l3qJ7J2k2jJ4J4j8pMMJ8rk5J6K4%k8QL3Rl2k1L3K0
$$ 13 4 6 10 14 4 6 4 12 9 -9 -12 8 18 -15 -23 -6 6 -16 -17 -3 11 -7 -14 -10 -6 12 3 -22 -6 18 18 -10 -2 31 40 8 -13 20 40
5703D0j7j2KOj0jj8J8J2rk0NK1kl0rL4Nl6pK8Qj9lMK1Rk7j9K1K8ol1RL2j0j7L
$$ 40 23 11 13 19 9 8 -10 8 20 11 -9 -4 17 15 -15 -24 10 15 -21 -28 0 8 -11 -14 -10 11 20 -7 -26 -5 23 17 -14 -5 27 17 0 3
5741CJ4Oj0nRJ1j2qqJ7J4k3j7K0J0j2j3kJ9jl1LJ5kqoQQNj1qK0J5j8j2K2Mj4j3
$$ 3 17 23 13 8 17 28 16 8 0 17 31 8 -9 11 21 9 -4 -6 13 12 -19 -16 -1 -3 -11 -17 -9 -1 4 -7 -15 5 20 2 -10 12 16 2 -11
5780a1J8J2lqL%jQlrQkpj4K8mrJk0J2oJ1pj4mK0j0j1MRQj2PJ1qkPJNRmj6OK3j1
$$ -11 7 19 16 8 11 11 10 18 15 6 14 12 5 -9 19 15 6 7 -13 -1 -7 4 -3 -17 -21 -1 -11 -22 -18 -9 -1 -13 -6 5 -3 -5 2 3 8 17 13 -3 3 26 15
5825A5j2NJ9j4j5J7Ljq%j1RJj9KMJ0qk1J3J9j9j4J2J6pj9RJ0oJ0j3OJ3Nrj6K5
$$ 15 3 8 27 13 -2 15 18 17 9 9 -2 7 8 -11 -9 -5 5 -3 -24 -11 8 -11 -25 -13 3 -4 -23 -14 -4 -10 0 -13 -7 6 11 2 -14 11
5863A1J2k2j8K6K1k1k1K3J6rj2%%J9j3j8oJ8J0k4j1K2Nk3j9K3K5k5rRQLj1KlJ4
$$ 11 23 1 -17 9 30 9 -12 11 27 18 6 6 6 25 12 -6 -12 6 16 -8 -19 3 8 -15 -34 -11 14 -11 -20 -11 -3 0 -11 -9 -12 2
5899BmoJK7Kk9JJ8K1l1%K3oj1oJ2oQmj6QJ5pk5oK5jk1mK0pj4KJ0j2%L%J0J5ok2
$$ 2 -2 -8 -7 20 22 -7 -6 12 33 2 2 25 19 8 2 14 8 16 12 -4 4 19 12 -13 -19 6 5 -16 -20 0 -7 -21 -19 -9 -21 -21 -18 -18 -8 7 1 -21
5941b1J8ONn%NPj7J1kj2J2Mnj7K3QrlPoj0%KnjRj5oJ1PqoKKQj6J5KrkjK2j9Qm
$$ -21 -3 3 8 3 3 8 15 -2 9 7 -5 7 11 6 -11 12 20 11 8 15 9 -1 -1 1 -4 -5 4 -11 -17 -6 1 -7 -13 -11 -9 -1 -17 -2 0 -9 -11 -12 10 -9 -1 -5
$$ [...]
8191a0
##END NTUPLES=NMR FID
##END=
