##TITLE=1H_LY-DMAA.Per.3.25
 CDCl3
 8 sc, 
 5.04.2022
##JCAMPDX= 6.0         $$ Bruker NMR JCAMP-DX V2.0
##DATA TYPE= NMR FID
##DATA CLASS= NTUPLES
##ORIGIN= UXNMR, Bruker Analytische Messtechnik GmbH
##OWNER= root
$$ XWIN-NMR		Version 3.5
$$ Tue Apr  5 11:28:01 2022 Russian Standard Time (UT+4h)  she@DPX200
##.OBSERVE FREQUENCY= 200.131346
##.OBSERVE NUCLEUS= ^1H
##.DELAY= (6, 6)
##.ACQUISITION MODE= SIMULTANEOUS
##.ACQUISITION SCHEME= undefined
##.AVERAGES= 8
##.DIGITISER RES= 18
##SPECTROMETER/DATA SYSTEM= spect
##.PULSE SEQUENCE= zg30
##.SOLVENT NAME= CD2Cl2
##.SHIFT REFERENCE= (INTERNAL, CD2Cl2, 0, 15.7039)
##AUDIT TRAIL= $$ (NUMBER, WHEN, WHO, WHERE, WHAT)
$$ ##TITLE= Audit trail, XWIN-NMR		Version 3.5
$$ ##JCAMPDX= 5.01
$$ ##ORIGIN= Bruker BioSpin GmbH
$$ ##OWNER= she
$$ F:/spectra/data/she/nmr/H-F/1/audita.txt
$$ ##AUDIT TRAIL=  $$ (NUMBER, WHEN, WHO, WHERE, WHAT)
(   1,<2022-04-05 11:26:49.17 +0400>,<she>,<DPX200>,
      <created by zg, POWCHK disabled, PULCHK disabled
       configuration hash MD5:
       00 E9 B6 7A A2 85 ED C7 34 08 36 98 17 FE 4E 26
       data hash MD5: 16K
       3F 02 3C 8E D5 FC 4F 8C 32 54 49 9C 24 80 47 5A>)
$$ ##END=
$$ 
$$ hash MD5
$$ 7B 9F 3E 6F EC 2C E2 31 37 23 92 68 B3 5E 8B 74
##$RELAX= 
##$RELAX= 
##$RELAX= 
##$RELAX= 
##$RELAX= 
##$RELAX= 
$$ Bruker specific parameters
$$ --------------------------
##$DU= <F:/spectra>
##$EXPNO= 1
##$NAME= <H-F>
##$PROCNO= 1
##$TYPE= <nmr>
##$USER= <she>
##$AMP= (0..31)
100 100 100 100 100 100 100 100 100 100 100 100 100 100 100 100 100 100 
100 100 100 100 100 100 100 100 100 100 100 100 100 100 
##$AQSEQ= 0
##$AQ_mod= 1
##$AUNM= <au_zg>
##$AUTOPOS= <>
##$BF1= 200.13
##$BF2= 200.13
##$BF3= 200.13
##$BF4= 200.13
##$BF5= 200.13
##$BF6= 200.13
##$BF7= 200.13
##$BF8= 200.13
##$BYTORDA= 1
##$CFDGTYP= 0
##$CFRGTYP= 5
##$CHEMSTR= <none>
##$CNST= (0..31)
1 1 145 1 1 1 1 1 1 1 1 1 1 1 1 1 1 1 1 1 1 1 1 1 1 1 1 1 1 1 1 1 
##$CPDPRG= <>
##$CPDPRG1= <>
##$CPDPRG2= <>
##$CPDPRG3= <>
##$CPDPRG4= <mlev>
##$CPDPRG5= <mlev>
##$CPDPRG6= <mlev>
##$CPDPRG7= <mlev>
##$CPDPRG8= <mlev>
##$CPDPRGB= <>
##$CPDPRGT= <>
##$D= (0..31)
0 1.2 0 0 0 0 0 0 0 0.06 0 0.03 0 0 0 0 0.0002 0 0 0 0 0 0 0 0 0 0 0 0 
0 0 0 
##$DATE= 1649143608
##$DBL= (0..7)
120 120 120 120 120 120 120 120 
##$DBP= (0..7)
150 150 150 150 150 150 150 150 
##$DBP07= 0
##$DBPNAM0= <>
##$DBPNAM1= <>
##$DBPNAM2= <>
##$DBPNAM3= <>
##$DBPNAM4= <>
##$DBPNAM5= <>
##$DBPNAM6= <>
##$DBPNAM7= <>
##$DBPOAL= (0..7)
0.5 0.5 0.5 0.5 0.5 0.5 0.5 0.5 
##$DBPOFFS= (0..7)
0 0 0 0 0 0 0 0 
##$DE= 6
##$DECBNUC= <off>
##$DECIM= 32
##$DECNUC= <off>
##$DECSTAT= 4
##$DIGMOD= 1
##$DIGTYP= 9
##$DL= (0..7)
0 120 120 120 120 120 120 120 
##$DP= (0..7)
150 150 150 150 150 150 150 150 
##$DP07= 0
##$DPNAME0= <>
##$DPNAME1= <>
##$DPNAME2= <>
##$DPNAME3= <>
##$DPNAME4= <>
##$DPNAME5= <>
##$DPNAME6= <>
##$DPNAME7= <>
##$DPOAL= (0..7)
0.5 0.5 0.5 0.5 0.5 0.5 0.5 0.5 
##$DPOFFS= (0..7)
0 0 0 0 0 0 0 0 
##$DQDMODE= 0
##$DR= 18
##$DS= 0
$$ [...]
##$SUBNAM2= <"">
##$SUBNAM3= <"">
##$SUBNAM4= <"">
##$SUBNAM5= <"">
##$SUBNAM6= <"">
##$SUBNAM7= <"">
##$SUBNAM8= <"">
##$SUBNAM9= <"">
##$SW= 18.0517287032376
##$SWIBOX= (0..15)
0 0 2 0 0 0 0 0 0 0 0 0 0 0 0 0 
##$SW_h= 3612.71676300578
##$TD= 16384
##$TD0= 1
##$TE= 0
##$TE2= 300
##$TE3= 300
##$TEG= 300
##$TL= (0..7)
0 120 120 120 120 120 120 120 
##$TP= (0..7)
150 150 150 150 150 150 150 150 
##$TP07= 0
##$TPNAME0= <>
##$TPNAME1= <>
##$TPNAME2= <>
##$TPNAME3= <>
##$TPNAME4= <>
##$TPNAME5= <>
##$TPNAME6= <>
##$TPNAME7= <>
##$TPOAL= (0..7)
0.5 0.5 0.5 0.5 0.5 0.5 0.5 0.5 
##$TPOFFS= (0..7)
0 0 0 0 0 0 0 0 
##$TUNHIN= 0
##$TUNHOUT= 0
##$TUNXOUT= 0
##$USERA1= <user>
##$USERA2= <user>
##$USERA3= <user>
##$USERA4= <user>
##$USERA5= <user>
##$V9= 5
##$VALIST= <valist>
##$VCLIST= <CCCCCCCCCCCCCCC>
##$VD= 0
##$VDLIST= <DDDDDDDDDDDDDDD>
##$VPLIST= <PPPPPPPPPPPPPPP>
##$VTLIST= <TTTTTTTTTTTTTTT>
##$WBST= 1024
##$WBSW= 4
##$XGAIN= (0..3)
0 0 0 0 
##$XL= 0
##$YL= 0
##$YMAX_a= 685463
##$YMIN_a= -608366
##$ZGOPTNS= <>
##$ZL1= 120
##$ZL2= 120
##$ZL3= 120
##$ZL4= 120
##$ABSF1= 10
##$ABSF2= 0
##$ABSG= 5
##$ABSL= 3
##$ALPHA= 0
##$AQORDER= 0
##$ASSFAC= 0
##$ASSFACI= 0
##$ASSFACX= 0
##$ASSWID= 0
##$AUNMP= <proc_1d>
##$AZFE= 0.1
##$AZFW= 0.1
##$BCFW= 1
##$BC_mod= 2
##$BYTORDP= 1
##$COROFFS= 0
##$CY= 11.3945322036743
##$DATMOD= 1
##$DC= 2
##$DFILT= <>
##$DTYPP= 0
##$F1P= 2.36226072786647
##$F2P= -0.459571619588291
##$FCOR= 0.5
##$FTSIZE= 0
##$FT_mod= 4
##$GAMMA= 1
##$GB= 0.15
##$INTBC= 1
##$INTSCL= 1
##$ISEN= 128
##$LB= 0.24
##$LEV0= 0
##$LPBIN= 0
##$MAXI= 10000
##$MC2= 0
##$MEAN= 0
##$ME_mod= 0
##$MI= 1.114404
##$NCOEF= 0
##$NC_proc= 0
##$NLEV= 6
##$NOISF1= 3.799351
##$NOISF2= 2.8
##$NSP= 1
##$NTH_PI= 0
##$NZP= 0
##$OFFSET= 15.70392
##$PC= 1
##$PHC0= -17478.64
##$PHC1= 24.00078
##$PH_mod= 1
##$PKNL= yes
##$PPARMOD= 0
##$PSCAL= 0
##$PSIGN= 0
##$REVERSE= no
##$SF= 200.130013532006
##$SI= 16384
##$SIGF1= 3
##$SIGF2= 2
##$SINO= 400
##$SIOLD= 16384
##$SREGLST= <1H.CDCl3>
##$SSB= 0
##$STSI= 0
##$STSR= 0
##$SW_p= 3612.71676300578
##$SYMM= 0
##$S_DEV= 0
##$TDeff= 0
##$TDoff= 0
##$TI= <>
##$TILT= no
##$TM1= 0
##$TM2= 0
##$TOPLEV= 0
##$USERP1= <user>
##$USERP2= <user>
##$USERP3= <user>
##$USERP4= <user>
##$USERP5= <user>
##$WDW= 1
##$XDIM= 8192
##$YMAX_p= 0
##$YMIN_p= 0
$$ End of Bruker specific parameters
$$ ---------------------------------
##NTUPLES= NMR FID
##VAR_NAME=  TIME,          FID/REAL,        FID/IMAG
##SYMBOL=    X,             R,               I
##VAR_TYPE=  INDEPENDENT,   DEPENDENT,       DEPENDENT
##VAR_FORM=  AFFN,          ASDF,            ASDF
##VAR_DIM=   8192,          8192,            8192
##UNITS=     SECONDS,       ARBITRARY UNITS, ARBITRARY UNITS
##FACTOR=    0.0002768,     1,               1
##FIRST=     0,             0,               0
##LAST=      2.2672688,     0,               0
##MIN=       0,             -608366,         0
##MAX=       2.2672688,     685463,          0
$$ Real data points
##PAGE= N=1
##DATA TABLE= (X++(R..R)), XYDATA
0@%%%%%%%qQqJ6j7K5l2M0n4O3p5R8j20J40j70K03k38K80l28L80m37N06n84O68
31C56p61Q66r83J109j251J412j583J769j975K200k445K713l009L331l680M063
47B132m484M943n444N997o608P282q031Q870r813J0879j2098J3512j5168J7137
61I106j9532K2517k6353L1494l8786M9991o9555J13254l78263J70209Q21381o02713
73H2750o08306L60032N77560k44958l71484p269K35045J86532k4412m11801j15836
84c42147N54212K69762o85587l48346P21963M11129p16795m05081O23582L78942
94D61634m91578l06472L00777K27660r7058j30375j20989M5796L14702L1870m79869
105b43902q3316N90513J15681o44812j20388O32971J07482n62777p8079M40004
$$ plain form
0 0 0 0 0 0 0 0 0 -8 0 -8 8 -9 16 -16 24 -30 33 -42 56 -64 76 -94 109 -129 151 -177 203 -234 272 -312 356
31 356 -405 461 -522 587 -664 748 -835 934 -1041 1159 -1286 1427 -1582 1749 -1931 2132
47 2132 -2352 2591 -2853 3144 -3464 3818 -4213 4657 -5156 5723 -6375 7137 -8031 9106
61 9106 -10426 12091 -14262 17232 -21554 28437 -41118 72136 -306127 -135918 685463 82750
73 82750 -525556 -165524 412036 167078 -204406 -211675 23370 209902 185490 -226311 -342147
84 -342147 212065 481827 -203760 -552106 169857 580986 -135809 -540890 82692 461634
94 461634 -29944 -336416 -35639 192021 94963 -35412 -156401 -110605 204097 235967 -243902
105 -243902 -327218 263295 378976 -265836 -386224 246747 354229 -208548 -286627 153377
115A53377M3662k81495q726J03034j7512P3766L0921k32152k7894L55191Q526
126B00698m32554K4244M57589o5938m31551J09466L60768j47751k56421J74173
136g277J33100j83320o560J72502j07255j40432J96032Q9919k50073k5141K64968
147A36463m7468k40759J20470J83257j86461j01670K37821P668k69624Q4901K77892
158B02490j63385k61642K16345K21649k36406j62185K19823Q8685j67507q162
168e0295Q5902p1745J5409J44052j23347k01871K24791K41107l05621k58537L54453
179E4298K54065l63743k29550L30212J88695k55814j37018J47042P9711j5742
189E2156k3024j24246k8996K57506P2565l69119j06138M46323J28962m80102j41082
$$ plain form
115 153377 197039 -84456 -93182 9852 -7660 66106 97027 -135125 -163019 192172 200698
126 200698 -231856 -207612 249977 184039 -247512 -138046 222722 74971 -181450 -7277
136 -7277 125823 -57497 -64057 108445 1190 -139242 56790 146709 -103364 -128505 136463
147 136463 88995 -151764 -31294 151963 -34498 -136168 101653 109321 -160303 -75402 202490
158 202490 39105 -222537 -6192 215457 -20949 -183134 36689 125374 -42133 -50295
168 -50295 35607 -36138 -20729 123323 -24 -201895 22896 264003 -41618 -300155 54298
179 54298 308363 -55380 -284930 45282 233977 -21837 -158855 -11813 67898 52156
189 52156 29132 -95114 -124110 133396 205961 -163158 -269296 177027 305989 -174113 -315195
200c15195M66221J44509m04800j40711L01581J32230j66209j20497J2503J07198
210A6830J44468r2509k89290P6328M07058n8318m86123L7563N18410j3980n01211
221b40774j3286M35935M3449l29524p6235J93345J09673m1367j41388j10817J68623
232b366K48296j87567l57186J95545M27914j89722m54548J68858M36438j32392
242A53270l77419Q2022K85407k0933j71848m6604M9137J14704O9508j77549j72549
253b12854K28270K50286k61670k97046K73444L10496k61565k91645K26183K45360
263B09259j69842j78438R7612J00260j5455k0042o8417n2885J46343J10748k10547
274e1404j48139K55106J62181k75728j53654K70576J24926k40686q1996J89317
$$ plain form
200 -315195 151026 295535 -109265 -249976 51605 183835 17626 -102871 -90368 16830
210 16830 161298 68789 -220501 -144173 262885 204567 -281556 -243993 274417 260437 -240774
221 -240774 -254060 181875 225324 -104200 -180435 12910 122583 81216 -60172 -170989 -2366
232 -2366 245930 58363 -298823 -103278 324636 134914 -319634 -150776 285662 153270
242 153270 -224149 -142127 143280 122347 -49501 -96105 -46968 67736 137244 -40305 -212854
253 -212854 15416 265702 4032 -293014 -19570 290926 29361 -262284 -36101 209259
263 209259 39417 -139021 -41409 58851 43396 23354 -45063 -97948 48395 159143 -51404
274 -51404 -199543 55563 217744 -57984 -211638 58938 183864 -56822 -138818 50499
284E0499L1616j22358J8272M6487o0514K9973Q9204r9257j00079J54623R2165
295A30631j90705o6550K04901K7451j96589J9876J68369o8194j24698J10818P1460
306H6770j41362j5846J55284l5443j50124P6100J25173j01837q3305J10280K8106
317E3796j01181L4085P6845r6768m1490J52766R30j95788L9133K20804p1918k24366
329a53152R2514K05946r7241j66451Q4690J09899n5522m1798J2974l1094L7546
340a689J01430q9803j62452J36410K07781j71051k33663J87807K37687j83282
350B9175k20214J56433J83458j08567j31833M3980P0981L1198o674j08536n4792
361a15391J79905J08247k36718j49394K72176J75899k81459j86282K62053J81367
$$ plain form
284 50499 82115 -40243 -21971 24516 -35998 -6025 83179 -16078 -116157 38466 130631
295 130631 -60074 -126624 78277 105728 -90861 -70985 97384 29190 -95508 15310 86770
306 86770 -54592 -70438 84846 49403 -100721 -24621 100552 -1285 -84590 25690 53796
317 53796 -47385 -13300 63545 -33223 -74713 78053 78983 -116805 -77672 143132 71214 -153152
329 -153152 -60638 145308 48067 -118384 -33694 76205 20683 -21115 -8141 -39235 -1689
340 -1689 99741 9938 -152514 -16104 191677 20626 -213037 -25230 212457 29175
350 29175 -191039 -34606 148852 40285 -91548 -47568 23413 54611 47937 -60599 -115391
361 -115391 64514 172761 -63957 -213351 58825 234724 -46735 -233017 29036 210403
371B10403k15461j62908J45022J33498n7608r6966l8443N6729J33133j6617k17175
382a26393k0120K81672N1024l19663p4436L27352Q9621l03315r6576K50222R6770
393A56158j73092r1392P9893Q2402J9931p1445j16384O0188J99686m9359k62134
404a65548L9056K97414k9299l02959J9027K79043p787k29097n462J59012K0684
415G4084p6580l7560q885N5266Q9119p2358j55708Q6934K02836r6905k26410J00862
427f5305K25406r7247k01473Q5601J58330o6213j02177M0521L9353j0093K1850
438B8553k2416p5300N4297J14932q2773j36992J05045J39894j19014j24475J23293
449E044R3924j17085n2781J01136P394p6618L6192M6056p1809j2225R4873k1353
$$ plain form
371 210403 -5058 -167966 -22944 110554 52946 -44020 -82463 -25734 107399 90782 -126393
382 -126393 -146513 135159 186183 -133480 -207916 119436 209057 -94258 -190834 59388 156158
393 156158 -16934 -108326 -28433 53969 73900 2455 -113929 -53741 145945 96586 -165548
404 -165548 -126492 170922 141623 -161336 -142309 136734 128947 -100150 -105612 53400 74084
415 74084 -2496 -40056 -48941 6325 95444 23086 -132622 -45688 157148 60243 -166167 -65305
427 -65305 160101 62854 -138619 -53018 105312 39099 -63078 -22557 16796 6703 28553
438 28553 6137 -69163 -14866 100066 17293 -119699 -14654 125240 6226 -118249 5044
449 5044 98968 -18117 -70898 30238 37632 -38986 -2794 43262 -28547 -40772 54101 32748
461C2748j02559N1529R3712p5474o9958R0950L4250r6862Q187R3052n1788q1149
473g3362R0614O2805j19421m0814J34061J8169j32085K467J13235j8621p8803
484d1755K9060L2838l3089K0105L1105p3957k4174J22578J4399j60533l769J82857
496I5665n376j86978J0899J71554j1550j38012O598Q9234L575l0347j8018l2756
508d5512L4774R3841n1479j46194O5337J84683p3481k05393P4205K06371o5587
519G1565j87599M7500J51327k0845j01368j2259M2929M8657J8145q4768p5882
530a02598J15696J24877j37911j60939J47915J80969j43782j83852J24846J70154
540A35375r2421j41663M8938J02300J637n6069n4269Q106J03893L7068j45146
$$ plain form
461 32748 -69811 -18282 75430 -44 -70002 20948 55198 -41664 -33477 59575 7787 -73362
473 -73362 17252 80057 -39364 -80178 53883 72052 -60033 -57566 55669 37048 -41755
484 -41755 -12695 20143 -12946 7159 38264 -35693 -59867 62711 77110 -83423 -87192 95665
496 95665 90289 -96689 -85790 85764 74214 -63798 -57200 32034 35609 5262 -12756 -45512
508 -45512 -10738 83103 31624 -114570 -49233 135450 61969 -143424 -69219 137152 71565
519 71565 -116034 -68534 82793 61948 -39420 -51679 -8750 39907 58052 -26716 -102598
530 -102598 13098 137975 64 -160875 -12960 168009 24227 -159625 -34779 135375
540 135375 42954 -98709 -49771 52529 54166 -1903 -56172 -48066 55827 92895 -52251
551e2251p5241J74040J03167j87093j19201J82811J22497j61362j14104J24302
561b435R6037p5353p1469J8903M3512L9265j5643r3696r020J38825K8507j70379
573g2946m1315J85506M7183j82305m6727J61870M1361j26143l2935P9335K3460
584C6344k6416j4526k7120P745P5369l843j14081L151J39082n388j48847R961
596f8569J42779j5866j22307K1339R0511k5257n1318K6365R681k3747K9698J7301
608C0610o2405o929Q5195o163r5846K1055R3794l5966p9972M9140N6642n8866
620i711k7271O3518m160o2577L3229N5508n6174m3073O9865K6211p2657o750O4184
633C0142j3473m5383L2480J9007m8450J1716O0051m2511o6049O9197O6746q8128
$$ plain form
551 -52251 -127492 46548 149715 -37378 -156579 26232 148729 -12633 -126737 -2435
561 -2435 93602 18249 -53220 -34317 9195 48460 32817 -60879 -69899 68926 97433 -72946
573 -72946 -114261 71245 118428 -63877 -110604 51266 92627 -33516 -66451 12884 36344
584 36344 9928 -4598 -31718 -23973 51396 47553 -66528 -63377 75705 70317 -78530 -68569
596 -68569 74210 58344 -63963 -42624 47887 22630 -28688 -2323 7358 -16389 13309 30610
608 30610 -31795 -38724 46471 40308 -55538 -34483 59311 23345 -56627 -7487 49155 -9711
620 -9711 -36982 26536 22376 -40201 -6972 48536 -7638 -50711 19154 45365 -27292 -34042 30142
633 30142 16669 -28714 3766 22773 -25677 -13961 46090 3579 -62470 6727 73473 -14655
645a4655o1941R6437N2600r2711l9891P6768K5113n0262r825J5720m718K2676
657A5311J7448o0945k7613R4511L4546j19323l8394J32456L9263j31710l7832
668h2282J17087L4935q9580l0924N1721K6841p301k2970l9086J9571Q2820j6562
680D4270j19273J3432J44445r772j55793M819J51978J469j33235r865J01557J9914
692E3946o0181l1042J3399M2231L4065n2099p7622N9576J12776o2767j36225O1026
704d2917J46189n3663j41834M0916J24317k3369r5724K224N9287K0642j9169m3527
716b6628k0557O3829N5811p9728q3540Q9295J01273r1575j07767Q5699J03333
727H9445p1910q8980N1309O7026k5401m0263l428J2241L2610J4300n9285l6417
$$ plain form
645 -14655 -76596 19841 72441 -20270 -60161 16607 41720 -8542 -18367 -2647 -7365 15311
657 15311 32759 -28186 -55799 38712 73258 -46065 -84459 47997 87260 -44450 -82282
668 -82282 34805 69740 -19840 -50764 957 27798 20497 -2473 -41559 -21988 60832 44270
680 44270 -75003 -61571 82874 73102 -82691 -77872 74106 75575 -57660 -67525 34032 53946
692 53946 -6235 -37277 -23878 18353 52418 319 -77303 -17727 95049 32282 -103943 -42917
704 -42917 103272 49609 -92225 -51309 73008 49639 -46085 -43861 15426 36068 16899 -26628
716 -26628 -47185 16644 72455 -7273 -90813 -1518 99755 8180 -99587 -13888 89445
727 89445 17535 -71445 -20136 46890 21489 -18774 -22202 -9961 22649 36949 -22336 -58753
739e8753Q0761N2070r4833o0221J00155O0421r5945n3771Q2674M1438o1880k5711
751c3595L5608Q845o773O702k1672j9095M6824K6932o6162k9129P7954K5980q1121
764b8702j8133P5844P173o3111N370M4825j7593k3014K7357N03l3438K0228L4598
777C1907l6879l0685M7755K1701n1990q837M9089o424m0146K2530K6311l7272
789a2940r648M8913p420n5847K2744N7229l3910n2625L9636M2306l8775k7332
801b7669L1606R139j8802J0246K140k9008J5994M5281l3494n7343M7475O4086
813E9651n6099o5168N8013O0096n2334m9911L9578L5553k0864j8453j785O21K5860
826A4758J6711m8722l1712O7722M3502q0486n0899Q5215N3777q1123n2275O8271
$$ plain form
739 -58753 22008 74078 -20755 -80976 19179 79600 -16345 -70116 12558 53996 -7884 -33595
751 -33595 2013 10858 4085 10787 -10885 -29980 16844 43776 -22386 -51515 26439 52419 -28702
764 -28702 -46835 29009 36182 -26929 -21559 23266 5673 -17341 10016 10519 -22919 -2691 31907
777 31907 -4972 -35657 12098 33799 -18191 -27028 22061 15637 -24509 -1979 24332 -12940
789 -12940 -22588 26325 18905 -36942 -14198 43031 9121 -43504 -3868 38438 -337 -27669
801 -27669 3937 13076 -5726 4520 6660 -22348 -6354 38927 5433 -51910 -4435 59651
813 59651 3552 -61616 -3603 56493 4159 -45752 -6174 29379 8515 -9938 -11723 -11102 14758
826 14758 31469 -17253 -48965 18757 62259 -18227 -69126 16089 69866 -11257 -63532 4739
838D739M6642m7652l8036K1162K7169Q633j5552l8740L970O5854O653q7271j5580
851e8009J00577K2538j04009k7234R7203K9971q0775l0657N6257K9994k6226k7947
863a8317o329K5211L7859k1785o5474J7941Q6083j3658r7918Q842R9970l793r2287
876d3655j731P5830P464n2610j3368K5256J9042L573k4253l0710K8659N3689l1621
889A5565p0168L2780P9038l1774p9522K8431P1984k2626n7682J4569L8382m848
901A4129j6485n988n614J6990K5239k7157m0654L5375N0169m0765n3187M2755
913e193M9677m1004m0447L5575K7193k6816j1671J5874l900l681J7699q460k7915
926b3069J9382L3429k7999l3892L3620K9157l5721k0326L4125Q576k9515M445
$$ plain form
838 4739 51381 3729 -34307 -13145 14024 22657 7105 -31635 -27665 38189 44842 -42429 -58009
851 -58009 42568 65106 -38903 -66137 31066 61037 -19738 -50395 5862 35856 9630 -18317
863 -18317 -24646 565 38424 16639 -48835 -30894 55189 41531 -56387 -47545 52425 48632 -43655
876 -43655 -45386 30444 37908 -14702 -28070 -2814 16228 19801 -4452 -35162 -6503 47186 15565
889 15565 -54603 -21823 57215 25441 -54081 -25650 46334 23708 -33974 -19405 18977 14129
901 14129 -2356 -8344 -13958 3032 28271 1114 -39540 -4165 46004 5239 -47948 -5193
913 -5193 44484 3480 -36967 -1392 25801 -1015 -12686 3188 -712 -4393 13306 4846 -23069
926 -23069 -3687 29742 1743 -32149 1471 30628 -5093 -25419 8706 17282 -12233 -7788
938g788K2226j6860j3494K7209M055l3918M834L6140j2088l3507J7229K6317j9587
951G68j5026J9049J337j6002J3503J0973k7672m622L9351j846m7197P586M9781
964B9983j1472m7244J2908L9386j1885k6896Q052J1284k162N904n217k2780J2892
977g247L7698j9708m8901K4638N5405k6724n6364K5479N1894k0480m2593J2359
989a4544K9393j720j3760j0368k880K2633J8772l3584l2647M1908M2923m6443
1001c17m9152M6382N0792m1483m7821L1917M0783j8374l0555K310J8351J4838
1013A7671n104l1417p494M5546J8471n5617k6934O0467L2288n9476l4360N2588
1025F629L3154m0498k9349K4411K3281n764j6172j3511Q784L1212j691m5860m338
$$ plain form
938 -7788 14438 -2422 -15916 11293 15348 -18570 -13736 22404 10316 -23191 -5962 20355 768
951 768 -14258 4791 6128 -9874 3629 14602 -13070 -17692 21659 19813 -27384 -19798 29983
964 29983 18511 -28733 -15825 23561 11676 -15220 -7168 4116 1954 7858 2641 -20139 -7247
977 -7247 30451 10743 -38158 -13520 41885 15161 -41203 -15724 36170 15690 -26903 -14544
989 -14544 14849 13129 -631 -10999 -13879 8754 27526 -6058 -38705 3203 46126 -317
1001 -317 -49469 -3087 47705 6222 -41599 -9682 31101 12727 -17828 -15518 2833 17671
1013 17671 12567 -18850 -26344 19202 37673 -17944 -44878 15589 47877 -11599 -45959 6629
1025 6629 39783 -715 -30064 -5653 17628 11864 -4308 -17819 -9035 22177 20486 -25374 -29712
1038b9712N5867R052o0217j2187N8799J3777n1548j4016L9585J3303k4107j1916
1050a3320O816J0345J0576q858k6355P530L8875o554m7016N717N0002n101m7876
1063b5219M487M0891l729k9951K425J6609p80k184j397j1376L950K2973o703l1123
1077b1127R525L5098j1943l4645J3693L0029j4437k2009J4060J1756j2473q06
1089c279R684r579o180J8116J925k3706K345K5708o298k4136R678J9099j1948
1102A429j1473J3173K246j3068P467J1961j6347r912K3409P161k7389m298K8026
1115A2385J461k5108R96J8684k792r766L869r02m254J1988L859k2262l005L0398
1129A5551K004l5430j124L6751O46l3955o56K7359J488j7725k800N959M728O665
$$ plain form
1038 -29712 26155 35207 -25010 -37197 21602 35379 -16169 -30185 9400 22703 -1404 -13320
1050 -13320 -6504 3841 14417 5559 -20796 -13266 25609 19055 -27961 -22244 27758 22657 -25219
1063 -25219 -20732 20159 16430 -13521 -11096 5513 4733 2549 1152 -10224 -6274 16699 9996 -21127
1077 -21127 -11602 23496 11553 -23092 -9399 20630 6193 -15816 -1756 10000 -2473 -3279
1089 -3279 6405 -3174 -9354 8762 10687 -13019 -10674 15034 8736 -15400 -5722 13377 1429
1102 1429 -10044 3129 5375 -7693 -226 11735 -4612 -14524 8885 16046 -11343 -15641 12385
1115 12385 13846 -11262 -10266 8418 5626 -4140 -271 -1173 -5427 6561 10420 -11842 -14847 15551
1129 15551 17555 -17875 -18999 17752 18398 -15557 -16213 11146 12634 -5091 -7891 -1932 2796 9461
1143I461o760j8872Q656K9295j0105l6731J0451M0608r667m0583P570L6359l991
1156A5691k8869o94J8648O037o735j1665n589J6858J7225k0985k6920K3511L3931
1169C0444k3874l7421K1843L7470j7587l3925J1352K7347l619j8427n057Q267
1181c187J3626J998k1245j1719K7276J9536l0869k5013L1592K7652k9355k7368
1193b7076K4272K4496j6697j9591P534J3307K570o448j2311l53K1097O247k7772
1206a0725j0766L1732J3595l2558j4814L0339J4283k5204j2493J7696R632q698
1218B019o260j006K927J0182P1j8087k428K3953L831k6966m358K7165M010k4495
1232i442k855J9395J294j2354L20M574j887L351K961j0465l320J5931K837j9170
$$ plain form
1143 9461 2701 -16171 -7515 21780 11675 -25056 -14605 26003 16336 -24247 -16677 19682 15691
1156 15691 -13178 -13872 4776 10813 4078 -7587 -13176 3682 20907 -78 -26998 -3487 30444
1169 30444 6570 -30851 -9008 28462 10875 -23050 -11698 15649 12030 -6397 -11454 -3187
1181 -3187 10439 12437 -8808 -20527 6749 26285 -4584 -29597 1995 29647 292 -27076
1193 -27076 -2804 21692 4995 -14596 -7062 6245 8815 2367 -9944 -10297 10800 17047 -10725
1206 -10725 -21491 10241 23836 -8722 -23536 6803 21086 -4118 -16611 1085 10717 2019
1218 2019 -4241 -5247 -2320 7862 7933 -10154 -12582 11371 15202 -11764 -16122 11043 15053 -9442
1232 -9442 -12297 7098 8392 -3962 -3642 932 -955 2396 5357 -5108 -8428 7503 10340 -8830
1246h830j800J9885J40j8238J921J4260m083q679N870K363p160M014P820r639
1260b156p641J3856O694j5942n019J5879K875j3579n09R462k049l896M394k353
1274A6o293Q378P670j3617q515J7337Q499j8890q061J8225O907j5232n337J0260
1288A347L528l702j630l470k41J0656J980j6852l415K1410M678k3903n388K3719
1302H717N839k0982o109J5918O119r074n987J016N681P219n251j4874M637K1046
1316A3915l708k5261K432K7031q74k6037r73K2574L104j6898n217R590P399j545
1330E532r124o614J0431J3962j1058j9828J0858K3544r640k5019P575K3842m713
1343I748k0457J193J5275K550q753o305J670R728N204j2483j1111J4212J5736
$$ plain form
1246 -8830 -10630 9255 9395 -8843 -6922 7338 3255 -5424 446 2809 -4351 -337 7483 -2156
1260 -2156 -9797 4059 10753 -5189 -10208 5671 8546 -5033 -5542 3920 1871 -2025 2369 16
1274 16 -6277 2101 9771 -3846 -12361 4976 13475 -5415 -13476 4749 11656 -3576 -8913 1347
1288 1347 4875 1173 -457 -3927 -4168 6488 8468 -8384 -11799 9611 14289 -9614 -15002 8717
1302 8717 14556 -6426 -12535 3383 9502 428 -5559 -4543 1138 8357 3106 -11768 -7131 13915
1316 13915 10207 -15054 -12622 14409 13535 -12502 -13475 9099 12203 -4695 -9912 -322 7077 5532
1330 5532 -3592 -10206 225 14187 3129 -16699 -5841 17703 8063 -16956 -9381 14461 9748
1343 9748 -10709 -9516 5759 8309 -444 -6749 -5079 4649 9853 -2630 -13741 471 16207
1356A6207j4755j8495J4092J9208j2057j7998Q973J5034m956j0770L14N825M311
1369D933p22q634m059J2175P951j4628j0657J5561J2071j5154j1964J3175J0653
1382A0701r925q255N846N245j350j798l205j327P201M096j0348o009J2265O997
1396A0134j2904o835J2032N695r924m008O934J699l374Q66n72l115M129M802o900
1411a341n950Q860O131r472n497R054L943p282j983M855l84j697K869j653m949
1426d496M584O647p024p583Q411P712q702p070P640N745n726l736K846J367N04
1441A119J218m039l534P026N691r396p269J0757Q165j0673q293R369P765o923
1455I83o484L533M677M07k510m556J15Q387K092j1376m131J3330N718j4000o749
$$ plain form
1356 16207 1452 -17043 -2951 16257 4200 -13798 -4825 10209 5253 -5517 -5203 622 4933
1369 4933 4211 -4423 -8482 3693 11644 -2984 -13641 1920 13991 -1163 -13127 48 10701
1382 10701 776 -7479 -1633 3612 2262 464 -2741 -4068 3133 7229 -3119 -9128 3137 10134
1396 10134 -2770 -9605 2427 8122 -1802 -5810 1124 2823 -551 315 -257 -3372 757 5559 -1341
1411 -1341 -7291 1569 7700 -1772 -7269 1785 5728 -1554 -3537 1318 934 -763 2106 453 -4496
1426 -4496 88 6735 -289 -7872 539 8251 -451 -7521 119 5864 138 -3598 -752 615 1119
1441 1119 2337 -1702 -5236 1790 7481 -1915 -9184 1573 9738 -935 -9228 141 7906 983
1455 983 -5501 -1968 2709 3116 606 -3950 -3835 4552 6644 -4732 -8863 4467 10185 -3815 -10564
1470a0564J3060P239j0767p219P367O595k968n668j616M317O370k888j0399J268
1484e873J3508M44j5307j946J5520L346j4243m481J1496N241p695n714L081N892
1498C269J645n601o240M893J0098l940j2799K711J4318j384j4207j37J2829J588
1512G043j0129k934O600M096k500m921j646N404N430n517q686N384J0702m689
1526C637j1744L733J1386k412r936Q19P548P54m582k216J147L761J943m604m926
1541e692N368O986n475q165N174Q487m401p695L192O132j697m050O3J630J444
1556A301Q80k775l172L654M887m266n808M243O196l994n579L127M391j973k690
1571a578P71O45N35J414j673l293K609M745l226n442L341N601l097n019K296L896
$$ plain form
1470 -10564 2496 9735 -1032 -8251 -884 5711 2743 -2925 -4541 -224 6146 3258 -7141 -5873
1484 -5873 7635 8079 -7228 -9174 6346 9692 -4551 -9032 2464 7705 10 -5704 -2623 3269
1498 3269 4914 -687 -6927 -2034 8064 4124 -8675 -5964 8354 6970 -7237 -7374 5455 7043
1512 7043 -3086 -6020 580 4676 2176 -2745 -4391 1013 6443 926 -7760 -2376 8326 3637
1526 3637 -8107 -4374 7012 4600 -5336 -4517 3031 3785 -797 -3013 -1866 1895 3838 -766 -5692
1541 -5692 -324 6662 1187 -6978 -1804 6683 2282 -5413 -2221 3911 2214 -1836 -1773 -143 1301
1556 1301 2181 -594 -3766 -112 4775 509 -5299 -1056 5140 1146 -4433 -1306 3085 1112 -1578
1571 -1578 -807 -162 373 1787 114 -3179 -570 4175 949 -4493 -1152 4449 1352 -3667 -1371 2525
1587B525j204k345k1L67J274J637k465l431L334M795l722n800L701O105l135n685
1603d070K174M804q69l299o22J463K203N00l487k496M457M140m912n400M800O117
1619E503m280o234L063N892j609m856k27L366K100j613l833k07N222K029o094
1634a778l580O454M781o127n450N133N725l633n362J705M589M60l572k549K061
1649a143M511n92n931r74O779K366p033l474O565M156n386m447L632M430j650
1664A809l950n31L234K603k168m319R95N642J69o377j149O315K127n795k789M685
1680E01L189l170l308J305L063O54k681k452K088L888j286m916M32N497L58n384
1696b222j052M722J668l675k051K268K198n72k205j058J969K507j544l587R93
$$ plain form
1587 2525 1321 -1024 -1045 -678 596 2233 -232 -3663 -329 4466 744 -5056 -1355 4750 1615 -4070
1603 -4070 -1896 2908 2039 -1260 -1882 -419 1784 2284 -1203 -3699 758 4898 -14 -5414 -614 5503
1619 5503 1223 -5011 -1948 3944 2335 -2521 -2748 618 2718 1105 -2728 -2935 2287 4316 -1778
1634 -1778 -5358 1096 5877 -250 -5700 -567 5158 1525 -3837 -2132 2457 2917 -655 -3204 -1143
1649 -1143 3368 2776 -3155 -4129 2650 5016 -2017 -5491 1074 5230 -156 -4603 -971 3459 1809
1664 1809 -2141 -2672 562 3165 997 -3322 -2327 3315 3484 -2893 -4042 2273 4400 -1395 -4184 501
1680 501 3690 520 -2788 -1483 1580 2234 -447 -2899 -811 3077 1791 -3125 -2693 2804 3162 -2222
1696 -2222 -3274 1448 3116 -559 -2610 -342 1856 1284 -921 -1979 -10 2497 953 -2634 -1641
1711a641M196l95m396j69L936Q36l270j241K199J504r44j610m02J615J603j318
1727E03k568R21L252l93l507j32L450N29k841r88J980J343j034j473j48J536J146
1744A576j378k147J125K719o05l140J01L079M19k737r03K150J271j177j567K46
1760i68J607R17j644j735J409K414r18k912M17K969K09k764q18K270J302j615
1776A40j627O80J811K09j767j158J608J882j262k408P98K661j43k708m09K528
1792H35R27k004j362J316J733m93j878l58J752J156j488j816J084K288o27k542
1808a477N8K490M91k206j013J664J420r95j635K23J744N13j565j220J248J844
1824A584q27k112K27K299K95k237p19J808J207j322j513P61J556l7j513o78J254
$$ plain form
1711 -1641 2555 2160 -2236 -2405 1531 2367 -903 -2144 55 1559 615 -995 -1397 218 1821 503
1727 503 -2065 -1144 2108 1715 -1792 -1924 1526 2055 -786 -1774 206 1549 515 -958 -1106 430 1576
1744 1576 198 -1949 -824 1895 1290 -1850 -1749 1330 1749 -988 -1891 259 1530 353 -1214 -968
1760 -968 639 1556 -88 -1823 -414 2000 1082 -1830 -1413 1556 1765 -999 -1817 453 1755 140
1776 140 -1487 -807 1004 1213 -554 -1712 -104 1778 516 -1892 -1094 1567 1424 -1284 -1693 835
1792 835 1762 -242 -1604 -288 1445 952 -926 -1284 468 1624 136 -1680 -596 1692 1065 -1477
1808 -1477 -1419 1071 1562 -644 -1657 7 1427 432 -1203 -980 764 1277 -288 -1508 -260 1584
1824 1584 757 -1355 -1128 1171 1466 -771 -1490 318 1525 203 -1310 -549 1007 970 -543 -1221 33
1841C3J268r29j747M59K152o1k185m10K101Q45j763j177J300J292o47j383k7J337
1859D58P37j098j372Q06J840m15k128J7K123L98k022p42J635J044j214j145N28
1876e50J195J24j024q54R53J266n50j768L35K074j23j994k01J855M44j515n77
1893i10R73P98n03q01j28P11P43p26j170N94J507m71j709K67J777j69j582J2J257
1912D70N3p27j97L16K37K47l01p15L91J035l96j235L97J285m40j163M91R09n20
1931A37o05M94J68m41K25L63n20k67P57J32r46Q1R49l18p53M89N42o55j35P31
1951D28j30q88N69P91q13p67R87O53j155l32Q99K29p08N1K96l02J53M82n82o88
1971h27J055O94j331p67J582P89j625o47J443N28j121l25O33J37M3k4o10j86J245
$$ plain form
1841 33 1301 372 -1375 -916 1236 1175 -1010 -1420 681 1526 -237 -1414 -114 1178 531 -852 -879 458
1859 458 1195 97 -1275 -469 1371 956 -1172 -1155 968 1366 -656 -1398 237 1281 67 -1078 -550
1876 -550 645 769 -255 -1109 -156 1110 560 -1208 -873 1201 1078 -916 -1117 738 1182 -333 -910
1893 -910 63 861 358 -443 -571 140 883 157 -1013 -419 1088 617 -1092 -825 952 783 -799 -787 470
1912 470 523 -204 -401 -85 152 399 98 -617 -226 809 413 -822 -425 860 420 -743 -252 657 137
1931 137 -468 26 194 -247 -22 341 -179 -446 311 443 -503 -422 527 209 -544 -55 487 -168 -303 428
1951 428 298 -590 -21 770 -43 -810 177 830 -325 -657 242 471 -237 -186 110 -192 -39 443 -139 -827
1971 -827 228 922 -409 -1176 406 1195 -430 -1077 366 894 -227 -552 81 218 261 237 -373 -559 686
1990F86K60j713l74K042L95k154m05J992L81j751l31J261K38n91k43p5K46P12
2008E76j09j451J98J950j53k223K13K257j90k110K13J748k04j306K84M32JJ59
2026B85j23q12K38J429n52j709O31J930q08j881R06J621q65j255Q48P37o52k30
2044b62N32m67j70R74j98j213N37J332q90j276J025J118j224p30J310K44j228
2061e86J37J137o22p96R18M90j112j22J163l17r67O94N83r05j59J160m79j144
2079i27R38J144j321j063J623Q71j757o84J716K35j276j4O73j38k8L15p12m44
2097h49J445N21k041m99K487N10k642m49K598L52k234l33J612L68p92m01j04L75
2115g6J043m19j961M73K630m53l175N19L241m23l052J66K624J2j812l35R29O97
$$ plain form
1990 686 946 -767 -1141 901 1296 -858 -1263 729 1110 -641 -972 289 527 -64 -307 -382 -136 576
2008 576 467 -984 -786 1164 1011 -1212 -999 1258 1068 -1042 -829 919 715 -591 -307 125 126 285
2026 285 162 -650 -412 1017 465 -1244 -613 1317 509 -1372 -466 1155 290 -965 -117 620 -32 -262
2044 -262 270 -197 -367 607 409 -804 -267 1065 175 -1101 -76 1042 -182 -912 398 642 -586
2061 -586 -449 688 66 -730 188 678 -434 -556 607 290 -677 17 600 -305 -464 696 217 -927
2079 -927 11 1155 -166 -1229 394 1265 -492 -1176 540 775 -501 -515 158 20 -8 307 -405 -849
2097 -849 596 1117 -924 -1423 1064 1574 -1068 -1517 1081 1433 -801 -1134 478 846 54 -347 -451 -76
2115 -76 967 548 -1413 -940 1690 1237 -1938 -1419 1822 1399 -1653 -1487 1137 1149 -663 -998 -69 628
2133F28J69j050j145J285K078j476k762J551L152j474l178J204L029r46k529M67
2149i97J750J79r21p04j05J238J001j811j705K072K340k317k545K233K579j928
2165C59k297J471J858q37j214J23N42N01K34j198r64J927J348k308j593K439J728
2182B119k381j646K093J245j558q34R16L43j62K20n64p58J253J097j769j222K053
2199D45J236k159r88J923O90j589j71J013k84m20P88l20j077Q27J344j301j468
2216a511J531J336j527j057J426N84j097J0N14n35J00J146p37j496J163J824j479
2233A95j978J698J879j542j739J362J150p95o22P3l3O72O80j346j342J995J819
2250B126k437k140K536K276k312k271J954J963j191j555L39R83O95k89j689l57
$$ plain form
2133 628 797 -253 -1398 -113 1965 489 -2273 -722 2430 956 -2222 -1018 2011 1065 -1464 -997
2149 -997 753 932 11 -693 -798 440 1441 -370 -2075 -3 2337 20 -2525 -292 2287 359
2165 359 -1938 -467 1391 554 -660 -537 5 506 740 -458 -1422 505 1853 -455 -2048 391 2119
2182 2119 -262 -1908 185 1430 -128 -962 -46 297 135 355 -209 -967 286 1383 -386 -1608 445
2199 445 1681 -478 -1466 457 1147 -442 -613 400 116 -304 484 164 -913 -86 1258 -43 -1511
2216 -1511 20 1356 -171 -1228 198 782 -315 -305 209 -326 -226 920 183 -1313 -150 1674 195
2233 195 -1783 -85 1794 252 -1487 -125 1025 230 -392 -319 -352 320 1000 -346 -1688 307 2126
2250 2126 -311 -2451 85 2361 49 -2222 -268 1695 504 -1051 -712 271 966 677 -1012 -1369
2266a369K513R79l218j368L461J810l535j958L114J962k348j962J371J621q4j332
2282c43j063Q38K169k90l182j62L838P02m152j101M019J404l462j574K636J611
2298A888j429j608J22J439J195j226k394Q74L409o10l986K20M196R4l942m62L356
2315A136P65k425r60J286J151l0j293j194J336K366j409l046J233L495r96l571
2331b156O74L282l88k642J4J735L66p01p06m50J037J422j265k173J338K674j307
2348G54k864J164K731r28k194N92J532k67n71j99k88N21J163p36j899R70K274
2365A755j057k430R75K250q52j805O27J107k74k89j24n82M78J372o45k048P77
2382g65K520r30k652R34K385n98j952K72J284J12l13o32n37R11J512j222k287
$$ plain form
2266 -1369 1144 2123 -1095 -2463 998 2808 -727 -2685 429 2391 43 -1919 -548 1073 989 -343
2282 -343 -1406 -568 1601 1311 -1871 -2033 1805 2507 -1645 -2746 1273 2677 -785 -2359 277 1888
2298 1888 459 -1149 -1027 412 1607 381 -2013 -1139 2270 1660 -2326 -2106 2090 2184 -1758 -2220 1136
2315 1136 1901 -524 -1484 -198 953 923 -370 -1564 -228 2138 729 -2317 -1084 2411 1415 -2156
2331 -2156 -1482 1800 1412 -1230 -1216 519 885 184 -522 -972 65 1487 222 -1951 -613 2061 754
2348 754 -2110 -946 1785 857 -1337 -745 787 520 -51 -250 -538 -17 1146 410 -1489 -519 1755
2365 1755 698 -1732 -757 1493 641 -1164 -537 570 296 7 -117 -699 -221 1151 506 -1542 -765
2382 -765 1755 825 -1827 -893 1492 894 -1058 -786 498 610 297 -335 -872 39 1551 329 -1958
2399a958J336K837j306l116J117K943o73k581J46J958M19j038j011JJ573J054
2415A701j999j962K249K742k208l360K068L418j512l290Q87K797j31j987q17J074
2431c30J643q1k435q90K939J847l298k459L130L086k780l232K025L135j142k677
2447a519P3K064J054j250k069L14K960O55l651j390L783K036l600k535L147K650
2463B722k285k647J281K338j20j825j111J201K202n32l022k15L650Q22l818j317
2479b676L646J642l047j853K273J856j165j672j15J420J146r93k182M69L072l2
2495A789l521l17L461P23l161r79K500J064j581j103N43R92O59r00j588N77K396
2512A554j83k957m9L061L22k821n87K362P30j630p80O45P72L51n45j488N47K074
$$ plain form
2399 -1958 -622 2215 909 -2207 -1090 1853 1180 -1401 -1255 703 1122 84 -927 -926 647 1701
2415 1701 -298 -2260 -11 2731 523 -2837 -769 2649 1137 -2153 -1266 1531 1400 -587 -1404 -330
2431 -330 1313 1232 -1203 -2093 846 2693 -605 -3064 66 3152 372 -2860 -835 2300 1158 -1519
2447 -1519 -1446 618 1672 422 -1647 -1333 1627 2282 -1369 -2759 1024 3060 -540 -3075 72 2722
2463 2722 437 -2210 -929 1409 1289 -536 -1647 -446 1756 1224 -1798 -2013 1637 2459 -1359 -2676
2479 -2676 970 2612 -435 -2288 -15 1841 676 -996 -1111 309 1455 462 -1720 -1251 1821 1789
2495 1789 -1732 -2049 1412 2135 -1026 -2005 495 1559 -22 -1125 -582 410 1069 169 -1419 -842 1554
2512 1554 1371 -1586 -1635 1426 1748 -1073 -1660 702 1432 -198 -978 -333 439 790 245 -1243 -696 1378
2530A378j80k705j5K894L04k745n54K320P50j585q54O07Q78M49p87j475P13K234
2548A627m47k857J37L160J43l046n68K585R29j872j127Q27J355J72j288j335J256
2565c49K331j065l052P39L485k61l635j96L309P28k589j274J734J570n10j917
2581i52o36J968J788j921k740J648L464j245l826O33L798o8l317o31K606J286
2597A855j572j893M41K282Q46k563j928K621K764k274l422J861L645j172l599
2612b108L83L100N08k383j286J371K026l04k641p48K878J715k860k516K619L048
2628B802k152l181J385L088n42k674l28K020J171j107j955K03K547O88k842j505
2644b382K936K008k667k389K041K610j388k415M74K014M60j386j304O88J961R3
$$ plain form
2530 1378 1198 -1507 -1522 1372 1676 -1069 -1623 697 1447 -138 -992 -385 493 942 155 -1320 -607 1627
2548 1627 1180 -1677 -1540 1620 1763 -1283 -1851 734 1663 -209 -1336 -509 846 1018 -270 -1605 -349
2565 -349 1982 917 -2135 -1396 2089 1828 -1807 -2003 1306 2034 -555 -1829 -95 1475 965 -952
2581 -952 -1588 380 2168 247 -2493 -845 2619 1374 -2452 -1819 1979 1911 -1406 -2037 569 1855
2597 1855 283 -1610 -1169 1113 1959 -604 -2532 89 2853 579 -2843 -982 2663 1491 -2108
2612 -2108 -1725 1375 1883 -500 -1786 -415 1611 1307 -1334 -2082 796 2511 -349 -2865 -246 2802
2628 2802 650 -2531 -1146 1942 1400 -1274 -1602 418 1589 482 -1473 -1270 1277 1965 -877 -2382
2644 -2382 554 2562 -105 -2494 -453 2157 769 -1646 -1172 842 1302 -84 -1388 -700 1261 1354
2660A354k428q56K729J416k685j765K244K063j679k034R17J729N9j355r11Q30
2676c72J575j16k189n27K548J045k588j487K307J721j766j792J050J672k31j302
2692d52o14Q39J460l64k068k38K530O99k586j197K480J534k000j753J302J726
2708A298m59j514n38J213J469p36k190R8K771M23l041r39K865J459k486j747J716
2725c38J982q16k001j17J708J197j359j992P49K864l02l182l60L265R67l064j438
2742b237K485J783j652k059O41K084M84j975j535J709K419j232l023N61L467j
2758A919l392o45K970J323k414j730J516K096n09k183o36K121J627j837k535J474
2774h35L073q97l337J94L323M74k857j144K103J700j227k002K16K135Q39k172
$$ plain form
2660 1354 -1074 -1930 799 2215 -470 -2235 9 2072 393 -1641 -724 1005 1064 -291 -1202 -372
2676 -372 1203 1087 -1102 -1629 919 1964 -624 -2111 196 1917 151 -1641 -591 1081 850 -452
2692 -452 -1066 -227 1233 869 -1199 -1437 1093 1792 -794 -1991 489 2023 23 -1730 -428 1298
2708 1298 839 -675 -1213 0 1469 733 -1457 -1359 1412 1835 -1206 -2145 720 2179 -307 -2054 -338
2725 -338 1644 828 -1173 -1290 418 1615 256 -1736 -987 1877 1575 -1607 -1967 1298 2265 -799 -2237
2742 -2237 248 2031 379 -1680 -1039 1045 1529 -446 -1981 -272 2147 915 -2108 -1547 1920 1919
2758 1919 -1473 -2118 852 2175 -239 -1969 -453 1643 1134 -1049 -1685 436 2063 226 -2309 -835
2774 -835 2238 1341 -1996 -1802 1521 1995 -862 -2006 97 1797 570 -1432 -1216 919 1758 -414
2790d14j631J873K461j586k887J046L054m09k923k35K491Q13j780j388Q45J914
2806A244k7k046r60K114J735j924k255J461K655r82k653L98K348L32j930r30J177
2823b43J505l38j875m25J948J257j898j911J689K257j241k450O83K292k9j881
2839f60o53J366J171o31j665j49J946Q53j970j524J877J908j456k236R88K245
2855A410k96k011l26J500J054r63j528K05J945N28k157j150K053J680j781k055
2871a892J240K253o30k098j54J865P95j296j538O82K062j5k287o98K385J316k195
2888b05j848J764K256j181k366N06K095L90j825j137J303J823o79k344k4K566
2904A094P98k613j364K320J832j834k119J165K208l19k156n02J800J375j302k056
$$ plain form
2790 -414 -2045 -172 2289 703 -2184 -1138 1916 1507 -1416 -1651 840 1653 -127 -1515 -670 1244
2806 1244 1217 -829 -1789 325 2060 136 -2119 -658 1997 1015 -1638 -1240 1108 1440 -490 -1420 -243
2823 -243 1262 924 -951 -1376 572 1829 -69 -1980 -291 1966 725 -1725 -1042 1250 1221 -660
2839 -660 -1313 53 1224 593 -1072 -1221 725 1578 -392 -1916 -39 1869 413 -1823 -835 1410
2855 1410 1114 -897 -1223 277 1331 368 -1160 -955 990 1518 -639 -1789 264 1944 163 -1892
2871 -1892 -652 1601 971 -1127 -1281 584 1379 83 -1455 -773 1289 1274 -1013 -1711 674 1990 -205
2888 -205 -2053 -289 1967 786 -1580 -1074 1021 1411 -414 -1551 -248 1575 896 -1448 -1472 1094
2904 1094 1892 -721 -2085 235 2067 233 -1886 -721 1487 1168 -988 -1490 310 1685 383 -1673
2920a673P14K481%k704p10K713J287k366j744J680K088r95k125M5K115P49j722
2937a67j602J275K187p28k527N9K719N71k546j117K158J515j502j854P95J937
2953A173R1j855q80J485J692j172k186O94K406n5k560m63K289J019j896j396J218
2970c96J686m21j852k26J643J116j436j788J097K128n11k349m8K359N57j994j049
2987a484J447J382p59j707R9J721O88j613j333J324J835q89k160L54K251J57k064
3004g51o68J622J144j087j490M42J656K90j632j008J513J559j195j914P48K160
3020A389k47k147l75J863Q94j434j262Q03J587o6j704p04J759J178j445j758J089
3037e80K107o21k154K8K032O24j708j089J176J546n95j832j16J890Q32j866j416
$$ plain form
2920 -1673 -959 1522 1522 -1182 -1892 821 2108 -258 -2002 -322 1766 771 -1354 -1309 806 1555 -167
2937 -167 -1769 -494 1693 965 -1562 -1503 1216 1787 -759 -1876 282 1797 295 -1559 -764 1173
2953 1173 1264 -591 -1471 14 1706 534 -1652 -958 1448 1393 -1167 -1630 659 1678 -218 -1614 -396
2970 -396 1290 869 -983 -1209 434 1550 114 -1674 -577 1551 1040 -1309 -1357 1002 1559 -435 -1484
2987 -1484 -37 1345 586 -1121 -1022 699 1387 -226 -1559 -235 1600 711 -1449 -1095 1156 1313 -751
3004 -751 -1419 203 1347 260 -1230 -788 868 1158 -474 -1482 31 1590 395 -1519 -771 1389
3020 1389 1142 -1005 -1380 483 1377 -57 -1319 -516 1071 1005 -699 -1403 356 1534 89 -1669 -580
3037 -580 1527 906 -1248 -1220 812 1436 -272 -1361 -185 1361 766 -1066 -1182 708 1540 -326 -1742
3054a742J617J772j139k040N57K156L8j975o22J545J234j084j698N37J899K02
3070A257k008q45J950J325j549j792J145J983n12k065o3J845P46j550j297R95
3086d35J695k99k045k37K052Q61j909j383J523J774j045j910M11J908K43j672
3102d68r02J381J382q49j817K81K024K85j982q62J828J235j419j559R15J714k89
3119H98j728l38J517R24j136j451O95J788j47j976l77J922Q72j645j259J251J447
3136A257o44j638R2J598N05j316j165R74J599n58j846K5J969M59j739r94J475
3153E3J290r63j526L90J614J57j445q29J279J309r17j549L56J805J12j851n22
3170a237J596R47j288j250P68J534k03j572m32J447R79j145j447P97J650l35j776
$$ plain form
3054 -1742 -125 1647 508 -1532 -975 1181 1219 -756 -1378 167 1401 317 -1381 -844 1055 1257
3070 1257 -751 -1596 354 1679 130 -1662 -517 1466 954 -1111 -1174 671 1417 -133 -1430 -435
3086 -435 1260 961 -1084 -1321 731 1592 -317 -1700 -177 1597 552 -1358 -947 961 1204 -468
3102 -468 -1370 11 1393 544 -1273 -992 1032 1317 -665 -1527 301 1536 117 -1442 -527 1187 898
3119 898 -830 -1168 349 1273 137 -1314 -619 1169 1022 -954 -1331 591 1463 -182 -1441 -190 1257
3136 1257 613 -1025 -933 665 1170 -146 -1311 -337 1262 704 -1142 -1117 852 1311 -428 -1422 53
3153 53 1343 380 -1146 -756 858 1015 -430 -1259 20 1329 412 -1137 -781 1024 1136 -715 -1237
3170 -1237 359 1306 18 -1232 -464 1070 867 -705 -1137 310 1289 144 -1303 -506 1144 809 -967
3187i67j88J736O32j488j037J117J385n60j567m9J550O95j535j055J124J571p34
3204F30j781K13J870K51j753p46J461J192r79j477L63J645J34j557p92J461J212
3221A347j112j576O94J783k39j750k72J608P68j264j180P61J482j78j665l22J598
3238D83Q11j383j300J029J625n78j715N6J742L62j452r74J193J253o38j553J40
3255h99J652M50j600r17J370J273r44j613N67J662o7j559n09J362R91j053j322
3272a156O04J502j01j529m54J481R17j307j190Q50J445l75j573n6J557N14j266
3289a37r37Q01J381m93j527k6J563N62j509q85J152J246p69j439K59J461K89j415
3307d23p33J152J151p88j380K82J496K11j517o30J335J015j008j355P19J448j77
$$ plain form
3187 -967 -1155 581 1213 -275 -1312 -195 1190 630 -937 -986 564 1259 -276 -1331 -207 1364 630
3204 630 -1151 -938 932 1183 -570 -1316 145 1337 358 -1119 -756 889 1023 -534 -1326 135 1347
3221 1347 235 -1341 -647 1136 897 -853 -1125 483 1251 -13 -1193 -432 1050 872 -793 -1115 483
3238 483 1294 -89 -1389 -360 1265 687 -1028 -972 770 1132 -320 -1294 -101 1152 514 -1039 -899
3255 -899 753 1203 -397 -1314 56 1329 385 -1228 -661 1001 934 -625 -1134 228 1219 166 -1156
3272 -1156 -552 950 849 -680 -1134 347 1264 -43 -1233 -383 1062 687 -886 -942 615 1129 -137
3289 -137 -1074 -273 1108 615 -912 -938 625 1187 -322 -1207 -55 1191 422 -1017 -758 703 992 -423
3307 -423 -1156 -4 1147 359 -1021 -739 757 968 -549 -1179 156 1171 163 -1192 -473 975 798
3324G98j438l87J339Q40j030j231O00J504k77j497j98J423O81j201j087R53J246
3341A038m65j460O5J341M93j185r46R28J270n35j503Q5J598L14j473p15J192J071
3359A113p63j329L24J437J04j372n70J143J052r12j319M66J520m8j555l62J383
3376C12P55j074j087P40J262k42j385j96J409N85j092j093Q45J270m06j480N1
3393h26J434L68j243p45R36J102o25j317J47J362L66j317p67J126J102p62j371
3410a030L58J425J07j370n33J231Q71q66j081L87J320L6j372m21J195Q31j003
3427H5j114O33J327k80j349j04J247N17j066r73Q53J078l18j336r1J365M38j109
3445a97q60R22J116n21j347K24J272L32j258o47R47R85n49j318L18J255K48j384
$$ plain form
3324 798 -640 -1027 312 1152 122 -1109 -509 995 718 -779 -977 446 1127 -74 -1161 -208 1038
3341 1038 573 -887 -822 519 1012 -173 -1119 -191 1079 544 -959 -874 724 1038 -435 -1150 42 1113
3359 1113 350 -979 -655 782 886 -486 -1056 87 1139 227 -1092 -626 894 846 -709 -1071 312
3376 312 1067 -7 -1094 -354 908 666 -719 -915 494 1079 -13 -1106 -261 1009 603 -877 -826
3393 -826 608 976 -267 -1012 -76 1026 401 -916 -769 593 959 -358 -1125 1 1103 341 -1030
3410 -1030 -672 753 860 -510 -1043 188 1059 193 -888 -501 819 855 -517 -938 257 1088 85
3427 85 -1029 -396 931 651 -698 -802 445 962 -104 -1077 -224 854 536 -800 -891 474 912 -197
3445 -197 -1057 -135 981 460 -887 -663 609 941 -317 -964 -17 968 419 -899 -581 674 922 -462
3463d62n02J059R25p78j187M54J269j4j300l96J117Q75r12j139N79J241j23j314
3481f08k58J264N95j032r29P00J144l55j233m6J256L46j005p78P57J089m80j217
3499g90O1J278L23j149o97R56R82o53j189K84J219J43j167n35J049Q63p39j125
3517h86L43J252L3j231m04J091P25r06r49N51J206j74j303j61J108O18r92q78
3535i57O66J121k61j274j1J229L59j071p55Q36J005m65j125P0J163L09j052p16
3553i29Q83J002o28j087J34J211J43j124n24R82R02q03j082L89J176M5j166m08
3571h84J053P84q43r94N02J145r3j247k36J150N85r40q60O23J037k17j217j00
3589g52J140M70r44p76P00J008m04j138J5J162L48j066o52Q48R50n61j096J55
$$ plain form
3463 -462 -964 95 1020 242 -945 -491 778 764 -536 -932 185 1060 148 -991 -412 829 706 -608
3481 -608 -866 398 993 -39 -968 -268 876 521 -712 -758 498 844 -161 -939 -182 907 427 -790
3499 -790 -729 549 872 -277 -974 -18 964 311 -878 -594 625 768 -399 -934 115 978 239 -886
3517 -886 -543 709 742 -489 -893 198 923 17 -932 -381 825 651 -652 -813 295 913 -79 -957
3535 -957 -291 830 569 -705 -716 513 872 -199 -954 -118 887 422 -703 -633 530 839 -213 -929
3553 -929 -46 956 328 -759 -625 586 729 -395 -919 63 965 162 -920 -531 645 690 -476 -884
3571 -884 169 953 110 -884 -382 763 670 -577 -813 337 922 -18 -878 -255 782 565 -652 -752
3589 -752 388 858 -86 -862 -162 846 442 -696 -681 481 829 -237 -889 -41 909 348 -748 -593
3607e93J142K01j087n69R50Q54o35j091L67J064Q2j111m54J036P21p00r98L32
3625d89J169p8j124k95J044O81q65r11N32J102k12j128j38J092N17r81p87O57
3643b14J040m02j099oJ187K78j015o52P79R52m80j147K15J140J23r70n86Q71Q13
3662H27o13j018K93J109J09j112m16R67O91o36r68L59J061k3j108l01J056N60
3680H37q06q92N44J039j30j217j07J026N21q83p62O45R23l05j048j3J027L80r94
3699b15o06P41Q55m15r98N3J078K04r71n32P63P90m91r18J61J068J15j039l98
3718g55Q33O85o13r37L63J035j3r96l09Q86O41p24q68N24R36j60j023k08R15N65
3738G77q20p53N68R00j89j054j11J071L61q55o62O56Q43m02q97M0J017K27r19
$$ plain form
3607 -593 549 750 -337 -906 44 898 263 -828 -461 603 685 -426 -880 156 877 177 -821 -489
3625 -489 680 602 -522 -817 227 908 43 -868 -336 766 554 -574 -712 380 897 -84 -871 -214
3643 -214 826 424 -675 -681 506 784 -231 -883 -104 848 368 -779 -564 576 699 -271 -857 14 827
3662 827 214 -804 -511 598 707 -405 -821 146 837 201 -767 -408 653 630 -478 -779 277 837
3680 837 31 -861 -317 722 592 -625 -732 294 815 -68 -830 -185 738 433 -615 -628 399 779 -215
3699 -215 -821 -80 775 360 -638 -585 493 697 -274 -806 -43 747 256 -662 -501 567 682 -357 -755
3718 -755 78 763 150 -787 -424 611 598 -398 -707 179 820 96 -772 -248 688 528 -495 -703 212 777
3738 777 -43 -796 -228 672 483 -571 -682 389 750 -105 -767 -111 732 330 -567 -527 490 717 -202
3757b02n41P12Q18n09r35J99J006J51j029m26Q37O82n75q86K26J055K5j035k84
3776g11Q73O00o69q47M32R80j73j016j35R40M84p84p10N59Q94k25j021n4R38L97
3796G52r32n77O23Q84l87r51J8R74K56q47n15O62P58m27r32J28J028J00r65m05
3816g55P98O75n81q16L21R02K9r31l10Q14N68o31q39M62R20j27j000j41R06M97
3836G61p84p05N35R21l08r39q2R23L91q76o28O83Q12l39r33R7Q98J97q35m60P08
3857C7O52m69q32K34Q26J23q15m30P02O91n57q06K68R01k0q62l27Q33N32o13p75
3878g07L99Q68p0q81j40P42M96o84o89M47Q32j93q71n6Q01L46p07n54M88P65k77
3899C55q40m5Q83K73p85n66O38P43m09q27N7R53J20q28l76O76O36m55p80J83Q81
$$ plain form
3757 -202 -743 -31 787 278 -657 -458 548 699 -330 -756 81 763 188 -698 -472 583 608 -427 -711
3776 -711 162 762 93 -754 -322 658 485 -531 -666 274 758 -26 -736 -177 717 492 -529 -583 355 752
3796 752 -180 -757 -134 750 363 -588 -570 404 660 -187 -702 -40 718 291 -641 -513 515 615 -350 -755
3816 -755 43 718 137 -679 -358 544 573 -358 -668 146 714 83 -756 -294 626 499 -501 -642 264 761
3836 761 -23 -728 -193 728 420 -519 -601 322 713 -163 -791 -108 704 365 -568 -471 427 624 -211 -671 37
3857 37 689 220 -612 -378 448 571 -244 -674 28 719 162 -644 -376 525 505 -357 -684 149 681 68 -707
3878 -707 -308 560 490 -391 -531 211 707 23 -666 -219 613 420 -451 -507 294 640 -67 -621 -133 632 355
3899 355 -485 -530 353 626 -159 -725 -87 656 247 -580 -523 430 550 -278 -654 22 658 203 -577 -394 487
3920D87P2q64l48P80N26m93q59L72Q58n1q63k43Q00N03o70p16M87Q17j31r02j61
3941e99Q25M30p61n23M67P85k95r21J28Q05K91p32n20N26P03l43q23J14Q66J56
3961E79q21m34O85O43m55q14K64P88O2q09k78O71N42n07p46L08Q56p3p97k40Q11
3982B35M25o87o03M38P61j89p88j13P54L82o44o89N90O67k40p89j5Q10K58p76
4002b13m59N85O39k89p81J24P57K42p83l43N19N45l35p11J13P83J27q27k46N79
4022B6N33m72o24K26P55l5o96k36N89M91n22o38L64P48q6q17r8O72L94n80n34
4043e40M17O42k01p74n2O84L36n93n03M76O89k82p49L3P43J71o40m38N29O06l56
4064A98o45O6P11J51o75l38N70N32m36p19K95O60K0o75k61O14N24m76o18K21P30
$$ plain form
3920 487 559 -305 -653 127 653 160 -699 -327 531 480 -383 -626 174 677 7 -709 -222 595 464 -438 -599
3941 -599 226 656 -105 -628 -161 624 329 -592 -464 341 632 -100 -620 -94 609 266 -557 -443 423 579
3961 579 -242 -676 9 652 197 -617 -353 435 497 -312 -590 81 623 116 -630 -322 534 461 -336 -576 235
3982 235 660 -27 -630 -192 569 380 -408 -521 233 615 -29 -718 -128 539 299 -490 -505 305 563 -213
4002 -213 -672 -87 552 263 -518 -394 363 605 -178 -521 -2 543 208 -503 -390 393 520 -307 -553 26
4022 26 559 87 -537 -311 444 409 -287 -523 66 557 35 -603 -239 509 423 -394 -492 180 574 -6 -540
4043 -540 -123 519 318 -456 -508 176 512 -81 -584 -108 581 299 -450 -417 326 497 -143 -581 -52 554 198
4064 198 -447 -381 330 481 -194 -532 38 570 134 -585 -290 370 390 -285 -546 68 592 116 -502 -281 449
4085D49m5p36k71P46M51n52n99L69O94j69p22j00P29K61n95m54M13O44k09p01
4105c97m0P46K49o55m09M30O41l70o81J27O69J36o30l34N01N42l73o53J91O29
4125C19R9o99k19N69M89m73n71K42O67o1o89j86P11K91m51n52L08O77j84o21j42
4146d76O81L07o16m86N12N53j96o85k5O95K17o49l67M74N03k38o26L3O41J77o00
4167a71l33M86M59k70o01J60O33Nn72k41M92M57m06n00J88O23l0o47k00O13L45
4188D90m48m67K51N65m5p21o3N89K79m79m07K81N72p4o40o3N79K49n37m10L64
4209a35N19j49n76KN82J43m87l49M45M50k76n35P9N61J44o09k59M66L76k56m91
4230c55J04N78Pn57j85N12L57l84m75J68N97q3n45j62N91K28l95m67L37M91j07
$$ plain form
4085 449 404 -332 -603 143 594 42 -557 -188 506 337 -385 -485 244 505 -90 -544 -131 513 304 -397
4105 -397 -437 309 558 -97 -506 -76 565 195 -486 -359 310 446 -184 -518 -17 525 152 -501 -310 319
4125 319 418 -281 -500 69 558 85 -486 -244 423 362 -327 -513 198 489 38 -514 -206 471 287 -334 -476
4146 -476 205 512 -104 -590 -78 475 279 -406 -431 264 481 -168 -535 -61 442 204 -422 -389 252 429 -171
4167 -171 -504 -18 441 171 -430 -270 363 368 -204 -445 47 504 98 -402 -214 409 379 -268 -468 145 490
4188 490 42 -425 -174 391 346 -375 -438 151 430 -49 -456 -175 397 323 -317 -380 199 448 -89 -499 -135
4209 -135 384 235 -341 -339 243 386 -101 -450 -5 445 169 -366 -287 274 418 -191 -450 16 392 136 -355
4230 -355 -251 327 334 -223 -408 104 461 77 -398 -230 367 284 -261 -423 168 396 1 -466 -129 362 255
4251B55n62n3N43K91n17m26L72N05j29o25j2N97J52n05l11L96M62k32n82J24N05
4272B48J02n53k24M33L84k78n52J99N96J6n46j74M01L25l76l91J69N22n1m90j27
4293c67M62L37m13m51L11M96j69n39KM93K46m08l82K60M26p5m85n1N27J41m84
4314a23k40L14M12j90n17J15N01M4m79j71L45L33k25m32Q7M50O1m92j14L90K63
4335C32k70m32K16M68l3n13q8L88K80l25l58J57N12j2n42p4M34K37l75l05K27
4356g6M22j28m78m1N27J36l99l31K57M04j11m38n5N13J71n41k13L88K41j19m44
4377c15J12M39J6l82k19L42L33k19l94N2N25K5m53j59L86K85k94m23K06M10l4
4398B39m60l0L72K15l18l38K16M03o9n08K4L90K21m35j74K10L45j13m73L9L60
$$ plain form
4251 255 -307 -360 183 474 -43 -469 -97 408 279 -346 -358 239 391 -114 -425 -29 433 201 -381 -257 248
4272 248 350 -203 -427 6 390 112 -440 -241 355 371 -175 -349 52 377 1 -390 -221 301 250 -240 -367
4293 -367 95 432 19 -432 -121 375 206 -333 -331 162 408 0 -382 -122 304 229 -256 -307 220 361 -123
4314 -123 -363 -49 363 173 -344 -229 272 316 -163 -334 11 344 119 -313 -226 224 285 -207 -321 69 332
4335 332 62 -370 -154 314 281 -232 -320 68 348 23 -335 -178 334 322 -220 -294 140 377 2 -303 -76
4356 -76 346 218 -260 -301 226 362 -37 -368 -111 293 182 -256 -311 202 373 -168 -381 7 248 129 -315
4377 -315 -203 236 252 -130 -349 -7 326 107 -287 -235 290 315 -138 -297 89 374 80 -343 -137 273 239
4398 239 -221 -251 121 336 18 -320 -104 299 230 -278 -254 136 357 -78 -252 -42 303 190 -283 -244 116
4419A16J64l52k53L17L13j18m49M8M39N2m22k02L76L18k39m55J71M00J2l87j33
4440b84L25L01k73l63J99L08M6m23r6M34J45l36k86K18L38n6l92m4L58J51l29
4461e9l24L27L75j83m38K7M27J28l59j93K55L02j87l57J10L65P2m00j93L07K79
4482B81j78l33Q2L72j0l33j27L25K18k53k45R5L37l3l51o2K90J93k63l01J95L20
4504B19l5l43p3K72K65l11k56K34K16m7k90m3L12J44l11k29K38L66j43l96L8L51
4526A78M2k57k54K89K55k20k18jL63P9l29j63K46K49k15k90J09L00J3k80j06K61
4548E1J89k34k90K05K38K0k82j76L74J46k59k42J75L27j31k95J7K71J60k88k19
4569b43J94K40m5l66P5L25K0k64j58K16K87k06l05Q3L12K3k82j11K04K43j62l03
$$ plain form
4419 116 280 -72 -325 -8 305 187 -262 -214 225 277 -145 -347 29 347 108 -347 -176 224 236 -151 -284
4440 -284 41 342 69 -294 -95 213 259 -164 -260 174 319 -17 -303 -85 253 197 -195 -239 119 270 -59
4461 -59 -383 -56 319 136 -302 -275 152 280 -79 -272 -17 285 98 -259 -149 216 288 -112 -305 2 281
4482 281 103 -230 -148 224 214 -119 -246 79 297 44 -201 -106 231 198 -153 -215 75 268 5 -296 -101 219
4504 219 184 -159 -232 40 305 -6 -262 -28 188 141 -149 -192 120 264 -47 -276 -38 328 185 -211 -173 178
4526 178 220 -37 -291 -2 253 33 -185 -186 177 256 -73 -236 10 259 44 -246 -137 163 176 -104 -210 51
4548 51 240 6 -284 -79 159 179 -103 -279 95 241 -18 -260 -85 242 111 -184 -167 104 264 -24 -243
4569 -243 -49 191 146 -220 -145 180 200 -64 -222 -6 281 75 -230 -147 165 188 -94 -205 -1 242 80 -223
4591b23R6L04rk92j29K49K23k51k33K07K11j8k68LK37J22k81j96K30K52r2k68
4613a26j6L44j9k42j45J88J92j55j83lL16nk12j70K48J45l1l21M8K47K2k63m2
4636a83J98J61j55k14R4K24l5k07n1K21J69k29j83J49K42q3k56j4K65O5j69j48
4658a39Q6J97l1k27K6J53J06j33k07J09K54r8k52rK82J1k08m5J00K05j14k33N6
4681a11K09O2k54n6J71J91r0l06J29J91pk04m8J65J56j03k50Q6J74Mj73j01K50
4704H5M3j43j64J18K29q9j77j9K06Q3k15j28J22J81m5k67N7K11Q6k28j22J61K00
4727A85j70k14J03K25Mj88mJ38J37j59j82M8K01j4j64j29K54J08k07j48J67J66
4749A57j09j42n0J69J15j14j58P4J85qk40m3K52O7k17r0J39J77p3k61N4K16M3
$$ plain form
4591 -223 -127 177 168 -124 -253 -4 219 -32 -265 -58 153 135 -133 -130 107 229 -52 -248 -18 234 142 -126
4613 -126 -142 202 183 -59 -204 -16 176 21 -162 -165 151 146 -66 -236 12 157 126 -195 -147 100 122 -141 -183
4636 -183 15 176 21 -193 -99 125 90 -117 -168 53 222 -7 -190 -41 201 118 -138 -152 113 178 9 -139
4658 -139 -53 144 113 -114 -88 65 171 38 -169 -60 194 96 -156 -165 117 128 -80 -125 -25 180 66 -167 -111
4681 -111 98 160 -94 -150 21 212 122 -184 -55 136 129 -75 -123 42 198 95 -155 -69 105 109 -64 -165 85
4704 85 128 -15 -179 -61 168 79 -98 -117 89 172 -43 -171 -49 132 87 -180 -123 88 174 -54 -176 -15 185
4727 185 15 -199 -96 129 133 -55 -59 79 216 57 -125 -77 124 110 -54 -183 71 179 -28 -176 -9 157
4749 157 48 -94 -144 25 140 26 -132 -58 127 119 -121 -164 88 155 -62 -152 -13 164 91 -170 -116 100 143
4772A43j48j03J32J26j13j80O7K36m3j27j30J52J24j29j09L9J43N7j93q6J53Q8
4794I9j33j14J21J67m3j70o1K09K0j44q0R2J47r1q1m2K25j4p7j61R2J45l3j93
4818a20K2J73Q4j98m9J48O8n6j37J7J33L5j48j07J59J02j27j32N0J38K4j64l5
4841a20J22J31j22j26L0J52P1k76J3J27J08o9j89J26J70n4j45k8J19L7r1j34J41
4864gJ34m7k24R8J07J3j15r4J66J14j10j34L7J56k8j34m4J30J09j19o5J9Q5Q1
4888A28k58rJ24J48j79q8R3J50m7j71J3J44M7j33n4N4J33kj66L6J03L1j51r7J51
4913@J53j32j50P8J17k1j33m9J28J10n8j76O9J19j1r0JQ1O0j09o8O8P8nj44nJ30
4940D1K9q4k0L6Q3j4j76QJ44P3j17r8R4J11o4r5L9P3L4j25o9Q6O7l1j13J2J30
$$ plain form
4772 143 -5 -108 24 150 37 -143 -76 160 117 -10 -140 12 136 7 -102 -63 80 137 -56 -142 11 99
4794 99 -34 -148 -27 140 97 -73 -134 75 95 -49 -129 -37 110 19 -62 -104 121 107 30 -131 -39 106 73 -120
4818 -120 -98 75 159 -39 -88 60 128 72 -65 -48 85 120 -28 -135 24 126 -1 -133 -83 55 79 -85 -120
4841 -120 2 133 11 -115 -85 67 138 -138 -125 2 110 41 -148 -22 148 94 -51 -79 40 77 -14 -148 -7
4864 -7 127 80 -144 -46 61 74 -41 -135 31 145 35 -99 -62 94 66 -68 -112 18 127 8 -57 -38 47 128
4888 128 -130 -139 -15 133 -46 -134 -41 109 62 -109 -96 48 95 -38 -92 -38 95 93 -73 -37 66 97 -54 -151 0
4913 0 153 21 -129 -51 66 45 -88 -137 -9 101 43 -133 -64 55 44 -46 -45 36 96 -13 -81 -13 65 60 -84 -89 41
4940 41 70 -14 -34 2 85 71 -105 -97 47 120 3 -95 -1 110 46 -49 -10 63 97 -28 -97 -11 56 25 -88 -76 54
4967E4l9j01O7j4Q1n2q7N9P7On7q9J14J05q0j52P3J09rj24mQ1N8j07l8M7R1m2
4995B7r5JO8J03l1j79N7J58l8j12r4J84J6q5m9O1R4k3l0j01J6J59j44q0J02J32
5021A17j10n1l9J12R1j77k9Q0M6m1k2LJ39l4j51k3J63K9j37p1R0R7nj77R3Q0M
5048G7r0j07Q9R1j04m8N3J10K0j14r7J11R3n2j33N5J04j9p8oO3P0j17Mk7J37K9
5075A14j50p2J89K8j36o0P6J08q2p0j3R8jn0k3K8O3L6j55L0J10k9r1l2J25K3m8
5102A6m5rQ6k7k6l7L2J7Nr6N7J01n4m1o3J41No7lK2N2n1j3k0K3J0l8p5R3O9j8
5133D6n5q0J18J0o9k4L4Q3p7rm3N9M3j9m8QM0Qm0p1J54m7Kj06R9O2p2n2L5O8K3
5164H0j08jj1J02l7o6KQ9O6j46k0P3P1r7r0N5Q9M4j79qJ42J5m1j10M3R0L4j67
$$ plain form
4967 54 15 -86 -19 -33 48 -4 -91 -32 45 51 -6 -95 19 124 44 -108 -35 74 65 -59 -63 18 76 -31 -69 -22 69 27
4995 27 -68 -67 1 104 73 -106 -49 109 71 -41 -135 49 65 -20 -69 -8 86 63 33 -68 -52 107 -37 -117 -15 117
5021 117 7 -44 -83 29 120 -57 -86 -6 40 -1 -23 -20 119 85 -66 -89 74 103 -34 -105 -15 82 77 -100 -7 73 77
5048 77 -13 -120 -31 60 -44 -92 -39 71 91 -23 -120 -9 84 32 -101 -46 58 39 -39 -45 18 88 -29 -25 -52 85 114
5075 114 -36 -108 81 109 -27 -87 -11 97 15 -55 -68 30 29 -21 -44 -16 47 83 -72 -42 68 39 -52 -84 41 64 16
5102 16 -29 -38 48 21 -5 -42 -10 7 12 -84 -27 74 20 -21 -84 57 62 -5 -8 14 66 15 2 -18 5 15 -23 -98 -5 64 46
5133 46 -9 -89 29 39 -30 -54 -20 63 -14 -23 -66 -7 36 17 -31 -23 17 25 -15 -86 68 21 23 -83 16 78 6 -46 -11 57 80
5164 80 -28 -29 -40 62 25 -41 -39 50 116 -30 -50 23 94 -3 -93 -38 51 95 -84 -92 50 65 24 -86 -43 47 81 -86
5192h6N0P7Mj09n2J18J0l4l5k1J69j8j45N0QJ07p6r7N8Q1J0j13j9J65j0j04l9
5219e1MJ57j6j51J3RQ9l1j38P4J06J3j47K0J12o5m2rQQ7l1r2N0J58k8q5j13J22
5247B3K2m3n3P4M9o2l4K7M4j7n5l7M1P2j0p4k8J06jp8p0P6M8k9l0pJ11rr0j7R3
5278D2KKk6p2P8K9p8QM9L6m9m4P0Qn9n4M8k6L8O8j24J7N1Nm9JO6l8l1qM3P0r0
5311a7K6p8J02rj2n8K2R3m1o4l4J14lo1k6P6NMk5k6Q0Qp9q4Q3P4j8j24M3Q8L8
5342I7j39k8Q4K0k3n5M0L7K7q9k3J8R3J3j64O7J27n0j24lP7K0m2k0L0N3pm2k1
5371b7L4L7n7j01J16Q4l9j05lJ62n4n7p8J28J7n7m1L2N4k9o6l6J33L5j18l5J06
5398C5M9n9q9M9O9J3j03JP6J3j3p5m0J02J9n5p7J04P5j48j9Q0M2p5n4J2O6O0n8
$$ plain form
5192 -86 -36 41 45 -64 -116 2 12 -22 -57 -78 91 73 -72 -22 -14 93 17 -80 -22 59 69 -44 -63 102 92 -12 -51
5219 -51 -47 110 94 -57 -44 -35 54 23 -115 -41 65 78 -69 -49 63 -2 -44 -53 -45 42 11 -81 -31 127 99 14 -99 23
5247 23 45 2 -51 23 72 10 -24 3 47 30 -25 -62 -21 51 41 -33 -61 45 44 -34 -104 -28 20 -9 -39 -46 65 56 -34 -51 42
5278 42 44 46 20 -52 26 55 -23 -15 34 70 21 -23 47 55 -4 -58 -10 -36 2 70 -54 -37 14 19 -30 -29 37 -1 -32 -40 3 73 -17
5311 -17 9 -69 33 24 12 -46 -24 69 28 -36 -70 44 41 -20 -46 30 35 39 14 -12 68 76 -3 -87 -4 70 52 -72 -29 59 97
5342 97 -42 -70 14 34 11 -44 -4 33 60 -29 -52 -34 59 72 -92 -25 102 52 -72 -75 2 22 -20 -40 -10 43 36 -6 -27
5371 -27 7 44 -13 -114 2 86 47 -58 -61 101 47 -10 -88 40 57 0 -41 -9 45 16 -50 -86 47 82 -36 -71 35
5398 35 84 25 -64 -15 54 67 -36 -35 41 54 41 -34 -74 28 47 -8 -85 19 94 -54 -73 7 49 -26 -80 -68 -2 58 0
5427@k1rP5j8p5J3P9J3o0k6J3M5k7Rj02J13l8M1j6mK0j5m4LO2Qn2m4J02j4om6
5459b1J5oM9K8j01j1N1L3q4k0P4Q0q8j02Q9P0n9Qn6J06n4rm1N7j1N5j00m1J45
5488E6j4p9k3R4L7j07k7M8L9l5j5L4k2R5l2q8L0O0J4j25m5J61j5q3j8P0M4o1n5
5517f2K8K9N9o6m1P1Q7j40l9L1O1Qp4o6J77k9k3p8L3R0k3r6n7J74pnp9k0J47r
5547H1j37L6J05J3j66J8L3O8k8j16J02M4L1j38K1L4R5j01j19R0J13n3n7KO3Mp6
5574c8J1j9R1m8oj5Q1J9r7o0Q5J3J3j16R0Q2r1l5Q6l7K4m6p6L9O3L5q0l0N5N7
5604E0j9p6J5O7n4m5P0rj6J0o0M8J8L9n0k0N1jL9o5N2Mj03P8j2Mj5O8l8j1J3r
5636B3o4m6M5J10o2r4L9N8J8m6K0O1m7L1n6j0M9P7j20j12J52K1j14j4J01J1j9
$$ plain form
5427 0 -21 -30 45 27 -48 -35 44 57 -3 -29 -16 29 2 11 -91 22 -16 25 9 5 25 10 -34 -31 31 39 -13 -57 45 31 25 -21
5459 -21 -6 -12 37 65 -36 -47 4 37 -47 -67 7 87 -1 -103 -14 56 -3 5 -51 55 1 -8 -49 8 -3 52 -48 -89 56
5488 56 42 -37 -60 34 71 -36 -63 -15 24 -11 -26 8 -14 81 49 -39 -9 51 65 -60 -105 56 41 -42 -60 10 54 -7 -62
5517 -62 -34 -5 54 -12 -53 18 105 -35 -74 -43 18 26 -48 -114 63 34 11 -67 -34 56 33 -63 -120 54 47 42 -37 -57 90 81
5547 81 -56 -20 85 98 -68 -50 -17 51 23 -93 9 53 84 -54 -33 1 96 -5 -124 -34 79 26 -31 -29 34 38 -38
5574 -38 -27 -46 45 -3 -9 -24 57 76 -21 -81 4 17 30 -86 4 86 -5 -40 46 9 33 -13 -89 -50 13 48 -32 -62 -7 50
5604 50 31 -45 -30 37 -17 -62 8 -1 -17 -7 -67 -19 -1 38 -12 -32 19 18 57 -8 44 48 -55 23 11 15 0 68 30 19 32 23
5636 23 -41 -87 -42 68 6 -88 -49 9 27 -19 1 62 15 46 -10 -20 29 106 -14 -126 26 47 -67 -81 20 31 12
5663A2j3l2O3M9l7o3l1J30k6j00p2J86M6j44n2Q9O4p6j05P9P1j3q7pL7Q5j3j33
5691i3O0J55r3p6l4J89q0n9p0J82L6j53k4N3M7J5r8%J9Q3O4k01L1J39l0j33K1
5718e0J43n6q7QM0L0l1n8l1N3J8j9k8J40m1qj30J06Q9m6j19O9Q2o7l3k2J7N7l8
5747a2M3m0K7L3r0o1J54Q2j88RO7J2n0J8OL7p6N6ll1OpJ6m7oO3k3p3O4N8o9J1
5779a4L0k5l4J25n1n3l0J42p4m1QK5k6m2O2MQ1n2j2o0N0N7l3q5L0P3l0j37J09
5808cN3l5p0j2O4rpJ5j01J28J1m3r0J58Pm8j50J28R5r7q7M8J71j19o5J0N4P6p3
5837Iq6J6J11M5j49m8J55M6r0q8Q6P3j17ojP9j7m5j3J9K5J5j37L5J06L3j63N8
5865d9J22K0j10j7M2J29j48l2LP3J5j13L7J0R3q1r0P1J14n7j35K4J28kr2k2Q2
$$ plain form
5663 12 -1 -33 30 79 42 -21 -52 78 52 -48 -120 66 112 -32 -84 5 69 -7 -112 -33 38 25 -62 -69 -32 53 40 -93
5691 -93 -33 122 29 -47 -81 108 28 -31 -101 81 117 -36 -60 -7 40 55 -43 -43 -24 59 123 -78 -47 92 62 -71 -50
5718 -50 93 37 -50 -42 -2 28 -3 -61 -92 -39 -21 -40 -68 72 31 23 -107 -1 88 42 -77 -8 74 7 -26 -48 -31 26 -12
5747 -12 31 -9 18 51 -39 -100 54 136 -52 -43 24 36 -14 4 10 47 -29 27 24 -7 -1 -8 8 -39 -45 18 -5 -78 -14 44 -25 -14
5779 -14 16 -9 -43 82 31 -22 -52 90 16 -25 -17 8 -18 -60 2 6 87 35 23 -37 13 70 37 -48 -18 55 25 -112 -3
5808 -3 50 15 -55 -67 -3 -12 -19 -4 -105 23 34 -9 -99 59 66 18 -132 -4 91 -6 -93 -45 126 7 -58 -48 6 82 9
5837 9 -77 -61 50 95 -54 -102 53 99 9 -79 7 80 -37 -43 -44 35 18 -27 -40 -21 4 19 -118 -83 23 56 -107 -49
5865 -49 73 93 -17 -34 8 137 -11 -43 -40 33 48 -65 -28 -18 75 -6 -96 -25 89 32 -103 -79 49 47 -45 -67 15
5892A5L0%r7L7N1R1j32p0P6N3p9l8L0J23p1m1oM4J3r6P9n5K9k0P1n5N2om1j4j3
5923d0N2q7K3Q6k5k5l1L9J2j8M7Om7m6L5j9K2rO1o7j8O7l6o3L0O7p8K8Q9l5n2
5954c2j2N9M5q7OO1k8j5qoK6K2p1l6J01N7k6j46K8J83r1j16R1K5K2j15J3O1k4
5983a3K4l1%L3R5j84o7J25J03r6j48J38J74p8j83P4J02l8q9mj9J81M1j70k4R5
6009D1K3j27j43J96J30j97q3K15R9j68kk1N0j7k1M0j6L8M1k07L3J83J5k23N6J75
6035A10l1j72J2J53J5l7j10Q1J1K7j11k7L2J54r8j31J15J61n5k04Q5J20k4j74
6059i8L8J42j8q1pRN4J7j02l7R2N7nj49J20J6o5q9P5Q9q4n3Q0P3r2O3k4m3n0Q4
6089A2kn9M5M9n5m9J43q1n0M4L0K3j11N5L4l7k6Q5l1M3l1np4N7N1o8q7J14L5j00
$$ plain form
5892 15 45 45 -52 -15 36 127 -5 -75 1 54 -25 -63 -33 90 19 -22 -28 16 29 -67 12 -43 -14 -34 37 -18 34 28 -13 -27 -40
5923 -40 12 -75 -52 34 9 -16 -47 -8 4 -14 33 39 -8 -54 -19 -38 -16 -25 36 -31 -49 18 -18 -81 -51 16 -62 -34 55 20 -32
5954 -32 -44 15 60 -27 -21 40 12 -3 -11 -17 9 31 -40 -76 25 82 56 -90 -62 121 30 -86 5 30 52 -63 -50 11 -13
5983 -13 11 -20 -20 13 108 -76 -143 -18 85 -11 -159 -21 153 75 -108 -34 68 30 -59 -63 -82 99 140 -30 -54 41
6009 41 64 -63 -206 -10 120 -77 -160 55 154 -14 -16 -37 13 -4 -25 15 -1 37 78 -129 -96 87 102 -121 -65 110
6035 110 79 -93 -81 72 87 50 -60 21 32 59 -52 -79 -47 107 9 -122 -7 154 99 -105 -20 100 76 -98
6059 -98 -60 82 64 -17 -24 -15 39 56 -46 -83 9 66 61 -88 32 48 -17 -106 -31 58 -26 -79 1 74 -18 45 21 -22 -72 12
6089 12 10 -49 -4 45 -10 -59 84 3 -47 -3 27 50 -61 -6 28 -9 -35 50 19 62 31 26 -48 9 60 -8 -95 19 54 -46
6119d6o3J32Mk2j08J64J1j46K1Q2m8N2o3K9j1K5Rm5k5J31J5k28M8J53Kj74J0J33
6147D2M3j37j3K8O7j0m6n1P1R9p9j69J50J77j60j66R3J90r2j43R8R1K3j53l5O1
6173b1N4N5q7m5J26J9j52o3J94P4j97o2J40R6j52o6P0jO9n0j27J41O7Qj27p6K04
6200I1L6k11J2J30Q6k44L2R1L4p4j1lO7K5n9l2K0R6r2r3J04O4Pj22m0J79oj72
6228h5O2P4kl3j2Pk2P9p6klN3j7j10M6J63j66l7Q0N3r8PJ02m8o2P4J1q7K1M8l2
6259a2j9J23o8ko2O9K6j25J03Q1r8j11Q2Q2l9o7P9l7j2l2J4M2j7Qrm2Q2K9j30
6288f2l3J40L9j28o0J40P6j55o5J42O2o4m1PlK8L1j62K2K38l3k47Q6J35O5k57
6314i9J3J27R9j62r6R9L1Jk3j06O1J38o2j52K7K25p3k18J25J56Jj78N6J05j4j26
$$ plain form
6119 -46 -109 23 27 5 -103 61 72 -74 -53 29 -19 33 -30 -1 -12 13 22 -23 -48 83 98 -130 -82 71 73 -101 -91 42
6147 42 85 -52 -65 -37 30 20 -26 -77 -6 93 14 -155 -5 172 12 -154 -61 129 37 -106 -8 83 106 -47 -82 -21
6173 -21 33 88 1 -44 82 101 -51 -114 80 154 -43 -105 35 131 -21 -87 -17 -18 51 1 -126 15 82 90 -37 -113 91
6200 91 127 -84 -72 58 144 -100 -68 23 57 -17 -28 -31 36 61 2 -30 -10 86 -6 -99 5 69 76 -46 -86 93 87 -85
6228 -85 -23 51 49 16 4 11 -11 68 -8 -10 -13 40 23 -87 -41 122 -44 -81 -1 52 -46 -39 63 15 -47 27 38 -49 -28 20 -12
6259 -12 -31 92 24 22 -40 29 55 -70 33 114 16 -95 -13 69 30 -37 42 5 -7 -39 -25 17 0 8 -1 -43 39 68 -62
6288 -62 -95 45 84 -44 -104 36 112 -43 -108 34 96 32 -9 -2 -5 23 54 -108 -86 152 119 -128 -42 93 158 -99
6314 -99 -86 41 140 -22 -118 -19 12 13 -10 -116 -55 83 21 -131 -104 121 48 -170 -45 111 112 -66 -10 95 81 -45
6340d5l1j0J48M0j25p4J38J29j93r3J44J52k19j52J74J68j36r8P7M9K9l5p3K3
6364a3P5P1k15n5K05L6j75r0J80R3j79o1J54J0l9n1N1M3Mo6l5N2J14p9p7K9J75
6391A57p8j59K9J68p2j26O3Q6n3J7m2J1l9P5p7n2M8R9q8j7M3Q5j46m5J23O2o9
6418Cn5O9N4j07kP9m6M4m7N4m4J5j2j4o6J32q1p7O3J06j08l7P8J06j10q8Q4L1
6446B4L7r3o1J09m3P3r0k3J59qj18p8J31J44j86q7J59K8j14l9K9J07K1j40K1J8
6472b0J06k2j30k3K30o3j78k2K55j0k53j2J94O1j97j4P7P4K0r7p4O2J66j00k04
6497a74Q6J85j8k82J29K01k3j55l2J37N2j38nl6J72l7n5j16J48Q5j00j83J43J60
6521A44j33j67J69J38j23j43R5P6m0j4j8m7J21K9j60p8J98J02k23o4J90J04k35
$$ plain form
6340 -45 -76 -86 62 102 -23 -97 41 170 -23 -116 28 180 -39 -191 -17 151 15 -83 -6 43 72 37 -36 -13
6364 -13 62 133 -82 -137 68 104 -71 -161 19 112 -67 -128 26 36 -3 -54 -3 40 44 -22 -57 -5 109 30 -47 -18 157
6391 157 79 -80 -51 117 45 -81 -18 68 15 32 -10 1 -38 37 -40 -92 -44 55 -33 -50 -7 78 -68 -113 10 72 3
6418 3 -52 17 71 -36 -38 41 -5 39 -8 46 2 17 5 -9 -75 57 -24 -101 -38 68 -40 -77 1 107 -3 -91 -7 24
6446 24 61 -32 -93 16 -27 46 -44 -67 92 84 -34 -112 19 163 -23 -110 49 77 -37 -76 -47 60 81 -59 -38 -20
6472 -20 86 64 -66 -89 141 78 -100 -122 133 123 -130 -142 52 113 -84 -98 -21 53 73 -24 -98 -36 130 30 -174
6497 -174 -88 97 79 -203 -74 127 104 -51 -83 54 106 -32 -37 -73 99 62 7 -109 39 124 24 -159 -16 144
6521 144 11 -156 13 151 28 -115 -20 56 16 2 -16 -63 58 87 -73 -151 47 149 -74 -138 52 156 -79
6544g9n1J82ko8l6N6J6Nj2J9k7P8Nj81NK00o8j64J05J13j03o4M6N3p1k4R9Qk6
6573A4p6P9q4PJ39q8p7Q4M8j20jJ22M2j66K3R8oq7N3l9K3rJ8L6j0J4l5q2R3N8
6603G1Kj51M4J65n2k36J36J79j09j32N8Q4k0l9Mj9j2L7o4k2N2J21j29j30J52J63
6629A53j56j71J86J23j32j13Q6J25m0l0j12L3J80n9j44m1K56j0k38l5K28K9k21
6652a03k7J25J40j47r0L3Q5P8j10j57J70R5p2j53Q3J94l9k65L5K41l5k32O5J17
6676C1L9j13J4j0R9M0j25r6J44J34j66j66J67J66j71j24Q6J89q6q7JR2J4j00k2
6701e0l8J19L9j10p1J34R9j91l2J62O8j78n5J89p1l8j2RjPR9j06m9J23j5n5K8
6728DP8k5j67J00P6m8j30J15R0j43k2P3N0j00%N4qnN1p3p3J21N7j55kJ91k6j96
$$ plain form
6544 -79 -130 52 50 -18 -54 2 18 23 11 30 3 81 86 -95 -90 110 42 -122 -17 96 -7 -71 -25 28 -43 -67 32 40 14
6573 14 -62 17 -67 -60 79 -9 -86 -2 46 -74 -75 47 89 -77 -54 44 38 -49 4 -35 -12 -21 -3 33 23 37 2 -80 13 71
6603 71 73 -78 -34 131 79 -157 -21 158 49 -83 -25 59 39 0 4 -15 -27 10 -54 -76 -24 97 -32 -162 -10 153
6629 153 -3 -174 12 135 3 -110 -24 101 61 31 -81 -48 132 73 -71 -112 144 134 -104 -139 89 118 -103
6652 -103 -130 -5 135 -12 -102 -69 16 94 -16 -173 -3 92 20 -133 -50 144 105 -160 -125 116 81 -151 -86 31
6676 31 70 -43 -29 -39 60 100 -25 -121 23 157 -9 -175 -8 158 -13 -137 -51 138 52 -35 -34 58 72 -28 -50
6701 -50 -88 31 70 -40 -111 23 122 -69 -101 61 129 -49 -104 85 14 -24 -36 -27 -28 -21 78 -28 -77 46 31 -24 4
6728 4 82 57 -110 -10 66 18 -112 3 93 -50 -72 1 51 -49 -49 5 -3 -8 43 -30 -103 18 75 -80 -82 109 83 -113
6756a13JK19n7j28M5J08Ro8j3nL0J7r9l0Q3J41j03j65J6L09j65j23K0K23r3j83
6782a24N5R1Nj3p7jJ28J8j46r4K36M6j55j24J47J84j62j46J61J15j51o9PJ38K1
6807I0j28l9N0J08m2j40j9K30O5k49j21K77O3k11r7K05Q9j23p1K0P5Ro2p1M4J52
6833A04o5j56K4K43o7j88jK31k6k34Q7J1J15n2m2l5O1N5l0j40J02J21q1j67J12
6858a8K02j33j99J28R1m7o1O9K4j29K8K3jJ2J34j48n2J34M2j35j07J92M2j10j27
6883a46J81Nj26M9J12o4j5N0o7j4Q1l7n5Q8Q4j32q8J63N0r4j81J93R4k08j7R0
6909dP9j50L5L2Q7n6k2o7M5P5K0k01K1J93L9k12k6J73L6j77K7P5M4r9Mk5R1j7
6937B0l0j18N0K26q9k13O5K73j51j12nK46q6j76N4N2P5o6p3k4J29Q6j75j01J31
$$ plain form
6756 -113 -112 107 50 -78 -33 75 84 16 3 -2 28 45 -54 -84 -1 140 37 -128 -112 197 32 -91 -71 152 59 -124
6782 -124 -69 22 27 14 -63 -64 64 82 -64 -158 78 124 -31 -155 -8 176 14 -132 29 144 -7 -76 -69 69 90
6807 90 -38 -77 -27 81 39 -101 -120 110 175 -74 -195 82 145 -66 -163 42 131 8 -63 -43 32 41 -21 -92 -48 104
6833 104 39 -117 -93 150 83 -105 -106 125 99 -135 -48 -37 78 26 -16 -51 10 65 35 -105 -3 118 37 -130 -18
6858 -18 184 51 -148 -20 71 24 -37 32 56 -73 -45 -22 -23 -11 123 -25 -77 57 99 -36 -143 49 91 -19 -146
6883 -146 35 40 -86 -37 75 11 -4 46 -21 -35 46 9 -46 42 126 -6 -94 69 119 25 -156 37 131 -77 -94 -4
6909 -4 75 -75 -40 -8 79 23 1 -66 -21 54 74 -127 -106 87 126 -86 -112 61 97 -80 -53 22 66 -33 -29 -54 37 20
6937 20 -10 -128 -78 148 59 -154 -89 184 33 -79 -84 162 76 -100 -46 6 81 15 -58 -82 47 133 -42 -143 -12
6962a2J42j85j71K06K01j39k15J39J72p2j48M4Q0R7j02r8JJ48N4k21o7K69M9k64
6986i2j02K74L1j31q4J03N8m8q8J8Q6M9j5j26j6J96q0j93M7J90Nj79k0K09k2j69
7012i9RJ09M1m6J2r1Q7P2n1j57J13J49r4j61J42R7j33r4J20O5j34n6J38J4l4m4
7038b6L6n2Q9lo6m8P9N8j21l7J11O3j69nJ47Rj16l6J29n7l2N3qM6K9m2l2L6Qk3
7068B0j65J66J04j33j88K15J73j62j37J08Q7j03j1J2K0NL2j25N0J10K8k07o2K26
7092F3K8j90r3K79L1k14%R1J15r2o0J4R2K5j0k45O6L05n3l11N3K55n3k14J4K55
7118A51p5j23j27K19M6q6l4J1K0J11j44j58K00J31p8k50J82K02j41j65P8J62j02
7141C0j06L0P8L1m9n6m6J58O1j68p7J99P3k05j21K00J58k14q7J50K7n6o3L6oQ1
$$ plain form
6962 -12 130 -55 -226 -20 181 42 -173 -34 138 66 -82 -38 42 139 37 -61 -60 88 142 -79 -146 123 172 -92
6986 -92 -194 80 111 -20 -104 -1 57 9 -79 -61 25 74 59 -67 -83 113 33 -160 -113 77 82 -97 -117 92 70 -99
7012 -99 -90 19 60 14 26 -65 22 94 43 -114 -1 148 54 -107 35 132 -1 -95 25 90 -44 -100 38 52 18 -26
7038 -26 10 -42 47 44 -22 -70 9 67 -54 -91 20 83 -86 -91 56 65 -51 -87 42 -15 -47 6 -2 44 73 31 -1 35 43 20
7068 20 -145 21 125 -8 -196 19 192 30 -107 1 88 -15 -26 -14 6 11 43 -82 -32 78 106 -101 -163 63
7092 63 91 -99 -192 87 118 -96 -96 -5 110 18 -42 -28 64 89 79 -166 -100 205 152 -159 -106 149 96 -118 -104 151
7118 151 76 -47 -174 45 91 5 -29 -18 2 113 -31 -189 11 142 64 -186 -4 198 57 -108 -30 132 30
7141 30 -76 -46 32 63 14 -42 -88 70 131 -37 -114 85 158 -47 -168 32 190 -24 -111 39 66 10 -53 -17 -23 58
7167E8Qj09J7J08K4k65J02J37k6k19M6J93m1q5j5J23M0q5J2j5ML2m5p6O0J07o4
7194B6j15J21P1r9p9Q4O9o7r9R1N3j06K0kO0o2P4q8o3J79Kj29l4J67qj31JJ72
7222A08p8j45N7J43m6j47Q7O5k4jm5j0K3J51j21j32J54J02j62j49J49J94j71j47
7246a45Q6J71j34l7L7L8J5jj01k2J53O7j99p3K68J2j73r1J92J66l13o1K02J8J3
7271H8j75OP8R4o5j76P3K13Ll66J40J96O3k92j5J90Q1k00m4J33M0m8m5q8J45O8
7297I7j35j37J71J80j31k13P0L02j99j42P1K25p3j68PQ1P0n2q9%J35K7j59q1K11
7322F8J27k43q3J46J12k01m6J67rk3n4PK9O7m5p3k1J66k0j78j4K48m1k02O6J56
7348A06l9j26kQ3k0l1M7K1l0M6q6m6J03O4o7r9J10O4j14r3J14P9r0r2J28P9j20
$$ plain form
7167 58 66 -43 -26 82 106 -159 -57 80 54 -165 -119 74 33 -52 -67 56 96 11 23 8 12 44 -1 -77 -17 90 26
7194 26 -89 32 103 4 -75 9 78 11 -88 3 56 -50 -30 -32 28 -34 40 -48 -111 68 70 -59 -93 74 66 -65 -64 108
7222 108 30 -115 -58 85 39 -108 -21 44 20 19 -26 -36 -13 138 17 -115 39 141 -21 -170 -21 173 2 -145
7246 -145 -59 112 -22 -59 -22 16 31 30 -71 -93 60 127 -72 -145 123 135 -38 -129 63 229 -84 -145 57 75 88
7271 88 -87 -81 -3 91 26 -150 -77 136 139 -227 -87 109 172 -120 -135 55 136 -64 -108 25 65 17 -28 -116 29 97
7297 97 -38 -175 -4 176 45 -168 -98 204 5 -137 -66 159 86 -82 -75 6 76 24 -65 -65 70 97 -62 -143 68
7322 68 195 -48 -131 15 127 -74 -120 47 38 15 -39 -32 -3 64 19 -54 -75 91 71 -107 -121 127 86 -116 -50 106
7348 106 67 -59 -61 22 2 -29 18 39 9 55 -31 -77 26 90 23 -76 34 98 -16 -109 5 84 -6 -98 30 109 -11
7375a1o4R9N8l2q7K2n1J03Kj04k9J54K5k20O8J45L4j75lJ31kj32N0j3O5K5p3o2
7403g7Q7J40j06j58Q8K21j69k20J90J76j31j45J42Q3p9q9J2M5J14n5j30k6J67
7426H0K6j30j79K59J92k82j74L00O6j54j12J13J03r3l6Rk6J55j25j32P7K06k2
7449A21k86OK53O0k91O8J60Q6k08o4J21J8N8j71l1J11J36j74j49Q9K70j40k58
7472b15J27K53o5k25J1J89L1k24R9L5M0l4l6j05K01L2k11m4J68R2j83q8J63R0
7496A01r3j18J34O3r5o6O9j7N9kp4LJ29l9j18q4K51n2j92Q8R6Oj36O8M8Mo5J0
7524b2m7J20k0m1k1Q0on2j01J42J10j84j06K39M5j28p6K7J49j31l6L4N0K3k3n1
7550b6nJ14k5j77N1J64Lk38k3K91ok14j1J10O7q8n2J5J33p7m6l7Q4J50j29j35
$$ plain form
7375 -11 -75 24 82 50 -37 -15 -66 37 39 -65 -94 60 85 -135 -67 78 112 -63 -66 65 63 -69 -19 -32 33 58 -15 -77
7403 -77 10 150 44 -114 -26 195 26 -194 -4 172 41 -104 38 121 42 -47 -35 10 124 69 -61 -87 80
7426 80 106 -24 -203 56 248 -34 -208 92 158 4 -108 5 108 15 -21 -12 -38 117 -8 -140 -63 143 121
7449 121 -165 -159 94 154 -137 -69 91 177 -31 -95 26 44 102 -69 -100 11 147 -27 -176 -87 183 43 -215
7472 -215 -88 165 100 -125 -114 75 106 -118 -19 16 56 22 -14 -119 82 114 -97 -141 27 119 -64 -152 11 101
7496 101 8 -110 24 87 -8 -74 -5 -22 37 35 -39 -36 93 54 -64 -148 103 51 -141 -53 43 49 -87 -19 29 33 -32 -22
7524 -22 -69 51 31 -10 -31 49 43 -9 -110 32 142 -42 -148 91 136 8 -68 -41 108 -23 -59 -25 25 48 25 -26
7550 -26 -31 83 58 -119 -68 96 99 -139 -162 129 123 -91 -102 8 75 -13 -65 -50 83 6 -40 -77 7 157 28 -107
7576a07L5K24n2k71J27J94j17j04J6J14K0j40J9O2N7k5j92J5J78J07k11j12K18
7599E5R0j77j97K64J09j73j46J24J40k0q8n5N2J09m6j73rK86j2k49JK55J9k81
7623a22kJ40J37j89o7J07J6n1L9n4j1J55p7j76J13J76p0j96O7J90q9j09O9N9k0
7648C5p1K0N2l5J0k2r7J61R8j77j21K08J08j72j21J70J12j56j35J26J39j50M2
7671B4l1J0L3q9J5L0R0n6j17L8Q8L6j36J4J35m3j41J22Q5m4p3j4L3K4j1n4K9O7
7699F4j2l7j30J59J02j15j27R0J16j13q4J21P0j07q6J13J3Jp5J0o9J26O5j84J3
7724g6J80K2j92l5K06Lj79n6J46J17j64n9N7O3L6j02o0O9J64r7j78J00J93q2k70
7749a94J56J99j20j74P0J75Lj66k6O3P2L9j23p6J45O7j16j42J63J27j53j85J62
$$ plain form
7576 -107 -72 152 100 -171 -44 150 33 -71 -55 59 79 -61 -42 20 77 52 -140 -125 53 160 -51 -163 55
7599 55 145 -32 -229 35 144 -29 -175 -51 89 69 -19 -74 -22 87 41 -132 -141 145 133 -116 -115 140 159 -122
7623 -122 -124 16 153 -36 -103 4 20 -31 8 -46 -57 98 21 -155 -42 134 64 -132 -65 125 36 -73 -4 55 35
7648 35 -36 -16 36 1 11 -11 -108 53 151 -26 -147 61 169 -3 -124 46 158 2 -133 -7 132 -18 24
7671 24 -7 3 36 -53 -38 -8 82 26 -91 -53 35 71 -65 -51 84 41 -100 22 107 63 -10 -24 9 33 22 -32 -3 64
7699 64 52 15 -115 44 146 31 -96 -6 110 -3 -87 34 104 -3 -89 24 37 38 -37 -27 -96 30 95 -89 -76
7724 -76 104 126 -66 -101 105 108 -71 -127 19 136 -28 -87 -30 33 69 -33 -93 -24 140 43 -135 -35 158 76 -194
7749 -194 -38 161 41 -133 -63 112 115 -51 -77 -14 58 97 -26 -102 43 110 -6 -148 15 142 -11 -196 -34
7772c4J51j12j10J19M4k0o7j7j0J65j4j91j0J73J09k73l9K34N2k35K9Q6Q7j07
7796A0m1K1M9K2j17l1P1J19o3j73P9J91j13j50N2J99r2j42M1J36n9q5O3lK5O4
7822G3j09L5KN0o7j01J34J00j40o5J09R8j52lJ28j5j10q9J36M6n8L4l9k3O3M7
7848H4j77O2J74q2j63RJ40m0j18O0J45J5j29n1J36o7lK2r1P5J09j14p7O6J06r7
7874fj27J85R0j98l6R4J23r8j26R7K4L0n4p7P2N1L1j78L2J71oj98J0J41M8j67
7900g2p4J70Q0k05L4LJ15J4q3r3J41N9j4j76J15J29p3j74MK28m6j47l7J49P5j22
7926@q1N4M4N2j48k8J54J3j10q0J03J77j29j70J27J68r7j71J1J73j8p4J1j0J48
7951A19lj84m3J74J5j19l5J62N6k20J5R6N6m0j39Q8K0M3q9j2K8O0J1j50K2J20
$$ plain form
7772 -34 117 5 -105 14 58 38 -29 -46 -56 109 95 -96 -106 67 176 -97 -136 98 150 -85 -56 30 117 10
7796 10 -31 -10 39 61 -56 -87 -16 103 40 -133 -54 137 24 -126 -74 125 33 -109 -68 68 9 -76 -13 -16 9 73
7822 73 -36 -1 1 51 -16 -117 17 117 -23 -88 21 119 -33 -36 92 77 -33 -122 14 60 2 36 -3 -26 37 84
7848 84 -93 -31 143 61 -102 -93 47 7 -111 -51 94 109 -20 -71 65 -2 -5 17 -74 1 110 -4 -81 -15 91 -6
7874 -6 -133 52 142 -56 -92 2 125 27 -99 -2 22 52 -2 -79 -7 44 75 -103 -71 100 94 -104 -94 47 95 -72
7900 -72 -146 24 104 -101 -67 -64 51 65 -18 -111 30 89 75 -101 14 143 70 -104 -100 128 82 -65 -102 47 122 0
7926 0 -81 -27 17 69 -79 -107 47 60 -50 -130 -27 150 21 -149 -22 146 49 -122 -111 62 44 -30 -19 -29 119
7951 119 116 -68 -111 63 78 -41 -76 86 142 -78 -63 33 89 49 -90 -2 18 61 -28 -40 -12 48 59 -91 -69 51
7977E1l8j07M5J40m5j75N2J19lp4k5R9j1pql1P3j1q3m5J38Pq0n3O4J02j12n0J02
8006C4K1p6l1P5J3K0q0kN0N0p4j04kJ59l9j16K7J45j7r3k8Q8l9m1m0J45kNo1l3
8036d6J12k1k6j54J47J46j78j13J29R9m4j83J33K4M3j71M3Q6J6o6k7K0J21j3j38
8061f1p3K44Nj96l2J78L5j52o3J93M2j05n9k4J00L8m0j32J35R3n9j85M1K14o7
8086G0j42J3J60%j30o3R6N7m7n3rR6Mo4p0J10R9j48j13Q7J32o2j31Q7J33p8q7
8113e3J7P0J8j04pK6J11l6j32J3J03N9j04m3R6R0j92j0J27K3r5j4K8j9nqM1K1
8141B1M8j4j54N0N9J7j46O9Q0l6o7O6R3l8j28L2P7j2K3j00K9M6j6j4j8P6L7q5
8169ej14J95k1p2o4R6J0k3p6O3L0l7o7M8M3K7o3j8PR0j1j52
$$ plain form
7977 51 13 -94 -49 91 46 -129 -77 42 39 -35 -60 39 28 21 13 -18 55 44 -39 -84 54 61 -19 -72 -8 94 -18 -68 34
8006 34 55 -21 -52 23 36 56 -24 -26 24 74 0 -104 -106 53 14 -102 -75 70 53 -40 -68 20 -19 -60 -100 45 43 48 -13 -46
8036 -46 66 45 19 -135 12 158 -20 -133 -4 95 51 -132 1 25 68 -103 -60 26 42 -24 -51 -31 90 77 -61
8061 -61 -134 110 115 -81 -113 65 100 -52 -115 78 120 15 -44 -68 32 70 30 -102 33 126 67 -118 -77 137 70
8086 70 -72 -59 101 101 -29 -92 4 61 14 -39 -48 48 52 -12 -82 28 127 -21 -134 -47 85 23 -108 -21 112 34 -53
8113 -53 -36 34 52 -52 -59 -33 78 42 -90 -77 26 85 -19 -62 34 124 -68 -78 49 72 -23 -37 -9 -28 -33 -41 0 21
8141 21 69 55 -99 -49 10 27 -119 -50 30 -6 -73 -7 86 48 -80 -48 29 17 40 -60 -31 15 -1 -15 -33 43 80 -5
8169 -5 -119 76 55 -17 -81 15 25 2 -74 -11 19 -18 -85 -37 6 33 -30 -48 -41 49 38 -114
8191a14
$$ Imaginary data points
##PAGE= N=2
##DATA TABLE= (X++(I..I)), XYDATA
0@%%%%%%%%%%%%%%%%%%%%kK%%mPlMqQoMmMljMmMoJ4k0J8k2L1l7M0m4N1n7O2o7
52c5P4p8P9q2Q0p0N4k5k5J06k40M64q55J585l079O652j8149J13009N53162n54569
72I8058p06424M80685O02699l09219m77256J20115L05405R6994j28551l02353
82b19847m8245M88450J97504o27100l14489P12173L85476p27846m13237O78251
92A11090L96450n64033l45974M00430K68574k00862j79170j2750Q6977K20969
102A81701m951m02973o0637N42222J02557o25506j20778O46863J16146o05112
112b30468r4168N07048O1413l64103k5421J93615n736j3472K6223j56422l1519
123a33010K99001K0252m00130O400M51566m4625m50868Q7860M01117j29725l11972
$$ plain form
0 0 0 0 0 0 0 0 0 0 0 0 0 0 0 0 0 0 0 0 0 0 -2 0 0 0 -4 3 0 4 -4 4 -2 2 -2 2 -1 -2 2 -2 2 -4 10 -10 8 -14 17 -20 20 -24 27 -30 32 -35
52 -35 39 -39 40 -42 38 -32 22 -3 -28 78 -162 302 -553 1032 -2047 4605 -13544 99465 652627 98058
72 98058 -608366 -127681 475018 165799 -311457 -191342 114063 211057 82506 -219847
82 -219847 -268092 220358 417862 -209238 -523727 188446 573922 -153924 -567161 111090
92 111090 507540 -56493 -402467 -2037 266537 65675 -113495 -126245 -39268 181701
102 181701 176750 -226223 -286860 255362 357919 -267587 -388365 258498 374644 -230468
112 -230468 -324636 182412 243825 -120278 -145699 47916 42180 28708 54931 -101491 -133010
123 -133010 165991 186243 -213887 -207487 244079 199454 -251414 -163554 237563 107838 -204134
134b04134J62841J95970j81330o9224J80390n2771j58945J55728J17361k27821
144h1935n8811K62458j0666k57393Q4568K15908j54727j44703K14348N5244k56540
155a32249L9586K76871j26614k72776J93542K44341k31103j94139K32546J26752
165A56757j97837m8773J29876l2474l7037J09225o9469j75029J75890K24226k68336
176c2981k52558L34643K58998l64360k44076L52491K10940k97752j63766K05011
186F590J08717q3620n1046n4257l820J92764N1923l16906r0859M12545J18786
197B90817m69183j36261M79420J43765m41268j43303L57899J36896k37126j26654
207a44998R0909J14151O6722r9964k19362Q4593L52405o7519m52069M8444N08507
$$ plain form
134 -204134 -41293 154677 -26653 -95877 84513 31742 -127203 28525 145886 -81935
144 -81935 -140746 121712 111046 -146347 -61779 154129 -598 -145301 69047 124291 -132249
155 -132249 -92663 184208 57594 -215182 -21640 222701 -8402 -202541 30005 156757
165 156757 -41080 -89853 40023 7549 -29488 79737 10268 -164761 11129 235355 -32981
176 -32981 -285539 49104 308102 -56258 -300334 52157 263097 -34655 -198421 6590
186 6590 115307 31687 -19359 -73616 -77436 115328 167251 -149655 -240514 172031 290817
197 290817 -178366 -314627 164793 308558 -132710 -276013 81886 218782 -18344 -144998
207 -144998 -54089 60062 126784 26820 -192542 -107949 244456 176937 -275132 -226688 281819
218B81819k6180n16100O38M74143K7893l87255n9698K64354R3033j18463j26105
229i1921l5787J55734J82339j79244l06944J93197L97844j94465m46955J81214
239a44988M51047j52340m11531J08822L35086n2586k30634j2396J10744Q1066
249H2290J1516j47209j23637K04674K14978k47605k77894K70397L07969k70658
259B4821l04894K46733K71539k00534k13842J35224J40262n7169n9742k6717j7760
270f2079J08699Q4020j80580j32069K35712J58173k68540j60611K76391J41409
280B00525k58647j04831K17419N7242j57459o165Q4944m0866p969P6770o5954
291d991r6998J29006R8478j75330q1382K00638M8368k03451m266J84860m4239
$$ plain form
218 281819 255639 -260461 -259823 214320 242213 -145042 -204740 59614 152647 34184 -91921
229 -91921 -127708 28026 210365 31121 -275823 -82626 315218 120753 -326202 -144988
239 -144988 306059 153719 -257812 -148990 186096 133510 -97124 -109520 1224 82290
249 82290 93806 -53403 -177040 27634 242612 -4993 -282887 -12490 295479 24821
259 24821 -280073 -33340 238199 37665 -176177 -40953 99309 42140 -17602 -44319 -62079
270 -62079 46620 130640 -49940 -182009 53703 211876 -56664 -217275 59116 200525
280 200525 -58122 -162953 54466 111708 -45751 -51916 33028 -7838 -15807 60963 -4991
291 -4991 -101989 27017 125495 -49835 -131217 69421 117789 -85662 -89928 94932 50693
302E0693j48106R0711R8786j27890m3492J50739j0733j55043N7430J39959r1180
313A1874j06214J08277N6907j07774K448R0681o5866o0349J25989K1413j76360
324i8974J9605K10867n6676k25460Q4102K17848r6980j88560R3149J40134p1905
335B7150p6802L5684N488J1621O7058o3858j33540J14331J87351j55745k23384
346b04646J81854K38349j88460k31540J72714K03940j35037j59236P7964J02177
356E8079p259l8860p0063k4644J45538Q2887k10576j30593K57493J64656k80206
367e3548j82977K75399J85713k41997j73676J82777J49303j02938j15872J0084
377f7732P7022Q6465l6477j77204k439K52338L6377l04308o3716L27443Q3028
$$ plain form
302 50693 -97413 -6702 92084 -35806 -79298 71441 60708 -94335 -36905 103054 11874
313 11874 -94340 13937 70844 -36930 -34482 56199 -9667 -70016 55973 77386 -98974
324 -98974 -79369 131498 74822 -150638 -66536 151312 54332 -134228 -41079 99055 27150
335 27150 -49652 -13968 -8480 3141 70199 6341 -127199 -12868 174483 18738 -204646
346 -204646 -22792 215557 27097 -204443 -31729 172211 37174 -122062 -44098 58079
356 58079 50820 11960 -58103 -82747 62791 145678 -64898 -195491 62002 226658 -53548
367 -53548 -236525 38874 224587 -17410 -191086 -8309 140994 38056 -77816 -67732
377 -67732 9290 95755 59278 -117926 -120365 131973 168350 -135958 -199674 127769 210797
388B10797l19314r4048K80144R7538k14148r4564J28033Q7193l0111p7087o9093
399i4660O5822J60307n4667k33923M4185K83290l4240l04001K4296K94497j3533
410A37373k57071J310J96019J2774j18856k9019L3739M6404N0227o4047j24512
421a15659Q0079J82031r2618k17606R9838K29003r9986k16076R2465J81915p6856
432D6530j31339N4146P1077k5735q224o077m9940L8512R7090o9151j28275R4771
444a6615J40755j13153j34487J22431J10725j21505p4196J10285L0251q9799J5018
455b0290O1922n5199k9349Q5228m641j00807L7096J00183o4469q3531Q4416N3303
467F3862r5176j3468R6114l0262q8153P2155P2500j06576n2154J28708K9393j35321
$$ plain form
388 210797 -108517 -202565 77579 175117 -39031 -133595 -5562 81631 51520 -25567 -94660
399 -94660 -28838 131469 76802 -157121 -112936 170354 136114 -167887 -143591 150906 137373
410 137373 -119698 -118388 77631 90405 -28451 -57470 -23731 22673 72900 8853 -115659
421 -115659 -35580 146451 53833 -163773 -63935 165068 65082 -150994 -58529 123386 46530
432 46530 -84809 -30663 40414 14679 6455 378 -49562 -11050 86040 16889 -111386 -16615
444 -16615 124140 10987 -123500 -1069 109656 -11849 -86045 24240 54491 -35308 -20290
455 -20290 41632 -13567 -42916 42312 37671 -63136 -26040 74143 9674 -73857 10559 63862
467 63862 -31314 -44782 51332 21070 -67083 5072 77572 -29004 -81158 47550 76943 -58378
479e8378p422J24634j1180r7823K4708N7125l1849o871L2751m7203k8096R9365
491D9761J9545j43209q978J73945j172j87290Q685J81628j1934j56975R829J15253
503D9088k240o0723j0407j195K6306O3913m3400j21349N8844J67515p0360j97399
515a41407P4937K08425p1014j99349N7782J71492l5135j27804N019P2874L0404
526D6224j2372o7061m7716J01046J01755j28162j44870J44613J73036j47690j84611
537a65808J36098J78908j10297j57604P1893J23134k4269p9767k8008L2080P9838
548E6198J5059j25791n7166J61499R0626j82682j12719J87255J22395j74203j19641
559a39170J44639J06104j01106q4315M7636N7644J0219k9394o7314K767J17691
$$ plain form
479 -58378 -65800 58834 47654 -50169 -25461 31664 -185 -7056 25695 -21508 -49604 49761
491 49761 69306 -73903 -82881 91064 89892 -97398 -88713 92915 80981 -75994 -66165 49088
503 49088 46848 -13875 -24282 -25477 829 64742 21342 -100007 -41163 126352 55992 -141407
515 -141407 -66470 141955 70941 -128408 -70626 100866 65731 -62073 -57054 15820 46224
526 46224 33852 -33209 -80925 20121 121876 -6286 -151156 -6543 166493 18803 -165808
537 -165808 -29710 149198 38901 -118703 -46810 76324 52055 -27712 -55720 -23640 56198
548 56198 71257 -54534 -111700 49799 140425 -42257 -154976 32279 154674 -19529 -139170
559 -139170 5469 111573 10467 -73848 -26212 31432 41651 12257 -55057 -52290 65401
570F5401J9535j56661l5820J80145M5070j86163m7689J74246M4600j45709l7414
581h0459J03882K8267n3235j8718n88J0804N2180n295r6252L033J28479l978j46007
594g7887P503J47688j2842j34231J8648J07537k3662p1479K6242L0421k5552J0547
606B933K1019m7109j2623P5328P19r2039J3465R6490k8614q8239M2982O9289n4495
619h94m2410O1904J1476o3802J9151N9736m5618m9867O4276L5021p2719j6704
631d0450O9737l496n5950K3274L2944m0983l878N4836k7349o3766N6613O7161
643F8693p9787o4882R3769N7736r6084m6536Q6185L2744o4691j7470L3782K310
655E769L226J1397m2226k2860P8535L1469j08209l6925J27438L9068j33826l8804
$$ plain form
570 65401 84936 -71725 -107545 72600 117670 -68493 -116182 58064 102664 -43045 -80459
581 -80459 23423 51690 -1545 -20263 -20851 -10047 42133 36838 -59414 -56381 72098 68120 -77887
594 -77887 -70384 77304 64462 -69769 -51121 56416 32754 -38725 -12483 17938 -7614 2933
606 2933 23952 -23157 -35780 39548 40267 -51772 -38307 58183 29569 -58670 -15688 53601 -894
619 -894 -43304 18600 30076 -33726 -14575 45161 -457 -50324 13952 48973 -23746 -40450
631 -40450 29287 25791 -30159 -6885 26059 -14924 -18802 36034 8685 -55081 1532 68693
643 68693 -11094 -75976 17793 75529 -20555 -67091 19094 51838 -12853 -30323 3459 5769
655 5769 8995 20392 -21834 -44694 33841 65310 -42899 -79824 47614 86682 -47144 -85948
667h5948J26110L6572j04906l2871P1764K8836l0007k4857j5921K1255O1704j8085
679C3646j02153J5018J33507j1792j51921P536J55753j894j44364n498J18804
690D6642J4648q1829k5469L7187L6666J0548m7432n6605N6182R6420o1728j26051
702a00821O2542J43065n8073j45809M8118J34620l2644j11147J3172P8102R240
713D0365l9391l2217j062N4133L8940p2519p0809Q5382R3697r1477j05971Q9580
725a1349J06879p9786r7233O2427P8754l8829n4154J1171K6257J8170J450m6379
737b2622k6042P0915M5153q8848n7111R8727O1251r9178n7866R0377M8259p3188
749a0173l3964M9222J7326k1361p62p809j3440L4883K3562n7407k8694P3095K8164
$$ plain form
667 -85948 40162 76734 -28172 -61043 10721 39557 9550 -15307 -31228 -9973 51731 33646
679 33646 -68507 -53489 80018 68226 -83695 -76159 79594 77700 -66664 -72162 46642
690 46642 61290 -20539 -46008 -8821 27845 38393 -9039 -65644 -9462 86958 25230 -100821
702 -100821 -38279 104786 46713 -99096 -50978 83642 50998 -60149 -46977 31125 40365
713 40365 974 -31243 -32305 21828 60768 -11751 -82560 2822 96519 5042 -100929 -11349
725 -11349 95530 15744 -81489 -19062 59692 20863 -33291 -22120 4137 22307 23757 -22622
737 -22622 -48664 22251 67404 -21444 -78555 20172 81423 -17755 -75621 14756 63015 -10173
749 -10173 -44137 5085 22411 1050 288 -7521 -20961 13922 37484 -19923 -48617 24478 52642
762E2642q0661k2547P9597J2982p0403r28N4617j1626l4095K2797J1756l0931
774a6800J0280L4639k9156l3279M3152K6763n0757j5772N1355J339m5333J4527
786i042L3674l0219j8233M3615J016n3130J5457N7326k8871n5774L7583M8201
798D1603m0005l5348L5948J8649k5832N64J0909j9845O858L7581k4956n1937M1027
811d784O1463n2610o5394N7937O3269n6175n5579M6822M3096l0882k7302R854
823a0285R663J3759Q299l7741k4552N8898L8179p4981m7768Q3944N2939q4237
835a3883n3476P5709M9916n8768m2698L4954L2780o422k1473k3827R640N2851
847C5303J444p7525j1382R5031J9280j03525k5152J01879K8828r0119l0582O9440
$$ plain form
762 52642 -28019 -50566 29031 42013 -28390 -29318 25299 13673 -20422 2375 14131 -16800
774 -16800 -6520 28119 -1037 -34316 8836 35599 -15158 -30930 20425 21764 -23569 -9042
786 -9042 24632 -5587 -23820 19795 20811 -32319 -16862 40464 11593 -44181 -6598 41603
798 41603 1598 -33750 2198 20847 -4985 -4421 6488 -13357 -6499 31082 6126 -45811 -4784
811 -4784 56679 4069 -61325 -3388 59881 3706 -51873 -5051 38045 7163 -20139 -10285
823 -10285 -622 13137 21436 -16305 -40857 18041 56220 -18761 -66529 17415 70354 -13883
835 -13883 -67359 8350 58266 -502 -43200 -8246 24534 18112 -3361 -27188 -17548 35303
847 35303 36747 -40778 -52160 42871 62151 -41374 -66526 35353 64181 -25938 -56520 12920
859A2920L0498m1712k9061J0054K6743K2406k3494n2354J9918P6805j5757r3313
871e6347J1308J00240o366r7338J042Q5064M541o4970j0442L9187J6267j0868
883A1318k1709j7567K6619M2893l0332o2864L2473P5631l2601q0218L0481P6669
895E0793k5879o5467J8920M8465r836k7618m79N259J1546J5869k2263l3604L1480
908b814M6190l8500n2443M2167N2153m2394m5663L8690L4204l1575j9543K1637
920B109L696r851J1167k372k3378J4182L1356k3997l4280L1278L2092l5113k5186
933b8297L5404J4660l2234k129K6137j0822j8035K2357Q744l1108N12L5661q767
946A2083l5486J5011L0452j8770k1130J9751Q416j7804O103J3700k0770p844L3878
$$ plain form
859 12920 43418 1706 -27355 -17301 9442 31848 8354 -44000 -24082 52723 36966 -56347
871 -56347 -45039 55201 48835 -48503 -47461 37603 42144 -22826 -33268 5919 22186 11318
883 11318 -10391 -27958 -1339 41554 11222 -51642 -19169 56462 23861 -56357 -25876 50793
895 50793 24914 -40553 -21633 26832 16996 -10622 -11101 -5842 5704 21573 -690 -34294 -2814
908 -2814 43376 4876 -47567 -5400 46753 4359 -41304 -2614 31590 15 -19528 2109
920 2109 5805 -4046 7121 4749 -18629 -4447 26909 2912 -31368 -90 32002 -3111 -28297
933 -28297 7107 21767 -10467 -12596 13541 2719 -15316 7041 15785 -15323 -14811 20850 12083
946 12083 -23403 -8392 22060 3290 -17840 1911 10327 -7477 -1374 12326 -8444 -16288 17590
959A7590J368m3728M865M9179r779m9258J2568M4005j2839l3646J0217J9332n266
972D608k737j523j4538R081L0587j6522m3784K2497N2814k6187n6538K6577N4858
985C9193k3469m7819J6873L6438p240k1830m199N471J6560J1048k8351k6054L8178
998D799L8257m4723m6669M6952N0597m4569m9881L7266M4687k5567l6014J0636
1010a4229K4581O221j1751k3353j255L8929J3194n1100k3080N8819L0069o0758
1022a3713l3714N6833L4091m7184l1491L2838K6461j5221j9884l954J2549K2538
1034B0149n105l9123j481N1544O907n8837j0844O0264J3096n5811j4031M6143
1046A2871J3777l2199j2659J5590J1211K009r574j8738Q186L3116o944m3573O051
$$ plain form
959 17590 18958 -24770 -19905 29274 19495 -29763 -17195 26810 13971 -19675 -9458 9874 4608
972 4608 1871 348 -14190 -5109 25478 8956 -34828 -12331 40483 14296 -42242 -15665 39193
985 39193 15724 -32095 -15222 21216 13976 -7854 -12053 -6582 9978 21026 -7325 -33379 4799
998 4799 43056 -1667 -48336 -1384 49213 4644 -45237 -7971 36716 11149 -24865 -14229
1010 -14229 10352 16573 4822 -18531 -19786 19143 32337 -18763 -41843 16976 47045 -13713
1022 -13713 -47427 9406 43497 -3687 -35178 -2340 24121 8900 -10984 -14938 -2389 20149
1034 20149 15044 -24079 -25560 25984 32891 -25946 -36790 23474 36570 -19241 -33272 12871
1046 12871 26648 -5551 -18210 -2620 8591 10600 1026 -17712 -9526 23590 16646 -26927 -20876
1059b0876M9159n415m9563M765M4893m121l5836L085K3483j675r514k54m668K534
1073d003J7572n401k7482Q170L3686j0808l5347J2890L2786j4132k6328J4391
1085d006J7105j3389o289J1240m593p956J4091M121k1339J81K5155m416k5376
1098a5471Q094K1978j0998j5595J2719O946j3293K735J2619j2044j1087K0223
1110F826Q592k5765n752K8231K839k6957j46K2286k032j4438L440M542m107O400
1124C959M058j7260l519K6602K565l3369j601L6564Q46l5816o12L1113R57k2867
1138h380k032J2000L676L84n699j2912P805K4359r445l3376J0427L9181j0281
1151A5707m1097Q802L8890n841l3150J853K4017L253j2762q923N45J4317J1522
$$ plain form
1059 -20876 28283 22868 -26695 -21930 22963 18842 -16994 -13909 9574 7899 -1615 -1869 -6537 -4003
1073 -4003 13569 8168 -19314 -11144 22542 11734 -23613 -10723 22063 7931 -18397 -4006
1085 -4006 13099 -290 -6579 4661 68 -7888 6203 10324 -11015 -10834 14321 9905 -15471
1098 -15471 -7377 14601 3603 -11992 727 7673 -5620 -2885 9734 -2310 -13397 6826
1110 6826 15418 -10347 -16099 12132 14971 -11986 -12132 10154 8122 -6316 -2876 1666 -2441 3959
1124 3959 8017 -9243 -12762 13840 16405 -16964 -18565 17999 18845 -16971 -17583 13530 14487 -8380
1138 -8380 -10412 1588 5264 5648 -51 -12963 -5158 19201 9756 -23620 -13193 25988 15707
1151 15707 -25390 -16588 22302 16461 -16689 -14836 9181 12434 -328 -9251 -8706 5611 17133
1164A7133j9132k2288K2447L0748k3861l6171K3191L7910k0028l6047J4716L0998
1176A9616p636k3119n88J3469R361l078j7644p029K4548J5864k9395k2575L1571
1189C365K6634l0847k7863K7117K6212k0736k2345J2342J6506k548r878p469K975
1202f535J6941L342k4619q658L0132J2434l2542j4524L1898J4795k8104j3506
1214a8946K1694J1078j3244q054L854M642N613j342j4406j375K1259L266k5819
1227a1780m212K7435M244k6180l466K2343K048j6126m26Q584j084o02K549p123
1241c796l176J3430L240j7882k401J9796J070j9339Q41J6389k930j1627M967N557
1255D139o638R41P510p015p801J1903P348j5167n998J6221M114j5066j665J1730
$$ plain form
1164 17133 -1999 -24287 -1840 28908 5047 -31124 -7933 29977 9949 -26098 -11382 19616
1176 19616 11980 -11139 -11727 1742 11103 8025 -9619 -16648 7900 23764 -5631 -28206 3365
1189 3365 29999 -848 -28711 -1594 24618 3882 -18463 -6121 10385 7837 -2041 -9510 -6535
1202 -6535 10406 13748 -10871 -19529 10603 23037 -9505 -24029 7869 22664 -5440 -18946
1214 -18946 2748 13826 582 -7472 -3618 1024 6637 5295 -9111 -10486 10773 14039 -11780
1227 -11780 -15992 11443 15687 -10493 -13959 8384 10432 -5694 -6120 2464 1380 778 3327 -3796
1241 -3796 -6972 6458 9698 -8184 -10585 9211 10281 -9058 -8217 8172 5242 -6385 -1418 4139
1255 4139 -2499 -1558 5952 -1063 -8864 3039 10387 -4780 -10778 5443 9557 -5509 -7174 4556
1269D556p73o761L214Q85n466N451P089j1126q234J5727Q560j8362q445J8924
1283E239P542j7064o157J2936M466p158k638K08O36P146J116j3875k740J9411
1297I068M076k2926n063K4182N667k2634o070J8762O157j2650o082N124N859L111
1311F581n519j1221N025J8183m277k3471L098K6474j724k6881j6K4701J900j9944
1325g091m153J3404O354n628q315k533R869J0478j0902j7065J1111K1971j0352
1338G148k4606Q724K4757o268k2502L015J8106O22j2156m436N225Q079J778j1166
1352c680q320J3413J3713j4641j7427J4630J9085j3186j8878J0757J6672p029
1364E109j2967K654Q359K034l243o581j707J0507O120j3576r511J5319J1531j5639
$$ plain form
1269 4556 3783 -2978 236 1121 -4345 1106 8195 -2931 -11165 4562 13122 -5240 -13685 5239
1283 5239 12781 -4283 -10440 2496 6962 -196 -2834 -2626 -1990 5156 6272 -7603 -10343 9068
1297 9068 13144 -9782 -14845 9337 15004 -7630 -13700 5062 11219 -1431 -7513 -2389 3470 6581
1311 6581 1062 -10159 -5134 13049 8772 -14699 -11601 14873 13149 -13732 -13748 10953 12853 -7091
1325 -7091 -11244 2160 8514 2886 -5429 -7962 1907 12385 1483 -15582 -4471 17500 7148
1338 7148 -17458 -8734 16023 9755 -12747 -9732 8374 8996 -3160 -7596 -2371 5708 7486 -3680
1352 -3680 -12000 1413 15126 485 -16942 -2312 16773 3587 -15291 -4534 12138 5109
1364 5109 -7858 -5204 3155 5189 1946 -4635 -6342 4165 10285 -3291 -12802 2517 14048 -1591
1378a591j2153J4348J1419j1735r581Q047O798l668l581r19K10N292K831q904
1392c187n185J1537O644j2686p076J2599O439j1129m935Q518K887n178m20J370
1406A98k070K440M014n645n486P964O155r348n912R434M811q353l038O261P25
1421B150l252J703Ml913L167N905n946p151P858P774q771p413Q301O473o826m794
1437d731M372K516j226j6k404k370N594M665q388o510J0159P897j0934q380J0280
1452E24Q153q319p180N400N586j611l598k418J326O500R27r906l179J2471N015
1467I691j3820o342J3671P125j2167p255R122P000n265o226O68N095M041l659
1481A679q462K008J2167l71j4604j162J5602K690j5076l885J3061M837r638n530
$$ plain form
1378 -1591 -13744 604 12023 288 -9293 -1246 5552 1884 -1697 -2616 -2406 2886 5717 -3187
1392 -3187 -8372 3165 9809 -2877 -9953 2646 9085 -2044 -6979 1539 4426 -752 -1172 198
1406 198 -1872 568 4582 -1063 -6549 1415 7570 -1778 -7690 1744 6555 -1798 -4836 1425 2150
1421 2150 -1102 601 605 -3308 -141 5764 -182 -7333 525 8299 -472 -7885 416 6889 63 -4731
1437 -4731 -359 2157 931 915 -1489 -3859 1735 6400 -1988 -8498 1661 9558 -1376 -9756 524
1452 524 8677 358 -6822 -1422 4164 2553 -1045 -3463 -2137 4363 5290 -4616 -7795 4676 9691
1467 9691 -4129 -10471 3200 10325 -1842 -9097 25 7025 1760 -4466 -3798 1297 5338 1679
1481 1679 -6783 -4775 7392 7021 -7583 -8745 6857 9547 -5529 -9414 3647 8484 -1154 -6684
1495f684N383N883o78n829m019N326Q214m458j1629L350J3715k060j4455O00J3679
1510F338Q94j1614k254Q445L558m633m524M12N267L700n551p181N527R785n049
1525C120j1384M258J1750l136j0793J658Q848j36o096j570K911L012M11m252l522
1540d921N034O083n491p670N353Q468m770q249L824P049k388n236R54K901O80
1555A621l63k107k109L246M105m008n476M257O174m202n998L595N115k699l537
1570b386J396J609p9M27j189k362K181M098k993n103L276N638l195n426K718M537
1586C147j823l056O76J287O54O29j893k544K843M223l610n395L789O001l477n995
1602d544K692N314j508m093O1K464J469m78k901j530M083L359m790m777M906N938
$$ plain form
1495 -6684 -1301 4582 3904 -1925 -5944 -618 7596 3138 -8491 -5141 8574 6514 -7941 -7341 6338
1510 6338 7232 -4382 -6636 1809 5367 734 -3790 -3378 1889 5589 38 -7143 -1616 8169 3120
1525 3120 -8264 -4006 7744 4608 -6185 -4527 4321 4185 -1911 -3481 -570 2442 2853 -1399 -4921
1540 -4921 113 6196 705 -6965 -1612 6856 2086 -6163 -2339 4710 2322 -2914 -1960 941 1621
1555 1621 1258 -849 -2958 288 4393 385 -5091 -834 5340 1138 -4860 -1265 3850 1151 -2386
1570 -2386 -990 619 540 967 -222 -2584 -403 3695 702 -4401 -1125 4513 1318 -4108 -1390 3147
1586 3147 1324 -1732 -1056 231 885 1514 -379 -2923 -80 4143 533 -4862 -1073 4928 1451 -4544
1602 -4544 -1852 3462 1954 -2139 -2078 386 1855 1377 -1524 -3054 1029 4388 -402 -5179 -273 5665
1618E665m644o358L784O140k420n339O57M141J125k494l027O82M500J246n770
1633b112k918O416M253o451n171N768N660m415n643K763N100p39l995j558K845
1648a97L560j292n235k65O489J638p048k894O861L782o013m421M611M472k720
1663A328m189N54L593J581k618l602J591N104l87o109p32O574J618o136k518N324
1679I76L031l910l325K249L268m11k906j555K369L191j631m507Q22N282o9n462
1695b588p18N169J353m327j811K935K188j430k172k74K147J794j770l057J286
1710a275L980o79m404P0M273N29l719j058K763J375j541j621K82J562J037j491
1726H3k100J095K997p11l436K42L436L32l118p84K464J182j479j466M57J575O19
$$ plain form
1618 5665 1021 -5337 -1553 4587 2167 -3172 -2515 1626 2751 257 -2770 -2088 2412 3658 -2112
1633 -2112 -5030 1386 5639 -812 -5983 -215 5445 1030 -4613 -1850 3250 2511 -1484 -3042 -197
1648 -197 3363 2071 -3164 -3429 3060 4698 -2350 -5244 1617 5399 -614 -5035 -424 4048 1328
1663 1328 -2861 -2307 1286 2867 249 -3353 -1762 3342 2955 -3154 -3886 2688 4306 -1830 -4348 976
1679 976 4007 97 -3228 -979 2289 1878 -1028 -2583 -214 2977 1346 -3161 -2339 2943 2874 -2588
1695 -2588 -3306 1863 3216 -1111 -2922 13 2201 771 -1401 -1675 472 2266 496 -2561 -1275
1710 -1275 2705 2026 -2378 -2308 1965 2494 -1225 -2283 480 1855 314 -1307 -1025 537 1574 83
1726 83 -2017 -922 2075 1364 -2072 -1830 1606 1938 -1180 -1964 500 1682 203 -1263 -806 769 1388
1743A388j391j731J194K539q65l041L98L177J24k989o63K434J136j738j453P65
1759g16J689K54j625j359J457K171j100k699O85K982j20k885n43K682R76j988
1775a39j472J146J745j62j816p47J639J572j489k154R88K625m29k804j56K623
1791I70P31k271j228J660J583p52j870O0J809Q25j716j472J385K089q71k457L00
1808a225K575K61k418q25K015J253j420j558N44J765J63j709q61J399J549j030
1824D78j988N62K222J4k266n55K082J047j637j401J075J626m57j556l25J469R48
1841A338j161j531P28K016k98k296j10K139O04j932j110J569J374j033j386L73
1857g16J337L89j184j052R19J638o15j951K06K169K05k111o17J879R18j491j046
$$ plain form
1743 1388 -3 -1734 -540 1999 1134 -1907 -1509 1668 1792 -1197 -1860 574 1710 -28 -1481 -716
1759 -716 973 1227 -398 -1757 -300 1871 771 -1928 -1243 1739 1619 -1266 -1809 873 1849 -139
1775 -139 -1611 -465 1280 1118 -698 -1445 194 1766 277 -1877 -889 1736 1307 -1497 -1653 970
1791 970 1701 -570 -1798 -138 1445 693 -1177 -1117 692 1517 -199 -1671 -286 1803 932 -1525 -1225
1808 -1225 1350 1611 -807 -1632 383 1636 216 -1342 -798 967 1130 -579 -1440 -41 1508 478
1824 478 -1510 -948 1274 1288 -978 -1533 549 1596 -41 -1442 -367 1259 802 -754 -1079 390 1338
1841 1338 177 -1354 -626 1390 1092 -1204 -1314 825 1429 -503 -1613 -44 1330 297 -1089 -716
1857 -716 621 1010 -174 -1226 -307 1331 716 -1235 -1029 1140 1345 -766 -1383 496 1414 -77 -1123
1874a123Q07J178k55j108m82J022J107q41j519M22J966k32k041j14K037L21j684
1891e39n67J284P46p75p17J05P66M88o71j008N87J406n01j648K74J805k81j691
1909i37J64J472q7j016j08N29K08k8k96m15L15Q90l60j157M31J281m37j187M37
1928c01J013m50p76M95M03m66qL78l79k41O22J45q93K0R46k16q61L59O66n87k46
$$ plain form
1874 -1123 -316 862 607 -501 -983 39 1146 305 -1214 -792 1174 942 -1099 -1213 824 1145 -539
1891 -539 -1106 178 924 149 -568 -463 303 791 120 -888 -301 1105 604 -1044 -770 1035 754 -937
1909 -937 -773 699 612 -404 -512 17 225 197 -99 -514 -199 691 331 -826 -395 886 449 -738 -301
1928 -301 712 262 -514 -19 384 -82 -90 288 -91 -332 290 435 -458 -438 508 292 -569 -210 456 -131 -377
$$ [...]
8191h8
##END NTUPLES=NMR FID
##END=
