##TITLE=1H_LY-DMAA.Per3.23
 CDCl3
 8 sc, 
 14.04.2022
##JCAMPDX= 6.0         $$ Bruker NMR JCAMP-DX V2.0
##DATA TYPE= NMR FID
##DATA CLASS= NTUPLES
##ORIGIN= UXNMR, Bruker Analytische Messtechnik GmbH
##OWNER= root
$$ XWIN-NMR		Version 3.5
$$ Thu Apr 14 13:55:47 2022 Russian Standard Time (UT+4h)  she@DPX200
##.OBSERVE FREQUENCY= 200.13135
##.OBSERVE NUCLEUS= ^1H
##.DELAY= (6, 6)
##.ACQUISITION MODE= SIMULTANEOUS
##.ACQUISITION SCHEME= undefined
##.AVERAGES= 8
##.DIGITISER RES= 18
##SPECTROMETER/DATA SYSTEM= spect
##.PULSE SEQUENCE= zg30
##.SOLVENT NAME= CDCl3
##.SHIFT REFERENCE= (INTERNAL, CDCl3, 0, 15.7039)
##AUDIT TRAIL= $$ (NUMBER, WHEN, WHO, WHERE, WHAT)
$$ ##TITLE= Audit trail, XWIN-NMR		Version 3.5
$$ ##JCAMPDX= 5.01
$$ ##ORIGIN= Bruker BioSpin GmbH
$$ ##OWNER= she
$$ F:/spectra/data/she/nmr/H-F/1/audita.txt
$$ ##AUDIT TRAIL=  $$ (NUMBER, WHEN, WHO, WHERE, WHAT)
(   1,<2022-04-14 13:54:45.87 +0400>,<she>,<DPX200>,
      <created by zg, POWCHK disabled, PULCHK disabled
       configuration hash MD5:
       00 E9 B6 7A A2 85 ED C7 34 08 36 98 17 FE 4E 26
       data hash MD5: 16K
       40 7F 54 EF CE C2 4E C2 31 38 B6 74 0D 3E BC 3A>)
$$ ##END=
$$ 
$$ hash MD5
$$ 30 F4 D2 24 FC C3 D4 83 48 9B 73 67 6E D6 E1 3C
##$RELAX= 
##$RELAX= 
##$RELAX= 
##$RELAX= 
##$RELAX= 
##$RELAX= 
$$ Bruker specific parameters
$$ --------------------------
##$DU= <F:/spectra>
##$EXPNO= 1
##$NAME= <H-F>
##$PROCNO= 1
##$TYPE= <nmr>
##$USER= <she>
##$AMP= (0..31)
100 100 100 100 100 100 100 100 100 100 100 100 100 100 100 100 100 100 
100 100 100 100 100 100 100 100 100 100 100 100 100 100 
##$AQSEQ= 0
##$AQ_mod= 1
##$AUNM= <au_zg>
##$AUTOPOS= <>
##$BF1= 200.13
##$BF2= 200.13
##$BF3= 200.13
##$BF4= 200.13
##$BF5= 200.13
##$BF6= 200.13
##$BF7= 200.13
##$BF8= 200.13
##$BYTORDA= 1
##$CFDGTYP= 0
##$CFRGTYP= 5
##$CHEMSTR= <none>
##$CNST= (0..31)
1 1 145 1 1 1 1 1 1 1 1 1 1 1 1 1 1 1 1 1 1 1 1 1 1 1 1 1 1 1 1 1 
##$CPDPRG= <>
##$CPDPRG1= <>
##$CPDPRG2= <>
##$CPDPRG3= <>
##$CPDPRG4= <mlev>
##$CPDPRG5= <mlev>
##$CPDPRG6= <mlev>
##$CPDPRG7= <mlev>
##$CPDPRG8= <mlev>
##$CPDPRGB= <>
##$CPDPRGT= <>
##$D= (0..31)
0 1.2 0 0 0 0 0 0 0 0.06 0 0.03 0 0 0 0 0.0002 0 0 0 0 0 0 0 0 0 0 0 0 
0 0 0 
##$DATE= 1649930085
##$DBL= (0..7)
120 120 120 120 120 120 120 120 
##$DBP= (0..7)
150 150 150 150 150 150 150 150 
##$DBP07= 0
##$DBPNAM0= <>
##$DBPNAM1= <>
##$DBPNAM2= <>
##$DBPNAM3= <>
##$DBPNAM4= <>
##$DBPNAM5= <>
##$DBPNAM6= <>
##$DBPNAM7= <>
##$DBPOAL= (0..7)
0.5 0.5 0.5 0.5 0.5 0.5 0.5 0.5 
##$DBPOFFS= (0..7)
0 0 0 0 0 0 0 0 
##$DE= 6
##$DECBNUC= <off>
##$DECIM= 32
##$DECNUC= <off>
##$DECSTAT= 4
##$DIGMOD= 1
##$DIGTYP= 9
##$DL= (0..7)
0 120 120 120 120 120 120 120 
##$DP= (0..7)
150 150 150 150 150 150 150 150 
##$DP07= 0
##$DPNAME0= <>
##$DPNAME1= <>
##$DPNAME2= <>
##$DPNAME3= <>
##$DPNAME4= <>
##$DPNAME5= <>
##$DPNAME6= <>
##$DPNAME7= <>
##$DPOAL= (0..7)
0.5 0.5 0.5 0.5 0.5 0.5 0.5 0.5 
##$DPOFFS= (0..7)
0 0 0 0 0 0 0 0 
##$DQDMODE= 0
##$DR= 18
##$DS= 0
##$DSLIST= <SSSSSSSSSSSSSSS>
$$ [...]
##$SUBNAM2= <"">
##$SUBNAM3= <"">
##$SUBNAM4= <"">
##$SUBNAM5= <"">
##$SUBNAM6= <"">
##$SUBNAM7= <"">
##$SUBNAM8= <"">
##$SUBNAM9= <"">
##$SW= 18.05172834244
##$SWIBOX= (0..15)
0 0 2 0 0 0 0 0 0 0 0 0 0 0 0 0 
##$SW_h= 3612.71676300578
##$TD= 16384
##$TD0= 1
##$TE= 0
##$TE2= 300
##$TE3= 300
##$TEG= 300
##$TL= (0..7)
0 120 120 120 120 120 120 120 
##$TP= (0..7)
150 150 150 150 150 150 150 150 
##$TP07= 0
##$TPNAME0= <>
##$TPNAME1= <>
##$TPNAME2= <>
##$TPNAME3= <>
##$TPNAME4= <>
##$TPNAME5= <>
##$TPNAME6= <>
##$TPNAME7= <>
##$TPOAL= (0..7)
0.5 0.5 0.5 0.5 0.5 0.5 0.5 0.5 
##$TPOFFS= (0..7)
0 0 0 0 0 0 0 0 
##$TUNHIN= 0
##$TUNHOUT= 0
##$TUNXOUT= 0
##$USERA1= <user>
##$USERA2= <user>
##$USERA3= <user>
##$USERA4= <user>
##$USERA5= <user>
##$V9= 5
##$VALIST= <valist>
##$VCLIST= <CCCCCCCCCCCCCCC>
##$VD= 0
##$VDLIST= <DDDDDDDDDDDDDDD>
##$VPLIST= <PPPPPPPPPPPPPPP>
##$VTLIST= <TTTTTTTTTTTTTTT>
##$WBST= 1024
##$WBSW= 4
##$XGAIN= (0..3)
0 0 0 0 
##$XL= 0
##$YL= 0
##$YMAX_a= 249569
##$YMIN_a= -254448
##$ZGOPTNS= <>
##$ZL1= 120
##$ZL2= 120
##$ZL3= 120
##$ZL4= 120
##$ABSF1= 10
##$ABSF2= 0
##$ABSG= 5
##$ABSL= 3
##$ALPHA= 0
##$AQORDER= 0
##$ASSFAC= 0
##$ASSFACI= 0
##$ASSFACX= 0
##$ASSWID= 0
##$AUNMP= <proc_1d>
##$AZFE= 0.1
##$AZFW= 0.1
##$BCFW= 1
##$BC_mod= 2
##$BYTORDP= 1
##$COROFFS= 0
##$CY= 11.3945322036743
##$DATMOD= 1
##$DC= 2
##$DFILT= <>
##$DTYPP= 0
##$F1P= 2.36226072786647
##$F2P= -0.459571619588291
##$FCOR= 0.5
##$FTSIZE= 0
##$FT_mod= 4
##$GAMMA= 1
##$GB= 0.15
##$INTBC= 1
##$INTSCL= 1
##$ISEN= 128
##$LB= 0.24
##$LEV0= 0
##$LPBIN= 0
##$MAXI= 10000
##$MC2= 0
##$MEAN= 0
##$ME_mod= 0
##$MI= 1.114404
##$NCOEF= 0
##$NC_proc= 0
##$NLEV= 6
##$NOISF1= 3.799351
##$NOISF2= 2.8
##$NSP= 1
##$NTH_PI= 0
##$NZP= 0
##$OFFSET= 15.70392
##$PC= 1
##$PHC0= -18669.09
##$PHC1= 24.00075
##$PH_mod= 1
##$PKNL= yes
##$PPARMOD= 0
##$PSCAL= 0
##$PSIGN= 0
##$REVERSE= no
##$SF= 200.130013532006
##$SI= 16384
##$SIGF1= 3
##$SIGF2= 2
##$SINO= 400
##$SIOLD= 16384
##$SREGLST= <1H.CDCl3>
##$SSB= 0
##$STSI= 0
##$STSR= 0
##$SW_p= 3612.71676300578
##$SYMM= 0
##$S_DEV= 0
##$TDeff= 0
##$TDoff= 0
##$TI= <>
##$TILT= no
##$TM1= 0
##$TM2= 0
##$TOPLEV= 0
##$USERP1= <user>
##$USERP2= <user>
##$USERP3= <user>
##$USERP4= <user>
##$USERP5= <user>
##$WDW= 1
##$XDIM= 8192
##$YMAX_p= 0
##$YMIN_p= 0
$$ End of Bruker specific parameters
$$ ---------------------------------
##NTUPLES= NMR FID
##VAR_NAME=  TIME,          FID/REAL,        FID/IMAG
##SYMBOL=    X,             R,               I
##VAR_TYPE=  INDEPENDENT,   DEPENDENT,       DEPENDENT
##VAR_FORM=  AFFN,          ASDF,            ASDF
##VAR_DIM=   8192,          8192,            8192
##UNITS=     SECONDS,       ARBITRARY UNITS, ARBITRARY UNITS
##FACTOR=    0.0002768,     1,               1
##FIRST=     0,             0,               0
##LAST=      2.2672688,     0,               0
##MIN=       0,             -254448,         0
##MAX=       2.2672688,     249569,          0
$$ Real data points
##PAGE= N=1
##DATA TABLE= (X++(R..R)), XYDATA
0@%%%%%%%%%%%%%%%Qj6J6j6J6j6K4l2L2m0M8n4O2p2Q5r3J04j20J36j54J75j94
$$ 0 0 0 0 0 0 0 0 0 0 0 0 0 0 0 0 8 -8 8 -8 8 -8 16 -16 16 -24 24 -30 32 -40 45 -48 56 -64 72 -82 93 -101
37a01K18k43K67k98L33l71M12m56N01n51O09o71P38q13Q95r87J089j204J336j486
$$ -101 117 -126 141 -157 176 -195 217 -239 262 -289 320 -351 387 -426 469 -518 571 -633 703 -783
57g83J658j862K103k395K761l227L843m704N991q105J2150k2445R3541J71043
$$ -783 875 -987 1116 -1279 1482 -1745 2098 -2606 3385 -4720 7430 -15015 78526 249569
71B49569l24632j48411K78901J32405k18722j04196J24246R3963k6852q8244p7505
$$ 249569 -75063 -223474 55427 187832 -30890 -135086 -10840 83123 56271 -31973 -109478
82a09478J01134J64189j18206k32974J43401K69664j61520k78710J71147K57023
$$ -109478 -8344 155845 37639 -195335 -51934 217730 56210 -222500 -51353 205670
92B05670j61347k15061J33526J58442q4407r9894K0540M5896N2960n721j25466
$$ 205670 44323 -170738 -37212 121230 36823 -63071 -42531 3365 56325 50604 -74862
103g4862j7949J88948K3228k33880j4387K54554m321k47630K5049K14985m0994
$$ -74862 -92811 96137 119365 -114515 -128902 125652 121331 -126299 -101250 113735 72741
114G2741j61250M5920R4614l6880k4626J3462l8081K1493Q5715o2543j12176J02335
$$ 72741 -88509 -42589 52025 15145 -9481 3981 -34100 -12607 73108 10565 -101611 724
126G24J15395j33605r6973J50461O2341j48928j9198J28362k4197r1886N9609
$$ 724 116119 -17486 -114459 36002 98343 -50585 -69783 58579 34382 -57504 2105
137B105M4995q0857M856Q4725m9856p1316Q2311M3381r7079o316R2045l2844o8118
$$ 2105 47100 -33757 -28901 55824 5968 -65348 16963 60344 -36735 -43051 48994 16150 -51968
150e1968O7539K9182r2030J7977J03083o5289r9358J05070Q2772j30283n7618
$$ -51968 15571 44753 -47277 -29300 73783 8494 -90864 14206 96978 -33305 -90923
161i0923J36221K9327j21189m026Q7006j2871l8304J7478j8175r234P4478j0470
$$ -90923 45298 74625 -46564 -50590 36416 23545 -14759 2719 -15456 -24690 49788 39318
173C9318j22878L7556J57218o6261j73738Q9700J71356j01818j52005R8355J20481
$$ 39318 -83560 -46004 111214 44953 -128785 -39085 132271 30453 -121552 -23197 97284
184I7284p7084q2700L9011M5115J1917j3280o9200q647J25443J9463j73074k0232
$$ 97284 20200 -62500 -23489 21626 33543 20263 -48937 -57584 67859 87322 -85752 -105984
196a05984K05241J4027k17649n446K08676m20j79827r64J34872J2100q0027l3889
$$ -105984 99257 113284 -104365 -109811 98865 98445 -81382 -82346 52526 64626 -15401 -49290
208d9290K2542O4532L0888j00297p4464J35542J04421j64321j19101J81214J19866
$$ -49290 -26748 37784 68672 -31625 -106089 29453 133874 -30447 -149548 31666 151532
219A51532j81789j09719J64017R3227j28533p5296P8581O0827j9552n2932m1716
$$ 151532 -30257 -139976 24041 117268 -11265 -86561 -7980 52847 33295 -19637 -61353
230f1353N2748R7677n9698j41870P0889J69590q2260j78511Q9078J68859q7469
$$ -61353 -8605 89072 29374 -112496 -41607 127983 45723 -132788 -43710 125149 37680
241C7680j43896P4676J08765m9900o9469J4738L2185K7227k145p0675j7263J10069
$$ 37680 -106216 -31540 77225 27325 -42144 -27406 4779 32006 29861 -40814 -58077 51992
253E1992K5288j39821k2839J55578J2913j55102K55J38567j2097j08228J8533
$$ 51992 77280 -62541 -85380 70198 83111 -71991 -71736 66831 54734 -53494 -34961
264c4961O8511j7313k5175P187j5692J0549M8884l3302p0198N6850P7455p7134
$$ -34961 33550 16237 -8938 -1751 -17443 -6894 41990 8688 -61510 -4660 72795 -4339
276d339p0761R0052N2696r2539k7123Q3572q50o3831K5814L6238m3318m702N0497
$$ -4339 -75100 14952 67648 -24891 -52014 31558 30708 -33123 -7309 28929 -14389 -19091 31406
289C1406k5520m6437M9633L1994o3611j0268O5195j4671n4091L8195L2105n6369
$$ 31406 5886 -40551 9082 41076 -22535 -32803 32392 17721 -36370 1825 33930 -22439
301b2439l335O6196k7532o6328N5106N7557p4651m2116Q2599K3338p7253n258
$$ -22439 -25774 40422 12890 -53438 1668 59225 -15426 -57542 25057 48395 -28858 -34116
313c4116N9436q404l1239J4973l177j3208L8923L715p1126J1638R5566k9423j09244
$$ -34116 25320 16916 -14323 650 -2527 -15735 23188 26903 -44223 -32585 62981 33558 -75686
326g5686M5436J10888n5878j01139N7311Q2361m7946n8088K7538L2206J912q919
$$ -75686 -30250 80638 24760 -76379 -19068 63293 15347 -42741 -15203 17003 18915 9996
338I996l6991q851P3325J9432j05672k2676J29347K0033j40727j4108J38220Q356
$$ 9996 -26995 -35846 37479 56911 -48761 -71437 57910 77943 -62784 -76892 61328 69684
350F9684j21740n893R3488R264n7372j9545J8053L6458J9528n7765n1237Q0071
$$ 69684 -52056 -57949 35539 44803 -12569 -32114 -14061 22397 41925 -15840 -67077 12994
362A2994P3753r9603q5877J12324Q7897j15064q1739J05995P0225q5185n6788
$$ 12994 86747 -12856 -98733 13591 101488 -13576 -95315 10680 80905 -4280 -61068
373f1068N4240M4765j6394l6304k4045L2874O2330l4347r3892L9389J15351m5444
$$ -61068 -6828 37937 21543 -14761 -38806 -5932 56398 22051 -71841 -32452 82899 37455
385C7455j24509M9894J20984n0050j06227M3711Q3095k9927n5440R078K7448J6828
$$ 37455 -87054 -37160 83824 33774 -72453 -28742 54353 24426 -31014 -21936 5512 22340
397B2340l206m4992j4516P1649K4218r2955k5959J05700K1088j07811j2339R8795
$$ 22340 19134 -25858 -40374 31275 55493 -37462 -63421 42279 63367 -44444 -56783 42012
409D2012K908p9563M280N2902o774k2489L435p383N675L2828j8907n0657L3878
$$ 42012 44920 -34643 -30363 22539 15765 -6724 -3289 -10672 -4997 27831 8924 -41733 -7855
422g855N8856m7738n7251N7488M6951o0950l0445N6823J1083m5492P482K8239
$$ -7855 51001 3263 -53988 3500 50451 -10499 -40944 15879 26962 -18530 -11048 17191
434A7191k2107p599L0524j3253l1495L1124K5157m3117j2905M7341k741m2907
$$ 17191 -4916 -12515 18009 4756 -26739 4385 29542 -13575 -26480 20861 18120 -24787
446b4787J8936L0751l2854j2691M1943q047m4889K8097M1421m3910l2596N2656
$$ -24787 -5851 24900 -7954 -20645 21298 13251 -31638 -3541 37880 -6030 -38626 14030
458A4030K0233n2760p063M3814m316k6985J1513M684j3271J9669R343m2753n53
$$ 14030 34263 -18497 -25560 18254 13938 -13047 -1534 3150 -10121 9548 18891 -23862 -24415
471b4415O1306j0857p2821K2327P6098l0975p1161L4353N9478l0793m3055J9935
$$ -24415 36891 26034 -46787 -24460 51638 20663 -50498 -16145 43333 12540 -30515 -10580
483a0580K4669k534p257j9358p104M3001J6826o4935k1616Q1973K1815r1610j8997
$$ -10580 14089 11555 4298 -15060 -22164 20837 37663 -27272 -48888 33085 54900 -36710 -55707
496e5707R2192J5038q3388j1997O6046J1768m2505j5416J5677K3183J1339l4296
$$ -55707 36485 51523 -31865 -43862 22184 33952 -8553 -23969 -8292 14891 26230 -8066
508h066l5070M6996N3167n8948o4022O7646O7338p0703o3887O6592N5471n4803
$$ -8066 -43136 3860 57027 -1921 -65943 1703 69041 -1662 -65549 1043 56514 1711
520A711m4540L5946L3431j1824k4287j4954J8522M1002j6542o3402J7700P9424
$$ 1711 -42829 -6883 26548 14724 -9563 -24517 -5995 35007 18465 -44937 -27237 52187
532E2187k0666q7269K3607Q6397k4573p7460K2040O2141j4960m2837L520K2464
$$ 52187 31521 -55748 -32141 54256 29683 -47777 -25737 36404 21444 -21393 -17873 4591
544D591J1589l725k8655j1153M5396K0837n9372k4875O8460K3750p1179j8964
$$ 4591 16180 12455 -16200 -27353 18043 38880 -20492 -45367 23093 46843 -24336 -43300
556d3300O6641J2310n5226n984L8345J712j8198q05k591L638K1302r737l5448
$$ -43300 23341 35651 -19575 -25559 12786 14498 -3700 -4505 -7096 -3458 17844 8107 -27341
569b7341J7895M3504k6376m4702L3286L9477l6855k9047L6046J5566l0322j662
$$ -27341 -9446 34058 7682 -37020 -3734 35743 -1112 -30159 5887 21453 -8869 -10531
581a0531K0356j0440p480J8768o379k2114J8918K0307k8350j3990L2933M445l1934
$$ -10531 9825 -615 -8095 10673 4294 -17820 1098 21405 -6945 -20935 11998 16443 -15491
594a5491O316K5544j6375j4830K3917J632k7856J2009K7633k3601k3536L1333
$$ -15491 -9175 16369 -6 -14836 9081 10713 -17143 -5134 22499 -1102 -24638 6695
606F695J6580l3706q233L0261K04k1311O015Q157r151P228Q797k2840n067L6227
$$ 6695 23275 -10431 -18664 11597 11801 -9510 -3495 4662 -4489 2739 11536 -11304 -16371 19856
620A9856j062m5605Q132M9651j4464m8156J8199M1505j8059l0922J3325J8239
$$ 19856 18794 -26811 -18679 30972 16508 -31648 -13449 28056 9997 -20925 -7600 10639
632A0639m147n391q488n843K3040J4227l7319j8967M9220K0233n6737j8808N8657
$$ 10639 6492 1101 -7387 -13230 9810 24037 -13282 -32249 16971 37204 -19533 -38341 20316
645B0316J5868n4337j2884M4246J1125k9645j1567J2221J4552N747j9811k2260
$$ 20316 36184 -18153 -31037 13209 24334 -5311 -16878 -4657 9895 15642 -4169 -26429
657b6429K6493L5392l3264m4029L8537M7549m0823m6248L9119M1095l2807l3452
$$ -26429 64 35456 2192 -41837 -3300 44249 3426 -42822 -3703 37392 4585 -28867
669b8867K2097K4979p817j7033q514J1005K5038p367l9840O191N0975o897n7115
$$ -28867 -6770 18209 10392 -6641 -15155 -4150 20888 13521 -26319 -20128 30847 23950 -33165
682c3165Q410N7673r642n2687R132M3073o270l0312O42J6215P502k773j7270q529
$$ -33165 -24755 32918 23276 -29411 -20279 22794 16524 -13788 -13146 3069 10571 7798 -9472 -18001
696a8001K7420J6470l6302k0493M2517K0891m4845j8348M2738J4054l6174r261
$$ -18001 9419 25889 -10413 -30906 11611 32502 -12343 -30691 12047 26101 -10073 -19334
708a9334K5949N264j3228l068l13L106J2830n235k2984R004K9371j3493l1478
$$ -19334 6615 11879 -1349 -4417 -4730 -1624 11206 5971 -17013 -8009 21362 7869 -23609
721b3609J7495K9256k0069k3361K0276J5038j7722n714J2506l014n239R819k992
$$ -23609 -6114 23142 3073 -20288 -12 15026 -2696 -8410 4096 1082 -4157 5662 2670
734B670j3665J1003J4307j7498j1674K1303O580k1753j21J8825o558j2800J2012
$$ 2670 -10995 8 14315 -3183 -14857 6446 13026 -8727 -8848 9977 3419 -9381 2631
747B631M760j5551M004J6522j2063j4989J8028J1297k0902o416K0135J285j5773
$$ 2631 7391 -8160 -4156 12366 303 -14686 3342 14639 -6263 -12679 7456 8741 -7032
760g032L073Q492n781O75O458j0327n006J9120J946k5738K054K9381n937k9642
$$ -7032 -3959 4533 -1248 -573 5885 -4442 -9448 9672 11618 -14120 -12066 17315 11378 -18264
774a8264Q758K6561r572k0819P918J3234l655n127k862k484J0682Q731j8973j2846
$$ -18264 -9506 17055 7483 -13336 -5418 7816 4161 -966 -3828 -6312 4370 13101 -5872 -18718
788a8718K6289J4770l1509j4646L3620J3109l2167j0931K7142Q993j8965q049
$$ -18718 7571 22341 -9168 -23814 9806 22915 -9252 -20183 6959 15952 -3013 -11062
800a1062Q788Q433K361j0354j2890J3338K1803j6757k8058J9732L1054k1374l0967
$$ -11062 -2274 6159 8520 -1834 -14724 -1386 20417 3660 -24398 -4666 26388 5014 -25953
813b5953K0969K8091j7996k3272J2417J7398m696j1531m470O487J3983k796k2720
$$ -25953 -4984 23107 5111 -18161 -5744 11654 6958 -4573 -9043 -2556 11427 8631 -14089
826a4089O30K9669J20l3837J01L4811o12l2411P72K7121J4j9653k049J1011N412
$$ -14089 -13459 16210 16330 -17507 -17406 17405 16793 -15618 -14846 12275 12289 -7364 -9413 1598 7010
841G010k301r838n528J4773J1495j9420j5195K2912J6459k4638j5556K3987J3036
$$ 7010 4709 -5129 -10657 4116 15611 -3809 -19004 3908 20367 -4271 -19827 4160 17196
854A7196k0801r720J5374O371q181l759K31K345P556k195j4142L261J8761n042
$$ 17196 -3605 -13325 2049 8420 239 -3520 -3289 -944 6612 4417 -9725 -6464 12297 7255
868G255k0845P018K0282q558j7320R087J2568q339o809O118J005k849M091j303
$$ 7255 -13590 -6572 13710 5152 -12168 -3081 9487 1148 -5661 457 1462 -1387 2704 1401
882A401p681N536R381r239r161J1774P160j2604l970J1698J76q979L513M916o380
$$ 1401 -6280 -744 8637 -602 -9763 2011 9171 -3433 -7403 4295 4471 -4508 -995 3921 -2459
897b459j22Q092m652q369Q707P256j1273n147J1959K409j0540K72P303k487k621
$$ -2459 -2581 5511 859 -7510 1197 8453 -2820 -7967 3992 6401 -4139 -3867 3436 949 -1672
912a672L701k856l787Q147K785j2642j026J5671j038j6739K836J5834l865j3140
$$ -1672 2029 -827 -4614 3533 6318 -6324 -7350 8321 7283 -9456 -6620 9214 5349 -7791
926g791L775R126k310m372l50l78L881M674p867p933J1705R898j4713j0542J6280
$$ -7791 -4016 5110 2800 -1572 -1922 -2300 1581 6255 -1612 -9545 2160 12058 -2655 -13197 3083
941C083J0081j6094q945J4099P375j0357n990N202N118N74m857o474N303J1767
$$ 3083 13164 -2930 -11875 2224 9599 -758 -6748 -1546 3572 4146 -711 -7185 -1882 9885
955I885o146j5859P191J8235p856j8814P920J7657o941j4981M801J1361j526p335
$$ 9885 3739 -12120 -4929 13306 5450 -13364 -5444 12213 5272 -9709 -4908 6453 4927 -2408
969b408k641L469P156k11j1558k218J5277L586j7670m192J8493M091j7520l782
$$ -2408 -5049 -1580 5576 5365 -6193 -8411 6866 10452 -7218 -11410 7083 11174 -6346 -10128
983a0128J4934L490j0990l532O171M139j109n196l698O704P625q206j0367R496
$$ -10128 4806 8296 -2694 -6226 -55 4084 2975 -2221 -5919 785 8410 204 -10163 -667
997f67J1795j0214j1793J0040J0625q858q614O612O194l502l875j74J818M003
$$ -667 11128 914 -10879 -839 9786 928 -7686 -1074 5120 1618 -2257 -2431 -613 3390
1011C390m55p462k32J0180K22j1739K02J2049r46j0914J528Q723j772n639J508
$$ 3390 2935 -4527 -4759 5421 5643 -6096 -5894 6155 5209 -5705 -4177 4546 2774 -2865 -1357
1026a357K255o39J033o89l790K321N641l910o371N145O058n863m870N762L039
$$ -1357 898 259 1292 603 -3187 -866 4775 865 -5506 -361 5697 -166 -5036 726 3765
1041C765m937r37L404j130j274K677r81l722L132M028m767l674N712K733n720
$$ 3765 -1172 -2109 1295 165 -1109 1568 587 -3135 -3 4025 -742 -4416 1296 4029 -1691
1056a691j434M827J97l132R92P81j733J735K050m183j868O140J302p336n92P632
$$ -1691 -3125 1702 1899 -1233 -241 540 -1193 542 2592 -1591 -3459 2681 3983 -3353 -3945 3687
1072C687j51o951N50N484n97l378J55Q80P63J582k016l745L421N343m645o281
$$ 3687 3536 -3415 -2865 2619 2022 -1356 -1201 -321 442 2024 8 -3737 -316 5027 382 -5899
1088e899N578O469n837o018N384N169m233m034K376K881n6j834k510J035M941
$$ -5899 -321 6148 311 -5707 -323 4846 613 -3421 -1045 1836 1780 -54 -2564 -1529 3412
1103C412n78o952L42Q420l56r092M04Q811k44p784j24O073Q34m027j741J719K939
$$ 3412 2834 -4118 -3776 4644 4288 -4804 -4400 4411 4167 -3617 -3741 2332 3166 -861 -2602 -883 2056
1120B056N45m204k488N468L904o368m804O868N089o708m913N878M434m518l724
$$ 2056 2601 -1603 -4091 1377 5281 -1087 -5891 977 6066 -642 -5555 323 4757 239 -3485
1135c485K553L020l26k430k024K025M101j816n753J753O804j748p150J710O864
$$ -3485 -932 2088 1762 -668 -2692 -667 3434 1618 -4135 -2382 4422 2674 -4476 -2766 4098
1150D098j511n903J047M548l02k907o58J198J829L32l030j539M070K373m834k754
$$ 4098 2587 -3316 -2269 2279 1977 -930 -1588 -390 1439 1771 -1259 -2798 1272 3645 -1189 -3943
1166c943N198K677n101k423M522J954l494j404K089R08n04n88j104M86K494n55
$$ -3943 1255 3932 -1169 -3592 930 2884 -610 -2014 75 983 479 -109 -1213 -727 1767 1212
1182A212l514P57M183j111m182J362L750j505k839J445J684j134m38O21p16O7
$$ 1212 -2302 -1545 2638 1527 -2655 -1293 2457 952 -1887 -442 1242 108 -330 291 -425 -358
1198c58J656q77k247J595K353k135k122K400J518k332p67J993j48j262R16M03
$$ -358 1298 421 -1826 -231 2122 -13 -2135 265 1783 -549 -1316 677 529 -733 183 586
1214E86j538N71J939j491j974K169J782k512j327K472P58k046j64J284l65k57
$$ 586 -952 -381 1558 67 -1907 262 2044 -468 -1795 677 1435 -611 -775 509 144 -113
1230a13P57r52r36K062Q92k997o79L545L65l703l4L398j89k688K42J641l7m24
$$ -113 644 -308 -1244 818 1710 -1287 -1966 1579 1944 -1759 -1793 1605 1416 -1272 -1030 611 574 150
1248A50l06q70R05J992j552k870K263L357k721l533K949L355k874k825K323K171
$$ 150 -156 -1026 -121 1871 319 -2551 -288 3069 348 -3185 -236 3119 245 -2580 -257 1914
1264A914j480j464L00P86J044k90k400mL535J93m479j71M984L9m935L2M471l6
$$ 1914 434 -1030 -730 56 1100 810 -1590 -1594 1941 2134 -2345 -2516 2468 2507 -2428 -2396 2075 2039
1282B039l520j28K308N47r39j108m59J836J658k579k568L263L064l734l178L867
$$ 2039 -1481 -1609 699 1246 307 -801 -1260 576 2234 -345 -2913 350 3414 -320 -3498 369
1298C69K927l632k475K988J855j994j228O81P34P19m26k072L36L283n09m046P91
$$ 369 3296 -336 -2811 177 2032 38 -1190 -509 225 944 518 -1554 -1218 2065 1556 -2490 -1699
1315a699M394j081m267J370L660j383k775J237J645p91m69O6n53P49J330j694
$$ -1699 2695 1614 -2653 -1283 2377 994 -1781 -544 1101 310 -159 -93 -646 103 1433 -261
1331b61j764K506J779l059j482L287R63l227k19K712m94j891J098Q40j361K62
$$ -261 -2025 481 2260 -799 -2281 1006 1969 -1258 -1477 1235 741 -1150 -52 788 -573 -311
1347c11J335j235j003J991M11k359L85K239j120j749J767R26k199J07K328j226
$$ -311 1024 -211 -1214 777 1188 -1171 -786 1453 333 -1416 351 1277 -922 -815 1513 287
1363B87k064K062J568k668q65K782J85k499M56J747q68o76R75n39p78J801K27
$$ 287 -1777 285 1853 -815 -1680 1102 1287 -1212 -756 991 123 -553 422 -117 -895 906 1133
1380A133k785M41L552j184l857J843L743k220l249K194K494j830j491R80N02K03
$$ 1133 -1652 -1211 2341 1157 -2700 -857 2886 666 -2583 -389 2105 275 -1216 -236 266 469
1396D69K82j570q88K963J137m156j120M939R31n262n94N058L04m302j31L077K70
$$ 469 751 -819 -1707 1256 2393 -1763 -2883 2056 2987 -2275 -2869 2189 2493 -1809 -1940 1137 1407
1413A407j558o73n1J356J596k261k807L164L613l925l957M413L817m474l346L961
$$ 1407 -151 -824 -875 481 2077 -184 -2991 173 3786 -139 -4096 317 4134 -340 -3686 275
1429B75K698l026j993J632J383k7r21j706P07L336p66m611J088N355j372n565
$$ 275 2973 -53 -2046 -414 969 942 21 -1685 -978 2358 1592 -3019 -1931 3424 2052 -3513
1445c513J642N226j751m320J535L070r40j659M5L09J046Q21k212j671L396J949
$$ -3513 -1871 3355 1604 -2716 -1181 1889 949 -710 -665 -356 690 1511 -701 -2372 1024 2973
1461B973m259j887M691J501m689q96M148K24l111K89J757n62k28N20j237j14K419
$$ 2973 -1286 -3173 1518 3019 -1670 -2566 1582 1806 -1305 -1016 741 179 -49 471 -766 -880 1539
1478A539n16l133J270L367j934l139K508K336k727j257K556P4k060J064J192j912
$$ 1539 1023 -2110 -840 2527 593 -2546 -38 2298 -429 -1686 870 944 -1116 -52 1140 -772
1494g72j86K384q49k389J707J913k240j114K327J37k042R84J314j911k54K590
$$ -772 -958 1426 577 -1812 -105 1808 -432 -1546 781 918 -1124 -140 1174 -737 -991 1599
1510A599r52k846K045K742k825k300L228J585l073q06K375O7j218M33k62o23J816
$$ 1599 647 -2199 -154 2588 -237 -2537 691 2276 -797 -1603 772 839 -379 54 -208 -831 985
1527I85M45l240n3M360m99n032J070N160j535m675J646L735j287k514O14J121
$$ 985 1430 -1810 -1863 2497 1998 -3034 -1964 3196 1661 -3014 -1368 2367 1080 -1434 -820 301
1543C01N44J28j848j230L282J971m559k291N411K308n785k095N584J747m805j470
$$ 301 845 973 -875 -2105 1177 3148 -1411 -3702 1709 4017 -1768 -3863 1721 3468 -1337 -2807
1559b807L474J299j754j356j92J678K051k195l661K875M731l421n269L799N319
$$ -2807 667 1966 212 -1144 -1336 342 2393 198 -3463 -588 4143 722 -4547 -748 4571
1574D571l859m805L457L967k522k963J192J923M52j041k239M29L887j41n231J12
$$ 4571 712 -4093 -636 3331 809 -2154 -962 961 1413 372 -1867 -1438 2449 2308 -2923 -2811
1590b811O056l01o272N15N873o42m948N83L533k20j894m23K41J363J195k356k255
$$ -2811 3245 2944 -3328 -2813 3060 2418 -2530 -1947 1586 1366 -528 -951 -710 653 1848 -508 -2763
1607b763L314K886m075k989M518K651m448k074L942J272k963m71J544n4q7L98
$$ -2763 551 3437 -638 -3627 891 3542 -906 -2980 962 2234 -729 -1200 344 290 203 601
1623F01j442l87K734L0l569M75L904j085l673J631K931j939j848J978N04j611
$$ 601 -841 -1228 1506 1536 -2033 -1558 2346 1261 -2412 -781 2150 211 -1637 341 845 -766
1639g66Q20R66j894j02K598q10k796J545K566k130j842K285Q18j940K65J200j293
$$ -766 54 1020 -874 -976 1622 812 -1984 -439 2127 -3 -1845 440 1258 -682 -417 783 -510
1656e10k07K119r21k640K001K749k857k484L319J966l249j295K658O34j574o1
$$ -510 -717 1402 481 -2159 -158 2591 -266 -2750 569 2535 -714 -2009 649 1283 -291 -352
1672c52J34k11J386K92k905r1M139k78m971P44N244j132m939J172M229j012l069
$$ -352 -218 -429 957 1249 -1656 -1747 2392 2114 -2857 -2113 3131 1999 -2940 -1768 2461 1449 -1620
1689a620M10J686N68l58j767q79L135J744m295k293N220K475n645k357N531K130
$$ -1620 -1210 476 1044 686 -1081 -1960 1175 2919 -1376 -3669 1551 4026 -1619 -3976 1555 3685
1705C685m833j862L598J683j943j650L1J873J796k256l400K704M642l237n253
$$ 3685 -1148 -3010 588 2271 328 -1322 -1291 582 2378 122 -3278 -574 4068 831 -4422
1720d422L446N395l441n011K992M318k224l299R51K265N60j289k159N08L754l3
$$ -4422 -976 4419 978 -4033 -1041 3277 1053 -2246 -1295 970 1530 241 -1918 -1410 2344 2311
1736B311n005j21N773J61o053q3N773j5m855j07L647K71k043q00L68J563J054
$$ 2311 -2694 -2815 2958 3119 -2934 -3017 2756 2741 -2114 -2221 1426 1697 -346 -1146 -778 785 1839
1753A839k372k229L210K891l832l156M157K977m074k483L586J755k641r87J373
$$ 1839 -533 -2762 448 3339 -493 -3649 508 3485 -589 -3072 514 2269 -372 -1359 14
1768A4L28J47R2j609j80K789O0l603K49L941o64l772J041L077j232k044J213Q16
$$ 14 342 489 581 -1028 -1208 1581 1641 -1962 -1713 2228 1564 -2208 -1167 1910 678 -1366 -153 663
1786F63r85M75M66j584K13K374r34k758J555K673j941k193K022J407j721m23J082
$$ 663 -322 153 619 -965 -752 1622 688 -2070 -515 2158 217 -1976 46 1453 -268 -691 391
1803C91n65j22J344q97j946J999K167k849k117L346J767l365j271K830Q03j921
$$ 391 -174 -296 1048 151 -1795 204 2371 -478 -2595 751 2518 -847 -2118 712 1515 -406
1819d06l84N99J70Q45j35k299L81L500p03m326J029M724j248m645J321M064j054
$$ -406 -790 -191 -21 824 689 -1610 -1229 2271 1568 -2758 -1729 2995 1747 -2898 -1577 2487 1433
1836A433l124M22K004M58p65j637k62K799J104l871j749M779K020n234k088N185
$$ 1433 -1691 -1269 735 1193 428 -1209 -1471 1328 2432 -1439 -3188 1591 3611 -1623 -3711 1474
1852A474J970m623j828L562J769k127j801M48K024J208k309k754K733L940l093
$$ 1474 3444 -1179 -3007 555 2324 197 -1604 -1156 868 2076 -233 -2987 -254 3686 593
1867E93m645L263M906l180m698K763M166j998l352Q67K421M86j540j988P91L401
$$ 593 -4052 -789 4117 937 -3761 -998 3168 1170 -2182 -1315 1106 1592 52 -1936 -1145 2256
1883B256k65m570k1N305J38n534k07N300K33m563l12L395O20k003j082N54J693
$$ 2256 1991 -2579 -2600 2705 2843 -2691 -2898 2402 2635 -1928 -2240 1155 1775 -228 -1310 -756 937
1900I37P82k347j873L020K588l480k941L709K894l597k538L073J982k206j383
$$ 937 1719 -628 -2501 519 3107 -373 -3314 395 3289 -308 -2846 227 2209 3 -1380
1915a380J060P88K18l59j496J48K582j34l341K64L691m59l590O96L045p63k112
$$ -1380 -320 468 686 327 -1169 -1021 1561 1427 -1914 -1650 2041 1582 -2008 -1312 1733 970 -1142
1932a142O43J016l92J72n0j236O15J986j170k420J638K502j987k154J946J578
$$ -1142 -499 517 125 297 247 -989 -374 1612 442 -1978 -340 2162 175 -1979 -33 1545
1948A545j573q63R17Q5q2O14r13j139J893J431k636j483L081J382l144j143K831
$$ 1545 -28 -891 26 111 29 643 -270 -1409 484 1915 -721 -2204 877 2259 -885 -2028 803
1965H03Q70k102o30J027N11K34n60j474P17K615j006l471J258L937j473l989J451
$$ 803 1673 -429 -1059 -32 479 713 153 -1321 -604 2011 1005 -2466 -1208 2729 1256 -2733 -1282
1982a282L605j143k936N66K080K47j134j254K50K371M85l366j026M169J369m621
$$ -1282 2323 1180 -1756 -1190 890 1137 3 -1251 -1001 1370 1855 -1511 -2537 1632 3001 -1620
1998a620j475M591J541m169j534L321J561k151j682P47J916O59k228j957K571
$$ -1620 -3095 1496 3037 -1132 -2666 655 2216 65 -1617 -870 1046 1705 -523 -2480 91
2013I1K987k849l735K996M097k964m013K553L688j846l105Q90K381L18j711j575
$$ 91 3078 229 -3506 -510 3587 623 -3390 -837 2851 1005 -2100 -1210 1171 1489 -222 -1797
2029a797J104K795o16l808L02M483n7m775q8M595K01l972m24L068O87j902j135
$$ -1797 -693 2102 1486 -2322 -2020 2463 2406 -2369 -2457 2138 2339 -1633 -2057 1011 1698 -204 -1339
2046a339O74J670N06k274j436K754K102l107k469L256K524l097k307K649J893
$$ -1339 -665 1005 1511 -763 -2199 555 2657 -450 -2919 337 2861 -236 -2543 106 1999
2061A999j861j457Q92J037K31o95j335M66K275l97k923M06L222m32l185M62K762
$$ 1999 138 -1319 -427 610 841 146 -1189 -723 1552 1155 -1768 -1362 1860 1428 -1757 -1295 1467
2078A467m18k089K55J174L8j72m57p17R23J475j400j926J750K092j890k001J839
$$ 1467 1049 -1040 -785 389 427 255 -202 -919 4 1479 79 -1847 -97 1995 105 -1896 -57
2095e7J628j461j113Q73N07n7Rq05m64J666P11k360q00K751Q26k899p54K683O30
$$ -57 1571 110 -1003 -130 377 320 329 -476 -940 726 1437 -923 -1723 1028 1854 -1045 -1799 884 1514
2114A514k065o19J275O22k74p40p77R96J710j274k426J483K970j648l117J596
$$ 1514 -551 -1170 105 727 453 -287 -1064 -68 1642 368 -2058 -575 2395 747 -2370 -774
2130g74K981j339k613Q16K066r9j377q38P59J769k02k639k86L350O02l773q21
$$ -774 2207 868 -1745 -929 1137 1038 -339 -1177 -418 1351 1149 -1490 -1776 1574 2176 -1597 -2418
2147b418L881R62l635j045K975J224k099j391J003J708J12k025j137K335K055
$$ -2418 1463 2425 -1210 -2255 720 1944 -155 -1546 -543 1165 1277 -748 -1885 450 2505
2162B505k651k674K794L014k658l176K350K998j774k643R35K236K2j769j112J321
$$ 2505 -146 -2820 -26 2988 330 -2846 -496 2502 728 -1915 -980 1256 1278 -491 -1603 -282
2178b82K138r58k973O79L536m08l841J97L831j0l399l04K773O16j879j055R00
$$ -282 1856 898 -2075 -1396 2140 1732 -2109 -1912 1919 1909 -1490 -1794 979 1595 -284 -1339 -439
2195d39J541N3j980q90K395J503k667j914K758K041k607j978K182J786j564j483
$$ -439 1102 1155 -825 -1715 680 2183 -484 -2398 360 2401 -206 -2184 -2 1784 220 -1263
2211a263P30J159K24r60j073P68J887o59k457O00K744n28k732M45K432k77j915
$$ -1263 -533 626 850 -110 -1183 -415 1472 813 -1644 -1044 1700 1172 -1560 -1115 1317 1040 -875
2228h75K0J233L14m78o70k78J074R08j443j394J715J623j806j687J717J514j377
$$ -875 -855 378 692 214 -456 -734 340 1248 -195 -1589 126 1749 -57 -1744 -27 1487 110
2245A10j234Q47Q92j89m88n98K07J310O6j914k31K346L15k513l37K361L98j967
$$ 110 -1124 -277 615 426 -62 -660 -453 857 923 -991 -1222 1124 1439 -1074 -1411 950 1348 -619
2263f19n22J378O45o32q39j83J100R50j388j577J577K050j704k279J646K314j402
$$ -619 -1141 237 882 250 -589 -772 328 1278 -110 -1687 -110 1940 236 -2043 -397 1917 515
2280E15k142R59J858l70j423m09J041J207o53j969L28K576j4k999k15L130M23
$$ 515 -1627 -668 1190 820 -603 -1012 29 1236 583 -1386 -1058 1518 1504 -1495 -1710 1420 1843
2297A843k991o93K630Q75j975j143J175J449l17j768n08K050J237k252j809K386
$$ 1843 -1148 -1841 789 1664 -311 -1454 -279 1170 853 -915 -1423 627 1864 -388 -2197 189
2313A89K164k301k344K037K322j544k187Q92J967j52j614p47J341J585j102k238
$$ 189 2353 52 -2292 -255 2067 523 -1664 -772 1195 1043 -571 -1318 23 1608 506 -1732
2329a732Q20K794o32l080M04L053j38k799j71K298N36j672r49R58J380k16j765
$$ -1732 -912 1882 1250 -1830 -1426 1627 1489 -1310 -1481 817 1353 -319 -1268 -310 1070 854 -911
2346i11m54K096R70k288j328K299J606k172j634J788J574j209j465N59J267J38
$$ -911 -1365 731 1701 -587 -1915 384 1990 -182 -1816 -28 1546 337 -1128 -569 698 836
2362H36j057q77Q91J488p23j997O08K250m83k268L04K098j13j674j91J199M71
$$ 836 -221 -1098 -207 1281 558 -1439 -831 1419 936 -1332 -1028 1070 957 -717 -908 291 762
2379G62n95q20L0J165M83j411r34J607J206j656j301J497J337j233j216P93R82
$$ 762 167 -653 -623 542 1025 -386 -1320 287 1493 -163 -1464 33 1370 137 -1079 -286 696
2396F96j94p99m39O11J029m04j560K25J932q6k052r2K009K50j752m20J336O72
$$ 696 502 -297 -736 -125 904 500 -1060 -835 1097 1011 -1041 -1133 876 1126 -626 -1046 290 962
2414I62q74q41K27J088M28j371q92J503J324j606j575J519J720j309j713R36J559
$$ 962 88 -753 -526 562 990 -381 -1273 230 1554 -52 -1627 -108 1612 303 -1410 -474 1085
2431A085m26j406j52J167P53q45j402O40J867l50k268J74K397Q1k361l22K110
$$ 1085 659 -747 -899 268 1021 176 -1226 -586 1281 931 -1337 -1163 1234 1315 -1046 -1368 742
2448G42N96j711q76J186J175n48j477o8J716O26j918j056J959J435j923j628J632
$$ 742 1338 -373 -1249 -63 1112 564 -913 -981 735 1361 -557 -1613 346 1781 -142 -1770 -138
2465a38J787j322j712P72J621j95j456m22J249J098j100j584Q50K056o77k248
$$ -138 1649 327 -1385 -613 1008 813 -643 -1065 184 1282 182 -1402 -552 1504 827 -1421
2481a421M22K295j81k166q4J859M33j434q01R42J134m24j434q7J699M83j819q50
$$ -1421 -999 1296 1115 -1051 -1135 724 1157 -277 -1078 -136 998 574 -860 -947 752 1235 -584 -1434
2499a434J861J040j681j226J434J231r80j231M95J151P8j058o67R81J122q15j473
$$ -1434 427 1467 -214 -1440 -6 1225 245 -986 -491 660 738 -320 -987 -6 1116 301 -1172
2516a172O55J719m99j785L15J687p7j448k22J100N30p07q05K22J097J46j282m81
$$ -1172 -517 1202 703 -1082 -767 920 843 -605 -827 273 803 96 -709 -487 610 756 -526 -1007
2534a007J399P58j396r43J277J046j074j003O74R90k44q83k63Q04P10o81j100
$$ -1007 392 1150 -246 -1189 88 1134 60 -943 -269 721 477 -406 -669 135 845 164 -936
2551i36N62J392l83j592K21J585j1j483k03J222M32q46p45M76R70m5j183l43J302
$$ -936 -374 1018 635 -957 -736 849 838 -645 -848 374 806 -40 -785 -309 661 616 -567 -910 392
2570C92P60j446r53J371J140j178j228R14J220n18j199J03J089L78r69q59Q12
$$ 392 1152 -294 -1247 124 1264 86 -1142 -228 992 474 -725 -622 467 845 -124 -983 -171
2587a71J267o62j553M87J698k63j731J5J636K41j387n25J060P87o55j108K95J317
$$ -171 1096 434 -1119 -632 1066 803 -928 -913 723 964 -423 -948 112 899 244 -864 -569 748
2605G48J29j505m63J578P59j527r87J387J131j095j219P14J235k82j190j88J096
$$ 748 877 -628 -1091 487 1246 -281 -1268 119 1250 155 -1064 -350 885 603 -587 -775 321
2622C21O42r97j056Q68J359p12j543N06J601k70j544K2J362K89j134n60Q25Q17
$$ 321 963 -34 -1090 -222 1137 425 -1118 -612 989 719 -825 -803 559 848 -286 -846 -21 796
2640G96m51j121J61J315J15j353m27J410N73j309p37J076R13q02r21L73R69k5
$$ 796 345 -776 -615 700 815 -538 -965 445 1018 -291 -1028 48 961 159 -762 -389 580 555
2658E55r12m17Q96P59q16j021O98J178n02j253L06J224o8j095j77Q74M46o20o86
$$ 555 -357 -774 122 881 65 -956 -258 920 418 -835 -529 695 627 -468 -645 229 675 55 -631
2677f31L49R05n2j083j80J127L89j135n36R99O92q17p99N61Q21k27q36j22Q09
$$ -631 -282 623 571 -512 -692 435 824 -311 -847 152 844 27 -772 -211 610 383 -453 -575 234
2696B34M33p31p36O71R52n15j113L76J174k12j098l3J015K68q02n13N29P66l01
$$ 234 667 -64 -800 -129 823 308 -805 -429 745 533 -565 -598 417 685 -117 -630 -101 665 364
2715C64r57L9J100K15j165m46J125O19j026p31P98Q34n33q87J79R58J22q91m76
$$ 364 -593 -554 546 761 -404 -850 275 894 -132 -863 -65 769 236 -651 -472 486 608 -283 -759
2734g59Q51P62p52r83O20J132m30j185K45J145oj066k51R02M99o56p88M30R56
$$ -759 92 854 102 -881 -261 871 441 -744 -499 646 640 -426 -677 225 724 68 -720 -290 666
2753F66k01j083l9J160K82j171m71J110N92r14p20O46Q38l78q79N2R01K86q99
$$ 666 465 -618 -657 503 785 -386 -857 253 845 -69 -789 -143 695 317 -562 -510 391 677 -222
2772b22n70Q39P99p17r67N87J045l92j046J41R95N2q32l61P05N80m94q21L20R44
$$ -222 -792 47 846 129 -838 -251 794 402 -644 -503 492 544 -288 -649 56 636 142 -679 -359 585
2792E85j11j041n9J067K41r63m03Q27N16o06o33L82P13j32p62j44P63M22p32o23
$$ 585 474 -567 -626 441 682 -281 -684 143 659 53 -580 -198 515 383 -379 -523 240 662 -70 -693
2812f93O75P20n50q08L80Q27j45q27k4O69K94n97m89M28O62k35q28J04R02Q6q96
$$ -693 -18 702 152 -656 -276 551 406 -421 -445 224 518 -79 -568 -140 522 287 -541 -437 465 551 -345
2833c45k51Q26L92o82m96M85N96k70o72L5P20J97p23l97O65N75o08p19N06Q06
$$ -345 -596 230 622 -60 -556 -71 525 255 -417 -382 338 535 -188 -585 80 655 47 -672 -166 640
2853F40l72q04J36P58J27p17k94N60M95m20o58K73P85o5q88r0R24K06q47l40P15
$$ 640 268 -536 -400 358 485 -232 -526 34 529 109 -549 -276 509 444 -444 -534 390 596 -251 -591 124
2874A24M57n12n77K96O71o2p41j74P64L68p44n54O93O56n53p72M37P80k38p31
$$ 124 581 69 -508 -212 459 397 -344 -518 246 614 -130 -684 9 665 112 -660 -223 557 319 -412
2894d12K5O23K61o14m66N21O44l66p62K34Q69j26q87l0Q41K16p70l33O05M53l88
$$ -412 -387 236 497 -117 -583 -62 582 216 -546 -312 557 431 -456 -486 355 571 -199 -532 73 526 138
2915A38o00J97O77j3p12k02P47L62o89n04O14N66m69o40L09O45p3o60j13O04K94
$$ 138 -462 -265 412 399 -313 -515 232 594 -95 -599 15 581 112 -528 -219 426 353 -307 -420 184 478
2936D78m99m95M18O20l03o98J54P59m9o89j18O43K27n08l22L09M75k09n41J4O13
$$ 478 -21 -516 -98 522 219 -479 -325 434 385 -304 -422 221 448 -60 -382 -73 402 193 -348 -334 279
2957B79J52o33k83O35L78n61m45M06N30k72n48J14N26O1m48k80M15M37l41n66
$$ 279 431 -202 -485 150 528 -33 -478 -72 458 186 -362 -248 278 339 -109 -389 26 463 122 -444
2977d44K55O42j86o31QO30J15n83k17M65L25l05m48J40N39L1o13j44O08K96n72
$$ -444 -189 453 267 -364 -356 274 389 -194 -411 54 379 74 -374 -234 305 336 -277 -421 187 483 -89
2998h9l80M93M79l93n66K79N51j16n05j17N28K32m16m41L70N71l17o01J79O44
$$ -89 -469 24 503 110 -456 -177 374 258 -247 -364 164 396 -20 -461 -91 480 163 -438 -259 385
3018C85n9o68m4N99K09n16l22L69M24j88n47N0O51P5o67k08O40L34o02m09M79
$$ 385 326 -342 -386 213 422 -94 -416 -47 377 189 -358 -308 343 418 -249 -457 183 517 -85 -494 -15
3039a5M72l30m93J41N19L6n41j95M64M03m41n02L49O13k94o32J82O31m3o21o8
$$ -15 457 127 -366 -225 294 330 -211 -406 58 461 20 -482 -133 480 186 -446 -264 367 324 -297 -365
3060c65N37K36m29l68L12M56j50n41kO00Q7o19j87O07K41m78l64M10L99k68m30
$$ -365 172 408 -21 -389 -77 379 229 -312 -314 286 373 -246 -433 174 415 -63 -427 -17 382 114 -316
3081c16R3M50Q3m49k56M56L46l39m94L11N25k24n53J42N33k5m74j09L81K32k66
$$ -316 -223 227 310 -139 -395 61 407 68 -426 -115 410 186 -367 -225 308 283 -191 -300 81 313 47
3102D7l43J68M33n6n27m0N31J28n15k17M50K96l66l20K37L84j01l71q4L70K12
$$ 47 -296 -128 305 249 -278 -318 213 341 -174 -391 59 355 -11 -331 -94 290 189 -182 -266 104 316
3123C16l82l05L33M09k68m66K24M75j01m83K7M09R0l36k19K58L25j61m40O7M84
$$ 316 -66 -371 -38 371 103 -363 -139 336 235 -248 -221 188 278 -58 -277 -19 306 145 -295 -228 256
3144B56N0n33j37N07K28m57k85L45L25k13l88J10M16L0l68k02L87L15l48m27L32
$$ 256 306 -227 -364 143 371 -86 -371 -26 299 86 -302 -192 224 254 -114 -316 71 386 38 -389 -57
3165e7M65k63m52J16M64qm58r2L86K26l03l43K03M28j04n24K7N31P2n41j47N04
$$ -57 408 145 -307 -191 273 265 -193 -285 101 327 24 -319 -116 312 208 -316 -289 242 314 -227 -374 130
3187A30K36m16l03L12L45j45m17L3M22J43m35k74M24L45l68m17K95M54k04m93
$$ 130 366 -50 -353 -41 304 159 -258 -225 197 340 -95 -369 55 400 32 -385 -90 364 160 -333
3207c33J30M35K5m14j53L58K96k82l60J52M55p0n37L3N44M4m69j69M44J96l49
$$ -333 -203 232 257 -157 -310 48 344 62 -298 -146 309 239 -298 -265 279 323 -146 -315 129 325 -24
3228b4k70K25L19q5l57l9M08J58m45k37L60L44l30l75K77M08k02m06P6L54P5l17
$$ -24 -294 -69 250 165 -192 -231 177 335 -110 -347 13 357 27 -348 -71 337 135 -271 -195 159 234 -83
3250h3j82K50L12k07l71J14M37k3m67kM11R1l86j41L15K11k23k96J17L39J4m20
$$ -83 -265 -15 297 90 -281 -167 270 247 -220 -222 189 280 -106 -247 68 279 56 -240 -123 216 230 -190
3272a90p5L70J97l55k72K94L55k69l48J77L21k1l46l9K88J74k90k27K04L47j35
$$ -190 -265 105 302 -53 -325 -31 324 55 -293 -116 205 184 -162 -201 87 261 -29 -256 -52 295 160
3293A60m06M5M39M6m51j08L91J79l22k61K35L00j25l58K7L78J06l90k03L86K91
$$ 160 -246 -201 238 284 -167 -275 116 295 -27 -288 -53 247 122 -236 -209 169 275 -115 -318 68 359
3314C59l38l54K50L75j71l96P3M03K7l52j35L19K31k31l50J53M34p5m87J0N20
$$ 359 21 -333 -83 292 121 -275 -202 201 228 -124 -259 60 291 60 -290 -137 297 222 -265 -255 265
3335B65K4m35j24L55K15k80k97J83L36l8m27k8M18J34l91k45L76L24l01l97K16
$$ 265 289 -146 -270 85 300 20 -277 -94 242 204 -223 -251 167 301 -90 -335 41 365 64 -333 -117
3356a17M17j39l75LL70J18l36k46K87L23k06m29J72M53p4m77pM70O9l88j63L13
$$ -117 300 161 -214 -211 159 277 -59 -305 -18 305 99 -330 -158 295 221 -256 -263 207 276 -112 -275 38
3378C8K57k35l23J30L60Rm15o9L95J62l77k28L39L10k91l43J82L53q0l10r6L30
$$ 38 295 60 -263 -133 227 236 -179 -248 147 309 -68 -296 43 353 62 -281 -99 254 174 -136 -232 98
3400I8J59l13k28K31L24j65m03J31M05l1m45j0L53J47l01k27K63K64j28l51N7
$$ 98 257 -56 -284 -53 271 106 -297 -166 239 208 -237 -247 106 253 -48 -275 -12 252 124 -227 -170
3421a70L70O6m29j24L72K17l45k66L10K98j52l84P9L32L3l19j47L05K03k19k91
$$ -170 200 266 -163 -287 85 302 -43 -309 1 299 147 -237 -158 174 207 -112 -259 46 249 30 -261
3442b61J23M23j60l75M6L80P4l87j26L35J85k43k49J31L39l4l86l1L70R9l45k15
$$ -261 -138 285 125 -250 -204 176 250 -137 -263 72 257 14 -235 -104 235 201 -185 -216 154 253 -92 -307
3464c07L32L17l11l02J62L60o6l62k1L10J24l02k08K70L07k29l69J50M20m7m28
$$ -307 25 342 31 -271 -109 251 185 -177 -198 112 236 -66 -274 -4 303 74 -295 -145 275 228 -200
3485b00m1M03J00l25k10K75K64j88l18R7L58J0l89j17L89J85l31k92K99L42k58
$$ -200 -241 162 262 -63 -273 2 266 78 -240 -143 215 225 -164 -281 108 293 -38 -330 -31 311 53
3506E3l15J40L44j0l63j20L42K27l12k74K25L58j60m10Q4M51l5l93p8L66J69l21
$$ 53 -262 -122 222 212 -151 -271 71 298 -14 -288 -63 295 135 -275 -191 260 225 -168 -246 120 289 -32
3528c2k52K34K91j00l55kL81J02l89k00L90K45l17k87K40L22j33l27L3L54L6l17
$$ -32 -284 -50 241 141 -214 -216 165 267 -122 -322 68 313 -4 -291 -51 271 138 -189 -156 198 234 -83
3550h3j86L00K93k84l15J97L50j07m09K4M11N3l60j32K90K13k33l12J73L53o2
$$ -83 -269 31 324 40 -275 -78 272 165 -244 -220 191 244 -116 -248 42 255 22 -290 -117 236 174
3571A74l88l7L76J62l90k01L21K77k49k98J40L35l3l53m2L58J23l09k34K49L03
$$ 174 -214 -251 125 287 -103 -304 17 294 45 -253 -113 222 189 -164 -206 152 275 -34 -268 -19 284
3592B84j82l63J25L52ll89m7L31J44l01k18K37L03j93l19Q1L56O1m25r8L35K22
$$ 284 102 -261 -136 216 213 -176 -223 108 252 -49 -267 -30 273 80 -239 -158 198 259 -166 -264 71 293
3614B93l42k43K50L37k11l02O0L48L5l40j44L26J98k48k86J91L48j37l61M4L70
$$ 293 -49 -292 -42 295 84 -218 -158 190 225 -115 -259 67 265 17 -269 -78 270 133 -228 -184 186
3635A86N9l82r1L07J86k35k68J56L28r1l37k2M11M8l45j78L07K41k51l06J98L32
$$ 186 245 -137 -228 79 265 30 -238 -82 246 155 -182 -204 207 255 -90 -268 39 280 29 -277 -79 253
3657B53j04l51j1L40J21l34k04K59L08k37l24J47L78q3l64k7L59J21l01k20K87
$$ 253 149 -202 -213 127 248 -86 -290 -31 277 40 -284 -137 241 158 -206 -233 126 247 -54 -274 13
3678A3K78j96l40J17L50k5l50q1L64J48l26k35K85K76j97l39J05L37J5l53q5L38
$$ 13 291 95 -245 -128 222 197 -153 -234 130 278 -48 -283 2 278 81 -258 -153 184 199 -154 -239 99
3700I9J65l04k18K21L13j61l44J02L30ll48p7L26J56k73k50K31K94j32l50O1L48
$$ 99 264 -40 -258 -37 276 115 -229 -127 203 200 -148 -225 101 257 -16 -266 -35 259 127 -223 -162 186
3722A86M6l40j49L53J90k91k50J55L32j12l64K9L59R9l62j54L23K33k37l04J67
$$ 186 232 -108 -257 96 286 -5 -255 -100 232 120 -244 -215 144 243 -119 -273 50 283 46 -258 -91
3743i1L25j09l34K9L44Q6l40j61K98K16k06l03J26L59n6l52m9L45J20l28j79K81
$$ -91 234 125 -209 -180 164 250 -90 -251 47 263 57 -246 -120 239 183 -169 -218 127 247 -81 -260 21
3765B1K44k36k83J39L45o8l41j3L09J28k80k27K53K80j61l32Q3L67l1l60q3L44
$$ 21 265 29 -254 -115 230 162 -179 -192 117 245 -35 -262 -9 271 110 -222 -139 228 197 -163 -246 98
3787I8J61l12j93K17K68j55l22P2L25L3l56n2K95J87k46k75K25K60j20k95N4L22
$$ 98 259 -53 -246 -29 239 84 -238 -166 159 192 -164 -216 79 266 20 -255 -30 230 110 -185 -131 191
3809A91Jl03j12K87J82k53k57K04K85j19l21M3L24N5l32j26K93J92k44k64J87
$$ 191 192 -111 -223 64 246 -7 -264 -60 225 106 -215 -172 152 207 -125 -251 42 234 -10 -274 -87
3830h7K96p4l22j7L42Q6k88j84K92K27k39k48J36L29r4l04l0L21R0k85k03K88
$$ -87 209 135 -187 -204 138 224 -64 -248 44 271 32 -216 -80 249 155 -149 -179 142 232 -53 -256 32
3852C2K34j95k83J26K84k1l38l4K98J08k86k01K61K43j68k93J09L02jl19r3L30
$$ 32 266 71 -212 -86 198 177 -161 -195 103 211 -75 -276 -15 228 60 -233 -124 178 177 -142 -235 95
3874I5J66k93k36K53K83j63l22R5L41k4l33o2K57J85k41k28J84K75j29l30P6L32
$$ 95 261 -32 -268 -15 268 105 -217 -122 219 195 -138 -200 57 242 1 -227 -43 232 103 -227 -151 181
3896A81J7l48n5K75J89k76k32J93K93j57k78QL56L8l01j29K77J95k41k35J73K80
$$ 181 198 -150 -205 70 259 -17 -249 -56 237 80 -198 -190 166 204 -97 -226 51 246 5 -230 -57 223
3918B23j04l34L6L28O8k99j21K34K15j93k86J67K93q2l22JK92Q4k68j60K55K09
$$ 223 119 -215 -179 149 217 -82 -203 31 246 53 -233 -66 227 145 -177 -176 116 200 -68 -228 27 236
3940B36k04k43J29K73m8k87m6K93J24l00j56K42K45k12k85J02L25n6k84m5K57
$$ 236 32 -211 -82 191 143 -144 -190 103 227 -73 -229 13 258 46 -239 -137 188 132 -152 -197 60
3961F0J70k75j72K33K14j35k91Q8K88jl07p3K91J60k37k15J60K54j15l03N7L20
$$ 60 230 -45 -217 16 230 95 -196 -108 180 179 -128 -201 90 250 13 -202 -42 212 97 -206 -149 171
3983A71L1l27j07K85J91k50k34J77K94j43k68K0L03M8k93j54K82J97k06k30J39
$$ 171 202 -125 -232 53 244 -6 -240 -63 231 88 -180 -160 143 191 -102 -256 26 223 17 -213 -74
4004g4K93j04l00j1L36O3k80j27K30J95j84k88J50L07m8l50rL16J15k88j67K33
$$ -74 219 115 -185 -196 140 203 -77 -204 26 221 37 -251 -101 206 158 -192 -201 115 230 -58 -225 8
4026HK15j69k64J09K77j9l26j7K80J22k66j62K31K07j41k69P5L14n2l20l0K90
$$ 8 223 54 -210 -101 176 157 -169 -186 94 216 -50 -212 19 226 85 -184 -109 205 153 -167 -197 93
4048I3J37k67j88K01K53j48k85R1K79Rk96j06L16J21k48j88J99K85j61k96P7K83
$$ 93 230 -37 -225 -24 229 81 -204 -113 166 175 -121 -227 89 210 -38 -226 -27 258 97 -199 -122 161
4070A61K5l10p4K59J70k71j88J92K25r9k43lK74P7l28r0K54J87k25j95J33K68
$$ 161 186 -124 -198 61 231 -40 -228 -36 189 90 -153 -156 118 195 -133 -223 31 218 -7 -202 -69 199
4092A99r5k58qL08P8k76j51K33K14j95k54J34K63q0k80J5K72P7k60j37J87J88
$$ 199 104 -154 -162 146 224 -52 -203 30 244 49 -205 -71 192 112 -168 -153 119 196 -64 -201 -14 174
4114A74j38k41J04K66n1k67j7K70J11k64j58K18K05j69k14P8K97l6l05n0K63J40
$$ 174 36 -205 -101 165 114 -153 -170 100 211 -53 -211 7 212 43 -171 -93 204 168 -137 -187 76 216
4136B16k24k17K10K32j08k94M6L22k7k82m9K23J45j94k23J87K28j23k64N3K97
$$ 216 -8 -225 -15 217 109 -185 -139 183 156 -126 -175 48 193 -1 -224 -37 191 68 -196 -143 154
4157A54K5k85j04K90J42k02k59J81K70j02k69OL05N0k75j45K58J70j89k23R7K91
$$ 154 179 -106 -210 80 222 20 -239 -58 212 110 -159 -153 152 202 -73 -218 40 210 21 -202 -105 186
4179A86n5l33O5K62N8k55j25K24J93j86k45J16K93n1l24%K88J12k87j76K57K19
$$ 186 131 -202 -137 125 183 -72 -197 27 220 34 -211 -95 198 147 -177 -177 111 223 -64 -240 17 236
4201B36k08k20J00K91n6k89n0K92J08k42j85K36K01j33k94J08K86k1k87n2K82
$$ 236 28 -192 -92 199 143 -146 -196 96 204 -38 -223 13 214 81 -213 -105 181 160 -127 -179 103
4222A03R7k48j65K01K35j33k68P1K92j5l04m5K75J16k36j86J85K13j29k49N5K58
$$ 103 200 -48 -213 -12 223 90 -178 -107 185 170 -134 -179 96 212 -24 -210 -25 188 59 -190 -135 123
4244A23L2k53r9K55J18j82k10J36L01j04l26P3K78J9k40j23K37J53j67k04J33
$$ 123 155 -98 -197 58 176 -6 -216 -80 221 117 -209 -136 142 161 -79 -202 35 188 21 -183 -50
4265e0K21n1k50kK50N4k46j38K52J47j48k27J19K27l6k56J8K17O6k19j52K11J85
$$ -50 171 120 -130 -132 118 172 -74 -212 40 187 39 -188 -69 158 122 -134 -116 101 167 -52 -204 7 192
4288A92j13k90J10K59j4k83k3K37J10k19j57J68J90q3k66N5K87jk58n5K27J17
$$ 192 79 -211 -101 158 144 -139 -162 75 185 -34 -191 -23 167 84 -182 -127 160 159 -99 -154 73 190
4310A90k02k11K05K52j67k21M1K49L5k61j20K37J70j93k26J56K44o9k81J2L00
$$ 190 -12 -223 -18 234 67 -154 -113 136 171 -90 -210 27 197 4 -222 -66 178 109 -172 -160 140
4331A40K9k46r7J95J87j84j95J16K20l9k85j7L00O2k23j82K57J79j95k10J24K43
$$ 140 169 -77 -174 21 208 24 -171 -55 165 126 -159 -176 124 186 -37 -219 38 217 22 -188 -64 179
4353A79k6k88j1K55Q2k51j41K23J81j67k66J35K42k3k96rK71P8k18j49J79K02
$$ 179 153 -135 -146 109 191 -60 -201 22 203 36 -230 -95 147 124 -172 -181 90 168 -50 -199 -20 182
4375A82j24k60R7K46Ok57q2K64J34k38j89K13J98j15k42O7K40K5k48j00K32J42
$$ 182 58 -202 -105 141 147 -110 -192 72 206 -32 -221 -8 190 75 -167 -100 140 165 -83 -183 49 191
4397A91k04j80J49K29r0k63M3K50K7k80l6K09J55k19j62J30K04n4k46LK67M4k22
$$ 191 -13 -193 -44 185 95 -168 -125 125 152 -128 -164 45 200 -19 -181 -51 153 99 -147 -144 123 167 -55
4420e5j29K24J39j57k08J41K31q1k15j7K21P4k13j36J53K09j30k46R8K55m0k56
$$ -55 -184 40 179 22 -186 -45 186 105 -110 -127 94 168 -45 -181 -28 181 51 -195 -97 158 118 -138
4442a38NK34N4k06j20J70J67j27k15M3K88jk64l2K26J14k02j75J73J72r5k55P3
$$ -138 -133 101 155 -51 -171 -1 166 39 -176 -133 155 154 -110 -142 84 198 -4 -179 -6 166 71 -184 -111
4465a11K43j5j94p4K17J15j75j84J41K18q8k52KK95Nk26j00K21J50j88j90J37
$$ -111 132 117 -77 -151 66 181 6 -178 -37 181 93 -159 -157 138 143 -83 -183 38 188 0 -190 -53
4487e3K29r8k36L4K54M8k49j07J88J53j68j81R9K46o2k58NK45R6k27j47K16J80
$$ -53 176 78 -158 -124 130 178 -71 -178 10 163 -5 -186 -87 159 97 -161 -156 89 185 -42 -189 27 207
4510B07j75k05R5K64n9k62jK61N1k37r3J78J51j33k21P7K65lk80o1K52J07k34
$$ 207 32 -173 -78 186 127 -135 -136 125 176 -61 -154 24 175 42 -179 -102 163 160 -120 -181 71 178 -56
4533e6j44J93J97j23k25P8K16j1k29o0K28J37k13j60J50J95j07k17M8K60j6k29
$$ -56 -200 -7 190 67 -158 -80 136 125 -104 -164 64 201 -12 -172 -22 173 66 -151 -103 157 141 -88
4555h8n9K19R9j78j52J36J77o6k25L9K21K9k47q3K05J55j84j87J67K01r6k29J2
$$ -88 -147 72 171 -7 -159 -23 154 88 -137 -98 123 152 -95 -178 27 182 -2 -189 -22 179 83 -146 -134
4578a34K25M8j99r8J49J81j30j90R8J89k7k70QK63M0k04j06J86J33j02j86L5K10
$$ -134 91 139 -60 -158 -9 172 42 -148 -50 139 112 -158 -150 113 153 -51 -157 29 162 60 -126 -91 119
4601A19Jk23k0J98J15j97j53J30K15j61j89P1K35k5k10o4K15J47j88j84J24K24
$$ 119 120 -103 -123 75 190 -7 -160 -30 185 24 -165 -94 141 116 -94 -158 57 204 16 -168 -44 180
4623A80q0k69N0K51Kk37o0K25J03j78j78J42K14o8k35mK62N7k41r7K15J28j38
$$ 180 100 -169 -119 132 134 -103 -163 62 165 -13 -191 -49 165 97 -138 -142 120 177 -64 -161 54 182 44
4646D4k22J49K15p7k40L2J87Q9k20j10J61J87j40k22R7K62o8k64nK38P2k38j03
$$ 44 -178 -29 186 109 -131 -99 88 177 -43 -153 8 195 55 -167 -70 192 124 -140 -145 93 165 -73 -176
4669a76J67J89j52j94P1K26Mk38m7K24J16k26j28J68J96j48k21Q2K20%k17l8J88
$$ -176 -9 180 28 -166 -95 131 135 -103 -150 74 190 -36 -164 4 200 52 -169 -87 133 133 -84 -122 66
4692F6J02j83j28J29J70o3k63O3K17J6k47m0K27R8j83j43J30J84q1j94qK12N8
$$ 66 168 -15 -143 -14 156 93 -170 -107 110 126 -121 -161 66 164 -19 -162 -32 152 71 -123 -131 81 139
4715A39k29p5K13J26j59j81J39J58l9k08RK27Jj65q2J42J54j09k02N5K32o0k01
$$ 139 -90 -165 48 174 15 -166 -27 131 92 -116 -107 120 121 -44 -126 16 170 61 -141 -86 146 86 -115
4738a15kJ94P4k03q1J37J49j08j95M3K24J5k31p6K30J39k17j39J46J59q3j97N1
$$ -115 -117 77 151 -52 -133 4 153 45 -150 -107 117 132 -99 -175 55 194 -23 -162 -16 143 60 -137 -86
4761h6K14%j99q1J80J48j58j71J30K08q8k45J3K70Lk13o5J85J27j47j86R9K00
$$ -86 128 128 -71 -152 28 176 18 -153 -23 185 97 -148 -135 135 138 -75 -140 45 172 25 -161 -62 138
4784A38k6k22j7K13P5k12j46K04J67j73j87J21K15p0k07NJ95Q0j98j14J52J65
$$ 138 112 -110 -127 86 161 -51 -197 7 174 1 -186 -65 150 80 -127 -122 73 153 -45 -159 -7 158
4806A58j12k02Q0K13kk58oK20Q8k29r7J49J74j24k11O4K19qk31l6K20R6k05j57
$$ 158 46 -156 -76 137 135 -123 -129 91 179 -50 -147 2 176 52 -159 -95 124 116 -115 -151 69 165 -40 -197
4830a97J92J98j45k01O3K17Jk40l2J99J08j60j49J14K19r4k37O6K14%k41n4K22
$$ -197 -5 193 48 -153 -90 127 128 -112 -144 55 163 3 -146 -32 187 93 -144 -78 136 136 -105 -159 63
4853F3Q7j54j47J26J85p9k09J2K20L4j78q5J53J22j73j33J25J89r5j99N2J60N0
$$ 63 150 -4 -151 -25 160 81 -128 -116 104 138 -40 -125 28 150 -23 -156 -31 158 63 -136 -84 76 126
4876A26j64r8J17J61o7k10P3J90k4j95l5K21N2j74j04J18J55j10j47L0J70K5j64
$$ 126 -38 -136 -19 142 75 -135 -62 128 104 -91 -126 95 147 -27 -131 -13 142 32 -115 -85 85 110 -54
4899e4j06K04J28j86j60J54J65r0j91L9J83%j40p8J68R3j03j91J06K11n8k10m3
$$ -54 -160 44 172 -14 -174 -20 145 55 -136 -97 86 86 -54 -132 36 129 26 -165 -59 152 94 -116 -159
4922a59K55L6j89j05J99J15j49j45P8J86j5k16l2K40M4j72j50K20J53j23k41R1
$$ -159 96 132 -57 -162 37 152 3 -142 -64 122 107 -109 -141 99 143 -29 -179 41 194 71 -170 -79
4944g9K43p0k15JK18O1j88j29J57K08j31k34N5K25J8k65k8K43Q8k28j23K12J28
$$ -79 164 94 -121 -120 98 159 -29 -158 -1 207 76 -158 -103 122 140 -125 -153 90 178 -50 -173 39 167
4967A67j34j65M0K18K4k04j04K14J53k24j63J76J96j27k29J12J94qk53k8K21Q2
$$ 167 33 -132 -92 126 150 -54 -158 56 209 -15 -178 -2 194 67 -162 -50 144 136 -117 -145 76 158
4989A58j58j71J31K05q8k30L0K49Rk25o2J92J09j56j12O9J95p1j68QJ55O0j56
$$ 158 0 -171 -40 165 77 -153 -123 126 135 -90 -152 40 149 -7 -119 -50 145 74 -94 -86 69 129 -27
5012b7j10J29J87j53j75R5K13j15j56L9J25O4j72m6J18J21p7j84M4K07j8j80m2
$$ -27 -137 -8 179 26 -149 -54 159 44 -112 -73 52 116 -56 -102 16 137 60 -124 -80 127 109 -71 -113
5035a13J94N0j48j00J19J29r8j20pJ84Oj49r9J77J20j42j65R6K26q6j75J2J97
$$ -113 81 131 -17 -117 2 131 33 -87 -94 90 96 -53 -152 25 145 3 -162 -66 160 74 -101 -89 108
5058A08Lj57o6R9J58j09j79N6J95Nj89l7K04P4k13j08J68J59j59j52P7J74Lj94
$$ 108 111 -46 -112 -13 145 36 -143 -87 108 113 -76 -113 91 165 -48 -156 12 171 12 -140 -63 111 114 -80
5082h0n7J83J06j46j95J74J80j06k57J44J99k8k05m4J96P9j55j29J50J51p7k53
$$ -80 -137 46 152 6 -189 -15 165 59 -198 -54 145 117 -88 -132 64 143 -12 -141 9 160 83 -170
5104a70M3K62Nk53l4K31J00k18j00J39J44r3j91N3J89Qj74j10K21J13k00j38J55
$$ -170 -127 135 140 -113 -147 84 184 -34 -134 5 149 56 -135 -82 107 115 -59 -169 52 165 -35 -173 -18
5127a8K02j43k27J09J99k1k01k6J78Q5j33j49O2K38n3k26L2J96L4k30n0J99P3
$$ -18 184 41 -186 -77 122 101 -100 -126 52 137 4 -145 -83 155 102 -124 -92 104 138 -92 -142 57 130
5150A30j39j16J15J21l8j53l1J90M3j69j03J42J50j16k03J43J67r6j41J0J51N7
$$ 130 -9 -125 -10 111 73 -80 -111 79 122 -47 -150 -8 142 26 -177 -34 133 37 -104 -94 57 114
5172A14j38j06J23R7k9j62L1J48J0j58n4K05N7j59j12J34J18q6j28L2J28M7j23
$$ 114 -24 -130 -7 90 61 -101 -70 78 88 -70 -124 81 138 -21 -133 1 119 33 -95 -63 65 112 -11
5195a1j23J51J44j18j64P0J85l8k22L7J81%j26m8R5R9m9j77M0J66L4k36o3K33
$$ -11 -134 17 161 43 -121 -51 134 96 -126 -89 92 92 -34 -82 13 112 63 -114 -74 92 126 -110 -173 60
5219F0R5j88j42J81J53j32j47O9J40J6j35j05J66J39j64j77J28K47j27k45Q4K53
$$ 60 155 -33 -175 6 159 27 -120 -51 89 105 -30 -135 31 170 6 -171 -43 204 77 -168 -84 169
5241A69l8k24n0J99O9j46j37J16J78n6j98nK15N5k37r4K67J03k17j55K04J21r2
$$ 169 131 -93 -143 56 125 -21 -158 -42 136 80 -118 -123 92 147 -90 -184 83 186 -31 -186 18 139 47
5264D7j63L1J75J8j72q5J71J65j68j88J39J91q5k45O1K38j8j99l3J60Q5j27j45
$$ 47 -116 -85 90 108 -64 -149 22 187 19 -169 -30 161 76 -169 -108 130 112 -87 -120 40 125 -2 -147
5287a47J13J34j5k14J5K01M6k24q1K30P1j40j01J03R5k6j38oJ25N2j19j02J40
$$ -147 -34 100 85 -129 -114 87 133 -91 -172 58 129 -11 -112 -9 86 60 -78 -84 41 93 -26 -128 12
5310A2J61j60j80J43J78r7j65N5J34J8j29n6N6J23l2j43j1J73K6j59o2J62M6j28
$$ 12 173 13 -167 -24 154 57 -108 -53 81 99 -30 -86 -30 93 61 -82 -93 80 106 -53 -115 47 93 -35
5334c5o2J00O1l6r9LJ30M7j22q6P6J39q0j63P1J76m1j84O1J09K2j26p3R4J34n9
$$ -35 -97 3 64 28 -71 -68 62 109 -13 -99 -23 116 36 -127 -56 120 79 -105 -44 65 87 -39 -112 -18 116 57
5360E7j28l9J88N7k07p5K03Q5j73j16J66J07r9j18K8J56Lj40j00J26J53j37j61
$$ 57 -71 -110 78 135 -72 -147 56 141 -32 -148 18 125 26 -92 -64 92 95 -45 -145 -19 134 -3 -164
5383a64Q7K23o9k24O6K16m5j89l1J63Q2j08j06L8J90m3k03kK30N5k59q2K16J33
$$ -164 -77 146 77 -147 -81 135 90 -99 -130 33 115 7 -99 -61 129 86 -117 -119 111 166 -93 -175 41 174
5407A74k24j25J68J62j08j72L5J58M4j53j11J59J88j90j60J00K22j01k10N7K21
$$ 174 -50 -175 -7 155 47 -125 -90 68 112 -41 -152 7 195 5 -155 -55 167 66 -144 -87 134
5428A34k6j88j9J41P7j30j11Q4J60j9k23kK13P6k49n2J80R6j57q5R3J00n2j43
$$ 134 108 -80 -99 42 119 -11 -122 -38 122 103 -120 -122 91 167 -82 -134 46 142 -15 -100 -7 93 41 -102
5452a02M9R6M2q7j28J18J52j45j11P5J77o2j96O8J40m8p3m7Q1Q1o8r3MJ44Qj44
$$ -102 -53 43 85 -2 -130 -12 140 -5 -116 -41 136 74 -122 -54 86 38 -35 -82 -1 80 12 -81 -77 67 75 -69
5478f9n4J71Q5j33q8R7O3n5p6J1Q0L8m8j09N6J36l5j58N9J32k1j57KJ54Or3r1
$$ -69 -123 48 133 0 -88 9 72 17 -59 -48 32 70 22 -87 -31 105 70 -88 -29 103 82 -75 -73 81 87 -6 -97
5505i7Q0P2J1j13l5J48N5j64j07J81J11j54j14J13J26o6j52O1J42j9j07r2J29
$$ -97 -17 55 66 -47 -82 66 121 -43 -150 31 142 -12 -126 -13 113 47 -105 -44 98 79 -28 -120 9
5528IJ60j18j93P1K21j8k49J2K06K6k01o5J88Q5j20j38N7J65J2k00n1K04R1k12
$$ 9 169 51 -142 -71 150 132 -117 -105 101 127 -74 -139 49 134 14 -124 -67 98 110 -90 -141 63 154 -58
5552e8r2K01J13j46j58J42J35q8j43J8J74J7j32j05R9J77j11k14J04K30p9k14
$$ -58 -150 51 164 18 -140 2 137 49 -94 -76 98 115 -17 -122 -23 154 43 -171 -67 163 84 -130
5574a30M5K22m5j74kJ31O2p6j34N3J86p3j49l1J96N5k04n7J80Q1j58q7J18Q4q4
$$ -130 -85 137 92 -82 -84 47 109 33 -101 -48 138 65 -84 -115 81 136 -68 -125 55 136 -22 -109 9 93 9
5599Io1JJ04L8r3r1J12Q9r4j60J05J40n1j67N3J60m7p6l9Q7M3j1j05mR0N7j25
$$ 9 -52 -51 53 91 -2 -93 19 108 14 -146 -41 99 48 -119 -66 94 47 -29 -68 19 62 51 -54 -58 32 89 -36
5626c6m5J20O3j29o4R0P6o9q3O3L8K1j5q2K0J09l0j31J1J56qj51L5P9N1r7l7M
$$ -36 -81 39 102 -27 -91 -1 75 6 -77 -14 24 45 30 -52 -32 77 47 -84 -73 83 75 -76 -41 38 89 -8 -45 -41
5654d1R1K8j06l3P5J13j09j31J40J05j16j44J09J15p2q8lJ13L1j11o7N6J61o2
$$ -41 50 78 -28 -61 14 127 18 -113 27 132 16 -128 -19 96 24 -64 -67 46 77 -34 -101 -45 116 54
5678E4j90O8J96l5k07K4J81L1j88m5J47P8q1j17L8J42pj30p6J79R2j81j21J75
$$ 54 -136 -68 128 93 -114 -90 91 122 -66 -111 36 114 33 -84 -46 96 89 -41 -117 62 154 -27 -148 27
5702B7J67k23j07J14J48q7j49K5J73Rj48o9J04J38o8j86O4K14m1k40O1J73Pj79
$$ 27 194 -29 -136 -22 126 39 -110 -85 88 97 -51 -120 -16 122 54 -132 -68 146 105 -135 -74 99 106 -73
5726g3l7J78M2j07j05P7J34m0j45l7K04N8j96r3J84R8j49j12J07R1m4p2RO9K6
$$ -73 -110 68 110 3 -102 -25 109 69 -76 -113 91 149 -47 -140 44 142 -7 -119 -12 79 35 -37 -28 41 67
5751F7p1p5R2O4m2j62P9J31m4j43N6J26n7o6MN1K6j5p2pR3M7j25n4J57K6r1n7
$$ 67 -4 -79 13 77 35 -127 -48 83 39 -104 -48 78 21 -45 -41 10 36 21 -51 -58 35 82 -43 -97 60 86 -5 -62
5779f2Q2N2o0m4K6L6l0L5o4j3J08j2j14QJ11Mj41L1J18j5o6j3L3pM8o5n5O2J11
$$ -62 20 72 12 -32 -6 30 0 35 -29 -42 66 54 -60 -52 59 63 -78 -47 71 56 -10 -23 10 3 51 -14 -69 -7 104
5808A04j22r8J14J27r3j46R1J14m1j24M3P1M3m7j00M4J31l1j76NJ89Nj88j3J65
$$ 104 -18 -116 -2 125 32 -114 -23 91 50 -74 -31 40 83 36 -64 -20 111 80 -96 -91 98 103 -85 -98 67
5833F7M6j81m0J42P4j13p8K9J00L9j55n6J42J45j78j44J77J45j42j54J03J80r1
$$ 67 113 -68 -108 34 108 -5 -83 -54 46 85 -70 -126 16 161 -17 -161 16 161 19 -135 -32 148 57
5856E7j44K6J03M0j08o4O9J54q3j79L9K30l8k25L1K22l2j64k5J62J5r5o6QJ47
$$ 57 -87 -61 42 82 -26 -90 -21 133 50 -129 -90 140 102 -123 -92 130 98 -66 -91 71 86 -9 -75 -67 80
5881H0lj75kJ65M9j72o6J57R9j35j25J20J39j30o1N0P8k3o4m9Q2R1r5j08N9J61
$$ 80 77 -98 -100 65 114 -58 -124 33 132 -3 -128 -8 131 1 -60 -10 68 45 -19 -68 14 105 10 -98 -39 122
5907A22o5j48O6J07l7q7K1N2rml6j5P5Mp2n2J08K7r0o1J37qp1J6M9rm2L4m5j0
$$ 122 57 -91 -25 82 45 -42 -21 31 22 18 -18 -33 42 46 -26 -78 30 57 -33 -94 43 35 -36 -20 29 20 -22 12 -33 -43
5937d3R5Mj17PJ35k2q9mP7Qm8JJ7J3j3j0n8J2J08n9j17Q2J16p3j21N6J34m2r7
$$ -43 52 56 -61 -54 81 59 -30 -34 43 51 3 4 21 34 21 11 -47 -35 73 14 -103 -21 95 22 -99 -43 91 49 -48
5966d8K4O5j3j5m5pO2M3j28k5J59L4j85m8J98N0j69k5R5M9n6q4N9Q3K6j18r1J21
$$ -48 -24 41 28 13 -32 -39 23 66 -62 -87 72 106 -79 -127 71 121 -48 -73 22 71 15 -69 -10 73 99 -19 -110 11
5994A1R3j30j24J63J20j17j40R5J72q4j59L0J32J5r9q5Q2J31m0k09N3J93k0k00
$$ 11 104 -26 -150 13 133 16 -124 -29 143 59 -100 -70 62 77 -22 -107 -25 106 66 -143 -90 103 83 -117
6018a17K1K00k9j48j1J54K6r9n9J2J22Mj25l4J41M9j24r8J61P2j50q4J48Q4j00
$$ -117 -96 104 75 -73 -84 70 96 -3 -62 -50 72 76 -49 -83 58 107 -17 -115 46 118 -32 -116 32 116 16
6043A6j04R6M9k5n0n9P3J05p4j21N9J59r3j38O5J24n9r8M9Q2l9rl1J3J6K7k4n3
$$ 16 -88 8 57 32 -18 -77 -4 101 27 -94 -35 124 31 -107 -42 82 23 -75 -26 56 17 8 -23 -10 6 33 9 -44
6071d4P4L0q7k4Q4M5j03%K8L0l8J1j0rK1K4p2jO0Ko2OO4k1n5L0K7J3pln0mR6J4
$$ -44 30 60 -27 -51 33 78 -25 -25 3 33 -5 6 -4 -13 8 32 -40 -41 19 21 -41 -35 29 8 -47 -17 10 23 16 13 -37 -41 55 69
6105F9j43M6J06l1j03J2J55p1p1J0M6K8k1m2k5Q0J6j08l1J28M8j52o2J39N5j03
$$ 69 -74 -28 78 47 -56 -44 111 40 -31 -21 25 53 32 -10 -35 45 61 -47 -78 50 98 -54 -116 23 78 -25
6131b5l8O8P2p6j6k9R8Lp4o9J16J05j25j30J11J57j34j15O0J62o9r4lQ4K8q8m4
$$ -25 -63 5 77 1 -15 -44 54 57 -17 -86 30 135 10 -120 -9 148 14 -101 -41 121 52 -42 -45 39 67 -21 -65
6158f5O9Q9k6j41mJ96l0j99L0J85Jj44n6J41Ko2m7M6O2K7j31k1J43K1j35p5J49
$$ -65 4 93 67 -74 -78 118 88 -111 -81 104 105 -39 -95 46 48 -14 -61 -15 47 74 -57 -78 65 86 -49 -124 25
6185B5J16j58p4J05P8r0q1O7O3m0Kn6N8R5q2j11N7J20j7j54N2R1k7q7L1M8Km8
$$ 25 141 -17 -91 14 92 2 -79 -12 51 11 13 -43 15 110 28 -83 -26 94 77 -77 -25 66 39 -48 -17 31 33 -15
6213a5qJ7L2Lm7k3O7M0j16kP0J7m8l8R0nn2J7J4k0L1J5n6k1Q2j8o5jP1rk5jL0
$$ -15 -23 -6 26 29 -18 -41 26 66 -50 -52 18 35 -13 -51 39 34 -18 -1 13 -7 24 39 -17 -38 44 26 -39 -40 31 22 -3 -4 26
6246B6k0k2L3m2oP9m0o6K8O8J0j21M9M4j2n2J1M2J2lm9qP6K1p6o6J04P6j03q6
$$ 26 6 -16 17 -25 -31 48 8 -58 -30 38 48 -73 -24 20 8 -44 -33 9 21 18 -31 -39 37 58 -18 -84 20 96 -7 -93
6276i3J24O6j11m9Q8O4o0n7L6J5J5k5p8Q4P3n8j42Q0J26o6j32P5Q8m0q8J7P7L1
$$ -93 31 97 -14 -63 25 89 29 -28 8 23 38 13 -65 19 92 34 -108 -28 98 32 -100 -25 63 23 -65 -48 29 60
6304F0r2l3K6J10l4j02JJ44K2j94jJ76J6j47m0J36%n9n3O1N0k2p7lJ04N7j19p7
$$ 60 -32 -65 -39 71 37 -65 -64 80 102 -92 -93 83 99 -48 -88 48 48 -11 -64 -3 47 25 -52 -55 49 106 -13 -90
6332i0J26Q4j27j15J39P6q5q4P9M2j3o1k2K7Q4rj28M8J06j8j33K8J15n1q8M6O2
$$ -90 36 120 -7 -122 17 93 8 -76 3 45 32 -29 -51 -24 60 51 -77 -29 77 59 -74 -46 69 18 -70 -24 38
6359C8l7m3L0jM0j8k2k2M2K7n9j2R9Kp6j9L8L7p8K8L6j5m0P6m0j7j0O1o6l5P1
$$ 38 1 -42 -12 -13 27 9 -13 -35 7 34 -25 -37 62 64 -12 -31 7 44 -34 -6 30 15 -25 51 11 -6 -16 45 -21 -56 15
6390A5pl2K2Pkl3L7Ml7O0Ql6j2O6k2o6J4O2Om5m9P9k9J1ln1M5K8n3n0Q6N9r2m4
$$ 15 8 -24 -2 5 3 -30 7 11 -26 34 42 6 -6 60 38 -28 -14 48 54 9 -40 39 10 21 18 -33 12 40 -13 -63 23 82 -10 -54
6424e4L6J15j04m1O9L6l8m8L8pN0l5q8Q6M7m8q4L7J21m5j35P5Q6k9o4J8K2L3m5
$$ -54 -18 97 -7 -48 21 57 19 -29 9 2 52 17 -71 15 62 14 -70 -33 88 43 -92 -17 69 40 -24 -6 16 49 4
6453Do4O2N4j3r3j8J16K9j15j5R8M3j24l5P9P2j09m0P6L5kp3k8O3N6p9q2J15Q2
$$ 4 -60 2 56 43 -50 -68 48 77 -38 -53 45 88 -36 -71 8 80 -29 -69 7 42 40 -33 -61 2 58 -21 -103 12 94
6482I4j15q4J20O4p1p2M6O4k7l7OJ4M4k6l9J2R7o4o7MJ01l9q6J1Q4rl8kJ6J9j8
$$ 94 -21 -105 15 79 8 -64 -18 46 19 -18 -12 2 46 20 -19 -7 90 26 -41 -37 64 25 -61 -50 34 25 -13 -15 1 20 2
6513Bj8j1N3On9j5Q8lo7k6J11j2m8l4N8km3N7l2j5K3K0o8KN0%l3jO9j4m8L9l7
$$ 2 -16 -27 26 32 -27 -42 46 43 -24 -50 61 49 1 -33 25 23 -20 37 5 -10 13 33 -35 -33 17 17 -16 -17 52 38 -10 29 -8
6546hnjM6m1m3Q4mp1J6O0j0l8J7J7j9J1j8m2M0J9j3l9M8O6r8o1O5R8m9q8N5O1
$$ -8 -13 -14 32 -9 -52 32 28 -43 -27 33 23 -15 2 19 0 11 -7 -49 -9 10 -3 -42 6 72 -26 -87 -22 76 27 -61 -6 55
6578E5l7l8J9MJ3j4m9J5J01k4j05K7J03k9q2j4J15j9q2%N9L5o2k2oP5J0j00j1
$$ 55 18 -20 -1 3 16 2 -47 -32 69 45 -60 -33 70 41 -41 -55 60 41 -41 -41 18 53 -9 -31 -37 38 48 -52 -63
6607f3P4O3j22lR4J8p7o2J17J1p6j6M9J0L2p0l5Q2M1p0l6L3P8p3q8Q0N5l9n8K9
$$ -63 11 74 -48 -51 43 61 -16 -78 39 50 -26 -42 7 17 49 -21 -56 26 67 -3 -39 -6 72 -1 -89 -9 46 7 -51 -22
6637b2O5j0p2%M0L9k9m5K6P5k3q8KR5j0j10L8P0ko3L9J7j8j2k4J6J1J6k6m4M1
$$ -22 43 33 -39 -39 1 40 11 -34 -8 67 44 -44 -42 53 43 -67 -29 41 39 -24 15 32 14 2 -22 -6 5 21 -5 -49 -8
6668hO3p2j8N1K0l9k3K6K3l6j5K7LJ6j7n1qQ2k2l1J8L4k0k2N5l3j0J2Rj9KJ1j5
$$ -8 55 -17 -35 16 36 -3 -26 0 23 -13 -28 -1 2 18 1 -50 -58 24 2 -29 -11 23 3 -19 36 3 -7 5 14 -5 -3 8 -7
6701g%lK4ol1K2J8j0k9M6l5K5K9l7k5J7K8j7n7M0O1o3l4K7M3j8m7M5PJ5l2%k3
$$ -7 -7 -10 14 8 -23 -1 17 7 -22 24 -11 14 43 6 -19 -2 26 9 -48 -8 53 -10 -44 -17 26 8 -39 6 13 28 -4 -4 -27
6734b7N0Ro4QP4l2o7K5P6j4o1mL9L7m7j2pM0K7o3j1O0J7j04j2P7K3n8l4Q1L8p3
$$ -27 23 32 -32 -24 50 18 -49 -24 52 38 -23 -27 12 49 2 -10 -17 23 50 -13 -24 36 53 -51 -63 14 37 -21 -55 26 64 -9
6766il1L3M6m4Ro0M8L8qn8jR9l8o9K3Q9n0n8J6Q7l9k5oJ8OJ1l9jM3j9m7JO3J4
$$ -9 -40 -7 39 -5 4 -56 -8 30 22 -36 -37 62 24 -45 -22 67 17 -41 -25 62 23 -2 -8 10 16 27 -12 -13 30 11 -36 -35 28 42
6800D2p1%M2Rn3j5N5j9LLjNJ4km2K2K6l8j9N2qj8pK8L0k5Rk9PJ7J3l1LJ3J7o8
$$ 42 -29 -29 13 22 -31 -46 9 -10 -7 -4 -5 0 14 12 -30 -8 18 -20 -39 13 5 -13 -20 8 38 13 22 -7 0 17 30 -1 2 15 32 -36
6836c6MN1ok1MK0k7qK8Qj6J1J2l1qJ0KoJRJ4k2K9j3OroJj3L8j6k8K4Ok4Qk3M4
$$ -36 -32 19 13 -8 -4 16 -11 -19 9 17 1 12 24 -7 -15 -5 -3 -9 -8 1 15 -7 22 9 15 6 0 1 -12 26 10 -18 6 12 -12 -4 -27 17
6874A7Ok4J8J1l0J4k9rN7k4j6J9K5pl2m6O5J5m4k0N5j1j5j8J8K4Rk9m9N8M9m6
$$ 17 23 -1 17 28 -2 12 -17 -26 31 7 -9 10 35 28 -4 -50 15 30 -14 -34 21 10 -5 -23 -5 19 28 -1 -50 8 57 11
6906A1l2L6Jk9j3M3lrj2J8Mj2k4MJ6L0j7nk0M9j9m2J1L9j3n2J8L8Mm2J6j0J3K
$$ 11 -21 15 16 -13 -26 17 14 5 -7 11 15 3 -21 -17 -1 29 12 7 -13 36 17 -25 -14 25 12 -40 -22 16 20 -22 -6 -16 -3 -1
6940alk5M6Om5rM7Pm8K3M7j0k4nJ8l2J9k9L4J5nj9k1J7M3m5k2K3PPk7K2kK7m2
$$ -1 -4 -29 17 23 -22 -31 16 23 -25 -2 45 35 11 6 24 -8 11 -18 16 31 26 7 -14 3 46 1 -21 2 9 16 -11 11 9 36 -6
6975f%LL6k1jl3L6lk9jK6oKRqMoj5L8l1MJ5j3J4jLj4NmNj5K4j0nk2L7k7qK9j4
$$ -6 -6 -3 33 12 11 -22 14 11 -18 -19 7 1 3 12 4 8 2 -13 25 -6 -2 13 0 14 13 16 2 7 3 8 -7 17 7 2 -20 17 -10 -18 11 -3
7015cRj7M0l2n4N5J4k6j4Qj3M0j4j0J5j2M7l6j2K6Jj1j6K0lJ6j4QK2k9j2KK8J
$$ -3 6 -11 29 -3 -57 -2 12 -14 -28 -20 -33 7 -7 -17 -2 -14 33 -3 -15 11 12 1 -15 5 2 18 4 12 34 5 -7 -5 23 24
7049B4j6k1M9j3k9pnK3Kl1QJ4Mn2K4M6j9j5J7Pl2M1n7K8J2L0m5k1N2%k7qRK7M
$$ 24 8 -13 36 23 -6 -13 -18 5 7 -24 -16 -2 2 -50 -26 20 1 -14 3 10 -22 19 -38 -10 2 32 -13 -34 18 18 -9 -17 -8 19 23
7084B3l6NJ6lJ9k9kJ9j9j4NL5k8kJ9jrj2J1j0J1JNk5L8k4Pj0J9K2n7J4M2j4l4
$$ 23 -13 -8 8 5 24 -5 -7 12 -7 -21 -16 19 -9 -11 8 7 -2 -14 -3 -13 -2 -1 4 -21 17 -7 0 -10 9 31 -26 -12 30 16 -18
7119a8K2K2Nk5mL4j5nnj0J3L4n6j6J2K1k1j3JJ9J4m1K1QprOK1loj3QNj2RJ0J0
$$ -18 4 26 31 6 2 36 21 16 11 1 14 48 -8 -24 -12 9 -12 -25 -24 -5 9 -32 -11 -3 -10 -19 -13 8 5 -1 -14 -6 -1 -13 -4 6 16
7156A6rmpj7K5Ml6L7KoJ4j8J9k4Rj2K5pkMnJpj5KJ4mmK1m4J9%J5j2L4n5L2j4O
$$ 16 7 3 -4 -21 4 8 -28 9 11 5 19 1 20 -4 5 -7 18 11 9 13 8 9 2 -13 -11 3 -1 -5 16 -28 -9 -9 6 -6 28 -27 5 -9 -3
7195cprPk5N3k1L5k3o%J7j9QLljrKj5L7j5j0K3l4j0K1j1K9Nk0pM0j4l6MJ6J1k2
$$ -3 -10 -19 -12 -37 16 -5 30 7 1 1 18 -1 7 10 7 6 -3 -1 -16 21 6 -4 19 -15 -25 -4 -15 14 19 -1 -8 32 18 -18 -14 2 13 -9
7233iJJ1QOl0nJ0K1j8KJ5J3k7JpJ0j2KPJ3kkj5K0lk6J5K3kJl2lL4k1j8J0L8k8
$$ -9 -8 3 11 17 -13 -18 -8 13 -5 -3 12 25 -2 -1 -8 2 -10 -8 -1 12 10 8 -7 13 10 -16 -1 22 20 21 -11 -14 20 -1 -19 -9 29 1
7271Aqj3J8oJ4j2jLrlPJ1NqJK4k0jkK6k0k4J0L2k6LojLJ9j8K1l3J8J3m3L4j5j7
$$ 1 -7 -20 -2 -8 6 -6 -7 -4 -13 -16 -9 2 7 -1 0 24 4 3 1 27 7 -17 -7 25 -1 2 -4 -5 -2 17 -1 20 -13 5 18 -25 9 -6 -23
7310b3K7J8j9J1Ml2J2j2K6pMj6j1j1K0qJ1J0j0J3k1J2J2K0k6pPJ7Ml6%M5m1Jo
$$ -23 4 22 3 14 18 -14 -2 -14 12 5 9 -7 -18 -29 -9 -17 -6 4 -6 7 -14 -2 10 30 4 -3 4 21 25 -11 -11 34 -7 -6 -12
7345a2K0J3Mn3L9K1n0oJ1M1m7PL4k1J0Ql1MK8Lm3J1J7Ml3L7J7j3l4L2Lk6RlJ2
$$ -12 8 21 25 -28 11 32 -18 -24 -13 28 -19 -12 22 1 11 19 -12 -8 20 23 -20 -9 8 12 -21 16 33 20 -14 18 21 -5 4 1 13
7380A3k2J9PRk4j1oJ9Pk1KQJ5pqj0J6j7k0K7j0K4m1KJ0J6J3k4K7Ojl8K7J9k0q
$$ 13 -9 10 17 26 2 -9 -15 4 11 -10 -8 0 15 8 0 -10 6 -11 -31 -4 -14 10 -31 -29 -19 -3 10 -14 13 19 18 -20 7 26 6 -2
7416bK0Qk8k5K5J2Rl0J0%J5k5K0j8K5j8Mj6K6mn1M6J5Nl1oKM3m0mL1j9j1J7l3
$$ -2 18 26 -2 -27 -2 10 19 -11 -1 -1 14 -11 9 -9 16 -2 2 -14 12 8 -43 3 18 23 -8 -14 -12 31 -9 -13 18 -1 -12 5 -28
7451b8L1MqpK4mj4j7N1k7Kj5L8l5%J0K8m1K4j4JPJ7o3K7L6j4m1nM6J8n3PK8k2
$$ -28 3 7 -1 -8 16 12 -2 -19 32 5 7 -8 30 -5 -5 5 33 -8 16 2 3 10 27 -36 -9 27 13 -28 -33 13 31 -22 -15 13 -9
7486innL3J2m1K1k2J6PJk8J8K8mo1K9L0k9mK0Rj0J1OMl8K0j1kK1k5LoK4j7nNJ7
$$ -9 -14 -19 14 26 -15 6 -16 0 7 8 -20 -2 26 22 -39 -10 20 -9 -13 7 16 6 17 23 27 -11 9 -2 -4 17 -8 -5 -11 13 -4 -9 -4 13
7524A3j1m0M1j0Nl5M5J4l4mk3N3J2Kk7j0L8k2k9K8OJn3K9L0Kj5j9K4j6OqQJ1K3
$$ 13 2 -38 3 -7 -2 -37 8 22 -12 -16 -39 14 26 28 1 -9 29 7 -22 6 12 13 -40 -11 19 21 6 -13 11 -5 1 -7 1 12 35
7559C5n2nL0Kl4j6O3l1j2J0LKMoj6J5NlQJ6J9l1j0K6Lm5j3N1nl2mM2j9J0m8L2
$$ 35 -17 -22 8 10 -24 -40 23 -8 -20 -10 -7 -5 -1 -7 -23 -8 -3 -6 2 18 37 6 -4 22 25 -20 -33 18 13 -19 -23 19 0 10 -38 -6
7595frJ9lj2J5Ok4JOK8k6k4J9J3qj8jL6j7JkmNoK1mNl5j0M7Lj0k9N1qk6J4L0m6
$$ -6 -15 4 1 -11 4 10 -14 -13 -7 21 -5 -29 -10 3 -5 -23 -24 12 -5 -4 -6 -10 -5 -11 10 6 11 -24 -34 13 16 6 -23 28 20 -6 8 38 -8
7634hk6L2j1NJ8j6j9L5J3l7k2L1Nk3J3k1L7KnkOJ4k8J2LpMk9K0PK8l7qK2mm4L7
$$ -8 -34 -2 -13 -8 10 -6 -25 10 23 -14 -36 -5 0 -23 -10 -31 6 8 3 1 7 21 -7 5 8 1 5 -24 -4 3 31 -6 -14 8 4 -40 -3
7671cjMj8RPKKj0rL9k5nj6M0k1j1LL0pk2PL4j7m6M4pJk3J6m%L1n6J7K2Nj3rM1
$$ -3 -4 0 -18 -9 -2 0 2 -8 -17 22 -3 -8 -24 16 -5 -16 -13 17 10 -12 -5 29 12 -34 10 3 4 -19 -3 -7 -7 24 -32 -15 7 12 -1 -10 31
7710C1l6j4L2J4j4j4k5L7L0k3k3QJ0k5lPK6J1l6m1O3J2k5k6L1qKl1J4M2m2PK2
$$ 31 -5 -19 13 27 13 -1 -26 11 41 18 -5 3 13 -12 -15 -8 18 29 -7 -48 15 27 2 -24 7 -1 1 -30 -16 26 -16 -9 13
7743A3LJlk5L8k0j6oL3J5j9j9L2Pk2j4L1k0k4qK4QqqoMJ7JQJ9k9j7k2M7l3K1j0
$$ 13 16 17 14 -11 27 7 -9 -15 18 33 14 -5 27 34 12 -2 29 9 -15 -23 1 9 1 -7 -13 -9 8 9 17 36 7 -10 -32 15 -18 3 -7
7780goK2m6L1MoL0l2L9k3K4k5k5K6M9k5m7K1M2m6k0K8j1J9k3J4j9NJ2l8J7N9k1
$$ -7 -13 9 -37 -6 -2 -8 22 -10 29 6 30 5 -20 6 55 30 -17 4 46 0 -20 8 -3 16 -7 7 -12 -7 5 -33 -16 43 22
7813B2l0J7nLj9j7M5J6m7kJ1L3j1k5M3l2J0l7L4k1L7k6oK8j1m0PK3J4Lj5J4k3
$$ 22 -8 9 4 7 -12 -29 16 32 -15 -17 -6 27 16 -9 34 2 12 -25 9 -12 25 -1 -7 21 10 -30 -23 0 14 17 2 16 -7
7846gNL7m3pK7m2pK4L9k9J0K5k8k4mK1J4j7k1J8Qk7J1pL4j7j0L2jk1lnM8k4m4
$$ -7 -2 35 -8 -15 12 -30 -37 -13 26 -3 7 32 4 -20 -24 -3 11 -6 -27 -9 -1 -28 -17 -24 10 -7 -17 15 14 -7 -10 -15 33 9 -35
7881c5K7QK0m5L5k8K2rjJ8J3m9L5j1j0kk8L4MpnJ0K1l8MRK6j6jk0K9nJ5j6j1K5
$$ -35 -8 0 20 -25 10 -18 4 -5 -6 12 25 -24 11 0 -10 -12 -40 -6 -2 -9 -14 -4 17 -21 -17 -8 18 2 1 -19 10 5 20 4 -7 18
7917A8ok3K9mmKoJ2oNm3J6J6j7kJ9k1PJ3j2Rlj1j8L3NK3o4J5N7m3j5J2Pj6j3K4
$$ 18 12 -11 18 14 10 12 6 18 12 17 -26 -10 6 -11 -13 6 -15 -8 5 -7 2 -1 -12 -30 3 8 31 -33 -18 39 -4 -19 -7 0 -16 -29 -5
7954eK3l8K2l6K5L3m0j0J1K6oQj1J2Mm7PM0j9j6jNK6j2k1qL5k1LkM1m3k7L8pO
$$ -5 18 -20 2 -34 -9 24 -16 -26 -15 11 5 13 2 14 18 -29 -22 18 -1 -17 -18 -13 13 1 -20 -28 7 -14 -11 -13 28 -15 -42 -4 -11 -5
7990eoK0J2l%j7l3N0k9L0l8J9Jjk5NN5l4JK5l3j3K6KJ1m4J0K0Knj9QK3k5j7KL1
$$ -5 -11 9 21 18 18 1 -32 18 -11 19 -19 0 1 0 -25 -20 35 1 2 27 -6 -19 7 9 20 -24 -14 6 8 3 -16 -8 15 -10 -27 -25 6
8027Fj3rNJJ9qj9J8J2pk8J8QJp%J4%pJ6k2MpnK1J2k5K1j1rL0n0K1J5k0Lk4L7j0
$$ 6 -7 -16 -11 -10 9 1 -18 0 12 5 -23 -5 3 4 -3 -3 11 11 4 20 -2 2 -5 -10 11 23 -2 19 8 -1 29 -21 0 15 -5 -2 -26 11 1
8066Aj8NJ2J0k7J8k0J7k1%L3rJj2K4j3K2l7J4Pk1J5kJ4j2J2m2P1m7K0l9K8J4j2
$$ 1 -17 -12 0 10 -17 1 -19 -2 -23 -23 10 1 2 -10 14 1 23 -14 0 7 -14 1 -1 13 1 13 -29 42 -5 15 -24 4 18 6
8100Fk6L0k3J5oj8R%Olj1M8k3l6N8k4km2L6K2k4L2k9mJ5oj2L2qrKnOnj4L5j6k0
$$ 6 -20 10 -13 2 -4 -22 -13 -13 -7 -10 -21 27 4 -32 26 2 0 -42 -6 16 -8 24 -5 -9 6 0 -12 20 12 3 5 0 6 1 -13 22 6 -14
8138a4L5n0K4j7J7J0j4J9nk%j9K3j5l0L9k2lK2J2j6nMoJ0MPjj5mJ2J4jl0OoK5
$$ -14 21 -29 -5 -22 -5 5 -9 10 5 3 3 -16 7 -8 -38 1 -21 -24 -2 10 -6 -11 -7 -13 -3 1 8 7 -8 -12 0 14 13 -17 -11 -17 8
8175HJ5j7Mj4K0J1l8J2Lj2J5k0J0prq
$$ 8 23 6 10 -4 16 27 -11 1 4 -8 7 -13 -3 -10 -19 -27
8191b7
$$ Imaginary data points
##PAGE= N=2
##DATA TABLE= (X++(I..I)), XYDATA
0@%%%%%%%%%%%Qj6J6j6J6k4L2l3M1m9N7p2Q8j04J20j37J59j83K10k42K75l15L60
$$ 0 0 0 0 0 0 0 0 0 0 0 0 8 -8 8 -8 8 -16 16 -17 24 -25 32 -40 48 -56 64 -73 86 -97 113 -129 146 -169 191
34A91m06M58n15N76o45P21q03Q94r93J100j218J346j485J636j804J991k193K415
$$ 191 -215 243 -272 304 -341 380 -423 471 -522 578 -640 706 -779 857 -947 1044 -1149 1266
52A266k662K937l243L585l973M416m926N526o238P096q162R527j1342J3886j7737
$$ 1266 -1396 1541 -1702 1883 -2090 2326 -2600 2926 -3312 3784 -4378 5149 -6193 7693 -10044
67a0044K4320l8482J20571j44630k06183L31940J22097k37995j29193J83424Q9631
$$ -10044 14276 -24206 96365 -48265 -254448 77492 199589 -38406 -167599 15825 105456
78A05456o9133r5792k0744Q8144J27325j12814j98211J27688K58159j56033k75635
$$ 105456 36323 -59469 -80213 7931 135256 22442 -175769 -48081 210078 54045 -221590
89b21590J65861K72955j70464k36632J48661J89294j12338j27821N3084P2442
$$ -221590 -55729 217226 46762 -189870 -41209 148085 35747 -92074 -38990 33452
99C3452J4710k3137r0420p657J58575K3235k14569k0069K47103N887k54813J5093
$$ 33452 48162 25025 -65395 -73052 85523 108758 -105811 -125880 121223 127110 -127703 -112610
111a12610K34218l3782j90451M5175J28766m3326n9532K6896q173L002O4325m1566
$$ -112610 121608 87826 -102625 -57450 71316 27990 -31542 -4646 -12819 -9817 54508 12942
123A2942j01863Q2997J16573j19510j08568J44256Q1375j51994m1264J40912l110
$$ 12942 -88921 -5924 110649 -8861 -117429 26827 108202 -43792 -85056 55856 52746
134E2746j11951M3266O9350p2194j9831Q5076k8434q0160O7866N8729r2189k5552
$$ 52746 -59205 -15939 53411 -18783 -38614 46462 18028 -62132 5734 64463 -27726 -53278
146e3278R7157j3369q2233N1156N0019q1384o262R9384m2061j02881Q6696R2523
$$ -53278 43879 30510 -51723 -567 49452 -31932 -38194 61190 19129 -83752 2944 95467
158I5467j19818p0997J35750M3443j31289j5838J06370n631o4077J6777J0511
$$ 95467 -24351 -95348 40402 83845 -47444 -63282 43088 37457 -26620 -9843 668
169F68j5059M6766N82j00052K3522J42190n2172j67922P8926J74756r7552j63592
$$ 668 -14391 32375 32957 -67095 -43573 98617 46445 -121477 -42551 132205 34653 -128939
181a28939J02323J37545q9930j01950N9923O3406j4880k8194m0128J051R8071
$$ -128939 -26616 110929 20999 -80951 -21028 42378 27498 -696 -40824 -39773 58298
192E8298J5474j50812k0943J91375J7687k14155r653K15948J943j96568Q58J58928
$$ 58298 73772 -77040 -97983 93392 111079 -103076 -112729 103219 105162 -91406 -90548 68380
204F8380N092j08348k1742N1240M8349N111q2135n4234J18274R1234j51199j13640
$$ 68380 73472 -34876 -56618 -5378 42971 48082 -34053 -88287 29987 121221 -29978 -143618
216a43618J74650J21193j83703j15886J75234J01909j48410q4130J05113O7521
$$ -143618 31032 152225 -31478 -147364 27870 129779 -18631 -102761 2352 69873
226F9873m9681n5902j1273N1872P0710n5540j21651O5007J58136p6803j76421
$$ 69873 20192 -35710 -46983 4889 75599 20059 -101592 -36585 121551 44748 -131673
237a31673Q6451J75800q9646j58095Q2570J27271o3699q9211L3449N0157N704
$$ -131673 -45222 130578 40932 -117163 -34593 92678 28979 -60232 -26783 23374 29078
248B9078j6132m9167q964R1328K2801j26420k5193J49624J8514j57458o450J48810
$$ 29078 12946 -36221 -45185 46143 68944 -57476 -82669 66955 85469 -71989 -78439 70371
260G0371o528j24815J6217Q9230j9062m6994J3295M027Q81L3584k1452o1189M5188
$$ 70371 63843 -60972 -44755 44475 25413 -21581 -8286 -4259 -3378 30206 8754 -52435 -7247
273g247P5538o7808p5763Q4705O2941r2640m0491Q9522J3080p4986J3949N0788
$$ -7247 68291 483 -75280 9425 72366 -20274 -60765 28757 41837 -33149 -19200 31588
285C1588l5697k0581M8385j0830m9818L8641M0309n8136k1814O6076k050o1130
$$ 31588 -4109 -24690 23695 12865 -36953 1688 41997 -16139 -37953 28123 26073 -35057
297c5057K6933M4269m8249j8354O2375j2204o7479M2075O3034o6138n0521Q0170
$$ -35057 -8124 36145 -12104 -30458 31917 19713 -47766 -5691 57343 -8795 -59316 20854
309B0854L2835q1671j3994O9874k297m6324J2711J4508j5131K1102R344n5781
$$ 20854 53689 -27982 -41976 27898 25601 -20723 -8012 6496 -8635 12467 21811 -33970
321c3970L543Q4590k0408j03868L7912J11563n1671j07349N7901R2725n3987p0654
$$ -33970 -30427 54163 33755 -70113 -32201 79362 27691 -79658 -21757 70968 16981 -53673
333e3673L9033M5068j3887k0069j9041q31N5363J5136r0316k1935J18862K1872
$$ -53673 -14640 30428 16541 -3528 -22569 -23400 31963 47099 -43217 -65152 53710 75582
345G5582j36785j7280J41329J1013j31561o493J08893O738p6189j3566L7826K7360
$$ 75582 -61203 -78483 62846 73859 -57702 -64195 44698 51436 -24753 -38319 -493 26867
357B6867J283m6688l6347O9064O3715r0517q1194J07054Q8091j15059q5688J12063
$$ 26867 28150 -18538 -54885 14179 77894 -12623 -93817 13237 101328 -13731 -99419 12644
369A2644P6408r7080o3623P0811N0445l5912l9899l832L3951M3753l3093p9243
$$ 12644 89052 -8028 -71651 -840 49605 13693 -26206 -30038 3913 47666 14573 -64670
381f4670L6542J06125m2430j21469M8107J24309n0689j14915M7772R5497l7708
$$ -64670 -28128 77997 35567 -85902 -37795 86514 35825 -79090 -31318 64179 26471
392B6471o9510K0285M1262L366j4676l0941o614N8715K0451q3177k6005J00535
$$ 26471 -43039 -22754 18508 21874 7198 -23743 -30357 28358 48809 -34368 -60373 40162
404D0162K4172j08230j7080J04678P524r0295J162O6997o199l7939N821P232N08
$$ 40162 64334 -43896 -60976 43702 51226 -39069 -37907 29090 22891 -15048 -9227 -1995 -1487
417a487K0883j1821m2817K6392N6012m1171n9288N3275N3049o0072l9242N9879
$$ -1487 19396 7575 -35242 -8850 47162 5991 -53297 -22 53027 -7045 -46287 13592
429A3592K0921n2085j513L7437j5500j8156K7192l014l1918K2739K9159l8064
$$ 13592 34513 -17572 -19085 18352 2852 -15304 11888 8874 -23044 -305 28854 -9210
441i210j9648M6248N371m6130J0971L7742k6355k2274L8089K485m4250J8398M3961
$$ -9210 -28858 17390 22761 -23369 -12398 25344 -1011 -23285 14804 17289 -26961 -8563 35398
454C5398l6676l7574M9345K6637n3865j3569M9321J012l6245Q580J6302j3119
$$ 35398 -1278 -38852 10493 37130 -16735 -30304 19017 20029 -16216 -7636 8666 -4453
466d453P364J1932l1608n465N2812m944o8061J6769P5502k7134p4674L3430O6064
$$ -4453 2911 14843 -16765 -22230 30582 25638 -42423 -25654 49848 22714 -51960 -18530 47534
479D7534l3464n1599K6258L3948j1930j5697q045m25L1203J2642n4361j9833P4248
$$ 47534 14070 -37529 -11271 22677 10747 -4950 -12995 -13420 17783 30425 -23936 -43769 30479
492C0479K2209q7928k0696R3079J7027q8902j3314P5668J1464n4946j3101K9243
$$ 30479 52688 -35240 -55936 37143 54170 -34732 -48046 27622 39086 -15860 -28961 282
504B82J8800j926k8409k3740M0595M4920n3219n9557O3884O6597o9949o6311O9587
$$ 282 19082 17156 -11253 -34993 5602 50522 -2697 -62254 1630 68227 -1722 -68033 1554
517A554O0237o1675n0189M6133L8879k4405k8488j386K0959K8227j7096n2869
$$ 1554 61791 116 -50073 -3940 34939 10534 -17954 -19340 1619 29846 12750 -40119
529d0119J6740P2320j9050q4431K2244Q7940k4452q2910K3789P0476j9130n2790
$$ -40119 -23379 48941 29891 -54540 -32296 55644 31192 -51718 -27929 42547 23417 -29373
541b9373R802L2634L694j2734j9992m308L7209J6727n2871k3509O4692K4862p0693
$$ -29373 -19571 13063 16757 4023 -15969 -20277 16932 33659 -19212 -42721 21971 46833 -23860
554b3860k1738O9799J5773o1753r039M7416L495k8550p89P659J750J2323o352
$$ -23860 -45598 24201 39974 -21779 -30818 16598 20093 -8457 -9246 -1587 163 12486 6134
567F134k9032J3632M0369k2228m4996L0097M2838l5571l4756L7086K2585l3750
$$ 6134 -22898 -9266 31103 8875 -36121 -6024 36814 1243 -33513 3573 26158 -7592
579g592q521K5791m769j4155J5135N85k1070J2952K1855k4188j7635L1297R505
$$ -7592 -16113 9678 4909 -9246 5889 6474 -14596 -1644 20211 -3977 -21612 9685 19190
592A9190l3196R31K9364j1528k0716K0540Q425k6448N274K8269j8199k5981K8083
$$ 19190 -14006 -13075 16289 4761 -15955 4585 13010 -13438 -8164 20105 1906 -24075 4008
605D008K0346l3255j2490L2721M085k6388L247J5166q001o01R448j5171p318K9921
$$ 4008 24354 -8901 -21391 11330 15415 -10973 -7726 7440 -561 -1162 8286 -6885 -14203 15718
619A5718K247m1525M615M8353j1550m9614J6708M5396j8706l6582J6276K4716
$$ 15718 17965 -23560 -18945 29408 17858 -31756 -15048 30348 11642 -24940 -8664 16052
631A6052r221j1734j868n49J5666J0430l0380j6989M3739K0029n3638j9788N8446
$$ 16052 6831 -4903 -6771 -7320 8346 18776 -11604 -28593 15146 35175 -18463 -38251 20195
644B0195J7452n7234j4277M9982J1798l7423j1029K1133J2707l159j6924j4343
$$ 20195 37647 -19587 -33864 16118 27916 -9507 -20536 597 13304 10145 -6779 -21122
656b1122K3076K9348k9990m0343L6141M6404m0164m7444M0530M4075l6521l7500
$$ -21122 1954 31302 1312 -39031 -2890 43514 3350 -44094 -3564 40511 3990 -33510
668c3510K7934K9208j5319k0803j94J3730J6930q846l2771O458M5992o368n4731
$$ -33510 -5576 23632 8313 -12490 -12684 1046 17976 9130 -23641 -17183 28809 22441 -32290
681c2290P643N8143r116n5857R607M8408q068l6999L785K3319L163r303j2283
$$ -32290 -24647 33496 24380 -31477 -21870 26538 18470 -18529 -14744 8575 11738 2435 -9848
694i848l249K2355J2941l2099j8987L9839K1146m4234j9909M4383J6309l9997
$$ -9848 -13097 9258 22199 -9900 -28887 10952 32098 -12136 -32045 12338 28647 -11350
706a1350j1608L1514P111j9769l920O450K834O750l891j8302O953K6717j1229
$$ -11350 -22958 8556 15667 -4102 -8022 -1572 1262 8012 4121 -14181 -7228 19489 8260
719H260l0972J5596L0871j9076k6711K0496J9406j9304j0453J5408J170r048O661
$$ 8260 -22712 -7116 23755 4679 -22032 -1536 17870 -1434 -11887 3521 4691 -4357 2304
732B304J213j2161P126J4439j4510j3335J9759R383k1966l445K0740l249j6121
$$ 2304 3517 -8644 -1518 12921 -1589 -14924 4835 14218 -7748 -11193 9547 6298 -9823
745i823R478Q988j4084l66J6354q209j6080J5397J3364j9914q966K0951L776j8384
$$ -9823 -345 8643 -5441 -5807 10547 2338 -13742 1655 15019 -4895 -13861 7090 10866 -7518
759g518J036J2430m642m097O395n489n979J4877L605k2731K4K8029m068k9955
$$ -7518 -6482 5948 1306 -2791 3604 -1885 -7864 7013 10618 -12113 -12089 15940 11872 -18083
773a8083P556K8514r471k3976R103J7189o086r151O29J137O674N852j4914j1104
$$ -18083 -10527 17987 8516 -15460 -6357 10832 4746 -4405 -3776 -2639 4035 9887 -5027 -16131
787a6131K2866J4089k9263j4919L2979J3984l3358j2071L0079R897k3404q355
$$ -16131 6735 20824 -8439 -23358 9621 23605 -9753 -21824 8255 18152 -5252 -13607
799a3607J4069Q057l263r218p726J1717J7692j5026k5280J8373K9954k0781l1435
$$ -13607 462 8519 5256 -3962 -11688 29 17721 2695 -22585 -4212 25742 4961 -26474
812b6474K1474K9870j9789k5884J5487K0384q767j4440K18Q860R269m467j8533
$$ -26474 -5000 24870 5081 -20803 -5316 15068 6301 -8139 -7921 939 10208 5741 -12792
825a2792J512K6477j45l2125j09L4762l36l4006P65L0134n31k3634q42J5442L589
$$ -12792 -11280 15197 15052 -17073 -17182 17580 17244 -16762 -15997 14137 13606 -10028 -10870 4572 8161
840H161o578p498j800J2278Q774j7188j3666K1384J6127k4059j6240K4611J4426
$$ 8161 1583 -5915 -7715 4563 13337 -3851 -17517 3867 19994 -4065 -20305 4306 18732
853A8732k2729j1446J8345Q005j1946m943M225K902L737k124j1043K618J6744
$$ 18732 -3997 -15443 2902 10907 -1039 -5982 -1757 1145 4882 2758 -8285 -5667 11077
866A1077m072k0140O068K0922p889j9086Q951J5187q893r744P422L837m614J723
$$ 11077 7005 -13135 -7067 13855 5966 -13120 -4169 11018 2125 -7619 -197 3640 -974 749
880G49Q14o118L441Q745p475r505J0627Q377j2448n692J2356K097j0504J724P083
$$ 749 1563 -4555 -1114 7631 156 -9349 1278 9655 -2793 -8485 3871 5968 -4536 -2812 4271
895D271n103k546P410k325q394O860P975j0206o335J1926L809j1527r59R108j467
$$ 4271 -832 -3378 4032 1707 -6687 173 8148 -2058 -8393 3533 7342 -4185 -5144 3964 2497
910B497n111L237n4l930N574L381j0562k017J4395%j6464J987J6542l480j4724
$$ 2497 -2614 623 569 -3361 2213 5594 -4968 -6985 7410 7410 -9054 -7067 9475 5995 -8729
925h729L988J1244l185o807J156J931K083K598n903o402R939R048j3351j0359
$$ -8729 -4741 6503 3318 -3489 -2333 -402 1681 4279 -1624 -8026 1913 10961 -2390 -12749
939a2749J5693J0445j6440r561J5335Q140j2397o665P902N491k392m924l556M972
$$ -12749 2944 13389 -3051 -12612 2723 10863 -1534 -8199 -297 5194 2802 -2122 -5678 -706
953g06R250n655j4011O646J7284p612j8762Q003J8444p555j6440N995J3280l248
$$ -706 8544 2889 -11122 -4476 12808 5196 -13566 -5563 12881 5326 -11114 -5119 8161 4913
967D913r394m58N361M870j717r389j165J3566L028j6666l986J8299M178j8245
$$ 4913 -4481 -4939 422 5292 3575 -5814 -6979 6587 9615 -7051 -11037 7262 11440 -6805
981f805l943J6434L593j3100l511Q653L775l638m615j351N898N790p464r157Q905
$$ -6805 -10748 5686 9279 -3821 -7332 1321 5096 1458 -3157 -4508 1390 7180 -284 -9441 -536
996e36J1258r932j1929J0278J1318r585r692P879P455n196m985J748K748K117
$$ -536 10722 790 -11139 -861 10457 872 -8820 -941 6514 1318 -3667 -1919 829 2946
1010B946j063n794mQ897L45j1114o2J2021n36j1671J257R937j713p260J718L979
$$ 2946 1883 -3911 -3915 4982 5327 -5787 -5849 6172 5636 -6035 -4778 5159 3446 -3814 -2096 1883
1026A883j142n73K4k524J500M844l102o118M578O373n579n574N906M032n480j995
$$ 1883 741 168 192 -2332 -832 4012 910 -5208 -630 5743 164 -5410 496 4528 -952 -2947
1042b947M235j01k401J983J33l341K104L972m059l882N342L195n845k073N364
$$ -2947 1288 1187 -1214 769 902 -2439 -335 3637 -422 -4304 1038 4233 -1612 -3685 1679
1057A679P99m021M27K011j385M74J946k995j981N218J614o822r33P593K14p400
$$ 1679 2478 -1543 -1116 895 -490 -16 1930 -1065 -3046 2172 3786 -3036 -3969 3624 3838 -3562
1073c562L50O316o25m503M35K150K35L80j364k761K715M622m077n925N218O457
$$ -3562 -3212 3104 2479 -2024 -1589 561 796 1176 -188 -2949 -234 4388 311 -5614 -396 6061
1089F061n792o329N720N657m931m576L372L468j269k287j208J375L778p66o021
$$ 6061 269 -6060 -340 5317 386 -4190 -818 2650 1381 -906 -2114 -739 3039 2273 -3748
1104c748M40P760l41q820L69Q997l40q396J12O998L96n120j219K851K357n69l615
$$ -3748 -3308 4452 4111 -4709 -4340 4657 4317 -4079 -3967 3031 3427 -1693 -2912 -61 2296 1727 -1888
1121a888j589M909L290n967m428O709N024o861n073O384M698n261m050L557L394
$$ -1888 -3477 1432 4722 -1245 -5673 1036 6060 -801 -5874 510 5208 -53 -4103 -546 2848
1136B848j466k711q37K178L082j907m973J762O311j733p083J764P053j653o429
$$ 2848 1382 -1329 -2166 12 3094 1187 -3786 -2024 4287 2554 -4529 -2765 4288 2635 -3794
1151c794J325N268p16l782j30K086J229m10k416r72L570K024m465k628N074K795
$$ -3794 -2469 2799 2083 -1699 -1829 257 1486 1076 -1340 -2312 1258 3282 -1183 -3811 1263 4058
1167D058n216k629M881K200m036j698K849J129j332p26l28M95J838m92l125O88
$$ 4058 -1158 -3787 1094 3294 -742 -2440 409 1538 206 -520 -848 -353 1485 993 -2132 -1444
1183a444L919r79m204J238M009j454l314J518K282j323j040R01j61k27J206n00
$$ -1444 2475 1496 -2708 -1470 2539 1085 -2229 -711 1571 248 -792 109 -52 -279 927 427
1199D27j997J314K281j864k271K292J861k443j178K187L49j642M68Q35j234Q2
$$ 427 -1570 -256 2025 161 -2110 182 2043 -400 -1578 609 958 -684 -216 619 -615 -533
1215e33J779j057j990J868J912k386j594K594J036k288m66J719j31p43N90l72
$$ -533 1246 189 -1801 67 1979 -407 -2001 593 1629 -659 -1125 594 463 -280 310 -62
1231f2q50J531R15k576p71L293N32l697k04L591o2l117K29K192j80j049j26k02
$$ -62 -912 619 1534 -1042 -1813 1480 2012 -1685 -1889 1702 1640 -1477 -1248 944 764 -285 -411 -613
1249f13N76J435j220k418J901L158k482l522K898L502k968l103K635K514j932
$$ -613 -37 1398 178 -2240 -339 2819 337 -3185 -287 3215 247 -2856 -221 2293 361
1264C61j802Q98J114L83n33j722Q0L011J15m084j81M778P9m965k3M751r2m049
$$ 361 -1441 -543 571 954 421 -1301 -1221 1790 1905 -2179 -2360 2418 2497 -2468 -2491 2260 2168 -1881
1282a881j0K966L08j606q24K41J492J086k200k152K950K878l533l168L833L102
$$ -1881 -1891 1075 1383 -223 -1047 -806 686 1772 -428 -2580 370 3248 -285 -3453 380 3482
1298C482l815k712L383K136k560j527J371R29J5n53j417L45K723m23l690O33M273
$$ 3482 -333 -3045 338 2474 -86 -1613 -242 687 702 149 -1268 -923 1800 1377 -2313 -1680 2593
1315B593r46m394J234M053j422l265J402K219j053j049M89n8K92J004j263j590
$$ 2593 1647 -2747 -1513 2540 1118 -2147 -745 1474 421 -628 -139 -197 95 1099 -164 -1754
1331a754K142J797k790j696L224J234l317n70K985j58k305P74J370j217k83J356
$$ -1754 388 2185 -605 -2301 923 2157 -1160 -1730 1255 1097 -1208 -434 936 -281 -564 792
1347G92p85j194J643P22k185k1K378p53k056J482J384k013m26K307o80k210J635
$$ 792 7 -1187 456 1178 -1007 -1028 1350 597 -1459 23 1407 -606 -1032 1275 595 -1615 20
1364B0J861k399j249K752N04k651J47K127o89j241R53N9r15J181N33k322O9L258
$$ 20 1881 -518 -1767 985 1489 -1162 -1015 1112 423 -818 135 194 -721 460 993 -1329 -1260 1998
1382A998q26l745J529L852k034l553K280K896k099j984J493R76m17q1q90n96K251
$$ 1998 1172 -2573 -1044 2808 774 -2779 -499 2397 298 -1686 -193 783 366 285 -605 -1201 1050
1399A050J050l580j207M615J018n178p87N238M56m736k18L740J66k329m38P11
$$ 1050 2100 -1480 -2687 1928 2946 -2232 -3019 2219 2675 -2061 -2279 1461 1627 -702 -1140 -429
1415d29J039Q73j814k224K684L289l574l768M161L938m496l600M270L059l578
$$ -429 610 1483 -331 -2555 129 3418 -156 -3924 237 4175 -321 -3921 349 3408 -170
1430a70k330K383J618q21j119q85P59K591p42m056R20N087j241n572J587N429
$$ -170 -2500 -117 1501 680 -439 -1324 -565 2026 1284 -2772 -1852 3235 1994 -3578 -1991 3438
1446C438j711m819J653L771j263k438N68J033M40L13j648j299K880J823l852j941
$$ 3438 1727 -3092 -1439 2332 1069 -1369 -801 232 672 985 -663 -1962 918 2741 -1111 -3052
1462c052M485J715m733j262M484N79l678J3K499m71j019N82n10l60J845j65k846
$$ -3052 1433 3148 -1585 -2847 1637 2216 -1462 -1449 1050 579 -440 142 -368 -728 1117 952 -1894
1479a894Q87L328j600l328K299K754k647j838K700O75k340N25J666j550p01K224
$$ -1894 -1007 2321 721 -2607 -308 2446 -201 -2039 661 1336 -1004 -479 1187 -363 -1064 1160
1495A160l76k416J309K196k058j548K367O17k258M54J700j502p65K291l59k797
$$ 1160 784 -1632 -323 1873 -185 -1733 634 1251 -1007 -553 1147 -355 -1120 1171 812 -1985
1511a985J549K850k481k518L087J954l219j161K756M30j863K33N12n81J066N54
$$ -1985 -436 2414 -67 -2585 502 2456 -763 -1924 832 1262 -601 -368 144 -437 629 1183
1527A183k555l32L893k11m785Q03N146j338m960J615M259j554l166J045J809p0
$$ 1183 -1372 -1704 2189 1978 -2807 -2004 3142 1804 -3156 -1541 2718 1164 -2002 -957 852 782
1543G82m73j172p18K578J654l951k120N005K340n675k227N780J948n296j601M201
$$ 782 309 -863 -1581 997 2651 -1300 -3420 1585 3925 -1750 -3977 1803 3751 -1545 -3146 1055
1559A055J332k629j281P61J532J098j941k871K527M214l190n039L658N325l848
$$ 1055 2387 -242 -1523 -762 770 1868 -73 -2944 -417 3797 607 -4432 -774 4551 703
1574G03n091L687M438l044l458J911K438m15j434j341O81L095k15m620J02N713
$$ 703 -4388 -701 3737 693 -2765 -854 1584 1169 -265 -1606 -925 2170 1955 -2665 -2563 3150
1590C150j86o283M38O161o45n478O46M319m81k763n3J056Q80N22j852j833K876
$$ 3150 2964 -3319 -2881 3280 2635 -2843 -2197 2122 1641 -1122 -1175 -119 761 1283 -569 -2402 474
1607D74K655l744k973M326K866m524k360M264J641l479q77K319J83q42K85p09
$$ 474 3129 -615 -3588 738 3604 -920 -3280 984 2625 -854 -1731 588 771 -71 214 -495
1623d95m57K122K77l248K33L793p80l857J355L355j820k429K000J182j826J66
$$ -495 -952 1170 1447 -1801 -1568 2225 1445 -2412 -1057 2298 478 -1951 49 1231 -595 -429
1639d29J320j406n46K303l35k759J206K769j904k222K233J376k146k93J632q24
$$ -429 891 -515 -1061 1242 907 -1852 -646 2123 219 -2003 230 1606 -540 -833 799 -25
1655b5p67J783l48k433J492K713k471k662L127K251l363j650L019R75k165l38
$$ -25 -792 991 643 -1790 -298 2415 -56 -2718 409 2660 -703 -2353 666 1641 -524 -862
1671h62R26j48O16L12k156j97L574j06m635N67N130r19n137J153M665j161l667
$$ -862 64 -84 532 844 -1312 -1509 2065 1959 -2676 -2109 3021 2102 -3035 -1882 2783 1622 -2045
1688b045P39K375M1j007j125l16K434J372l782k061M824K432n520k456N664K287
$$ -2045 -1306 1069 1110 103 -1022 -1338 1096 2468 -1314 -3375 1449 3881 -1639 -4095 1569 3856
1704C856n266j979M292J703k764j646J008J738Q96k019k672K515M059k982m997
$$ 3856 -1410 -3389 903 2606 -158 -1804 -796 942 1838 -181 -2853 -338 3721 739 -4258
1719d258L350N411l480n304L289M700k669l847J631K789k52j757j329Q58K991
$$ -4258 -908 4503 1023 -4281 -992 3708 1039 -2808 -1177 1612 1360 -397 -1726 -868 2123
1734B123k65m412j12N463J99n986j25O009Nn402OM341J45k879m98J211J167L54
$$ 2123 1858 -2554 -2666 2797 2996 -2990 -3115 2894 2899 -2503 -2497 1844 1989 -890 -1388 -177 990 1344
1752A344j981j688K783K637l536l126M078L112m206k758L910K082l140j331J967
$$ 1344 -637 -2325 458 3095 -441 -3567 511 3623 -583 -3341 569 2651 -489 -1820 147
1767A47O43n77r2q74j79K231J78l270N2L890m41l927Q39L495j175k607J284J455
$$ 147 790 213 121 -753 -932 1299 1477 -1793 -1741 2149 1708 -2219 -1380 2115 940 -1667 -383 1072
1785A072j165j63P60j054j75K037n64k617J258K751j799k473K011J839j931r28
$$ 1072 -93 -256 504 -550 -725 1312 748 -1869 -611 2140 341 -2132 -121 1718 -213 -1141
1801a141J457p3o11R88m08j701J531K087k459k171L134J986l409j534L134J045
$$ -1141 316 243 -368 620 212 -1489 42 2129 -330 -2501 633 2619 -790 -2324 810 1855
1817A855k424n52J248K72R6j20j605K15K957n05m011Q39M630j161m733J273M401
$$ 1855 -569 -1121 127 399 495 375 -1230 -1015 1942 1437 -2574 -1735 2895 1734 -2999 -1726 2675
1834B675j150l633P53K562L8j435j013K57K234P07l365j475M407J878n044k077
$$ 2675 1525 -2108 -1355 1207 1245 -190 -1203 -946 1288 1995 -1370 -2845 1562 3440 -1604 -3681
1850c681N240K080m958j963M167J794k914j758J323J882M01k146k025K502L405
$$ -3681 1559 3639 -1319 -3282 885 2679 -235 -1993 -670 1212 1613 -533 -2558 -56 3349
1865C349k960m303L196M848l284m865L047M473k447l759J495K876j72j988j250
$$ 3349 389 -3914 -718 4130 846 -4019 -972 3501 1054 -2705 -1210 1666 1494 -494 -1744
1880a744J178K709n68m012J03M993J06n502j65N471K01m968k77M021M48k735q27
$$ -1744 -566 2143 1575 -2437 -2334 2659 2765 -2737 -2902 2569 2770 -2198 -2475 1546 1994 -741 -1568
1897a568J292J395R7k001j376K688K289l256k805L625K968l680k781L410K273
$$ -1568 -276 1119 1216 -785 -2161 527 2816 -440 -3245 380 3348 -332 -3113 297 2570
1912B570k711j653J661J073m39n67q52K06K090j21l026J59L584l54l662N49L323
$$ 2570 -141 -1794 -133 940 501 -66 -918 -712 1378 1257 -1769 -1610 1974 1620 -2042 -1493 1830
1929A830p10k588P45J539n29m14K05p32L58J651r55k251J471K502j840k370J962
$$ 1830 1120 -1468 -723 816 287 -127 78 -654 -296 1355 400 -1851 -380 2122 282 -2088 -126
1946a26J908j781j211J239M88n12K97m40r32J403J332k294j496K914J478l207
$$ -126 1782 1 -1210 29 517 5 302 -138 -1070 333 1665 -629 -2125 789 2267 -940
1962i40j267L062R70k474o98J554N34l86n14q53O07K110q67l064J136L728j389
$$ -940 -2207 855 1825 -649 -1347 207 741 355 -159 -1012 -405 1705 838 -2226 -1090 2638 1249
1979A249l965J425L873j318l348Q79K549k05j600p57O93J800J67k905p78L798
$$ 1249 -2716 -1291 2582 1264 -2084 -1205 1344 1139 -461 -1218 -525 1275 1442 -1463 -2241 1557
1995A557J202m417j438M648J554m445j545L810J552k777j630J517J785q8k047
$$ 1557 2759 -1658 -3096 1552 3106 -1339 -2884 926 2478 -299 -1929 -412 1373 1285 -762
2010g62j303K366K520k698l450K931L982l016m093K777L864k225l440J419K761
$$ -762 -2065 301 2821 123 -3327 -396 3586 570 -3523 -746 3118 893 -2547 -1128 1633
2025A633k83k061r36J378K203q28l315M37M177j56m677k3M743J46m357k96L583
$$ 1633 1350 -711 -1647 -269 1934 1106 -2209 -1772 2405 2249 -2428 -2451 2292 2438 -1919 -2215 1368
2042A368N13k494q93J302J365o5j937j007K475J827k964k312L198K505l161k484
$$ 1368 1881 -613 -1506 -204 1161 1096 -841 -1848 627 2454 -510 -2822 376 2881 -280 -2764
2058b764K893K172k288j689J376J262l39q64p58N64J815m12k632L66L126m23l226
$$ -2764 129 2301 13 -1676 -300 962 623 -241 -999 -435 1380 968 -1664 -1298 1828 1405 -1821
2075a821M26L031m34k462L22J679j73o33k38l17O60J131j159j743J590K093j866
$$ -1821 -1395 1636 1202 -1260 -938 741 568 -65 -303 -620 40 1171 12 -1731 -141 1952 86
2092H6k084J939J772j660j351J189Q09m66k35l85k53J267N77k047p65K607Q10
$$ 86 -1998 -59 1713 53 -1298 -109 700 234 -1 -386 -639 628 1205 -842 -1607 1000 1810
2109A810k876p44K781O92k403o27J678O11p66o90k21Q67J246j147k129J415K711
$$ 1810 -1066 -1810 971 1663 -740 -1367 311 922 156 -534 -755 112 1358 211 -1918 -503 2208
2126B208j556l047J580L126j478k807J061K371m75j723l21J037J324m95k202o3
$$ 2208 652 -2395 -815 2311 833 -1974 -913 1458 983 -740 -1061 -24 1300 805 -1397 -1460
2142a460L024M40l602p50L903Q82l806j006L326J168k597j318J593J556m69j843
$$ -1460 1564 2004 -1598 -2348 1555 2437 -1369 -2375 951 2119 -478 -1796 -203 1353 884 -959
2158i59o56K183J648k499k408K698K932k756l093K542L061k067k841J393K409
$$ -959 -1615 568 2216 -283 -2691 7 2939 183 -2910 -368 2693 626 -2215 -822 1587
2173A587m37k013n61J555J586j151k591Q30L346n63l779L09L897j08l645j54L147
$$ 1587 1150 -863 -1424 131 1717 566 -2025 -1195 2151 1588 -2191 -1882 2015 1907 -1738 -1892 1255
2190A255M30k327q38J391J290l98j795m80K229J246k575j763K759K026k738k025
$$ 1255 1685 -642 -1480 -89 1201 803 -992 -1472 757 2003 -572 -2335 424 2450 -288 -2313
2206b313K412J939j908j696J163J359k63j064o68Q18J512o60k201N78K670n66
$$ -2313 99 2038 130 -1566 -403 956 693 -371 -1039 -221 1291 631 -1570 -992 1678 1112
2222A112k758M63K641l48k253J92J573J60q39n25J03Q84O39j332j151J623J524
$$ 1112 -1646 -1183 1458 1110 -1143 -951 622 782 -57 -582 -479 405 1044 -288 -1439 184 1708
2239A708j804j660J792J598j577j399J132J083n43o99k27L70R95r4j626j63K182
$$ 1708 -96 -1756 36 1634 57 -1342 -210 873 330 -369 -596 -226 769 675 -951 -1114 1068
2256A068K62k440l47K474L90k187m79J718N75j033p23K25R59N89j237j279J501
$$ 1068 1330 -1110 -1457 1017 1407 -780 -1259 459 1034 1 -722 -497 462 1051 -186 -1465 36
2273C6J798j691k158J659K359j583k201J177J992o66j639j5J231P92q11j593M48
$$ 36 1834 143 -2015 -356 2003 420 -1781 -604 1388 722 -917 -932 299 1091 280 -1313 -865
2290h65K310j57k776j56L136L10l095n58K867P75k348j000J591J273p67j579r4
$$ -865 1445 1288 -1488 -1644 1492 1802 -1293 -1851 1016 1791 -557 -1557 34 1307 540 -1039 -1133
2307a133J857R33k170j560K337K020k353k310K201K361j799k277J259K038n12
$$ -1133 724 1657 -513 -2073 264 2284 -69 -2379 -178 2183 384 -1893 -634 1404 892
2322H92j794l07J529J140j209j935R50K568p50k920N00L086k89k937k5K605K97
$$ 892 -902 -1209 320 1460 251 -1684 -734 1834 1084 -1836 -1336 1750 1461 -1476 -1501 1104 1401
2339A401j973p34J278J170n77j562j23J926P34k190j224K314J516k274j632K045
$$ 1401 -572 -1306 -28 1142 565 -997 -1120 806 1540 -650 -1874 440 1956 -318 -1950 95
2355I5J590j528j521R24J366k29j142n33R94J202q09j822P25K130n21k331M24
$$ 95 1685 157 -1364 -440 926 697 -445 -978 16 1218 409 -1413 -688 1442 921 -1410 -986
2372i86K204k26j939j2J454L37q86p14L58R71K62j319o95J531J085j662j253J572
$$ -986 1218 992 -947 -959 495 832 -54 -768 -410 561 823 -496 -1191 340 1425 -237 -1490 82
2390H2J343j391j239R85J120m68r16j03O76P27m88j301K96J745j64j977k0K071
$$ 82 1425 34 -1205 -220 900 432 -484 -587 89 816 328 -973 -677 1068 904 -1073 -1093 978
2408I78J43j909l20J590N03j088p40M91J000R1j237o48J474J117j585j464J547
$$ 978 1121 -788 -1108 482 985 -103 -843 -352 648 739 -498 -1146 328 1445 -140 -1604 -57
2425e7J684j410j741J168J625o77j504J50J273M47j012j074P68J619n10k096K77
$$ -57 1627 217 -1524 -356 1269 592 -912 -762 511 958 -54 -1128 -360 1259 749 -1347 -1070
2442a070K357o8k402j89K265M52j942p10J442J010q30j331K41J617L42j820q70
$$ -1070 1287 1219 -1183 -1372 893 1345 -597 -1307 135 1145 315 -1016 -775 842 1184 -636 -1506
2459a506J935J297j943j591J797J725j475j762J039J671m72j562j38J403P57j174
$$ -1506 429 1726 -217 -1808 -11 1714 239 -1523 -484 1187 715 -847 -985 418 1175 1
2475Aj375R85J844p85k163N65K286l20k200mK051K86j702n80J169R78o46j313
$$ 1 -1374 -389 1455 670 -1493 -928 1358 1038 -1162 -1166 885 1171 -531 -1111 58 1036 390 -923
2493i23J40J598L16j789o95J875R68j844j133J560J293j250j251P51J209j90j149
$$ -923 -783 815 1131 -658 -1353 522 1490 -354 -1487 73 1366 116 -1135 -384 825 635 -514
2510e14l55J003R15r07j305P44J645o02j775L96J741j60j585o5J275L65r05o37
$$ -514 -869 134 1049 142 -1163 -419 1226 624 -1151 -755 986 826 -759 -824 451 816 -89 -726
2528g26M45R84r1j198l30J368O44j465q19J371R43j143j044Q84R79m49r34k2Q54
$$ -726 -281 703 612 -586 -916 452 1096 -369 -1188 183 1126 -17 -1061 -177 802 353 -581 -603 251
2547B51M85p29r16O37J265m71j513L07J622j28j548j22J373L19r90o54O91Q47
$$ 251 736 7 -909 -272 993 522 -991 -684 938 810 -738 -860 513 832 -158 -812 -121 726
2565G26k62j071j81J265N22j353q55J375J077j281j210J081J220p11j207L02J131
$$ 726 464 -607 -788 477 999 -354 -1209 166 1243 -38 -1248 -167 1053 342 -865 -563 568
2582E68J54r97o44Q89J094p57j404N60J676m05j742J61J675J23j549l66J213O78
$$ 568 722 -275 -919 -30 1064 307 -1097 -537 1139 734 -1008 -847 828 951 -598 -964 249 927
2600I27q80r56M68J265r6j447l06J566O01j545q81J476J060j246j168R11J213
$$ 927 47 -909 -441 824 728 -719 -1025 541 1142 -403 -1284 192 1252 6 -1162 -251 962
2617I62n11j197N0J160M29j058q65R54J203q13j458O32J561l92j578J50J462J23
$$ 962 451 -746 -696 464 893 -165 -1030 -76 1127 314 -1144 -512 1049 657 -921 -771 691 814
2635H14j257m47R97P11o55r79L29J211k0j334k82J418N18j373o75J179Q31r14
$$ 814 -443 -890 107 818 163 -816 -487 724 704 -630 -912 506 1024 -349 -1024 155 986 72
2653G2r12N74R38j93r32j80Q89N47q42q78P32J128o14j254M26J275k14j183l7
$$ 72 -840 -266 672 479 -453 -633 256 803 -39 -917 -185 943 329 -925 -499 776 562 -621 -658
2672f58J000L05p91n24M84Q34k46r85rJ093K56j126m76J103O38r58p36O73Q23
$$ -658 342 647 -144 -668 -184 650 404 -581 -590 503 759 -367 -843 260 898 -60 -796 -123 700
2691G00m05q72J22P72K89p36o34P05Q78n97j051M52J166l25j140Q8J055J43q66
$$ 700 295 -577 -455 317 606 -130 -764 -59 819 222 -829 -377 789 464 -676 -588 467 610 -256
$$ [...]
8191a3
##END NTUPLES=NMR FID
##END=
