##TITLE=1H_LY-DMAA.Per.3.20
 CDCL3
 8 sc, 
 11.04.2022
##JCAMPDX= 6.0         $$ Bruker NMR JCAMP-DX V2.0
##DATA TYPE= NMR FID
##DATA CLASS= NTUPLES
##ORIGIN= UXNMR, Bruker Analytische Messtechnik GmbH
##OWNER= root
$$ XWIN-NMR		Version 3.5
$$ Mon Apr 11 10:38:00 2022 Russian Standard Time (UT+4h)  she@DPX200
##.OBSERVE FREQUENCY= 200.13135
##.OBSERVE NUCLEUS= ^1H
##.DELAY= (6, 6)
##.ACQUISITION MODE= SIMULTANEOUS
##.ACQUISITION SCHEME= undefined
##.AVERAGES= 8
##.DIGITISER RES= 18
##SPECTROMETER/DATA SYSTEM= spect
##.PULSE SEQUENCE= zg30
##.SOLVENT NAME= CDCl3
##.SHIFT REFERENCE= (INTERNAL, CDCl3, 0, 15.7039)
##AUDIT TRAIL= $$ (NUMBER, WHEN, WHO, WHERE, WHAT)
$$ ##TITLE= Audit trail, XWIN-NMR		Version 3.5
$$ ##JCAMPDX= 5.01
$$ ##ORIGIN= Bruker BioSpin GmbH
$$ ##OWNER= she
$$ F:/spectra/data/she/nmr/H-F/1/audita.txt
$$ ##AUDIT TRAIL=  $$ (NUMBER, WHEN, WHO, WHERE, WHAT)
(   1,<2022-04-11 10:36:26.50 +0400>,<she>,<DPX200>,
      <created by zg, POWCHK disabled, PULCHK disabled
       configuration hash MD5:
       00 E9 B6 7A A2 85 ED C7 34 08 36 98 17 FE 4E 26
       data hash MD5: 16K
       D6 63 93 33 68 1D 0F EF CA 0E 9E 6F C3 25 A4 D9>)
$$ ##END=
$$ 
$$ hash MD5
$$ D8 67 F3 F1 07 C9 5B 05 42 C7 EB BA 88 14 FE 77
##$RELAX= 
##$RELAX= 
##$RELAX= 
##$RELAX= 
##$RELAX= 
##$RELAX= 
$$ Bruker specific parameters
$$ --------------------------
##$DU= <F:/spectra>
##$EXPNO= 1
##$NAME= <H-F>
##$PROCNO= 1
##$TYPE= <nmr>
##$USER= <she>
##$AMP= (0..31)
100 100 100 100 100 100 100 100 100 100 100 100 100 100 100 100 100 100 
100 100 100 100 100 100 100 100 100 100 100 100 100 100 
##$AQSEQ= 0
##$AQ_mod= 1
##$AUNM= <au_zg>
##$AUTOPOS= <>
##$BF1= 200.13
##$BF2= 200.13
##$BF3= 200.13
##$BF4= 200.13
##$BF5= 200.13
##$BF6= 200.13
##$BF7= 200.13
##$BF8= 200.13
##$BYTORDA= 1
##$CFDGTYP= 0
##$CFRGTYP= 5
##$CHEMSTR= <none>
##$CNST= (0..31)
1 1 145 1 1 1 1 1 1 1 1 1 1 1 1 1 1 1 1 1 1 1 1 1 1 1 1 1 1 1 1 1 
##$CPDPRG= <>
##$CPDPRG1= <>
##$CPDPRG2= <>
##$CPDPRG3= <>
##$CPDPRG4= <mlev>
##$CPDPRG5= <mlev>
##$CPDPRG6= <mlev>
##$CPDPRG7= <mlev>
##$CPDPRG8= <mlev>
##$CPDPRGB= <>
##$CPDPRGT= <>
##$D= (0..31)
0 1.2 0 0 0 0 0 0 0 0.06 0 0.03 0 0 0 0 0.0002 0 0 0 0 0 0 0 0 0 0 0 0 
0 0 0 
##$DATE= 1649658985
##$DBL= (0..7)
120 120 120 120 120 120 120 120 
##$DBP= (0..7)
150 150 150 150 150 150 150 150 
##$DBP07= 0
##$DBPNAM0= <>
##$DBPNAM1= <>
##$DBPNAM2= <>
##$DBPNAM3= <>
##$DBPNAM4= <>
##$DBPNAM5= <>
##$DBPNAM6= <>
##$DBPNAM7= <>
##$DBPOAL= (0..7)
0.5 0.5 0.5 0.5 0.5 0.5 0.5 0.5 
##$DBPOFFS= (0..7)
0 0 0 0 0 0 0 0 
##$DE= 6
##$DECBNUC= <off>
##$DECIM= 32
##$DECNUC= <off>
##$DECSTAT= 4
##$DIGMOD= 1
##$DIGTYP= 9
##$DL= (0..7)
0 120 120 120 120 120 120 120 
##$DP= (0..7)
150 150 150 150 150 150 150 150 
##$DP07= 0
##$DPNAME0= <>
##$DPNAME1= <>
##$DPNAME2= <>
##$DPNAME3= <>
##$DPNAME4= <>
##$DPNAME5= <>
##$DPNAME6= <>
##$DPNAME7= <>
##$DPOAL= (0..7)
0.5 0.5 0.5 0.5 0.5 0.5 0.5 0.5 
##$DPOFFS= (0..7)
0 0 0 0 0 0 0 0 
##$DQDMODE= 0
##$DR= 18
##$DS= 0
##$DSLIST= <SSSSSSSSSSSSSSS>
$$ [...]
##$SUBNAM2= <"">
##$SUBNAM3= <"">
##$SUBNAM4= <"">
##$SUBNAM5= <"">
##$SUBNAM6= <"">
##$SUBNAM7= <"">
##$SUBNAM8= <"">
##$SUBNAM9= <"">
##$SW= 18.05172834244
##$SWIBOX= (0..15)
0 0 2 0 0 0 0 0 0 0 0 0 0 0 0 0 
##$SW_h= 3612.71676300578
##$TD= 16384
##$TD0= 1
##$TE= 0
##$TE2= 300
##$TE3= 300
##$TEG= 300
##$TL= (0..7)
0 120 120 120 120 120 120 120 
##$TP= (0..7)
150 150 150 150 150 150 150 150 
##$TP07= 0
##$TPNAME0= <>
##$TPNAME1= <>
##$TPNAME2= <>
##$TPNAME3= <>
##$TPNAME4= <>
##$TPNAME5= <>
##$TPNAME6= <>
##$TPNAME7= <>
##$TPOAL= (0..7)
0.5 0.5 0.5 0.5 0.5 0.5 0.5 0.5 
##$TPOFFS= (0..7)
0 0 0 0 0 0 0 0 
##$TUNHIN= 0
##$TUNHOUT= 0
##$TUNXOUT= 0
##$USERA1= <user>
##$USERA2= <user>
##$USERA3= <user>
##$USERA4= <user>
##$USERA5= <user>
##$V9= 5
##$VALIST= <valist>
##$VCLIST= <CCCCCCCCCCCCCCC>
##$VD= 0
##$VDLIST= <DDDDDDDDDDDDDDD>
##$VPLIST= <PPPPPPPPPPPPPPP>
##$VTLIST= <TTTTTTTTTTTTTTT>
##$WBST= 1024
##$WBSW= 4
##$XGAIN= (0..3)
0 0 0 0 
##$XL= 0
##$YL= 0
##$YMAX_a= 296141
##$YMIN_a= -303608
##$ZGOPTNS= <>
##$ZL1= 120
##$ZL2= 120
##$ZL3= 120
##$ZL4= 120
##$ABSF1= 10
##$ABSF2= 0
##$ABSG= 5
##$ABSL= 3
##$ALPHA= 0
##$AQORDER= 0
##$ASSFAC= 0
##$ASSFACI= 0
##$ASSFACX= 0
##$ASSWID= 0
##$AUNMP= <proc_1d>
##$AZFE= 0.1
##$AZFW= 0.1
##$BCFW= 1
##$BC_mod= 2
##$BYTORDP= 1
##$COROFFS= 0
##$CY= 11.3945322036743
##$DATMOD= 1
##$DC= 2
##$DFILT= <>
##$DTYPP= 0
##$F1P= 2.36226072786647
##$F2P= -0.459571619588291
##$FCOR= 0.5
##$FTSIZE= 0
##$FT_mod= 4
##$GAMMA= 1
##$GB= 0.15
##$INTBC= 1
##$INTSCL= 1
##$ISEN= 128
##$LB= 0.24
##$LEV0= 0
##$LPBIN= 0
##$MAXI= 10000
##$MC2= 0
##$MEAN= 0
##$ME_mod= 0
##$MI= 1.114404
##$NCOEF= 0
##$NC_proc= 0
##$NLEV= 6
##$NOISF1= 3.799351
##$NOISF2= 2.8
##$NSP= 1
##$NTH_PI= 0
##$NZP= 0
##$OFFSET= 15.70392
##$PC= 1
##$PHC0= -18309.46
##$PHC1= 24.60078
##$PH_mod= 1
##$PKNL= yes
##$PPARMOD= 0
##$PSCAL= 0
##$PSIGN= 0
##$REVERSE= no
##$SF= 200.130013532006
##$SI= 16384
##$SIGF1= 3
##$SIGF2= 2
##$SINO= 400
##$SIOLD= 16384
##$SREGLST= <1H.CDCl3>
##$SSB= 0
##$STSI= 0
##$STSR= 0
##$SW_p= 3612.71676300578
##$SYMM= 0
##$S_DEV= 0
##$TDeff= 0
##$TDoff= 0
##$TI= <>
##$TILT= no
##$TM1= 0
##$TM2= 0
##$TOPLEV= 0
##$USERP1= <user>
##$USERP2= <user>
##$USERP3= <user>
##$USERP4= <user>
##$USERP5= <user>
##$WDW= 1
##$XDIM= 8192
##$YMAX_p= 0
##$YMIN_p= 0
$$ End of Bruker specific parameters
$$ ---------------------------------
##NTUPLES= NMR FID
##VAR_NAME=  TIME,          FID/REAL,        FID/IMAG
##SYMBOL=    X,             R,               I
##VAR_TYPE=  INDEPENDENT,   DEPENDENT,       DEPENDENT
##VAR_FORM=  AFFN,          ASDF,            ASDF
##VAR_DIM=   8192,          8192,            8192
##UNITS=     SECONDS,       ARBITRARY UNITS, ARBITRARY UNITS
##FACTOR=    0.0002768,     1,               1
##FIRST=     0,             0,               0
##LAST=      2.2672688,     0,               0
##MIN=       0,             -303608,         0
##MAX=       2.2672688,     296141,          0
$$ Real data points
##PAGE= N=1
##DATA TABLE= (X++(R..R)), XYDATA
0@%%%%%%%%%%%%%%qJ6j6J6j6J6k4L2l2M0m8N5o3P2q5R4j05J20j38J56j75J99k23
37a17K47k76L08l43L80m22M70n18N68o26O91p60Q37r23J018j123J239j370J518
56G98j688J886k116K391k725L137l664M366n344O802r198J3789k5515J07233K05989
71B96141l60527k05002K93523K02087k15162j66843J02962J30670P414p8725j23704
82a17166L1689K20206J8623k97877n6486L41309Q7626l54363j03631L30766J10740
93B11436k78355j04349J99517R0853j06366p0451N410M8681R1388k6201j76443
104a14880O986K39888P417k78294j5589K87943J8403k69499j6257K25325J0618
115A02061j61882l207Q6423k904p077O772o7813o862J30622K344j75132P209J98521
$$ plain form
0 0 0 0 0 0 0 0 0 0 0 0 0 0 0 0 -8 8 -8 8 -8 8 -16 16 -16 24 -24 31 -32 40 -45 49 -56 64 -74 82 -93 106 -117
37 -117 130 -146 162 -181 199 -223 247 -271 297 -329 362 -398 439 -484 534 -589 650 -720 798
56 798 -890 996 -1120 1271 -1454 1683 -1981 2385 -2959 3843 -5355 8434 -17081 90152 296141
71 296141 -64386 -269388 24135 226222 11060 -155783 -52821 77849 85263 6538 -117166
82 -117166 -85477 134729 153352 -144525 -201011 140298 227924 -126439 -230070 100696 211436
93 211436 -66919 -171268 28249 119102 12736 -57715 -52305 -3624 87764 61563 -114880
104 -114880 -107894 131994 139411 -138883 -154472 133471 151874 -117625 -133882 91443 102061
115 102061 -59821 -63028 23395 20491 13414 20186 -47627 -54489 76133 78477 -96655 -89446 109075
128A09075k0360j99509L5115J79306m9864j41805O2286R2787p0045l8711P0904
139B9179j4498o4621O0527N0759r4407k9797J13258L141j16212K6422J04009n5910
151A1850p8859Q2952M5271j04350q170J17563k7574j20572N7533J12996p7399
162A1241r4851Q4495O6980p8362l1906N9813p120l1211M6524l879q3222M0262
174b1236J13209p3173j33399R8348J41995j11969j38306J11596J22446r6429r5653
185h2571O8248O1020k9665k1807j5374j8344O1648N6098j03516q7860J36175J10853
197A34905j55789j23892J59459J26050j46115j17519J16649R9253p4028p3803
207e4830K1969M3580L4437j1111q9256k0600J36689M8836j71843p1283J91084
$$ plain form
128 109075 88715 -110794 -75679 103627 53763 -88042 -25756 67031 -3014 -41725 29179
139 29179 14681 -49940 10587 61346 -33061 -62858 50400 53541 -62671 -36249 67760 11850
151 11850 -67009 15943 61214 -43136 -51306 66257 38683 -81889 -24356 88640 11241
162 11241 -83610 885 67865 -10497 -42403 17410 10290 -20921 25603 21724 -61498 -21236
174 -21236 91973 18800 -114599 -16251 125744 13775 -124531 -12935 109511 13082 -82571
185 -82571 -14323 46697 17032 -4775 -20149 -38493 23155 79253 -24263 -112123 24052 134905
197 134905 -20884 -144776 14683 140733 -5382 -122901 -6252 93001 18973 -54830
207 -54830 -32861 10719 45156 34045 -55211 -75811 60878 109714 -62129 -133412 57672
218E7672Q6913j91687r4421J73269R3804j37595q5720Q8078P1751k9326n3533
229b0795l2871L2766R1723j1699j41634p790J77633K4220j96271l6978J95543
240G3847M5170j75898m8856J39764M8842r0834m5942L4213M0902K4449l4446p8839
252f7628K7704J24184k1122j56263J4849J72279q942j71044L509J53427J574j21984
264d9457o766P9950J1964l2054j7203j6664K2438O0988k7683r7066L2478J21434
276H2359l6149j31884L8391J28158l8740j11439L6809Q4296l1909m9948K4329
287e727J2853j4334K2571K347n2554J1071P4095k4709q5161L7156Q4882m7674
299A4816p4218N5031N5140n8332l0555N6996L612n1217K1869M1417m2662k7983
$$ plain form
218 57672 144585 -47102 -141523 31746 125550 -12045 -97765 -9687 62064 32738 -20795
229 -20795 -53666 -20900 70823 59124 -82510 -90300 87333 111553 -84718 -121696 73847
240 73847 119017 -56881 -105737 34027 82869 -7965 -53907 -19694 21208 45657 11211 -67628
252 -67628 -39924 84260 63138 -93125 -78276 94003 85061 -85983 -82474 70953 72527 -49457
264 -49457 -56223 23727 35691 3637 -13566 -30230 -7792 53196 25513 -71553 -39075 82359
276 82359 46210 -85674 -47283 80875 42135 -69304 -32495 51801 19892 -30056 -5727
287 -5727 7126 -7208 15363 17710 -34844 -23773 50322 25613 -59548 -22392 62490 14816
299 14816 -59402 -4371 50769 -7563 -38118 18878 22490 -28727 -6858 34559 -8103 -36086
311c6086N6408J2161o1417M573N7395k0929m4688L5843K5483m7922k278N6153
323C4696k2026o0036M4147N9337o0908n4257O9908M4950p0000l2475O0568J7902
335C1806m2459k287J7438j3133J1395K7022m0872l8186O7694M6067q8277m9994
347g3786R9906M9983j00865m6103R0824L9196p0241l0056M1017J9448o246q330
359D747l0595k304O5566J1773r5101j9953J15597K6419j24881l0979J21788L3587
371G5664j06471l4586Q0242L3983m5443l1744N873K8204L4739k3586p2215J8054
383c7286J02915j1557j23483M663J31842K361j27375r402J10489J6129q2938k2249
395d5891M7501K7328q189l1293l1321L3901O6929l4746r5143L3502J13309l0309
$$ plain form
311 -36086 20322 32483 -28934 -24361 33034 12105 -32583 3260 28743 -19179 -21457 34696
323 34696 12670 -47366 -3219 56118 -4790 -59047 10861 55811 -14189 -46664 13904 31806
335 31806 -10653 -12940 4498 -8635 2760 29782 -11090 -49276 18418 64485 -23792 -73786
347 -73786 26120 76103 -24762 -70865 19959 59155 -11086 -41142 -125 19323 13077 4747
359 4747 -25848 -28152 37414 49187 -45914 -65867 49730 76149 -48732 -79711 42077 75664
371 75664 -30807 -65393 14849 48832 3389 -28355 -22482 5722 40461 16875 -55340 -37286
383 -37286 65629 54072 -69411 -64748 67094 69455 -57920 -67322 43167 59296 -23642 -45891
395 -45891 1610 28938 20749 -10544 -41865 -7964 58965 24219 -70924 -37422 75887 45578
407D5578j19782K4971J14618j7490r8371Q293P3128K188m1834j3063Q032K3728
419I996K5033l3216n4087M0447P6188m4755q9506M5613R3209m2933q7374L6437
431b4948P2971k6873n2067J5025K7249j732j488j1921k2549K4766M2379l5546
443E266n5815M3627O1893m8277o0292M9057N1751m5876l7526L9125J9801k9444
455f710j078J7463j6355m448L0455q666l9513K0637M2351l0577l9088L7608L0307
468C2386m1120j7304M1082J888l7642J3737L1458k7402k3005L7449J3440m2393
480a7426l669M1533n447l4760J3278K2797j9103p139K2600j0544k3972K8051K3271
493B9470m3310k0907N4258J7196n9557j2912N8367Q410n0326m200L6300N88j7537
$$ plain form
407 45578 -74204 -49233 65385 47895 -50476 -42183 30945 33133 -8701 -21764 -13732 9996
419 9996 35029 1813 -52274 -11827 64361 19606 -69900 -24287 68922 25989 -61385 -24948
431 -24948 48023 21150 -30917 -15892 11357 9625 8137 -3784 -26333 -1567 40812 5266
443 5266 -50549 -6922 54971 6694 -53598 -4541 47210 1334 -36192 2933 22734 -6710
455 -6710 -7788 9675 -6680 -11128 19327 10661 -28852 -8215 34136 3559 -35529 2079 32386
468 32386 -8734 -26038 15044 16932 -20710 -6973 24485 -2917 -25922 11527 24967 -17426
480 -17426 -21095 20438 14991 -19769 -6491 16306 -2797 -9936 12664 2120 -21852 6199 29470
493 29470 -13840 -34747 19511 36707 -22850 -35762 22605 31015 -19311 -23511 12789 13377 -4160
506d160K100l901l692K5944M575m6166m663O2195M407p2303m066P5277M166p0648
520c0935m925N8616O305m0528q419J8029J1046O490j3808l0731J6003N2177j7358
533B1962o8472J7201P8278j5248q0432J1377P4761n699o1816j266M3126R138k0449
546B461j7107l821K4277K7391k9943m7762L3333O3071l4059p2044L1786P3661
558E1244k6594o8141J8805N6156r013l9215k165J9207J3628J879k4380k1700L3432
571C143L8468l9896n0527M3035N7027m2266n7461L7669N2196k9564m2085J8467
583a1794K8554n559j3088q078k509K0967J6513l2034k7700M0159L4997m4555l7936
596d2063M4796L6420m1040l0906L3721K2454k3505j2105J1451J435J170Q418j3122
$$ plain form
506 -4160 -2060 -5961 -9653 16291 20866 -25300 -29963 32232 36639 -35664 -39730 35547 39713 -30935
520 -30935 -35860 22756 29061 -11467 -19886 -1857 9189 15679 1871 -28860 -12857 39320 21962
533 21962 -46510 -29309 48969 33721 -46711 -35334 39427 33728 -28088 -29354 13772 22910 2461
546 2461 -14646 -18467 5810 33201 3258 -44504 -11171 51900 17841 -54203 -22417 51244
558 51244 24650 -43491 -24686 31470 22457 -16758 -18923 284 13912 15791 -8589 -30289 3143
571 3143 41611 1715 -48812 -5777 51250 8984 -48477 -10808 41388 11824 -30261 -11794
583 -11794 16760 11201 -1887 -9965 -12474 8493 25006 -7028 -34728 5431 40428 -4127 -42063
596 -42063 2733 39153 -1887 -32793 928 23382 -123 -12228 -777 658 1828 10246 -2876
609b876j6171K3470K1080l1207k2698L5729K0900l6795j6086L4333R062k8899
621a0158r71K0910p086j1559J3993J748j8787P500K0772j5352j9619K1007J5459
634A7857k3917q688K4071K85k1571Q786J7064j7355j1130K4445M716k9050J414
647a3073L0451o566k8358J0072K2910j1689j4656J1260M241r127O982N730j8036
660i859j634K7737k565l4921O144L8752q575l8652R516L4665q610k7039O060J6530
674G549j997m134l010q850Q411K1121j3463l1551J7392L8933j9534m2677J9518
687a2292M2166j7106l7728J2374K9666n695j8832k225O297J0607O620j8448j8706
700b3302K4913K8893k9148l6024L0551L9628k8896l9364K4273L5476j6999k8386
$$ plain form
609 -2876 -19047 4423 25503 -5704 -28402 7327 28227 -8568 -24654 9679 18741 -10158
621 -10158 -11129 9781 2695 -8864 5129 6877 -11910 -4410 16362 1010 -18609 2398 17857
634 17857 -6060 -14748 9323 9608 -11963 -3177 13887 -3468 -14598 9847 14563 -14487 -13073
647 -13073 17378 10812 -17546 -7474 15436 3747 -10909 351 4592 -4535 2447 8177 -9859
660 -9859 -11493 16244 13679 -21242 -15098 23654 15079 -23573 -14057 20608 11998 -15041 -8981 7549
674 7549 5552 1418 -1592 -10442 -2031 19090 5627 -25924 -8532 30401 10867 -31810 -12292
687 -12292 29874 12768 -24960 -12586 17080 11385 -7447 -9672 -3375 7232 13852 -4596 -23302
700 -23302 1611 30504 1356 -34668 -4117 35511 6615 -32749 -8476 27000 10001 -18385
712a8385P758J8899K476q150j2800k819K2096J2911k9492k1268L4129K7077l5616
725c184k9919L3731K9668k8499k6651K0561K1233j0511j4132n15O314J1657J399
738A1152k1679q302K9671J3740l4770j7224L6497J8512l4777j7764K9681J5203
750A9940k1827j1372J2106O646j562j879q805k426J7903N867k4851q027K9076
763A0789Q761l0191q090K8359O290k3743l622J7055O39r142K342P89m649P099
777B686O039j3740o400J8523N373k0979l321K1007L83j8821L014J4601o395r097
791g127R274L049j1309K963J2123q111j1519J1913R525j3835o241J3819K040j1867
805e303K656Q387p335l874J1537r78j4823N521J6685r245j7019J1500J5712j2087
$$ plain form
712 -18385 -10627 8272 10748 2598 -10202 -13021 9075 21986 -7506 -28774 5355 32432 -3184
725 -3184 -33103 628 30296 1797 -24854 -4293 16940 6429 -7703 -8218 -1904 9753 11152
738 11152 -10527 -18829 10842 24582 -10188 -27412 9085 27597 -7180 -24944 4737 19940
750 19940 -1887 -13259 -1153 5493 3931 2052 -6753 -9179 8724 14591 -10260 -18287 10789
763 10789 19550 -10641 -18731 9628 15918 -7825 -11447 5608 6247 -2895 -553 236 -4413 2686
777 2686 8725 -5015 -11415 7108 12481 -8498 -11819 9188 9571 -9250 -6236 8365 1970 -7127
791 -7127 2147 5196 -6113 -3150 8973 862 -10657 1256 10781 -3054 -9295 4524 6564 -5303
805 -5303 -2647 5740 -1595 -5469 6068 5090 -9733 -4212 12473 3228 -13791 -2291 13421 1334
819A334j2807J0819Q592p953l533L756j853J208P141o245j1892J0919J5517j4456
833E47j7614J6431J8183j6502j7078J4583J4435j0843j0483N554N750O23n66p196
847d176m601J3318R164j8379j2765K1650J5101k2723j6106K1489J5614j7868j3802
860a4084J2351J0888n340p252k271L233R890P69j6527m440K1621P425k4590r556
874a7883K5040J0694k3049j0799J8685J0013j2587q513N244O457K525m102j0056
887h331J744J6496M38k1276k224K3965L668k4290m530K2247M974j8049m956J2254
901B130M596n314m130j862L445Q691k835j4383K237J8418j785k0489J379K0296
915A0394j051j8087P23J4135m12q925OL120N41K652j117p763J798J1782k553j4191
$$ plain form
819 1334 -11473 -654 7938 -15 -3548 208 -1645 -437 6704 459 -11433 -514 15003 547
833 547 -17067 -636 17547 1045 -16033 -1450 12985 2142 -8341 -2787 2963 3586 3020 -4176
847 -4176 -8777 4541 13705 -4674 -17439 4211 19312 -3411 -19517 1972 17586 -282 -14084
860 -14084 -1733 9155 3815 -3437 -5708 -2475 7415 8184 -8343 -12783 8838 16263 -8327 -17883
874 -17883 7157 17851 -5198 -15997 2688 12701 114 -8399 -3155 3302 5827 1725 -8331
887 -8331 -6587 9909 10347 -10929 -13153 10812 14480 -9810 -14340 7907 12881 -5168 -10124 2130
901 2130 6726 1412 -2718 -4580 -1135 7556 4721 -9662 -7425 10993 9208 -11281 -9902 10394
915 10394 9343 -8744 -8021 6114 5702 -3223 -3217 -97 444 3096 1979 -5784 -3986 7796 5243 -8948
931h948L311J4943l943j3924M356J1504m517p938M307L731l813O04K943m615j780
946c779P724M02r763J057J0410k487r736L834P784m841m931N528J500n746K106
961i38N478n267m792P740L691r088k317R203Q07q028P17N714k146k620L380j071
977D63m248M671M761p836m922J0144M693j1299m121J1132L364r686k381P037J376
992C148l454l39o51n97M825J429q566k106J1610K553j3413k961J3918L093j2944
1007d455l152J0524L109p080k932K710K743J958k450o464K041J0382j559j3280
1021g905J018J4869l41j4904l61J3466J135j0623j919O753K692k252l387k366
1035d125L889O676m158j0294M155J2739l823j3964L160J3719k182j2225R50R515
$$ plain form
931 -8948 -5637 9306 5363 -8561 -4205 7299 2782 -5156 -849 2882 -931 -327 2616 -1999 -3779
946 -3779 3945 4347 -5416 -4359 6051 3564 -6172 -2338 5446 605 -4326 1202 2702 -3044 -938
961 -938 4540 -727 -5519 2221 5912 -3176 -5493 3710 4517 -3511 -2794 2920 774 -1846 1534 463
977 463 -3785 886 5647 -2189 -7111 3033 7726 -3573 -7694 3438 6802 -2884 -5265 1772 3148
992 3148 -306 -645 -1296 -1893 2932 4361 -4205 -6311 5299 7852 -5561 -8522 5396 8489 -4455
1007 -4455 -7607 2917 6026 -1054 -3986 -1276 1467 3425 975 -5489 -3448 6934 5375 -7905
1021 -7905 -6887 7982 7641 -7263 -7624 5842 6977 -3646 -5565 1188 3880 1628 -1759 -4125
1035 -4125 -236 6440 2282 -8012 -3857 8882 5059 -8905 -5745 7974 5792 -6433 -5483 4032
1049D032M58o032j878K055L323J960m486n592N335Q570n751j0504N716J1378n224
1064C360j0963M160R526k780p126J043M235O54r42k483k219M037M877n203o872
1079f696N912P965o136q134N846P321m968n734L712L674k190j297N02j077J224
1094g6L130k696m606L853N442m612n530M883M920m681l776M036K170l106l51J937
1110I37j537n86L053o61m173J747M705k509m617L022L854l065k590K811R64k269
1126i14R29J479k680o69M196j98n254R30N662j426n460J654M599j618l214J326
1142f58J342q17P14J61k723N18M455j103n679J488O409j602o472J505N873j092
1158B319m636M80K956L03r51j209j154K009L183k755m772L109N912l209o513K920
$$ plain form
1049 4032 4490 -1542 -3420 -1365 1958 3918 -568 -6160 -825 7745 1994 -8510 -2794 8584 3360
1064 3360 -7603 -3443 6083 3303 -3823 -2780 1455 2109 1167 -1316 -3535 502 5379 176 -6696
1079 -6696 -784 7181 1045 -7089 -1243 6078 1110 -4624 -912 2762 572 -725 -223 -1300 -76
1094 -76 3054 358 -4248 -395 5047 435 -5095 -212 4708 27 -3749 287 2457 -649 -1000 937
1110 937 -600 -1186 1867 1206 -2967 -1220 3485 976 -3641 -619 3235 170 -2420 391 1355 -914
1126 -914 15 1494 -1186 -1855 2341 2143 -3111 -2181 3481 2055 -3405 -1751 2848 1230 -1984 -658
1142 -658 684 -133 581 742 -1981 -1463 2992 1889 -3790 -2302 4107 2505 -3967 -2462 3411 2319
1158 2319 -2317 -1837 1119 1422 471 -738 -1892 117 3300 545 -4227 -1118 4794 1585 -4928 -2008
1174b008O453k352n748J416M531l03k862r26R40K155J066l204k840M012M255m358
1190B27n235M374N668l901n553L057M901j883l814M77K401J006q92k431o67L597
1206A332K025m442l085M835L753m744m053M198L989l275l487K002K757n73j725
1221d93r54O84K342L52l434j255M208J891m508k338M377K463l814k320K921J885
1237B007j764j346M33P19Q17l0j966n29K801J008l353j231L500J271l215j135
1253b013K660Q82j822n17Q57Q1J87K69j115n90J833Q30k368q80K484Q54k409o62
1271a439J983L51j310m0N42k88K64O26j007q91J643J076j990j124K112J072j906
1288c26r20J495O43q51l13J06q2O56M26j386p34J863J007k211j137K218J188j979
$$ plain form
1174 -2008 4445 2093 -3655 -2239 2292 1989 -873 -1799 -859 1296 2362 -842 -3682 330 4585 227
1190 227 -5008 -634 5034 1133 -4420 -1363 3538 1655 -2159 -1682 719 1725 833 -1598 -2265 1332
1206 1332 3357 -1085 -4170 665 4418 -326 -4379 -181 3808 533 -2954 -952 1805 1232 -493
1221 -493 -1447 -763 1579 1931 -1503 -2758 1450 3341 -1167 -3505 872 3335 -479 -2799 122 2007
1237 2007 243 -1103 -670 49 866 836 -1130 -1659 1142 2150 -1203 -2434 1066 2337 -878 -2013
1253 -2013 647 1529 -293 -810 47 128 315 584 -531 -1121 712 1542 -826 -1706 778 1632 -777 -1439
1271 -1439 544 895 -415 -455 87 -201 63 689 -318 -1209 434 1510 -480 -1604 508 1580 -326
1288 -326 -1246 249 892 41 -272 -166 -248 408 834 -552 -1286 577 1584 -627 -1764 454 1642 -337
1306c37j163J506J004q35p54L8M97Q19k19j525r7K173L59k546n92K690P65k465
1324f82r22K049R78j369j031N84R62K66q56j127O87J788m84k321K64K571j8k549
1342a210k59K307M63j784o62J147Q49l97r54l81J053J076j028j631R67J989q40
1359G05k123O37K021l93j755J04J295K02p63m94J49P66M27j018q65J166J184j207
1377C8j330J118J378r50j251P37R78l97o26M5K60K47J42n73m69Q79O17j012p34
1396i03J050O69r93n58Q63L40o46o8L20j72NL92k51n86N55O26p05n94Q22M06p37
1417a65k19O63m3m72L25K04n52O4P22l69q65N75Q89p41p97P88N62p05l39N35K5
1438H5k50K68l4n61M05Q07p27q88R89R18j135q59J173P39j075m85P99K57m55j6
$$ plain form
1306 -337 -1500 6 1010 175 -579 -541 -44 775 556 -969 -1066 1107 1466 -1080 -1672 1018 1783 -682
1324 -682 -1604 445 1423 54 -977 -393 569 835 -21 -1148 -461 1327 843 -1478 -1214 1357 1339 -1210
1342 -1210 -1469 838 1301 -483 -1145 2 851 454 -500 -881 172 1248 220 -1411 -444 1545 705
1359 705 -1418 -781 1240 847 -908 -804 491 693 -70 -564 -415 351 778 -240 -1105 61 1245 38
1377 38 -1292 -174 1204 254 -997 -260 718 321 -305 -260 0 247 389 -184 -653 226 843 -169 -903
1396 -903 147 816 -177 -735 128 468 -178 -246 74 -98 -93 299 48 -538 17 643 -62 -656 166 572 -165
1417 -165 -384 279 236 -236 89 293 -259 -195 527 158 -707 -132 757 16 -781 7 569 -136 -475 60 85
1438 85 -165 103 69 -492 -87 720 -7 -895 94 1012 -123 -982 191 930 -145 -630 169 426 -29 -45
1458d5Jk57M96M31r74n50J345O04j632o17J773N09j715l81J465K55j061j58N97
1477H6O3KL3o36k6J246Nj729Q2K025j81k119K30K059k99j768K04J396j87p63L4
1498b43Q7J49N40l84j158O72J656q78k022J075K140j123k064J116J780r10j399
1515i66O80Q36l01j88k05m02O82R20j176j357J577J645j878j721J964J654j902
1532a38j465J668J089j182o52N95J79Q0K83p71o47J467R06k011j012K392R77k465
1550g07r08K353P02k034m32J492R6p71J18Pl54P57M70j459n31K049M19k357k79
1569a369K470P1k308J71J978m29j349O01O91o82M9P05p82n75J375L41j824j3K015
1588A136l27k060O88J786r79j388J246P51j345j28J300m77j153J005Q72j354m54
$$ plain form
1458 -45 -44 -301 195 626 -348 -898 447 1051 -581 -1198 575 1084 -631 -1012 453 708 -353 -511 86
1477 86 149 151 184 -452 -478 768 773 -956 -874 1151 970 -1149 -919 1140 841 -927 -723 673 486 -277 -243
1498 -243 -156 -7 533 149 -1009 -337 1319 441 -1581 -506 1634 511 -1553 -437 1343 433 -966
1515 -966 -286 550 249 61 -144 -546 136 1056 -120 -1477 100 1745 -133 -1854 110 1764 -138
1532 -138 -1603 65 1154 -28 -680 -85 94 174 457 -314 -961 506 1412 -599 -1611 781 1758 -707
1550 -707 -1615 738 1440 -594 -1026 466 562 -209 -91 -84 -438 319 789 -670 -1201 848 1267 -1090 -1369
1569 -1369 1101 1172 -1136 -965 1013 584 -765 -164 527 -155 -106 599 -183 -758 617 958 -866 -879 1136
1588 1136 809 -1251 -563 1223 244 -1144 102 853 -492 -620 680 203 -950 55 927 -427 -881
1605h81J554l3j496N39J277j007q82J433L61j717K14J847p71j822J223J594j479
1622d6j237J527P75j378k21R81l22n47R68j69j433Q74J740j468j919J972J935
1639B032k226j799K259J498j996j074J512N35p07m4j73m60J029R66j948j301K662
1656G65J500l113j593L260J536l043j432K545J109j683p42O08M14N11J8j646l56
1673a342K678O04l407q05L854R35l950r89L645R34k935q63J886P60p01n93o39
1690i28M70J865l49k955K36L733j12m141LM193M8l729j89L008K84j878l67N65
1708b43N05P35o28j946P39K954q43l614Q87L886q58l814P70L312o52k485M11J451
1726E67j98k69j30q57M37J888p61k637J038L082j222l162J331K920j332k327J235
$$ plain form
1605 -881 673 640 -856 -317 960 -47 -929 504 865 -852 -638 1209 438 -1384 -161 1433 -46
1622 -46 -1283 244 1019 -359 -580 401 79 -468 500 331 -1102 -228 1512 44 -1875 97 2032
1639 2032 -194 -1993 266 1764 -232 -1306 206 741 34 -10 -183 -643 386 1352 -596 -1897 765
1656 765 2265 -848 -2441 819 2355 -688 -2120 425 1534 -149 -891 -283 131 642 660 -986 -1342
1673 -1342 1336 1940 -1467 -2272 1582 2517 -1433 -2422 1223 2157 -778 -1641 245 1005 304 -289 -928
1690 -928 -458 1407 1058 -1897 -1661 2072 1960 -2181 -2178 2015 2063 -1666 -1855 1153 1437 -441 -808 -243
1708 -243 262 997 369 -1577 -838 2116 1273 -2341 -1454 2432 1574 -2240 -1470 1842 1190 -1295 -884 567
1726 567 369 100 -30 -887 -450 1438 677 -1960 -922 2160 938 -2224 -893 2027 695 -1632 -397
1743c97J526r84o08O87l63l05J245j26j949N60K351r63k455J230K257j425j800
1760a519J511J069j463j73J274o83r52J410O20k015j98K309j58k320N11K028q04
1777D47j447J007O80j127K17J145j150j071J930R15k555o77K832M76k842k18K478
1794A040qj791J83Q61k95K11L85j277m04K312L62l077l51L560K68l658k51L376
1812A446K71k734k66J729K75n14l54p81L70K046m43l102M74L842l73m255K78M229
1830B138j05l749j14K937L82j783o54M50R01R68j144k213J284L296j362m058J290
1847a536M375j117m286Q18L729l91k869p5J676O41l73j149j013J592K218j907
1863C33l123K046L782k044l988J833L806j428l224Q94K348k66j220m34M1J082
$$ plain form
1743 -397 1129 145 -463 224 -139 -444 801 675 -1274 -714 1637 674 -1781 -551 1706 281 -1519
1760 -1519 -8 1061 -402 -575 699 16 -936 474 1094 -921 -1119 1190 1032 -1288 -777 1251 447
1777 447 -1000 7 687 -440 -223 922 -228 -1299 631 1546 -1009 -1686 1146 1622 -1220 -1438 1040
1794 1040 1032 -759 -576 285 -10 201 586 -691 -1095 1217 1579 -1498 -1849 1711 1979 -1679 -1930 1446
1812 1446 1717 -1017 -1283 446 721 207 -147 -928 -558 1488 1045 -2057 -1583 2259 1886 -2369 -2091 2138
1830 2138 2033 -1716 -1830 1107 1489 -294 -948 -498 403 1371 227 -1986 -702 2594 1232 -2826 -1536
1847 -1536 2839 1722 -2564 -1746 1983 1592 -1277 -1352 324 965 592 -557 -1570 22 2240 333
1863 333 -2790 -744 3038 994 -2994 -1161 2645 1217 -2007 -1113 1235 969 -251 -685 -644 438
1879D38J098j632k104K048K810k321l166K297L227k127k901J737K266j173j451
1894i54N21M99K26M55r11j287J479J948j921k315K145K457k226k265K070J785
1910A706j684j153J176L66n54M27n7j203P09J736j201k052J540K098j710j855
1926a711J691J391j499p14J132l3o95Q19K46j565K75K039o37k340R43K310j103
1943E49k000J070J462r02p01N83j42k93J046r7j833M31K473p47k820R10K905q84
1961A010k685P99K152n71j345J90M14K36O07o57j602J055K408j279l016J364L331
1978B411j343l289J052K921o82k212J19J317M55k67j014q29J529J830j889k677
1994b568K131L215k091l416J839L321j372k894P23K205L2j307p78K66J514P68
$$ plain form
1879 438 1536 -96 -2200 -152 2658 337 -2829 -532 2695 568 -2333 -596 1670 497 -954
1894 -954 -433 66 292 747 -164 -1451 28 1976 55 -2260 -115 2342 116 -2149 -79 1706
1910 1706 22 -1131 45 411 -143 284 227 -976 -267 1469 268 -1784 -244 1854 144 -1711
1926 -1711 -20 1371 -128 -842 290 257 -438 381 627 -938 -663 1376 739 -1601 -658 1652 549
1943 549 -1451 -381 1081 179 -522 61 -81 -374 672 575 -1258 -827 1646 899 -1921 -1011 1894 1010
1961 1010 -1675 -876 1276 705 -640 -450 -36 200 807 150 -1452 -397 2011 732 -2284 -920 2411
1978 2411 1068 -2221 -1169 1752 1070 -1142 -1023 294 749 482 -532 -1361 168 1998 109 -2568
1994 -2568 -437 2778 687 -2729 -890 2431 1059 -1835 -1112 1093 1125 -182 -960 -694 820 1588
2010A588k110j732K535K465k711k980K624L122k233l011J632K603q87j928J3J090
2026H0R02j95j689p09K341J501k754k099K896K451k757k488K305K302j639j887
2042a439Q28J274P9o03r59j03J729P71k290j342K667J687k765j804K559J710k088
2059h9j463J456J034o37n01k05j2R36N46j609r78K071J252k265j406K231J352
2076A713j969j101J447P70q82k69J64k37N15P34j120j058J529J300j745j360J742
2093A73J246j516r75J166N25n87p6K7m97N76R87j090j369J450J617j651j687J608
2111g3J565j380j309R67Q73m19l41j67k44P76Q13j276j320J648J716j839j909
2128a919J807J934j512j749J014J431m51q73k86L09R33L37j556r49K003J442k244
$$ plain form
2010 1588 -522 -2254 281 2746 35 -2945 -321 2801 568 -2443 -811 1792 905 -1023 -1010 80
2026 80 982 787 -902 -1611 730 2231 -523 -2622 274 2725 -32 -2520 -215 2087 448 -1439
2042 -1439 -611 663 742 139 -820 -923 806 1577 -713 -2055 612 2299 -466 -2270 289 1999 -89
2059 -89 -1552 -96 938 301 -200 -405 -417 519 1065 -544 -1522 549 1801 -464 -1870 361 1713
2076 1713 -256 -1357 90 860 -22 -291 -127 -364 151 885 -235 -1293 236 1536 -209 -1569 173
2093 173 1419 -97 -1072 94 619 32 -44 -17 -514 62 1049 -41 -1410 40 1657 6 -1681 -73
2111 -73 1492 112 -1197 -230 643 224 -117 -284 -528 248 1061 -215 -1535 113 1829 -10 -1919
2128 -1919 -112 1822 310 -1439 -425 1006 555 -318 -604 -295 638 975 -581 -1530 473 1915 -329
2145c29j831K252J995j988j993J517J792q34j440J14Q88P24l33j480k46K103Q41
2162A752k559j276K665J637k558j808K194J803j569j674Q28J319O5r23r26M35
2178e95J686Q8k266n91K659R96k758j302K565J465k100j450J423J314n87j076
2194e29k53O92J103k94j852o8K340L99k574o97K534R32k328r74J814R39j094q46
2212g56L32O52M41m00j193J70J751R7k111l06K262M80k136n94J811O09j296n33
2230g20O36M07Q8k79p41Q5J333M6j708k12J845L45j840m11J588L95j136l42N93
2249b8K34K2r4n96p4J159K15j502l70J682M95j655n26J438N11j063l93M80L11
2268B46O3j42o20p2J107K66j518m26J712N79j709o72J472P10j095o67N96N41M7
$$ plain form
2145 -329 -2160 92 2087 99 -1894 -377 1415 581 -859 -745 143 867 534 -946 -1192 911 1752
2162 1752 -807 -2083 582 2219 -339 -2147 47 1850 281 -1393 -565 754 819 -104 -1030 -595
2178 -595 1091 1179 -1087 -1678 981 1977 -781 -2083 482 1947 -153 -1603 -180 1134 547 -529
2194 -529 -782 -90 1013 719 -1133 -1201 1139 1538 -1036 -1733 801 1733 -595 -1569 245 1184 90 -756
2212 -756 -424 228 669 269 -924 -754 997 1094 -1017 -1323 939 1419 -717 -1311 500 1109 -187 -720
2230 -720 -84 323 411 132 -609 -524 809 855 -853 -1065 780 1125 -715 -1126 462 857 -279 -621 -28
2249 -28 206 228 134 -462 -536 623 838 -664 -1034 648 1143 -512 -1038 400 911 -152 -545 -65 246
2268 246 309 167 -453 -525 582 848 -670 -1096 616 1195 -514 -1186 286 996 -99 -766 -170 371 418
2287D18l99o44J68J218L5j632k65J870N06j906o55J727P81j380q28Q50P95k05
2305D54p20m25N07J088l42j562P8J917J99k086m10K021N84j700q14J312Q31o35
2323B97r09K0Q52O12o75j276N46J686k77k002J3K095K24j950m47J557O83j101
2341e2q06M94Q59K00q68q07P64J374o20j727M01J925j25j930j20J754L20j338
2359c02n31P95P18k86p34l53P57Q55o88j306N84J560m23j664K21J576kj320k06
2378g49R22M08m53n41l5O22N51o48r56O17J231m95j374L43J389j79j216l1Q91
2397B97K09m83l52L4M42L81m73q02M39J097l97j224K85J238j44j070n0Q55J82
2416D64n05k90N7M37L15m33p27M66R91l83j153K49J194q5j108o8Q65J98n14l57
$$ plain form
2287 418 19 -625 -457 761 796 -836 -1101 769 1275 -631 -1286 441 1222 -158 -986 -136 659 454
2305 454 -266 -691 -184 904 562 -1000 -922 995 1194 -892 -1302 719 1303 -397 -1211 101 932 297
2323 297 -612 -592 260 872 197 -1079 -533 1153 876 -1126 -1113 982 1206 -744 -1191 366 1049 -52
2341 -52 -858 -364 495 695 -173 -980 -216 1158 538 -1189 -788 1137 1012 -918 -1038 716 1036 -302
2359 -302 -833 -38 680 394 -340 -693 64 919 231 -1075 -491 1069 646 -1018 -797 779 777 -543 -749
2378 -749 173 581 128 -413 -448 174 725 77 -879 -262 969 474 -900 -557 832 653 -563 -594 297
2397 297 506 23 -329 -295 147 528 55 -747 -308 789 392 -832 -547 691 547 -523 -573 282 464
2416 464 -41 -331 -274 163 478 45 -682 -216 775 392 -761 -512 682 597 -511 -579 286 484 -30 -387
2436c87J51M72K84n61o71N37R84m96j163L50J252j79j155m5R93K24o89l88K95
2455a92N70Q3o36n34O91Q48o24j131N28J268l13j313J04J182J12q79l84N53N96
2474E29j89o98k25P84O05q06r33P52J139n84j233L91J179j14j032j48P57M11m48
2493A37o14L9P91K71q49o36Q63R01p71j072O15J108l74j015P3R01J52n94m39K96
2513b17O56M4p83l63Q53O47q32q34P02R46n12r50K79Q23m3o20k52M19M39j20o78
2534c96j08P35M06p91n80P44P01o07p56M47P15k35n80m7M23K80k06m67n3O56K62
2555E43p12m24O74N67o04o34M29O41k36n47j3M12K14k17l90rN76J62o32l91O73
2576H2N00n58n75M28N82k49n31M8M00K04k74l87N7N54J39o46l14O63M60o08n63
$$ plain form
2436 -387 -236 236 520 -41 -712 -175 809 313 -850 -500 752 573 -582 -627 366 590 -99 -487 -192
2455 -192 378 461 -175 -709 -18 830 206 -925 -397 871 558 -755 -651 531 643 -236 -620 -67 529
2474 529 340 -358 -583 201 806 0 -933 -181 958 374 -859 -468 711 597 -435 -583 174 585 137
2493 137 -477 -438 353 624 -225 -861 2 903 132 -940 -325 783 409 -606 -533 368 520 -74 -513 -217
2513 -217 439 483 -300 -663 190 837 5 -829 -127 819 307 -643 -364 459 416 -204 -456 -37 402 282 -396
2534 -396 -504 231 637 -154 -734 10 711 104 -652 -205 510 275 -305 -352 71 351 145 -322 -375 281 543
2555 543 -169 -593 81 648 44 -590 -161 480 244 -303 -316 96 310 93 -297 -306 270 432 -200 -591 82
2576 82 582 24 -551 -123 459 210 -321 -273 127 331 57 -330 -273 281 420 -226 -540 123 583 -25 -588
2597e88N08N66l07n50J16M38J57l36l46J85N14J3o53k14P21L64p06m45N42N56
2617E35m03n56J74N50M1m64k72K65N39j55o52l1P32K45q01l49O99M84n69n46L86
2638a48N26j10m76j66M35L63k72n47R6P06L8p76j67P41L11o65m06M97M65k66n07
2659c28N1M33J83l87l42K28N69j14o61n1P20J47o77k75N81L64l73m35J90M20N4
2680B97l81l08L71M38k05o07J15O59J4o60j44N97K15m57k97K88L15m6l79j02K99
2701B2L07k41m53J72M97Kn86n6N45J32m25k36K91K84j34k67m5K50K36k31m19K22
2723a33M72j03n34J8N13O0m23j57L07K19j19l22j3L20J64k43l73K60M45j60m98
2744c00L2N54M1m90j32L62K32k35k96O4K97R9k98k69K93L93k05n00J42N14m6n05
$$ plain form
2597 -588 -80 486 179 -371 -255 183 340 4 -342 -157 357 370 -283 -497 224 588 -118 -563 -21 535
2617 535 132 -424 -250 300 341 -123 -395 -130 409 254 -398 -429 303 548 -253 -602 97 581 12 -534 -148
2638 -148 378 268 -208 -374 61 424 152 -395 -299 407 445 -331 -498 243 554 -111 -517 -20 445 179 -328
2659 -328 -277 156 339 -48 -390 -162 407 293 -368 -419 301 448 -229 -504 77 441 68 -367 -177 243 297
2680 297 -84 -392 -21 417 212 -395 -280 379 393 -267 -411 186 401 -56 -353 -65 250 204 -175 -277 22
2701 22 329 88 -365 -193 304 306 -280 -336 209 341 -84 -320 -29 255 121 -146 -191 59 295 64 -355 -133
2723 -133 339 236 -298 -280 233 293 -130 -287 20 239 120 -202 -215 105 269 26 -347 -87 358 198 -300
2744 -300 -268 286 327 -163 -295 67 299 64 -232 -168 129 228 -70 -339 -46 347 142 -358 -216 298 252 -253
2766b53n0M10J80k76k47J27L12M1l45k05L37L67l48m11K41N09j54n38L3M72J02
2787C04l91j88K38K67o4l75o5L60K21l43l47L26M39k50n02J52M89k6m17j11L55
2808G2J79j74k99M9L71R0m02k26L80L69l62l95K41M43j52m21K6L34J10k49k38
2829b54J47K92J6l65j73M40K10l55l34L41L37k08l70J08L60l2k51j33J85K40m9
2850A52l40m0L48J63l99j91L16L16l15k88J44L03k0k65o8K20J41p1k75NL31P2
2872B39l48j76L55K31k88k74J96K66j10k14l0J68J25j13k30K9L02O3l41r3L09
2893F6J96k99k32K38K47j20k49PK20J10j60j88R8K84k3l64o0L68J45l41j97K83
2915B9K06k03k30P4J99Q4k16j54J18K87o9l55j1L87R4l72j75L40K37k55k32J44
$$ plain form
2766 -253 -303 107 287 11 -236 -109 203 244 -101 -306 31 398 50 -361 -120 389 235 -303 -270 202 304
2787 304 -87 -275 -37 230 166 -209 -274 86 307 -36 -383 -57 382 132 -370 -218 271 245 -172 -283 72
2808 72 251 77 -222 -173 198 288 -114 -340 40 409 47 -348 -107 336 184 -237 -211 123 233 -16 -254
2829 -254 -107 185 201 -164 -337 103 313 -42 -376 -35 302 94 -276 -168 192 160 -91 -224 -39 201 152
2850 152 -188 -228 120 283 -116 -307 9 325 10 -278 -134 169 149 -116 -184 36 177 106 -169 -164 167 239
2872 239 -109 -285 70 301 13 -261 -65 201 91 -123 -153 15 140 27 -203 -174 128 191 -150 -243 66
2893 66 262 -37 -269 -31 216 96 -153 -146 74 184 24 -164 -66 218 195 -169 -229 139 284 -57 -254 29
2915 29 235 32 -198 -124 75 159 -57 -211 -93 194 125 -230 -241 146 240 -132 -307 33 270 15 -217 -73
2937g3K55l6k26q6J69K28j72k90Q3L70J2m05q1L69J80l44k24K81J88r8k50kJ93
2960D1J44j78k70J45L39q9l77L5L86P4m02q8L16J40k17j97J32J63P0k29j43K07
2982BK37j56l48J31L50mm12qL24Q5k65j26J78J57m1j93o6J83J71j98k27J54L02
3005B30j06l46M3L15K0k63q5K13J08q0j55k0J61J01j61j88J80K52j53k97J03L32
3027B04n5k68k0K18L2r3j30O0J26R2j68j88J93K29j58k82J12K83q7k77M3K19L6
3050A21j73p2N5J29L2j63j02J53K14j83k32J78K57j25k78O3K61J7k23m3J02J24
3072A12Kj80r7K00J74k11k21K06K45j40l24J06K87l2k23m9J37J43r1j84j4K38
3094H4J17k66j77K31K69k22k90J93K91j32k70MK40J05j84j67P3K24M2k99r7L09
$$ plain form
2937 -73 182 146 -80 -166 3 231 59 -231 -148 222 234 -171 -252 117 297 -47 -271 10 198 100 -150 -152 41
2960 41 185 7 -263 -118 221 132 -245 -210 176 250 -152 -240 76 216 -1 -198 -66 97 167 -62 -205 2
2982 2 239 83 -265 -134 216 212 -200 -208 116 201 -64 -190 -12 145 104 -89 -155 28 199 1 -226 -72 230
3005 230 124 -222 -179 136 156 -107 -192 21 129 49 -106 -126 35 136 -25 -213 -33 219 66 -231 -128 204
3027 204 149 -119 -139 79 111 18 -112 -52 74 166 -2 -190 3 232 74 -208 -96 187 100 -177 -134 85 121
3050 121 -52 -124 -69 60 92 -71 -173 -20 194 11 -221 -43 214 89 -189 -126 135 152 -71 -114 -12 112
3072 112 114 -66 -163 37 211 0 -221 -15 230 90 -234 -128 159 127 -96 -145 -8 135 44 -140 -154 84
3094 84 201 -65 -242 -11 258 36 -254 -61 230 98 -172 -168 72 177 -7 -174 -101 123 165 -134 -231 78
3116G8J92l06k51K58L25k34k71Q8K74Qk18j05J31J84j6k92l6L01J32l28j99L18
3138C3K23k49k44J38K84q6k43j9J92J46j42k23K8L18K9l27j12L57J58l02j92K35
3160BK34j91j93N6K04K8j23j83J06K62m8l29m0L45R8l36j39K92J79k27k08J20
3182i1J76J1j53q0J07J67k3l10J1L15Q0l01j13K57J72k28j84J40K11m1j82q3J39
3205cJ71q2k48O3K91Nl38q0L39O7k63j32J83J64q9j58k4J60J36j47k07O2K94L
3229A67l45k4L68N8l37o8K05J52j27j70QJ97Q5j83j68J07K95p0l27j0L58M4l39
3252a24j05K52J78j77j96Q4K16%j88j18J54K48j24l34Q8L55k6l50q7L67J31k69
3274b5j93J57K20p4k08o1K40J60j83l06J66L55q3l47k0L81O9l25j39K35K11j39
$$ plain form
3116 78 270 -36 -287 -29 296 62 -209 -121 153 161 -57 -162 -31 153 137 -155 -191 110 242 -86 -285 33
3138 33 256 7 -237 -99 185 99 -144 -163 29 175 33 -190 -162 156 185 -142 -254 103 261 -41 -233 2
3160 2 236 45 -148 -92 112 140 17 -166 -60 202 154 -175 -215 130 228 -108 -247 45 224 -3 -211 -91
3182 -91 85 96 -57 -137 -30 137 114 -196 -185 130 210 -91 -204 53 225 -3 -187 -47 164 123 -59 -142 -3
3205 -3 168 86 -162 -99 192 197 -141 -221 118 185 -78 -210 -27 137 48 -110 -134 26 162 15 -192 -130 164 167
3229 167 -178 -202 166 224 -113 -181 24 176 49 -121 -113 84 169 -14 -182 -75 220 150 -177 -187 171 215 -124
3252 -124 -229 23 201 24 -172 -88 128 128 -60 -178 -24 224 100 -234 -146 209 183 -167 -254 113 244 -25
3274 -25 -218 -61 159 85 -123 -184 56 216 33 -273 -107 248 165 -182 -202 179 248 -77 -216 19 230 91
3296I1k42J5K31J12k35k51K08K81j22l68Q4M03nl70o9K91J42j95j95P8K55L0k59
3319i0j46K55K61k00l48J56L68p1l78k3L60R2k70j83J63K47q5k26q6K47K11k58
3341dk95K07L46j35l75O1L49L2k86j30K29J79j05k63RK79J25k38k76K54L23k01
3363H5l40R9L88l1l13j06K81J35j46k29M5K82N3k66k14K72K91k25l80J86L71n4
3385A84l54l9K91J24k11j86Q7K50J7k82j49L04K42k62l43K40L33j11l47k9L71
3406A30J14l20j46J73K37k7l23j23L77K26l32l12K82L72k01l76O8L85K4l35j42
3427b49K49K14j03l30PL37J21l41k41L48K97k54l81J66L77l9l65p5K87K01j58
3448F8l28R3L63P2l91j81L55K98l34l37K14M26j36l82j4L31J22k49k58J35L51
$$ plain form
3296 91 -151 -136 95 207 -28 -279 -71 210 88 -280 -196 207 202 -168 -237 54 196 1 -194 -116 139 169 -90
3319 -90 -236 19 280 80 -268 -112 256 185 -193 -216 144 236 -34 -217 -54 193 108 -118 -204 43 254 -4
3341 -4 -299 -92 254 119 -256 -195 154 186 -100 -230 -1 178 73 -190 -181 98 223 -15 -291 -37 286 85
3363 85 -255 -156 232 201 -112 -218 63 198 52 -177 -132 150 203 -63 -277 -5 286 61 -319 -133 238 184
3385 184 -170 -209 82 206 -5 -191 -104 146 163 -119 -268 36 278 16 -327 -87 246 135 -212 -241 130
3406 130 244 -76 -222 -49 188 161 -162 -285 92 318 -14 -326 -44 328 127 -249 -181 204 228 -107 -249
3427 -249 0 214 111 -219 -212 125 246 -95 -336 12 309 55 -326 -160 217 178 -187 -262 25 226 68
3448 68 -260 -167 196 268 -123 -304 51 349 15 -322 -108 318 182 -200 -214 117 239 -10 -268 -133 218
3469B18k0l81j41M15K49l75l07K61L83j77l90N6L59Q3l08j99K10L44j25l55n8
3490b58M13J68l91k64L25L47k49l68J38L45J0l31j23J99L20j68l74O2M06P7m11
3511a27k19L74L22k99l63J74M04m8l60j17K98K45k43l17J11M04j6l96j38M10K70
3532C69l79l29K38L99j33l95j8L35K12k85k93J87L35k1m33r1M35J84l73k91L16
3553c1L48j81m11O2L61J24l16k39K32L11r9m40K4M26J62m70k25L36L50k59l69
3574c04J04M09K6l35j77K87L19k02m03P6M28O1m22j86M06K54k89l53J46M31m5
3595B31l99j17L42K59k83l57J53M29Mm85j08M54K25m00l27L05L73j36l75n6M30
3616A62J42l13l30K37M21j27m35l8M51J94l96l21L18L93k16m14N6M23Q7l79k32
$$ plain form
3469 218 198 -183 -324 91 340 -35 -342 -81 302 125 -265 -209 150 233 -75 -274 -64 280 155 -200 -258
3490 -258 155 323 -68 -332 -7 340 91 -277 -139 206 216 -115 -238 -39 281 113 -261 -199 207 284 -127
3511 -127 -346 28 350 51 -312 -138 266 218 -142 -259 39 284 41 -276 -165 239 223 -173 -311 99 369
3532 369 -10 -339 -101 298 165 -230 -248 87 299 14 -279 -92 243 222 -211 -302 133 317 -56 -347 -31
3553 -31 317 136 -275 -213 148 272 -44 -283 -51 260 161 -279 -255 171 333 -137 -362 -26 324 65 -304
3574 -304 -200 209 235 -100 -277 10 329 127 -276 -200 228 289 -133 -319 87 341 52 -301 -155 276 231
3595 231 -168 -285 57 316 33 -324 -171 258 262 -223 -331 123 348 -52 -379 -74 299 163 -212 -268 162
3616 162 304 -9 -339 -102 319 192 -243 -281 170 364 -32 -353 -35 358 142 -272 -216 207 294 -85 -317
3637c17K95L27j81m19O7M48Q5m54k09L80L25k63m03J55M13J3m01j95L59L03k48
3658H0m04J24M85J7m82j96M72K70l39l54J96M12l5m48p5L67K54k81l83J69M60
3679C09m2m65j32M77K21m03l44L06L97j31m21m0L96J86l75l42L09L98j00n01J0
3700b87M89J30m36k40L42L54k09m22L7M47J07l94k55L32L88k08m99Q2M99O7m75
3721a51k11M14L09k84m01J03M88Om45j64L53L44k90m35J50N21ln09j33L99L16
3742C77l58l90K34M24l4m51j42M65K35l22l80K08M78p8n28p5N01J90l95l30L11
3763f0L89j45m24n3M25K04l52l46K74M39j54m84QM90J36m79k55L54L79k00m39
3784b93M1M67J12m57k44L64L79k42m57R5M87N8m74j80L91L02k51l89J06M40N1
$$ plain form
3637 -317 -22 305 124 -295 -228 220 305 -149 -358 22 347 84 -319 -164 249 262 -139 -334 25 328 80
3658 80 -324 -200 285 302 -180 -376 96 366 27 -327 -131 281 246 -202 -277 90 344 63 -320 -151 309
3679 309 267 -198 -330 147 368 -35 -379 -73 324 193 -228 -268 128 314 -61 -403 -94 304 204 -297 -287
3700 -287 202 332 -104 -344 -2 352 143 -279 -242 205 312 -82 -337 -5 383 175 -324 -242 257 324 -151
3721 -151 -362 52 361 77 -324 -221 267 273 -172 -336 17 361 71 -364 -214 307 304 -205 -338 61 377
3742 377 19 -371 -137 287 253 -198 -340 125 360 38 -342 -134 344 266 -262 -337 164 354 -41 -371 -60
3763 -60 329 184 -240 -293 132 336 -16 -362 -88 351 197 -287 -279 211 347 -132 -387 -33 346 146 -293
3784 -293 -252 215 327 -130 -374 -10 369 127 -330 -235 252 310 -164 -344 47 349 98 -291 -185 255 306
3805C06m54k01L78L57l45l84J55M89%m80j36M23K37l43l55J86M55n0m41j39M23
3826H1K72l36l92K16N09j42m65n3M48K29m03l01K75M10j20m77k8M42K02m06l35
3847c74L46L88j55m97OM79J43m44k62L43L72k15m42O5M45J21m61k50L75L88k51
3868A20m68R4M90Q8m78j99M05L10k72m28J37M97L4m79j78M03L12l09m28J67M77
3889B95j1n19r8M36K63l34l92J82M84o9m74r1M60K48l94l78K73M40j08m95l1M42
3911A29K17l87l03K65M21j30m71rM56J50l95l17L09M39k11m41J5M84J23m63k47
3932c66L77L66k31m54M2M93P9m22k36L58L45k37m08P8M66M4m66j95L98L00k36
3953I5m24J25M33N0m45k00M21K90k62l91J60M60j4m82j24M12K59l35l69K19M34
$$ plain form
3805 306 -148 -349 29 386 41 -343 -188 301 301 -179 -315 108 345 2 -353 -167 288 238 -203 -342 81
3826 81 353 17 -375 -159 350 208 -257 -310 138 367 -36 -337 -62 348 228 -249 -277 165 367 -39 -374
3847 -374 -28 360 205 -292 -286 193 336 -108 -370 -27 345 130 -312 -247 198 319 -142 -392 -17 371 120
3868 120 -348 -254 236 324 -154 -353 52 362 90 -338 -201 296 330 -149 -327 76 388 79 -349 -182 295
3889 295 284 -235 -333 103 366 32 -360 -178 306 237 -237 -328 132 380 -14 -392 -119 321 213 -282 -313 129
3911 129 346 -41 -344 -79 342 212 -259 -268 188 338 -57 -374 -65 374 163 -278 -263 221 344 -119 -366
3932 -366 11 377 146 -308 -266 227 306 -116 -352 6 351 114 -294 -216 250 294 -172 -367 31 331 95
3953 95 -329 -204 229 279 -166 -366 55 345 83 -308 -148 312 298 -184 -308 104 363 28 -341 -122 312
3974C12o0m58q8M14K23l38l64K24M48j04m79o8M77J96l67l46K56M54j47m67k3
3995c05M74J85m51k79K92M29j54m41k4N03Q9m08k67L41L44j78m29K4M64J05m22
4016a08k34L53L52k40m39J16M39O6m74k10L98L21k60m07J15M72J6m52j79M06L26
4037C77l23m18J92M76k8m64j39M33K59l50l72K15M80p8m85r1M42K81m07l77K58
4058a19M72j38m60n3M31K03l75l20K88L96j42m65NM58J46l99l23L29L75j52m61
4079c04L3M73J08m37k46L28L79k06m42R6M55P2m48k01L53L43k66m05J20M62L0
4100B97m26j87L69L01k69l95J40M36jm41j60L92L06l17m09J87M33k8m43j10L94
4121F9K90l33l77K16M03m7m25n6L55K40l38l23K53L88j03m32o8M44J89l48l20
$$ plain form
3974 312 252 -206 -294 120 343 5 -359 -135 313 209 -270 -338 139 335 -32 -378 -122 332 185 -282 -305
3995 -305 169 354 -97 -376 -84 345 191 -250 -274 229 318 -90 -357 -16 328 150 -279 -255 209 314 -108
4016 -108 -342 11 363 123 -316 -200 239 305 -169 -379 19 340 80 -327 -212 260 276 -176 -355 51 377
4037 377 54 -364 -172 304 276 -188 -327 106 365 15 -357 -142 338 260 -225 -316 126 407 0 -377 -119
4058 -119 353 215 -245 -298 133 336 -39 -359 -71 325 183 -282 -277 181 327 -72 -395 -66 309 157 -304
4079 -304 -271 202 310 -127 -373 -45 334 128 -314 -218 237 309 -139 -340 13 356 90 -315 -195 267 297
4100 297 -129 -316 53 354 85 -310 -170 266 265 -176 -336 56 362 45 -364 -177 256 228 -215 -325 69
4121 69 359 26 -351 -135 268 221 -204 -260 95 335 -3 -326 -73 315 212 -220 -288 156 345 -3 -323
4142c23K28M23j09m54n8M48J72l66k98K89L59j57m21j2M71J11l81k86L35L62j77
4163A56m40M2M45P1l98k01L16L49k22m23Q8M40O2m27j90L64L03k35m16J25M63
4184B72j3m36j37L67K94k86l87J43M62k0m51j28M03K68l18l71J91M35q4m32p9
4205c07M45K05l58l11K22L91q3m95MM23K17l89l11K71L97j66m37M0M35J31l79
4226e5k53K84L70j84m43M2M39R2l90k49L28L43k36l64Q5L97Q2m20j90L37K96k03
4248A08m05Q7M27M9m31j62L48L14k77l70J63L93Pm14j05L23K68k61l70J60M31
4269B83l8m17j25L99K10l16k84J84L76r5l73o6L55K25l49k84K11L74r0m21k3L88
4291A24J54l40k59K54L83j81l82K5L64J49l50k35K34L85j71m07L4M02J06l75k23
$$ plain form
4142 -323 -95 328 219 -235 -293 155 327 -39 -337 -48 311 154 -267 -279 192 303 -78 -364 -29 333 156
4163 156 -284 -242 203 274 -124 -325 -9 340 118 -305 -217 223 285 -142 -332 32 335 100 -316 -191 272
4184 272 259 -177 -314 53 347 61 -326 -183 279 259 -192 -320 83 351 33 -338 -147 288 204 -228 -307
4205 -307 138 343 -15 -326 -104 287 204 -291 -287 136 353 -36 -347 -76 321 155 -282 -242 193 324 -55
4226 -55 -308 -24 346 162 -281 -239 200 292 -98 -347 -19 324 88 -276 -191 206 288 -132 -322 15 311 108
4248 108 -297 -210 217 266 -165 -327 21 335 58 -312 -149 244 251 -163 -268 55 323 62 -308 -148 283
4269 283 245 -172 -297 102 312 -4 -288 -104 272 177 -196 -262 93 318 -31 -315 -104 270 180 -241 -264 124
4291 124 278 -62 -321 -67 316 135 -247 -222 142 291 -59 -294 -60 325 154 -253 -219 183 289 -86 -309
4312c09K96L29j66m21Q5L67Q0l61j84K86L08j92l87O9M13M6m09j51L45K76k59
4333F1l50J09L90K2l96j37L57K60k83l34J32M36k5m22q3L54K39l17k99J80M04
4354B98p3m12o5L84J82l33k90K28L92j14m39kL86J74l88k61K81L36j64l74J4L64
4376A24J56l53k29K58L26j54l85N4L76R6l65j86L05L11k27l67R6L88M5l89j44
4397b64K78K75j87l74J44L71k1l49j62L61K34k92l07J49L71j5l72j15L34K23k52
4418C0l14J68L48l1l80j00M07J57k94k79K28L12q1l40p0L47J78k87k73J94L35
4439B55r6l12p5L49J60l38k31K34L07j25l44J8L29J46l40k06K00L27j34l76L7
4460b15L72J14l93j87K98K81j89l19N3L65N8l12k12K61L11j91l63J13L60L0l69
$$ plain form
4312 -309 -13 316 150 -271 -186 181 261 -100 -284 2 310 118 -269 -200 213 259 -150 -301 44 320 61
4333 61 -289 -180 210 232 -164 -301 56 316 33 -301 -169 267 242 -180 -263 91 330 13 -286 -106 298
4354 298 225 -187 -252 132 314 -19 -309 -81 311 197 -242 -244 142 316 -72 -333 -52 284 120 -254 -240 124
4376 124 280 -73 -302 -44 282 128 -257 -203 173 269 -96 -282 23 334 107 -260 -164 224 269 -120 -264
4397 -264 14 289 102 -272 -128 243 222 -127 -289 72 306 14 -293 -144 227 212 -160 -275 59 282 30
4418 30 -284 -116 232 201 -179 -279 128 285 -9 -288 -60 252 171 -169 -239 108 286 -1 -274 -80 255
4439 255 159 -153 -228 121 281 -57 -288 -54 253 128 -216 -198 131 277 -63 -269 -69 258 124 -252 -215
4460 -215 157 271 -122 -309 -11 270 81 -238 -185 180 238 -74 -286 -25 286 95 -268 -155 205 235 -134
4481a34j10L12K15k39k86J09L40rk99j57K98K53k47l05J23L55j6l97p4L62J74
4502B68k73k77J91L22o5l28j03L57K12k93l04J78L79q7m03k6M02J17l13k12K19
4523c9L03j36l15k5L50J22l13k26K47L35j77l88N8L88N9l55j59L04K12j64l14
4544b33L3L55P3l54j63K98K68k06l26P7L86nl46r2K86K16k12l00J31L21J9l60
4566a34j15L19K16k87k80J52L59o2l66k9K99J75k29k59J65K91n4l14r2L24J46
4587B25k51k56K05L19j31l22L2L16J07k93j58J23L25j24k87nK95J29l24j62K10
4608b7K72j23l22O5L17M9l05j80K64K04j38k78N0K85Q9k83k15K51K67j70l28J18
4630a38K98L1l08j09K34J95j43k71J02K58N9l12j34K83K15k08l01J38L15l1k96
$$ plain form
4481 -134 -244 68 283 44 -242 -133 207 198 -101 -258 40 293 46 -259 -136 219 203 -194 -268 94 268
4502 268 -5 -282 -91 231 166 -162 -265 92 304 11 -293 -115 264 177 -226 -252 150 267 -46 -258 -39
4523 -39 264 128 -187 -212 138 260 -53 -279 -32 303 126 -262 -204 184 243 -112 -271 33 245 81 -233
4544 -233 -200 155 228 -126 -289 9 277 71 -255 -178 208 203 -143 -235 51 267 55 -245 -114 207 226 -134
4566 -134 -249 70 286 -1 -281 -129 230 168 -198 -227 72 247 18 -241 -76 215 161 -153 -245 79 225
4587 225 -26 -282 -77 242 111 -211 -179 137 244 -49 -207 -84 241 117 -170 -175 120 249 -75 -237 -27
4608 -27 245 122 -200 -135 182 231 -74 -254 10 214 76 -202 -152 133 222 -61 -276 -25 242 72 -256 -138
4630 -138 160 191 -117 -226 8 203 60 -211 -109 149 208 -104 -238 45 260 52 -249 -111 204 173 -123
4651a23q8K91J68k21k16J01K96k6l06j21L35J48k45k65K10K81o9l45JL11R4k68
4673e7k05K05K53l8l54k5L60J14k79k59K65K58j38l28O3L37O9k75k20K56K48j24
4695A26l24K2L55N5k96j71K52K45k07k69Q3L11k2k76p2K21J78j71k59Q4K86M2
4717A93l19j20K96J78k08k73J54L37q6l19mK66J46k25k29J46K53k0k97m8K77J22
4739B20k15k34J87K48p0k98j2K67J05k15j71J33K33m0k98m1K89J08k44j88K01
4760c5K36j06k96M0K95L1k45j21J89J89j23k14JK84P0k47j55K17K32j48l03R3
4782a16K86J1k72r3J92J86j52k13L7K95lk49j41K66K01k17k66J34K93m0k58o8
4804a87K14J63j39k33Q7K52Mk97p0K74J64k31k08J48K39n1k76LK31Q9j89k00J38
$$ plain form
4651 -123 -211 80 248 27 -189 -88 208 182 -124 -245 90 238 -7 -272 -62 219 150 -195 -194 117 211 -57
4673 -57 -262 -57 196 158 -196 -221 139 253 -26 -285 -20 238 100 -228 -165 172 241 -34 -254 2 250 126
4695 126 -198 -176 179 234 -62 -233 19 264 57 -212 -129 182 160 -116 -188 33 211 40 -219 -135 151 193
4717 193 -126 -246 50 228 20 -253 -99 238 152 -167 -171 95 241 16 -213 -67 186 166 -131 -179 98 220
4739 220 5 -229 -42 206 136 -162 -174 93 198 -17 -188 -55 178 138 -160 -201 88 196 -48 -236 -35
4760 -35 201 95 -201 -161 134 165 -80 -201 -12 177 54 -160 -159 125 195 -52 -207 10 242 94 -209 -116
4782 -116 170 181 -91 -184 8 194 42 -171 -134 161 158 -91 -232 34 235 18 -248 -114 179 139 -119 -187
4804 -187 27 190 51 -182 -95 157 161 -136 -206 68 232 1 -207 -59 180 129 -147 -144 87 176 -13 -213 -75
4827g5K69o1k85k7K89R9k44j95K19K07r5k77NK69O3k05j84J80K46r2k98J4L26
4850A48N7k94j05K10K12j70k54Q3K72K0k38j24K08J78j50k45N7K99J9l00q9K63
4872E7J51k12j91J16K54k5k85l1K15J55k09j79J02K37J2l21m1K91Q8k16j82J81
4894c3J94p3k24k1K54Q7j89j59J39K06o5k52J5K11J02k36j29J99J57j41j90M8
4916a00J93N0j88j24J43K04j34k00J6K64Rk09j17K08J53j31j99O6K16J6k19q0
4938a63J69J59j29j91O3K30J3k56n5K09J58j77j88J09J79j3j76j14J96J43j41
4959B5j85P2K33j5k40o8K00J49j69j87J46J70k8k04m3J59J28j36k03J18J99Kk52
4982a29k7K65R4k31j57J64K07j09k03j4K01J38k19j34J14K14q1k35LK65P4k64
$$ plain form
4827 -75 194 133 -152 -179 110 209 -35 -230 -11 196 101 -176 -171 98 161 -44 -228 -48 198 106 -192 -178 148
4850 148 205 -89 -194 16 228 58 -196 -113 159 179 -59 -183 25 203 53 -192 -135 164 183 -117 -206 57
4872 57 208 -4 -195 -79 175 150 -135 -166 49 204 -5 -184 -82 155 167 -154 -195 96 184 -32 -214 -33
4894 -33 161 88 -136 -157 97 184 -5 -164 -25 181 116 -136 -121 90 192 -44 -173 26 183 42 -148 -100
4916 -100 93 143 -45 -169 -26 178 44 -156 -140 124 133 -76 -193 15 168 37 -162 -96 120 136 -83 -163
4938 -163 6 165 36 -155 -92 138 151 -105 -160 49 207 30 -158 -49 130 117 -59 -173 23 166 25
4959 25 -160 -88 145 130 -110 -178 22 171 2 -185 -39 131 103 -101 -144 15 143 7 -196 -78 121 123 -129
4982 -129 -156 109 203 -28 -185 -21 186 77 -126 -140 61 199 -20 -154 -40 174 93 -142 -139 126 200 -64
5004f4j05J54J90j12k11M9K20K4k06j01J68J47r3k61Q4K80Mk68o7J91J53j53j64
5027a41P8K04o6j53n8J77J11j35j67R3K17k5k74jK11P4j79j21J40J65p4j92j5
5050a31J99P8j87j28J24J98r7j91j2K30M7j76j08J62J26r0j43pJ71O4j44j01R4
5073b2J58o9j97L4J94J9j91p9J55J28j07j26L5J45J7j50q3J22J66j00j85M9J90
5096A03j8j81l9J57Q9j07j09M5J23J2j35q5J72R4q3j66N2J75Jj81k1J41R9j12
5120B6j43O3J65l3j56l9J42J21j12k08R6K20l1k09m1K19N7j56j12R9J38l9j67
5143a00n4J81R2j33j49J22J77n7k05nK31Qj57o7J19J22o6j57K2J51N6j50j16J17
5167a8J60o2k24M1K17j3j90m8J53J01j05j34K6J94j1j52p9J33J55j15j92O2K38
$$ plain form
5004 -64 -169 -15 175 63 -148 -99 121 145 -61 -162 6 153 60 -201 -117 163 167 -101 -168 23 176 23 -141
5027 -141 -63 141 75 -78 -136 41 152 17 -150 -57 160 135 -139 -140 71 145 -34 -155 -15 150 76 -116 -131
5050 -131 68 146 -41 -169 -45 153 56 -135 -147 83 130 -46 -154 8 134 44 -99 -106 65 129 -15 -116 -22
5073 -22 136 67 -130 -96 98 117 -74 -153 2 130 23 -103 -68 77 94 -56 -139 -17 149 49 -136 -87 103
5096 103 85 -96 -135 22 111 4 -105 -60 63 75 -60 -145 27 121 38 -128 -76 99 100 -81 -102 39 138 26
5120 26 -117 -54 111 78 -78 -117 25 146 34 -174 -78 142 111 -98 -139 80 137 -19 -131 -32 106 67 -100
5143 -100 -154 27 119 -14 -163 -41 136 79 -126 -131 100 108 -49 -116 3 125 59 -98 -76 75 131 -19 -135 -18
5167 -18 142 80 -144 -103 114 101 -89 -137 16 117 12 -122 -96 98 87 -65 -144 -11 144 29 -163 -101 137
5190A37m7j97kJ76L4j16j10J05J40m2j31m7J33J14j51j23J01J76q9j55LJ44L0
5213H3j26l2Q3Q6n6j30M7J26L6j66j02J33J01o1j36O0J29J2j20n1O8J06o3j17
5237i0L2J06N0j47o3J33J01q0j69Q5J50j5j38m7J18Q6j17o0K9J19jj13n4J26Q4
5262A25j10j34O3J44k4j18l8J15M3n5q8J0J41Jj06q2J17J02r3j05Q5Q1k9j10j8
5287h3J39J8p5p0N4P2J7j07l9J19O5j17p9Q8J18m4j65K3J10L0r3p7O9J17l6j23
5313f9k0J40O6j46r8Q9J41o2j61O1J30J7j21l3J08N8o7j03jJ61J3j45n9J14J12
5338A25j09j47P1J76n5j56rJ28N1r9q0O4J24j0j26l7J17O6j32p9Q3J34m8j46M1
5363e3R0K2p8o0P5P4j6r5l9J41O3j60o8J09Q4n4j13M5Q6J4j02kL8Q5n3j10J5J37
$$ plain form
5190 137 90 -107 -109 67 101 -15 -125 -20 120 78 -53 -100 33 147 -4 -127 -26 150 61 -94 -91 53 83
5213 83 -43 -75 8 94 38 -92 -45 81 117 -49 -151 -18 83 22 -114 -54 75 87 -33 -84 -16 90 27 -90
5237 -90 -58 48 98 -49 -112 21 122 42 -127 -42 108 93 -45 -92 26 112 -5 -65 -36 83 82 -31 -85 41 125
5262 125 15 -119 -56 88 64 -54 -92 23 66 11 -77 -67 74 75 -31 -113 4 106 13 -92 -7 74 45 -65 -83
5287 -83 56 74 -1 -71 -17 55 72 -35 -74 45 110 -7 -86 2 120 76 -89 -66 44 74 -19 -96 -27 90 54 -69
5313 -69 -89 51 117 -29 -127 -38 103 41 -120 -59 71 88 -33 -66 42 100 33 -70 -71 90 103 -42 -101 13 125
5338 125 16 -131 -60 116 61 -95 -104 24 75 -24 -104 -40 84 74 -52 -89 28 94 -38 -117 -34 100 52 -94 -53
5363 -53 37 59 -19 -79 -4 70 54 -41 -80 61 124 -36 -104 5 89 35 -78 -33 53 67 -35 -37 1 86 33 -77 -62 75
5391G5qj11l8Q5Q2p3q6K2J14l2q4j0O7N8l3r1L9Q3j1j08j4R0Q2n4j05M2R6k2q3
5420b8j8O0N7o6n4KR2Kp1n1J02M8p8q6O4Q3m6o2M0L4J4l8n7NP6L6j02m4R9N0n0
5451A3q7P3Q3m2j01M6M5M6p7q7P7P8k0r1l3J20L9j20l5N5Q8n8q2K8O7K9q0o2P1
5480a7P6k4j31M3Q2N9j28l6P8P4j00n2O3Q3lj09k9N7P5m0j03K9J18K8j51KP4O4
5508H2j05l8N6R1m6j04K9O7M1o7n4L1R4l2j25rJ35L3j18o8J04O0n1p6O2N0mn4
5536a6l7N8P5l2j16L3Q5L0j00k3N3N4m5r5O1P8l3l1m0L8N7l4n5jQ1Pr7oO4N9q0
5567hl3L8J7Qo0%K3P0l3n5j3J00Rj01jQ8K9n5o7M3N1k3n5OM5L9m9m7J7O3j1n9
5599b4k1N6M8p2m7M9N7n9k4kM0K0rr5N5O0J1o5nN7K0m8o6P8N1n1m7J8K1K8l4k0
$$ plain form
5391 75 67 -44 -82 3 85 12 -74 -52 62 30 -54 -64 3 61 28 -63 -24 59 48 -60 -74 16 98 44 -61 -19 77 55 -28
5420 -28 -46 14 71 5 -49 -47 45 47 -24 -75 27 75 -3 -89 -25 58 12 -50 -10 24 38 0 -57 -52 24 60 -42 -86 13 63 13
5451 13 -74 -1 82 40 -61 -15 30 76 -1 -88 -11 67 47 -44 -77 43 82 -38 -73 -18 70 12 -70 -42 25 54 -26 -88 -17
5480 -17 59 35 -96 -53 29 88 -40 -76 2 76 -24 -76 -13 70 67 -42 -71 -14 61 21 -82 -53 65 93 -58 -56 18 82
5508 82 -23 -61 -5 86 40 -64 -35 32 73 6 -48 -17 77 45 -80 -89 46 79 -39 -107 -3 57 6 -70 -8 42 38 -16
5536 -16 -53 5 80 48 -68 -35 50 80 -20 -43 10 64 19 -76 -15 63 30 -1 -41 -3 54 20 -35 -36 45 52 -45 -51 13 72 -8
5567 -8 -41 -3 14 22 -38 -38 -15 55 22 -33 -46 54 63 -38 -39 49 78 23 -44 -1 50 27 -28 -22 23 62 13 -34 -17 46 35 -24
5599 -24 -45 11 59 -13 -60 -11 46 -13 -37 -39 1 21 12 -83 -28 32 43 -22 -27 30 50 2 -64 14 65 14 -33 -15 6 34 0 -20
5631b0MJ10n8n8j3P3J7n9n7P7M7n3n1KQ4k6l7k2M2N2n4l9j6J06op7l6Q4M7q4m4
5662f5O5N8nr3K1M5K2k7o8M3N7Oj09MP6L3n8l4K4O7o2m3J3M2M2o1j9J8M9k6p8
5693f3K9O2K5p8k7O1J8k6m6J2N9Kl0k9K9N1l1o1J4Q5k0n9lO0J3m0l9J3O0k0l5
5724a4j0L7Mj8m1K0O1k1m2pO9on6jK3N0k7l3j8M1rOrk5P1j0o1J3K4K5m4k9P0K
5758C5j0l7pN8K2p5j2K0N8j9n4k0N2L3n5j3K9L1j2l7j3M4Jl2l7N1L5k1m8nO7k
5790B7r6K0N5L9k5n4J4M6J4m6l9O1K7op4J9O3jm6k2P1k0k9l6RM5J8o5j3O9K4l9
5822A0n7L2M1%p5RQ4j2o3OJ9M4l8k7jM0L3m6mJ8L7l1j0j4N2k1k9j7K2P1n7m2K1
5855eK2L0p2k3M5M2p8nK7L8j3l7k1N7N0n7k2K0J7J6k4k0K7M6n8j6pO1l3j8J5J7
$$ plain form
5631 -20 -16 94 36 -22 -35 38 55 -4 -61 16 63 10 -41 -39 45 19 -18 -40 2 54 0 -39 -55 51 45 -32 -68 16 63 -21 -65
5662 -65 0 58 53 -40 -19 26 48 21 -47 -4 53 59 -50 -46 30 63 5 -29 -5 62 0 -43 -30 12 54 -7 -26 -8 41 15 -63
5693 -63 -34 28 53 -25 -52 9 27 1 -45 -33 26 28 -2 -31 -2 49 18 -43 -29 56 36 -23 -26 34 47 7 -32 -19 41 21 -14
5724 -14 -24 13 17 -1 -42 -22 39 18 -24 -31 38 32 -24 -25 -2 48 21 -12 -30 11 2 8 -1 -26 45 35 -26 -13 11 36 -8 -37 33 35
5758 35 25 -12 -19 39 61 -14 -26 -6 52 33 -21 -41 11 44 -11 -24 5 36 24 -13 -26 18 19 -13 -50 1 36 15 -33 -38 29 27
5790 27 -69 -49 6 45 20 -34 -20 26 40 -6 -45 16 43 37 -37 -18 45 44 -2 -24 47 27 -2 -38 -29 16 34 -31 -44 25 49 10
5822 10 -47 -15 26 26 -49 -40 44 32 -31 -25 -6 38 0 -27 -28 12 45 -1 -5 13 50 19 9 -5 47 26 -3 -20 2 73 16 -26 -5
5855 -5 17 47 -25 -48 -3 39 -39 -44 -17 21 8 -29 -50 7 57 0 -22 -2 15 31 7 -13 14 60 2 -14 -21 40 7 -11 4 21
5887B1njm5RM5j4j4K1J6Mo7pL5L4Mp1J1M1j3pk1j5O0qk6J9nJ9m2JOL7j5l3K3K6
5923B3J5l2l8M3Qj0j1K3kk3K2l5L0J3Lm5K8j8K7l4k5M6Qn0pJ9K6pNn2N9Mj4l7
5957c8L8J3J5l6k3M8Ok7k7L9J2J1k1mK1M6o3mk8N1j9%k1J5K8k2l8J2L0j1m6K2
5989b1M2j3k1joM4j2l2K0L9m1Jj2PJ8Nl9mJ4L6k0j2J3J1j3k3MK7L2m9j7N0Kl3
6023dpk3N5j8j8J4J3k2j7oJ1N1k7j1k8L7nk9K4J1j0J8k2j5K6J8j4jORJn5N9NM
6058C0m0qJ5kKNj0K2Rrm1J9K0l4j5lO4jk3m5J2K9lonN4l4l6MK9RJ1n6L9KL6o4
6095b4nM1K6l7Mk1J8J6Ol6K9lNk9J4K5k3Pl5K5Oj5j5j4L4j9rK4QpMK7m0K2Jk4
6131a4JJ4K1nj8K3pj7J8Pj8K6jm7L6k2J3J3k9L6j4l2J7NjJ1j1j1LNjj7ROj1J9
$$ plain form
5887 21 16 15 -30 -21 24 10 -4 17 33 37 -30 -37 -2 32 36 -35 -24 17 4 -3 -24 -39 21 13 -13 6 1 20 -22 -21 -15 22 7 -26 -3 23
5923 23 38 6 -32 11 19 9 -2 21 19 -4 18 -17 13 26 29 -16 12 -6 21 -13 -38 8 16 -34 -41 -22 4 -3 2 -50 9 13 -1 -38
5957 -38 0 13 28 -8 -31 17 23 -4 -31 8 20 31 10 6 27 73 10 6 -22 29 10 10 -11 4 32 10 -28 -16 14 3 -43 -21
5989 -21 21 8 -13 -14 -20 24 12 -20 0 39 -2 -1 -13 -6 12 17 -22 -26 -12 24 4 -8 5 16 3 -20 -16 11 43 -6 -23 27 29 -4
6023 -4 -11 -34 21 3 -15 -1 12 -10 -27 -33 -22 29 2 -9 -37 0 -5 -34 -10 1 -9 9 -13 -28 -2 16 2 1 7 16 17 -38 21 26 30
6058 30 -10 -18 -3 -5 -3 2 -8 14 23 14 -27 -8 12 -22 -37 -40 24 23 0 -45 -33 -4 -7 -13 -18 36 2 -34 -30 -1 8 19 -37 2 4 40 -24
6095 -24 -29 12 38 1 5 -16 2 18 24 -12 17 14 19 -10 4 29 6 13 -22 3 9 -6 -21 -35 -1 -20 -29 -5 3 -4 0 27 -13 9 10 -14
6131 -14 -13 1 22 17 -1 22 15 -2 16 23 5 31 30 -17 19 -3 10 23 -6 30 16 -16 1 6 5 16 5 -6 -3 2 1 -16 -7 -1 -12 7
6167Gj8qJ6j3J2Rj3L6l8NJ6Lj2QJ0knpj2K4Pnk4K2jK0o1M0j5%J0l4J4K5j4l1L
6204b6K0K9l4l3NM4m8lM4J9k7j5J3%K4k3K0k3L0J0m4J1M1j2j5mMK6l5j6L1rk2
6237a8J8qJ4J4No0RJ9J9n1PK4Nj5J0J2Nrl4K0J6Ljl4M1K5k1k8J1M8m0k0K3N%k8
6273a4j7K2K9j9j0K8k3NnppJ8J1k0J0Mmn1O1j9%qK2J8l5JnMK5j5J0j6J1K9l6L
6309@MJ4n1M3K8m9J6JK7qk9j4K6j5J6k3k7M7K8k8o1L6M9l4j2j4M1k0j5oJ9mkQ
6343iL2l2K4%k3J5K7m6lL1J7j0m7M2%j6j5L3nJ4kk5J5l9K0l3K1LL1k9rK9ol3p
6378c5L4Nrj4L4kQl5j4M1l4K5j0jK9Rl6%J9k1oJM5k1j1lJ8j2J4j2nK0jk5qJRk
6416ek0PL9rk9KKKk7K8kMK5%l2J5K0j6j6K2K1k2k7M5K4m7j8J3M2n0j1RlJ3qk6
$$ plain form
6167 7 -11 -19 -3 -16 -4 5 -8 28 -10 -5 11 14 2 10 20 18 13 6 -6 18 25 20 -4 18 17 37 -24 16 1 1 11 -23 -9 16 2 -29 -26
6204 -26 -6 23 -11 -44 -39 5 -43 -46 -2 17 -10 -25 -12 -12 12 -11 9 -14 16 26 -18 -7 34 22 7 3 7 33 -2 -18 13 4 -18
6237 -18 0 -8 6 20 25 -35 -26 -7 12 -39 -32 -8 -3 -18 -8 4 9 0 -34 -14 2 5 4 -30 11 36 15 -13 -2 46 6 -14 9 14 14 -14
6273 -14 -31 -9 20 1 -9 19 -4 1 -4 -11 -18 0 11 -9 1 5 1 -50 11 -8 -8 -16 6 24 -11 -10 -15 -11 14 -1 9 -7 4 33 -3 0
6309 0 4 18 -33 10 38 -11 5 6 33 25 -4 -18 8 -7 9 -14 -41 6 34 6 -55 -19 30 -4 -16 -30 11 -9 -24 -30 -11 -15 -17 -9
6343 -9 23 -9 15 15 -8 7 34 -12 -15 16 33 23 -24 18 18 2 -13 20 15 29 27 2 17 -22 -2 -35 -14 -11 20 -9 -18 11 5 -28 -35
6378 -35 -1 4 -5 -19 15 13 21 -14 -28 13 -21 4 -6 -7 22 31 -5 -5 14 -7 -13 -12 33 12 1 -2 16 4 18 6 1 21 20 -5 -13 -12 -3 -5
6416 -5 -25 -18 21 12 -17 -15 -13 -11 -38 -10 -12 -8 17 17 -15 0 20 4 -12 10 31 9 -18 27 51 4 -14 -1 41 -9 -20 -11 -14 -1 -9 -35
6452c5N9j8Ml1MJ8M3p6j0P7%n5JM0k3l1K8rRRqNJM0k6l4J1K9J1n0K1M2J4q1M4
6487B3j1jk6NOJJ0j7j6L7Qj9m5L6L4m3J0JL3m5kK2J7jj6k2k1M5J4Qm3M3j3k3J
6522a0K7K2l9KLJ8j2k3L1J5m8L7k5k7L6Pkl3O0k3l5K9k8Om3K7K0Ok0J3J4j6L2
6555B1qk2j2L8j3J5j6K6j3l5K1M3l6k7N5kJ2n2L9qLk8j3K1Jj6J5mK1l2k4JL3J2
6589A6m0j9J3O0n9NN3m3pL0J4l4J3K9n3mP9j4q3L4M5J0p0J2M0kk3lJ8MPj2k9J4
6623AJjn2M8M7l2m3LM4%m6J8L1ql1JJ5PJ6l6mL1Kl3j6N9qJ0l6L6K9l2l4K2K3k4
6659HJ3k8j8L6k3KonN4p2J2M1oj2k3PK6j5j1NK3oQj4NJ7nOn6N8L1k7o0O5K2m3
6695Ij3M3ql2K4j4Qk8J1l%oL2l3K8Nk7l4M4K4n2K2j9M2k4j7K4l8L0rjJ6j4RJ0
$$ plain form
6452 -35 24 6 10 -21 -17 1 44 -32 -42 35 35 -20 -19 21 -2 -33 -5 -14 -5 4 -4 1 2 42 16 -18 -7 22 33 -17 4 46 60 -21 23
6487 23 12 11 -15 -10 -4 -3 7 -10 -26 11 19 0 -45 -9 25 -18 -8 -7 26 -19 -21 1 18 17 1 -21 -42 3 17 25 -18 25 12 -11 -10
6522 -10 17 39 0 2 5 23 11 -12 19 34 -14 23 -2 -29 7 14 12 -21 39 16 -19 10 -18 -12 -55 -28 -8 -2 -22 -9 5 -11 21
6555 21 13 -9 -21 17 4 19 3 29 16 -19 2 45 9 -18 37 35 47 -5 34 26 29 1 -12 9 10 -6 9 5 26 -6 -30 -29 4 16
6589 16 -24 -43 -30 30 -29 -24 29 -14 -21 9 23 -11 2 31 -22 -26 53 39 -44 -10 35 45 -25 -13 27 25 2 -1 17 21 28 16 -13 1
6623 1 2 1 -51 -3 44 12 -31 -28 16 16 -30 -12 19 11 -20 -19 -4 3 19 -17 -21 10 12 -21 -37 22 14 24 -12 24 53 21 -13 9 32 8
6659 8 21 -7 -25 11 -12 -10 -16 -21 33 -39 -27 14 8 -4 -27 -20 6 -9 -20 -15 8 2 10 -4 1 18 13 19 -37 21 52 25 -35 30 52 9
6695 9 -4 39 31 -1 23 9 17 -11 0 -3 -3 -9 23 -10 18 23 -4 -38 6 30 -22 0 -19 23 -1 -18 6 -32 -2 -11 -12 4 -10 -1 9
6730Il1L2Rl5JK0K5n1k4P4Qm8J8J5kk3OrK5j0J4l3oL3j4k2mM1k3l9K5N9k1l9L0
6765A0j2j2%J4l7M8Rl0j8L4L3n8pJ7N2k2l1kM5l1j5kkL7j5m2K1L5Ml7j5K0M8m8
6799im0N6J9j3l6RK4j7%k0PK6kj1k8O9rk7k6N6J0k2l7J1K4jj8PMlOj9K3Ooj1k0
6836a8K8K6m7lM2j8l0rK1J8n0M6k1k0O7l4J6l0K2kk6MN5k3l2L9kj3k7K1Qj7L0
6869B1j2npJ2noKJ0j4j4J4jQk9M2k5L1l6PK0k0J4Rk6K2pMPrJ7nrJ0Mm0ML1j5R
6908A3j7K5k3%J5j6J7k4pPJ0j8JJ6k1L1l4QK0Qj5k6L2L0k5k6K6k2K7mj6j1J6m
6942gOj2K4Mk9oK3J6j4j1J7MqlJ3j4Pnk1J9MLl0mN6k0k4LJ5j3J7j7mL0j9l9J1
6979b8J8L1k2nj2L5K1n2K8L0ok9jK0oMk0j1M0j5opoK7pm1K8nJ1m8K4mK0k5L2o
$$ plain form
6730 9 -22 10 19 -16 -15 5 30 -21 -45 29 37 -11 7 22 20 -3 3 -6 19 9 23 -10 -16 17 3 -19 -23 18 -5 -44 -19 40 19 -20 10
6765 10 -2 -14 -14 0 -37 11 20 -10 -28 6 39 -19 -26 -9 43 21 -10 -12 33 2 -13 -15 -17 20 5 -37 -16 19 23 -14 -29 -9 39 -9
6799 -9 -49 7 26 13 -23 -14 10 -7 -7 -27 -20 6 4 -7 -35 34 25 -2 -28 28 38 16 -21 -10 14 13 -5 2 6 3 9 -10 13 19 13 2 -18
6836 -18 10 36 -11 -14 28 10 -20 -29 -8 10 -40 6 -15 -35 32 -2 14 -16 6 4 -22 -18 37 14 -18 21 19 6 -21 0 8 -9 21
6869 21 9 4 -3 9 4 -2 0 10 -4 -18 -4 -5 3 -26 16 -9 22 -14 -7 13 -7 7 16 -10 12 5 9 16 7 24 19 10 20 24 -16 -12 19 4 13
6908 13 -4 21 -2 -2 13 -3 14 -10 -17 -10 0 -18 -17 -1 -22 9 -25 -17 3 11 -4 -30 2 32 7 -19 7 -15 12 8 -8 -19 -3 -7
6942 -7 -1 -13 11 15 -14 -20 3 19 5 -6 11 15 7 4 17 3 10 5 -16 3 7 10 -20 -24 32 12 -12 -9 6 -7 10 -7 -11 19 0 -39 -28
6979 -28 -10 21 -1 -6 -18 17 38 -14 14 44 38 9 8 28 22 26 6 -5 35 20 14 7 1 28 21 -20 8 3 14 -34 -10 -14 6 -19 13 7
7015Gj5J9k5%PmK4j0j7J7%mK4kj6qK5k7lJ7Rqj8J8j5J3k2L3krnj2k4O3l8k2jN7
7053B6l8j9J2QJ1nlj6M4pk3J8Nj6j2J1lL7Ql0mqL9l4J2NLk3j1PL6j5Nm3K8PJ7
7090B9m7JL9Ll4K0Rj5m5J3KM3j1m1K3PJ7j1j8K4K7k9nk2N5m1k0OM0lk9K3lJK2
7125C0rl2J4J8ml1K0nj3Kj1M0k0k9J2L7k6Nj9L1pJ0j5J3rJ5qok2K9rk8L7%j1m
7161emK4Lk3J9J8l4L3j9j5PploJ1J0l5NNJ4pJ2kLmmOnJ3Jjk6K2mPKJ7j4l6LK6
7202Gk1K2J6J0o0K8L0j8K0k1llNj5jkK3J2l4j9L5j3m2K6L8j5r%K2j3%j6Q%J5m
7238Hj5J5qj5m1P3K8n3orM9k0j1OJ7Oj5k0J8Nk0rQM1k3km6N1lk6%j6K8nJ2k3j1
7275c2K0L1rl4K6J8m6%M0ljj8j3J8K3j1j0LJ0Mj6KM1m8kML3l1l8L3K7l0J9k5K3
$$ plain form
7015 7 -8 11 -14 -14 -7 -11 13 3 -14 3 3 -1 23 21 5 -3 22 -5 -8 9 18 10 -8 10 -5 8 -14 19 17 8 3 -9 -33 30 -8 -30 -31 26
7053 26 -12 -31 -19 -11 0 -5 -8 -24 20 13 -10 8 13 -3 -15 -4 -7 30 38 8 4 -4 35 1 13 18 21 -2 -13 -6 30 15 20 -23 5 12 29
7090 29 -18 -17 22 25 -9 11 20 5 -40 -27 -25 18 7 -34 -11 -4 13 2 -16 8 35 6 1 -21 34 -7 -27 -21 19 16 -13 10 7 8 30
7125 30 21 -11 3 21 17 -14 6 1 -12 -10 -21 19 -1 -30 -18 19 -7 -2 -21 10 3 13 -2 11 2 17 9 3 -19 10 1 -27 10 10 -1 -5
7161 -5 -9 15 18 -5 14 32 -2 31 12 -3 4 -3 -6 -12 -1 9 -26 -21 -16 -2 -9 3 1 4 0 -4 2 -3 10 11 10 -16 6 2 9 11 28 14 -22 -19 7
7202 7 -14 8 24 34 -26 2 32 14 34 13 10 7 12 -3 -4 -6 17 29 -5 -24 11 -2 -44 -18 20 5 -4 -4 18 5 5 -11 -3 -3 12 8
7238 8 -7 8 0 -15 -56 17 45 -8 -14 -23 26 6 -5 1 18 24 9 -11 7 12 -8 -17 -9 32 9 7 -39 12 9 -17 -17 -33 -5 -10 2 -21 -32
7275 -32 -12 19 10 -24 2 20 -26 -26 14 11 10 -8 -21 -3 20 9 -1 2 12 16 0 2 43 -5 -7 -3 30 -1 -39 -6 21 -9 10 -15 8
7310Hj4%OOk4jJ2jpRPl4K6j1K3j1j3K1joK4pMm0K5JnL5k0pkj1JkmK7j7j7N2k0
7350A2l6J0nJ2j5K2j3lj9J8J6k7K7oj7M9j8mqJ4J2j0l8K0L2j3rJ0pJkJ1J2k7J7
7385A8l2K7Kj4J3Lj2Nk4JJ4lj6Oj6NJ8rpQJ5pk3L6K9l5J1j9J5j5K9j1J5Ml9%o
7422a4K4Oj5Mj8L9j2k2jK9J5m6J4K0j5l1J4J2Pj4J1Ol4PmlJ3K6k2KpK5%l4L1J4
7458B7l2PmJ0J2jj4nK3j1rjK4j9k6J1J6Pl1qL1Lk0LPQj8nK3j9J8Ll8K9Jk4JK4
7496CL1j3n4L8OrJ0NNj8Jk1J6K5k5J3rJ6nk0rL0qj4JJ9k3K0qj0K2pj7Ol7M8lj6
7534a1j9L9jj6nL1Lm1J4QPJ8l9RLKK0pqRj6LL1k9Mm4M0J0j1m3K1K8J1l6lj3K7
7571dJk0j3M3Ook6J8mJ4l0O2j7n8L3l4M6j9kPKJ4kj6J6OJ7m5rL1pmm2M4mj0Qo
$$ plain form
7310 8 -6 -6 0 6 -18 -19 -7 -8 -15 -6 1 -33 -7 -18 5 -6 -19 2 1 -5 19 12 16 -24 1 2 -3 32 12 5 3 -8 -7 -9 -13 14 -3 -20 32 12
7350 12 -24 -14 -19 -7 -22 0 -13 -16 -35 -17 -1 -28 -1 -7 -24 25 7 3 -5 9 21 11 -27 -7 25 12 3 13 6 7 5 16 28 1 18
7385 18 -14 13 15 1 14 17 5 10 -14 -13 1 -2 -18 -12 -28 -23 -5 -14 -21 -13 2 -5 -28 8 37 2 13 -6 9 -6 23 12 27 31 -8 -8 -14
7422 -14 10 16 1 5 -13 26 14 -8 -9 20 35 -11 3 23 8 -23 -9 3 10 -4 7 13 -21 -14 -18 -21 -8 18 -4 -2 -9 16 16 -18 13 27
7458 27 -5 2 -2 8 20 19 5 0 23 12 3 2 26 7 -19 -8 8 15 -16 -24 7 10 -10 -7 0 8 -10 -15 8 -11 7 10 -28 1 2 -22 -21 3
7496 3 34 21 -33 5 11 2 12 17 22 4 5 -16 0 25 0 13 4 20 15 -5 -14 16 8 -6 -5 14 -9 11 3 -7 15 8 -9 -3 -40 8 5 -11
7534 -11 -30 9 8 -8 -13 18 21 -20 -6 2 9 27 -12 -3 0 2 22 15 7 16 0 3 34 5 9 -35 5 15 4 -39 -18 10 21 -15 -18 -31 -4
7571 -4 -3 -23 -36 7 13 7 -19 -1 -5 9 -21 41 24 -34 -1 -35 11 -8 -10 -3 -1 13 11 -5 11 17 34 -11 -20 11 4 0 -42 2 -2 -12 -4 -10
7609a0L3k6mOj7J7J4m7L6Oj2kj2M4k2k8M3J3k2k8K2Mk0K4k0JK1Oj5j7K0J2j4k3
7643a7ROj7K3j2K7lk2j3K9j7MJ1j3J1Lk0l0M6J2m0J1J6j1K0j6POPJ7k3Nj4mQm
7679BM6k5l1J7J1qj5J0nKOk9L6l1l4M9Mk8K0qJJ7jk6ML3j2J2j8mL7j7m1K2L0n8
7715c2K2J9J6qj9qL1j3NKm0N0km2%K3j1Kj7J8j7J8kJj3RJ0mj1J4jj4k0L4jkmK3
7753A6K2n9L3nKj9KqK4O%pK0KRm5J4J3pl1L2k4K5m8NK9Oj9oK5Mlj8k2J9K9k0m
7791hL0rn2M3JJ3j0J0k2L7rk4oL2j0j8QJj2J9m0K5J2J9n1PL0j9J1k9M2j8oj8j5
7826c6N5l4Mj3K1lpMK0J1om4M6J0l4j6M6JQml3J8j1J8l0j7L0Kj2pKJ7j6l3M4K3
7862B4l0MJ1nL4m6j5K1L0l8k5K8L9k6k7J4L0K2n9OOL2l7qJ6K8oj2j1Mj3PK2j5
$$ plain form
7609 -10 23 -3 -7 -1 -18 -1 13 -34 2 8 -4 -6 -18 26 4 -24 19 32 10 -18 4 8 -12 12 -8 -7 14 20 5 -12 8 20 6 -17
7643 -17 -8 -2 -19 4 -8 19 16 -6 -19 10 -7 -3 8 -5 6 9 -11 -41 5 17 -23 -12 4 -7 13 -3 4 10 17 34 11 16 2 -2 6 2
7679 2 48 23 -8 9 20 12 -3 7 2 4 10 -19 17 -14 -48 1 5 -23 -3 -11 -10 7 6 -20 -16 17 5 17 -1 -5 32 15 -26 -4 26 -32
7715 -32 -10 9 25 17 -2 -10 21 8 13 15 -25 25 23 -19 -19 4 -7 -5 -22 -4 -21 -3 -5 -4 -17 -8 2 -2 -13 1 0 -14 -34 0 -1 -3 -7 16
7753 16 38 -21 12 7 9 -10 -8 -16 8 14 14 7 27 29 38 -7 7 20 13 -18 14 -10 15 -33 -28 1 7 -12 -18 7 11 8 -10 -32 -13 16 -4 -8
7791 -8 22 13 -39 4 5 18 8 18 -4 33 24 0 -6 26 16 -2 6 7 -5 14 -26 -1 11 30 -21 -14 16 -3 8 -21 21 3 -3 -21 -36
7826 -36 19 -15 -11 -24 -3 -6 -13 -9 11 22 16 -28 18 28 -6 -22 24 25 33 29 -4 14 3 21 -9 -26 4 6 -6 -13 -11 6 -10 -43 1 24
7862 24 -6 -2 9 4 38 -8 -23 -2 28 -10 -35 -7 32 6 -21 -7 23 45 -14 -8 -2 30 -7 -15 1 29 23 11 0 4 -9 -2 20 5
7896EJ9rl9RJ8L0p1M2Pj0Rl9M3oj1k1K3K0J3m3k3M5%j1m3O3Pj2m0K3PJ8%roK6
7932C4k9J4k8M4%p8L8L5j8k2KK2J6l3m0M5Pj2nJ5kk1L0n8L5RL5l7j6Q9p0k1L1
7965A1PK2m8J9RJ1rkj4JL5l0l0L4J7rm7L4Kl1pK7k0k9K5K3Ql8OJ6JK3kk2k9L6
8001@Qj5mM9k2k7KL2rmrLrK7j8%NJ1j7k9M3J5k1m3PO6n6K2KK1j2j5j9J3J1pOr
8039brL2jm3M2nj5j1J6Mlj7%L4Pl0J0PNpoQNqrj8M0Ol1k0M2rk1KoJ2qqJ7jJ4k2
8081gl0L3NRk7L1k8L8l9J3K4Lm5J7K9Ql0k0J8J8J4j3l6J5K7j2j7qL3Jn4J5L0l1
8115a6J0MLJ0j4RqOMj6ljL5l3l1N6Mk2j2pO1m0kK9k8j7K7j7J3K1rj8j0J3L1n9
8151b7LN0j4j2k6L5Nk2pJ1Pj3mLJL1l0k4J6N2l2l8K7J1J7l8JRJ6kOmMJ3k5J0J3
$$ plain form
7896 5 24 15 -24 -15 3 33 -38 4 11 1 10 -29 14 8 -3 -24 -1 19 32 -11 -34 11 11 0 -43 20 27 15 -25 -2 5 23 23 14 8 34
7932 34 5 19 -9 35 35 -43 -5 30 12 -10 -8 14 30 -3 -43 2 9 -3 -8 7 5 -16 14 -44 -9 0 35 -2 -18 71 1 -20 11
7965 11 18 40 -8 11 20 31 22 20 6 7 42 12 -18 16 33 24 -23 11 13 -18 -25 2 -18 -47 -22 1 9 -29 -23 -7 -6 17 15 -7 -36 0
8001 0 8 -7 -11 38 16 -11 -9 23 14 10 1 4 -5 22 4 4 9 20 3 -26 17 32 11 -32 -25 41 -15 7 9 30 18 3 -16 -3 8 1 7 -2
8039 -2 -11 21 20 -23 19 14 -1 -12 4 8 5 -12 -12 22 29 -1 9 16 21 14 8 16 21 13 4 -14 26 32 1 -19 23 14 -7 -5 -11 1 -7 -15 2 1 15 -7
8081 -7 -37 -4 1 10 -17 14 -14 24 -15 -2 22 25 -20 -3 26 34 4 -16 2 20 34 21 -15 0 27 15 -2 -10 23 24 -30 -15 15 -16
8115 -16 -6 -2 1 11 -3 6 -2 4 8 -8 -11 -12 23 -10 -41 15 19 -3 -15 -22 39 -1 -3 26 -2 -19 8 -9 4 25 16 -2 -12 1 32 -27
8151 -27 -24 26 12 0 -26 9 14 -8 -15 -4 3 -10 -14 -11 -10 21 -9 -33 -17 35 3 -35 -8 3 20 -18 -17 -8 8 6 12 8 12 25 0 10 23
8188B3Oj6j8
$$ plain form
8188 23 29 13 -5
8191e
$$ Imaginary data points
##PAGE= N=2
##DATA TABLE= (X++(I..I)), XYDATA
0@%%%%%%%%%%%Qj6J6j6J7k5L2m0M8n6P2q8J02j18J37j59J83k10K43k80L19l62
33a93M12m66N26n92O64p44Q32r28J031j142J264j401J551j713J891k082K293k529
51a326K785l069L385l737M132m579N092n682O370p191Q186r419J0996j3093J6042
66H892k0512K8172m4740J41573j57446k59547L61038J84226k41305j99441J72299
77b6791J40752l9947j12726o0643M9120J79247j0393k58065m2118L27202P0308
88B15946l49659j00033L48836J06664l05934j10090K43323R7209j53302q2586
98h9626N6989N8776M5092l7629j35088J5584K11507J26k62480j2702K87169J7591
110A55309k81676j8017K50346J3267j95836p265J25334M7m6376N379l1464p572
$$ plain form
0 0 0 0 0 0 0 0 0 0 0 0 0 8 -8 8 -8 9 -16 16 -24 24 -32 40 -48 54 -64 73 -86 97 -113 130 -150 169 -193
33 -193 219 -247 279 -313 351 -393 439 -489 542 -600 664 -737 814 -899 992 -1090 1203 -1326
51 -1326 1459 -1610 1775 -1962 2170 -2409 2683 -2999 3371 -3820 4366 -5053 5943 -7150 8892
66 8892 -11620 16552 -28188 113385 -44061 -303608 57430 241656 351 -199090 -26791
77 -26791 113961 74014 -38712 -99355 -50235 129012 118619 -139446 -181564 145638 215946
88 215946 -133713 -233746 115090 221754 -84180 -194270 49053 146262 -7040 -89626
98 -89626 -32637 26139 71231 33602 -101486 -85902 125605 125731 -136749 -149451 137718 155309
110 155309 -126367 -144384 105962 119229 -76607 -83872 41462 41509 -4867 512 -30952 -38524
122c8524J00935N015j55377K067J89947j3142k01731K7515J91681m2832j62485
133i6931N6683J18645o6636o5917P1257J1337o8983L8587N8649p9044m0863J05942
145D2726J6929j16972J1158J11751m1356r2696P0211O3006r4470k7005J11943
156E5225j0344j20454M3740J18431o8680j05139Q2601Q1806q3263n0275P0648
167A4296J2886m6360K7101J4114o5659K1950R9080n7510j24572Q7198J39351j06806
179A5069j41863J13383J31672j05881j10154Q4076P9336m9952m1808P432J501
190a7189L8656L7865q3302p2684J21413J00556j47940j18899J59650J26382j54823
201a0315j22893J33451J09449r6953q7528M8687N9049O133k7310o2257n010J14139
$$ plain form
122 -38524 62411 67426 -87951 -85884 104063 90921 -110810 -83295 108386 65554 -96931
133 -96931 -40248 78397 11761 -54156 17101 28438 -40545 -1958 56691 -22353 -63216 42726
145 42726 59655 -57317 -46159 65592 24236 -68460 1751 64757 -29713 -56718 55225
156 55225 44881 -75573 -31833 86598 17918 -87221 -4620 77186 -6077 -56352 14296
167 14296 27182 -19178 7923 22037 -43622 -21672 77408 19898 -104674 -17476 121875 15069
179 15069 -126794 -13411 118261 12380 -97774 -13698 65638 15686 -26122 -18690 -17189
190 -17189 21467 59332 -23970 -96654 24759 125315 -22625 -141524 18126 144508 -10315
201 -10315 -133208 243 109692 12739 -74789 -26102 32947 39080 11770 -50487 -55497 58642
213E8642L5139j56307o0941J83755Q0202j93581r1606J84805R4967j57534r0690
224a13149J14345P9512n9283o2913j718M3236O2903k2253j18189J763J61768J6609
236A02631j89321l1229J98239M1439j88109m7510J59782M9426j16575m7743O3010
247e960M3468m871l7761n2327L1217J03068k4325j42164J7820J66338j1865j73695
259i1057O315J64343q67j39323m294J01868R325n6389j4493P613J9868L9579k5194
272A7294q0519L0077J10819l4391j28363L7572J31793l8945j21457L8037R8943
283F0860l4614o7615K8575L1560j9646N199Q452l8487M376O4671j7798q0984L1146
296b4305Q6340m2906q0821N1812O5627n7119m3270N8212J7004n4775R415M6731
$$ plain form
213 58642 93781 -62526 -123467 60288 140490 -53091 -144697 40108 135075 -22459 -113149
224 -113149 1196 80708 21425 -41488 -43206 30 62933 40680 -77509 -75746 86022 102631
236 102631 -86690 -117919 80320 121759 -66350 -113860 45922 95348 -21227 -68970 -5960
247 -5960 37508 32637 -5124 -57451 -26234 76834 52509 -89655 -71835 94503 82638 -91057
259 -91057 -84742 79601 78734 -60589 -64883 36985 46310 -10079 -24572 -16959 2909 42488 17294
272 17294 -63225 -33148 77671 43280 -85083 -47511 84282 45337 -76120 -38083 60860
283 60860 26246 -41369 -12794 18766 -880 4319 12771 -25716 -21340 43331 25533 -55451 -24305
296 -24305 62035 19129 -61692 -9880 55747 -1372 -44642 13570 30574 -24201 -14786 31945
308C1945l2969l4980N0594K0361o0136l934O0447j2947n1983K8820L5884m2226
320a1124j4173N2520j0080n8673L3585O0351n3206n7283O6503N0026p1261l9163
332e1978O6433K5423n2469j0039L0665n622l418K0210k6344l2990N4911M2686
344E7468p8891m8551R5276N0372j01816m8463R7294M3135q1658l4831N6506K4766
356C0607k4134j3878j2146L030M8666P244q1324j6185J06586K3388j21801k8877
368g8824J25006L2533j15662l4415R4532L4394o3736l2982K6140L0163J4569k6074
380E644n4176K0850Q8659j4815j14498Q254J29286j167j31287n946J20342J2894
392F4040r7801j9214O6007K4906k8154k9556j1879L2783M9849l4488q2109L4350
$$ plain form
308 31945 -1024 -36004 14590 34951 -25185 -29119 31328 18381 -33602 -4782 31102 -11124
320 -11124 -25297 27223 17143 -41530 -7945 52406 -800 -58083 8420 58446 -12815 -51978
332 -51978 14455 39878 -12591 -22630 8035 2413 -1005 19205 -7139 -40129 14782 57468
344 57468 -21423 -69974 25302 75674 -26142 -74605 22689 65824 -15834 -50665 5841 30607
356 30607 6473 -7405 -19551 -16521 32145 39389 -41935 -58120 48466 71854 -49947 -78824
368 -78824 46182 78715 -36947 -71362 23170 57564 -6172 -39154 -13014 17149 31718 5644
380 5644 -48532 -27682 60977 46162 -68336 -60082 69204 68037 -63250 -69196 51146 64040
392 64040 -33761 -52975 13032 37938 9784 -19772 -31651 1132 50981 16493 -65616 -31266
404c1266J05571l2317j18121K7860J18738k1423j07689J3074Q6703l213n8101
415b0184p615K5087J8572Q971k8670m0239L7109O6088m3016q4065M5698R2708
427G0444m4695r1474M0030Q1093l2119o3206K1233M0004q454j4318n148j1028
439a7638J8453L3104l0457m9932M0083N9869m6468o2075M9167N6775m7944m5112
451d2175M2996K9032l4596j0439K3623p993j1031K3965k104l5642J4852M1644
463C2132k5945m1576L4457L5315l9809k4161M1583R729l9848N981L4807k0911
475A754k7404L3050J8349m0603q540M2701j091l8817R617K9413j6418j5288K1158
488G881j588k3642J9423K3899l6069k2220M9427J9149n7760j5189N9761J0663
$$ plain form
404 -31266 74305 41988 -76133 -48273 70465 49042 -58647 -45573 41130 37917 -20184
415 -20184 -27799 -2712 15860 24831 -3839 -44078 -6969 59119 16103 -67962 -22264 70444
427 70444 25749 -65725 -25695 55398 23279 -39927 -18694 21310 12856 -1462 -6610 -17638
439 -17638 815 33919 3462 -46470 -6387 53482 7014 -55061 -5894 50881 2937 -42175
451 -42175 821 29853 -4743 -15182 8441 448 -10583 13382 11278 -24364 -9512 32132
463 32132 6187 -35389 -932 34383 -5426 -29587 11996 21725 -18123 -12142 22665 1754
475 1754 -25650 7400 25749 -14854 -23394 19307 18216 -20601 -10984 18429 2011 -13277 7881
488 7881 6293 -17349 2074 25973 -10096 -32316 17111 36260 -21500 -36689 23072 33735
500C3735n5138o238M4026K297k7429Q00O996l022J5005M317l6403m672N4823M581
514C3678o8148m225P4757M185p3876m418O5512N463n0296p312K9670R731n845
527H876j2421j8842J4945M1920j6924o1085J7468P4386j6472q0353J3522P8544
539D3564q808o9162K413N3142N180l2092j3148Q320K0821J5876k7350l8052L2022
552g274N6230l4059o8467L3293P3721k9609p1758K3043O2898j4121m8232L447
564b0888K9387P926q636j9150j2052K9239L0537l7098m5146M1892N4478m3043
576G446n7947M0469N5537l4043m7703K4338L5685j2195k0898j186N250J4634R748
589A9135k6822k2575L6494L1928m2846l7047M5163L7705m3489l4150L7806K6985
$$ plain form
500 33735 -21403 -27641 16385 18682 -8747 -7947 -951 -3973 11032 15349 -21054 -25726 29097 33678
514 33678 -34470 -38695 36062 40247 -33629 -38047 27465 32928 -17368 -24680 4990 14721 8876
527 8876 -3545 -22387 -7442 34478 17554 -43531 -26063 48323 31851 -48502 -34980 43564
539 43564 34756 -34406 -31993 21149 26329 -5763 -18911 -10591 10230 26106 -1244 -39296 -7274
552 -7274 48956 14897 -53570 -20277 53444 23835 -47923 -24880 38018 23897 -24335 -20888
564 -20888 8499 16425 7789 -11361 -23413 5826 36363 -735 -45881 -3989 50489 7446
576 7446 -50501 -10032 45505 11462 -36241 -11903 23782 11587 -9311 -10497 -5247 9387 19135
589 19135 -7687 -30262 6232 38160 -4686 -41733 3430 41135 -2354 -36504 1302 28287
601B8287k8859j7425J7626O724n156L608p246j2605J8598J9136k7697k2330L3885
614F546K2239l6742j8812L6019J2863l1957n136K5116l144j6375J0734O646j6688
627h691L042K0131j1712k0642J8457J7907k2824j2382K4366M708k3137M182J9590
640A2995j3239j4231K1211P999k7100j514L0143m173k9876Q591K6102j1110j9134
653a3336J1722R673j0472J298P553j2642l727K3191n63l1709M461L7246p593l9176
667b4074R303L7134r273l1277P554K2079m176j0526l66k294N730J5172j1039k6672
681b2725J5603L5682j8711m1251J9835M2934j8632m0489J4975L4111r250k4554
693a2472J866J2677O443J32j4675j2865K1933K4092k7362l2805L0244L8283l0126
$$ plain form
601 28287 -572 -17997 -371 6353 1197 4805 -2441 -15046 3552 22688 -5009 -27339 6546
614 6546 28785 -7957 -26769 9250 22113 -9844 -14980 10136 6992 -9383 1351 7997 -8691
627 -8691 -5649 14482 2770 -17872 585 18492 -4332 -16714 7652 12360 -10777 -6595 12995
640 12995 -244 -14475 6736 14735 -12365 -13879 16264 12091 -17785 -9194 16908 5798 -13336
653 -13336 -1614 8059 -2413 -1115 6438 -6204 -9931 13260 12697 -19012 -14551 22695 15102 -24074
667 -24074 -14771 22363 13090 -18187 -10633 11446 7270 -3256 -3622 -5916 -186 14986 3947 -22725
681 -22725 -7122 28560 9849 -31402 -11567 31367 12735 -27754 -12779 21332 12082 -12472
693 -12472 -10606 2071 8514 8646 -6029 -18894 3039 27131 -231 -33036 -2792 35491 5365
706E365l9977K6954L7856k0862l2243J2555K3943k731j3662p722K649J7689Q028
719A7842k6085j7439L2230K4499l5337k8888L5063L0221l1512k8544K4853K4145
731B1048j5734j7879N101J0279O189k371j6886n011K5991J1281l2652j5665L6094
744I785J8174l6091j8379L2576J6653k6018j3407J7157R083o872m305l745l47
757e736J3549M243k1668p130K7351Q545l0040q615K9621P321k6316m992K0642
770F775K110j3160Q65M972l622L334N497j0591o377J6396O017k0035m507K1319
784H993J941k0180J282J6886m732j2017P900O082j0403OJ1898n709j2001J0229
798A75J0667j3115q014J4088M231j3003K79J0296n051o226R546J524j3316L360
$$ plain form
706 5365 -34612 -7658 30198 9336 -22907 -10352 13591 10860 -2802 -10524 -7875 9814 17842
719 17842 -8243 -25682 6548 31047 -4290 -33178 1885 32106 594 -27950 -3097 21048
731 21048 5314 -12565 -7464 2815 9004 6633 -10253 -15264 10727 22008 -10644 -26309 9785
744 9785 27959 -8132 -26511 6065 22718 -3300 -16707 450 9533 2661 -1644 -5389 -5736
757 -5736 7813 12056 -9612 -16742 10609 19154 -10886 -19501 10120 17441 -8875 -13867 6775
770 6775 8885 -4275 -3410 1562 -2060 1274 6771 -3820 -10197 6199 12216 -7819 -12326 8993
784 8993 10934 -9246 -7964 8922 4190 -7827 73 6155 -4248 -4242 7656 1947 -10054 175
798 175 10842 -2273 -10287 3801 8032 -4971 -4692 5604 553 -5673 3873 5397 -7919 -4559
812d559J5922p553j7079J0545J6572j2013j4390J1648J0824r575o203N939Q98
825I76j381M579l739r645Q653J3847j2852j6747J5644J8159j6694j7821J5820
838a201J5900j2884j2618Q372Q186k492l145l955k048J0379O919j6023j1096K0242
852D536J4118k2491j5813K2390J6004j9956j4888J5323J2496q984r187J562N315
865D25O126j210j3347k664J9373O035k3388q643K5153J0280k4349j0884K1179
878D086J0504j5848r358R036P496j362n320o372K930J3418o29j9177j384K2919
892A0939L025k4471m164K3602M801k0417m981J5292M865q875m345J719L811N354
906F155l152j1678K537J6672k005j9730J546K0646j162j9455Q44J6310n99j1633
$$ plain form
812 -4559 11363 3810 -13269 -2724 13848 1835 -12555 -907 9917 342 -5861 78 976
825 976 -405 4174 435 -9210 -557 13290 438 -16309 -665 17494 800 -17021 -1201
838 -1201 14699 1815 -10803 -2431 5755 3263 118 -3837 -5885 4494 11413 -4610 -15706 4536
852 4536 18654 -3837 -19650 2740 18744 -1212 -16100 -777 11719 2735 -6452 -4890 425
865 425 6551 5341 -8006 -10670 8703 14738 -8650 -17293 7860 18140 -6209 -17093 4086
878 4086 14590 -1258 -10616 -1580 5916 4554 -766 -7138 -4208 9210 8581 -10596 -11980 10939
892 10939 13964 -10507 -14671 8931 13732 -6685 -11666 3626 8491 -384 -4729 -3010 801 6155
906 6155 3003 -8675 -6138 10534 8529 -11201 -9655 10991 9829 -9626 -8782 7528 6929 -4704
920d704K14O025K58k29p88n371J544R900k214j3184K961J4771l607j4620M171
935d873J2890m442r819M432N901m090j572L463k701k386O296J077q883L14J0243
950E850j812j0279L204Q913m385o507N229L256n673L14N701l794n162O632M285
965E772q569l033R338J620q767m5P005j449m245K800Q06l879K929M519o324m878
981f400R082M819j0911m401J1377L763j0589k869Q469J838n301q60J452j36K777
996B110J025o798j764J0252K325j2621k766J3852L024j3553l191J1900L134q895
1010a966l030M971K833m13k620m266K236Q503j792j2002J264J4273o88j5101K3
1025g775J4343Q03j2214j508Q799K302m536l063m4L658M622m045q598M173J1707
$$ plain form
920 -4704 -4490 1535 1793 1564 776 -4595 -3051 6849 4635 -8549 -5588 9183 5576 -9044 -4873
935 -4873 8017 3575 -6244 -1812 4089 -1 -1573 1890 -811 -3197 3099 4176 -4707 -4393 5850
950 5850 4038 -6241 -3037 5876 1491 -5016 213 3469 -2204 -1890 3811 17 -5145 1487 5772
965 5772 -2797 -5830 3508 5128 -3639 -3684 3321 1872 -2373 427 1233 -2646 283 4802 -1522 -6400
981 -6400 2682 7501 -3410 -7811 3566 7329 -3260 -6129 2340 4178 -1123 -1983 -531 -667 2110
996 2110 3135 -3663 -5427 4825 7150 -5471 -8237 5615 8639 -4914 -8105 3795 6929 -1966
1010 -1966 -4996 -25 2808 2395 -225 -4491 -2255 6248 4456 -7546 -6282 7991 7303 -7798 -7775
1025 -7775 6568 7371 -4843 -6351 2448 4750 214 -2849 -2893 765 5387 1342 -7256 -3083 8624
1040H624m050j3554L581J3980k682j3163J602J0971k78p859j174M055K615Nl984
1055a311l861M973P180n597r696N876J1069n517j1301M734J0374l499q402J957
1069c021N743j99k601j608o61L283L602m646o001N623P536o110q172O012P844
1084F624n461o609M375M787l001k482J326R7L69K181j997l939L351N110m290n572
1100e131M826N329m851m405M446L007l677j238K542o40j236K323q1l702J231M518
1116C261k190m743K832M314l109l298K996J821k576l4J924j819j062L506K09m775
1132b743N96N534j220n605J552N092j638l952J479K303j093l28M75j719J28L638
1148B499q17n175J301O153j615o485J619O241j403n283Q46L863r7j993p21j04
$$ plain form
1040 8624 4574 -8980 -5399 8581 5899 -7264 -5662 5309 5031 -2828 -4002 53 2668 2673 -1311
1055 -1311 -5172 -199 6981 1384 -8312 -2436 8633 3116 -8185 -3451 6923 3424 -4978 -3021
1069 -3021 2722 2523 -78 -1686 -2347 936 4538 -108 -6109 -486 7050 940 -7232 -1220 6624
1084 6624 1163 -5446 -1071 3716 715 -1767 -441 -344 25 2206 209 -3730 -379 4731 441 -5131
1100 -5131 -305 5024 173 -4232 214 3221 -456 -1694 848 208 -1028 1295 1214 -2488 -1257 3261
1116 3261 1071 -3672 -840 3474 365 -2933 63 1884 -692 -726 1198 -621 -1683 1823 2032 -2743
1132 -2743 -2147 3387 2167 -3438 -1886 3206 1568 -2384 -905 1398 305 -23 452 -1267 -1139 2499
1148 2499 1682 -3493 -2192 3961 2346 -4139 -2520 3721 2318 -2965 -2119 1744 1647 -346 -1067 -1171
1164a171J608K186k342m052K965N395l174o296L097O569k699o161J917N180q57
1179B165l813k93J898J579M9k690j982L614L613m209m822M415N539m178n685L542
1195a258N274k481m388J210L145K66j642j753J09L054J340m077k597M689L436
1210D327m831l989M534M060l806l727K649L162j351k259j60J203J660j26k927
1225a581q07L888J622m404k147M520K403m149k412L424K136k348j644J072J026
1240E99J51l25j435k77K428P63l103j170L475J285l445j219L002J048k290o86
1256a199J357L16l22Q9o21m59J539O73k120q71K479R01k493p74K179N49j690k11
1274f78R34j27j35M61o99p62J328J012j853j120K104J118k029j020J734P94j186
$$ plain form
1164 -1171 437 2623 281 -3771 -806 4589 1415 -4881 -1784 4785 2086 -4075 -2158 3022 2165
1179 2165 -1648 -1941 -43 1536 1585 -1105 -3087 527 4140 -69 -4891 -476 5063 885 -4800 -1258
1195 -1258 4016 1535 -2853 -1643 1502 1768 126 -1627 -1518 1536 2876 -1201 -3798 891 4327
1210 4327 -504 -4493 41 4101 295 -3432 -783 2379 1028 -1231 -1391 -188 1472 1346 -1581
1225 -1581 -2388 1500 3122 -1282 -3429 1091 3494 -655 -3067 357 2493 145 -1499 -427 599
1240 599 750 425 -1010 -1287 1141 1904 -1199 -2369 1106 2391 -1054 -2273 729 1777 -513 -1199
1256 -1199 158 474 152 241 -380 -839 700 1373 -747 -1618 861 1762 -731 -1505 674 1223 -467 -678
1274 -678 256 129 -6 455 -244 -1006 322 1334 -519 -1639 465 1583 -446 -1466 268 1062 -124
1291a24m64M84J16L24K47j042n80J667Q61k086j040K214J172k136j180J750J079
1308A262j193q89M25O29M25l88j199Q2J883K14k385m44K625O69k565q51K278R73
1326A551j737r94R61J034j43r24p26Q09J470o20k077M03K432j71k583j07K448
1343A026L39k059n92J514P56p79r07pR99P44j022j363J029J828r15k057P36K125
1361A395n24j930K69J561L2j036l78M63O12J30q94o49J089J034j180j309J151
1378a64J384j030j361Q79J124n57q08K40M23J20l5m53k49P21N24r12o76J042P28
1397I40j057o13R25M09p08k20M30m0j77K99j40n10M22O02o51n99P62N21p87l38
1417e30P52P3n60J91L74m72o4P07k62q04M87Q79o75q64Q06O81p77m20N93J80m33
$$ plain form
1291 -124 -588 -104 12 336 583 -459 -1039 628 1489 -597 -1637 577 1749 -387 -1567 183 1262
1308 1262 69 -820 -395 234 659 271 -928 -846 1037 1251 -1134 -1578 1047 1716 -849 -1700 578 1551
1326 1551 -186 -1180 -219 815 672 -252 -978 -169 1301 681 -1396 -993 1439 1268 -1315 -1422 1026
1343 1026 1365 -694 -1286 228 984 205 -702 -709 290 1034 12 -1351 -322 1506 591 -1466 -730 1395
1361 1395 871 -1059 -790 771 803 -233 -611 -148 464 594 -300 -949 140 1174 -6 -1315 -164
1378 -164 1220 190 -1171 -292 832 275 -533 -293 130 250 215 -238 -487 234 758 -154 -830 212 940
1397 940 -117 -730 195 604 -104 -324 106 66 -111 188 48 -462 -40 562 -89 -688 74 595 -192 -530
1417 -530 222 295 -265 -74 300 -172 -236 471 209 -595 -108 771 96 -768 38 719 -58 -478 115 295 -138
1438a38J36O6l91K20O81o12q12Q80R46j110r10J195Q02j150n93R65L71o18j69
1457b41K77j21K37L45p41m82J119O05j492n94J703N18j754m51J608L50j336k13
1475f63Q55Q9k69j1l32n3R96J0j486L4J903j41k111K68K109k54j969K67J624k46
1495F20j090J53M32K4K53k92r16N31J451p83j877R76K098j120k121J152J958j023
1513D26j626Q33J120m75n40N9o6M03P09r20j196J419J515j759j697J949J725j969
1531i0j583J787J272j446q84R06M26k94P8m42m88J150P67j753r52K198J028k455
1549g75r30K442Q13k233n43J796K65j148NL96k24L71M27j137n06J741M94k218
1567i64l46K405J68k422O2K167l32j700N30J066o40l36P41m33o93J130N00j626
$$ plain form
1438 -138 -2 64 -327 -107 574 -38 -850 30 976 -134 -1044 151 953 -197 -790 175 546 -72 -241
1457 -241 36 -85 152 497 -244 -726 393 998 -494 -1088 615 1133 -621 -1072 536 886 -450 -663
1475 -663 192 281 12 1 -331 -384 612 622 -864 -830 1073 932 -1179 -911 1198 944 -1025 -758 866 620
1495 620 -470 -317 115 139 392 100 -816 -285 1166 383 -1494 -518 1580 460 -1661 -509 1449 426
1513 426 -1200 -367 753 278 -262 -203 -269 134 843 -77 -1273 146 1661 -98 -1795 154 1879 -90
1531 -90 -1673 114 1386 -60 -944 -38 388 94 172 -270 -758 392 1159 -594 -1546 652 1680 -775
1549 -775 -1705 737 1550 -683 -1226 570 835 -313 -308 88 -136 235 662 -475 -981 760 1254 -964
1567 -964 -1310 1095 1263 -1159 -1097 1070 738 -962 -432 634 -6 -342 399 -34 -727 403 903 -723
1585g23k16J952j31k043M91J957q50j585J118J081j334m60J362k11j266P88R92
1602I22j215o54J471K45j582K78J413p56j108J262O08j596j5J786n20j867J035
1619b93J758j381j420J508J036j485n25J231p9p48N94J93j150M90J579j227j824
1636a743J738J937k097j921K296J676k192j257J756Q45j128k74K91k30O10P47
1652A054j528j128K308J423k906j594L248J576l153j533K816J253k127r37J178
1667e0N47p1k04j072j78K178M85l079p31L707Q75l946r88L865R81l328q88K449
1685E52Q28j353o54L0N60J236l98k465K77L416j91m008P4M221K6m049q7L383K15
1704A613k450l41J278M43O4n62j338O78K485p89l304Q38L808q55l923Q53L603
$$ plain form
1585 -723 -939 1013 882 -1161 -670 1287 437 -1148 -30 1051 -283 -743 619 408 -858 -70 922
1602 922 -293 -947 524 769 -813 -535 878 122 -986 276 884 -712 -727 1059 539 -1328 -293
1619 -293 1465 84 -1336 172 1208 -277 -802 429 350 -398 196 389 -761 -271 1308 81 -1743
1636 -1743 -5 1932 -165 -2086 210 1886 -306 -1563 193 1038 -90 -364 -73 -303 307 1054
1652 1054 -474 -1602 706 2129 -777 -2371 877 2453 -700 -2233 583 1836 -291 -1228 -50
1667 -50 497 426 222 -850 -1028 1150 1635 -1444 -2175 1532 2407 -1539 -2527 1338 2319 -1009 -1897 552
1685 552 1380 27 -627 -597 -37 1199 801 -1664 -1387 2029 1838 -2170 -2096 2125 2151 -1898 -1985 1398 1613
1704 1613 -837 -1178 100 543 607 45 -1293 -615 1870 1081 -2223 -1385 2423 1568 -2355 -1502 2101
1721B101p15k949N39K009l34q67L1l56L23J370o05k283R16K894j131l172J283
1738i46L088j371k639J295J972j133j070Q61J00m98Q78M8j632L68K185p77k460
1755a731J136K421j392k046J474J429j522o04J359k27j147J076P75j748m14K229
1771A068Mk354L72K214o76j767R20J071j070k11J140o90j097J545R77k245q15
1788a614K715N76k865l42K640J38k161J06J320k37l49L41p48l94J817L85k711
1805a383l63L373L08l667k60L599K45l121k17K268K42j136l06j07L62J412m24
1822H25k592M53L510m45m115L46M312k34m038K2L351K57k396n00J104P93K70j021
1840i8j620J251K828j369l704J332M259j216m370R77M039n85l339J35K285L71
$$ plain form
1721 2101 1386 -1563 -1024 985 651 -216 -185 -541 -218 1152 547 -1736 -820 2074 943 -2229 -946
1738 -946 2142 771 -1868 -573 1399 266 -804 57 157 -341 537 585 -1047 -679 1506 729 -1731
1755 -1731 -595 1826 434 -1612 -138 1291 -231 -835 524 297 -850 226 1001 -747 -1161 1068
1771 1068 1072 -1282 -910 1304 628 -1139 -219 852 -218 -429 711 21 -1076 469 1446 -799 -1614
1788 -1614 1101 1677 -1188 -1530 1110 1248 -913 -807 513 276 -73 268 -480 -874 943 1328 -1383
1805 -1383 -1746 1627 1935 -1732 -1992 1607 1852 -1269 -1486 782 1024 -112 -418 -525 -163 1249 825
1822 825 -1767 -1314 2196 1751 -2364 -2018 2294 2060 -1978 -1956 1395 1652 -744 -1244 -140 653 923 -98
1840 -98 -1718 -467 2361 992 -2712 -1380 2879 1663 -2707 -1730 2309 1724 -1615 -1480 805 1176
1856A176j017q81l76J370J619j733k737J991L528k073l954J967L977j709l502
1871b354J187K798n76j769j17O54P70N45j391j642J896K478k188l056K348L233
1887B816k235l123J963K604j471j908Q69R85j48n0n63q51J165J683j714k203K079
1904a02K441k227k347K148K045j887j488J451P30q24N9J98q06L81J485r40j979
1921a662J393K138j650k045J723J645j627j061J308L65r27M69M50j202M0J811
1937A168m96k190Q44K331j034k191J108J748r99j090P74L14m83O03N0j431K90
1954f84K137n86k692Q45K889q96k870R00K430o76j813M10Q95J8J13m52j108Q36
1972c04K040j145k740J330L205j336l369J214L139q77k633M33J806J39q26p39
$$ plain form
1856 1176 159 -722 -1098 272 1891 158 -2579 -588 2940 867 -3087 -1120 2857 1148 -2354
1871 -2354 -1167 1631 1055 -714 -831 -177 593 1138 -253 -1895 1 2479 291 -2765 -417 2816
1887 2816 581 -2542 -579 2025 554 -1354 -485 500 352 302 -261 -1112 53 1736 22 -2181 -102
1904 -102 2339 112 -2235 -87 1958 71 -1417 34 764 -60 -1 197 -609 -228 1257 317 -1662
1921 -1662 -269 1869 219 -1826 -103 1542 -85 -1146 162 527 -400 69 519 -683 -643 1168
1937 1168 672 -1518 -674 1657 623 -1568 -460 1288 289 -801 -27 287 -196 407 457 -974 -684
1954 -684 1453 867 -1825 -980 1909 1013 -1857 -957 1473 797 -1016 -606 289 307 420 -32 -1140 -304
1972 -304 1736 591 -2149 -819 2386 1050 -2319 -1105 2034 1157 -1476 -1043 763 902 76 -663
1988f63k68J298J368j795k258K029K980k141l350J993L408j605l169J099K565
2003A491l82j746m15Q23J133K82j859j244K335K149k668k749K697L059k455l116
2019b665J980K839j276k319M67J515M49o52j290l07K076J128k584j834K884K298
2035B709k838k523K554K451j997k150J264J622l34r75n52K30J366M77k074j058
2051a828K550J454k743j747K672J771k303j637J768J265j051q19K88K57N61L13
2067G71j284p98J857J174k207j361K262J421k143j232J718R67j204n12N02M6J75
2084A52M76q56q90J337J205j656j364J791J332j691j165J389Q14r01l43L42k00
2101b28K89P23q22j196J307J502j561j699J644J669j515j468J216J052o82o12
$$ plain form
1988 -663 -931 367 1735 -60 -2318 -289 2691 550 -2800 -807 2601 996 -2173 -1074 1491
2003 1491 1109 -637 -1052 -229 904 1186 -673 -1917 418 2567 -101 -2850 -153 2906 451 -2665
2019 -2665 -685 2154 878 -1441 -974 541 990 338 -952 -1259 817 1945 -639 -2473 411 2709
2035 2709 -129 -2652 -98 2353 356 -1794 -530 1092 758 -217 -769 -539 827 1304 -770 -1828
2051 -1828 722 2176 -567 -2314 358 2129 -174 -1811 -43 1222 171 -648 -360 -103 458 771
2067 771 -513 -1311 546 1720 -487 -1848 414 1835 -308 -1540 178 1145 -59 -571 -69 -23 152
2084 152 628 -228 -1118 219 1424 -232 -1596 195 1527 -164 -1329 60 874 -27 -370 -28 -228
2101 -228 61 784 -38 -1234 73 1575 14 -1685 -41 1628 113 -1355 -139 913 231 -381
2117c81J04L3N17N31j072j068J481J513j744j825J855J929j638j880J276J633
2133A264p68j188R4O24O19Qj260o31J798J199k164j620K244J946k197k019J815
2150b36J922j234j599M58J164L50o33j110M4J773N71k327j071K618J477k647j730
2167b210K394J859j907j754J236J492l89j162m83O76J339j60k054l44K505P95
2183A833k745j151K673J394k334j472J746J407j000j217J54R26O96n19j497J52
2199i54K085K76k493n86K627P95k448r37K032J016j486r28P62P25R0n49q40K99
2217e14J483m9j985j92K234L71k205n38K026N96j601n48R31N11k63l59l96J93
2235c05R97M0j559j45J827K61j862l87J738L96j380l83Q73K84k97j51l32L4Q57
$$ plain form
2117 -381 -277 -244 273 804 -268 -1336 145 1658 -86 -1911 -56 1873 235 -1645 -369 1264
2133 1264 496 -692 -598 26 645 653 -607 -1238 560 1759 -405 -2025 219 2165 -32 -2051 -236
2150 -236 1686 452 -1147 -689 475 825 192 -918 -874 899 1470 -857 -1928 690 2167 -480 -2210
2167 -2210 184 2043 136 -1618 -382 1110 721 -441 -924 -248 1091 931 -1123 -1467 1038 1833
2183 1833 -912 -2063 610 2004 -330 -1802 -56 1351 351 -866 -712 214 910 391 -1106 -954
2199 -954 1131 1407 -1086 -1672 955 1750 -698 -1635 397 1413 -73 -1001 -239 486 576 27 -813 -514
2217 -514 969 920 -1065 -1257 977 1348 -857 -1395 631 1227 -374 -922 9 520 257 -102 -498 -305
2235 -305 692 732 -827 -972 855 1116 -746 -1133 605 1001 -379 -762 111 395 98 -53 -385 -351 506
2254E06J91j341l18J612M54j730m69J560N26j253m70P94L57k51j98l68L4R26J47
2273G09j345l24J610N16j756o30J634O74j329o87Q60O44k79m94l42L04R60j05
2291F20j450j44J776M13j932n86J863P31j609p80J125Q14n31p48j22N97Q03m74
2309C66j327K04J747P5k044k88K084N03j906p09J521Q61j004q84L52Q48L61p97
2327c7r71O57J509m46j873J92K069P9k028l48J787N70j358p36P69Q40j54q72m91
2346h42P97J112o83j573N07J884l15j940K6J830K08j549m07J110N98n35p06p1
2364e49P84O22p39j118O55J450m95j658L10J644q6j491j31J172K91o91m88J76
2382c42O11L17o37p83O51J138n82j349M25J433k91j269Q4J043J09p02k85K60M02
$$ plain form
2254 506 697 -644 -962 650 1104 -626 -1095 465 991 -262 -732 62 419 168 -30 -398 -364 562 709
2273 709 -636 -960 650 1166 -590 -1220 414 1088 -241 -928 -68 576 297 -197 -539 -235 725 620
2291 620 -830 -974 802 1215 -717 -1303 560 1291 -318 -1098 27 841 310 -438 -560 37 840 366
2309 366 -961 -757 990 1065 -979 -1267 817 1320 -586 -1295 226 1087 83 -801 -449 399 760 -37
2327 -37 -1008 -351 1158 712 -1161 -969 1100 1179 -849 -1197 590 1160 -198 -934 -165 675 521 -351 -842
2346 -842 -45 1067 384 -1189 -682 1202 887 -1053 -1027 803 1011 -538 -945 165 763 228 -478 -549
2364 -549 235 857 118 -1000 -345 1105 610 -1048 -738 906 820 -671 -802 370 661 -30 -518 -342
2382 -342 269 586 -51 -834 -183 955 373 -976 -551 882 591 -678 -594 449 558 -144 -429 -169 233
2401B33K17m84o02M91R30m48j183L78J225k21j158L2J000J13o96k63L05L64J71
2420D04m80n47M96Q36l92j091K93J236j96j154N1R67J26p19k71L05M41P3n05m79
2440f06N46Q11n01j094M08J248l08j233J17J081J07q31l08N12M58o6n97l19O46
2459G1P03o19j055N93J238m50j277K27J211Lj031k38P43M38l71o31l6P57M35q14
2479a03p87P58J044o45j194M93J224k76j100pR23K47n87n17K30P25J63q69m68
2498g46Q59Q22q60r96O99J105n00j084K25R49N6p37l49M80N41j23p23k10Q42N06
2518G56q45p43P61R19o56r15L94Q91j39p58q4M72L93k56n87j9P14L12q32m75P86
2539H9O49o90p55N17Q00l62o53Q7M87J82k95m07P7N76J66o81l93P28N29o42o43
$$ plain form
2401 233 450 -34 -636 -145 785 337 -846 -468 757 536 -622 -590 410 523 -173 -436 -131 233 404
2420 404 -76 -623 -127 709 317 -774 -481 755 559 -595 -544 423 549 -170 -441 -136 305 378 -127 -606
2440 -606 -60 751 250 -844 -436 812 504 -729 -612 469 576 -255 -563 -51 407 341 -256 -575 71
2459 71 774 155 -900 -307 931 481 -796 -569 642 645 -386 -624 119 557 186 -445 -481 276 711 -103
2479 -103 -890 -132 912 267 -927 -434 790 514 -586 -593 330 577 -10 -527 -297 428 591 -278 -746
2498 -746 113 935 75 -921 -222 883 383 -701 -476 473 529 -208 -557 -77 464 341 -382 -592 250 756
2518 756 -89 -832 -71 848 192 -723 -329 562 423 -335 -419 53 446 190 -397 -416 298 610 -222 -697 89
2539 89 738 48 -707 -190 610 248 -405 -318 169 351 56 -351 -274 302 468 -213 -606 122 651 9 -634
2560f34N54O23l31n94J17M66R7l23k70P6M85R5o07k75O33M55n99n52M97O04l53
2581A64n54J60M63P9l38k95J64M52K2n60k50O95L96o66m93N37N58m12n84K67M80
2602B85ll91k40K62M16n7o05j27O89L03p19m26O26N97n09n93L01N28k4m97j75
2623c59L62M20k46n38LP16J39p58l07P44M14o35m97M55N45k30n34jM24K35l21
2644C1m39J94O16l1p75q5P72K60p03l94O04M56m06m96J83M75P3m28l18L20M86
2665C95j94o19Q3O97P2p07k00N97L17m53l95K67M32q0l97j58L67L73k74n04J51
2686b30O19n5o35r2O33J63n11k71L51L42j72l42n2L37K03k68l80J88M98r7n60
2707c31J5N41J06m70k08L82K58k16k73K1K87J65k84l18K40M39j53n01L0N46M6
$$ plain form
2560 -634 -80 543 212 -382 -265 201 298 -25 -295 -219 266 361 -246 -521 112 567 -32 -584 -87 517 164
2581 164 -390 -230 233 312 -26 -321 -157 295 317 -243 -493 202 598 -68 -561 -24 534 122 -462 -195 285
2602 285 282 -109 -349 -87 329 272 -333 -460 229 532 -187 -613 13 610 101 -492 -191 337 313 -184 -359
2623 -359 3 423 177 -361 -358 358 497 -261 -568 176 590 -45 -542 -87 458 228 -306 -307 117 352 31
2644 31 -408 -214 402 371 -404 -489 283 543 -160 -554 50 506 100 -396 -213 262 335 -93 -411 -91 395
2665 395 201 -418 -335 362 434 -273 -473 124 441 -12 -407 -140 292 212 -185 -343 24 397 123 -381 -230
2686 -230 389 334 -301 -393 240 403 -108 -379 -28 314 142 -200 -252 85 288 20 -360 -172 326 229 -331
2707 -331 -316 225 331 -139 -347 35 293 77 -196 -175 112 277 -7 -325 -85 354 201 -300 -270 276 322
2728C22n14j18L64K28k50k52N3K77J30k79l08K85L88k01m68R6N14jm80r9M17K01
2750C05k87k70J38L11L4l15j94K99L43k79m53J87N25j06m99l9M71J19l57k27K33
2771f1K84k9l55j43L93K68l66l89K75N17k28n22J30M81L5m54j18L10K28j31l45
2792b20nL81J65l87l09L45M23l19m75K26M80p1m81k4L78J62k65k52J04L56M1l82
2814a29j93L98K67l44l80L15M11k07m04N1M17J6l02j44J77K84r6l39o2L75K17
2835C28l91l23L94L32k77l53J36L79m2l12n7K32J52j02k63%L38J04l81k08L65
2856E1K54k92k72J82K97j17k80K3K03J32j61k06N5K94L3l38j23L27K51l53k40
2877b80K37K76j30k79M2K04R3j54j70P9K70j4l45p3L49J61l23k45K95K58k09k27
$$ plain form
2728 322 -192 -310 54 282 32 -220 -167 110 240 -39 -347 -62 326 125 -343 -247 267 266 -214 -313 104 305
2750 305 18 -252 -114 197 231 -84 -278 21 364 85 -368 -181 344 238 -261 -300 171 290 -67 -294 -61
2771 -61 223 194 -161 -304 89 357 -9 -398 -123 394 166 -356 -226 255 290 -164 -282 28 256 125 -220
2792 -220 -225 156 321 -66 -375 -30 393 74 -401 -175 305 234 -247 -271 107 269 4 -248 -144 212 253 -129
2814 -129 -322 76 343 -1 -381 -66 345 138 -266 -215 202 218 -84 -228 -51 233 137 -202 -264 111 328
2835 328 -63 -386 8 340 63 -290 -154 225 183 -129 -186 46 198 96 -167 -167 171 275 -106 -314 51
2856 51 305 13 -259 -77 220 103 -177 -154 49 181 20 -186 -131 163 196 -142 -265 62 313 -40 -280
2877 -280 -43 233 103 -176 -134 70 163 9 -161 -82 188 174 -171 -244 105 266 -57 -302 -7 251 42 -185
2899a85O6K04P1k06j41J10K64o8l03m1L61J17l38j80L29J93k28k50J26K56k5k14
2921h2p5J37K20q6l54N7L49P3l97j26L61J92l14k25K42K36r2k47l4K03K12k20
2943C0k61J04L52k8m04k9M29R5m17j18K83J92j89k01L4K53P3k49j80J71L03j56
2965H7l28N4M32qm07n5L57J03k57j93J88J99o4j81j05K16K20j96k71R6L54r3l96
2988b48M2L43Q1l00j26K14J34q0j82oK20Q8k02j92J45L11j52l41R8L63n7k82m1
3011a70K51R5j80j29K6J84O9j80j65K11K18j79k99J33L19q4l12M2K48L3j77q4
3033a30Q3J54J1j69j21J91J78j65k51J70K62j10k81N2K28L3j76p4R1J10J1j71
3055g4q6K05J67j92k42J74K66j22l03R8K78k2k54j9J54P9m1j44n1J97J64k41k15
$$ plain form
2899 -185 -119 85 156 -50 -191 -81 183 115 -188 -229 132 249 -89 -269 60 253 25 -225 -99 157 132 -82
2921 -82 -157 -20 200 114 -240 -183 166 239 -158 -284 77 269 -45 -270 -28 208 116 -131 -165 38 250 30
2943 30 -231 -127 225 197 -207 -236 193 288 -129 -247 36 228 39 -162 -128 125 198 -51 -231 -60 243 87
2965 87 -241 -187 245 237 -170 -225 132 235 -22 -215 -27 172 108 -73 -178 38 258 62 -209 -113 241 148 -248
2988 -248 -206 137 218 -82 -208 6 140 60 -122 -128 92 180 -22 -214 -69 242 90 -251 -153 210 153 -129 -170
3011 -170 81 176 -4 -133 -107 77 146 -34 -199 12 230 51 -248 -115 204 120 -192 -150 98 131 -46 -130
3033 -130 -47 107 118 -51 -172 19 197 32 -219 -49 213 103 -178 -126 102 135 -41 -115 -24 86 97 -74
3055 -74 -160 45 212 20 -222 -48 218 96 -207 -109 169 147 -107 -126 28 107 66 -78 -129 68 232 -9 -224
3078b24K33K31j52l05J07K95o5k69KJ89J10j47j47L4K30K7k70j05K53K46k74k69
$$ plain form
3078 -224 9 240 88 -217 -110 185 120 -149 -147 42 152 5 -142 -108 122 149 -121 -226 27 273 -1 -270
$$ [...]
8191A4
##END NTUPLES=NMR FID
##END=
