##TITLE=1H_LY-DMAA.Per.3.19
 CDCl3
 8 sc, 
 14.03.2022
##JCAMPDX= 6.0         $$ Bruker NMR JCAMP-DX V2.0
##DATA TYPE= NMR FID
##DATA CLASS= NTUPLES
##ORIGIN= UXNMR, Bruker Analytische Messtechnik GmbH
##OWNER= root
$$ XWIN-NMR		Version 3.5
$$ Mon Mar 14 12:23:55 2022 Russian Standard Time (UT+4h)  she@DPX200
##.OBSERVE FREQUENCY= 200.131346
##.OBSERVE NUCLEUS= ^1H
##.DELAY= (6, 6)
##.ACQUISITION MODE= SIMULTANEOUS
##.ACQUISITION SCHEME= undefined
##.AVERAGES= 8
##.DIGITISER RES= 18
##SPECTROMETER/DATA SYSTEM= spect
##.PULSE SEQUENCE= zg30
##.SOLVENT NAME= CDCl3
##.SHIFT REFERENCE= (INTERNAL, CDCl3, 0, 15.7039)
##AUDIT TRAIL= $$ (NUMBER, WHEN, WHO, WHERE, WHAT)
$$ ##TITLE= Audit trail, XWIN-NMR		Version 3.5
$$ ##JCAMPDX= 5.01
$$ ##ORIGIN= Bruker BioSpin GmbH
$$ ##OWNER= she
$$ F:/spectra/data/she/nmr/H-F/1/audita.txt
$$ ##AUDIT TRAIL=  $$ (NUMBER, WHEN, WHO, WHERE, WHAT)
(   1,<2022-03-14 12:21:50.95 +0400>,<she>,<DPX200>,
      <created by zg, POWCHK disabled, PULCHK disabled
       configuration hash MD5:
       00 E9 B6 7A A2 85 ED C7 34 08 36 98 17 FE 4E 26
       data hash MD5: 16K
       07 9D 67 4E BD 81 73 05 19 A5 F4 DC 7F 8C 4F 59>)
$$ ##END=
$$ 
$$ hash MD5
$$ AF BB 5F D0 90 62 AA 51 47 45 8A C7 F6 40 99 09
##$RELAX= 
##$RELAX= 
##$RELAX= 
##$RELAX= 
##$RELAX= 
##$RELAX= 
$$ Bruker specific parameters
$$ --------------------------
##$DU= <F:/spectra>
##$EXPNO= 1
##$NAME= <H-F>
##$PROCNO= 1
##$TYPE= <nmr>
##$USER= <she>
##$AMP= (0..31)
100 100 100 100 100 100 100 100 100 100 100 100 100 100 100 100 100 100 
100 100 100 100 100 100 100 100 100 100 100 100 100 100 
##$AQSEQ= 0
##$AQ_mod= 1
##$AUNM= <au_zg>
##$AUTOPOS= <>
##$BF1= 200.13
##$BF2= 200.13
##$BF3= 200.13
##$BF4= 200.13
##$BF5= 200.13
##$BF6= 200.13
##$BF7= 200.13
##$BF8= 200.13
##$BYTORDA= 1
##$CFDGTYP= 0
##$CFRGTYP= 5
##$CHEMSTR= <none>
##$CNST= (0..31)
1 1 145 1 1 1 1 1 1 1 1 1 1 1 1 1 1 1 1 1 1 1 1 1 1 1 1 1 1 1 1 1 
##$CPDPRG= <>
##$CPDPRG1= <>
##$CPDPRG2= <>
##$CPDPRG3= <>
##$CPDPRG4= <mlev>
##$CPDPRG5= <mlev>
##$CPDPRG6= <mlev>
##$CPDPRG7= <mlev>
##$CPDPRG8= <mlev>
##$CPDPRGB= <>
##$CPDPRGT= <>
##$D= (0..31)
0 1.2 0 0 0 0 0 0 0 0.06 0 0.03 0 0 0 0 0.0002 0 0 0 0 0 0 0 0 0 0 0 0 
0 0 0 
##$DATE= 1647246110
##$DBL= (0..7)
120 120 120 120 120 120 120 120 
##$DBP= (0..7)
150 150 150 150 150 150 150 150 
##$DBP07= 0
##$DBPNAM0= <>
##$DBPNAM1= <>
##$DBPNAM2= <>
##$DBPNAM3= <>
##$DBPNAM4= <>
##$DBPNAM5= <>
##$DBPNAM6= <>
##$DBPNAM7= <>
##$DBPOAL= (0..7)
0.5 0.5 0.5 0.5 0.5 0.5 0.5 0.5 
##$DBPOFFS= (0..7)
0 0 0 0 0 0 0 0 
##$DE= 6
##$DECBNUC= <off>
##$DECIM= 32
##$DECNUC= <off>
##$DECSTAT= 4
##$DIGMOD= 1
##$DIGTYP= 9
##$DL= (0..7)
0 120 120 120 120 120 120 120 
##$DP= (0..7)
150 150 150 150 150 150 150 150 
##$DP07= 0
##$DPNAME0= <>
##$DPNAME1= <>
##$DPNAME2= <>
##$DPNAME3= <>
##$DPNAME4= <>
##$DPNAME5= <>
##$DPNAME6= <>
##$DPNAME7= <>
##$DPOAL= (0..7)
0.5 0.5 0.5 0.5 0.5 0.5 0.5 0.5 
##$DPOFFS= (0..7)
0 0 0 0 0 0 0 0 
##$DQDMODE= 0
##$DR= 18
##$DS= 0
$$ [...]
##$SUBNAM2= <"">
##$SUBNAM3= <"">
##$SUBNAM4= <"">
##$SUBNAM5= <"">
##$SUBNAM6= <"">
##$SUBNAM7= <"">
##$SUBNAM8= <"">
##$SUBNAM9= <"">
##$SW= 18.0517287032376
##$SWIBOX= (0..15)
0 0 2 0 0 0 0 0 0 0 0 0 0 0 0 0 
##$SW_h= 3612.71676300578
##$TD= 16384
##$TD0= 1
##$TE= 0
##$TE2= 300
##$TE3= 300
##$TEG= 300
##$TL= (0..7)
0 120 120 120 120 120 120 120 
##$TP= (0..7)
150 150 150 150 150 150 150 150 
##$TP07= 0
##$TPNAME0= <>
##$TPNAME1= <>
##$TPNAME2= <>
##$TPNAME3= <>
##$TPNAME4= <>
##$TPNAME5= <>
##$TPNAME6= <>
##$TPNAME7= <>
##$TPOAL= (0..7)
0.5 0.5 0.5 0.5 0.5 0.5 0.5 0.5 
##$TPOFFS= (0..7)
0 0 0 0 0 0 0 0 
##$TUNHIN= 0
##$TUNHOUT= 0
##$TUNXOUT= 0
##$USERA1= <user>
##$USERA2= <user>
##$USERA3= <user>
##$USERA4= <user>
##$USERA5= <user>
##$V9= 5
##$VALIST= <valist>
##$VCLIST= <CCCCCCCCCCCCCCC>
##$VD= 0
##$VDLIST= <DDDDDDDDDDDDDDD>
##$VPLIST= <PPPPPPPPPPPPPPP>
##$VTLIST= <TTTTTTTTTTTTTTT>
##$WBST= 1024
##$WBSW= 4
##$XGAIN= (0..3)
0 0 0 0 
##$XL= 0
##$YL= 0
##$YMAX_a= 370330
##$YMIN_a= -324587
##$ZGOPTNS= <>
##$ZL1= 120
##$ZL2= 120
##$ZL3= 120
##$ZL4= 120
##$ABSF1= 10
##$ABSF2= 0
##$ABSG= 5
##$ABSL= 3
##$ALPHA= 0
##$AQORDER= 0
##$ASSFAC= 0
##$ASSFACI= 0
##$ASSFACX= 0
##$ASSWID= 0
##$AUNMP= <proc_1d>
##$AZFE= 0.1
##$AZFW= 0.1
##$BCFW= 1
##$BC_mod= 2
##$BYTORDP= 1
##$COROFFS= 0
##$CY= 11.3945322036743
##$DATMOD= 1
##$DC= 2
##$DFILT= <>
##$DTYPP= 0
##$F1P= 2.36226072786647
##$F2P= -0.459571619588291
##$FCOR= 0.5
##$FTSIZE= 0
##$FT_mod= 4
##$GAMMA= 1
##$GB= 0.15
##$INTBC= 1
##$INTSCL= 1
##$ISEN= 128
##$LB= 0.24
##$LEV0= 0
##$LPBIN= 0
##$MAXI= 10000
##$MC2= 0
##$MEAN= 0
##$ME_mod= 0
##$MI= 1.114404
##$NCOEF= 0
##$NC_proc= 0
##$NLEV= 6
##$NOISF1= 3.799351
##$NOISF2= 2.8
##$NSP= 1
##$NTH_PI= 0
##$NZP= 0
##$OFFSET= 15.70392
##$PC= 1
##$PHC0= -17116.73
##$PHC1= 24.00078
##$PH_mod= 1
##$PKNL= yes
##$PPARMOD= 0
##$PSCAL= 0
##$PSIGN= 0
##$REVERSE= no
##$SF= 200.130013532006
##$SI= 16384
##$SIGF1= 3
##$SIGF2= 2
##$SINO= 400
##$SIOLD= 16384
##$SREGLST= <1H.CDCl3>
##$SSB= 0
##$STSI= 0
##$STSR= 0
##$SW_p= 3612.71676300578
##$SYMM= 0
##$S_DEV= 0
##$TDeff= 0
##$TDoff= 0
##$TI= <>
##$TILT= no
##$TM1= 0
##$TM2= 0
##$TOPLEV= 0
##$USERP1= <user>
##$USERP2= <user>
##$USERP3= <user>
##$USERP4= <user>
##$USERP5= <user>
##$WDW= 1
##$XDIM= 8192
##$YMAX_p= 0
##$YMIN_p= 0
$$ End of Bruker specific parameters
$$ ---------------------------------
##NTUPLES= NMR FID
##VAR_NAME=  TIME,          FID/REAL,        FID/IMAG
##SYMBOL=    X,             R,               I
##VAR_TYPE=  INDEPENDENT,   DEPENDENT,       DEPENDENT
##VAR_FORM=  AFFN,          ASDF,            ASDF
##VAR_DIM=   8192,          8192,            8192
##UNITS=     SECONDS,       ARBITRARY UNITS, ARBITRARY UNITS
##FACTOR=    0.0002768,     1,               1
##FIRST=     0,             0,               0
##LAST=      2.2672688,     0,               0
##MIN=       0,             -324587,         0
##MAX=       2.2672688,     370330,          0
$$ Real data points
##PAGE= N=1
##DATA TABLE= (X++(R..R)), XYDATA
0 0 0 0 0 0 0 0 0 0 0 0 8 -8 8 -8 16 -16 16 -24 32 -32 41 -49 57 -70 81 -97 112 -129 147 -169 193 -221 251
33 251 -283 321 -361 406 -455 509 -568 632 -701 779 -863 952 -1052 1163 -1282 1410 -1554
50 -1554 1714 -1887 2081 -2296 2537 -2809 3119 -3475 3889 -4378 4966 -5686 6594 -7784 9410
65 9410 -11776 15553 -22547 39751 -171228 -98236 370330 89166 -274180 -143192 200648
76 200648 135875 -76339 -132576 -28419 89088 143310 -43987 -222993 -21491 286075 77494
87 77494 -305685 -132383 300094 165699 -256017 -182214 194022 171015 -112773 -141349 29076
98 29076 88907 51789 -27637 -119106 -42108 167785 104770 -194125 -157734 198588 190886 -182142
110 -182142 -202367 150407 189499 -107199 -154141 61362 102137 -15742 -38432 -22298 -27370
121 -27370 51886 89139 -69836 -138441 77954 170254 -78394 -182668 72573 173952 -64915
132 -64915 -148047 55938 107068 -49536 -59230 44050 8832 -40334 37741 36668 -75702 -31437
144 -31437 102636 23782 -115683 -10700 117527 -5897 -107683 27074 90708 -49835
154 -49835 -68453 72566 44979 -91683 -23001 103038 3144 -105684 12118 96297 -24639
165 -24639 -76356 33453 45243 -41608 -7268 49134 -33897 -56825 73839 65219 -106785 -72439
177 -72439 129562 78445 -137022 -79348 129900 75172 -107175 -62914 72516 42937 -29295
188 -29295 -15146 -16767 -19222 59438 55920 -94902 -92747 117252 123495 -125826 -145635 118129
200 118129 153823 -96903 -146539 64725 123297 -25683 -84531 -14040 34652 50603 23306
211 23306 -77321 -81326 92960 134722 -94312 -175719 82896 199857 -60458 -203264 30394
222 30394 183975 1376 -144927 -31707 88459 54342 -22104 -67577 -48253 68219 113238
233 113238 -57575 -166205 37316 201389 -10438 -214176 -17532 204334 43532 -171833
243 -171833 -61699 122629 70552 -60832 -67505 -5246 53292 68645 -29570 -122607 -682
254 -682 160782 32288 -181194 -62098 180952 84242 -162343 -96562 127325 95860 -81475
265 -81475 -82245 30118 57176 21052 -22980 -65663 -15072 100460 53475 -121015 -85529 128036
277 128036 108631 -120955 -118627 102852 114460 -76830 -96633 46620 66755 -16829 -29872
288 -29872 -10526 -10850 31768 49173 -46786 -81536 54542 103493 -56520 -113290 53988 110657
300 110657 -48064 -95652 41649 71753 -34616 -40926 29249 8599 -24069 22965 20088 -49565
312 -49565 -15846 68889 10262 -79888 -3324 81413 -6608 -76017 17921 63477 -31460 -47721
324 -47721 44667 29795 -56592 -12757 64822 -2324 -67314 14795 63549 -23287 -51671 29636
336 29636 33558 -33169 -9301 36195 -17214 -38358 44030 40758 -67470 -43126 84277 44546
348 44546 -92680 -44850 90263 41477 -78380 -34953 56652 23333 -28768 -7389 -2718 -12478
360 -12478 33714 34949 -60212 -57263 79700 77903 -88767 -92789 87602 100492 -75312 -97886
372 -97886 54847 84734 -28345 -61377 -711 28905 27939 8899 -50361 -49249 64304 86138
384 86138 -69456 -116530 64186 135347 -50804 -140332 31247 130107 -8684 -105052 -12882
395 -12882 68245 31261 -22305 -42586 -26180 46602 73089 -42053 -111953 30764 139149
406 139149 -14279 -151489 -4825 147150 22619 -127725 -37272 94192 45018 -51943
416 -51943 -45805 4333 38161 42289 -23717 -83208 4140 114215 18032 -131572 -38918 135049
428 135049 56454 -123362 -66575 99794 68475 -66711 -60562 28966 44003 9374 -20670
439 -20670 -44019 -6999 70986 34448 -88848 -59164 95323 76439 -92258 -85323 79703
450 79703 83458 -61014 -71539 38949 51054 -15948 -24026 -4530 -5164 21955 34454 -33768
462 -33768 -58877 40891 76772 -42984 -85466 41444 84765 -37377 -75151 31599 57484
473 57484 -26217 -35191 20882 9870 -17077 14206 13557 -35819 -10772 51860 7461 -61482 -2879
486 -2879 64308 -3101 -60422 11171 51799 -20065 -38923 30073 24975 -38787 -10683 45606
498 45606 -1933 -48777 12329 47085 -20363 -40342 25318 27898 -28906 -11674 30485 -7762
510 -7762 -31788 27321 32264 -45337 -32664 59278 32685 -66939 -31498 67657 28904 -60412
522 -60412 -23448 46783 15746 -26985 -4546 4397 -9058 18862 24663 -39868 -40747 55722 55040
535 55040 -65121 -66622 65962 72213 -59432 -71521 45435 62687 -26981 -46630 5842 23879
547 23879 14815 3595 -32140 -32539 44580 60395 -49909 -82790 48747 98036 -40699 -102867
559 -102867 27942 96923 -12452 -80275 -3668 54114 17340 -21737 -27609 -14308 31946 49034
571 49034 -31104 -79530 24399 101461 -13897 -112941 716 112349 12758 -99521 -23852
582 -23852 76497 31539 -45050 -33378 9817 29904 26391 -20380 -58588 6835 83836 9164
594 9164 -99367 -25168 103666 38388 -97117 -47272 79978 49393 -55974 -44961 27145
605 27145 33545 2298 -17048 -29490 -2812 51598 23593 -66289 -41874 73338 56092 -71899
617 -71899 -63191 63960 63294 -49976 -55215 33125 40637 -15119 -21109 -1938 -1209 16000 23225
630 23225 -26754 -43085 32684 57341 -35156 -65602 33749 66075 -30226 -59562 25363 46662
642 46662 -19932 -29082 15449 9662 -11432 10161 8931 -27315 -6622 40932 4746 -48986 -2079
655 -2079 51574 -1726 -49053 6732 41834 -13366 -31965 20230 19934 -27427 -8368 32831 -2540
668 -2540 -36109 11261 35905 -17738 -31732 22087 23845 -24005 -12096 25073 -1600 -24661
680 -24661 16831 24392 -30660 -23477 42286 22672 -49566 -21389 51425 19035 -47912 -15784
692 -15784 38349 10174 -24789 -3047 7720 -6428 9740 17121 -26231 -28434 39494 38987 -47751
705 -47751 -47230 50435 52180 -46631 -51691 37931 46385 -24590 -34938 9568 18970 5999 643
718 643 -19650 -21913 29587 42110 -35272 -59616 35366 71257 -31119 -76230 22528 72744
730 72744 -11912 -61539 314 43148 10366 -19399 -18212 -6891 22635 33504 -22391 -56659
742 -56659 18604 74505 -10981 -84200 1627 85097 8312 -76754 -16828 60068 22265 -37367
754 -37367 -24152 10597 21107 16227 -14368 -41006 3920 60417 8037 -72703 -19894 76855
766 76855 29997 -72550 -36178 61057 38061 -43432 -34114 22869 25661 -893 -12939 -19316
778 -19316 -2049 36128 17710 -47982 -32012 53622 42672 -53743 -48980 48084 49177 -38531
790 -38531 -43903 25916 32956 -12518 -18070 -374 996 11551 16545 -19570 -32019 24724 44192
803 44192 -26187 -50793 25419 52196 -22409 -47541 18522 37922 -14538 -24614 10973 9044
815 9044 -8514 6280 6496 -20487 -5579 31074 4274 -38269 -3031 40633 611 -39096 2888
828 2888 33928 -7363 -25964 12835 16841 -18063 -7055 23010 -1551 -26012 9186 27042
840 27042 -14668 -24904 18266 19863 -20037 -12076 20241 1917 -19876 8909 18527 -20027 -17487
853 -17487 29149 16069 -35908 -14680 38677 12805 -37227 -10109 31690 6582 -22139 -1367
865 -1367 10333 -4785 2957 12294 -15377 -20053 26031 27597 -33304 -33631 36462 37144 -35413 -37671
879 -37671 29849 33838 -21307 -26500 10403 15100 855 -1350 -11409 -14021 19716 29100 -24742
892 -24742 -42056 26319 51683 -23915 -56014 18750 54850 -11132 -47372 2847 34591 5221
904 5221 -17457 -11575 -2093 15265 21833 -16137 -39981 13472 53748 -8662 -62090 1890 63571
917 63571 5205 -58268 -11325 46734 15570 -30149 -16774 10950 15114 9440 -10021 -27874
929 -27874 2913 43165 5892 -52860 -14523 56811 21934 -54615 -26932 46530 28287 -34299
941 -34299 -26077 18787 19708 -2789 -10783 -12955 -715 25838 12604 -35296 -23697 40286 32450
954 32450 -40524 -37502 36905 38496 -29499 -34494 20374 26681 -10049 -15089 377 1948 7871
967 7871 11664 -14109 -24149 17568 33507 -18922 -39348 17861 40349 -15903 -37185 12805
979 12805 29774 -9957 -19543 7491 7714 -5640 4334 4721 -15168 -3933 23997 3728 -29459
992 -29459 -2850 31833 1551 -30609 848 26706 -4073 -20650 7902 13183 -12196 -5598
1004 -5598 15957 -1703 -19108 7565 20314 -12180 -19700 14929 16682 -16212 -11409 16261 4325
1017 4325 -15241 3983 14137 -12166 -12507 19818 11231 -25298 -9742 28414 8263 -28314 -6419
1030 -6419 24907 3785 -18724 -557 10168 -3753 -703 8476 -9034 -13898 17338 18905 -23681
1043 -23681 -23163 26987 25948 -27024 -26453 24139 24446 -18163 -19413 10702 12160 -2002 -2437 -6040
1057 -6040 -8164 13159 19072 -17881 -28839 19939 36106 -19399 -40201 16048 39855 -11082
1069 -11082 -35553 4777 26810 1205 -15053 -6553 1174 10072 13347 -11573 -26521 10901 37389
1082 37389 -7919 -43923 3991 46024 1029 -42976 -5474 35422 8991 -24026 -10710 10215
1094 10215 10226 4406 -7815 -18538 3332 30024 2092 -38379 -8245 42188 13508 -41561 -17571
1107 -17571 36519 19383 -27764 -18438 16725 14952 -4343 -8892 -7528 1381 18125 7203 -25740
1120 -25740 -15228 30300 22010 -31268 -26296 28726 27329 -23672 -25309 16387 19790 -8694 -12094
1133 -12094 822 2449 5776 7446 -10833 -16588 13989 24037 -15110 -28378 14782 29796 -12910
1146 -12910 -27587 10632 22656 -7874 -15163 5523 6330 -3727 2687 2356 -11216 -1823 17963
1159 17963 1322 -22646 -1225 24481 488 -24007 546 20769 -2448 -15984 4765 10007
1171 10007 -7456 -3513 10379 -2274 -12516 7442 14096 -10846 -14028 13142 12512 -13658 -9172
1184 -9172 13079 4364 -11622 1345 9622 -7652 -7813 13309 5742 -18092 -4402 20849 3015
1197 3015 -21491 -1934 19615 600 -15444 930 9555 -2777 -2255 5388 -5000 -8150 12025
1210 12025 11363 -17364 -13964 20864 16149 -21669 -17040 20073 16284 -16219 -13888 10483 9305
1223 9305 -3976 -3539 -2952 -3689 8751 10985 -13367 -18082 15860 23813 -16151 -27207 14375 27969
1237 27969 -10725 -25403 6241 20139 -1172 -12116 -3188 2631 6706 7698 -8730 -17391 8953
1250 8953 25480 -7674 -31067 4898 33184 -1640 -31907 -2050 26900 4890 -19228 -6943
1262 -6943 9415 7467 1224 -6357 -11633 3964 20773 -200 -27313 -3960 30924 8046 -30947
1275 -30947 -11268 27788 13112 -21748 -13094 13591 11069 -4607 -7322 -4650 1967 12505 3848
1288 3848 -18762 -9902 22311 14830 -23375 -18253 21811 19419 -18088 -18107 12990 14710 -6882 -9125
1302 -9125 1146 2514 4212 4755 -8164 -11435 10782 16943 -11773 -20580 11385 21708 -10200
1315 -10200 -20678 7969 17099 -5879 -11981 3673 5348 -2065 1378 898 -7834 -297 13171 226
1329 226 -16818 -184 18616 336 -18005 265 15911 -961 -12058 2547 7455 -4309
1341 -4309 -2434 6341 -2296 -8364 6097 9647 -8986 -10191 10465 9346 -10884 -7498 10085 4283
1355 4283 -8803 -272 6958 -4166 -5089 8597 3449 -12217 -2002 14886 1154 -15731 -280
1368 -280 14984 -300 -12452 987 8442 -1923 -3332 3070 -2186 -4803 7402 6535 -11979 -8422
1382 -8422 14942 9884 -16246 -10926 15567 10775 -13101 -9475 9278 6989 -4311 -3162 -692
1395 -692 -1360 5501 6494 -9231 -11356 11595 15596 -12365 -18440 11555 19333 -9397 -18369 5941
1409 5941 14950 -2374 -9996 -1479 3369 4339 3671 -6513 -10777 7363 16912 -6850 -21310 5354
1423 5354 23565 -2834 -23135 304 20479 2447 -15206 -4292 8468 5443 -732 -5360 -6939
1436 -6939 4071 13913 -1901 -19329 -1096 22206 4038 -22977 -6791 20855 8433 -16876
1448 -16876 -9034 10988 8082 -4280 -5810 -2476 2468 8761 1739 -13387 -5868 16588 9684 -17522
1462 -17522 -12277 16687 13635 -14046 -13196 10200 10998 -5692 -7530 997 2833 3146 2212 -6598 -7255
1477 -7255 8721 11369 -9753 -14389 9456 15648 -8288 -15054 6533 12898 -4319 -9100 2413
1490 2413 4502 -754 747 -335 -5545 975 9750 -987 -12676 757 14034 -472 -13789
1503 -13789 269 11987 -640 -9137 1141 5426 -2323 -1519 3627 -2146 -5003 5369 6189 -7474
1517 -7474 -6683 8709 6700 -8697 -5557 7989 3805 -6448 -1044 4622 -1999 -2756 5166 974
1531 974 -8048 268 10143 -1226 -11372 1534 11060 -1759 -9795 1621 7079 -1589 -3468 1884
1545 1884 -564 -2234 4668 3127 -8187 -4015 11012 5196 -12236 -5992 12293 6395 -10715 -6031
1559 -6031 8045 4860 -4467 -2961 426 157 3328 2978 -6773 -6378 8963 9335 -10083 -11652 9762
1574 9762 12786 -8321 -12576 5962 10973 -2907 -7815 -88 3800 3017 1134 -5031 -6043 6429
1588 6429 10566 -6547 -14030 5707 16106 -4115 -16529 1915 14884 227 -11787 -2310 7068
1601 7068 3552 -1776 -4218 -3915 3770 8994 -2606 -13085 777 15707 1422 -16431 -3353
1614 -3353 15533 5076 -12741 -5830 8769 5818 -3914 -4639 -1061 2689 5706 -104 -9584 -2764
1628 -2764 12017 5396 -13223 -7658 12674 8824 -11001 -9016 8173 7954 -4677 -5823 1074 2976
1642 2976 2448 721 -5044 -4158 7018 7450 -7779 -9719 7712 11024 -6692 -10865 5160 9463
1656 9463 -3399 -7009 1505 3623 -138 -27 -1020 -3780 1389 6840 -1515 -9187 1171 10296 -747
1671 -747 -10145 406 8996 -185 -6760 445 4065 -864 -967 1744 -1861 -2669 4310 3573 -6055 -4334
1687 -4334 6921 4430 -7014 -4150 6221 3111 -5022 -1593 3265 -553 -1661 2762 72 -4951
1701 -4951 1170 6731 -1870 -7839 2247 8180 -1976 -7443 1794 5885 -1322 -3482 1074 602 -1005
1716 -1005 2458 1182 -5331 -1752 7544 2365 -8981 -3174 9142 3575 -8421 -3864 6572 3464
1730 3464 -4069 -2599 1104 1033 1915 943 -4590 -3041 6711 5398 -7768 -7068 8020 8348 -7197 -8607
1746 -8607 5500 7875 -3232 -6250 682 3636 1653 -495 -3736 -3016 4981 6278 -5491 -9172
1760 -9172 5079 10888 -4037 -11550 2452 10868 -565 -8791 -1074 5833 2619 -2060 -3305 -1870
1774 -1870 3410 5708 -2801 -8836 1652 10983 -222 -11920 -1453 11411 2815 -9736 -3880
1787 -3880 6876 4126 -3536 -3805 -275 2661 3777 -1055 -6672 -894 8854 2988 -9833 -4582 9812
1802 9812 5943 -8492 -6300 6402 5927 -3743 -4683 903 2652 1776 -314 -4026 -2417 5378 4710
1817 4710 -6156 -6703 5975 7656 -5236 -7827 3871 7059 -2347 -5305 897 2988 476 -210
1831 -210 -1244 -2464 1789 4896 -1712 -6604 1474 7587 -879 -7599 385 6753 14 -5187 -154
1846 -154 3137 -100 -819 433 -1599 -1204 3402 1933 -4812 -2612 5593 3090 -5503 -3064 5080 2670
1862 2670 -3830 -1697 2467 491 -867 1205 -434 -2891 1542 4294 -2190 -5340 2363 5798 -2222
1877 -2222 -5665 1652 4617 -1108 -3136 517 952 -236 1258 59 -3423 -228 5265 692 -6449
1892 -6449 -1175 6997 1791 -6549 -2221 5507 2306 -3678 -2038 1554 1274 808 -297 -3053 -1221
1907 -1221 4655 2557 -5906 -4106 6235 5049 -5878 -5733 4685 5510 -3043 -4704 1109 3205 933
1922 933 -1066 -2554 -1205 3887 3645 -4451 -5634 4425 7178 -3737 -7881 2606 7714 -1184 -6699
1937 -6699 -320 4674 1503 -2252 -2583 -678 2847 3356 -2795 -5845 2073 7584 -1137 -8489 -88
1952 -88 8492 1356 -7395 -2229 5689 2916 -3144 -2889 505 2543 2295 -1450 -4577 163 6364 1247
1968 1247 -7289 -2650 7252 3695 -6556 -4329 4990 4192 -3036 -3620 844 2324 1273 -750 -3133
1983 -3133 -1108 4317 2947 -4914 -4297 4858 5306 -4236 -5535 3222 5183 -1987 -4080 664 2468
1998 2468 484 -553 -1371 -1510 1822 3266 -2003 -4733 1706 5515 -1331 -5789 609 5216 -104
2013 -104 -4146 -200 2625 503 -732 -250 -1071 -27 2767 691 -3835 -1277 4575 1783 -4575 -2085
2029 -2085 4011 1973 -3160 -1641 1747 820 -521 204 -841 -1515 1674 2589 -2374 -3533 2569 4120
2045 4120 -2337 -4143 1880 3761 -1183 -2702 532 1386 205 338 -481 -1875 673 3438 -492 -4588
2061 -4588 115 5084 347 -5187 -972 4459 1245 -3423 -1528 1715 1343 6 -861 -1807 5 3391
2077 3391 962 -4456 -1896 4970 2882 -4784 -3484 4084 3754 -2863 -3424 1350 2673 244 -1409
2092 -1409 -1782 -158 2981 1734 -3751 -3354 3846 4520 -3593 -5356 2712 5446 -1655 -4952 332 3818
2108 3818 814 -2251 -1724 319 2371 1736 -2506 -3562 2328 5083 -1640 -5917 738 6054 187
2123 187 -5572 -1177 4357 1857 -2788 -2261 646 2018 1288 -1632 -3191 803 4486 203 -5408 -1280
2139 -1280 5489 2200 -4928 -2709 3995 2958 -2454 -2749 855 2048 834 -908 -2237 -369 3268
2154 3268 1588 -3880 -2736 3815 3477 -3517 -3944 2639 3734 -1664 -3219 476 2168 466 -786
2169 -786 -1309 -704 1794 2150 -1848 -3245 1785 4028 -1286 -4181 830 3926 -153 -3199 -323 2046
2185 2046 610 -701 -654 -789 384 1993 -121 -3049 -477 3523 920 -3710 -1336 3198 1462 -2559
2201 -2559 -1345 1505 935 -316 -221 -653 -457 1603 1407 -2094 -2172 2421 2771 -2255 -2964 1847 2822 -1239
2219 -1239 -2294 512 1400 166 -354 -714 -917 950 2069 -1052 -3015 764 3669 -384 -3848 -45
2235 -45 3595 599 -2794 -922 1702 1099 -360 -965 -1000 633 2291 10 -3213 -777 3705 1408
2251 1408 -3860 -2059 3369 2346 -2601 -2452 1422 2108 -186 -1451 -1044 555 2114 620 -2775 -1653
2267 -1653 3153 2713 -2989 -3356 2597 3730 -1717 -3573 768 3017 266 -1993 -1236 678 1853 735
2283 735 -2193 -2145 2102 3282 -1813 -4124 1122 4370 -390 -4178 -382 3425 1144 -2258 -1520 888
2299 888 1726 682 -1550 -2007 1085 3206 -382 -3882 -430 4093 1098 -3866 -1731 3143 2053 -2120
2315 -2120 -2049 793 1726 423 -1120 -1663 259 2508 601 -3077 -1504 3185 2258 -2898 -2654 2268
2331 2268 2743 -1388 -2403 579 1786 385 -889 -1132 -223 1689 1318 -1826 -2201 1644 2915 -1339
2347 -1339 -3177 790 3047 -268 -2544 -328 1699 623 -669 -783 -448 729 1473 -455 -2254 127
2363 127 2805 356 -2884 -739 2655 1081 -2167 -1161 1246 1031 -414 -672 -556 102 1315 444
2379 444 -1968 -1160 2118 1583 -2123 -2035 1737 2103 -1196 -1860 590 1405 125 -604 -633 -229 1073 1230
2397 1230 -1212 -1986 1155 2607 -823 -2852 394 2727 89 -2335 -602 1580 813 -660 -1042 -454
2413 -454 852 1397 -563 -2256 103 2808 436 -2916 -959 2833 1443 -2260 -1617 1491 1688 -429
2429 -429 -1329 -502 802 1426 -109 -2106 -617 2494 1391 -2525 -2114 2249 2455 -1775 -2605 911 2243
2446 2243 -104 -1720 -741 865 1404 114 -1751 -1171 1822 2106 -1640 -2709 1240 3142 -581 -3045
2462 -3045 -16 2663 669 -1856 -1113 937 1367 118 -1423 -1251 1081 2082 -762 -2719 133 2995
2478 2995 411 -2958 -953 2494 1323 -1759 -1466 817 1385 168 -1064 -1083 565 1856 102 -2327
2494 -2327 -705 2455 1315 -2356 -1802 1828 1928 -1263 -1878 401 1497 310 -860 -956 90 1364
2510 1364 598 -1602 -1390 1556 1943 -1229 -2180 833 2223 -256 -1970 -171 1431 585 -667 -791
2526 -791 -178 869 906 -786 -1641 456 2046 -137 -2293 -276 2103 631 -1805 -883 1135 886 -389
2543 -389 -742 -347 509 1053 2 -1492 -464 1788 964 -1794 -1230 1577 1547 -1112 -1495 494 1241 35
2561 35 -788 -566 136 965 411 -1216 -1207 1151 1659 -984 -2013 620 2083 -218 -1879 -275 1451 689
2579 689 -736 -831 26 932 824 -775 -1393 576 1984 -96 -2198 -304 2234 695 -1925 -1022 1284
2596 1284 1175 -694 -1198 -169 927 846 -498 -1487 -80 1875 601 -1959 -1161 1847 1607 -1478 -1710
2613 -1710 837 1745 -198 -1420 -482 934 979 -233 -1400 -485 1574 1169 -1473 -1789 1154 2048 -736
2630 -736 -2219 217 2012 287 -1570 -741 897 1090 -97 -1142 -674 1098 1416 -762 -1858 478
2646 478 2198 89 -2133 -499 1890 878 -1350 -1101 748 1125 -21 -1018 -734 681 1269 -233
2662 -233 -1719 -370 1811 809 -1779 -1235 1410 1434 -895 -1379 346 1262 275 -831 -694 269 1135
2679 1135 396 -1236 -892 1284 1329 -1030 -1619 726 1617 -342 -1556 -190 1076 444 -676 -727 -12
2696 -12 833 590 -734 -1124 542 1459 -237 -1683 -58 1699 435 -1396 -675 974 845 -344 -803
2713 -803 -179 637 749 -346 -1184 -115 1382 420 -1461 -866 1253 1043 -928 -1145 441 1067 -5
2730 -5 -860 -438 426 866 113 -1030 -546 1104 1054 -909 -1349 763 1540 -307 -1495 -35 1186 414
2748 414 -835 -673 231 773 257 -816 -921 612 1285 -407 -1654 11 1617 364 -1445 -666 1164
2765 1164 939 -539 -987 82 900 527 -580 -1004 254 1421 180 -1494 -593 1473 964 -1227 -1222
2782 -1222 771 1250 -340 -1144 -236 825 629 -424 -1017 -82 1186 569 -1228 -1009 1062 1409 -667
2799 -667 -1492 419 1502 201 -1142 -444 861 793 -312 -916 -306 934 849 -777 -1230 472 1468 -136
2817 -136 -1598 -308 1370 566 -1108 -872 635 960 -63 -857 -426 651 983 -300 -1258 -50 1441
2834 1441 501 -1339 -784 1154 1033 -768 -1074 344 983 174 -754 -571 342 865 34 -1104 -492 1036
2852 1036 828 -938 -1158 608 1281 -276 -1199 -51 1002 415 -621 -658 194 814 348 -808 -731 630
2870 630 1122 -376 -1264 50 1259 278 -1141 -529 794 687 -421 -780 -88 693 543 -472 -879 149
2888 149 1125 173 -1176 -505 1066 792 -781 -850 527 950 -79 -738 -313 552 652 -185 -889 -229 922
2907 922 580 -928 -945 644 1048 -453 -1101 11 1015 300 -744 -540 435 813 67 -764 -466 725
2925 725 912 -496 -1123 177 1299 103 -1150 -393 928 694 -598 -749 110 756 276 -667 -706 397
2943 397 951 -142 -1133 -292 1143 614 -1027 -839 753 981 -368 -862 -46 840 471 -469 -712 145
2961 145 950 248 -930 -610 917 906 -667 -1102 336 1064 8 -979 -341 648 622 -327 -807 -156 803
2980 803 556 -745 -853 484 1112 -189 -1165 -104 1107 396 -868 -628 531 747 -123 -755 -233 649
2998 649 615 -396 -925 141 1030 209 -1094 -480 927 697 -649 -830 287 782 62 -650 -437 474
3016 474 664 -83 -777 -219 928 531 -725 -751 590 932 -327 -932 -41 763 269 -531 -531 173 651 73
3036 73 -692 -449 537 768 -369 -985 137 1014 139 -868 -371 690 597 -367 -614 57 631 383 -446
3055 -446 -623 294 849 -20 -912 -294 864 486 -721 -704 353 711 -104 -696 -240 590 478 -328 -729
3074 -729 -66 788 249 -744 -556 636 795 -357 -844 127 805 170 -638 -397 429 648 -30 -707 -267
3093 -267 676 589 -526 -790 261 868 -45 -932 -227 763 410 -591 -588 296 681 120 -588 -421 504 664
3113 664 -161 -776 -29 877 281 -764 -493 596 621 -344 -734 12 589 228 -537 -575 198 715 33 -829
3133 -829 -336 758 573 -561 -763 368 825 -50 -748 -210 664 461 -357 -599 68 653 266 -621 -592
3152 -592 463 679 -285 -866 -48 760 186 -760 -510 446 548 -173 -666 -123 553 398 -424 -624 216 818
3172 818 6 -736 -281 747 532 -464 -573 256 670 73 -585 -277 439 537 -209 -665 -139 686 302 -648
3192 -648 -576 457 610 -238 -718 -10 649 292 -475 -458 287 605 17 -610 -227 546 542 -385 -657 228 704
3213 704 61 -740 -249 583 436 -287 -596 44 549 158 -525 -480 311 558 -135 -722 -128 658 318 -567
3233 -567 -531 392 581 -146 -523 -133 541 352 -374 -537 85 596 92 -629 -419 480 558 -380 -699 118 609
3254 609 50 -571 -314 389 466 -194 -591 -57 623 357 -504 -472 374 684 -119 -647 -32 608 313 -385 -453
3275 -453 267 551 -26 -578 -288 389 473 -304 -574 54 653 117 -664 -338 471 478 -354 -563 57 530 137
3296 137 -496 -410 320 586 -63 -621 -140 595 418 -425 -487 349 616 -82 -617 -143 556 290 -363 -511 137
3317 137 516 116 -535 -346 365 426 -321 -629 122 646 180 -544 -270 387 462 -166 -523 -27 526 234 -376
3338 -376 -417 249 551 -68 -594 -168 530 375 -422 -493 176 534 -38 -509 -141 377 437 -198 -488 37 588
3359 588 228 -512 -362 416 600 -225 -600 57 525 188 -492 -364 295 466 -111 -514 -151 469 354 -373
3379 -373 -481 173 549 -15 -554 -200 470 299 -353 -430 141 481 108 -434 -261 374 507 -193 -505 25
3399 25 567 176 -503 -363 322 426 -184 -538 -71 435 233 -418 -437 169 514 -12 -533 -201 476 414 -329
3420 -329 -471 221 520 -2 -468 -163 445 421 -248 -454 42 487 141 -387 -380 312 496 -225 -576 -76 485
3441 485 219 -430 -377 287 424 -141 -505 -140 374 271 -349 -404 166 564 -4 -491 -159 428 365 -294 -445
3462 -445 152 474 98 -465 -267 319 387 -176 -471 -40 509 179 -460 -395 283 406 -177 -424 -59 436 242
3483 242 -293 -312 196 447 -28 -404 -199 427 335 -239 -484 88 472 49 -499 -197 343 373 -224 -403 -25
3504 -25 360 135 -419 -349 241 455 -127 -470 -22 422 238 -324 -295 241 450 -47 -447 -80 342 348 -263 -447
3526 -447 128 447 -20 -497 -240 331 284 -284 -437 61 443 15 -349 -230 244 371 -130 -387 -25 384
3546 384 220 -308 -335 276 457 -68 -415 -40 449 295 -304 -346 122 426 -3 -420 -209 328 312 -237 -499
3567 -499 96 447 56 -434 -213 252 395 -177 -447 13 451 176 -332 -258 242 410 -1 -397 -68 431
3587 431 272 -248 -329 205 418 -28 -415 -143 387 284 -266 -377 112 359 92 -403 -244 332 297 -165 -413
3608 -413 111 440 197 -301 -255 253 294 -93 -403 -41 450 159 -343 -340 200 406 -45 -462 -87 389 224
3629 224 -298 -299 126 376 43 -355 -126 314 287 -219 -342 94 411 96 -316 -245 263 342 -148 -357 21 348
3651 348 115 -288 -250 165 330 -87 -382 -92 278 192 -307 -331 108 341 -2 -383 -149 307 271 -216 -311 52
3673 52 364 90 -334 -179 264 376 -116 -359 12 374 187 -337 -263 148 345 -89 -356 -96 332 157 -314
3694 -314 -323 138 335 -70 -347 -160 330 263 -243 -333 80 365 70 -331 -177 288 288 -95 -349 47 352 66
3716 66 -282 -216 254 296 -115 -388 -19 341 189 -291 -295 105 374 -48 -336 -77 343 256 -258 -310 74 447
3738 447 30 -309 -176 319 319 -151 -332 -14 307 104 -390 -204 246 357 -95 -338 -56 299 84 -350 -249
3759 -249 222 356 -65 -321 -18 323 212 -266 -291 122 383 72 -345 -168 275 194 -199 -331 80 376 68
3780 68 -356 -211 204 255 -169 -335 -6 260 135 -272 -248 206 329 -83 -314 -31 297 131 -230 -212 157
3801 157 301 -23 -314 -85 313 184 -196 -307 54 376 38 -343 -162 241 225 -124 -324 -12 233 109
3821 109 -286 -232 192 275 -115 -299 -38 281 151 -277 -222 177 318 27 -296 -57 257 203 -269 -225 119 273
3843 273 30 -322 -130 221 177 -115 -275 6 323 5 -246 -180 203 279 -80 -272 -46 285 132 -252 -245 91
3865 91 282 -45 -239 -76 281 126 -198 -284 9 263 -2 -262 -152 259 226 -162 -298 61 272 18 -296
3886 -296 -180 222 209 -64 -264 19 299 119 -229 -245 192 271 -51 -321 -70 308 190 -268 -255 108 242
3907 242 -2 -329 -97 232 193 -168 -276 22 320 17 -280 -191 244 205 -107 -309 -21 308 105 -251 -212
3928 -212 185 284 -103 -295 2 313 73 -234 -234 131 237 -62 -289 -76 160 179 -184 -236 120 285 8 -292
3950 -292 -183 168 230 -131 -201 26 345 48 -220 -151 176 232 -105 -253 -12 268 55 -227 -212 148 264 -103
3972 -103 -303 -82 281 150 -159 -206 132 245 -58 -242 -93 229 201 -103 -247 61 302 39 -318 -167 170
3993 170 224 -133 -259 3 222 66 -313 -192 102 272 -37 -285 -47 215 125 -192 -227 125 266 18 -249
4014 -249 -101 205 165 -160 -240 164 207 106 -275 -150 177 221 -111 -235 28 241 50 -275 -175 191 220 -55
4036 -55 -293 -53 246 145 -202 -198 86 231 33 -242 -109 249 203 -145 -185 64 253 55 -250 -95 189 214
4058 214 -131 -275 4 249 36 -191 -165 153 224 -57 -249 -49 229 52 -198 -191 182 236 -56 -202 -82 247
4080 247 191 -155 -205 41 220 -17 -258 -68 219 216 -159 -236 81 221 38 -273 -110 180 198 -122 -263 3
4102 3 231 17 -236 -189 118 269 -47 -299 0 227 75 -175 -140 117 266 -11 -215 -128 190 186 -137 -183 85
4125 85 225 48 -249 -95 182 201 -112 -223 53 154 88 -202 -165 186 240 -75 -195 0 244 66 -192 -195
4147 -195 127 242 11 -236 -20 215 159 -153 -205 13 217 -2 -200 -134 191 138 -119 -188 7 191 53 -181
4169 -181 -121 165 252 -49 -179 24 187 86 -140 -156 157 214 -83 -260 -25 219 105 -162 -148 53 194 -2
4191 -2 -247 -81 165 141 -106 -254 22 190 65 -262 -164 156 230 -75 -191 31 186 49 -85 -127 115 236
4213 236 -21 -115 -27 243 120 -138 -206 76 167 1 -174 -86 151 146 -104 -186 14 169 29 -179 -110 111 158
4236 158 -62 -227 29 248 49 -194 -110 115 176 -84 -179 -61 192 126 -195 -169 76 165 -50 -198 -76 207
4258 207 110 -120 -168 36 185 44 -169 -89 157 156 -104 -197 37 243 66 -242 -156 136 196 -88 -214 21 192
4281 192 43 -183 -159 60 163 -98 -173 -75 169 67 -122 -148 79 169 33 -232 13 150 138 -100 -164 78
4303 78 216 37 -199 -68 158 203 -94 -182 -27 193 83 -184 -111 114 179 -79 -173 -47 134 51 -101 -169 17
4326 17 202 -28 -192 -71 140 92 -80 -143 92 177 -7 -174 -87 106 87 -76 -160 17 147 68 -121 -186 108
4349 108 145 -94 -171 -15 168 52 -124 -95 109 178 -54 -201 -44 173 101 -49 -159 54 157 55 -158 -125
4371 -125 117 169 -83 -210 -6 141 17 -162 -149 129 114 -10 -207 -48 164 85 -98 -147 120 192 4 -157
4393 -157 -3 136 92 -140 -109 57 131 111 -152 -77 113 109 -50 -157 12 92 15 -225 -89 166 164 -86 -177 25
4417 25 70 30 -156 -108 72 219 5 -157 23 170 127 -116 -154 140 132 -32 -83 -89 133 103 -89 -196 18 184
4441 184 -9 -157 -109 156 53 -99 -109 23 100 48 -190 -85 139 93 -21 -217 -33 148 76 -120 -118 120 114
4464 114 -12 -189 -57 164 54 -102 -134 94 158 -27 -168 -58 81 121 5 -176 38 191 52 -159 -88
4485 -88 92 170 -28 -138 3 90 61 -127 -129 53 89 18 -159 -62 172 91 -150 -139 66 105 8 -143 -71 107 90
4510 90 -102 -100 -8 155 59 -188 -97 193 200 -40 -143 -25 180 51 -126 -121 81 130 4 -173 -32 147 74 -114
4534 -114 -154 -8 136 17 -167 -81 161 87 -106 -154 33 159 30 -121 -23 81 148 -17 -100 42 141 64 -78
4557 -78 -67 62 150 -43 -114 -9 154 47 -155 -122 30 85 -29 -161 -55 70 82 -48 -169 67 187 45
4579 45 -121 -114 113 39 -62 -167 56 118 49 -55 -145 67 144 -63 -188 -17 115 112 -77 -129 63 145 -10 -159
4603 -159 -49 145 82 -30 -148 43 172 54 -131 -35 110 165 -99 -130 7 136 -30 -178 -83 78 61 -80
4625 -80 -165 0 69 55 -25 -161 73 133 -35 -130 23 111 73 -121 -53 98 97 47 -91 -19 106 109 -87 -121 42 125
4651 125 45 -140 -69 144 138 -86 -169 -41 132 20 -144 -64 49 104 -79 -116 -9 109 43 -77 -64 41 143
4674 143 -2 -130 13 87 82 -54 -97 35 136 63 -71 -26 120 161 -62 -101 61 87 36 -123 -36 18 89 -35
4698 -35 -110 9 99 73 -55 -25 46 116 26 -128 -77 160 59 -97 -58 56 59 31 -109 -70 119 77 -18 -127 71
4723 71 126 57 -161 -128 71 134 -22 -125 -2 162 42 -81 -10 99 111 -24 -131 -98 103 43 -53 -113 26 153
4747 153 -7 -94 -74 86 106 -108 -92 30 108 39 -97 -71 107 106 -15 -159 1 156 40 -170 -59 102 151
4770 151 -47 -77 -27 114 98 -58 -62 77 125 -14 -165 -65 130 78 -68 -152 51 108 -13 -117 -25 107 43 -88
4794 -88 -65 16 169 1 -54 -45 87 78 -53 -105 14 129 76 -143 -82 62 109 -28 -59 -62 98 25 -37 -129 50 101
4820 101 11 -159 -29 106 103 -104 -123 48 107 66 -73 -23 118 131 -30 -67 -1 159 41 -127 -99 53 107 -79
4844 -79 -118 -21 129 41 -79 -48 27 64 -28 -75 -74 71 74 -76 -81 54 127 34 -160 -6 118 69 -75 -41 25 105 66
4871 66 -45 -71 32 103 -16 -60 -5 81 48 -101 -63 33 111 -20 -71 -27 114 87 -16 -76 53 89 38 -77 -13 124
4897 124 132 -76 -79 -9 104 31 -59 -36 81 75 -3 -27 -45 131 50 -84 -87 53 98 12 -118 16 131 83 -43 -41 -14
4924 -14 114 76 -14 -25 76 107 6 -80 -26 131 36 -102 -45 101 85 -72 -52 40 70 36 -104 -66 44 106 -70
4949 -70 -100 -20 130 67 -53 -84 76 132 -57 -96 -46 144 70 -44 -107 11 129 -10 -55 -58 69 64 -41 -119 12
4974 12 96 38 -90 -72 81 123 -34 -108 22 88 15 -101 -98 38 122 13 -99 -48 74 57 -88 -51 26 74 -15 -79
5000 -79 -20 16 83 -67 -133 13 119 -4 -39 -73 117 22 -10 -88 3 32 57 -76 -60 68 55 1 -83 -16 59 13 -36
5027 -36 -53 -24 60 22 -70 -78 83 83 -50 -46 -12 31 66 -89 -115 30 35 18 -87 -20 111 19 -53 -42 25 106 -13 -70 -69
5056 -69 82 24 -47 -62 60 116 18 -73 -106 73 63 -50 -92 0 117 39 -110 -69 46 76 31 -67 -54 134 14 -53
5082 -53 -66 -18 102 -30 -56 -34 92 57 -67 -56 29 90 43 -61 -62 13 46 -25 9 26 139 29 -135 -22 121 150
5108 150 -30 -100 41 108 60 -13 -53 53 78 -14 -79 -24 102 97 -81 -74 41 106 5 -128 -18 85 31 -40 -53 42
5134 42 43 51 -83 -17 77 38 -48 -60 39 125 1 -61 31 85 74 -39 -58 64 68 2 -75 -97 12 72 35 -100 3 55
5162 55 -22 -79 -89 72 67 -18 -64 57 73 84 -42 -85 -35 106 20 -43 -40 124 88 -36 -66 60 117 -31 -53 -18 50
5189 50 21 -92 -90 -24 50 15 -52 -44 37 77 -26 -66 -16 57 50 -46 -18 79 59 55 -6 -60 13 66 4 -40 -27 30 36 -79 -6
5220 -6 17 31 3 -42 3 88 16 -31 -29 42 46 40 -26 -26 109 95 -98 -54 64 111 22 -78 27 38 98 9 -2 -62 63 48
5250 48 -73 -106 67 75 -35 -85 -3 104 71 -65 -17 46 94 -2 -58 -8 79 -4 -28 -80 27 77 13 -40 -34 100 35 -47
5278 -47 -80 49 35 -8 -40 -76 49 53 -23 -118 -25 94 113 -80 -22 69 57 -2 -82 -12 20 -40 -5 -45 16 44 18 -82
5306 -82 -51 49 71 -3 -121 58 95 -16 -84 -27 84 43 -75 -8 4 75 10 -66 -26 50 58 -48 -100 -38 114 36 -76
5333 -76 -47 57 59 2 -42 6 84 -6 -3 -26 18 19 54 -110 -58 52 33 -27 -52 9 25 27 -89 -27 -4 -1 35 -30 12 21 -17
5364 -17 -11 -40 25 59 -15 -58 -19 76 -22 -72 24 64 30 -28 -9 -60 -41 51 -2 -51 1 17 -31 -45 -20 56 69 -44 1 54
5394 54 110 58 17 -37 30 32 3 -6 12 74 18 -63 -51 35 60 31 -72 32 28 -9 -45 -6 -24 6 7 -79 -44 10 93 -45 -145
5425 -145 12 99 94 -76 -10 25 47 -22 -63 -4 41 53 -96 -82 -31 57 62 -45 -4 96 39 -80 -43 30 60 60 24 -81
5453 -81 19 42 3 -42 -64 94 1 -74 -126 44 53 -24 -59 62 30 -18 -40 -29 -5 77 -40 -56 -33 47 92 -49 -19 63
5481 63 68 26 -55 20 75 21 -55 -22 80 55 15 -65 27 46 97 -46 -139 -14 116 52 -56 0 86 81 -28 -25 26 53 20
5510 20 -23 -45 -21 72 41 -23 -37 126 75 -64 4 24 45 -24 14 38 40 5 -21 -67 -26 71 -28 -32 -59 25 20 -31 -55 22 49
5541 49 -62 37 1 33 33 3 -53 -2 40 44 -4 -57 23 -24 -7 -82 -15 53 17 -97 -29 0 32 37 15 -17 -30 1 27 -24 21
5572 21 35 35 -52 -49 30 22 -6 -40 12 -20 21 -65 -1 26 14 27 -16 -51 55 50 59 -42 -21 28 -5 -31 -29 9 33 1 -92 -11
5604 -11 53 74 29 -35 -26 102 -18 -111 -34 126 41 -50 -33 8 58 -27 -11 -1 53 77 -23 -55 -23 49 30 -117 28 64
5632 64 100 -49 -66 -14 62 -14 -71 -22 40 23 5 -12 -32 94 48 -20 -14 13 72 -58 -51 -45 37 38 -62 -4 12 -34 -18 -43
5662 -43 -15 13 41 -38 -95 38 48 1 -50 -26 9 39 -59 30 42 19 25 -6 -1 34 87 11 -81 11 56 -12 -89 -53 112 20
5692 20 -18 -8 -15 1 11 -8 0 -31 -20 36 -26 33 63 34 6 -24 61 73 -34 -53 23 15 -13 -1 69 -19 -30 41 15 -25 -20 49
5724 49 67 -44 -4 60 14 -17 24 -12 14 1 -54 35 -12 67 62 4 -54 27 41 -41 -26 65 66 -50 -63 -15 12 -8 -22 -33
5754 -33 -71 -14 94 -70 11 -6 47 -48 -48 -5 64 -39 -44 9 51 81 41 8 12 95 93 -31 -69 -16 93 1 -88 -58 38 66
5784 66 -90 -79 29 10 -23 -36 -18 34 -17 -20 -6 8 101 -34 -65 -49 93 64 -59 -21 32 115 -21 -18 11 -26 6 34
5812 34 -49 -8 53 -6 0 -48 15 71 -17 -55 37 78 59 -68 -7 50 42 -33 -69 10 39 32 -63 -9 -28 100 15 -78 -45 38 2
5843 2 -40 -15 14 43 3 -28 -64 12 29 -11 -94 -6 70 48 -46 -49 88 21 -11 2 30 -3 -26 23 -31 16 -16 15 -39 11 71
5874 71 -7 -26 -7 7 10 21 -50 39 0 35 -19 40 10 22 8 42 14 -6 59 -10 -79 2 21 13 -57 -10 47 -43 83 -19
5904 -19 18 29 -28 27 -48 -50 12 28 -38 -46 9 -4 -20 45 -13 10 5 64 2 -18 81 27 -22 -41 28 73 -36 -36 -17 64 67 -36
5936 -36 27 50 12 28 24 -21 7 111 15 -25 13 84 -11 -48 1 35 17 23 15 73 67 -14 -44 20 104 22 -16 1 10 104 48 -57
5968 -57 -61 -17 62 -42 -58 59 43 -50 -41 10 17 42 -5 -41 8 45 17 35 -36 101 92 -17 -63 70 80 28 -22 -20 36 11
5998 11 -74 -40 -10 31 44 -28 -97 26 16 -9 -79 -7 91 9 -54 -40 91 -22 31 19 7 23 47 -4 26 11 36 -6 -37
6027 -37 9 53 3 -25 -58 4 25 -52 27 -13 -27 -20 36 28 -33 14 17 22 -50 26 -16 -42 -24 55 21 -32 13 44 52 2 21 -6 -11
6060 -11 -12 76 86 -26 3 34 -15 -4 33 3 1 -13 43 5 -1 79 -23 -6 -36 -25 26 -28 -59 17 -7 -63 -37 1 39 38 40 -20
6092 -20 -44 45 35 -49 -58 37 40 -28 -51 -3 65 70 -46 27 48 -37 -34 -18 22 24 45 4 -48 8 41 56 -79 -20 78 -5 -59 -60
6124 -60 70 68 -49 -24 -40 54 18 -15 -66 -97 24 -2 -45 -78 48 53 -36 16 54 64 34 -108 38 -17 3 38 -18 33
6152 33 29 50 -49 15 27 15 -14 -68 44 52 -42 12 -4 64 -29 3 -39 -42 24 12 -45 -49 32 60 -22 -76 18 64 26 -24 20 79
6184 79 2 -23 23 3 14 28 -59 -34 12 57 -53 -35 -3 51 13 -48 -2 22 -1 -45 -1 51 -47 18 -48 -11 -36 24 55 -48
6214 -48 -23 44 16 -28 -18 33 33 -2 -31 53 30 2 21 6 -27 1 20 45 2 53 11 -45 -44 37 -19 6 -11 -13 9 -10 -10 11
6246 11 13 -43 -11 -40 -58 19 -18 6 -33 3 39 -5 16 34 -9 6 -36 69 1 -30 9 69 3 -40 66 46 -17 53 -3 45
6276 45 18 -14 -56 -69 -59 37 4 -79 16 55 18 -50 -27 41 56 37 -9 15 69 -29 -38 41 84 44 15 5 21 54 29 -82
6306 -82 -28 67 27 -46 -15 10 1 -15 -33 12 -8 5 -32 -23 11 78 13 -76 3 38 27 -21 -58 5 65 -72 -85 -30 17 55 -45
6337 -45 -21 -2 18 48 14 -6 33 86 -98 -39 10 60 -14 -78 31 -4 5 22 24 30 36 1 14 -32 24 52 36 -64 17 58 -13
6368 -13 -48 3 37 -11 -37 -32 -20 -7 5 -16 -13 -6 7 29 -28 18 -1 15 -29 -22 33 31 -46 -51 50 4 -6 26 19 -22 46 35 -11
6401 -11 6 -5 35 30 -20 36 7 -15 -61 7 29 -81 -31 -13 2 -4 -33 -19 42 -52 -1 -2 -29 -9 52 77 -27 35 -9 -57 -12
6432 -12 64 -36 -38 24 51 34 -10 23 34 10 2 27 1 -4 -21 -44 9 27 47 -13 5 -10 -20 10 -105 19 41 -2 -40 -16
6462 -16 -1 -1 -76 -54 -9 -25 -45 -33 -13 8 12 -7 -20 -61 94 64 -46 -25 -7 55 48 -35 -7 39 5 12 -26 13 24 -34 -1
6493 -1 -85 92 93 -7 -103 4 58 -15 -29 -5 0 0 -16 -56 36 -18 -24 -13 -14 5 93 -31 -64 54 52 3 -53 9 52 36 -18
6524 -18 -16 50 6 15 -58 21 30 21 -38 -49 -21 34 41 -53 1 44 -27 11 -7 -48 -12 -72 -2 -33 -12 -7 4 -6 6 24 11 -28 -6
6557 -6 32 -6 3 -43 32 -18 -25 22 0 5 -37 -24 26 17 -6 -3 1 18 -21 -33 18 -28 51 17 -57 5 21 5 -3 35 21 3 -40 -16
6591 -16 -7 -33 -32 -5 -21 31 30 -6 -11 -16 -34 5 -5 24 9 14 -57 -10 114 6 -44 24 -1 20 19 -12 -13 29 17 0 -86 -46 69
6624 69 25 -100 -22 49 27 -37 -25 24 -11 -53 25 28 -44 41 -20 -18 -5 20 4 -36 -19 8 9 -45 -25 28 28 -15 -45 -20 -2 6
6656 6 3 -9 -30 20 33 -9 -58 56 14 -43 -30 -10 42 8 -59 6 27 -3 -18 18 -41 -25 -12 -6 -28 19 29 6 -33 -24 36 14
6688 14 -10 14 74 -53 -46 5 -9 -6 54 -18 -1 60 41 -1 -48 -49 69 -17 -55 -9 28 -32 -39 -32 -18 -25 -26 -39 -21 -2 -5 50 21
6721 21 -33 5 -13 -23 61 8 28 -12 11 0 73 17 26 11 -2 -2 63 -4 -11 13 1 -26 -12 -29 -31 -26 -87 8 28 2 -20 -12 -35
6754 -35 -42 -7 64 1 -39 36 7 -2 0 0 15 -3 86 -1 32 10 44 43 -2 -11 49 42 -4 29 46 26 -10 0 -6 1 -18 -8 -5 -57 9
6789 9 -13 5 22 38 44 -35 11 7 71 -26 16 21 21 5 -12 24 -25 28 -16 9 -11 8 30 -52 -15 17 24 8 30 18 -19 1 -25
6822 -25 11 30 57 -22 -54 -9 -25 4 25 -25 59 35 -2 24 11 29 -18 -31 37 14 29 -33 -34 30 3 30 -5 22 60 4 -16
6853 -16 -63 13 57 -9 10 40 8 43 -44 -40 1 -16 45 23 26 21 42 30 -21 -24 -1 -9 -86 48 53 -7 -19 -26 -20 15 6 -23 -12 5
6887 5 13 15 -50 39 37 11 -54 10 59 37 14 63 14 24 8 27 50 3 -19 -24 -69 -24 -22 -16 15 21 -2 12 -50 -82 14 -24 -39 -19
6921 -19 69 9 -34 -16 103 9 36 9 -23 -13 -8 2 -38 53 12 -6 -25 12 -27 -17 -41 58 11 12 -22 -57 5 18 -46 -16 -23
6952 -23 -14 15 19 -10 14 36 3 5 18 43 23 -49 6 31 -20 -4 -19 16 50 3 -20 -79 -9 -21 -6 -47 -31 10 13 9 13 14 16 48
6986 48 -29 33 52 2 -70 60 41 29 6 -12 19 10 28 -30 -33 -1 45 -37 -26 -8 -29 22 -11 -9 13 -32 -23 17 -9 -3 -15 -13 8
7019 8 41 38 55 14 37 32 33 -53 -6 53 63 -27 -50 -18 -17 -7 17 -8 -7 24 -34 -25 -2 16 -39 -3 4 19 5 -63 -19 27 0 -32
7053 -32 19 -15 -9 -28 40 -8 -14 -18 -7 1 -7 43 46 -53 -30 49 15 -11 11 69 -39 0 -46 20 34 9 -14 -46 9 -6 13 -2 -14
7086 -14 -48 0 -2 -5 34 -17 -12 -8 -10 -36 15 21 17 -36 -8 -16 -35 45 -11 32 -7 -37 34 26 -11 21 -11 -39 -21 -22 5 -1 -4 -49 18 21 38
7123 38 -23 -17 7 -60 37 -1 -51 36 10 3 17 8 -17 -56 -59 5 -15 -11 30 -6 -9 35 41 7 4 -6 39 -13 -6 26 71 -27 -19 -18 19 31
7159 31 -26 -12 -11 -6 1 -6 -12 15 -21 -46 -47 12 11 -44 7 36 17 2 -24 -21 52 47 44 -30 -34 -62 0 -29 18 -65 32 16 -4 53 46 15
7195 15 -51 52 -14 26 9 -36 28 17 19 -5 -16 36 -1 -12 -3 0 38 -13 30 20 28 -16 -42 -37 26 -32 -2 34 45 1 -11 39
7227 39 -9 -19 -24 -13 49 -2 19 33 -14 8 7 31 -7 -35 -21 34 -19 -4 19 5 3 48 5 -32 -21 16 -14 -2 -45 -2 6 5 24
7260 24 0 5 -1 1 -32 -5 -30 -9 6 -32 -3 -12 7 -38 57 -29 12 66 15 -17 11 38 11 8 -49 -28 -42 18 -20 -45 -34 -25 -36
7293 -36 -29 -34 56 -35 -8 -33 30 3 -27 -35 -2 -4 -22 -31 48 -35 -25 0 -3 4 -74 33 -6 15 10 41 26 -1 -11 -33 4 -46 -1 26
7327 26 17 -5 -13 29 2 14 -3 -48 8 4 15 -42 -5 -15 -27 -29 -19 13 37 -62 59 14 -21 0 -26 8 -27 8 -14 66 7 50
7359 50 -7 31 -13 43 33 -32 9 44 -16 23 -26 23 6 -4 -15 -39 34 -17 21 -10 -16 31 -8 -56 -13 -41 -35 -119 -21 18 16 4
7391 4 -25 -20 62 43 -7 -8 56 24 -31 -55 -5 11 5 -40 -59 32 -21 19 18 -4 36 -11 -64 -5 27 -27 25 3 35 -7 21 -5 13
7424 13 13 -9 -11 22 3 15 -31 -12 4 -17 -14 -3 -23 -7 -1 -71 51 -39 21 12 -11 2 -7 60 -12 4 24 30 -3 4 -1 -10 41 1 24
7459 24 -35 8 -11 53 9 26 -55 -33 -38 -15 -12 6 -4 4 59 66 -8 9 -38 16 9 15 9 -18 -2 13 33 -20 25 -36 16 25 56 22
7493 22 40 2 24 17 -36 -10 -7 11 0 -14 -1 9 -16 -7 -24 -8 27 -23 -13 2 26 0 -20 -13 -11 65 16 14 -76 22 -14 -75 0
7526 0 -1 20 0 -19 -11 -20 14 15 36 21 -38 22 -25 -38 7 -4 -43 -28 -18 -15 22 -24 18 33 -33 -4 -22 -9 -1 -25 -4 5 0 40 73
7561 73 8 14 82 30 -40 -8 -35 32 -45 -21 33 55 1 -43 45 31 23 34 23 28 66 -10 4 -19 24 33 -27 -12 -35 -42 27 -31 13
7594 13 4 -20 -32 14 -5 -54 -20 25 56 23 -9 22 11 46 42 19 6 2 42 19 -10 14 52 -13 33 -26 -19 6 5 -1 2 -15 -15 26
7628 26 -18 -67 23 30 18 10 22 -36 -6 43 -12 26 -7 1 -4 9 -30 56 64 -11 -44 24 15 -17 15 -42 27 -4 -1 31 -25 -31 18 -22
7662 -22 -12 1 -25 -20 -54 -17 -28 7 -27 33 -48 25 20 -6 -40 -37 14 20 -4 -13 -24 -17 -24 -26 12 53 -22 11 -26 -68 -33 14 29 10
7696 10 -10 27 14 -13 23 -3 -34 -15 32 44 47 -21 -8 -23 12 -47 23 -20 -30 -72 3 -9 -13 -28 -20 -27 37 47 -43 21 0 4 34
7729 34 56 -12 21 39 -12 -18 51 11 33 15 -5 30 37 36 34 23 10 -4 -41 43 31 3 -30 -20 17 -9 29 -7 -34 -41 32 2 2
7762 2 -2 18 53 34 -34 46 14 -39 31 11 8 6 6 47 -29 -35 20 -10 -41 14 48 -38 1 33 -39 -18 -32 -43 21 10 17 -20 -15 34
7796 34 -63 35 12 1 2 6 -3 28 -63 -22 6 -37 -16 -24 0 48 -34 -17 -20 3 8 13 23 43 21 31 0 -6 23 -14 -11 24 -31 20 11
7831 11 -19 49 -14 -5 -26 7 19 -7 -12 31 -35 -14 3 12 -37 -11 -5 -5 10 -7 53 1 6 -8 22 47 12 15 2 -32 3 -20 -18 6
7865 6 -4 -13 -57 0 -2 -7 -35 30 -23 19 -21 -36 -27 16 -14 -18 -26 20 -14 23 -16 -4 5 1 3 -24 44 46 17 12 5 62 -1 14 39 35 41 -21
7903 -21 7 0 -4 2 6 20 25 5 6 2 9 17 5 -19 -5 11 0 -35 -39 -70 -42 -39 -103 -22 48 1 25 -2 18 16 -1 57 -16 32 0 -25
7939 -25 -25 16 -48 46 -43 -12 7 25 10 37 40 17 3 -27 48 19 -2 -23 -2 4 -12 -27 11 -17 2 -28 -38 -24 87 10 41
7970 41 44 1 -1 -32 25 -53 4 -46 43 -31 42 35 18 23 34 17 -34 28 -52 -5 36 65 -3 47 -10 0 -14 35 -33 6 -7 12
8002 12 -3 -28 26 -5 51 -40 52 26 5 3 26 22 -19 17 63 8 -22 -6 35 17 16 -10 -34 8 -8 -36 54 57 22 13 -53 -23 63
8035 63 35 -3 37 22 -3 -6 1 -1 28 21 10 -21 60 39 -24 27 1 15 13 -15 -48 55 -31 37 14 62 69 -19 8 31 -15 -23 14
8068 14 -3 2 27 22 -11 12 9 48 -1 17 28 -31 -8 56 9 29 10 2 -34 -4 -29 -13 47 43 38 9 -39 -49 -35 14 3 -41 -40 -11
8102 -11 17 -74 5 43 0 10 -34 -5 -16 -16 -17 23 -37 11 30 -21 9 -7 41 11 -12 -16 28 -13 -18 -11 -15 -6 47 -47 -16 -20 27 -12
8136 -12 -73 -11 26 15 17 -13 30 19 -32 53 19 12 45 -12 15 12 -87 18 44 -4 41 -17 -46 34 -13 11 -42 -29 31 -13 13
8167 13 -26 28 -19 61 19 14 -14 -5 -12 -9 -31 53 49 -30 3 8 22 -45 66 77 39 28 10 3
8191C
$$ Imaginary data points
##PAGE= N=2
##DATA TABLE= (X++(I..I)), XYDATA
0 0 0 0 0 0 0 0 0 0 0 0 0 0 0 0 0 0 0 0 0 0 0 0 0 0 0 0 2 -1 3 -4 4 -4 6 -10 11 -12 12 -14 17 -22 23 -25 28 -34 35 -40 46 -51
48 -51 55 -61 67 -74 82 -87 96 -104 110 -121 127 -130 131 -126 109 -69 -14 194 -615 1763 -5998
69 -5998 47755 355515 88940 -324587 -119638 240823 141909 -140180 -137683 22941 112456
80 112456 87021 -68525 -186505 11811 258582 50246 -300226 -106397 307237 151792
90 151792 -281052 -176153 228084 180004 -154426 -158621 71182 117342 12763 -59026 -87304
101 -87304 -7107 145861 74026 -184210 -133599 198822 176752 -192939 -199958 167411 198401
112 198401 -130165 -174600 84420 130072 -37879 -71094 -4254 5424 38564 59628 -61798
123 -61798 -115097 75569 157075 -78831 -178931 76126 180925 -68753 -162843 60511 128925
134 128925 -52832 -84213 46244 33600 -42304 15049 38339 -58274 -34790 90361 27729
145 27729 -110957 -17811 118227 3135 -113579 16247 100082 -38187 -79692 61860 57207
156 57207 -82325 -33380 98570 12697 -105741 5063 102603 -18683 -87750 29124 61660
167 61660 -38046 -27313 45002 -13458 -53083 54197 60847 -91717 -69302 119535 75717 -135140
179 -135140 -79289 135645 78298 -120095 -69928 91308 54260 -51227 -29502 6662 -1142
190 -1142 38981 37442 -78421 -74679 107801 109107 -123494 -136163 123551 151161 -109544 -152533
202 -152533 81633 136744 -45891 -105835 5401 60559 32973 -6231 -65172 -52396 86993
213 86993 109327 -95140 -156876 90374 190377 -72524 -203943 46356 196563 -14450
223 -14450 -166923 -17183 118473 44052 -56196 -62415 -13270 69115 81486 -64636 -141950
234 -141950 48176 186185 -24532 -210797 -3757 211863 31074 -190628 -53590 149284
244 149284 67712 -92510 -70244 28073 61857 38003 -42174 -96929 15260 144007 16598
255 16598 -173506 -47817 183475 74174 -173945 -91940 146440 97554 -105712 -90978 55826
266 55826 70800 -4202 -41057 -44524 4108 84506 34544 -112517 -70286 126595 98811 -125830
278 -125830 -115142 113346 118525 -90357 -106921 62252 83159 -31394 -48999 2478 9483
289 9483 21778 30513 -40280 -66495 51377 93680 -56537 -110283 55415 113394 -51338 -104522
301 -104522 44852 84639 -38138 -56943 31885 24952 -26292 7905 22384 -36804 -17828 60472
313 60472 13416 -75312 -6828 81956 -1241 -79628 11961 70220 -24735 -56092 38035 38661
325 38661 -51176 -21353 60972 4547 -67164 8734 66238 -19503 -58513 26734 43422 -31584
337 -31584 -21867 34958 -3469 -37036 31077 39767 -56218 -41834 76986 44171 -89548 -44798
349 -44798 92875 43581 -85628 -38886 68349 29501 -43500 -16093 12978 -2366 18273
360 18273 23274 -47940 -46450 70982 68063 -85559 -86159 89568 97805 -82646 -100265 66308
372 66308 92985 -41843 -74120 14003 46222 14830 -10347 -39849 -29035 58548 68291 -68231
384 -68231 -102638 67788 127367 -58585 -139800 41462 136945 -20309 -119508 -2621 87863
395 87863 22725 -45994 -37731 -1737 45714 50311 -45170 -93558 37477 127538 -22771 -147095
407 -147095 5037 151462 14079 -139151 -30482 112510 42021 -74053 -46596 28176
417 28176 42756 19121 -31925 -63909 14198 99971 6608 -124860 -28884 135108 48424 -130861
429 -130861 -62415 113044 68794 -84025 -65543 48313 53559 -9319 -32779 -27227 7294 58695
441 58695 20972 -81225 -47439 93510 68780 -95105 -82322 86671 85447 -71209 -78905
452 -78905 50074 62024 -27493 -38280 5182 9440 13749 20082 -28468 -47232 38116 68963
464 68963 -42394 -82158 42812 86566 -39391 -80779 34710 67248 -28804 -46776 23525
475 23525 22672 -18897 2316 15099 -25724 -12396 44401 9008 -57758 -5531 63634 -16
487 -16 -63201 6766 56507 -15502 -45643 25141 32194 -34414 -17589 42702 4295 -47585 7670
500 7670 48793 -16413 -44250 23180 34803 -27325 -20208 29814 2134 -31277 17500 31858
512 31858 -36894 -32753 52744 32563 -64039 -32300 68152 30381 -65046 -26608 54363 20104
524 20104 -37247 -10342 16129 -1897 7524 16927 -29645 -32511 48743 48259 -61242 -61300 66491
537 66491 70084 -63656 -72831 53135 68002 -36843 -55849 16275 35755 4474 -10656 -24146
549 -24146 -18137 39035 46782 -48147 -72419 50258 91651 -45286 -101598 35052 101467 -20237
561 -20237 -89724 4494 68329 11052 -38381 -22911 3873 30389 31953 -32323 -65174 28270
573 28270 91597 -19730 -108854 7283 114022 5897 -107558 -18743 89141 28213 -61627
584 -61627 -33155 27719 32418 8576 -25575 -42930 14189 72521 1150 -92813 -17166 103071
596 103071 32340 -101525 -43413 89677 49164 -68799 -48154 41834 39974 -12456 -26053
607 -26053 -16572 7206 41147 13121 -60015 -33200 70754 49677 -73614 -60546 68665 64275
619 64275 -57373 -60025 41983 48836 -23938 -31207 6474 10207 9479 12451 -21832 -33534 30233
632 30233 50908 -34474 -62476 34716 66680 -32406 -63788 27759 53613 -22790 -38485 17432
644 17432 19447 -13274 394 10095 -19100 -7590 34823 5812 -45469 -3352 51156 489
656 489 -50782 4177 46002 -9885 -37060 16786 26052 -23986 -14180 30222 2560 -34974 7078
669 7078 36399 -14943 -34481 20067 28141 -23355 -18374 24659 5448 -24900 9282 24640 -23891
682 -23891 -23814 37146 23282 -46378 -21918 51383 20463 -50295 -17544 43803 13215 -32058 -6868
695 -6868 16402 -1558 877 11478 -18436 -22914 33286 33798 -44420 -43612 49678 50133 -49326 -52605
709 -52605 42927 49858 -31607 -41244 17332 27632 -1443 -9290 -12940 -10993 25310 32383 -32911
722 -32911 -51334 35991 66197 -33787 -74762 27189 75451 -17600 -68262 5937 52985 5129
734 5129 -31898 -14802 6314 20865 20348 -23095 -45608 21029 66510 -15002 -80295 6502 85956
747 85956 3560 -81914 -12658 69447 20093 -49209 -23707 24322 23132 2886 -18214 -29189
759 -29189 9410 51372 1766 -67705 -14250 75733 25226 -75804 -33754 67578 37720 -52871
771 -52871 -36711 33450 30544 -11685 -19625 -9334 5739 28422 10099 -42599 -24997 51652
783 51652 37967 -54355 -46513 51455 49816 -43776 -47260 32410 38854 -19390 -26093 5738 9541
796 9541 6116 7758 -16060 -24654 22521 38562 -25836 -48144 26171 52363 -23947 -50415 20675
809 20675 43472 -16371 -31530 12809 17078 -9455 -1254 7434 -13604 -5993 26258 4902 -35266
822 -35266 -3856 39843 1831 -40546 799 36689 -5139 -30280 9891 21413 -15547 -11968
834 -11968 20683 2644 -24714 5712 26981 -12016 -26186 16849 22850 -19211 -16168 20443
846 20443 7318 -20070 3416 19225 -14590 -18103 24835 16661 -33093 -15554 37729 13696
858 13696 -38659 -11674 34831 8448 -27327 -4175 16473 -1565 -3696 8519 -9233 -16042
870 -16042 21149 24048 -30031 -30782 35565 35897 -36361 -37781 33142 36228 -25940 -30637 15994 21058
884 21058 -4833 -8548 -6440 -6324 15822 21518 -22813 -35972 25899 47332 -25572 -54519 21699
897 21699 56171 -15043 -51722 7073 41701 1521 -26389 -8562 8012 13877 12120 -16051
909 -16051 -31244 15201 47450 -11415 -58796 5299 63624 1477 -61930 -8535 53103 13635
921 13635 -39100 -16688 20682 16317 -683 -12885 -18983 6753 36117 1459 -48628 -10122
933 -10122 55832 18606 -56337 -24685 51344 28162 -40814 -27641 26886 23423 -10812 -15666
945 -15666 -5345 5068 19662 6591 -31226 -18457 38249 28348 -41166 -35613 39106 38534 -33650
958 -33650 -37015 25184 31009 -15160 -21091 5122 8815 4097 5049 -11206 -18031 16251 29339 -18485
972 -18485 -36950 18724 40479 -17077 -39351 14291 33769 -11459 -25100 8560 13651 -6583
984 -6583 -1752 4987 -10009 -4372 19884 3849 -27127 -3274 31189 2343 -31592 -353 29145
997 29145 -2169 -23767 5929 17102 -9973 -9292 14170 1842 -17658 4806 19891 -10141
1009 -10141 -20380 13672 18340 -15876 -14429 16346 8037 -15983 -322 14680 -8100 -13335 16181
1022 16181 11862 -22748 -10348 27420 9156 -28674 -7267 27125 5271 -22022 -2217 14680
1034 14680 -1439 -5477 6088 -4300 -11205 13385 16381 -20953 -21343 25594 24706 -27542 -26504
1047 -26504 25852 25724 -21442 -22360 14583 16087 -6394 -7439 -2057 -2676 9889 13773 -15662 -24090
1061 -24090 19385 32904 -19966 -38539 18034 40609 -13735 -38265 7975 31633 -1858 -21373
1073 -21373 -4103 8108 8437 6032 -11209 -20287 11362 32345 -9658 -41181 6040 45669 -1463
1086 -1463 -45039 -3220 39782 7500 -30050 -10012 17467 10859 -2819 -9200 -11599 5797 24640
1099 24640 -747 -34739 -5189 40810 10979 -42533 -15894 39404 18663 -32601 -19304 22408
1111 22408 16986 -10568 -12226 -1770 5287 13143 2920 -22209 -11242 28637 18990 -31097 -24410
1124 -24410 30479 27335 -26438 -26714 20255 22951 -12606 -16204 4613 7262 2545 2416 -8627 -12310
1138 -12310 12601 20550 -14871 -26675 15081 29500 -13990 -29068 11828 25518 -9198 -19074
1150 -19074 6774 10925 -4426 -1684 3038 -7022 -1922 14861 1621 -20572 -1293 23957 862
1163 862 -24611 -58 22600 -1568 -18695 3403 12979 -6187 -6868 8863 381 -11534 5029
1176 5029 13469 -9367 -14158 12223 13450 -13482 -10880 13552 7003 -12344 -1510 10751 -4463
1189 -4463 -8644 10627 6751 -15936 -5047 19714 3560 -21533 -2494 20754 1144 -17878
1201 -17878 -32 12602 -1947 -6032 4050 -1388 -6730 8645 9752 -14867 -12657 19452 15280
1214 15280 -21503 -16647 21250 16960 -18275 -15186 13548 11869 -7262 -6585 468 -4 5906 7360
1228 7360 -11367 -14816 14821 21055 -16347 -25885 15399 27810 -12842 -27099 8592 23095 -3664
1241 -3664 -16343 -1057 7542 5261 2634 -7835 -12601 9121 21810 -8442 -28661 6476 32563
1254 32563 -3306 -32944 -261 29763 3480 -23426 -6194 14495 7325 -4220 -7161 -6568 5223
1267 5223 16402 -2202 -24365 -1885 29513 6066 -31347 -9728 29838 12492 -25029 -13303
1279 -13303 17919 12448 -9045 -9372 -103 4825 8809 839 -15922 -6962 20762 12418 -23258 -16859
1293 -16859 22771 19007 -20186 -19146 15576 16628 -10032 -12146 3940 5906 1696 1180 -6228 -8154
1307 -8154 9703 14483 -11370 -18933 11808 21535 -10811 -21467 9179 19182 -6954 -14704 4688
1320 4688 8675 -2864 -2047 1289 -4842 -616 10603 137 -15346 -245 17919 188 -18545
1333 -18545 -136 17167 -514 -14048 1730 9898 -3323 -4884 5427 69 -7340 4365 9167
1346 9167 -7621 -9980 9881 9932 -10788 -8633 10551 6001 -9571 -2484 7753 -1995 -6062 6393
1360 6393 4230 -10585 -2789 13685 1561 -15523 -643 15602 82 -13865 627 10615 -1316
1373 -1316 -5878 2496 703 -3840 4930 5615 -9794 -7474 13565 9207 -15882 -10553 16104 10882
1387 10882 -14649 -10376 11297 8361 -6862 -5270 1819 991 3208 3882 -7467 -9006 10709 13714
1401 13714 -12233 -17156 12213 19238 -10579 -19042 7802 16944 -4124 -12673 427 6752 2980
1414 2980 98 -5627 -7356 7063 13913 -7339 -19417 6218 22722 -4269 -23743 1625 22051
1427 22051 1150 -18020 -3438 12081 5137 -4622 -5433 -3092 4934 10673 -3073 -16771 494
1440 494 21076 2640 -22928 -5481 22230 7720 -19228 -8983 14054 8632 -7771 -7197 783
1453 783 4144 5663 -435 -11327 -3801 15307 7879 -17263 -11100 17374 13250 -15417 -13585 12311
1467 12311 12399 -7885 -9368 3400 5251 1194 -297 -5015 -4755 7756 9380 -9469 -13118 9721
1481 9721 15191 -9049 -15626 7403 14180 -5476 -11217 3379 6842 -1487 -1888 92 -3238 754
1495 754 7863 -941 -11336 964 13633 -591 -14124 346 13131 -371 -10756 827 7264
1508 7264 -1747 -3534 2895 -445 -4408 3802 5603 -6569 -6583 8201 6812 -8818 -6244 8461
1522 8461 4714 -7200 -2385 5617 -400 -3603 3655 1868 -6593 -260 9281 -772 -10865 1421
1536 1421 11386 -1636 -10654 1630 8492 -1683 -5474 1641 1455 -2071 2567 2565 -6580 -3594 9664
1551 9664 4579 -11784 -5538 12475 6252 -11631 -6244 9568 5664 -6290 -3916 2559 1702 1582
1565 1582 1435 -5130 -4708 7947 7865 -9728 -10695 9974 12349 -9241 -12960 7189 11896 -4523 -9624
1580 -9624 1346 5933 1622 -1451 -4135 -3552 5870 8411 -6517 -12419 6344 15403 -4936 -16502
1594 -16502 3141 15900 -867 -13503 -1337 9561 3078 -4540 -3987 -1083 4055 6460 -3362
1607 -3362 -11278 1696 14625 256 -16366 -2467 16179 4299 -14248 -5531 10920 5938 -6314
1620 -6314 -5240 1456 3799 3587 -1369 -7690 -1284 10926 4160 -12792 -6620 13075 8357 -12029
1634 -12029 -9160 9626 8555 -6516 -7046 2841 4426 696 -1145 -3854 -2467 6156 5868 -7527
1648 -7527 -8622 7928 10569 -7314 -11037 6084 10351 -4191 -8363 2489 5412 -740 -1783 -508
1662 -508 -1976 1271 5276 -1594 -8228 1350 9819 -1019 -10392 470 9674 -280 -7989 223 5483
1677 5483 -592 -2530 1349 -383 -2130 3240 3201 -5265 -3929 6674 4469 -7037 -4377 6754 3726
1692 3726 -5680 -2390 4139 544 -2481 1603 749 -3928 561 5876 -1625 -7489 2016 8140 -2180
1707 -2180 -7932 1920 6796 -1488 -4724 1210 2221 -909 969 1180 -3934 -1369 6552 2090 -8265
1722 -8265 -2789 9167 3427 -8877 -3874 7645 3637 -5420 -3208 2560 1806 383 -143 -3374 -2014
1737 -2014 5733 4245 -7364 -6228 8096 7833 -7667 -8500 6456 8474 -4388 -7106 2031 5094
1751 5094 508 -2061 -2805 -1219 4457 4661 -5352 -7833 5384 10086 -4715 -11410 3251 11312
1765 11312 -1587 -10029 -289 7450 1902 -4052 -3009 139 3486 3906 -3140 -7258 2383 10087 -920
1780 -920 -11560 -629 11822 2229 -10708 -3428 8378 4043 -5291 -4082 1593 3275 1979 -1953
1794 -1953 -5438 -28 7902 1900 -9521 -3900 9927 5377 -9156 -6183 7592 6288 -5052 -5293
1808 -5293 2407 3826 532 -1429 -2899 -1069 4784 3641 -5894 -5803 6156 7276 -5673 -7948 4537
1823 4537 7530 -3182 -6269 1571 4148 -209 -1683 -957 -1204 1556 3732 -1786 -5781 1650 7290
1838 7290 -1165 -7635 753 7349 -126 -6049 -50 4224 92 -1890 224 -393 -894 2468 1528 -4288
1854 -4288 -2318 5250 2860 -5697 -3154 5360 2911 -4482 -2209 3129 1201 -1707 414 172 -1973
1869 -1973 1089 3627 -1899 -4820 2447 5672 -2317 -5790 2028 5215 -1378 -3911 787 2072 -375
1884 -375 52 49 -2354 -204 4343 409 -5941 -914 6854 1499 -6889 -1986 6114 2297 -4679 -2186
1900 -2186 2750 1880 -319 -774 -1859 -414 3944 1984 -5389 -3402 6189 4667 -6109 -5482 5339
1915 5339 5655 -4031 -5245 2008 3970 -108 -2222 -1869 -72 3312 2437 -4224 -4706 4542 6579 -4089
1931 -4089 -7656 3257 8008 -1880 -7182 506 5812 977 -3465 -2010 810 2804 2017 -2939 -4648
1946 -4648 2480 6804 -1707 -8181 406 8605 681 -8054 -1864 6609 2609 -4449 -2986 1913 2781
1961 2781 952 -2009 -3434 929 5619 602 -6808 -1922 7418 3256 -7037 -4077 5875 4362 -4063
1976 -4063 -4013 1887 3106 244 -1562 -2287 -174 3759 2001 -4661 -3683 4899 4958 -4604 -5492 3807 5467
1993 5467 -2558 -4651 1382 3412 -6 -1543 -913 -432 1707 2437 -1944 -4077 1844 5197 -1537 -5774
2009 -5774 891 5538 -386 -4791 -163 3393 384 -1691 -376 -228 165 1940 372 -3341 -944
2024 -944 4323 1555 -4589 -1923 4463 2091 -3599 -1773 2513 1263 -1137 -265 -188 -851 1223 2017
2040 2017 -2107 -3157 2404 3860 -2483 -4289 2016 4014 -1589 -3323 800 2084 -189 -568 -378
2055 -378 -1093 700 2740 -554 -3979 380 4944 138 -5217 -568 4929 1128 -4016 -1383 2602
2070 2602 1425 -882 -1161 -1041 447 2581 393 -4006 -1454 4707 2400 -4979 -3153 4540 3675 -3529
2086 -3529 -3635 2133 3144 -457 -2089 -994 702 2448 1023 -3351 -2586 3858 4024 -3745 -4996 3117
2102 3117 5442 -2238 -5347 975 4423 192 -3106 -1371 1221 2160 743 -2540 -2736 2498 4403
2117 4403 -2003 -5585 1298 6141 -267 -5879 -628 5091 1589 -3544 -2068 1762 2199 284 -1902
2132 -1902 -2292 1221 3935 -373 -5055 -759 5462 1724 -5353 -2527 4537 2908 -3227 -2883 1678
2147 1678 2473 24 -1492 -1498 361 2888 1016 -3525 -2191 3987 3206 -3704 -3760 3095 3889 -2195 -3533
2164 -3533 1029 2665 -28 -1519 -960 -29 1554 1416 -1866 -2730 1859 3627 -1554 -4215 1108 4190
2180 4190 -398 -3601 -54 2684 514 -1329 -571 2 602 1492 -248 -2569 -177 3327 724 -3657
2196 -3657 -1197 3476 1408 -2984 -1522 1983 1166 -972 -696 -165 -87 1158 943 -1886 -1750 2309 2535
2213 2535 -2304 -2852 2075 2970 -1450 -2606 903 2016 -129 -891 -443 -298 886 1478 -1117 -2604
2229 -2604 950 3394 -679 -3849 149 3711 303 -3235 -747 2305 998 -1056 -1098 -249 788 1654
2245 1654 -257 -2725 -300 3561 1138 -3786 -1744 3662 2256 -3053 -2481 2085 2309 -893 -1845 -420
2261 -420 1003 1594 -40 -2545 -1187 3021 2217 -3190 -3045 2857 3623 -2177 -3678 1316 3385 -146
2277 -146 -2504 -748 1411 1569 -31 -2014 -1423 2198 2729 -2005 -3715 1451 4223 -798 -4373 -196
2293 -196 3803 786 -2973 -1441 1544 1669 -136 -1648 -1351 1335 2675 -666 -3560 -2 4078 852
2309 852 -3992 -1433 3601 1936 -2646 -2042 1470 1979 -184 -1475 -1108 726 2137 144 -2867 -1127
2325 -1127 3065 1857 -3109 -2558 2590 2682 -1838 -2633 1021 2136 -59 -1348 -777 326 1429 796
2341 796 -1724 -1773 1841 2641 -1532 -3048 1097 3151 -530 -2894 24 2129 451 -1227 -710 94
2357 94 735 990 -681 -1904 346 2574 97 -2899 -552 2824 938 -2410 -1069 1738 1184 -784
2373 -784 -823 -131 465 1004 215 -1618 -884 2082 1384 -2232 -1866 1928 2025 -1513 -2065 880 1600 -256
2391 -256 -1038 -394 221 944 733 -1166 -1538 1176 2309 -916 -2771 713 2865 -124 -2571 -299 2027
2408 2027 741 -1191 -1005 133 940 880 -778 -1929 314 2498 116 -2988 -783 2918 1211 -2613
2424 -2613 -1537 1846 1667 -954 -1472 -20 1125 1027 -419 -1783 -268 2400 1058 -2539 -1787 2440
2440 2440 2312 -1986 -2590 1298 2449 -535 -2084 -331 1310 1067 -441 -1619 -661 1796 1604 -1790
2456 -1790 -2454 1427 2910 -945 -3095 308 2903 380 -2258 -825 1493 1317 -332 -1409 -673 1327
2472 1327 1704 -919 -2476 458 2900 124 -3085 -667 2731 1171 -2171 -1452 1277 1455 -346 -1273
2488 -1273 -598 829 1515 -232 -2142 -452 2483 1144 -2357 -1584 2138 1891 -1590 -1895 890 1664
2504 1664 -63 -1231 -640 481 1176 332 -1492 -1095 1554 1694 -1458 -2137 1052 2280 -517 -2115
2520 -2115 34 1708 399 -964 -658 244 921 613 -771 -1281 671 1964 -264 -2191 -75 2174
2536 2174 504 -1952 -742 1428 866 -851 -869 35 588 611 -257 -1305 -254 1616 674 -1854 -1171
2553 -1171 1727 1476 -1270 -1523 903 1363 -270 -988 -283 553 855 134 -1136 -854 1228 1389 -1097
2570 -1097 -1880 786 2051 -409 -2008 -47 1621 440 -1128 -813 410 931 337 -859 -1123 714
2586 714 1716 -317 -2076 -92 2315 523 -2064 -876 1636 1184 -968 -1174 211 1060 536 -730
2602 -730 -1220 245 1765 345 -1960 -954 1941 1363 -1640 -1715 1180 1752 -559 -1571 -75 1218
2618 1218 775 -529 -1212 -127 1526 858 -1505 -1462 1352 1940 -943 -2200 469 2138 12 -1795
2634 -1795 -561 1196 853 -543 -1121 -303 1140 1050 -939 -1661 588 2067 -190 -2182 -296 2105
2650 2105 757 -1670 -1033 1117 1216 -335 -1071 -366 877 1036 -455 -1578 -131 1816 582 -1928
2666 -1928 -1065 1552 1296 -1239 -1492 580 1269 -64 -1048 -502 580 1014 59 -1206 -573 1311 1143
2683 1143 -1131 -1486 909 1711 -515 -1607 91 1371 358 -939 -672 344 808 235 -820 -838 601
2700 601 1308 -501 -1600 41 1676 256 -1547 -606 1171 708 -676 -833 151 756 488 -424 -950
2717 -950 164 1310 295 -1417 -675 1413 1016 -1162 -1172 687 1142 -256 -1003 -299 621 633 -174 -975
2735 -975 -359 1106 823 -1003 -1217 851 1504 -496 -1461 130 1326 253 -1048 -529 579 820 39
2752 39 -794 -636 759 1076 -550 -1484 164 1582 180 -1605 -551 1293 799 -892 -961 329 949
2769 949 259 -789 -759 444 1299 -47 -1443 -412 1529 833 -1305 -1104 1056 1276 -561 -1211 56
2786 56 1014 451 -671 -839 141 1097 352 -1214 -913 1102 1184 -872 -1471 496 1528 -33 -1347 -268
2804 -268 1009 613 -537 -866 -2 1013 648 -868 -1046 671 1396 -360 -1517 -64 1481 440 -1291
2821 -1291 -749 795 915 -400 -966 -269 730 670 -531 -1117 95 1342 260 -1391 -609 1276 981
2838 981 -954 -1058 605 1068 -5 -884 -392 652 739 -150 -1018 -225 1035 665 -1014 -1030 780 1220
2856 1220 -511 -1302 84 1117 221 -821 -592 444 721 78 -761 -483 709 902 -520 -1197 283
2873 283 1305 123 -1188 -387 976 609 -573 -749 150 678 325 -602 -784 254 996 -2 -1134 -385
2891 -385 1061 619 -963 -875 674 965 -318 -837 -141 706 452 -352 -782 6 956 454 -897 -746 792
2910 792 968 -578 -1206 226 1053 56 -927 -463 576 622 -219 -775 -297 760 726 -599 -1002 354 1165
2929 1165 -20 -1159 -294 1083 636 -763 -699 375 796 55 -726 -511 537 804 -268 -1085 -84
2946 -84 1058 439 -1106 -719 852 855 -562 -992 124 877 246 -650 -657 331 890 80 -977 -418 1020
2965 1020 747 -734 -941 515 1089 -167 -1040 -170 872 506 -509 -697 138 834 220 -804 -726 590
2983 590 943 -387 -1114 50 1152 197 -1003 -506 690 694 -366 -755 -89 701 484 -473 -700 233 993
3002 993 20 -1064 -392 999 540 -815 -790 426 824 -121 -779 -321 545 514 -371 -755 2 869 362
3021 362 -845 -649 696 913 -341 -919 153 880 179 -693 -449 394 620 1 -743 -319 651 630 -523
3040 -523 -959 265 1002 6 -983 -314 791 555 -515 -667 141 689 192 -570 -545 418 761 -129 -828
3059 -828 -107 920 378 -782 -560 550 709 -306 -689 17 584 339 -448 -638 185 724 124 -849 -425
3078 -425 697 662 -513 -818 262 904 29 -772 -293 539 536 -254 -611 -109 678 431 -554 -658 384 819
3098 819 -158 -922 -176 862 347 -700 -550 344 607 -69 -662 -282 520 628 -381 -793 58 899 189
3117 189 -847 -357 729 611 -452 -714 246 781 125 -625 -343 405 658 -198 -772 -196 760 425 -674
3136 -674 -722 429 768 -222 -814 -148 714 358 -483 -525 235 706 121 -620 -367 579 698 -323 -801 100
3156 100 857 135 -784 -391 529 494 -308 -703 -73 615 280 -571 -540 308 721 -152 -823 -203 708 410 -643
3177 -643 -531 354 631 -81 -604 -113 553 404 -326 -582 162 718 175 -664 -468 590 604 -359 -739 102
3197 102 694 122 -606 -417 350 550 -177 -588 -200 562 419 -464 -542 322 729 -69 -699 -127 629 404
3217 404 -458 -452 215 596 49 -551 -309 446 524 -263 -711 -26 655 140 -638 -419 494 494 -274 -637 44 621
3239 621 233 -395 -418 233 644 10 -676 -228 631 476 -465 -587 215 677 -54 -588 -221 517 419 -347 -515
3260 -515 34 596 203 -517 -440 411 624 -250 -675 29 642 194 -580 -413 398 487 -145 -530 -112 504 353
3281 353 -364 -500 208 629 43 -653 -238 585 406 -453 -581 118 501 -15 -508 -276 413 440 -209 -561
3301 -561 -66 596 241 -518 -426 422 587 -216 -598 -26 596 259 -427 -414 273 576 -75 -544 -220 459 439
3322 439 -364 -564 166 598 10 -621 -214 469 321 -368 -444 112 505 142 -416 -394 348 530 -144 -539 -91
3343 -91 580 278 -516 -428 312 469 -154 -548 -117 420 319 -347 -512 119 520 41 -578 -276 496 389 -341
3364 -341 -569 139 523 99 -467 -277 395 434 -211 -451 -46 495 222 -444 -452 278 511 -142 -585 -144 488
3385 488 216 -375 -376 210 483 -41 -493 -148 425 384 -279 -522 135 561 92 -511 -259 413 396 -286 -513
3406 -513 77 542 135 -345 -357 328 475 -149 -563 -85 466 266 -464 -484 263 454 -109 -548 -98 430 371
3427 371 -340 -405 148 476 139 -409 -272 462 423 -229 -466 50 525 86 -404 -343 346 423 -176 -476 -64
3448 -64 435 173 -432 -380 165 478 -124 -524 -126 459 275 -373 -402 194 484 19 -452 -142 389 383 -266 -438
3470 -438 68 496 118 -457 -261 410 423 -213 -485 20 516 134 -401 -319 277 428 -132 -514 -75 468 222
3491 222 -332 -431 210 515 40 -458 -134 454 315 -246 -398 173 455 -2 -464 -254 316 370 -173 -472 19
3512 19 448 128 -390 -339 313 357 -170 -393 -39 406 227 -251 -342 147 429 -4 -432 -145 483 260 -301
3533 -301 -421 210 425 -26 -417 -179 314 295 -217 -426 39 424 136 -435 -286 273 423 -124 -472 -26
3553 -26 433 158 -349 -328 271 464 -76 -368 -93 408 314 -242 -414 165 436 22 -457 -167 312 358 -263
3574 -263 -391 43 372 53 -395 -228 279 347 -173 -453 -19 455 188 -340 -269 284 429 -93 -419 24 373
3595 373 150 -291 -317 189 359 -53 -418 -124 344 293 -330 -415 96 399 -22 -383 -190 335 311 -161 -352
3616 -352 71 382 181 -286 -262 250 419 -101 -438 -57 379 128 -369 -368 226 357 -81 -346 -161 346 167
3637 167 -258 -357 100 420 19 -391 -131 326 321 -125 -325 162 430 103 -336 -149 281 360 -96 -358 -59
3658 -59 385 178 -299 -293 180 299 -101 -408 -98 327 200 -268 -329 90 357 -4 -393 -153 298 277 -138 -294
3680 -294 33 405 144 -340 -181 318 301 -105 -364 54 357 172 -287 -277 171 338 -61 -407 -95 302 235
3701 235 -268 -329 145 347 -56 -356 -107 314 238 -174 -328 78 366 37 -331 -200 265 276 -139 -375 21
3722 21 387 110 -331 -222 236 290 -91 -350 -30 375 186 -287 -310 159 350 -37 -399 -104 326 220 -189
3743 -189 -309 154 393 55 -290 -135 296 325 -161 -335 6 304 113 -339 -254 187 271 -127 -291 43 342
3764 342 120 -305 -202 183 357 -26 -348 -41 342 215 -237 -258 208 379 57 -330 -162 342 210 -194
3784 -194 -332 76 331 109 -328 -195 228 257 -168 -368 27 291 109 -290 -233 184 245 -73 -351 -74 317
3805 317 155 -257 -227 168 354 -36 -301 -71 254 183 -179 -261 60 315 9 -283 -160 217 225 -152 -329 14
3827 14 255 128 -289 -233 118 238 -97 -384 -21 325 124 -209 -208 120 308 9 -313 -83 268 203 -184 -255
3849 -255 114 294 -34 -294 -156 256 270 -137 -319 -6 291 114 -249 -185 194 266 -85 -244 -7 330 96
3870 96 -240 -133 137 266 -34 -327 -47 284 237 -218 -308 48 337 -26 -317 -131 233 231 -230 -268 16 304
3892 304 85 -258 -154 194 272 -68 -228 26 339 153 -253 -187 217 301 -44 -253 -36 314 124 -195 -204 120
3914 120 307 -39 -331 -121 222 180 -194 -341 30 305 4 -284 -158 228 260 -140 -233 22 355 148 -243
3935 -243 -204 159 273 -70 -291 -70 293 179 -271 -192 117 251 -41 -254 -120 238 150 -199 -272 142 301
3956 301 -33 -251 -111 278 115 -130 -269 2 326 -25 -241 -109 175 232 -69 -321 -36 265 123 -230
3976 -230 -194 129 250 -82 -250 -8 208 165 -196 -243 97 282 62 -248 -121 238 228 -142 -252 73 264
3997 264 19 -264 -160 182 222 -82 -230 -1 248 99 -225 -149 178 217 -67 -272 -65 180 68 -228 -183
4018 -183 131 257 13 -228 -75 220 191 -110 -178 72 259 82 -242 -112 211 177 -127 -246 59 225 78
4039 78 -226 -181 97 144 -111 -316 -89 203 149 -206 -174 91 223 -44 -241 -40 203 153 -132 -182 121 264
4061 264 67 -188 -105 189 172 -74 -255 52 231 143 -223 -112 175 179 -80 -229 -7 221 82 -244 -171 113
4083 113 253 -25 -223 -57 232 140 -157 -207 80 202 29 -253 -78 204 156 -120 -225 22 207 52 -208
4104 -208 -160 170 173 -102 -266 -11 229 131 -193 -184 110 237 -34 -243 -24 242 123 -147 -195 127 266 56
4126 56 -268 -103 203 128 -123 -220 37 265 18 -239 -113 138 163 -91 -227 -11 256 72 -137 -175 133 251
4148 251 -25 -156 53 236 69 -115 -182 125 269 -12 -226 -81 154 195 -177 -199 95 257 -29 -236 -94
4169 -94 163 162 -73 -161 9 149 63 -188 -123 156 209 -81 -196 6 208 86 -147 -162 124 248 -37 -159 -49
4192 -49 222 134 -124 -215 31 242 -9 -195 -110 208 139 -121 -200 41 191 80 -192 -100 143 186 -59 -187 13
4215 13 161 91 -191 -139 108 225 -76 -207 -53 205 88 -149 -131 91 194 -12 -247 -73 135 153 -97 -225
4237 -225 43 221 49 -232 -59 218 178 -78 -200 -34 231 157 -144 -65 158 184 -90 -151 4 218 125 -182
4259 -182 -191 133 196 -34 -212 -95 137 140 -86 -178 59 231 19 -235 -91 167 161 -134 -199 130 226 0 -144
4282 -144 -107 141 153 -87 -164 -44 195 37 -195 -177 89 129 -40 -262 -88 178 122 -183 -185 49 218 -70 -156
4305 -156 -75 163 115 -107 -118 70 243 31 -182 -90 163 201 -58 -177 29 148 58 -143 -112 150 179 -64 -155
4328 -155 -61 155 101 -126 -154 89 154 27 -175 -45 177 105 -108 -142 37 185 23 -151 -101 171 220 -92 -190
4351 -190 27 147 60 -171 -159 84 145 -67 -158 -60 170 101 -113 -169 87 206 3 -156 -35 181 129 -139 -118
4374 -118 28 164 35 -156 -55 130 110 -66 -191 -43 125 79 -169 -125 86 95 -59 -144 -8 136 150 -103
4396 -103 -86 103 128 -44 -177 -22 219 130 -158 -205 128 212 28 -200 -101 129 128 -140 -115 17 172 57 -145
4419 -145 -143 68 104 -47 -112 -22 168 48 -181 -94 102 171 -17 -141 -14 129 78 -73 -171 93 119 17 -168
4442 -168 -98 125 71 -80 -168 81 161 -17 -199 -107 105 125 -133 -155 46 148 4 -124 -166 112 102 -77 -135
4465 -135 -2 170 35 -140 -74 98 150 -20 -102 -23 161 90 -93 -117 64 170 -28 -166 -61 175 67 -101
4487 -101 -140 24 186 88 -126 -91 145 106 4 -147 -25 213 52 -161 -96 83 166 -19 -128 -33 131 51 -71
4510 -71 -115 78 127 30 -172 -84 154 90 -53 -130 53 195 -1 -133 -36 109 150 -47 -165 53 183 126 -133
4533 -133 -89 41 162 -47 -181 -74 132 45 -111 -100 63 136 -19 -114 -69 139 121 -73 -139 6 155 46 -137
4556 -137 -32 73 151 -25 -102 48 168 34 -129 -75 50 112 -46 -143 -12 81 59 -129 -121 99 183 -48 -161
4579 -161 -66 119 124 -117 -154 67 112 16 -90 -40 88 133 -70 -136 24 186 15 -133 -60 109 99 -29 -161 -43
4603 -43 84 29 -105 -152 83 117 26 -171 -36 216 107 -147 -124 47 147 22 -134 2 128 71 -39 -72 47
4626 47 100 34 -96 -99 112 75 -80 -106 -32 157 43 -162 -55 97 76 -69 -153 -7 156 123 -70 -107 4 196
4650 196 51 -162 -16 178 136 -52 -117 69 110 -21 -119 -52 95 111 -74 -157 1 123 68 -43 -124 73 87
4673 87 -114 -131 -43 47 98 -96 -60 59 129 9 -99 -20 111 86 -68 -110 45 103 2 -135 8 101 67 -54
4697 -54 -62 -13 140 60 -82 -68 63 115 -38 -118 2 119 27 -101 -33 102 78 -14 -114 -26 63 61 -29 -126 29 149
4723 149 44 -165 -35 90 106 -47 -82 -3 126 -32 -103 -69 122 173 -34 -60 36 165 61 -76 -113 84 83 -64
4747 -64 -143 -46 110 46 -97 -139 15 119 14 -153 -77 72 128 -37 -117 2 154 65 -90 -101 118 159 -18 -124
4771 -124 27 129 94 -21 -57 100 123 -57 -121 20 119 140 -153 -46 32 101 -41 -140 -38 75 80 -118 -100 22
4795 22 99 -20 -114 -80 76 111 0 -144 90 158 92 -79 -43 82 80 -14 -90 -9 135 24 -44 -69 66 91 -18
4820 -18 -148 24 107 68 -106 -113 56 73 -20 -111 -7 87 38 -40 -95 41 133 88 -136 -54 41 36 -23 -122 -8 109 7
4847 7 -35 -78 58 100 22 -69 -5 42 87 -93 -94 116 105 39 -164 -17 103 140 -8 -44 34 115 13 -114 -10 85
4873 85 118 -45 -119 -14 130 56 -64 -87 51 58 -3 -40 -22 32 45 -65 -77 7 82 -10 -107 -44 95 56 -56 -14 58
4900 58 102 30 -46 -48 114 63 0 -73 -18 67 77 -71 -84 98 145 -47 -82 -16 118 22 -93 12 64 14 15 -81 1 36
4928 36 107 -62 -65 69 102 54 -125 -41 107 134 -63 -78 25 78 63 -70 -52 19 110 -38 -129 -22 76 57 -136 -38
4954 -38 60 102 -45 -101 -26 121 21 -59 -63 43 48 -25 -63 -65 84 112 -45 -86 7 111 -33 -119 -13 36 58 -21 -84
4981 -84 -31 87 61 -73 -39 98 105 -2 -70 -3 130 46 -39 -15 30 60 -31 -16 -2 64 23 -12 -35 40 96 9 -121 -87
5009 -87 42 36 -34 -81 4 88 -9 -62 -47 59 49 -32 -36 -4 60 21 -82 -68 88 64 7 -132 30 104 61 -7 -18 88
5037 88 49 -10 -22 -33 17 87 -33 -75 7 48 9 -64 -63 86 52 -70 -88 43 77 40 8 -63 7 4 -24 -36 -6 61 102
5066 102 -30 -40 96 78 1 -44 6 100 69 -47 -67 -13 45 76 -128 -83 74 95 -40 -95 28 104 51 -66 -69 45
5092 45 79 -58 -49 -9 84 50 3 -69 45 111 9 -51 -40 134 69 -15 -85 23 89 22 -65 -40 31 75 -22 -92 48 122
5120 122 63 -46 -12 131 87 -77 -127 -5 126 24 -60 -53 -14 70 -48 -124 -36 90 33 -77 -99 71 78 24 -49 -14
5146 -14 111 47 -80 -95 33 67 36 -67 -33 64 82 6 -115 18 106 29 -55 18 91 68 -90 -19 -26 34 27 -71 -25 -7
5174 -7 41 27 -60 4 73 29 -42 -80 59 57 -14 -33 -11 90 20 30 20 -27 40 -12 -58 -17 18 65 -54 -66 -6 64 26 7
5204 7 -62 37 65 34 -36 -3 18 56 25 -90 2 89 59 -71 4 75 46 -38 -9 49 50 22 -66 -36 31 75 -38 -41 -19 93
5234 93 56 -26 -83 49 106 -9 -10 -12 25 42 -11 -105 -22 20 72 -10 -46 36 94 -34 -103 5 92 15 -108 -36 59 31 -59
5263 -59 -20 -19 52 57 -65 -79 53 85 12 -112 -1 130 41 -66 -40 34 97 7 -39 9 6 53 -44 -64 -10 96 32 -111
5291 -111 -30 93 61 -47 -93 -33 82 36 -31 -61 43 40 -63 -85 -44 86 53 -26 -41 75 80 -17 -52 19 91 -7 -72
5318 -72 -42 69 43 19 -54 -55 8 109 -9 -93 -1 73 -23 -71 -65 74 47 -83 -68 17 41 75 -7 -74 47 39 -41 -68 -54
5347 -54 3 -17 -70 -16 58 36 -7 -34 -9 42 -5 -63 -61 19 18 60 -65 -63 1 62 -8 -36 70 61 36 -57 0 38 6 -21 -42
5378 -42 -3 55 13 -25 -56 -41 41 -24 -65 -76 -14 -12 5 -10 49 73 -14 -6 13 35 7 0 -51 -27 78 51 -67 -101 81 62
5408 62 -63 -48 -11 83 -3 -65 -57 9 -20 13 -62 -29 -10 18 -31 -97 23 40 18 -36 -43 42 14 -11 -29 -26 94 27 -27 -72
5438 -72 34 109 45 -112 -40 68 17 -63 -18 45 93 -25 -45 22 28 15 -30 -57 9 23 42 -84 -60 105 81 -32 -57
5465 -57 60 76 50 -76 9 63 85 0 -45 6 84 -15 -53 -70 72 85 -9 -72 25 120 13 -39 -41 42 55 -27 11 0 40
5494 40 94 14 -32 28 95 -32 -107 8 79 42 -61 -45 21 72 -41 -27 -29 -2 73 -10 -70 -18 60 32 -51 -32 90 30
5522 30 24 -57 20 57 10 -11 -58 85 62 34 -4 10 51 27 41 -53 26 63 13 -39 -33 -20 -20 -57 -12 16 -23 -4 33 -11 -3 86
5554 86 67 -43 11 64 67 8 -54 63 -16 10 28 25 -8 29 56 11 -37 76 53 -48 -18 17 23 13 -15 6 23 13 21 -32
5584 -32 -31 72 -3 -44 -101 38 71 -4 -17 21 58 12 19 9 74 76 17 -28 -30 71 54 6 -51 27 81 14 -26 -4 102 38
5614 38 -56 -25 111 53 -12 -35 31 58 52 4 -77 -9 154 24 -96 -50 22 48 -63 -60 19 51 -25 -52 20 72 29 -58 -43
5643 -43 -33 40 105 -56 -70 95 100 -77 -20 21 83 34 -55 24 42 19 -35 -51 41 52 43 -14 -22 -29 112 17 -96 -31 74
5672 74 37 -40 -5 -9 -26 27 -41 -65 76 7 -8 -54 29 83 0 -42 -32 59 -3 -28 1 -16 3 -26 10 -28 -21 21 80 -41
5702 -41 -3 69 34 -56 9 -15 39 -15 -32 -6 39 -11 -40 13 -15 10 17 -14 -16 70 19 -57 -47 -6 18 3 -76 -6 77 39 1
5733 1 -34 -15 9 60 13 -33 -16 79 12 -78 -42 63 12 -28 13 -4 17 23 -30 -7 1 -1 70 -36 4 -10 50 -38 -43 13 83 -28
5765 -28 -70 -4 26 42 -11 -26 -27 60 35 -44 -77 46 80 14 -35 31 110 68 -36 22 91 11 -37 -54 -12 17 56 3 -21 2
5795 2 60 41 -34 -52 14 16 -22 -17 46 47 -20 -6 16 68 -4 -36 -35 -24 53 24 -29 -57 47 83 -49 -67 26 79 6 -58 12 69
5827 69 34 -16 11 -22 -19 33 15 1 15 90 -56 -78 13 49 15 -58 -32 25 33 -24 2 39 44 34 -28 -15 6 62 48 -80 18
5858 18 58 2 -5 -14 46 75 -4 45 29 42 80 32 -6 63 71 32 -2 -43 7 106 -62 27 5 45 27 -7 51 8 22 -4 -43
5889 -43 -26 2 20 29 -41 16 68 50 -15 2 27 60 5 -22 30 36 36 -16 -22 8 9 -2 -2 -42 25 17 23 -12 -37 21 -25 41 -25 -71
5923 -71 49 54 12 -51 16 113 -35 -84 -1 33 40 -60 24 50 15 18 38 8 45 19 15 -13 16 101 60 -75 0 81 24 -13
5953 -13 -24 58 9 -51 -20 41 102 20 13 -36 3 54 40 -23 -18 88 46 -59 -44 -4 23 -4 -73 -11 3 10 -10 -23 -17 47 3
5984 3 -34 -31 -29 72 -28 -51 7 101 -23 -94 55 66 40 -23 -5 23 4 22 -74 -65 33 38 -36 -112 27 66 -62 -79 -21 -19
6014 -19 -2 -65 -13 71 33 43 -22 -12 10 100 8 -40 2 37 -19 -13 2 50 52 -62 -2 24 21 -16 -3 -64 -11 42 13 -71 -36
6045 -36 43 3 -21 -43 19 -6 2 -37 -3 66 4 -14 32 -58 -18 72 -61 56 7 5 12 29 -17 21 36 12 12 45 -23 -11 -30
6076 -30 30 -20 1 39 -51 -11 19 63 17 31 -7 26 -10 -20 37 -16 0 11 -35 -34 30 57 -20 -63 -61 104 -11 -43 -33 14
6106 14 -13 -47 -5 14 43 43 -14 -14 32 71 8 2 -45 43 41 -15 -18 63 80 -44 1 -3 27 28 -22 -48 -46 40 -22 -54 -31 76 2
6139 2 -97 -81 26 24 -12 -3 -10 19 -3 -9 38 55 45 20 -6 -30 97 20 -31 -49 23 91 -11 -76 23 35 37 6 -13 -48 -14 -10
6171 -10 -54 -33 5 -12 -54 -35 27 38 19 -51 22 35 24 23 -15 16 39 54 -7 -29 6 6 15 -32 46 2 17 -50 -46 59 4 -45
6203 -45 -36 35 -22 7 -8 11 -6 9 -6 -16 -19 5 -3 -26 -39 63 11 12 3 -3 70 5 9 -17 -11 33 9 52 27 -18 3 12 -108 -3
6237 -3 50 -18 -3 -43 9 -26 -49 34 4 -39 20 52 -54 -42 86 117 -33 -33 -17 -5 -44 -9 19 -51 24 -3 -17 -48 43 34
6267 34 -13 -10 20 57 31 56 -7 28 24 28 28 24 31 15 -5 -33 14 36 -26 -56 -25 46 100 -67 -14 8 34 -6 -35 -1 13 0 -51
6300 -51 -92 11 33 11 -31 -9 91 34 -50 -37 87 59 -43 -52 -22 9 -41 40 -39 3 -19 -23 -79 -54 36 53 -56 -40 66
6329 66 51 -44 -73 23 34 -29 -16 20 24 22 -19 13 -17 45 89 -19 -38 18 59 17 -29 23 74 10 -33 -9 -28 -9 -21 19 -50
6360 -50 45 9 -22 -14 32 42 26 -77 20 56 40 -104 -23 -9 -49 -14 -29 -13 7 6 0 8 -2 26 30 -14 -32 -10 -19 -18 42 55 -3
6393 -3 -45 -15 33 17 -50 39 37 -4 19 -17 50 3 8 41 -34 -2 47 32 28 -40 71 -22 -6 -16 27 -31 -67 -17 -2 49 9 -31
6425 -31 16 -20 -44 -4 29 -32 24 -6 -25 8 71 22 -47 48 33 28 5 1 36 26 -7 68 6 -15 4 31 29 9 36 -6 -37 -8
6457 -8 81 83 -62 -26 45 -52 -36 3 62 40 44 44 -28 -47 8 35 -26 -33 62 34 -29 16 58 47 -10 -56 -7 -23 14 -33 -28 -2 -10
6490 -10 -13 -78 13 40 54 -31 -16 49 74 33 -38 5 11 41 -50 22 -4 8 -8 -57 -47 8 50 -31 -69 -21 94 3 -57 -13 56
6521 56 35 -4 -53 58 68 -31 24 -28 69 -5 28 -3 4 24 -7 -3 21 46 -9 -42 -28 17 17 -53 -20 6 -9 29 -46 -27 -68
6552 -68 6 -8 -37 27 44 56 -19 -35 19 54 -34 8 7 45 -45 25 32 -23 -40 95 -10 6 -11 -20 4 -15 8 42 29 -6 27
6583 27 13 25 7 38 -10 -5 30 46 -13 -79 -15 33 -25 -4 -19 -34 16 55 -18 -74 -29 25 -15 -24 -1 96 29 -9 33 2 -23
6614 -23 -64 11 -2 -20 17 22 0 9 46 19 -38 -25 64 15 -48 -82 24 -52 -19 3 -9 0 32 -36 -12 23 39 10 28 -24 66
6645 66 15 -7 -25 27 59 -16 -28 16 10 63 -15 23 31 30 25 14 -2 35 57 -5 -50 8 16 -12 -52 30 54 -10 -12 -7 -4 42 -12 9
6679 9 -25 -12 22 9 7 -2 41 17 -85 49 -19 -11 -11 39 33 45 -9 6 -6 -14 7 -30 2 38 10 -5 8 7 32 62 -2 53 24
6712 24 7 -2 -6 17 -24 53 49 -37 29 -18 20 -25 -60 46 -4 8 -21 19 6 1 -41 32 12 -25 20 65 23 15 60 -11 6 30
6744 30 51 9 -73 35 40 -43 -7 37 -13 38 -29 47 -7 -69 19 13 10 -51 -20 9 -34 -1 20 0 6 10 37 -18 2 23 53 -19
6776 -19 10 21 43 -4 -47 94 -8 -55 -27 -6 -27 -5 33 10 -23 63 0 2 12 -10 55 0 -10 28 -45 -33 -30 -25 2 -12 -20
6807 -20 -13 -34 40 30 -5 -8 15 36 -42 0 11 47 4 4 -17 55 25 -12 33 40 52 -4 -5 11 -3 17 -33 -11 51 69 -95 -56
6839 -56 -1 50 -14 -44 -12 27 11 15 -24 -85 18 48 -25 1 19 24 -22 -49 2 30 -25 -33 19 -42 38 -48 29 -31 38 2 -20
6870 -20 20 21 -4 15 -44 -36 12 9 7 -42 -3 -20 49 -2 -17 -41 -17 -44 -19 -18 -10 0 -57 55 62 -6 -28 -6 24 -3 -10 54 14 1
6904 1 20 15 42 -17 -37 -3 -22 -7 23 -21 14 -26 9 11 15 -38 102 35 5 -17 12 19 4 -39 52 -26 10 4 39 23 26 0 11
6937 11 -5 -18 12 -13 -4 33 -5 -43 -16 12 -32 7 -21 -11 20 15 19 -30 -47 48 22 18 -24 29 37 10 -36 32 34 -49 10 -12 20
6970 20 -11 18 8 8 -21 9 -6 -48 2 32 -12 -18 14 41 11 -5 79 21 13 -48 3 44 31 -13 46 47 28 4 -17 -76 50 -39
7002 -39 16 1 9 53 10 -15 -35 55 34 -27 -13 8 -16 3 11 -3 22 -2 -8 -68 23 98 19 -12 -3 62 29 -11 -8 13 53 -15 -36
7035 -36 24 26 15 -13 18 10 60 19 17 0 2 -5 -72 -3 58 -13 35 14 -3 -22 28 -8 -7 18 -9 -16 17 -12 25 11 -48 30 37 18
7069 18 -6 13 -16 24 -21 7 22 -35 32 4 30 -36 6 8 11 -17 23 24 -16 -2 -17 20 -34 -10 1 -38 -15 -34 -12 33 24 -20
7101 -20 20 12 52 -11 -23 -2 46 10 40 10 57 24 -22 20 22 67 12 60 45 7 8 52 -43 -13 28 -26 -34 33 14 20 -55 -17 -2
7134 -2 46 -10 -2 -7 41 27 -31 34 -58 36 37 19 -14 42 3 -41 13 37 51 36 -17 20 33 -21 -10 17 -11 57 -9 -3 -65 49
7166 49 -35 -13 -29 14 26 -3 -34 3 28 -40 -21 -35 -7 85 -35 -55 -4 56 27 -7 18 25 36 -8 2 10 91 8 -26 10 11
7197 11 -18 18 18 42 0 17 -7 20 -70 44 58 -7 -20 16 29 20 -9 42 30 -45 25 -61 -3 11 27 0 26 26 -9 9 -4
7228 -4 3 9 -33 36 32 37 -25 -4 2 93 2 8 -12 -14 -24 -24 14 55 30 -7 22 7 -21 18 -33 -41 -28 35 12 -40 24 22 -6 -71 33
7263 33 -11 33 -28 9 -27 6 6 7 25 23 30 -28 28 25 -2 -40 18 18 -24 -37 29 -10 -4 -6 -18 19 27 -17 56 -2 51 -49 21 -46
7297 -46 21 30 7 -47 -39 39 3 35 -34 -15 12 -15 50 0 27 64 33 -16 31 18 24 -43 -14 19 43 -2 67 -34 18 -8 -8 14
7329 14 2 -14 9 -4 15 17 -1 19 37 2 -44 5 11 -6 38 -18 32 16 34 3 11 17 48 -8 5 45 -5 17 27 1 -13 8
7361 8 6 32 -18 -8 2 48 -12 21 59 22 6 -17 42 11 -13 31 27 -5 47 -1 -39 -2 -13 -23 -10 -26 19 -1 -14 17 -54 24
7393 24 -22 -31 -9 -15 20 16 21 31 34 9 -11 2 3 -9 -21 34 24 -34 21 10 -14 -21 -1 0 -27 12 -9 30 -32 -59 12 24 -25 -22 29
7428 29 45 29 -20 21 40 -1 5 2 26 2 -20 22 36 -13 1 3 15 47 6 -43 -16 37 19 -13 -1 54 4 -46 -65 35 1
7459 1 11 67 -25 14 -11 41 43 43 25 13 -14 -15 -10 7 -31 -12 33 28 9 30 -62 3 24 -12 31 12 48 38 -18 -15 23 81 3 -48
7493 -48 -3 53 -47 46 -9 -9 24 -16 -2 16 46 16 11 -53 -13 -16 -20 -88 -20 22 -38 -23 -31 74 37 -25 -46 -2 -11 67 -15 12
7525 12 32 -15 40 -8 -18 36 17 -2 31 5 48 -46 20 35 -28 -26 32 47 -8 -6 40 22 -14 -22 56 -12 28 31 -2 -48 40 20
7557 20 12 -31 33 23 31 -28 16 10 56 -43 -18 1 -27 54 11 4 18 31 40 -32 -13 16 -4 17 20 -3 13 36 -16 -40 -5 4 2 -17
7591 -17 8 4 33 5 12 -15 -31 -12 -13 -5 -2 -13 33 15 6 44 -17 47 -24 -17 1 20 -7 44 51 46 -26 48 57 7 2 44 -1 17 -43 -6
7627 -6 43 -11 -19 15 -37 16 -42 -29 -4 -41 16 5 31 40 29 -2 17 8 38 34 5 64 17 75 55 38 14 -6 -20 -14 -14 68 44 -14
7661 -14 5 42 65 -23 24 16 45 -20 64 30 13 -6 4 20 27 -26 41 -11 12 -8 21 9 -21 30 58 53 40 6 28 20 56 83
7693 83 11 51 -10 -6 -37 -37 -27 21 9 -23 29 17 6 43 12 -31 0 33 -4 -16 -11 -7 -17 11 -7 20 64 30 12 39 -24 19
7725 19 16 16 6 -30 1 13 5 -26 -5 3 22 52 6 -9 -5 55 57 -18 49 54 23 25 54 49 23 -9 -19 3 55 10 -64 -60 -29 -16 31
7760 31 -27 33 15 -32 -23 7 9 -36 -7 -12 -22 -9 -20 50 9 19 -2 -8 -11 13 4 -14 -22 1 -38 19 -4 39 -2 0 -8 39 16 -8 32
7795 32 -23 30 -1 46 51 -26 -2 -12 -8 14 -4 -5 50 -2 -5 81 65 -75 -23 27 79 30 -1 -37 -12 10 7 8 48 1 16 -4 22
7828 22 -7 17 26 32 47 -6 -7 38 68 0 3 52 11 15 -18 14 1 -31 34 21 -24 -18 -12 91 55 19 65 42 -20 -22 35 19 -7 21
7862 21 61 20 16 -41 5 26 -24 50 -28 49 24 12 -29 30 38 36 47 -24 -65 17 -5 0 51 17 -38 -13 -20 7 45 -31 -5 0 -7 6
7896 6 -45 -48 41 46 -6 21 8 12 20 12 -10 -20 -2 2 -11 69 69 -29 -14 -13 52 58 -31 -19 33 40 -32 -38 -16 10 48 45 -23 -82 -4 -40 14
7933 14 -27 -69 -11 12 25 28 36 -16 -13 3 8 -33 -19 13 15 -38 13 2 -32 4 27 -14 28 13 -20 -23 -7 -2 38 -8 -35 10 -1 53
7967 53 -4 -12 31 -7 6 -27 -8 -7 -2 -86 -36 -37 21 62 -43 24 5 0 56 17 -6 -11 53 -9 20 49 40 9 -29 51 38 46 -15 -11
8001 -11 15 7 70 -4 10 58 -18 10 -9 -10 -14 65 26 12 34 29 -19 27 14 -12 57 -10 -23 -9 4 -6 36 76 24 58 56 1 28
8034 28 5 -92 -4 51 5 -18 28 -1 44 28 -29 31 -4 14 -71 16 -18 -14 62 20 12 42 -49 -20 53 -5 34 50 15 36 -1
8065 -1 14 40 11 -7 26 -45 40 -15 -48 -9 2 3 -7 -31 60 -8 -4 36 -35 -24 24 1 -11 -9 -58 37 -27 -15 -47 -56 -28 -62 13
8098 13 16 34 -10 -21 -20 13 -6 -3 -6 35 -1 25 16 17 12 12 18 4 -55 13 38 -6 19 36 50 -3 28 -19 23 -49 49 13 32 19 -28
8133 -28 4 21 -16 22 21 22 32 2 -7 -28 27 12 -10 -23 15 -1 1 6 18 3 -5 54 57 -44 67 61 67 -32 25 10 4 11 28 52 3
8168 3 -4 27 -7 16 58 26 35 -10 -18 3 4 33 -10 37 -40 4 20 -16 -30 -56 -7 -18 -27
8191b7
##END NTUPLES=NMR FID
##END=
