##TITLE=1H_LY-DMAA.Per.3.15
 CDCl3
 8 sc, 
 10.03.2022
##JCAMPDX= 6.0         $$ Bruker NMR JCAMP-DX V2.0
##DATA TYPE= NMR FID
##DATA CLASS= NTUPLES
##ORIGIN= UXNMR, Bruker Analytische Messtechnik GmbH
##OWNER= root
$$ XWIN-NMR		Version 3.5
$$ Thu Mar 10 11:25:01 2022 Russian Standard Time (UT+4h)  she@DPX200
##.OBSERVE FREQUENCY= 200.131346
##.OBSERVE NUCLEUS= ^1H
##.DELAY= (6, 6)
##.ACQUISITION MODE= SIMULTANEOUS
##.ACQUISITION SCHEME= undefined
##.AVERAGES= 8
##.DIGITISER RES= 18
##SPECTROMETER/DATA SYSTEM= spect
##.PULSE SEQUENCE= zg30
##.SOLVENT NAME= CDCl3
##.SHIFT REFERENCE= (INTERNAL, CDCl3, 0, 15.7039)
##AUDIT TRAIL= $$ (NUMBER, WHEN, WHO, WHERE, WHAT)
$$ ##TITLE= Audit trail, XWIN-NMR		Version 3.5
$$ ##JCAMPDX= 5.01
$$ ##ORIGIN= Bruker BioSpin GmbH
$$ ##OWNER= she
$$ F:/spectra/data/she/nmr/H-F/1/audita.txt
$$ ##AUDIT TRAIL=  $$ (NUMBER, WHEN, WHO, WHERE, WHAT)
(   1,<2022-03-10 11:23:39.25 +0400>,<she>,<DPX200>,
      <created by zg, POWCHK disabled, PULCHK disabled
       configuration hash MD5:
       00 E9 B6 7A A2 85 ED C7 34 08 36 98 17 FE 4E 26
       data hash MD5: 16K
       9C 74 6D D4 90 0B F5 AA 14 02 A3 56 F7 03 C1 42>)
$$ ##END=
$$ 
$$ hash MD5
$$ 6C ED 17 15 49 7E 13 D7 64 54 6F DB E2 91 9F CB
##$RELAX= 
##$RELAX= 
##$RELAX= 
##$RELAX= 
##$RELAX= 
##$RELAX= 
$$ Bruker specific parameters
$$ --------------------------
##$DU= <F:/spectra>
##$EXPNO= 1
##$NAME= <H-F>
##$PROCNO= 1
##$TYPE= <nmr>
##$USER= <she>
##$AMP= (0..31)
100 100 100 100 100 100 100 100 100 100 100 100 100 100 100 100 100 100 
100 100 100 100 100 100 100 100 100 100 100 100 100 100 
##$AQSEQ= 0
##$AQ_mod= 1
##$AUNM= <au_zg>
##$AUTOPOS= <>
##$BF1= 200.13
##$BF2= 200.13
##$BF3= 200.13
##$BF4= 200.13
##$BF5= 200.13
##$BF6= 200.13
##$BF7= 200.13
##$BF8= 200.13
##$BYTORDA= 1
##$CFDGTYP= 0
##$CFRGTYP= 5
##$CHEMSTR= <none>
##$CNST= (0..31)
1 1 145 1 1 1 1 1 1 1 1 1 1 1 1 1 1 1 1 1 1 1 1 1 1 1 1 1 1 1 1 1 
##$CPDPRG= <>
##$CPDPRG1= <>
##$CPDPRG2= <>
##$CPDPRG3= <>
##$CPDPRG4= <mlev>
##$CPDPRG5= <mlev>
##$CPDPRG6= <mlev>
##$CPDPRG7= <mlev>
##$CPDPRG8= <mlev>
##$CPDPRGB= <>
##$CPDPRGT= <>
##$D= (0..31)
0 1.2 0 0 0 0 0 0 0 0.06 0 0.03 0 0 0 0 0.0002 0 0 0 0 0 0 0 0 0 0 0 0 
0 0 0 
##$DATE= 1646897018
##$DBL= (0..7)
120 120 120 120 120 120 120 120 
##$DBP= (0..7)
150 150 150 150 150 150 150 150 
##$DBP07= 0
##$DBPNAM0= <>
##$DBPNAM1= <>
##$DBPNAM2= <>
##$DBPNAM3= <>
##$DBPNAM4= <>
##$DBPNAM5= <>
##$DBPNAM6= <>
##$DBPNAM7= <>
##$DBPOAL= (0..7)
0.5 0.5 0.5 0.5 0.5 0.5 0.5 0.5 
##$DBPOFFS= (0..7)
0 0 0 0 0 0 0 0 
##$DE= 6
##$DECBNUC= <off>
##$DECIM= 32
##$DECNUC= <off>
##$DECSTAT= 4
##$DIGMOD= 1
##$DIGTYP= 9
##$DL= (0..7)
0 120 120 120 120 120 120 120 
##$DP= (0..7)
150 150 150 150 150 150 150 150 
##$DP07= 0
##$DPNAME0= <>
##$DPNAME1= <>
##$DPNAME2= <>
##$DPNAME3= <>
##$DPNAME4= <>
##$DPNAME5= <>
##$DPNAME6= <>
##$DPNAME7= <>
##$DPOAL= (0..7)
0.5 0.5 0.5 0.5 0.5 0.5 0.5 0.5 
##$DPOFFS= (0..7)
0 0 0 0 0 0 0 0 
##$DQDMODE= 0
##$DR= 18
##$DS= 0
$$ [...]
##$SUBNAM2= <"">
##$SUBNAM3= <"">
##$SUBNAM4= <"">
##$SUBNAM5= <"">
##$SUBNAM6= <"">
##$SUBNAM7= <"">
##$SUBNAM8= <"">
##$SUBNAM9= <"">
##$SW= 18.0517287032376
##$SWIBOX= (0..15)
0 0 2 0 0 0 0 0 0 0 0 0 0 0 0 0 
##$SW_h= 3612.71676300578
##$TD= 16384
##$TD0= 1
##$TE= 0
##$TE2= 300
##$TE3= 300
##$TEG= 300
##$TL= (0..7)
0 120 120 120 120 120 120 120 
##$TP= (0..7)
150 150 150 150 150 150 150 150 
##$TP07= 0
##$TPNAME0= <>
##$TPNAME1= <>
##$TPNAME2= <>
##$TPNAME3= <>
##$TPNAME4= <>
##$TPNAME5= <>
##$TPNAME6= <>
##$TPNAME7= <>
##$TPOAL= (0..7)
0.5 0.5 0.5 0.5 0.5 0.5 0.5 0.5 
##$TPOFFS= (0..7)
0 0 0 0 0 0 0 0 
##$TUNHIN= 0
##$TUNHOUT= 0
##$TUNXOUT= 0
##$USERA1= <user>
##$USERA2= <user>
##$USERA3= <user>
##$USERA4= <user>
##$USERA5= <user>
##$V9= 5
##$VALIST= <valist>
##$VCLIST= <CCCCCCCCCCCCCCC>
##$VD= 0
##$VDLIST= <DDDDDDDDDDDDDDD>
##$VPLIST= <PPPPPPPPPPPPPPP>
##$VTLIST= <TTTTTTTTTTTTTTT>
##$WBST= 1024
##$WBSW= 4
##$XGAIN= (0..3)
0 0 0 0 
##$XL= 0
##$YL= 0
##$YMAX_a= 322681
##$YMIN_a= -288252
##$ZGOPTNS= <>
##$ZL1= 120
##$ZL2= 120
##$ZL3= 120
##$ZL4= 120
##$ABSF1= 10
##$ABSF2= 0
##$ABSG= 5
##$ABSL= 3
##$ALPHA= 0
##$AQORDER= 0
##$ASSFAC= 0
##$ASSFACI= 0
##$ASSFACX= 0
##$ASSWID= 0
##$AUNMP= <proc_1d>
##$AZFE= 0.1
##$AZFW= 0.1
##$BCFW= 1
##$BC_mod= 2
##$BYTORDP= 1
##$COROFFS= 0
##$CY= 11.3945322036743
##$DATMOD= 1
##$DC= 2
##$DFILT= <>
##$DTYPP= 0
##$F1P= 2.36226072786647
##$F2P= -0.459571619588291
##$FCOR= 0.5
##$FTSIZE= 0
##$FT_mod= 4
##$GAMMA= 1
##$GB= 0.15
##$INTBC= 1
##$INTSCL= 1
##$ISEN= 128
##$LB= 0.24
##$LEV0= 0
##$LPBIN= 0
##$MAXI= 10000
##$MC2= 0
##$MEAN= 0
##$ME_mod= 0
##$MI= 1.114404
##$NCOEF= 0
##$NC_proc= 0
##$NLEV= 6
##$NOISF1= 3.799351
##$NOISF2= 2.8
##$NSP= 1
##$NTH_PI= 0
##$NZP= 0
##$OFFSET= 15.70392
##$PC= 1
##$PHC0= -16749.01
##$PHC1= 15.60078
##$PH_mod= 1
##$PKNL= yes
##$PPARMOD= 0
##$PSCAL= 0
##$PSIGN= 0
##$REVERSE= no
##$SF= 200.130013532006
##$SI= 16384
##$SIGF1= 3
##$SIGF2= 2
##$SINO= 400
##$SIOLD= 16384
##$SREGLST= <1H.CDCl3>
##$SSB= 0
##$STSI= 0
##$STSR= 0
##$SW_p= 3612.71676300578
##$SYMM= 0
##$S_DEV= 0
##$TDeff= 0
##$TDoff= 0
##$TI= <>
##$TILT= no
##$TM1= 0
##$TM2= 0
##$TOPLEV= 0
##$USERP1= <user>
##$USERP2= <user>
##$USERP3= <user>
##$USERP4= <user>
##$USERP5= <user>
##$WDW= 1
##$XDIM= 8192
##$YMAX_p= 0
##$YMIN_p= 0
$$ End of Bruker specific parameters
$$ ---------------------------------
##NTUPLES= NMR FID
##VAR_NAME=  TIME,          FID/REAL,        FID/IMAG
##SYMBOL=    X,             R,               I
##VAR_TYPE=  INDEPENDENT,   DEPENDENT,       DEPENDENT
##VAR_FORM=  AFFN,          ASDF,            ASDF
##VAR_DIM=   8192,          8192,            8192
##UNITS=     SECONDS,       ARBITRARY UNITS, ARBITRARY UNITS
##FACTOR=    0.0002768,     1,               1
##FIRST=     0,             0,               0
##LAST=      2.2672688,     0,               0
##MIN=       0,             -288252,         0
##MAX=       2.2672688,     322681,          0
$$ Real data points
##PAGE= N=1
##DATA TABLE= (X++(R..R)), XYDATA
0 0 0 0 0 0 0 0 0 0 0 0 8 -8 8 -8 8 -16 16 -24 24 -32 40 -45 50 -64 73 -83 97 -113 130 -151 171 -196 222
33 222 -251 284 -321 359 -403 450 -503 560 -622 689 -762 844 -933 1027 -1132 1249 -1377
50 -1377 1516 -1672 1841 -2033 2245 -2486 2762 -3077 3444 -3877 4397 -5035 5842 -6898 8341
65 8341 -10448 13820 -20076 35567 -155152 -110798 322681 125515 -219664 -179771 136305
76 136305 158283 -16591 -118727 -67514 30560 139786 62728 -159952 -165148 151757 240558
87 240558 -101840 -288252 41679 290933 28285 -256610 -79091 186008 107724 -100080
97 -100080 -102336 6351 65780 70668 -5268 -127518 -68317 150162 139726 -144112 -195425 111559
109 111559 225795 -64560 -223494 15828 192478 24508 -135345 -44984 66433 44118
119 44118 5794 -19961 -66477 -19259 109505 66036 -129565 -109884 127048 140380 -108503
130 -108503 -153899 78539 144541 -49032 -117870 23982 75970 -11177 -28529 10462 -17690
141 -17690 -20658 56785 38738 -82715 -57028 96830 73166 -97176 -79552 90443 77113
152 77113 -78151 -63628 66474 42661 -57612 -17668 52305 -8193 -51857 29471 51535
163 51535 -46867 -52047 56651 47838 -62729 -39952 64895 26495 -66599 -9482 69611 -7880
175 -7880 -73224 24465 78813 -35212 -81492 41642 81689 -40998 -74493 37273 60225
186 60225 -31949 -38208 28561 10307 -30620 18751 37547 -46790 -51448 66835 67061 -78330
198 -78330 -83212 77521 93455 -66807 -94593 48573 84094 -26943 -60249 8802 27042
209 27042 3286 13821 -3470 -53811 -6684 88795 27071 -111384 -52276 118689 76419 -109968
221 -109968 -93789 86281 97224 -54605 -85973 19369 57240 9716 -16811 -28719 -31144
232 -31144 32662 77952 -21521 -115722 -1268 139029 31197 -142297 -59059 127852 79870
243 79870 -96262 -85371 56068 74570 -13367 -46549 -22953 5522 46483 41459 -54663 -87875
255 -87875 45241 123724 -23806 -145042 -6347 145951 35496 -128201 -57802 94219
265 94219 66801 -50327 -58634 5295 34914 34391 2678 -60266 -45384 70901 87847 -63830
277 -63830 -120096 44045 137534 -16358 -136540 -11884 116760 32685 -83369 -42490 40505
288 40505 36482 2034 -17592 -39351 -12462 64284 46639 -74942 -78724 71345 102688 -55681
300 -55681 -113051 34511 109394 -11625 -90203 -5307 61105 14410 -25147 -12098 -10320 89
312 89 40752 19045 -62082 -41664 71336 61527 -70449 -76051 59828 79933 -45174 -73925
324 -73925 29041 57604 -16429 -34190 9643 7768 -9012 18617 15277 -39682 -24132 54919
336 54919 34685 -61486 -42050 61882 45298 -56765 -42212 49068 33064 -41534 -19917 34956
348 34956 3529 -31597 11948 29480 -26287 -29426 36340 28428 -42984 -26088 45962 21172
360 21172 -46177 -13168 46006 3877 -44781 7306 45134 -16861 -44874 25084 44914 -29540
372 -29540 -42812 31143 37879 -30268 -29512 27675 16648 -26329 -1890 25926 -15135 -29256 30141
385 30141 34418 -42460 -41650 49126 48246 -49613 -51732 44798 50738 -34881 -42414 24255 28352 -13742
399 -13742 -7678 7772 -15119 -6605 38266 11594 -57672 -21511 69706 33247 -73644 -44793
411 -44793 67600 50953 -54691 -50940 35934 41457 -16777 -23833 -73 -483 10836 28241 -13129
424 -13129 -54324 7759 75741 5008 -87124 -20094 88420 35249 -77830 -44757 58552
435 58552 46159 -33833 -37439 8247 18701 12790 6610 -26921 -35904 30347 62584 -25050 -83382
448 -83382 11595 93557 5089 -91936 -20977 78923 31966 -56284 -33841 29296 26554 -1341
460 -1341 -9238 -21260 -13730 36657 40073 -41778 -63901 37350 81269 -25742 -89156 9572
472 9572 85039 5402 -71181 -16934 47916 20212 -21168 -15437 -6097 2105 28755 16953 -43555
485 -43555 -37851 49629 57323 -45986 -70087 36294 75109 -22048 -69424 8680 55449 1501
497 1501 -34532 -5528 10478 2472 12493 6135 -32187 -19656 44402 33318 -50022 -45641 47806
510 47806 52423 -40930 -52972 30986 46433 -21077 -33571 13880 17130 -9800 1696 10757 -18446
523 -18446 -14316 32715 20542 -41508 -26320 45414 30379 -44693 -31275 40228 27578 -34669
535 -34669 -20751 28284 10130 -24009 1215 20662 -13039 -19635 22766 19308 -29928 -18817
547 -18817 34323 17581 -35538 -13957 35487 9094 -33576 -1755 32322 -5699 -30757 13368
559 13368 29824 -19478 -28663 23689 26289 -26006 -22806 25895 16422 -25380 -8637 23932 -1534
572 -1534 -23858 11873 24574 -21731 -26601 29616 29410 -33970 -31315 35153 32107 -32072 -29284
585 -29284 27067 23413 -20143 -13194 14218 306 -10152 14306 9057 -28673 -11698 40013 16329
598 16329 -47584 -22843 48967 27791 -45358 -30631 36513 28521 -25197 -21203 13306 9137 -3100
611 -3100 6988 -2839 -23798 4625 40276 -975 -52081 -5464 58500 13910 -57792 -21105
623 -21105 50432 24870 -37975 -23754 22118 16123 -6856 -3871 -6491 -12956 14454 30493 -17214
636 -17214 -46670 13912 58218 -6385 -63004 -2962 60677 11930 -50430 -16943 35568 17315
648 17315 -17133 -10998 -413 -316 15096 15588 -24468 -31950 27172 46092 -24317 -55933 16459
661 16459 58556 -7269 -54789 -1865 43670 7332 -28195 -8264 10348 3814 6995 5540 -20794
674 -20794 -17422 30102 30625 -32985 -41160 31087 48199 -24503 -48953 16374 43943 -8388 -33433
687 -33433 2664 18678 -987 -2805 2980 -12852 -9200 24862 17155 -33117 -25839 35821 32493
700 32493 -34049 -35832 28977 34897 -21970 -28818 15569 19519 -10322 -7054 8329 -5290 -8592
713 -8592 17010 11482 -25877 -15284 31311 18729 -33252 -20981 31724 20229 -28679 -17171
725 -17171 23977 11031 -20023 -3518 16468 -5155 -14432 13347 13451 -20099 -12739 25272 12470
738 12470 -27538 -10816 28394 8552 -27113 -4286 25438 -597 -23266 6372 21231 -12030
750 -12030 -19634 16581 17621 -20243 -15907 21576 12695 -22034 -8942 21034 3365 -19785 2965
763 2965 18656 -9694 -17966 16332 18251 -21193 -18417 24778 18990 -25300 -18008 24099 15917
776 15917 -20802 -11337 16804 4645 -13049 3502 9894 -12859 -8856 21413 9077 -28891 -11341
789 -11341 33114 13631 -34344 -15874 31855 16280 -26412 -14042 19303 8996 -11203 -655
801 -655 4726 -9042 149 20153 -1589 -29801 648 37092 2717 -40455 -7070 39299 10501
814 10501 -34303 -12319 25438 10502 -15373 -5714 4913 -2671 3472 12842 -9134 -23620 11145
827 11145 33150 -9502 -39354 5735 41702 -293 -38920 -4021 32333 6722 -21981 -5968
839 -5968 10252 1819 1211 5403 -10878 -14905 16764 24420 -19335 -33081 17555 37990 -13521
852 -13521 -39259 7753 35521 -2681 -27683 -648 16868 1168 -4483 1963 -6819 -7376 16436
865 16436 15221 -22125 -22584 24314 28957 -22685 -32175 18512 31590 -13212 -27287 7916 19195
878 19195 -4670 -9335 3330 -1749 -5048 11487 8533 -19552 -13489 24331 18362 -25832 -21774
891 -21774 24679 23204 -20919 -21272 16687 16895 -12019 -9632 8877 1328 -7096 7475 7182 -15352
905 -15352 -8770 21129 10683 -24765 -12789 25397 13310 -24318 -12656 21198 9578 -17784
917 -17784 -4975 14250 -877 -11365 7197 9723 -12734 -8450 17670 8161 -20414 -7377 21879
930 21879 6413 -21415 -4376 20031 1429 -18015 2192 15684 -6604 -13819 10408 11750
942 11750 -14080 -10503 16286 8601 -17668 -6584 17653 3754 -16829 -102 15544 -3890
954 -3890 -13918 8648 12920 -12837 -11826 16645 11472 -18807 -10613 19760 9608 -19039 -7638
967 -7638 16878 4300 -14173 -71 10898 -5479 -8545 11046 6657 -16843 -6171 21150 6374
980 6374 -24019 -7087 24522 7718 -22659 -7169 19212 5673 -14073 -1896 8985 -2957
992 -2957 -3982 9355 758 -15826 1018 21674 -1085 -26001 -494 27593 2282 -26934 -4322
1005 -4322 23058 4583 -17511 -3471 10411 27 -3449 5190 -2426 -11579 6654 18420 -8257
1018 -8257 -23918 8130 27805 -5798 -28475 3120 26407 -401 -21247 -853 14078 182
1030 182 -5966 2424 -2027 -7229 8209 12679 -12656 -18680 14111 23065 -13546 -25768 10887 25520
1044 25520 -7415 -22446 4387 16823 -2236 -9132 2272 1229 -3830 6708 7447 -12643 -11792
1057 -11792 16682 16326 -18011 -19775 16986 21132 -14421 -20432 10662 16685 -7504 -11155 4946
1070 4946 3824 -4300 3656 5028 -10523 -7147 15954 10188 -18954 -12714 20023 14664 -18572 -14538
1084 -14538 16133 12873 -12664 -8970 9542 3747 -7085 2201 5750 -8303 -5661 13246 6161
1097 6161 -17166 -7380 18841 7932 -19157 -8098 17670 6968 -15315 -4620 12558 1270
1109 1270 -9717 3160 7671 -7225 -5877 11428 5183 -14393 -4405 16412 3959 -16954 -3096
1122 -3096 16353 1558 -14830 542 12633 -3506 -10705 6408 8514 -9629 -7031 12074 5424
1135 5424 -13863 -4135 14633 2522 -14318 -543 13519 -1702 -11781 4690 10423 -7544
1147 -7544 -8646 10614 7483 -12928 -6397 14499 5452 -15063 -4443 14346 2775 -13071 -880
1160 -880 10654 -2224 -8446 5420 6212 -9174 -4578 12637 3593 -15371 -3129 17224 3264
1173 3264 -17326 -3016 16357 2687 -13679 -1169 10469 -1053 -6584 4408 3154 -8305
1185 -8305 -524 12369 -1257 -16145 1599 18475 -1512 -19493 404 18367 112 -15803
1197 -15803 -194 11745 -764 -6837 3042 2103 -6067 2219 10157 -4925 -13886 6628 17266
1210 17266 -6462 -18961 5525 19150 -3857 -17309 2306 13608 -1598 -8700 1850 2996
1222 2996 -3724 2183 6384 -6676 -9990 9399 13336 -10697 -16142 10298 17390 -8641 -16702 6704
1236 6704 14337 -4470 -9912 3452 4766 -3300 1009 4463 -6206 -6546 10340 9107 -12947 -11756
1250 -11756 13676 13244 -13092 -13766 11041 12394 -8827 -9620 6377 5321 -4765 -398 4072 -4637
1264 -4637 -4304 9306 5602 -12486 -6921 14599 8563 -14743 -9105 13817 9003 -11704 -7335 9169
1278 9169 4484 -6958 -887 4970 -3541 -4072 7389 3607 -11044 -4025 13187 4477 -14375 -4832
1292 -4832 14066 4601 -12811 -3499 10860 1705 -8479 1221 6501 -4084 -4680 7286 3574 -9850
1306 -9850 -2682 11823 2153 -12876 -1648 12800 736 -12081 243 10348 -2036 -8803 3803
1319 3803 6646 -6056 -5116 8143 3626 -9698 -2368 10944 1454 -11186 -221 10919 -793
1332 -793 -9704 2542 8466 -4139 -6726 6208 5276 -8120 -3974 9665 2849 -10952 -1975 11143
1346 11143 991 -10873 -84 9534 -1470 -8014 3082 5987 -5269 -4127 7581 2588 -9641
1359 -9641 -1290 11534 726 -12366 -150 12548 -29 -11397 669 9756 -1396 -7213 2809
1372 2809 4369 -4775 -1822 6928 -603 -9486 1887 11348 -2769 -12907 2720 13190 -2421
1385 -2421 -12421 1942 10524 -1748 -7581 2276 4343 -3319 -674 5325 -2153 -7448 4537 9873
1399 9873 -5674 -11667 5904 12608 -5345 -12505 4292 10952 -3466 -8406 2754 4753 -3068
1412 -3068 -1088 3831 -2729 -5504 5713 7425 -7845 -9235 8840 10740 -8521 -11059 7682 10474
1426 10474 -6021 -8411 4723 5550 -3496 -1839 3268 -2081 -3625 5508 4610 -8489 -6193 9957
1440 9957 7372 -10637 -8426 9845 8318 -8603 -7310 6652 5181 -4895 -2248 3739 -1109 -2911
1454 -2911 4668 3100 -7534 -3504 9891 4427 -10856 -5011 10965 5307 -10093 -4860 8468
1467 8468 3480 -6675 -1537 4704 -1285 -3446 4048 2329 -6775 -2054 8912 1940 -10386 -2119
1481 -2119 10819 2211 -10244 -1788 9215 1154 -7342 366 5646 -2020 -3835 4135 2527 -6161
1495 -6161 -1490 7820 822 -9107 -560 9444 120 -9351 197 8245 -1090 -7016 2077 5441 -3507
1510 -3507 -3890 5030 2551 -6411 -1456 7598 641 -8141 281 8411 -832 -7717 1732 6930 -2734
1525 -2734 -5607 3875 4180 -5145 -2936 6297 1628 -7478 -793 7997 -190 -8316 654 7724 -1455
1540 -1455 -6847 2220 5478 -3223 -3897 4471 2437 -5693 -976 7077 86 -7968 722 8639 -1048
1555 -1048 -8525 1304 7792 -1656 -6582 2054 4705 -2950 -2924 3966 759 -5326 690 6608 -1980
1570 -1980 -7975 2534 8615 -2743 -8811 2682 8191 -2372 -6657 2452 4767 -2548 -2312 3369
1584 3369 80 -4270 2170 5630 -3765 -6890 4642 7829 -5016 -8390 4598 7963 -4191 -6883
1598 -6883 3284 4880 -2922 -2587 2737 -28 -3251 2633 4125 -4605 -5084 6084 6248 -6544 -6847
1613 -6847 6512 7046 -5654 -6255 4682 4897 -3631 -2812 2860 234 -2649 2230 2671 -4679 -3369
1628 -3369 6379 3994 -7506 -4784 7716 5092 -7281 -4914 6213 4083 -4874 -2426 3760 470
1642 470 -2516 2002 2120 -4161 -1836 6247 2082 -7563 -2487 8145 2775 -8014 -2920 7104 2394
1657 2394 -5950 -1507 4379 -56 -3155 1781 1986 -3780 -1263 5476 927 -6757 -876 7586 1095
1672 1095 -7582 -922 7163 785 -6028 -40 4845 -911 -3400 2204 2140 -3640 -1196 4900 393
1687 393 -6136 -79 6586 -434 -6891 491 6361 -924 -5692 1363 4490 -2144 -3210 3143 2035
1702 2035 -4080 -858 5149 87 -5679 654 6122 -1061 -5958 1513 5493 -1932 -4677 2447 3500
1717 3500 -3231 -2440 3881 1158 -4798 -367 5308 -513 -5808 898 5766 -1337 -5317 1713 4659
1732 4659 -2083 -3565 2793 2490 -3369 -1070 4231 185 -4885 787 5532 -1300 -5816 1698 5772
1747 5772 -1874 -5206 2022 4212 -2361 -3053 2646 1496 -3304 -134 3909 -1128 -4714 2099 5345
1762 5345 -2669 -5653 2899 5715 -2753 -5123 2622 4186 -2448 -2697 2517 1155 -2722 571 3182
1777 3182 -2079 -3897 3104 4507 -3863 -5109 3978 5132 -3962 -4959 3348 4019 -2885 -2829 2442 1148
1793 1148 -2213 719 2375 -2311 -2688 3812 3312 -4666 -3673 5155 4100 -4959 -4047 4545 3511 -3800
1809 -3800 -2616 2906 1065 -2388 532 1733 -2454 -1783 3827 1815 -5072 -2305 5641 2609 -5770
1824 -5770 -2694 5299 2581 -4437 -1816 3563 923 -2433 605 1755 -2052 -1155 3568 1047 -4700
1839 -4700 -1024 5459 1148 -5821 -1429 5429 1238 -4951 -1119 3859 297 -2893 602 1789 -1895
1854 -1895 -1005 3119 509 -4149 -98 5065 74 -5312 0 5346 91 -4813 202 4028 -572
1869 -572 -2943 1268 1851 -2168 -951 2989 33 -4025 348 4448 -802 -4904 851 4697 -1026
1884 -1026 -4313 1152 3624 -1498 -2627 1997 1677 -2497 -669 3165 -4 -3694 691 4131 -1098
1899 -1098 -4184 1359 4000 -1578 -3639 1739 2864 -2120 -2120 2350 1000 -2934 -307 3220 -534 -3692
1915 -3692 1075 3854 -1480 -3872 1744 3619 -1846 -2914 2151 2221 -2277 -1228 2715 294 -3036
1930 -3036 582 3415 -1296 -3689 1655 3756 -1985 -3724 1954 3169 -2123 -2672 2025 1625 -2244
1945 -2244 -613 2389 -406 -2754 1308 3078 -1944 -3330 2396 3606 -2493 -3419 2522 3105 -2291
1960 -2291 -2410 2126 1451 -2005 -368 2010 -831 -2218 1794 2430 -2645 -2808 3009 2884 -3259 -3072
1976 -3072 3089 2701 -2753 -2185 2400 1356 -1960 -198 1739 -951 -1563 2170 1771 -2975 -1890 3674
1992 3674 2126 -3850 -2188 3714 2125 -3330 -1735 2658 1045 -2208 -261 1524 -959 -1231 1999
2007 1999 1003 -2997 -1002 3695 1132 -4037 -1228 4095 1348 -3702 -1150 3189 811 -2328 -55
2022 -55 1648 -802 -968 1849 534 -2798 -298 3495 193 -3981 -342 4020 328 -3875 -335 3256
2038 3256 32 -2540 424 1739 -1016 -903 1769 302 -2486 220 3257 -365 -3567 531 3857
2053 3857 -500 -3566 499 3174 -589 -2523 860 1638 -1329 -937 1632 113 -2337 299 2802
2068 2802 -756 -3185 947 3274 -964 -3203 1103 2854 -1114 -2221 1352 1556 -1480 -644 1874
2083 1874 5 -2261 561 2628 -979 -2852 1255 2901 -1396 -2761 1435 2239 -1551 -1771 1638
2098 1638 979 -1877 -363 2025 -375 -2279 878 2530 -1242 -2557 1514 2573 -1494 -2235 1684
2113 1684 1886 -1616 -1225 1733 564 -1852 121 2015 -771 -2230 1210 2350 -1551 -2472 1648 2332
2129 2332 -1784 -2106 1718 1574 -1668 -927 1618 254 -1701 494 1857 -1082 -1910 1705 2193 -1932
2145 -1932 -2154 2075 2103 -1998 -1854 1851 1300 -1711 -701 1423 -152 -1512 786 1426 -1650 -1626 2079
2162 2079 1673 -2383 -1759 2451 1776 -2330 -1544 2152 1212 -1725 -576 1487 -115 -1165 921 1065
2178 1065 -1657 -1150 2142 1171 -2593 -1295 2713 1282 -2674 -1283 2260 890 -1960 -547 1395
2193 1395 -183 -1107 929 750 -1614 -657 2240 655 -2645 -570 2942 806 -2766 -678 2565 611
2209 611 -2004 -175 1521 -297 -981 848 496 -1548 -288 2038 40 -2590 -153 2764 30 -2894
2225 -2894 -120 2556 41 -2107 145 1630 -425 -989 976 537 -1304 11 1918 -178 -2283
2240 -2283 354 2552 -425 -2606 419 2371 -449 -2106 483 1516 -752 -960 975 322 -1395
2255 -1395 116 1778 -517 -2043 683 2256 -822 -2298 849 2168 -792 -1717 942 1392 -993
2270 -993 -769 1204 197 -1419 252 1600 -722 -1854 923 1924 -1146 -1941 1117 1704 -1164 -1495
2286 -1495 1126 1039 -1201 -503 1265 -53 -1411 446 1610 -782 -1674 1161 1799 -1158 -1687 1256
2302 1256 1582 -1183 -1086 1229 712 -1201 -229 1202 -298 -1462 677 1482 -1130 -1556 1206 1569 -1385
2319 -1385 -1507 1359 1232 -1272 -896 1238 482 -1122 135 1161 -498 -1136 1084 1277 -1336 -1241 1580
2336 1580 1320 -1601 -1267 1511 1041 -1470 -718 1199 273 -1109 186 943 -738 -1038 1167 1008 -1517
2353 -1517 -1012 1758 1092 -1751 -1011 1705 915 -1442 -578 1268 228 -1003 289 781 -771 -615 1294
2370 1294 621 -1620 -714 1814 709 -2006 -767 1815 491 -1666 -367 1281 98 -909 362
2385 362 663 -782 -381 1309 302 -1629 -228 1934 297 -1931 -224 1925 269 -1689 -131 1340
2401 1340 -77 -965 346 564 -783 -318 1068 13 -1578 65 1755 -135 -1917 121 1840 -78
2417 -78 -1627 192 1369 -221 -918 528 588 -703 -125 1073 -79 -1286 354 1543 -444 -1694
2433 -1694 444 1663 -507 -1563 369 1167 -572 -919 578 374 -815 -85 986 -270 -1210 468
2449 468 1419 -635 -1451 779 1517 -625 -1272 729 1080 -653 -729 717 344 -819 11 958 -401 -1180
2467 -1180 603 1213 -798 -1302 779 1226 -866 -1146 838 860 -799 -569 833 218 -829 217 948
2484 948 -497 -987 764 1154 -853 -1035 1011 998 -962 -922 916 576 -805 -308 806 -56 -812 312
2502 312 787 -654 -921 861 895 -1074 -936 1094 847 -1043 -672 979 522 -802 -181 725 -138 -721
2520 -721 521 711 -820 -727 977 732 -1190 -779 1126 668 -1130 -630 920 258 -817 -126 614 -310
2538 -310 -586 621 538 -900 -495 1144 549 -1220 -493 1316 496 -1147 -384 992 227 -774 34 579
2556 579 -348 -481 547 294 -955 -341 1112 246 -1332 -327 1298 249 -1208 -215 1049 125 -791
2573 -791 107 559 -332 -315 649 199 -875 -29 1115 80 -1291 -44 1321 113 -1194 -65 1037
2590 1037 -62 -839 132 529 -419 -341 567 -16 -825 141 987 -190 -1181 224 1239 -220 -1144 275
2608 275 1034 -220 -794 351 507 -319 -226 610 -67 -719 220 914 -353 -1118 386 1094 -436 -1069 353
2627 353 890 -420 -665 326 429 -435 -177 531 -133 -596 347 820 -453 -863 623 915 -579 -855 584
2646 584 794 -489 -606 497 331 -484 -155 523 -243 -676 359 677 -561 -812 671 781 -725 -760
2664 -760 642 648 -524 -411 561 251 -488 -5 578 -258 -554 538 588 -578 -633 707 660 -715 -632 663
2684 663 485 -627 -425 505 132 -537 71 431 -305 -542 545 528 -635 -529 797 574 -754 -432 762
2703 762 417 -594 -195 564 78 -508 231 384 -383 -376 604 322 -745 -368 779 334 -866 -327 749
2722 749 196 -693 -154 426 -43 -356 220 330 -441 -212 640 250 -743 -150 869 265 -825 -175 812
2741 812 156 -677 -94 505 -94 -352 254 216 -475 -153 629 58 -836 -82 798 54 -893 -77 778 41
2761 41 -639 30 494 -128 -326 314 168 -408 49 577 -34 -746 116 811 -89 -843 68 677 -136 -656
2781 -656 69 425 -250 -308 229 5 -425 37 614 -159 -649 185 705 -249 -767 238 714 -167 -605 200
2801 200 482 -178 -230 313 60 -361 76 503 -276 -644 299 608 -318 -698 294 592 -342 -580 272 403
2821 403 -237 -217 320 -10 -323 181 438 -257 -455 400 612 -365 -609 431 565 -342 -516 349 285 -363
2841 -363 -175 254 -36 -337 177 281 -338 -436 374 433 -531 -494 454 484 -407 -336 406 257 -312 -112 329 -79
2863 -79 -296 259 304 -357 -360 412 374 -476 -396 518 365 -545 -278 368 195 -333 -34 281 -152 -276 287 300
2885 300 -339 -265 481 344 -492 -236 542 271 -456 -193 404 152 -311 28 214 -182 -209 318 168 -474 -200
2906 -200 464 121 -581 -256 482 157 -487 -155 391 98 -254 43 250 -155 -119 384 131 -427 -82 535
2926 535 104 -531 -67 512 111 -496 -102 311 39 -302 85 93 -248 -143 356 -16 -470 13 521 36 -538
2947 -538 -6 557 37 -474 -30 404 30 -210 101 196 -128 -17 313 -18 -374 56 388 -66 -556 40
2967 40 476 -114 -512 4 387 -94 -317 101 171 -197 -19 295 -33 -315 130 417 -169 -437 236 484 -171
2988 -171 -373 157 373 -113 -189 117 76 -181 14 206 -118 -338 150 320 -204 -385 222 379 -186 -343 158
3009 158 242 -124 -161 223 104 -151 55 217 -163 -239 257 348 -237 -347 269 344 -244 -314 190 158 -190 -255 139
3032 139 -5 -150 17 137 -120 -205 267 248 -258 -261 280 274 -211 -220 243 170 -159 -85 188 54 -112 140 105 -188
3056 -188 -217 284 182 -372 -230 362 176 -309 -229 275 161 -222 -60 206 -3 -147 79 170 -181 -138 315
3077 315 152 -265 -126 366 177 -270 -165 254 164 -216 -100 136 -12 -127 89 58 -242 -58 242 46 -282
3098 -282 -131 383 103 -313 -92 265 157 -190 -19 171 -19 -54 109 56 -144 -3 265 26 -331 -94 296
3119 296 42 -334 -76 238 43 -218 -61 98 -69 -84 99 37 -207 33 288 -6 -289 51 352 43 -297
3140 -297 20 262 18 -166 18 92 -28 -86 112 -31 -203 -7 167 -28 -296 26 253 -75 -349 20 262
3161 262 -25 -205 30 130 -31 -39 115 -16 -147 102 232 -82 -225 106 293 -97 -219 133 251 -110 -185
3182 -185 49 86 -118 -60 50 -35 -129 111 143 -178 -250 112 284 -151 -177 97 274 -99 -199 30 84 -71 -18
3205 -18 153 -1 -45 100 188 -153 -159 152 176 -176 -247 143 169 -130 -132 137 123 -107 39 40 -23 -92 158 120 -128
3230 -128 -103 227 229 -174 -75 190 160 -79 -66 117 34 -116 -39 44 -97 -93 129 58 -201 -114 102 85 -226 -76 159
3255 159 139 -129 -124 107 74 -70 30 60 -9 13 108 44 -115 -52 178 95 -171 -80 180 47 -218 -103 81 -28
3279 -28 -107 -29 -13 -105 -6 77 -4 -174 -41 223 97 -240 -44 171 42 -151 15 165 119 -51 -6 36 -40 -18
3303 -18 121 48 -167 -41 205 -1 -223 -47 268 37 -175 -46 94 32 -58 3 -20 -48 -27 98 -74 -127 64
3326 64 167 17 -176 46 156 -44 -135 -8 90 5 -60 -44 11 -88 60 52 -89 -138 51 134 -83 -155 11 177
3350 177 -18 -150 27 114 -35 2 64 9 -65 36 108 -50 -89 116 135 -143 -110 18 113 -17 -186 30 101 -42
3374 -42 -27 20 -51 -34 -27 104 -54 -94 93 137 -61 -103 105 114 -28 -146 58 141 -40 -13 -29 35 -93 38 20 -76
3400 -76 -64 76 38 -81 -104 87 76 -125 -91 16 50 -72 -59 27 30 40 118 29 -54 -60 65 133 -131 -53 155 70 -87
3427 -87 -67 97 17 -84 -35 27 -83 -39 -14 -3 -61 -48 87 9 -114 -44 78 99 -86 -64 122 58 -33 -51 35 38 31
3454 31 35 27 -84 -46 91 31 -101 -19 131 14 -183 -68 61 -7 -64 -21 -9 -1 -9 26 4 -71 11 106 8 -142 14
3481 14 150 18 -98 -37 109 110 -70 35 29 1 -60 45 -43 -127 -11 76 -47 -132 -20 90 55 -120 -39 68 18
3506 18 -48 65 5 50 35 42 -10 -4 98 66 -51 -65 42 151 -13 -104 -29 81 -15 7 -1 21 -37 -24 -24 -19 -27 47 43 -67
3536 -67 -19 16 127 -27 -100 7 107 -2 -13 -26 16 -27 8 37 -67 -39 44 53 -91 -77 58 89 -42 -86 -7 59
3562 59 -32 -109 4 33 -3 -47 -24 -43 -42 38 55 -40 -38 76 57 -42 -104 60 73 -64 -27 25 67 -13 6 -38 -10 -34 15
3591 15 57 -127 -24 70 11 -71 -115 50 30 -33 -53 74 74 3 -3 24 -22 45 46 33 -47 -71 106 50 -23 -95 11 -22 -33
3620 -33 -88 -13 -55 8 31 24 -61 10 1 4 -62 13 63 46 -71 -41 84 19 -18 8 36 68 -15 9 49 -63 0 44 22 -48
3650 -48 -27 61 6 -66 -61 66 20 -19 -70 33 32 44 -26 -32 -24 16 67 10 -89 18 75 35 -98 -60 69 20 -42 -41 16 -3
3680 -3 -22 9 -47 -69 -9 31 -77 -49 -3 57 -20 -97 -38 31 -44 -55 22 106 -1 11 -1 13 10 52 38 -31 -40 -2 -7 -40 -74
3711 -74 30 51 -25 -88 -35 -29 3 -62 -22 -29 26 27 -37 -8 -32 51 78 67 -52 39 34 28 -5 -32 -21 36 -64 -36 -23 42 58
3742 58 16 -96 -49 9 -7 -28 -60 -69 10 -16 -78 36 -14 -20 12 -26 31 33 14 37 -13 -11 66 39 -1 -27 12 29 -21 -3 -11 42
3774 42 46 -36 1 -18 -37 -27 -20 -76 25 64 35 -21 -21 52 41 18 -8 30 71 5 5 -30 -26 -5 48 10 13 -16 79 28 -48 21 -19
3807 -19 -11 -71 -52 7 2 30 -22 -9 -75 -14 24 24 -38 -25 51 29 -37 -15 47 -4 7 -29 85 73 11 -83 -51 7 13 1 -28 -25
3839 -25 52 9 -36 -50 -12 62 0 -32 -14 -2 0 -11 47 16 55 48 19 -19 8 -14 48 -11 -9 2 -14 -16 -54 -13 39 16 -12 -33
3871 -33 -19 8 -24 -19 -29 -27 26 -22 -39 -39 -8 63 -19 -29 67 89 41 53 -11 1 14 85 14 -18 -58 28 -10 -22 -43 63 -28
3902 -28 -58 19 -48 -36 -48 9 -3 -5 -16 -31 -11 33 12 39 2 36 -11 19 29 66 -44 10 31 -43 -27 -31 -6 -27 -23 -19 -33 -24
3934 -24 -22 15 -71 -22 -5 -3 41 7 9 -45 41 -13 81 71 55 29 7 -6 33 -10 -22 -6 -55 -43 -1 -67 -50 -41 -15 -8 -43 2 19
3967 19 9 11 -24 -42 23 -35 -19 17 -27 48 14 8 -33 50 56 56 -9 -4 6 -28 20 -13 -25 32 36 4 -31 -48 -11 -32 4 -82 -25
4000 -25 -48 28 -11 57 -34 38 25 -40 28 35 62 15 0 -32 82 15 -17 -8 -10 -28 -14 -21 -76 23 -5 -6 -42 -29 30 -43 -52 -47 -21
4033 -21 8 47 -66 -20 -15 11 -23 -6 -4 24 -2 -12 58 12 38 14 -15 5 -6 23 -25 -1 -26 3 13 -35 -38 -3 57 -46 25
4064 25 -15 0 12 3 -14 7 26 82 -25 27 -13 -26 37 18 22 -14 7 -5 15 -3 -2 -33 -3 -35 4 -57 -6 -33 -24 -1 6 44
4096 44 6 -10 58 23 21 26 66 18 -11 27 -30 42 -10 66 32 -54 -8 -6 59 -4 -79 11 -19 -6 -17 -49 12 -11 -36 -33 -36 7 44
4129 44 -31 -37 14 -2 25 -39 17 40 27 23 -27 -7 54 2 12 -13 -1 20 -6 15 -27 -28 -11 -15 -22 -11 1 -7 -30 -31 -1 -24 -5 3
4163 3 41 45 28 6 16 15 -20 -12 3 -53 35 9 22 7 -16 -26 -27 -39 1 -5 -25 1 7 -24 -46 3 -10 30 16 5 55 14 -32 -6
4197 -6 84 39 1 6 35 44 48 1 -15 -51 1 -4 -42 -1 9 -48 10 -60 -11 21 19 -54 -48 32 6 -19 -77 9 19 47 41 53 -50 -1
4231 -1 33 7 -8 -7 31 66 38 -4 -28 4 18 -23 -27 2 -25 1 4 -21 -7 -2 -4 7 21 44 0 -32 8 11 34 24 31 22 -3 -2 21
4266 21 7 6 -12 1 29 -38 -15 -15 -27 56 -5 -9 -47 -31 22 14 -46 5 33 12 -27 -22 26 36 -66 3 -7 -24 -23 -32 -2 36 -30
4299 -30 0 -36 -54 -1 18 -1 30 27 7 -25 -26 -19 -30 7 -26 17 7 29 -7 3 7 -50 16 29 14 17 11 31 -3 -24 -4 -24 -26 -11
4333 -11 4 -20 12 -48 16 -18 -38 -18 -3 -26 -10 -25 29 27 29 18 4 -6 -19 17 42 43 -11 26 0 19 5 23 -18 -96 57
4364 57 72 -58 -62 27 20 -26 -32 -3 -43 -6 -7 -55 23 -7 -23 50 44 -4 8 15 -48 3 33 21 -14 -40 -1 24 2 10 4 -39 -11 5
4398 5 -6 0 0 -29 23 -7 -57 -7 11 23 23 -40 13 -24 37 23 41 18 -8 -30 -6 62 -9 -30 -48 -41 34 38 -46 -27 27 -23 -64
4431 -64 -33 29 -4 44 -2 -21 -4 16 0 30 26 -12 27 15 -19 -8 53 7 18 -7 -1 14 54 -12 -51 -9 -38 -1 -12 -25 -37
4462 -37 36 13 -31 23 -11 -19 -60 -21 -22 18 5 10 53 0 -12 6 -3 -64 -13 -6 6 -6 -3 34 12 -47 -8 14 -19 -58 -29 -16 -14 -15
4496 -15 -34 -20 -65 26 16 -10 -31 -1 42 -22 -8 11 6 5 29 12 -55 -13 17 17 2 -5 26 -20 41 -70 -5 21 -13 -54 6 -21
4528 -21 -5 -33 -4 -26 -63 38 12 58 -70 -28 54 49 -12 -1 5 34 -12 42 24 -1 -7 42 16 11 11 -45 -93 -51 1 -6 -8 -39 -22
4561 -22 -51 -50 -84 4 31 38 -19 63 2 45 41 40 -13 -8 47 3 4 2 11 -4 18 -16 -2 -48 -45 -20 -19 40 12 -9 47 -63 -27 -1 -3
4596 -3 -35 22 36 7 -14 20 40 0 -10 31 25 5 47 34 20 -1 -30 -3 -6 -17 -15 7 -26 -54 -15 61 -65 -33 -19 -71 -21 -24
4628 -24 -43 1 1 -41 -12 -21 36 -3 26 20 9 9 9 3 21 68 8 -12 -29 -37 -65 23 -58 28 -41 -61 -40 51 6 -11 -9 37 -14 -2
4662 -2 50 30 -16 -6 60 -44 -12 13 -52 24 -46 -4 27 -41 -24 -13 3 -3 -51 5 -25 -51 14 8 -24 6 -17 31 32 -15 -3 -4
4694 -4 2 -6 -20 -16 -27 -16 0 13 -9 -27 -33 11 -7 -11 -3 16 22 -44 1 -19 18 60 5 -23 -16 9 15 -45 7 25 2 53 10 34 -31
4729 -31 -26 35 29 -7 4 14 -22 -21 0 33 -10 54 -7 6 -36 -22 7 25 -11 -31 6 39 -43 11 16 -39 28 -14 38 37 36 17 -6
4762 -6 9 -7 9 -24 17 9 -59 -22 -24 6 26 -82 43 -27 -10 -10 7 2 -26 8 -21 42 -14 -18 0 45 70 -21 -50 27 43 -17
4794 -17 -18 -19 12 18 -30 12 -15 -47 27 11 -67 4 -50 -3 9 11 -20 16 -11 -15 -80 16 3 15 45 13 59 59 2 -50 28 82 21
4827 21 25 -3 18 19 -15 11 -24 3 -19 29 23 -23 26 9 9 -35 -71 -66 -34 -7 -13 6 16 1 -7 -6 53 24 -2 -9 -30 56 -13 8 29
4862 29 -13 45 -25 51 9 -41 -62 -28 3 -26 7 -36 -56 8 -7 32 14 -27 -37 40 10 -3 45 9 -13 29 19 -1 -13 -6 9
4893 9 -43 18 3 1 -16 -9 -38 23 16 -1 -7 1 -12 10 7 11 13 -12 32 -12 33 8 24 -3 -26 3 -7 -14 -25 -45 19 -39 15 -30 -33 -13
4929 -13 -1 10 -10 21 -32 -26 6 -14 5 19 -26 29 -12 8 -33 1 -5 23 45 4 36 76 42 -33 -23 -5 -11 -12 -60 5 -17 -19 -29
4962 -29 -6 -79 -18 -2 -23 16 4 -52 -35 -6 32 -4 29 -15 11 -26 -9 35 18 24 9 -18 -8 -36 19 -7 -20 -23 -64 -3 18
4993 18 -2 -31 12 1 -44 32 -16 4 -47 30 15 -6 38 -13 -4 19 46 22 -24 15 -22 26 -14 -66 8 11 -47 -18 48 2 32
5024 32 -35 2 8 10 1 10 8 -39 14 11 2 37 -44 -8 -34 -6 -18 27 -8 13 -20 -11 31 -15 -27 17 -14 -51 -3 12 -36 -4 22 -54
5058 -54 5 16 -15 5 -7 -14 37 -13 44 -4 4 3 46 -3 -21 -59 -12 23 7 -14 -16 -25 -2 1 6 -3 -69 -24 9 -26 -51 -12 25 -1
5092 -1 -42 29 31 -42 35 5 -9 -4 23 16 17 12 -17 -1 -38 15 46 39 -19 31 17 -14 -19 -20 24 10 9 -45 -21 -31 -33 -1 67 10 -12 3
5128 3 -4 -3 -27 22 27 24 -11 44 -32 -1 -11 -2 -18 25 -41 18 -23 32 24 -56 14 -12 8 5 -14 -9 55 -12 15 -1 44 -8 22 6 -41
5163 -41 53 31 17 -7 17 -17 17 -2 34 -27 1 3 -3 -32 -13 -21 -14 -32 -6 -19 -39 58 -14 0 0 -20 35 -24 34 75 58 21 -6
5196 -6 29 44 25 10 17 26 -15 10 14 36 15 4 -6 17 -11 -38 0 9 11 25 13 7 -16 -39 -15 2 20 -44 22 12 52 0 -2 -15
5230 -15 21 -4 0 -48 19 -30 -14 3 -9 1 -4 -5 10 9 -26 24 -6 -40 29 86 20 -16 6 -17 14 -7 61 0 36 28 11 -18 5
5263 5 -10 22 -27 -7 67 -3 5 9 33 18 5 23 71 -7 14 14 -20 -33 -42 15 18 -14 18 -19 53 -24 -20 20 -43 10 61 -33 32 -29
5297 -29 -11 -3 -2 -77 -47 7 -23 34 -37 -49 -11 40 -12 -23 11 9 -35 20 -31 7 11 39 18 4 11 61 -70 -26 -8 -5 -13 13 14 -34
5331 -34 33 60 20 14 -22 -9 -20 40 4 -89 17 3 32 29 -54 -49 20 21 -20 -24 24 21 25 39 27 -9 49 -34 -21 16 48 -38 -36 -28
5365 -28 -43 -14 -27 18 1 19 -37 0 21 -21 7 -5 26 2 -26 -36 1 -32 7 -13 25 62 -9 14 -6 -1 -18 14 -13 -8 -7 7
5397 7 4 25 -17 -12 1 1 36 1 16 -7 -51 17 27 2 47 5 10 -8 -15 -29 -45 66 12 1 -62 -54 -22 -18 2 -31 -19 -10 32 44
5431 44 -51 -37 18 7 30 -44 5 2 -19 26 -72 30 0 -6 25 11 -25 7 9 -16 32 -24 -9 -25 -16 -8 7 -59 0 23 21 10 -45
5464 -45 22 7 53 34 -24 26 -52 29 1 -23 -43 30 -48 12 21 -29 16 19 -14 -4 24 -44 13 22 14 -5 76 12 -21 28 4 -68
5496 -68 -53 11 0 -40 -11 -58 -32 -26 55 9 30 1 -3 33 18 40 28 -23 29 -12 13 34 -2 -23 -10 -3 -1 -13 19 8 -28 28
5528 28 -38 -9 75 57 -11 -7 20 -18 3 -13 -9 -24 13 -3 -18 21 -9 -9 -31 22 35 -67 32 50 -18 -46 -26 -9 -29 -16 18
5559 18 -47 24 19 14 -34 -90 21 -8 2 6 58 -15 -49 6 12 23 -54 71 -27 12 11 30 -13 -25 4 -20 -16 -29 17 -17 54 -17
5591 -17 -27 41 21 -14 -24 -2 -48 -4 19 5 13 -24 36 0 27 -2 75 51 6 22 50 5 -26 60 -19 0 -27 40 9 86 -14
5622 -14 11 24 43 -29 -44 -43 56 -13 -13 54 -34 11 30 45 5 28 -45 -11 81 0 14 -1 -37 -36 36 55 0 16 31 -33 -63 51
5654 51 -3 -28 5 29 -41 44 -11 25 33 21 -22 -12 5 17 46 12 -11 42 45 -3 9 -70 18 -46 -40 41 -8 3 6 -23 8 -38
5686 -38 32 14 40 9 1 -28 -25 -10 -36 -5 -4 31 -31 55 40 3 25 0 44 14 17 32 -34 -26 -11 15 4 15 29 -17 9 5 27
5719 27 38 0 5 22 -19 7 14 -1 20 5 22 37 15 34 30 -10 -28 30 8 -27 58 21 20 22 -22 -5 -13 18 38 24 -8 44 7
5752 7 45 -17 -64 45 10 -36 33 18 -25 -27 -53 8 -18 53 -26 19 -2 -50 5 -48 -36 -11 -3 -27 7 -12 -5 34 -12 5 24 6
5784 6 13 30 -2 65 22 46 20 -3 -17 20 22 -5 36 26 -11 7 -8 28 16 -79 32 -24 7 -5 1 -8 -49 8 -20 24 -25 7
5816 7 10 -8 52 52 31 -22 -32 -28 -18 20 41 -3 -23 -1 -31 19 -27 11 -20 16 60 39 -76 9 -17 57 32 20 -2 55 17 -36
5848 -36 -1 1 11 21 36 8 0 -23 -21 18 16 -18 -39 23 14 -47 -28 -31 4 26 -9 -20 9 18 15 0 1 36 -16 10 23 25 -4 11 -41
5883 -41 -12 12 -41 9 43 43 -16 2 61 -29 -6 39 -31 -46 24 -4 -9 19 -5 -10 28 25 23 31 40 85 -49 -9 31 1 4 19 54 4
5917 4 -27 27 27 -2 32 25 17 35 0 -36 10 12 -1 27 -23 -23 5 -2 -37 -4 -42 -6 18 24 -11 47 -14 57 -27 27 6 21 5 -8
5951 -8 -5 18 22 5 32 -3 47 -10 -35 -50 27 6 27 16 1 10 -33 22 -23 13 4 10 46 -32 19 -8 -21 -100 -9 -70 -21 5 -26
5984 -26 -23 33 43 -12 14 -9 -11 -37 36 11 -8 3 37 37 16 -22 21 -52 -23 5 17 29 -5 -41 -27 -3 12 -14 -1 32 -25 -16
6016 -16 11 7 18 -9 32 1 -35 -21 4 -17 -17 -47 -2 28 -28 47 76 4 52 27 -53 -10 24 38 44 39 -23 47 13 22 18 -33 32
6049 32 -30 -21 -21 -34 8 -44 33 -14 20 -7 72 -16 3 -20 -13 -8 -10 -1 -57 22 30 -38 -56 23 12 24 26 25 13 11 36 -7 -21 50 -22
6084 -22 46 21 -45 -6 -12 -50 11 -6 8 -14 -17 -33 45 -5 -40 -23 -45 -1 -24 14 11 -23 -11 -10 -34 -53 -11 -21 -6 2 10 18 10 -8
6118 -8 -33 -12 58 -18 2 0 -20 -29 -3 -2 -6 -15 -16 -43 -14 45 7 -36 -37 -94 -93 11 -4 -4 -2 10 -37 30 -60 -12 11 -16 28 29 -19 -42
6154 -42 3 -33 -29 42 23 10 -17 51 -17 25 15 41 -32 -7 15 11 17 -19 19 -13 0 -35 -10 11 49 23 1 -66 14 4 -8 -43
6186 -43 -35 -15 4 14 -5 26 21 12 45 -24 8 -22 -6 -4 2 23 37 19 5 -27 -5 -33 -6 -49 -1 -29 -43 5 18 -27 30 -17 27
6219 27 -6 5 37 0 -6 -1 21 27 40 37 14 1 34 48 1 -17 33 20 -6 -34 -14 -7 -40 4 -7 34 -15 35 -5 -12 -22 54 45 -1
6253 -1 46 52 5 -4 -25 38 8 24 16 -7 -54 18 -2 -15 -12 -27 55 56 31 27 30 -2 46 2 58 -33 -4 -21 8 -4 23 5 41 41 -9
6288 -9 36 22 -6 15 13 -16 -74 7 -11 15 -57 -2 27 28 5 -37 -41 3 -23 9 10 -21 -6 1 22 -15 4 -26 -27 13 -2 23 1 10
6322 10 -17 -10 28 -22 45 -20 37 50 6 1 -2 -7 8 -25 10 -18 -26 -3 -20 -60 -10 29 -4 18 9 19 -28 -8 16 26 -9 -13 7 24
6356 24 -18 8 -11 15 14 17 -51 17 32 -10 34 28 -19 25 -20 47 9 -46 41 -1 5 42 2 6 -52 54 -11 -23 -15 -20 -24 3 -16 12
6390 12 122 -3 31 -23 -13 -6 31 -49 -27 -25 -18 74 90 19 40 19 30 33 42 2 -5 -4 1 30 -8 -3 11 11 7 -25 -6 18 12 32 9
6425 9 -13 -15 -37 -7 20 -22 -29 23 -18 -8 -9 -44 3 -1 -75 -26 -10 37 -15 -22 -24 4 -18 -6 5 16 -1 -40 -50 1 -42 -28 37 33
6459 33 -38 18 -27 -1 12 -16 -36 26 -48 6 73 8 12 15 -19 3 22 36 -44 -65 -20 6 0 -10 25 -16 -12 -30 8 -5 6 49
6491 49 -1 -21 7 15 -70 -3 34 28 -9 52 4 6 36 13 31 -40 19 -11 30 17 15 8 24 14 12 5 -4 -34 -61 -48 64 -14 46 14
6525 14 -21 17 -20 -52 14 -46 -11 37 9 -13 -38 22 45 -2 34 27 -34 26 33 33 15 17 24 -25 -22 -5 -45 -13 41 -25 -3 21 -5
6558 -5 4 8 -5 -23 32 2 5 8 -13 -5 -4 -25 -34 52 17 10 25 -7 48 60 1 31 -35 18 22 -12 4 -20 48 -64 -9 51 18 29 -6
6593 -6 -28 98 12 -18 9 -13 -31 19 36 28 10 39 -32 17 1 -1 -37 -41 0 11 25 -4 32 -7 3 -4 17 34 -9 10 -23 -2
6625 -2 -2 5 20 -21 -12 96 11 -16 -28 -19 -20 32 -17 -24 -27 -23 9 -18 32 -32 31 -16 -28 20 2 41 34 15 11 10 36 -37 3 -54 46
6660 46 24 16 8 3 6 6 5 10 17 -39 -24 15 -15 3 38 9 -53 -24 55 -9 -21 4 33 -28 49 -32 31 31 -14 -39 0 -17 -39 -19 -40
6695 -40 -22 -17 -26 -5 26 28 -33 26 12 72 50 -52 26 -28 -1 47 17 38 -3 -1 72 18 -37 66 -2 3 -17 11 60 21 38 -28
6727 -28 25 -31 -38 -22 13 3 -24 27 30 30 -3 29 -29 51 -44 33 -7 0 18 -28 18 -48 -2 -16 43 17 -15 -20 5 -2 -26 2 18
6760 18 -26 -16 10 -2 19 -4 -22 -14 -43 2 -6 48 52 -9 21 11 -10 -5 -22 15 36 14 22 39 15 52 19 -22 -20 -5 37 11 45
6793 45 -10 -13 1 90 18 31 1 -44 -11 -21 -36 -21 20 2 -20 -36 -6 -36 2 11 26 29 -15 -25 5 34 -2 -21 -5 -29 15 20
6825 20 -1 21 -5 -44 -15 1 -15 -3 53 -6 -37 13 -10 29 -27 44 -3 -19 -4 -24 25 -47 -8 11 27 46 -44 -46 -10 -44 -32
6856 -32 6 -52 -1 21 -41 -1 -10 5 24 44 34 39 -46 -19 -11 -43 9 22 30 95 1 30 12 -5 35 33 15 14 56 15 -39 -35 -5 -47
6890 -47 -38 -44 10 -34 -38 4 -19 -30 13 30 -17 -22 -1 -14 -23 -26 -1 -35 15 6 23 39 -19 2 5 -18 83 -16 -3 24 30 -21 2 -19
6924 -19 -25 -26 45 28 10 -18 -23 -23 -33 -25 15 34 -8 22 -31 -43 6 -29 -45 46 55 14 -2 26 -18 -32 -14 5 19 8 -16 61 -18
6957 -18 -64 -39 2 9 -41 -6 27 14 -13 -32 40 -18 32 20 23 8 4 -22 -11 1 -8 9 -11 21 -27 -14 -39 31 -8 -5 27 31 -22
6990 -22 10 -14 15 -18 19 41 50 10 26 35 35 18 -27 29 9 16 23 -14 -29 -4 -13 51 7 -35 15 6 -30 37 26 -10 24 -25 27 50
7024 50 -29 39 -25 41 -24 -36 35 -4 11 3 -3 -18 7 -16 52 35 51 17 4 -11 -16 20 7 27 81 2 -38 36 22 -23 -4 26
7056 26 13 -4 26 -4 45 -13 -7 24 -8 32 -53 6 35 32 32 -15 26 -7 -32 -30 16 -8 8 -14 -19 81 8 19 21 14 10 21 40 -10
7090 -10 18 27 38 41 5 -11 -16 -12 15 -35 44 -22 -33 6 -31 -43 -5 -7 59 35 31 -34 20 30 44 18 14 33 16 -28 -35 -11 -7 14 -7
7125 -7 5 60 31 16 18 9 13 25 -15 23 7 2 7 -49 -30 1 7 -40 -15 0 8 4 19 -18 -44 9 31 -9 26 -20 -22 45 27 12 -32
7160 -32 84 29 -14 4 -20 37 -6 -36 -28 -29 -15 -14 -6 41 15 26 -18 40 -16 -16 -3 -45 35 -22 39 1 -7 -6 18 -31 36 18 2
7193 2 -10 -4 -66 28 -5 -76 -38 6 22 -14 0 -10 -22 18 55 46 11 -12 -20 -9 48 19 -37 -7 43 54 37 16 -32 -33 30 -34 16
7226 16 -24 -23 -6 -48 -22 -20 -10 17 -6 46 -6 -10 -48 4 -25 12 -12 -19 -36 0 26 1 -6 2 62 -31 8 54 -34 33 -17 2 -10
7259 -10 36 33 27 25 6 -17 -43 -52 -49 -4 -15 10 23 -14 -18 20 49 -8 8 8 31 0 -10 -5 39 36 16 10 14 -14 13 26 7 -3 -50 32
7295 32 25 -25 -33 19 -9 -8 -57 38 -12 14 25 -8 24 -29 21 32 28 20 13 -9 -7 -51 33 15 -8 -24 -28 -62 -37 -3 -48 -32 19 -15
7329 -15 18 -22 34 21 23 24 39 15 -4 59 12 -60 39 42 54 -17 13 -10 -15 5 -32 -18 -25 -2 -12 -40 1 16 68 36 2 -35 35
7362 35 33 3 21 7 -6 -4 37 23 9 27 49 51 34 5 -3 49 30 41 -19 10 -18 -9 -12 8 -23 4 13 -30 -25 -38 6 -51 21 -11
7396 -11 27 -22 -20 -21 -20 26 14 17 26 -25 -57 5 -11 -64 -18 33 5 1 79 12 -30 -15 14 54 -45 30 39 1 -21 18 -11 33 -7 -9
7430 -9 -28 27 41 31 -37 -9 -21 -22 14 -34 30 19 10 14 25 -11 3 18 9 -13 2 -42 2 57 -40 28 -19 4 4 -41 -22 45 -15
7463 -15 18 -6 -25 8 -2 47 10 0 38 -45 -3 1 -21 -12 42 -6 -31 -14 0 43 -10 5 -26 -3 -38 -27 -4 7 -15 15 -3
7494 -3 -38 23 38 42 20 -53 -58 10 -53 26 -21 -9 -25 15 46 -6 8 12 4 -21 -27 39 24 -16 36 23 -58 23 -17 -23 -9 -30 28 -5
7528 -5 52 30 4 -15 9 16 -72 26 23 -4 38 17 53 -42 13 4 11 -19 27 -5 -8 -9 -7 57 37 17 -21 -17 5 -11 5 -20 32 -16 25
7563 25 -1 -38 -44 -16 -25 -12 -10 -10 33 -3 -13 11 -3 -20 -52 -13 -7 24 -14 44 0 -27 28 -26 3 -20 39 24 28 22 -16 2 -23 -23
7597 -23 39 40 -2 17 -55 -1 2 -15 -21 -47 -1 -33 29 -34 -10 -15 10 3 8 -4 -47 -34 -3 24 -35 46 -18 -10 -24 -22 22 -3 12 30
7631 30 18 -7 -2 5 -9 -18 -35 10 15 1 4 -37 18 -30 22 -10 27 32 26 -54 -56 1 -31 68 -31 -70 -12 -7 -15 -4 -3 -8 29 -35 21 44
7667 44 -7 -24 -19 -4 10 -8 -27 -39 1 0 16 26 -7 -25 12 -10 -5 7 34 24 -41 14 -11 42 8 8 16 15 3 -39 15 -34 8
7700 8 -27 -13 11 -10 65 3 -35 -19 -2 -15 89 25 11 -17 -6 -50 -12 35 1 -35 2 31 26 -32 -11 -34 -45 7 -19 10 -36
7731 -36 26 -1 8 -5 11 -11 -14 15 -9 33 -53 -16 13 -54 -37 -18 3 12 -6 35 36 7 8 14 5 10 41 12 3 64 14 -55 36 3 -26
7766 -26 59 63 69 9 -15 49 7 15 60 -31 14 30 -9 -16 13 10 -30 0 -40 28 -3 27 6 -7 3 4 -24 9 -20 43 62 49 -38
7799 -38 38 -16 27 42 7 30 27 -36 20 21 17 -31 18 -59 8 59 -3 -5 11 -20 -43 -33 -1 14 -4 7 -23 -5 -17 -7 36 71
7831 71 10 -15 -52 19 1 -7 7 21 -3 46 -8 -5 8 37 -13 13 10 -29 -30 -1 19 -33 4 9 -9 31 29 -44 -13 -4 -27 -35 -1 -7 -33
7866 -33 -38 10 -1 -25 22 68 0 -17 -27 3 11 15 -32 -15 -28 7 -10 13 -3 -10 41 29 30 -24 -6 -29 20 57 20 -5 43 -14 -34
7899 -34 21 36 1 -47 -13 29 9 -18 11 17 8 -29 29 25 65 -34 -11 4 2 2 6 4 4 -13 13 31 -26 -30 -6 10 4 6 49 5 9 -4
7935 -4 17 1 24 -7 35 -9 -55 -6 -57 1 15 71 -40 -18 2 -30 8 -28 12 50 -16 45 -4 -21 -3 23 20 2 1 19 -40
7966 -40 41 0 5 -14 17 -3 26 -2 35 24 39 -19 29 3 -2 -68 -29 -8 14 -27 -14 -34 -38 -7 -55 -55 -28 17 5 24 -21 -52
7998 -52 8 11 36 -7 -5 -9 -21 -5 -4 -7 -40 31 18 38 36 16 -8 18 28 -5 -1 -15 46 37 29 12 29 13 5 -3 -24 -24 62 18 -24 -2
8034 -2 51 14 -32 -18 42 -16 29 28 11 15 27 -34 6 -24 4 50 12 -24 14 18 -4 -22 -43 28 86 9 4 21 -26 -32 -31 8 -3 -21
8068 -21 -5 -24 -3 -32 -17 26 -24 -28 -3 -39 -26 28 -11 23 47 -5 -19 27 -49 12 -13 24 -10 57 33 -33 -27 -33 -11 -45 61
8099 61 4 27 50 -12 15 -42 17 18 15 66 1 1 7 2 -3 1 -58 24 14 14 -13 7 48 -42 10 -4 -69 5 21 -32 45 -32 -29 -21 53
8134 53 2 -27 -12 4 13 42 -1 36 2 -16 19 -20 8 0 -43 -7 3 -12 -2 -15 63 47 12 -11 40 -3 -53 -21 -34 29 41
8165 41 7 17 5 -23 -1 19 65 -29 38 -21 -24 -18 35 16 -11 58 2 19 42 49 51 -53 -21 -7 33 -17
8191a7
$$ Imaginary data points
##PAGE= N=2
##DATA TABLE= (X++(I..I)), XYDATA
0 0 0 0 0 0 0 0 0 0 0 0 0 0 0 0 0 0 0 0 0 0 0 0 0 0 1 -4 4 -4 8 -8 8 -10 12 -12 15 -19 20 -21 27 -30 33 -38 43 -47 52 -58
46 -58 66 -72 78 -88 97 -105 116 -128 140 -152 166 -180 196 -210 225 -237 243 -239 204 -104 -169
67 -169 990 -4244 37325 316244 116077 -273866 -158187 180001 173767 -76636 -144038 -29283
79 -29283 77024 107159 14524 -155428 -115339 160518 206591 -129895 -268655 73715 295628
90 295628 -5332 -277753 -55625 225296 97626 -143973 -108786 53034 87926 34668 -37967
101 -37967 -102885 -31182 142460 104723 -151280 -170781 129788 213587 -89822 -229199 39238
112 39238 211103 5907 -166509 -37507 101898 47687 -29422 -34072 -37530 2384 91234
123 91234 42956 -121890 -88452 131281 127580 -119140 -149469 94254 151675 -63576 -133566
134 -133566 35040 97801 -16443 -53094 8658 4187 -14916 38038 28737 -71777 -48221 91197
146 91197 65751 -98306 -77392 94880 80028 -84154 -71121 72563 54405 -61103 -29990
157 -29990 54853 4984 -51415 19639 51681 -38987 -52134 52272 50176 -60534 -44929 63603
169 63603 33287 -66244 -18763 67490 300 -71551 16377 75841 -30598 -80400 39326 82415
181 82415 -41626 -78653 39860 68736 -34108 -49601 30235 25110 -28481 4494 33544 -33234
193 -33234 -43965 57722 58910 -74170 -75861 79000 88804 -73778 -95845 57911 90501 -38093
205 -38093 -73979 17041 44556 -1670 -6960 -4719 -33981 51 72759 16283 -101417 -38964
217 -38964 117539 65237 -115863 -86095 99946 97537 -71127 -93677 36736 73327 -3976
228 -3976 -38575 -21251 -7139 32232 54694 -29300 -98744 11001 129309 15598 -143365
239 -143365 -45773 137394 71010 -113477 -84354 77165 82510 -34026 -62109 -5575 27591
250 27591 36921 17922 -52409 -65144 52039 107461 -35917 -136710 9133 147686 21061
261 21061 -139687 -48432 112484 63845 -73326 -65152 27252 48435 15607 -17451 -49281 -23633
273 -23633 67882 67536 -69131 -105316 55584 131385 -30354 -139031 2230 129072 23752
284 23752 -101338 -39251 62591 41332 -18964 -28738 -22125 3229 53204 29026 -71838 -63608
296 -63608 74445 91750 -64929 -109925 45450 113028 -22834 -101360 2425 76908 11375
307 11375 -43209 -14250 7345 7479 26856 9166 -52473 -30122 68313 52279 -72064 -69805
319 -69805 65959 79078 -53049 -78521 36658 66546 -22499 -46865 11917 20758 -8764 5534
331 5534 11399 -29959 -19398 48233 29581 -58980 -38642 62759 44662 -59453 -44187 53411
343 53411 38576 -44969 -26671 38151 11996 -32872 4413 30205 -19601 -29565 31579 28746
355 28746 -40460 -27855 44510 23673 -46584 -17751 45893 8557 -45509 1721 44954 -12171
367 -12171 -44893 21500 45301 -27454 -43877 31064 41081 -30633 -33831 29228 23690 -26688
379 -26688 -9418 25887 -6690 -27387 22790 31369 -37114 -38210 46313 44780 -50483 -50780 47583
392 47583 51761 -40384 -47556 29580 36180 -18638 -18489 10270 -3238 -6167 27303 8703 -48390
405 -48390 -15827 64968 27538 -72609 -39259 71778 48678 -62059 -52147 45560 47089 -26500
417 -26500 -33876 7468 11994 6066 13926 -13274 -41883 11244 65828 -2093 -82705 -12309 89328
430 89328 28205 -84143 -40607 69356 46925 -46313 -42774 21080 29443 3208 -6559 -20895
442 -20895 -21121 29824 49672 -29006 -74280 18827 89645 -3730 -94600 -13761 86474 27141
454 27141 -68717 -34250 43011 31403 -15032 -18944 -10665 -1473 30404 27157 -40236 -52221 41004
467 41004 73892 -32098 -86297 18115 88682 -1725 -79296 -11972 60201 19436 -35024 -19100
479 -19100 6924 9384 17923 6614 -37523 -27541 47613 47920 -49005 -64707 41867 73791 -29312
492 -29312 -73312 15318 63730 -2769 -45386 -4155 22961 5152 1542 1367 -22920 -12494 39164
505 39164 26564 -48164 -40038 49507 49556 -45043 -53799 35865 50369 -26150 -40850 16868 25557
518 25557 -11427 -7798 9733 -10302 -12034 26224 17513 -37510 -23357 44350 28956 -45329 -31089
531 -31089 42999 30134 -37426 -24549 31428 15652 -25991 -4574 21982 -7518 -20180 17917
543 17917 19163 -26956 -19366 32317 18172 -35432 -16128 35612 11732 -34554 -5475 33063
555 33063 -1737 -31289 9852 30462 -16400 -29067 22082 27798 -24938 -24663 26241 19914 -25742
568 -25742 -12842 24535 3512 -23982 6483 23770 -17276 -25660 25793 27733 -32387 -30677 34864
581 34864 31968 -34015 -31116 29886 26957 -23496 -18554 17203 7317 -11569 7215 9393 -21533
594 -21533 -9807 34968 13886 -44349 -19551 48906 25438 -47956 -29868 41224 29976 -31288
606 -31288 -25701 18936 15527 -7994 -1560 -574 -15507 4332 32333 -3313 -46636 -1740 56259
619 56259 9876 -58768 -17532 55067 23740 -44466 -24882 30366 20775 -14214 -10583 -348
631 -348 -4283 11082 21605 -16774 -39199 16053 52996 -10801 -61780 1614 62597 7553 -56473
644 -56473 -15054 43545 17886 -26348 -14784 8371 6129 8475 7805 -20304 -23615 26770 39572
657 39572 -26315 -51635 20852 58226 -11965 -57657 2402 49806 4942 -36611 -8639 19102
669 19102 6503 -1573 136 -14641 -11381 26102 24047 -32259 -36243 32696 45464 -28025 -49212
682 -49212 20757 47440 -12018 -39062 5328 26608 -1127 -10689 1504 -5219 -5792 19299 12947
695 12947 -29770 -21740 34857 29264 -35644 -34862 31697 35756 -25729 -32554 18588 24528 -12651
708 -12651 -13422 9116 992 -8025 11602 10052 -21651 -13096 29237 17260 -32490 -19951 33016
721 33016 21073 -30325 -19051 26324 14381 -22081 -7602 17953 -959 -15517 9120 13597
733 13597 -17130 -13204 22852 12576 -26665 -11821 28269 9893 -27868 -6440 26576 2126
745 2126 -24121 3650 22403 -9085 -20174 14655 18759 -18469 -16789 21119 14379 -22062 -11094
758 -11094 21441 6088 -20602 -455 18998 -6541 -18380 12964 17913 -19050 -18312 23264 18805
771 18805 -25215 -18596 25084 17338 -22448 -13718 19070 8449 -14657 -604 11378 -8038 -9004
784 -9004 17336 8798 -25445 -10151 31361 12380 -34385 -15017 33319 16219 -29580 -15699
796 -15699 22831 11784 -15307 -5224 7810 -3968 -1905 14718 -1117 -25054 1631 33965
808 33965 1058 -39094 -4651 40670 9075 -37190 -11657 30260 11885 -20578 -8588 9947
820 9947 1781 -520 7388 -6857 -18413 10363 28510 -10839 -36834 7754 41006 -3068 -40947
833 -40947 -1947 36179 5841 -27312 -6641 16388 4522 -4171 1616 -6169 -9813 14349 19805
846 19805 -18412 -28976 18751 35985 -15881 -39317 10615 37823 -5287 -32248 479 22446
858 22446 1158 -10921 -104 -1470 -4430 11990 11174 -19740 -18857 23803 26239 -23739 -30855 20961
872 20961 32543 -15697 -29764 10567 23672 -5962 -14394 3686 3781 -3845 6741 6429 -16030
885 -16030 -11096 22179 15860 -25638 -20471 25473 22735 -23080 -22666 18843 19484 -14177 -13455 10370
899 10370 5751 -7601 3254 7147 -11439 -7709 18668 9821 -23146 -11784 25455 13248 -25088
912 -25088 -13260 22842 11219 -19669 -7596 15776 1964 -12839 3893 10339 -10178 -9010
924 -9010 15375 8294 -19168 -7719 21435 7105 -21684 -5354 21024 3146 -18883 437
936 437 16992 -4275 -14573 8661 12812 -12337 -11141 15270 9522 -17251 -7813 17646 5122
949 5122 -17511 -2210 16027 -1966 -14864 6193 13326 -10774 -12334 14935 11689 -17834 -10944
962 -10944 19697 10371 -19390 -8555 18265 6306 -15480 -2294 12563 -2516 -9622 8252
974 8252 7405 -14132 -6345 19101 6061 -22951 -6872 24394 7396 -24001 -7681 21063 6566
987 6566 -16723 -3954 11481 -273 -6294 6159 2297 -12453 577 19026 -1113 -24009 540
1000 540 27204 1425 -27666 -3312 25319 4615 -20567 -4371 13955 1865 -7037 2287 208
1013 208 -8415 4709 14950 -7862 -21407 8452 26199 -7109 -28525 4523 27963 -1529
1025 -1529 -23964 -282 17989 898 -9958 1008 2010 -4532 5390 9886 -10819 -15795 13674
1038 13674 21018 -14225 -24895 12236 25887 -9355 -24457 5773 19806 -3182 -13226 1995
1050 1995 5188 -2753 2945 5552 -9856 -9426 15168 14295 -17536 -18085 17876 20863 -15761 -21022
1064 -21022 12635 18843 -9028 -14145 5993 7491 -4515 -151 4278 -7355 -6065 13374 8469
1077 8469 -17847 -11625 19695 13839 -19550 -14863 17567 14033 -14338 -11008 11210 6656 -8037
1090 -8037 -689 6393 -5190 -5491 11027 5898 -15379 -6732 18228 7711 -19311 -8269 18496
1103 18496 7602 -16744 -6065 13813 2943 -11161 801 8509 -5246 -6727 9448 5527
1115 5527 -12997 -4686 15598 4317 -16628 -3459 16839 2520 -15559 -479 13856 -1912
1127 -1912 -11663 4962 9639 -8101 -7851 10753 6139 -13180 -4914 14255 3314 -14709 -1702
1140 -1702 13913 -593 -12653 3089 11045 -6098 -9415 9184 8139 -11736 -6810 14007 6061
1153 6061 -14821 -4851 14954 3738 -13797 -1872 11980 -661 -9673 3687 7196 -7328 -5488
1166 -5488 10853 3920 -14196 -3402 16373 3134 -17547 -3220 17018 2972 -15160 -1992
1178 -1992 12193 361 -8419 2769 4922 -6139 -1597 10450 -457 -14303 1665 17482 -1603
1191 -1603 -19176 902 19159 -176 -17407 -432 13748 -213 -9473 1617 4342 -4527 133
1204 133 8005 -3813 -12077 5980 15780 -6644 -18277 6226 19504 -4597 -18338 3141 15725
1217 15725 -1750 -11193 1614 5897 -2574 -359 4959 -4649 -8266 8176 11633 -10402 -14957 10545
1231 10545 16865 -9656 -17412 7610 15695 -5572 -12323 3914 7505 -3134 -1801 3832 -3612
1244 -3612 -5272 8517 8004 -11766 -10354 13568 12670 -13514 -13703 12136 13336 -10007 -11227 7465
1258 7465 7512 -5577 -3021 4183 -2269 -4153 6984 4827 -11043 -6260 13775 7839 -14814 -8888
1272 -8888 14573 9336 -12701 -8198 10617 6188 -7897 -2704 5913 -1226 -4367 5544 3701 -9378
1286 -9378 -3771 12243 4203 -14063 -4828 14235 4673 -13656 -4256 11810 2550 -9823 -387
1299 -387 7410 -2571 -5494 5745 4149 -8529 -2990 11101 2560 -12397 -1842 13068 1350
1312 1350 -12421 -293 11267 -1027 -9596 2827 7674 -5043 -5947 6984 4183 -9106 -3094
1325 -3094 10335 1815 -11236 -925 11071 -259 -10320 1683 9169 -3301 -7473 5230 6097
1338 6097 -7066 -4470 9075 3446 -10314 -2321 11172 1599 -11080 -585 10283 -696 -8873
1351 -8873 2083 6904 -4244 -5124 6345 3234 -8758 -1970 10653 943 -12059 -375 12595
1364 12595 117 -12080 328 10835 -868 -8421 2140 5900 -3624 -2984 5892 664 -8143
1377 -8143 1293 10477 -2491 -12286 2714 13103 -2729 -13001 2078 11537 -1868 -9273 1841
1390 1841 5972 -2726 -2569 4219 -734 -6248 3466 8736 -5081 -10713 6018 12410 -5619 -12606
1404 -12606 4975 11953 -3815 -9768 3045 6641 -2852 -2977 3283 -966 -4709 4302 6314 -7049
1418 -7049 -8430 8396 9982 -8887 -11096 8145 10923 -6845 -9533 5396 7164 -3957 -3649 3351
1432 3351 26 -3253 3949 4136 -7088 -5321 9384 6783 -10468 -7963 10304 8429 -9342 -8070
1446 -8070 7529 6304 -5886 -3932 4097 501 -3324 2869 2931 -6195 -3250 8875 4028 -10494
1460 -10494 -4714 11144 5377 -10539 -5110 9419 4431 -7491 -2546 5735 193 -4016 2673 2830
1474 2830 -5522 -2211 7931 1891 -9807 -2137 10636 2122 -10749 -2092 9825 1488 -8360 -471
1488 -471 6573 -1129 -4688 3184 3221 -5093 -1895 7158 1201 -8521 -569 9440 391 -9358 23
1503 23 8795 -608 -7668 1549 6157 -2892 -4750 4230 3110 -5831 -2007 7024 924 -7939 -193
1518 -193 8311 -522 -8087 1368 7488 -2118 -6167 3302 4995 -4417 -3389 5854 2245 -6871 -1133
1533 -1133 7793 233 -8193 402 8019 -1102 -7410 1696 6106 -2764 -4782 3725 3092 -5148 -1762
1548 -1762 6396 529 -7553 394 8399 -872 -8559 1312 8322 -1348 -7143 1887 5755 -2381 -3741
1563 -3741 3454 1854 -4601 0 5977 -1454 -7431 2300 8265 -2786 -8901 2659 8479 -2553
1577 -2553 -7562 2358 5744 -2478 -3544 2998 1244 -3707 1183 4997 -2919 -6184 4449 7491 -4909
1592 -4909 -8094 4952 8355 -4363 -7507 3715 5963 -3085 -3846 2754 1207 -3014 1299 3514
1606 3514 -3747 -4611 5356 5625 -6393 -6611 6611 7022 -6086 -6687 5262 5874 -4063 -3864 3289 1670
1622 1670 -2589 1051 2653 -3519 -2938 5630 3635 -7072 -4509 7650 4915 -7647 -5173 6689
1636 6689 4547 -5689 -3433 4211 1504 -3127 741 2337 -3061 -1846 5311 2005 -6876 -2178 8025
1651 8025 2772 -8098 -2698 7709 2764 -6541 -2011 5222 829 -3761 917 2491 -2883 -1643
1665 -1643 4581 1060 -6297 -958 7199 868 -7693 -1011 7440 895 -6578 -379 5502 -352 -4031
1680 -4031 1620 2809 -2827 -1539 4358 798 -5494 -91 6440 -186 -6827 432 6691 -739 -6136
1695 -6136 1101 5078 -1865 -3898 2536 2534 -3660 -1432 4571 366 -5498 292 6030 -843 -6056 1309
1711 1309 5870 -1641 -5024 2282 4185 -2745 -2939 3601 1838 -4277 -754 5034 -113 -5586 693
1726 693 5733 -1200 -5657 1484 5029 -1970 -4220 2402 3016 -3059 -1764 3849 682 -4540 364
1741 364 5299 -1055 -5647 1621 5910 -1774 -5519 2030 4810 -2114 -3682 2439 2280 -2936 -859
1756 -859 3559 -618 -4368 1609 4996 -2492 -5603 2746 5724 -2889 -5525 2733 4750 -2516 -3411
1771 -3411 2517 2006 -2551 -191 3028 -1282 -3470 2711 4280 -3545 -4775 4052 5219 -4047 -5132
1786 -5132 3624 4471 -3208 -3565 2561 1910 -2390 -376 2225 -1629 -2512 3073 2948 -4288 -3477 5046
1802 5046 4009 -5067 -4049 4842 3953 -4072 -3047 3394 1904 -2519 -258 2075 -1412 -1771 3155
1817 3155 1767 -4580 -2120 5333 2418 -5852 -2766 5459 2660 -4986 -2337 3926 1387 -3026 -174
1832 -174 2112 -1242 -1351 2877 1088 -4081 -876 5247 1191 -5665 -1247 5755 1425 -5246 -1271
1847 -1271 4426 715 -3385 75 2274 -1279 -1482 2477 644 -3730 -237 4652 27 -5215 -100
1862 -100 5403 52 -5171 86 4514 -320 -3443 945 2451 -1651 -1356 2661 443 -3455 168
1877 168 4236 -638 -4744 781 4774 -992 -4682 1057 3971 -1381 -3205 1732 2086 -2227 -1175
1892 -1175 2842 308 -3383 421 3965 -856 -4134 1288 4216 -1393 -3845 1691 3374 -1866 -2491
1907 -2491 2231 1572 -2656 -701 3047 -232 -3543 717 3770 -1419 -3980 1523 3699 -1847 -3360
1922 -3360 1955 2624 -2246 -1688 2524 803 -2761 202 3271 -927 -3487 1614 3846 -1784 -3739
1937 -3739 2091 3541 -2080 -2975 2059 2128 -2151 -1212 2258 46 -2608 829 2883 -1736 -3241 2212
1953 2212 3453 -2513 -3544 2559 3300 -2384 -2746 2201 2101 -1963 -890 2034 -123 -2033 1346 2320
1969 2320 -2236 -2647 2900 2879 -3216 -3056 3166 2876 -2975 -2527 2491 1746 -2205 -815 1819 -443 -1598
1986 -1598 1595 1636 -2618 -1752 3473 2041 -3729 -2128 3873 2245 -3497 -1996 3060 1547 -2398 -670
2002 -670 1826 -366 -1326 1375 1021 -2553 -1040 3290 1025 -3962 -1233 4022 1286 -3938 -1230 3463
2018 3463 990 -2703 -372 1992 -308 -1225 1330 754 -2244 -289 3232 227 -3802 -197 4094
2033 4094 341 -4013 -347 3580 137 -2999 69 2093 -742 -1358 1343 514 -2250 -63 2844
2048 2844 -352 -3408 451 3709 -463 -3695 548 3446 -469 -2750 761 2186 -998 -1278 1512
2063 1512 536 -2025 111 2554 -574 -3072 832 3223 -1058 -3311 970 2964 -1151 -2546 1204
2078 1204 1790 -1416 -1097 1724 365 -2072 358 2489 -759 -2717 1144 2920 -1316 -2778 1497
2093 1497 2521 -1457 -2051 1591 1394 -1766 -727 1908 -39 -2225 594 2427 -1124 -2630 1323
2108 1323 2574 -1546 -2457 1593 2135 -1581 -1545 1773 950 -1695 -154 1971 -442 -2097 1029 2370
2124 2370 -1388 -2477 1657 2366 -1782 -2243 1697 1772 -1692 -1320 1625 548 -1703 163 1716 -898
2140 -898 -1907 1427 2031 -1831 -2146 2032 2210 -2060 -1943 1994 1640 -1684 -998 1692 299 -1443 450
2157 450 1447 -1201 -1555 1820 1612 -2362 -1768 2419 1747 -2486 -1677 2192 1345 -1959 -900 1574 227
2174 227 -1340 480 1131 -1274 -1025 1979 1211 -2332 -1196 2725 1363 -2639 -1299 2528 1170 -2129
2190 -2129 -722 1652 210 -1201 485 855 -1252 -797 1900 617 -2501 -671 2760 721 -2854
2205 -2854 -728 2692 706 -2288 -343 1781 20 -1222 635 822 -1180 -357 1828 199 -2297
2220 -2297 -57 2674 42 -2866 -118 2654 33 -2384 17 1845 -321 -1387 658 717 -1147
2235 -1147 -229 1634 -110 -2147 337 2473 -413 -2562 478 2585 -418 -2187 461 1871 -621
2250 -621 -1239 814 652 -1166 -153 1527 -332 -1953 530 2158 -769 -2291 776 2148 -846 -2036
2266 -2036 866 1544 -907 -1003 1141 543 -1219 108 1563 -457 -1683 884 1946 -960 -1938 1126
2282 1126 1918 -1150 -1658 1146 1230 -1157 -835 1145 204 -1327 195 1432 -696 -1668 957 1728 -1159
2299 -1159 -1737 1263 1612 -1195 -1362 1247 962 -1176 -457 1179 20 -1254 553 1424 -911 -1538 1197
2316 1197 1582 -1374 -1566 1389 1381 -1407 -1127 1243 657 -1241 -204 1135 -356 -1201 789 1205 -1148
2333 -1148 -1290 1521 1341 -1550 -1265 1602 1210 -1462 -917 1352 546 -1117 -62 987 -491 -994 929
2350 929 904 -1409 -1014 1585 1005 -1778 -1043 1764 960 -1550 -748 1345 439 -1103 99 933 -545
2367 -545 -666 1109 654 -1447 -580 1809 668 -1971 -665 1889 601 -1736 -534 1410 147 -1194
2383 -1194 107 768 -582 -485 1036 363 -1441 -265 1790 252 -1940 -252 1994 316 -1761 -165
2399 -165 1564 136 -1091 260 837 -572 -392 1016 138 -1359 34 1627 -109 -1857 54 1867
2415 1867 -159 -1822 28 1427 -228 -1169 344 680 -574 -281 971 17 -1179 319 1509 -360
2431 -360 -1596 522 1758 -491 -1583 509 1440 -404 -1050 512 639 -713 -269 864 -193 -1116
2447 -1116 345 1269 -638 -1514 687 1490 -649 -1429 676 1221 -649 -868 693 543 -695 -98 886
2464 886 -238 -1046 552 1216 -724 -1299 752 1261 -878 -1248 819 976 -840 -758 745 339 -832
2481 -832 -45 862 -389 -969 674 1044 -832 -1101 968 1142 -919 -887 1017 808 -839 -480 857 226
2499 226 -757 194 840 -537 -823 797 853 -986 -941 991 837 -1104 -823 966 568 -869 -365 806
2517 806 -5 -726 358 772 -644 -653 962 792 -1027 -697 1184 722 -1127 -616 1092 495 -898 -172
2535 -172 733 -114 -645 347 501 -778 -588 981 477 -1265 -517 1224 485 -1225 -479 1130 318 -872
2553 -872 -44 738 -72 -499 483 374 -758 -293 1112 310 -1236 -265 1288 211 -1271 -338 1105 187
2571 187 -978 -42 644 -227 -396 405 244 -725 -118 998 85 -1130 2 1302 77 -1223 -15
2588 -15 1183 31 -892 149 693 -242 -469 458 135 -752 -12 922 -149 -1143 217 1143 -205 -1205
2606 -1205 211 1135 -201 -894 285 644 -335 -367 539 81 -582 171 873 -283 -951 422 1134 -419
2624 -419 -1042 411 947 -365 -863 376 566 -482 -356 467 11 -626 167 727 -410 -859 512 923
2642 923 -566 -904 640 876 -499 -685 533 569 -479 -156 525 -22 -536 255 622 -486 -692 634
2660 634 799 -697 -843 636 684 -634 -580 539 338 -516 -130 476 -186 -543 391 596 -560 -601 705
2679 705 665 -715 -612 702 575 -664 -439 602 283 -532 -26 465 -231 -511 389 413 -605 -554 687
2698 687 498 -766 -560 762 471 -672 -310 655 148 -456 77 468 -233 -353 528 375 -620 -321 841
2717 841 392 -828 -353 742 310 -720 -216 578 76 -504 105 295 -406 -336 574 253 -718 -250 804
2736 804 269 -812 -181 869 194 -719 -92 571 65 -383 247 312 -328 -148 592 77 -705 -127 857 -10
2756 -10 -880 -130 801 48 -754 -76 522 -78 -465 210 224 -344 -63 555 -34 -691 120 801 -23 -803 122
2777 122 809 -80 -665 63 557 -101 -362 198 166 -307 5 433 -146 -693 197 692 -226 -772 189 729
2797 729 -214 -668 227 545 -192 -282 298 201 -304 63 435 -168 -505 313 672 -354 -709 346 635 -322
2817 -322 -594 268 492 -310 -318 264 98 -303 74 353 -281 -432 363 510 -376 -556 469 551 -366 -442 355
2838 355 394 -311 -230 273 71 -320 71 356 -342 -408 413 404 -529 -500 467 440 -484 -458 394 307 -375 -184 345
2861 345 18 -238 199 349 -232 -242 450 352 -475 -366 507 396 -461 -342 437 223 -440 -118 286 -42 -349
2882 -349 164 200 -399 -280 446 212 -548 -284 458 326 -469 -221 455 233 -316 -27 346 -56 -156 295
2902 295 237 -342 -193 472 170 -508 -187 499 176 -495 -191 405 67 -397 6 199 -148 -212 236 141 -357
2923 -357 -119 449 106 -467 -81 548 120 -473 -97 459 103 -356 32 259 -111 -168 198 42 -357 -34
2943 -34 393 -25 -517 54 512 -1 -486 -78 379 -35 -340 45 212 -112 -25 269 52 -293 39 424 -1
2964 -1 -475 90 481 -53 -500 28 434 -46 -366 62 190 -213 -93 151 -30 -303 47 324 -168 -414 138
2985 138 515 -183 -431 189 389 -67 -299 143 203 -104 -48 205 -48 -272 139 329 -248 -382 164 431 -209
3006 -209 -475 189 306 -213 -285 133 99 -175 -28 195 -39 -222 214 344 -188 -305 288 394 -232 -253 267
3027 267 333 -179 -211 141 152 -162 -82 174 -91 -205 181 183 -229 -278 310 309 -279 -305 234 195 -184 -161 182 80
3051 80 -204 22 184 -110 -102 279 170 -267 -180 350 236 -372 -217 297 146 -256 -144 209 44 -184 12
3072 12 131 -133 -79 202 140 -266 -130 351 155 -284 -161 340 172 -245 -127 222 78 -150 64 72 -146 -89
3094 -89 206 96 -344 -166 341 52 -349 -147 245 63 -253 -94 172 9 -135 85 103 -157 -25 257 63
3115 63 -261 -54 364 80 -280 -9 249 59 -257 -28 153 27 -152 39 51 -155 -46 178 -19 -310 -6
3136 -6 333 5 -310 -40 296 62 -230 -4 217 31 -70 129 15 -128 40 219 -42 -255 89 319 -67
3157 -67 -271 45 249 -15 -312 37 173 -63 -103 101 4 -152 25 141 -103 -194 106 224 -80 -256 86
3178 86 261 -68 -193 35 194 -49 -109 59 -36 -100 88 102 -132 -254 80 237 -148 -211 61 218 -83 -206
3200 -206 87 129 -58 -39 102 25 -72 69 142 -105 -166 113 171 -161 -188 157 182 -172 -177 63 57 -122 -97 68 -28
3225 -28 -108 87 30 -182 -158 89 144 -142 -191 135 143 -133 -74 147 102 -44 -35 70 29 -21 150 81 -167 -15 211
3250 211 161 -198 -141 190 64 -177 -148 110 22 -94 -18 35 -68 -53 92 10 -117 0 231 92 -195 -133 169
3273 169 126 -168 -66 148 55 -68 -38 25 -2 -57 114 -18 -155 -35 173 -18 -234 -46 209 67 -147 -25
3295 -25 109 17 -111 22 63 -3 5 109 5 -135 51 152 48 -206 15 202 -13 -177 -4 80 -26 -134
3317 -134 -35 14 -101 -29 90 -23 -175 10 180 -28 -93 -4 177 50 -139 24 140 43 -105 85 54 3 23
3340 23 27 1 -110 15 73 -129 -176 54 186 -31 -144 1 89 -27 -93 21 2 -31 53 55 -56 -97 140 172 -27
3365 -27 -140 49 173 -33 -117 101 99 -9 -30 20 8 -27 -37 -14 -102 -124 114 96 -144 -158 62 111 -111 -184 65
3390 65 107 -56 -63 81 51 32 30 47 -13 -64 108 60 -138 -94 140 132 -93 -112 76 103 -77 -29 40 -15 -49 62 20
3417 20 -43 -46 119 53 -111 -75 154 101 -65 -117 96 103 -42 -4 51 17 51 11 -15 -114 -47 81 -10 -187 -54 99
3443 99 29 -77 -107 87 71 -3 -36 40 -12 -4 59 -4 2 -5 87 53 -123 42 160 44 -113 -9 101 39 -58 32 -9
3470 -9 4 -87 -31 -61 -104 -64 36 8 -164 -2 107 -1 -110 -36 139 45 -65 12 77 30 2 67 -42 -18 27 94
3496 94 10 -73 -19 86 -7 -80 -54 83 1 -99 -47 -4 21 -44 2 -31 8 58 29 -42 -84 10 65 15 -71 35 114 -37
3524 -37 -12 3 57 -47 25 4 -28 -73 40 79 -30 -101 11 67 -27 -85 -10 79 -12 -77 -12 31 -10 -21 -7 24 -14 5
3552 5 68 2 -71 58 124 -133 -31 60 100 -13 -126 -72 11 56 -21 -19 -21 -39 72 7 -52 -32 53 73 -26 -110 35 76
3580 76 -35 -39 27 64 -38 48 27 -44 -34 4 19 -68 6 74 38 -38 -115 58 -36 -36 -52 8 32 0 50 -15 -19 -32 79 36
3610 36 -73 -28 107 66 -46 -11 53 87 -19 -64 53 59 -14 -54 -8 -30 -20 16 7 -106 -58 16 -15 -75 -60 100 18 -39
3638 -39 -85 28 31 -31 28 29 -30 -10 65 -37 -55 77 93 -31 -102 -15 42 -23 -80 -77 -56 -5 -10 -21 -44 -92 13 10 -36 -74
3668 -74 -14 87 28 -34 -1 66 27 -71 -34 22 23 -5 -6 4 8 -32 36 -40 -47 -8 12 -56 -120 -17 35 0 -57 -8 -3 -12 6 -14
3700 -14 50 -53 33 75 48 3 -10 96 -8 -53 39 99 -6 -35 -1 21 30 -46 -2 -39 -29 47 46 -61 -25 13 38 -33 -105
3729 -105 -21 48 -28 -76 -20 1 55 -22 90 -7 22 6 -12 -25 10 47 74 -40 -55 13 34 -21 -80 2 -31 -23 16 -42 -62
3758 -62 17 -6 -45 -23 -51 71 52 -51 -40 -2 -38 48 -10 34 49 8 17 59 -24 27 3 -37 -36 -26 16 36 -41 -69 41 1
3788 1 -12 -54 34 11 6 -43 -24 5 56 11 46 -19 36 49 13 -13 18 48 83 -41 -20 14 23 -1 -49 -17 1 15 -55 -42 -25
3819 -25 -18 43 -8 -57 37 7 29 -46 -35 62 56 71 11 37 36 42 46 50 -20 41 40 -71 -18 26 49 18 -81 -74 -38 56 -48 -33 -45
3852 -45 -46 8 -7 10 -33 -12 -24 -45 17 -5 37 60 -2 -28 41 14 40 17 3 10 -2 -4 -24 -42 -1 4 -27 -52 -77 53 -24 -17
3884 -17 -38 24 4 23 8 38 -19 -3 -19 -18 5 28 57 -1 46 18 54 18 -72 -36 4 42 -57 -16 -45 38 7 -54 -25 43 30
3915 30 -24 -1 -30 48 24 21 -47 37 10 -4 -1 -1 28 11 -17 -67 32 4 13 -33 -26 -37 1 -28 -69 -16 -15 -65 1 29 -36 41 33 -30
3949 -30 -6 -21 37 50 -11 -39 18 19 16 16 -14 54 -7 -3 -9 15 -24 37 -64 -31 -20 -40 -11 4 -80 15 -29 4 -13 -55 -5 -22
3981 -22 45 -29 21 -35 60 4 22 32 65 31 -4 -17 55 80 29 -58 39 32 -12 39 7 7 -30 7 -34 -20 -42 4 74 -32 -14
4012 -14 29 35 3 -13 2 30 -12 -40 -21 0 50 65 -53 1 20 61 -12 -44 -12 34 -14 -9 -3 -9 21 10 -5 -15 30 -10 -23 -35
4044 -35 -39 13 74 49 0 67 44 -3 -16 -34 -35 8 70 -81 -41 -32 51 -4 -34 -52 -38 -39 -34 -30 -21 25 -31 -29 -5 -47 31 57 -24 -18
4078 -18 0 42 38 15 -16 41 35 36 17 58 58 18 35 7 -16 8 26 -32 -15 8 5 -9 -34 -41 0 -31 -23 -8 35 -39 7 13 39 -32
4112 -32 44 17 16 17 -12 32 22 14 17 48 13 -17 -40 12 23 26 -48 32 -11 -2 -17 -52 19 -33 -29 61 -26 21 23 -26 -66 15 28 23 21
4147 21 -5 28 -1 22 15 -18 -4 -30 32 0 4 -9 16 43 -57 5 2 -17 17 17 57 6 70 -47 -13 12 65 67 -63 -12 19
4178 19 34 11 15 -10 3 7 -22 -14 -10 -69 -26 -51 -20 -32 17 6 -9 -59 36 5 21 9 -24 60 34 -26 -15 -22 7 21 -26 79
4210 79 -56 19 48 -10 -32 -9 32 13 3 23 -9 -29 -15 -58 -17 42 1 -24 -12 15 46 1 -41 -34 1 -23 9 4 23 -5 41
4241 41 2 30 13 1 13 -22 -10 1 -9 -32 4 -12 5 25 14 -59 -25 9 16 -35 17 -17 8 -24 4 -59 -16 52 28 26 -36
4272 -36 48 -8 -4 -11 -15 -46 26 -21 -24 -1 2 8 16 -33 18 -7 -4 -3 37 27 -11 -1 49 2 5 6 8 -15 -45 5 -23 -2 -33 36 52 -37
4308 -37 -4 -55 -33 -24 -45 -16 -23 10 -37 -36 7 22 -10 -36 -12 -43 -31 50 -16 4 6 63 13 -25 -50 29 32 -24 21 1 44 14 15
4341 15 44 -26 3 30 -14 -11 -42 9 -33 -5 -12 -37 -6 19 -34 -22 6 -14 -1 52 23 -9 28 52 -53 18 7 -51 -19 -67 20
4372 20 24 -41 -11 42 -67 6 -32 0 0 -24 51 -66 12 16 12 -7 2 43 4 -12 -31 8 -51 -24 22 35 -9 -13 34 -37 3 -3 25
4405 25 1 -11 -4 -48 -21 -30 2 -8 21 23 -22 11 5 -3 16 36 35 -18 76 6 10 19 0 39 -13 -1 1 -24 2 -31 16 -9 -49 21 -20
4440 -20 -41 -1 -28 8 -96 2 10 28 -28 28 32 -41 -12 62 40 2 24 -4 -27 36 59 25 5 -34 58 28 -11 -40 -44 -12 -10 -40
4472 -40 -14 -4 10 -13 -14 -5 45 36 -1 -2 -38 -3 8 5 -2 9 4 3 -30 1 -8 -8 -9 29 65 21 -6 20 11 -64 -1 74 -67 -69 14 36
4508 36 20 16 77 34 -13 8 78 4 14 69 -8 14 -36 27 24 55 13 19 -13 -19 11 -10 -60 -55 17 -12 4 10 39 5 62 -23 -19 35
4542 35 -36 -7 31 12 -5 27 30 -7 -26 32 1 -9 57 47 -5 -13 -21 6 -60 -16 -48 -28 6 -30 51 -21 -12 -6 25 15 -54 -47 4
4575 4 32 -10 -7 17 -16 7 -6 46 8 60 30 31 17 -54 -9 27 -15 -43 8 -23 26 -53 -12 37 -13 20 6 -42 -7 -43 -57 -74
4607 -74 26 -13 -18 13 -15 30 -40 9 -47 -6 -54 15 -44 20 10 7 22 -23 31 -2 28 -14 -36 -4 -3 26 -7 -40 -15 28 11
4638 11 -8 12 25 4 37 20 45 26 -32 -28 -53 -27 68 -30 -34 12 -10 -45 8 30 -34 14 3 -38 -36 -11 3 50 -25 -48 17 14
4670 14 -2 -15 79 48 47 10 13 8 -29 -1 42 24 30 40 -30 22 -33 -40 8 -27 -26 -25 0 -71 -46 -5 4 27 -1 22 20 33 -45 69
4704 69 -4 3 15 13 -4 38 21 29 -33 -14 5 -19 44 32 -1 19 24 -76 21 -5 7 -14 -30 32 15 -3 1 5 8 -78 -3 -56 12
4737 12 1 -75 -14 14 -15 -33 -26 8 7 24 12 -7 64 -4 18 -10 13 -14 5 8 -4 -5 -11 0 -2 11 13 59 4 78 -14 -5 14 -6
4771 -6 -4 11 19 18 -54 -8 -69 -39 -17 -3 -41 -4 29 -38 -44 10 2 -34 13 -12 -21 -14 27 -13 -11 -34 26 28 3 21 63 54 13 -32 -15 4
4807 4 -11 14 -56 -20 23 -44 -20 -11 34 -2 -46 -19 -15 27 -52 -56 8 3 -44 -32 36 6 25 21 -33 -19 -64 42 -21 22 31 27 9 22
4841 22 48 13 11 26 -15 25 21 7 -11 -22 -35 -21 47 16 -6 14 -30 11 28 18 55 -37 22 2 0 39 -42 34 -9 -47 -42 8
4873 8 -8 5 0 -38 31 -50 -23 -1 -18 -11 32 -12 34 15 15 38 -28 -4 -19 -11 9 32 -20 -38 1 -25 33 18 53 9 -19 41 -17
4906 -17 -15 28 34 -77 5 -13 37 15 -8 -36 1 53 -19 33 40 9 7 -3 -19 -22 78 20 -25 49 25 -39 12 -29 44 30 -48 14
4938 14 64 -32 20 -3 18 20 -6 -63 2 -9 -31 28 28 5 2 11 35 -30 31 16 -2 49 11 55 33 20 11 33 -33 50 32 -11 -64
4971 -64 -32 37 -6 13 -13 30 38 -18 -38 25 -33 15 24 19 -1 0 -44 8 -41 -26 -87 33 -28 10 -40 -9 -4 14 -38 -10 27 -47
5003 -47 -24 -1 -15 -20 -13 15 -13 -16 -23 44 -49 49 -4 -55 67 50 -36 9 -25 -9 -69 -2 -20 -38 -11 -29 6 -35 -16 -8 1 -13 -21
5036 -21 -64 -25 45 -60 28 -8 -28 2 37 3 23 -3 23 7 -18 4 -33 1 17 -45 36 13 -36 65 48 -54 -23 -2 1
5065 1 50 15 -18 -17 -15 -9 20 -78 13 4 15 -47 -21 22 -70 44 7 2 -18 -39 14 2 -32 -21 -57 -4 19 -45 56 -3 5 -17 -24
5098 -24 -8 -30 -11 20 -30 14 -51 58 -7 10 -21 50 -30 21 -12 16 -18 -4 51 -19 -13 -12 -15 -51 -9 33 38 -29 6 -34 29 23
5130 23 18 -28 -15 -73 -47 43 -19 -21 -65 -32 19 -1 21 50 4 -13 -37 -27 66 -2 -20 20 -1 -28 28 -6 5 16 -43 -41 -58 -55
5162 -55 -43 38 12 7 -61 -8 8 35 11 50 33 16 34 -20 67 -52 -28 59 11 13 -26 29 13 -18 -21 -9 -22 10 5 -52 -6 -26
5194 -26 21 -19 -3 -30 -22 9 -28 -63 -30 -10 -22 21 6 18 2 -21 27 -19 -15 26 20 28 -6 42 -25 19 7 6 -23 -1 -58 12 -27
5227 -27 -26 -69 56 -12 -11 7 -75 -3 28 23 40 44 8 8 1 -40 -7 -14 -24 -36 -14 25 -3 -5 -21 -8 7 -39 1 33 -23 -32 8 6 37
5262 37 76 -23 4 14 5 -4 15 3 -2 -11 1 -4 -25 35 -21 -7 -36 1 0 -59 -36 -2 -41 -16 -59 -34 6 -22 47 -37 34 18 -10
5295 -10 -22 21 16 14 46 -87 22 9 -4 14 42 22 1 -11 7 -62 8 -14 18 -15 -9 -6 -8 -32 -11 -30 -31 51 -79 -15 -25 -12
5327 -12 -31 16 -20 -28 12 1 42 5 -18 -4 35 -22 3 22 -14 99 13 13 15 39 -9 28 25 34 -15 36 29 20 -9 -16 -68 -31 10 -23
5361 -23 -11 26 -68 -38 -23 -35 58 25 35 -16 -43 26 17 -30 -8 -38 -13 -26 11 -40 10 10 -22 2 28 -18 15 -1 66 39 -11
5392 -11 -47 41 -20 -15 -43 -1 -28 -6 27 11 27 -52 -38 -22 -22 -16 -32 53 -83 39 44 -9 8 -58 51 18 -5 0 -4 21 22 2
5424 2 28 -33 45 1 7 61 -25 47 -6 17 -10 13 -16 30 -11 0 28 -20 -27 -37 -19 -29 -49 -7 -15 -9 11 -6 -5 31 -57 -58 -77 -4
5458 -4 10 12 -12 37 44 49 10 -24 -2 -5 -52 -16 13 3 37 -47 -18 15 37 1 -19 26 -18 -10 19 -16 -32 -43 -7 -20 -25 3 -38 -36
5492 -36 -33 26 -35 -82 15 -47 -12 -66 -65 -4 4 -8 -43 7 59 24 30 28 8 29 4 -10 30 8 -52 26 8 -26 -6 -39 -16 14 33
5525 33 31 -15 16 -6 18 -52 -64 -28 -11 16 -32 25 7 -23 -6 -37 -31 -8 4 18 -57 9 31 32 -16 5 56 31 33 9 -26 -39
5557 -39 -12 -15 7 24 1 63 -6 -31 -12 1 11 -12 26 55 35 -15 7 33 -37 -29 18 16 -25 -48 -62 -18 -1 -13 22 -23 2 -9
5589 -9 -45 21 -23 39 -26 0 11 -18 -15 1 -9 -26 15 23 18 23 15 -19 33 2 -6 45 -8 27 31 -18 23 -12 16 20 -21 -4 -2 -6 22 -43
5625 -43 -30 29 33 -27 -4 -7 -23 47 47 -6 -20 -18 51 -15 4 4 11 -21 10 32 -20 -36 24 26 20 -5 26 49 -22 -4 15 -62 28 -25
5659 -25 -34 -37 -37 -42 1 -32 10 21 27 3 -8 9 -30 -33 11 -9 -15 6 -36 -38 -10 -15 -29 14 25 -21 -29 36 -11 -4 -10 -7 -35 -3 22 34 -41
5696 -41 4 -36 3 -34 -30 2 -15 -61 14 1 8 -5 -16 36 -20 -17 -2 8 -48 -5 -22 11 22 34 67 -23 -32 45 54 -17 -16 55 67
5729 67 13 -1 41 8 -40 -3 0 94 -10 -18 -10 9 37 -41 -5 -30 -62 14 1 -28 -59 -67 -65 -41 -48 -7 -58 -20 8 -7 -8 -26 19
5762 19 27 -22 -17 39 23 57 22 -37 34 -6 -47 13 -1 7 -33 -22 -29 -14 -10 -57 -24 -27 9 6 38 -30 -61 -19 -38 -28 -10 -25 -17 45
5796 45 -26 20 -20 25 28 27 -10 18 68 44 0 0 -32 -30 25 -2 -12 -44 15 4 -26 -9 33 48 -26 -8 18 -31 -27 22 -21 -26 33
5829 33 -9 -34 -15 -52 -23 31 -38 -50 -10 23 -78 -52 15 35 5 -28 -26 -4 -10 2 86 26 27 29 18 18 4 -3 6 8 11 -6 21 -1
5863 -1 -38 -23 -14 -67 22 -19 43 -16 7 -19 -45 -20 -19 1 9 9 16 37 -18 -4 -2 3 48 27 32 23 28 -4 -44 -13 -36 46 -41 -41 -23 33
5899 33 -43 -20 -43 -5 -38 -17 14 18 -17 -53 -33 -9 -45 29 7 19 -24 -12 7 22 15 16 13 14 25 -11 49 26 -10 23 -22 48 -11
5932 -11 57 -23 23 4 -5 -16 -44 38 -5 -9 15 -29 6 -13 -53 7 3 10 3 38 -21 31 34 -14 -7 -40 62 38 57 0 11 19 -8 -17
5966 -17 20 32 -3 29 -10 -34 -25 -33 19 -12 -15 19 -3 -2 12 -9 11 46 -6 20 16 17 -19 -45 -51 -30 62 17 2 -5 -5 -13 -18 18 42 14
6002 14 -13 27 -21 19 -33 6 -23 -2 -34 44 -15 4 75 28 13 -25 11 -40 5 15 -17 -6 -27 -23 9 2 9 8 3 64 -3 -18 -11
6035 -11 -8 2 -3 28 -48 -23 -17 -35 -4 9 -36 -9 3 -23 8 8 46 -3 1 -19 -68 -17 12 -25 -20 -1 2 -25 -27 -22 15 32 18 -25 -61
6070 -61 5 20 -11 36 -6 38 42 7 -6 -5 -6 -1 -9 9 3 32 1 16 -4 1 8 31 -54 -28 18 -48 60 18 4 13 21 70 15 28 -4
6105 -4 -10 1 15 16 -8 47 -33 -51 39 -29 -27 57 0 2 -11 -33 42 4 2 -25 -27 -80 -23 37 10 -8 -30 5 5 -10 -39 -7 33 -28
6139 -28 -57 -4 2 31 45 -16 17 21 8 32 -14 39 -27 17 29 -75 -14 -36 -26 -47 4 -7 -22 -12 -49 15 6 4 11 -14 1 15
6171 15 6 -40 15 24 -51 -55 -26 14 23 8 0 25 -15 -11 -17 -8 8 -7 -8 -17 23 -8 36 -19 17 8 25 -14 -34 -8 -6 4 -59 5 -66 51
6207 51 -35 -5 16 -19 1 -18 -42 63 3 0 5 7 -42 12 -4 -46 -2 -13 -15 -36 3 -19 23 -22 7 26 -59 28 7 -20 -27 12
6239 12 69 2 -17 1 64 -15 -57 -45 23 7 -29 -15 7 -9 21 5 -33 -25 9 -42 4 -8 -23 -12 31 10 18 6 -5 37 33 27
6271 27 4 25 44 -25 -13 17 24 19 -17 -29 27 -39 -3 13 41 -12 5 23 -47 5 17 29 -76 17 50 15 -10 -44 31 1 43
6302 43 -23 62 37 -9 24 22 35 -33 45 53 -3 0 23 12 -42 -1 -23 46 -53 34 -52 -10 5 -6 -53 -4 -24 -13 -8 -10 -24 30 3
6335 3 12 -60 -21 15 -12 -40 -20 -20 41 -45 -23 -5 12 -4 30 -18 -20 38 45 25 30 -20 -14 -7 -2 -20 46 -20 -48 -31 -31 -40 -26 17 -53 1
6371 1 -42 57 15 -32 7 -46 -25 51 -43 12 -12 -21 26 -58 8 29 18 0 7 1 8 -33 -23 -31 10 -8 -33 1 -18 12 31 30 10 14
6405 14 -6 -17 -6 6 22 -57 -7 10 -22 11 -10 -12 -25 -40 9 4 16 8 32 5 19 -4 -25 48 3 -15 -43 -38 -28 9 15 17 -14
6438 -14 4 -3 26 -2 -21 -1 -8 26 -20 31 33 4 73 -25 17 -68 6 -10 -25 3 -34 -14 -56 7 -12 12 -1 -46 -1 1 -22 52
6470 52 16 33 31 52 21 25 31 26 -1 26 -5 50 -19 6 27 8 -47 10 6 -14 23 30 28 -10 9 -21 15 40 30 -36 -27 8 20 25 -16
6505 -16 -17 33 -1 47 -1 26 32 -37 -5 22 -18 8 15 -13 24 -38 3 63 5 -19 -12 31 -27 -25 -23 -43 -11 -20 -7 20 -6 -7 32 -22
6539 -22 -19 41 15 -7 26 88 -10 -5 35 10 -20 -77 16 -17 3 1 5 -41 -8 -10 -32 15 -16 11 27 -20 21 35 11 -38 -21 71 19
6572 19 -41 27 9 -24 2 -66 -3 -5 10 25 -13 -13 -53 -11 35 -12 -8 -56 -58 -45 -12 -13 12 -11 -36 34 -28 56 -49 12 -24 -32 30
6605 30 60 2 1 0 48 18 10 39 22 -8 23 8 44 55 -16 -32 15 -9 -22 36 15 8 28 30 -18 -22 5 -41 -19 -65 17 -20 13
6638 13 30 12 -14 5 -14 1 26 -27 2 36 -11 -31 56 35 50 17 18 -24 -45 -2 0 26 5 1 -1 16 5 -2 -10 24 27 40 32 -4
6672 -4 18 -19 33 -26 -61 -10 31 -48 0 9 -20 39 23 27 7 26 -19 5 -65 14 15 1 50 15 -19 -15 -56 12 -5 -5 -14 -6 -60 -10
6706 -10 24 11 -9 -41 -20 5 44 -10 14 -45 -71 -73 8 -3 19 3 -5 23 -31 40 32 -25 -6 -19 5 -29 35 18 4 -10 -24 3
6738 3 -22 21 -4 -5 -42 -12 -21 -28 7 -15 -21 -32 27 1 -14 47 24 1 -7 -4 -7 5 -36 -52 26 -30 31 42 -54 -37 8 -4 14 71
6772 71 -5 -17 21 37 1 33 -41 41 48 -28 6 -20 -39 -24 23 -4 -15 -23 6 -9 30 -30 61 -39 60 37 24 -5 -22 34 15
6803 15 -23 -23 -46 9 -2 -26 39 19 8 7 -4 46 -11 -39 1 17 0 3 -6 8 2 -2 -23 24 -4 -35 -40 -2 20 -34 -18 3 -12 -27
6837 -27 7 -32 -21 35 -54 21 -20 13 -36 -51 5 23 9 11 48 25 14 17 -45 14 0 36 37 -34 -8 55 -18 35 -15 42 26 -21
6869 -21 9 74 47 -43 -1 -88 -22 -20 -27 -46 7 -24 1 -2 24 -49 -40 15 -8 -7 54 -23 -34 44 39 13 0 -11 34 22 -43 -31 -10
6902 -10 -33 -32 23 50 22 -6 4 -15 53 74 6 24 21 -1 20 31 12 8 17 67 1 24 23 -15 -6 -4 28 -6 42 -10 -3 -27 48 50 14
6937 14 15 -23 38 -5 -19 4 7 30 -22 24 -5 40 51 -21 -3 3 39 -23 -2 33 -14 -38 33 -44 -4 -21 -25 -24 -3 -1 0 29 -8 -59
6971 -59 -31 15 20 -28 8 29 54 -22 -33 14 7 15 47 23 10 33 -20 -15 -28 25 -1 25 -17 -8 -51 16 15 42 4 -4 -32 5 72 10
7005 10 17 39 -44 59 34 11 5 -25 -31 10 6 4 -2 6 -33 -3 -11 -1 -25 42 51 17 13 2 2 43 1 14 -23 6 19 27 -5 -9 -37 8
7041 8 1 -8 -7 6 -3 -25 -39 -48 -37 -9 23 -53 -7 -34 34 -31 -15 -19 -19 -14 -4 8 15 -19 36 -11 26 30 26 16 14 1 -26 4 16 18 34
7078 34 -55 -5 11 10 -9 -21 18 1 9 -18 9 -8 1 -25 23 25 -21 1 20 23 28 -15 -5 -39 3 24 -40 -11 -21 -3 -30 0 -18
7111 -18 -9 7 -9 -17 35 3 5 12 -16 5 37 -46 25 -4 -26 13 29 4 -32 -5 -35 31 -16 -32 50 14 13 23 -8 -8 11 2 60 14
7145 14 -7 -2 39 76 12 10 -5 -48 43 14 -21 6 46 11 21 34 0 2 -38 1 -25 17 -31 29 1 -37 7 -29 19 25 -23 -15 25
7178 25 -11 2 22 47 -46 7 -27 -17 11 27 -2 34 -53 31 53 -1 -1 9 9 33 51 4 35 -14 -81 6 27 -16 19 27 -15 51
7210 51 -14 -8 3 -16 -18 -73 -6 -21 10 3 61 -17 -34 17 -23 13 -16 14 0 38 -2 -23 -1 -12 27 -32 -27 -7 -19 9 -26 -42
7242 -42 14 16 -14 12 -29 -25 60 -19 -14 -62 -78 11 -2 11 12 -25 22 4 12 -24 20 -6 68 -8 -14 41 -50 -13 -26 12 -26 -19 7 69
7276 69 3 9 -28 42 19 -11 21 60 7 -50 -18 13 -57 -9 14 -3 2 42 77 -2 -9 -37 -48 -2 19 -32 -7 -15 -45 -22 -32 -4
7308 -4 -2 -5 3 -5 -1 37 53 5 25 30 20 2 16 26 103 -47 -33 -4 -17 -6 -1 12 -28 7 3 -8 26 -28 38 18 -28 -2 -3 44 42
7343 42 -14 54 -7 16 -1 26 17 -9 -13 49 38 -67 37 30 81 49 -3 11 43 17 -31 -10 43 7 -14 -23 75 -43 11 -20 23
7374 23 56 -57 31 0 -31 -6 -2 -24 55 -35 10 19 -19 -26 7 -8 -27 36 -8 -33 -69 18 42 -31 73 -21 -19 23 -51 -21 16
7405 16 -3 17 26 -10 -29 11 52 -3 -33 -42 31 26 -14 11 -9 -9 26 -6 15 -26 32 -27 16 30 19 -2 9 -24 -16 9 2 -18 -7
7438 -7 1 -11 12 -30 5 53 12 -20 50 27 22 17 35 20 60 -13 -25 1 15 -10 -1 -8 17 2 41 28 55 5 -9 3 53 -21 -19 -3
7472 -3 22 -1 -19 -14 -19 1 45 14 -12 31 -19 3 9 61 10 38 35 38 34 16 49 51 -17 19 -38 13 34 39 -61 14 -17 12 60 44
7506 44 23 -22 -14 -24 19 33 2 -7 30 6 -30 -66 -19 -2 22 25 -15 22 -12 20 -3 29 -57 18 44 18 -4 37 25 35 50 15
7538 15 -19 3 -6 38 15 -36 -11 -5 6 3 59 -5 -1 11 12 13 20 20 -28 -44 -12 -19 -15 -1 -22 36 37 39 -22 -10 13 76 61 -5 34 8
7574 8 -18 -36 28 13 41 37 41 29 -5 26 -9 -5 -2 -7 -10 -16 -22 -40 10 -19 53 23 -6 13 20 11 -44 -38 43 -3 -26 8 -27 15 -4 -6 33
7611 33 9 14 33 21 22 -29 20 -30 9 37 41 7 21 17 9 -18 31 76 0 20 11 70 -23 48 -37 25 58 -21 28 -19 -23 -26 -10 29
7645 29 17 18 50 -76 40 44 35 -24 1 2 -19 43 -2 -10 -3 25 -24 32 2 41 67 66 17 12 -37 -2 5 33 16 1 -18 4 11 -25
7679 -25 -12 13 13 23 1 -32 30 -10 -1 -19 39 -21 20 33 16 16 -5 -43 -7 4 6 21 -25 -24 20 46 -15 -5 -8 15 -14 8 32
7712 32 -16 1 13 -20 -10 39 26 -13 65 18 -21 53 -15 -27 -47 7 20 21 2 -12 -27 -13 17 -8 6 7 15 69 6 -24 -21 37
7744 37 19 41 -20 35 11 -1 3 -4 -55 -12 27 21 -12 7 2 36 20 -28 -37 -22 67 -40 -26 0 7 -5 8 -7 28 -30 29 26 16
7777 16 -6 62 -23 -3 0 40 29 23 56 -50 22 15 36 50 -24 74 14 7 42 10 12 -73 -22 -31 -24 -15 15 31 -18 -24 10 82 43 -17
7811 -17 -28 -57 -13 -15 22 21 29 6 25 -26 -14 -9 55 -9 37 53 17 -14 -23 -6 -29 39 43 -29 -32 -39 -38 38 -15 53 6 -20 -18 14 3
7846 3 -5 -29 -28 -37 -16 -16 1 15 20 35 4 8 12 47 -33 -19 11 43 -6 25 -45 10 56 23 3 -15 -29 -38 38 16 5 55 13 -27 40
7881 40 68 21 40 37 -48 -46 -9 -3 -14 -8 19 -1 9 -2 -8 5 4 -5 -20 7 7 54 -21 24 25 25 11 56 20 -15 -9 28 -7 64 -26 20
7917 20 10 -12 4 -46 0 -26 -32 -31 46 -11 26 13 -15 -21 -46 5 40 -45 22 -30 25 -4 -4 -31 25 2 -9 11 -8 -1 -6 41 12
7950 12 -2 39 34 5 65 50 -15 55 -9 17 -6 -2 -6 22 -11 -15 -24 -14 42 50 -25 -24 -12 20 -24 -33 -41 -40 -20 65 -61 12 1 1 -17
7985 -17 17 -31 -22 42 51 15 25 -31 -43 -16 21 -19 -13 20 -38 -3 67 14 15 -6 20 -5 -20 3 -10 -6 52 -7 -24 -10 -12 -33 11
8018 11 -11 -92 21 -67 -1 66 41 -13 25 -20 -31 26 38 49 50 -14 30 20 75 15 -8 -16 28 -1 81 32 7 -35 -39 -30 43 26
8050 26 -18 32 -3 -9 -27 29 -22 -16 -19 37 -51 -3 -6 9 -23 4 43 31 -15 55 -7 -26 -29 -30 41 22 44 28 -15 5 10 46 35 0
8084 0 28 20 11 -39 -9 -41 -3 -8 -55 -14 -2 -4 5 15 8 -49 -9 -6 -19 41 15 9 12 4 26 -9 -43 26 -8 -31 19 19 69 -35 15 45
8120 45 -28 -39 -9 -1 18 -14 58 -9 -25 -3 21 -10 17 26 25 24 8 16 -6 -6 13 -15 8 28 -9 -15 46 0 -22 31 -8 23 -7 18
8154 18 -24 -43 -36 -30 -3 12 29 -56 52 48 47 46 -5 -46 -31 -32 10 -29 34 18 14 -38 22 -21 32 14 -3 52 -35 31 12 -17 6
8187 6 -20 33 -11 -51
8191e1
##END NTUPLES=NMR FID
##END=
