##TITLE=1H_LY-DMAA.Per.3.13
 CDCl3
 8 sc, 
 18.02.2022
##JCAMPDX= 6.0         $$ Bruker NMR JCAMP-DX V2.0
##DATA TYPE= NMR FID
##DATA CLASS= NTUPLES
##ORIGIN= UXNMR, Bruker Analytische Messtechnik GmbH
##OWNER= root
$$ XWIN-NMR		Version 3.5
$$ Fri Feb 18 11:19:28 2022 Russian Standard Time (UT+4h)  she@DPX200
##.OBSERVE FREQUENCY= 200.131346
##.OBSERVE NUCLEUS= ^1H
##.DELAY= (6, 6)
##.ACQUISITION MODE= SIMULTANEOUS
##.ACQUISITION SCHEME= undefined
##.AVERAGES= 8
##.DIGITISER RES= 18
##SPECTROMETER/DATA SYSTEM= spect
##.PULSE SEQUENCE= zg30
##.SOLVENT NAME= CDCl3
##.SHIFT REFERENCE= (INTERNAL, CDCl3, 0, 15.7039)
##AUDIT TRAIL= $$ (NUMBER, WHEN, WHO, WHERE, WHAT)
$$ ##TITLE= Audit trail, XWIN-NMR		Version 3.5
$$ ##JCAMPDX= 5.01
$$ ##ORIGIN= Bruker BioSpin GmbH
$$ ##OWNER= she
$$ F:/spectra/data/she/nmr/H-F/1/audita.txt
$$ ##AUDIT TRAIL=  $$ (NUMBER, WHEN, WHO, WHERE, WHAT)
(   1,<2022-02-18 11:18:24.85 +0400>,<she>,<DPX200>,
      <created by zg, POWCHK disabled, PULCHK disabled
       configuration hash MD5:
       00 E9 B6 7A A2 85 ED C7 34 08 36 98 17 FE 4E 26
       data hash MD5: 16K
       22 9F 9A BF 12 05 B4 C9 6A 55 64 FC 64 F7 3B 68>)
$$ ##END=
$$ 
$$ hash MD5
$$ C6 12 50 82 CB 1B 02 1E DE C2 9A 94 D5 47 3D 75
##$RELAX= 
##$RELAX= 
##$RELAX= 
##$RELAX= 
##$RELAX= 
##$RELAX= 
$$ Bruker specific parameters
$$ --------------------------
##$DU= <F:/spectra>
##$EXPNO= 1
##$NAME= <H-F>
##$PROCNO= 1
##$TYPE= <nmr>
##$USER= <she>
##$AMP= (0..31)
100 100 100 100 100 100 100 100 100 100 100 100 100 100 100 100 100 100 
100 100 100 100 100 100 100 100 100 100 100 100 100 100 
##$AQSEQ= 0
##$AQ_mod= 1
##$AUNM= <au_zg>
##$AUTOPOS= <>
##$BF1= 200.13
##$BF2= 200.13
##$BF3= 200.13
##$BF4= 200.13
##$BF5= 200.13
##$BF6= 200.13
##$BF7= 200.13
##$BF8= 200.13
##$BYTORDA= 1
##$CFDGTYP= 0
##$CFRGTYP= 5
##$CHEMSTR= <none>
##$CNST= (0..31)
1 1 145 1 1 1 1 1 1 1 1 1 1 1 1 1 1 1 1 1 1 1 1 1 1 1 1 1 1 1 1 1 
##$CPDPRG= <>
##$CPDPRG1= <>
##$CPDPRG2= <>
##$CPDPRG3= <>
##$CPDPRG4= <mlev>
##$CPDPRG5= <mlev>
##$CPDPRG6= <mlev>
##$CPDPRG7= <mlev>
##$CPDPRG8= <mlev>
##$CPDPRGB= <>
##$CPDPRGT= <>
##$D= (0..31)
0 1.2 0 0 0 0 0 0 0 0.06 0 0.03 0 0 0 0 0.0002 0 0 0 0 0 0 0 0 0 0 0 0 
0 0 0 
##$DATE= 1645168704
##$DBL= (0..7)
120 120 120 120 120 120 120 120 
##$DBP= (0..7)
150 150 150 150 150 150 150 150 
##$DBP07= 0
##$DBPNAM0= <>
##$DBPNAM1= <>
##$DBPNAM2= <>
##$DBPNAM3= <>
##$DBPNAM4= <>
##$DBPNAM5= <>
##$DBPNAM6= <>
##$DBPNAM7= <>
##$DBPOAL= (0..7)
0.5 0.5 0.5 0.5 0.5 0.5 0.5 0.5 
##$DBPOFFS= (0..7)
0 0 0 0 0 0 0 0 
##$DE= 6
##$DECBNUC= <off>
##$DECIM= 32
##$DECNUC= <off>
##$DECSTAT= 4
##$DIGMOD= 1
##$DIGTYP= 9
##$DL= (0..7)
0 120 120 120 120 120 120 120 
##$DP= (0..7)
150 150 150 150 150 150 150 150 
##$DP07= 0
##$DPNAME0= <>
##$DPNAME1= <>
##$DPNAME2= <>
##$DPNAME3= <>
##$DPNAME4= <>
##$DPNAME5= <>
##$DPNAME6= <>
##$DPNAME7= <>
##$DPOAL= (0..7)
0.5 0.5 0.5 0.5 0.5 0.5 0.5 0.5 
##$DPOFFS= (0..7)
0 0 0 0 0 0 0 0 
##$DQDMODE= 0
##$DR= 18
##$DS= 0
$$ [...]
##$SUBNAM2= <"">
##$SUBNAM3= <"">
##$SUBNAM4= <"">
##$SUBNAM5= <"">
##$SUBNAM6= <"">
##$SUBNAM7= <"">
##$SUBNAM8= <"">
##$SUBNAM9= <"">
##$SW= 18.0517287032376
##$SWIBOX= (0..15)
0 0 2 0 0 0 0 0 0 0 0 0 0 0 0 0 
##$SW_h= 3612.71676300578
##$TD= 16384
##$TD0= 1
##$TE= 0
##$TE2= 300
##$TE3= 300
##$TEG= 300
##$TL= (0..7)
0 120 120 120 120 120 120 120 
##$TP= (0..7)
150 150 150 150 150 150 150 150 
##$TP07= 0
##$TPNAME0= <>
##$TPNAME1= <>
##$TPNAME2= <>
##$TPNAME3= <>
##$TPNAME4= <>
##$TPNAME5= <>
##$TPNAME6= <>
##$TPNAME7= <>
##$TPOAL= (0..7)
0.5 0.5 0.5 0.5 0.5 0.5 0.5 0.5 
##$TPOFFS= (0..7)
0 0 0 0 0 0 0 0 
##$TUNHIN= 0
##$TUNHOUT= 0
##$TUNXOUT= 0
##$USERA1= <user>
##$USERA2= <user>
##$USERA3= <user>
##$USERA4= <user>
##$USERA5= <user>
##$V9= 5
##$VALIST= <valist>
##$VCLIST= <CCCCCCCCCCCCCCC>
##$VD= 0
##$VDLIST= <DDDDDDDDDDDDDDD>
##$VPLIST= <PPPPPPPPPPPPPPP>
##$VTLIST= <TTTTTTTTTTTTTTT>
##$WBST= 1024
##$WBSW= 4
##$XGAIN= (0..3)
0 0 0 0 
##$XL= 0
##$YL= 0
##$YMAX_a= 361424
##$YMIN_a= -310659
##$ZGOPTNS= <>
##$ZL1= 120
##$ZL2= 120
##$ZL3= 120
##$ZL4= 120
##$ABSF1= 10
##$ABSF2= 0
##$ABSG= 5
##$ABSL= 3
##$ALPHA= 0
##$AQORDER= 0
##$ASSFAC= 0
##$ASSFACI= 0
##$ASSFACX= 0
##$ASSWID= 0
##$AUNMP= <proc_1d>
##$AZFE= 0.1
##$AZFW= 0.1
##$BCFW= 1
##$BC_mod= 2
##$BYTORDP= 1
##$COROFFS= 0
##$CY= 11.3945322036743
##$DATMOD= 1
##$DC= 2
##$DFILT= <>
##$DTYPP= 0
##$F1P= 2.36226072786647
##$F2P= -0.459571619588291
##$FCOR= 0.5
##$FTSIZE= 0
##$FT_mod= 4
##$GAMMA= 1
##$GB= 0.15
##$INTBC= 1
##$INTSCL= 1
##$ISEN= 128
##$LB= 0.24
##$LEV0= 0
##$LPBIN= 0
##$MAXI= 10000
##$MC2= 0
##$MEAN= 0
##$ME_mod= 0
##$MI= 1.114404
##$NCOEF= 0
##$NC_proc= 0
##$NLEV= 6
##$NOISF1= 3.799351
##$NOISF2= 2.8
##$NSP= 1
##$NTH_PI= 0
##$NZP= 0
##$OFFSET= 15.70392
##$PC= 1
##$PHC0= -16747.34
##$PHC1= 9.60078
##$PH_mod= 1
##$PKNL= yes
##$PPARMOD= 0
##$PSCAL= 0
##$PSIGN= 0
##$REVERSE= no
##$SF= 200.130013532006
##$SI= 16384
##$SIGF1= 3
##$SIGF2= 2
##$SINO= 400
##$SIOLD= 16384
##$SREGLST= <1H.CDCl3>
##$SSB= 0
##$STSI= 0
##$STSR= 0
##$SW_p= 3612.71676300578
##$SYMM= 0
##$S_DEV= 0
##$TDeff= 0
##$TDoff= 0
##$TI= <>
##$TILT= no
##$TM1= 0
##$TM2= 0
##$TOPLEV= 0
##$USERP1= <user>
##$USERP2= <user>
##$USERP3= <user>
##$USERP4= <user>
##$USERP5= <user>
##$WDW= 1
##$XDIM= 8192
##$YMAX_p= 0
##$YMIN_p= 0
$$ End of Bruker specific parameters
$$ ---------------------------------
##NTUPLES= NMR FID
##VAR_NAME=  TIME,          FID/REAL,        FID/IMAG
##SYMBOL=    X,             R,               I
##VAR_TYPE=  INDEPENDENT,   DEPENDENT,       DEPENDENT
##VAR_FORM=  AFFN,          ASDF,            ASDF
##VAR_DIM=   8192,          8192,            8192
##UNITS=     SECONDS,       ARBITRARY UNITS, ARBITRARY UNITS
##FACTOR=    0.0002768,     1,               1
##FIRST=     0,             0,               0
##LAST=      2.2672688,     0,               0
##MIN=       0,             -310659,         0
##MAX=       2.2672688,     361424,          0
$$ Real data points
##PAGE= N=1
##DATA TABLE= (X++(R..R)), XYDATA
$$ [...]
986a5752J1385J3565o320m977K647m747q33J4514J124k2949l211K8878O348l1671
1000a1999r591L0899J1824k6981j2376K0523J0415j2794n968M910o34J833Q696
1013H757o763j6729R202K3970r344k8831P602L0877m756k9444J969K4859n8j7777
1027f466k34R186j348l94M632p599r179J3581J4079j7306j8407J8465K1201j7530
1041B681k1823J4972J9877j1590j5569Q342R412n802k122M682n382m590J2185
1054E273N652j7454p162K0617Q744k1731r549K0727Q990j8022p184J4360L787
1067G048j0439P49O699n876l812J0844J822j5081n64J8099k33j9348R35J8832
1081I675j671j6798K943J3811m865r962P239O113r789k653J2170k23j4098K555
$$ plain form
986 -15752 -4367 9198 2878 -2099 548 -4199 -5032 9482 10606 -12343 -15554 13324 19672 -11999
1000 -11999 -21590 9309 21133 -5848 -18224 2299 12714 -80 -6048 -1138 -1772 61 8757
1013 8757 1994 -14735 -5533 18437 9093 -19738 -12136 18741 13985 -15459 -13490 11369 11311 -6466
1027 -6466 -6700 2486 1138 744 5376 -2223 -11402 2179 16258 -1048 -19455 -990 20211 2681
1041 2681 -19142 -4170 15707 4117 -11452 -3110 6302 500 -1622 3060 -2322 -6912 5273
1054 5273 10925 -6529 -13691 6926 15670 -6061 -15610 5117 14107 -3915 -11099 3261 7048
1067 7048 -3391 -2642 4057 -1819 -5631 5213 7035 -8046 -8610 9489 9256 -10092 -9157 9675
1081 9675 8004 -8794 -5851 7960 3095 -6867 372 6485 -3304 -5957 6213 5990 -8108 -5553
1095e553J4902m363j4679N682J3192o945j0786Q295P615r764m133J1298Q35j2735
1109g139K047J3804m185j4178N828J3593o644j1871P187R101p600n464Q066J361
1123C906q944K779J0072o637j1240R376J2265j1200j2701J1700J2095j1037j0364
1136i930R611P399p876l277O370j535n223O581M768j1077n073J4805N768j6802
1150e491o670J7237P094j5863o895J3187N438r521k905N470q21j836N250j100
1164B574r912K727J4257l354j7345K874J8789j535j8418L48J6030O52j2111o26
1178e050P145m56j699K719l383n758P425R182j0125j2386J1101J4651j0574j5603
1192a2811Q923J4743o800j2103M486Q033k799k843J915k664k004P767L233j1966
$$ plain form
1095 -5553 9349 4986 -9693 -4011 9181 2236 -8550 -255 7360 -2404 -6537 4761 5596 -7139
1109 -7139 -5092 8712 4527 -9651 -3823 9770 3126 -8745 -1558 7543 -57 -5521 2545 3906
1123 3906 -5038 -2259 7813 1176 -10064 -688 11577 377 -12324 -624 11471 434 -9930
1136 -9930 -319 7080 -796 -4073 2297 762 -4461 2120 6888 -4189 -9262 5543 11311 -5491
1150 -5491 -12161 5076 12170 -3693 -10588 2599 8037 -1484 -4389 1081 260 -1576 3674 2574
1164 2574 -7338 -4611 9646 6292 -11053 -8179 10610 9075 -9343 -8995 7035 7687 -4424 -5050
1178 -5050 2095 1639 -60 2659 -724 -6482 943 10125 0 -12386 -1285 13366 2792 -12811
1192 -12811 -3888 10855 4055 -8048 -3562 4471 1672 -1171 744 -1920 -3924 3843 7076 -4890
1206d890m818J4587O678j5535q035J4789Q545j2557p890R513N947o206k840L097
1220C85j266o65N646r76r684J450J2873j147j4800L21J5240N24j4155r09J1691
1235D528O42q194L17M667k181j032M714k108p177M318R429n638j1031O097J1619
1250H970n983j1071N418R345m901o844M652L612m686l39N025k741n679N358O338
1265F474p092o712Q121O670q390n900Q048M590p328k663O598L38n887K171N234
1280D272m521m767O437M299p705l951Q347L018q158k011P544N11o606J344N527
1295C580l414m438N464L577p199k844Q424K295q804j718Q560R53p608J84O070
1310C082j536m320L195K521n139r40P012l97q517J129R400j392r711J453R063
$$ plain form
1206 -4890 -9708 4879 11557 -3978 -12013 2776 11321 -1236 -9126 387 6334 128 -2712 385
1220 385 -881 -1546 4100 3124 -6560 -5110 7763 6616 -8184 -7863 7377 7901 -6254 -7163 4528
1235 4528 5170 -3024 -2707 1960 -221 -1253 3461 1353 -5824 -1506 7923 2285 -8746 -2649 8970
1250 8970 2987 -8084 -2666 6679 1778 -5066 -414 3198 -1488 -1827 3198 457 -5222 136 6474
1265 6474 -618 -7330 791 7461 -929 -6829 1219 5809 -1519 -4182 2416 2754 -3133 -962 4272
1280 4272 -249 -5016 1421 5720 -1985 -5936 2411 5429 -2729 -4740 2804 3315 -3291 -1947 3580
1295 3580 166 -4272 1192 4769 -2430 -5274 3150 5445 -3359 -5077 3483 4436 -3172 -2988 3082
1310 3082 1546 -2774 421 2942 -2197 -3137 3875 3478 -5039 -3910 5490 4098 -5613 -4160 4903
1325D903j399p605J536N414j865k861K782Q3l907K416N365m310o734N482P874
1340G174n832q501N555Q231m693p221L699N164k783k523K133n90j981L636K257
1355C725o219l014Q172L976r180m706R137N123q104m888O508L940m512k167K455
1370B46j89o66K912n87n616J107P888j041r471M95R968K44r620q32Q196J033n988
1387a921p93L490j96q32J743j571l450L279N396m290o945M676P860m189q230L584
1403b389P460k637n956J846L805j535j261J548j469j987L772K727n474l635O502
1418A317M337o836m609O390M467n411l724M304K360l083n18K090j559j235L508
1433A798Q90n187p63O264R10o872r48O726Q28o080n17M866r5l571J133K136k331
$$ plain form
1325 4903 3504 -4101 -2565 2849 984 -1877 905 988 -2919 -503 4862 552 -6182 -700 7174
1340 7174 1342 -7159 -1604 6627 1934 -5287 -1588 3576 793 -1730 403 -187 -2168 1468 3725
1355 3725 -2494 -5508 2664 6640 -2540 -7246 1891 7014 -1090 -5978 530 4470 -42 -2209 246
1370 246 57 -609 2303 1716 -3900 -2793 5095 4054 -5417 -4922 5046 5290 -4330 -5162 3034 4067 -1921
1387 -1921 -2714 776 580 -252 1491 -80 -3530 -251 5145 855 -6090 -1414 6446 2257 -5973 -2389
1403 -2389 5071 2434 -3522 -1676 2129 594 -667 881 -588 -2575 1197 3924 -1550 -5185 1317
1418 1317 5654 -1182 -5791 599 5066 -345 -4069 235 2595 -488 -1006 1084 -475 -1710 1798
1433 1798 2688 -2499 -3262 3002 3912 -2960 -3908 2818 3646 -2434 -2951 1915 1820 -1751 -618 1518 -813
1450h13q32L459o5m559P33N390j182n645J485N383j609m698J841L732k189k470
1466b039K754J013l287K28L862j313m381K025M563k455m471K707L842k805k971
1481b728K927J738k924l95L072q99l292K130L617l087l692L534L772l704l383
1496c314L456K744l086j769K624M57k255R15K100k466j973L620J983m494k207
1511c665N019K247m894k160M448J724l531r73K468J8j455J403M69k626K4M059
1527B575m27n038M87N599l63n645K4N112J17m156k4K706l42j148R88l89j922J722
1545a24K873k522l872L025M570k960m866K578M765k031l952J369K835r99j220
1560e31P42m38q16J926J273l369j766M173K346m536k824M397K940l790k833L052
$$ plain form
1450 -813 -1645 1814 1749 -2810 -2077 3313 2131 -3514 -2029 3354 1745 -2953 -1112 2620 431 -2039
1466 -2039 715 1728 -1559 -1331 2531 1218 -3163 -1138 3425 970 -3501 -794 3048 243 -2728
1481 -2728 199 1937 -987 -1382 1690 791 -2501 -371 3246 159 -3533 1 3773 69 -3314
1496 -3314 142 2886 -200 -1969 655 1112 -1143 -228 1872 -594 -2567 1053 3036 -1458 -3665
1511 -3665 1354 3601 -1293 -3453 995 2719 -812 -1785 683 701 -754 649 1118 -1508 -1484 2575
1527 2575 2148 -2890 -2403 3196 2833 -2812 -2788 2324 2441 -1715 -1739 967 625 -523 465 76 -1846 -124
1545 -124 2749 227 -3645 -620 3950 990 -3876 -1298 3467 1436 -2516 -1147 1688 689 -531
1560 -531 211 -227 -1043 883 2156 -1213 -2979 1194 3540 -996 -3820 577 3517 -273 -3106 -54
1576e4K060k011r83J036k08l45J767j70l034K96M113j17m715k14M949L93m565
1593a802n83L811M13k708j31J509m75m34J400o84k306J428L063j743l678J839
1609a081L922j646l822J471L287j163k427J035J350j017k03J188q57j514J739
1624B62J921k401k231K726K336k794k251K502J945k292j275J819N44j591M67J304
1640I91j367j098K104J057k553j067K981R69k973p97K782M48k349N1J825o07j331
1657i34J251Q42j912n24K433K37k783r4K831k6k661J24K322l81j744P43J069j109
1675c16m14J567l4k086M48K524o58k749Q10K733q03k475P84J889q00j194Q76L94
1693D96j102L95J324j116j710J679K014j927k266J984K254j790k015J504J608
$$ plain form
1576 -54 2006 -5 -988 48 -160 -505 1262 1092 -1942 -1646 2467 2350 -2365 -2579 2370 2763 -1802
1593 -1802 -2385 1426 1839 -869 -1000 509 34 -400 1000 316 -1990 -562 2501 758 -2920 -1081
1609 -1081 2841 1195 -2627 -1156 2131 968 -1459 -424 926 -91 -294 894 37 -1477 262
1624 262 2183 -218 -2449 277 2613 -181 -2432 70 2015 -277 -1552 267 811 -780 -313 991
1640 991 -376 -1474 630 1687 -866 -1933 1048 2017 -956 -1753 1029 1477 -872 -821 1004 397 -934
1657 -934 317 1159 -753 -1277 1156 1393 -1390 -1484 1347 1321 -1340 -1216 1106 725 -1019 -276 793 -316
1675 -316 -730 837 803 -1283 -835 1689 1031 -1718 -908 1825 1022 -1453 -669 1220 420 -774 102 496
1693 496 -606 -211 1113 -3 -1713 -34 1980 53 -2213 -229 2025 235 -1780 -276 1332
1708A332j219q44Q65J21p14Q45O30j687o30K255Q82k700j107K744J245k545j325
1725a852K173J035j556o49Q81J09l58P01j34j445L74K134m44k619L88K956k58
1742A436k860O8K524R9j944q8J164r7l05L89l66r85J028J442j508j902J601K275
1760A971j523k404J289K244r79j833P18J234n64l23M05m26m50J142O58j742q40
1777a423K103J084k141j276K005J304j764j146J325P16q50k40M68m22j83J047
1793F07Mj597j1K046K6k194j33K196K39j919j47J502L8j019K10N14n74J2Q94k80
1813D14j328N83J553o36j766O52J711o85j554O03J201n68p74O05K92p49K03R73
1831G30o68j040Q88J218j078j230J125J154r89j036J010O53q34k91O90j20p37
$$ plain form
1708 1332 113 -731 134 255 -459 386 1016 -671 -1301 954 1836 -864 -1971 773 2018 -527 -1852
1725 -1852 321 1356 -200 -849 32 141 -217 484 350 -1095 -721 1413 969 -1650 -1262 1694 1436
1742 1436 -1424 -1356 1168 1267 -677 -765 399 302 -3 386 20 -965 63 1505 -3 -1905 -304 1971
1760 1971 448 -1956 -667 1577 598 -1235 -517 717 153 -170 235 -191 -641 501 1159 -583 -1423
1777 -1423 680 1764 -377 -1653 352 1656 -108 -1254 71 787 -63 -303 165 -257 -440 607
1793 607 611 -986 -997 1049 1075 -1119 -1252 944 1183 -736 -883 619 657 -362 -152 362 -212 -200 694 414
1813 414 -914 -331 1222 586 -1180 -528 1183 498 -1056 -453 748 180 -594 11 303 -446 -243 730
1831 730 62 -978 -90 1128 50 -1180 -55 1099 110 -926 84 737 -97 -388 302 182 -555
1848e55N81O93r62p58J227Q37j384p63J302O51j106n65J003J74o80J27N41m85
1866a22l48R42K70j277k02J445K15j538k59J466K36j231j48R08p8n96L58J42n88
1885d05J39Q93l70j164M86J350l88j490L55J433k76j234K57R08k09m72L13n8m16
1904c48M37O37p73q41R50J052j102j156R36J188q31r84N46P89l51m28K14q4r5
1923b44N56J50r72k45J294L74j397m86J412N96j196n71Q68N41o83j88K71q4p0
1942g4M61k07q41L19J072k67j312J95J302j2j280oR87J71q15KM52j23L0K08k79
1963a7n09N83O70o42q99P13J021n89j045M34R03l52p35L08L34k01K3J83l61k85
1983d63O68L48q34l96P90N86q09n71Q21M29n59l84M40J67k92O1K43m18p4N66J03
$$ plain form
1848 -555 26 719 -243 -1001 226 1063 -321 -1084 218 869 -237 -802 201 375 -305 -178 363 -122
1866 -122 -470 472 742 -535 -737 708 923 -615 -874 592 828 -403 -551 357 279 -317 41 183 -405
1885 -405 -266 627 257 -907 -421 929 541 -949 -594 839 563 -671 -414 494 285 -187 126 68 -348
1904 -348 89 726 -47 -888 62 1114 12 -1144 -208 980 149 -835 -289 500 149 -279 -65 -149 -244
1923 -244 312 462 -510 -755 539 913 -484 -970 442 1038 -158 -729 139 680 -3 -191 80 -4 -74
1942 -74 387 180 -661 -342 730 463 -849 -654 648 636 -644 -650 337 508 -307 -305 147 24 54 262 -17
1963 -17 -526 57 727 85 -814 -101 920 331 -714 -280 623 271 -464 -156 178 -23 0 183 -178 -463
1983 -463 205 553 -281 -677 113 699 -110 -681 140 569 10 -374 66 233 -59 2 245 -173 -247 319 422
2004D22q01j44R01J67r43j51Q18P8o09o4M41k8k73K42P6l99J14N50j07p53K05
2025b58P56j83o86J22O67j00n10J10K98j72j48K47o6l93K88M59l78n79L86O07
2045D67l80n40K51N78l05l47K07J93j74Q4K33k74k55M20L67o09l46N77M58o34
2065b9m27N17L52l81k63K05R0j66J47Rk83JM66N6o45o4O96J81p47j68O03K05m75
2088a20j27L15O3j29J19q9k63K51L58k81m99K84N78k22p09J86N87o5m91N6K57
2109E9Pm4K3j13j48K98K22l99l18M73M33m04n10M43M36k92l65Q9K95j52l3%j17
2132a17JK39N0m54PM43J54n36k05N06K05l65k14L24J26j46p0R3j24J07J63q6l46
2155b45J31M49j15m62M9M57l4l88q5L05P7j82j1M9j07J04P8j42k05K31K95k03
$$ plain form
2004 422 -379 -523 378 545 -398 -549 269 347 -262 -326 115 87 -186 56 132 -267 -153 397 290 -463 -258
2025 -258 498 315 -371 -249 418 318 -192 -82 216 44 -104 143 77 -316 -28 431 53 -526 -140 467
2045 467 87 -453 -202 376 71 -276 -69 124 -50 34 267 -7 -262 158 525 -84 -430 147 605 -29
2065 -29 -456 61 413 32 -231 -26 64 -102 45 54 -229 -228 238 294 -351 -415 281 462 -285 -453 150 355 -120
2088 -120 -247 68 131 2 121 32 -231 20 378 97 -402 -118 460 238 -471 -285 302 237 -254 -198 59
2109 59 66 22 45 -68 -216 82 304 -95 -413 60 493 89 -421 22 458 166 -199 -110 185 33 0 0 -117
2132 -117 -116 123 173 -281 -274 169 323 -213 -418 88 293 -72 -286 38 164 18 -52 41 -83 24 187 101 -245
2155 -245 -114 335 220 -242 -193 264 230 -158 -243 62 139 -43 -54 -5 -112 -8 70 -72 -277 -46 249 46
2177D6l08J85L14j01k90J51J85n9j34Q5jq2P0Q6k13j70L42J63k57k36K43K06k34
2200ij60J77K3p4m4M1l8J8J40M3k62L3L20j2l87N1K71M5k04p7K13j3q7m6O2o7
2226d3O4J00j03j91J01K35j03k82J06K39l5k49O3J19K9Op0jj4J08O2j94j13K35
2250F9J62k59j39J43J56m1k09K3J90k6m3n6n3Q4N7k2j91j4L31n6k03n1K13M6j32
2275b1m0R4M4l3kk4k5Q4M7j24j24J41J48j03k31Q5J53lj76K8Q0No4J6m7L8J21
2302F7m1j50k8K42N7j58p1K05rp5q1L3J02j7n7k8l6O4k3L5j32L1J65m6j84N5J28
2329D8kj63N8J13p0k1L3K2n9N4Q3p8r6J87N6j21j13N5J66j13j16M9R7o0n5K7l0
2356d9l1R1K2o2p1R7R0j37m2R3M8r1RJ44p2k6%P3q3p7J14lq2mJ82q3j08L7J22
$$ plain form
2177 46 -262 -77 237 136 -154 -3 182 123 -11 74 73 -9 61 147 -66 -236 106 269 12 -224 19 225 -9
2200 -9 -169 8 31 -43 -87 -46 -84 -66 74 117 -145 -112 208 196 -191 -140 131 176 -28 -105 108 95 8 -38 24 -43
2226 -43 21 121 18 -173 -72 163 60 -222 -116 123 88 -161 -98 21 50 56 -14 -15 -29 79 141 -53 -166 69
2250 69 231 -28 -167 -24 132 91 -118 -95 95 69 26 -30 -83 1 58 36 -155 -169 162 106 -97 -148 65 111 -21
2275 -21 -61 33 77 44 42 18 -7 77 124 0 -124 17 165 62 -169 -84 69 66 -110 -82 -2 3 -61 -45 -92 -54 67
2302 67 26 -124 -152 90 147 -11 -82 123 114 39 -42 -9 93 76 19 -9 -45 19 -4 31 -101 -70 95 49 -135 -80 48
2329 48 46 -117 -59 54 -16 -37 -4 18 -41 13 96 18 -78 109 165 44 -69 -14 152 39 -77 -28 69 9 -46 -19 -49
2356 -49 -80 11 33 -29 -100 -3 87 -50 -92 1 49 -42 -33 111 39 13 13 86 3 -74 40 37 -45 -49 133 50 -58 -21 101
2385A01o5j85O4J06r3rJ29Pj51j3J95j4j56P6J85r1k06J88N6q4j35J40N5j33O
2410b7R0r3o0P2J34j57j17J50J23j91j00K17M2j70n2J89rj17R9N8j21o6K04L5
2434A33j83M2J27K5k49Q1J74k1j92M3R5l1j37J18Mo2p0J67o3j72Q6J97n9k79J58
2459f8K52j34j86Q9K22j54q7J19L5j40N0J42r3j28J14J61k37r9K09J36k56n2J82
2482G7P2k66rK05l5j32Q6J06j84nJ41N4k01O3K14o6k26K0K61j01k06J03J54j44
2506a9m4J15J2j68KJ59n8j88J52J43r1j60P6K00j40j96K01J59k06r9K48L6k01
2529f7R2Q1k6j57J24J35j96j43K36O7k57m2K47J1k29mK15n8j27O7O0p2p0K22j6
2554I3j96n6L33n3k61oL45j00k34J50J59j09j81K03N5j98oJ82Qk66M6K09p8k45
$$ plain form
2385 101 36 -149 -85 21 -72 -81 48 55 -96 -109 86 72 -84 -8 177 86 -120 68 124 40 -95 45 100 -33 -27
2410 -27 63 -30 -90 -18 116 -41 -158 -8 115 -76 -176 41 83 -87 -139 50 41 -76 23 81 -40 -106 98 133
2434 133 -50 -8 119 144 -105 -24 150 129 -63 -20 75 44 -93 25 29 -33 -103 64 1 -171 -85 112 53 -226 -68
2459 -68 184 50 -136 -47 175 21 -66 53 88 -52 -2 140 47 -81 33 194 -43 -142 67 203 -53 -105 77
2482 77 149 -117 -126 79 44 -88 -2 104 -80 -85 56 110 -91 -28 186 120 -106 -86 175 74 -132 -29 125 -19
2506 -19 -63 52 64 -104 -102 57 -1 -189 -37 106 15 -145 -69 131 -9 -205 -4 155 -51 -150 98 134 -67
2529 -67 25 106 80 -77 47 182 -14 -157 79 146 -111 -153 94 105 -124 -128 87 29 -98 -31 29 -43 -113 109 93
2554 93 -103 -159 174 121 -140 -146 199 99 -135 15 174 65 -116 87 142 -56 -62 120 128 -138 -92 117 39 -206
2578b06J11K66k26j57K15J19k14k7K31k8k29Q9K67j13k51J94J49j32k70L13M8
2599A49j68j51K27M5j93J7K31j40j82J71J49k71o2K79O0k81n6K67N3k33k3K39
2621A27n6j70J06J37j72k5J81Q9l01o9L20j7k84J5K98j13k67J04K27j21j16J16
2643IR1k20J0K67l1l37J43L17j64k40Q8K85j04k64J94J67k66j2K05n6k13J10J62
2666A41j22k20J53K55l58j01K31K06k87j10K58J9j40k9K19j12q2J20J34k57q5
2687a67L59M6l42o5L16J27m28nL25Kk33jJ80j60q2J68L1k31J9L50j52l17J75L25
2711B40j51l13J04L02j48j68J72J11j51o7J93m6j90R5K39k14k62K63K73k92k58
2732b68K33J99j91j83J80J11k15N4K21r1k46K10K10k83j30K45K60l64j57L50P1
$$ plain form
2578 -206 -95 171 -55 -212 3 122 -92 -119 112 84 -145 -56 211 98 -153 41 190 58 -212 101 149
2599 149 -19 -170 57 102 -91 -74 157 17 -165 6 155 -116 -178 101 161 -120 -176 91 144 -89 -112 127
2621 127 71 -99 7 144 -28 -53 128 217 -84 -153 167 150 -134 -119 179 66 -201 -97 130 9 -107 9
2643 9 100 -120 -110 157 126 -211 -68 249 85 -155 -67 218 114 -150 44 211 -55 -67 138 82 -131 -21 141
2666 141 19 -201 -48 207 -151 -252 -21 185 -102 -212 46 65 -75 -104 115 3 -79 41 175 -82 -167
2687 -167 192 238 -104 -169 147 274 -154 -159 166 168 -65 -66 114 -46 -128 40 71 -160 -141 209 57 -260 -85 240
2711 240 89 -224 -120 182 34 -134 38 149 -2 -69 124 78 -112 -17 222 8 -254 9 282 -10 -268
2732 -268 -35 164 -27 -210 -30 81 -134 -80 141 50 -196 14 224 -59 -189 56 316 -48 -205 145 216
2753B16k74q1K40mj70P7J33j83j28K33P3k59o1L35O4l82mL59k4l10Q4K10j21j38
2777a15J68R2k33l3L14J2l76J17L02j79k84J15K83j45k27J53J75j73q6J92Mk10
2799a34Q2J86j33j74J46K48j45k81J78K36j94p1J48N3j56m7K77j92j70J61J73
2820A91k42k02L27J39k99j39L10Q4k80p0K15J9j11N3J24k11o8K87m6k50k8L65
2842A68L3l73P7K52N7k87K2J97j19r6R0Q0j81k1K68o8l31J51L14j54l77J49L55
2865B06j46k72J21K41j33j33J55j9j63J31K16j80k19J89L04l41k17L40J27j55
2885E2k55K37J37k01n0J27m9j05J59J43k86j53L20J29k88j22K96J92l68j22K79
2906G2N8j76J1J91j56j21K22lk76J0L47J1l86L4L37p7k53qK73o2j67J06J29j59
$$ plain form
2753 216 -58 -139 101 97 -73 4 137 -46 -174 59 132 -127 -188 147 211 -171 -175 184 160 -150 -66 144 23 -115
2777 -115 53 145 -88 -121 193 205 -171 -54 248 69 -215 -100 183 38 -189 -36 139 -34 -120 72 76 -134
2799 -134 -52 134 1 -173 -27 221 76 -205 -27 209 15 -56 92 145 -11 -58 219 27 -143 18 191
2820 191 -51 -253 74 213 -86 -225 85 169 -111 -181 34 53 -58 -5 119 -92 -160 127 81 -169 -197 168
2842 168 201 -172 -95 157 214 -73 -51 146 27 -69 21 101 -80 -101 167 99 -232 -81 233 79 -298 -149 206
2865 206 60 -212 -91 150 17 -116 39 20 -143 -12 204 24 -195 -6 298 -43 -260 80 207 52
2885 52 -203 34 171 -30 -80 47 -2 -107 52 195 -91 -244 76 205 -83 -205 91 283 -85 -207 72
2906 72 130 -46 -35 156 0 -121 101 98 -178 -168 179 190 -196 -162 175 98 -155 -163 110 48 -119 -13 116 -43
2930d3lJ82q8j68N4K89j22k88J50K81j25k78R1K66j24j86J68M2j80k5K25j56j78
2953b16J81K49k13k84K82J94k44j24K07J21j94n8J81j0k00J63J21j76j44K99J33
2974B68l38m9J96J21k64j37K72N3k37L9J36p1j72K20N9k08m5K93J1l65O5L72p3
2997A46l43J33J68m7j36M0J44j67L9R0Nk44Q0K65j03k69J06L32j71k33J07K24
3019A66j13j77J16R3j38L4J30j23j79J56K75k61k00K37K40k77j65J93J60j53j54
3040a40K02%j35N5R2j43j57K98J55l60o5L33O1k84n1K34M1j96j6J48l8m6R7k9
3064E6j67Q2J96k7l39O2K86pl18P2K41k8k26K3J74j28n2J40l2j71R6K04p4k37
3088a74J46K22j00k79P0L51j90k18K05Q6p7q6J05k1j48J75J11j93j93K26J73k51
$$ plain form
2930 -43 -46 136 48 -120 -66 223 101 -187 -37 244 119 -159 -68 198 74 -112 56 98 -82 -107 118 -38 -216
2953 -216 -35 214 1 -283 -1 193 -51 -175 32 153 -41 -99 82 72 -128 35 156 -20 -164 135 268
2974 268 -70 -119 77 198 -66 -203 69 122 -115 -76 60 -11 -183 37 96 -112 -157 136 147 -218 -153 219 146
2997 146 -197 -64 104 57 -79 -39 105 -62 -23 67 72 -172 -92 173 70 -199 -93 239 68 -165 -58 166
3019 166 53 -124 -8 85 -53 -19 111 -12 -191 -35 240 -21 -221 16 256 -21 -186 7 167 14 -140
3040 -140 62 62 -73 -18 74 -69 -226 72 227 -133 -198 135 196 -88 -139 95 136 -60 -76 72 34 -12 85 56
3064 56 -111 -29 167 140 -199 -137 149 142 -176 -104 137 109 -117 -94 80 -48 -100 40 8 -163 -67 137 63 -174
3088 -174 -28 194 94 -185 -115 236 46 -172 33 119 42 -44 61 40 -108 67 178 -15 -208 18 191 -60
3110f0j61K33J03j86o5J38O9j72Q2O1m2q1J20J09k60m5L01O0k74j23L06Q9k44
3133d2o9K27n1j34K8N6p9L0J07Kk44Q0K84p8k98O6K64j15j59Q6J17m6m0N0J5j42
3159h5P3J25m2k11N8L27k39k08J57J70o9k18J43J27p7p6Q4k5j25P7J39j19j30
3182a44K12R4j62j30J97J55k20q6J15P6q5kJ07j25j12K21K8k58l1K49Q5k83r4
3205a93K80M5k68M9J20Q7j99MP1j4j6J30p4j04N5K26r8k18N3K42m9k20QJ80Jj53
3231e5K4J04j89J25N7k5j71R8J84j60j87J43K12j53j66R8J47o4j05J13l0j6Q3
3254F7M6j15j00J35J69k43j44K13J53j83k32K30J35j12q6R1k7k6Q4jj26o9K32
3277I1qj61r6K72Q8k16r6J84N4j69J8J14j30pJ59Lk05KK21o3k11M5K91p3j96m3
$$ plain form
3110 -60 -221 12 115 -71 -136 2 71 -101 -19 42 0 -81 39 148 -112 -157 144 204 -70 -193 113 202 -42
3133 -42 -111 116 65 -69 -41 15 -64 -34 73 75 -169 -89 195 117 -181 -115 149 34 -125 -39 78 32 -8 42 57 -85
3159 -85 -12 113 71 -140 -82 245 6 -202 -45 125 56 -162 -19 108 31 -45 39 14 -111 -34 105 -14 -144
3182 -144 68 162 0 -130 67 222 2 -84 31 107 22 20 127 2 -110 111 139 -119 -150 99 184 -99 -193
3205 -193 87 132 -136 -87 33 120 -79 -75 -4 -18 -34 96 22 -82 -27 199 101 -117 -64 178 129 -91 -83 97 98 -55
3231 -55 -31 73 -116 9 66 41 -130 -32 152 -8 -195 -52 160 7 -159 -61 86 22 -83 30 0 -16 67
3254 67 113 -2 -102 33 202 -41 -185 28 181 -2 -234 -4 131 19 -67 24 -3 -29 55 54 -72 -141 91
3277 91 83 -78 -174 98 186 -30 -126 58 112 -57 -39 75 -55 -62 97 100 -105 -103 118 55 -156 -111 180 107 -89 -132
3303a32K05J5j60J6J03r0L5J23k7j44Q2J54j33j61Q2K36j67j76R2J69r5q5O4%
3327FK5l7Q9j33o7J36N0j76m5J38J37k10q8J86J00p3r8R5K6p2Q6j0j17j2J81K9
3353A46k57K7K01J5k05m0J62M9j85J0J41m2o0J06m4j47N8J42qk44J35K39j46j90
3377a37P2J94l3j84Q3Q0r8l3J19k8j19O8J31r8j48P4J44k0k71J59J42p1j21M8
3401d7P0k2j5N4m1p3J88J4j44j21K29M8j57p6J29P7j75p2J42K4m3mj1o7K8J49
3427H4%j92pK37rk21OJ76j4j36l6J65Qp9N5k1n2O4L3j0j79J05R5k7j38lK08o8
3455D4j55L3J54n0k4j9k1j6O7O3p2j40J70J23j66j09J31J01k5j48R0M3n5k6QO
3481Gl7R3J5j69lJ19Q3k24J3J85K0j55o2J24O6o4n8P0m0PJ04p2j23M8J58l1j52
$$ plain form
3303 -132 73 88 -72 -56 47 -43 -8 115 88 -56 26 180 47 -114 -32 204 37 -139 -47 122 27 -58 6 6
3327 6 31 -6 83 -50 -117 19 69 -107 -152 -14 123 -87 -175 11 111 38 -60 35 61 -11 75 65 -52 -64 117 146
3353 146 -111 -84 117 132 -73 -113 49 98 -87 -77 64 22 -38 68 24 -123 -65 77 69 -175 -40 199 53 -137
3377 -137 -65 129 96 -88 -5 75 -23 -56 63 35 -84 -16 115 17 -131 -57 87 67 -204 -45 97 26 -95 -47
3401 -47 23 1 -14 40 -1 -74 114 128 -16 -137 92 140 -17 -93 36 113 -62 -134 8 32 -11 -15 -26 -93 -65 84
3427 84 84 -108 -115 122 113 -108 -102 74 60 -76 -112 53 61 -18 37 16 -36 28 61 51 -128 -23 72 45 -93 -96 112 44
3455 44 -111 -78 76 26 2 -17 -38 -54 13 76 4 -136 34 157 -9 -118 13 114 89 -59 31 74 19 -7 1 7
3481 7 -30 63 78 -91 -94 25 108 -116 -103 82 102 -53 -115 9 75 11 -47 23 -17 -10 94 22 -101 -53 105 74 -78
3508g8M1P6N0j17j06J56O2j18K5Lk7R9j3o8q3P5J91j77q2O6R5j0j44M6J14l6o2
3535b2M6l4j6J10Qj01q3R2J45p8k09J36J72j74p7R3M5k0o9k4M6j0M8J2j27J3J63
3562H5K3j46OJ27L2r5j12P8N0j7k4NL4p4P2j9r9K7M6O4j43kJ44n9j03k5J61N4
3590I0r4jL4k2jN5l3l1L1J04q5j48R4J78j36o6pP6K1j20L5JL4L4m1n3RO1M0o2
3620cj32J06P9j0j47Q3N2p5k5L9J9L1K2J8n0p6J31%j46j6J41O1l2j34R9M2n1n8
3648c2N0k1qj0j6mK8P3nj24l6J77N3j57l1O8Opj11R7R5o8j3qj8J7Q3r8l8L4Q1
3679E7l3j25P2M1N4j07L1M0kLl2J2n7J15J1m9r3J05L7r1n2O7Q2q7j11L2J12j0
3707B2l3K2q8K7J22l4j46Q0Q3K4o2p3P1J02r6m7L2N2j7n3K7n9J4R5J6j00l1J35
$$ plain form
3508 -78 -37 39 89 -28 -134 22 84 -34 -9 -6 -33 66 53 -15 -98 -23 168 -9 -91 -25 70 60 -84 -38 76 40 -22
3535 -22 24 -10 -26 84 92 -9 -92 0 145 67 -142 -6 166 -8 -85 8 53 33 -36 -60 -14 -24 24 36 -91 -78 85
3562 85 108 -38 -32 95 127 32 -80 -2 48 31 7 12 46 -28 44 25 -74 -47 -1 63 -80 -82 62 3 -100 -125 36 90
3590 90 -4 -5 29 7 6 61 28 -3 28 132 47 -101 -7 171 35 -31 -38 38 59 -61 -26 -25 9 43 2 -51 -42 19 59 -3
3620 -3 -135 -29 50 40 -107 -24 28 -47 -72 -33 -14 17 39 57 7 -69 62 62 -84 -100 41 102 70 -64 35 77 26 -32
3648 -32 18 -3 -11 -21 -37 -41 -13 60 55 -69 -105 72 125 -32 -63 5 11 4 -107 -10 85 17 4 -4 -22 -5 78 -20 -58 -24 57
3679 57 24 -101 -29 12 66 -41 -10 30 28 31 -1 11 -46 69 80 31 -62 43 80 -11 -63 4 86 -1 -112 -80 32 22
3707 22 -11 11 -77 -50 72 38 -108 -28 55 79 17 -56 15 117 21 -26 6 58 41 -12 15 -44 -30 65 81 -19 -50 85
3735H5l3j23M6P6Oo1q1J01K4m1k8Ro2R2P5r8p4J00P2o0r0P7N6m6n5JL6N3o2K4
3765A9m2P0NJ0o6qrJ05q9j11J12R4n5p4p4J00J01q0o0J4K7M9j2p6L4O2Qj00m5
3794i1J06P3o2j37J01M5k1jm2m7N2Q9j09K5j1O2j4k7k3O3mo9M6nK7n1kmK5M7m6
3825ek4l7mJ60p6j23Q6M3K5j05lN5K6ok3l3K8N9%oj3M3Pq7k8J15j0j1p3K5L9j4
3857C0J0p4L7M4l0j1j00N5N7mr9J0J37J9j43J0N9N0l0j01M6J6M2Kq1j0R0K8K9
3886H8j62K1J00k2j5p6Q0P9j33PJ4j1M0p6O7j8N1J8r6k9PJ19l5r9K5M2O3j09N9
3915am0N1K%po6J17j9n6p1M3N9Nn8J5J07o7n1L0PO3m8j0k2j2J00k4j09J9Q6K3
3946F6j27KJ6P2N3j33QK3J1k1M9r3j1J58r5m1k6J03Jp1LL9Q6qp0M9K6Roq7k1P3
$$ plain form
3735 85 52 -71 -25 51 57 -4 -85 16 40 -1 -29 -20 -82 10 85 -13 -87 13 85 25 -65 12 68 22 -33 -32 4 57 -5 19
3765 19 -23 47 52 62 -4 -12 -21 84 -5 -116 -4 90 35 -39 -113 -13 88 8 -52 -38 -11 38 26 -50 -16 46 54 -46 -91
3794 -91 15 88 26 -111 -10 35 14 13 -29 -76 -24 65 -44 -19 -30 32 18 -9 -32 31 27 -42 4 -1 26 -25 -27 -31 -6 41 -5
3825 -5 -29 -66 -70 90 14 -109 -23 20 45 -60 -63 -8 18 12 -11 -44 -16 43 43 37 24 67 74 -13 -41 74 64 53 -20 5 44 30
3857 30 40 -34 3 47 17 6 -94 -39 18 14 -85 -75 62 81 -62 -52 7 57 27 -74 -28 -12 30 32 -49 -59 31 59 88
3886 88 -74 -53 47 25 10 -66 14 93 -40 -33 -19 -30 10 -66 1 -17 34 52 -44 -73 -66 53 18 -81 -56 -14 49 -60 -1
3915 -1 -41 10 12 12 5 -61 56 37 -19 -90 -47 12 17 -41 -26 81 14 -37 -7 0 63 15 5 -17 -29 71 47 -62 -43 43 66
3946 66 -61 -59 -43 29 82 -51 -43 -20 -9 -30 19 -74 -85 73 -22 -63 -89 14 15 -56 -53 -14 72 64 -6 43 69 78 72 -15 -36 37
3978C7J1p7qK2Q3m9n6K3M4m2l4j2O1L4m1K2o3N4nnn0K3L6L7n0J4m6R7l6o9pP3
4010B1Ok1K5K1n2M3N3j47MJ15l4n5l3P3P2q6m7LR3n0l4L0j9K8O5n3m9K5M3nm0
4041em4Q8j2K6j00J0N6m4K1m2l5J42n7m0L8rQ3k5p7j7P1no1L1J2K1Mm4m0R3J1
4072E0m2p5J5J9P0pm7NP5r3j5K3J9pk1OJK8kk7j7K5lL2n0PJ13j6k7l1j2K4Kp6
4106e4k5J01M0p5L0p3K7M3k0j6l8J08k3q1L1NO4q4M8j0L6op5kL5J1NN7j06O3K6
4137D2K8m3n6JR4j7o9PP3m9j4J3m9O1k6l3O0l1M0n2mL4j7K2p7K8lP4m7L9q7P3
4169A5N0p2ml6M3J9n9NQQ4l6p3j6K0J11m9j3m9P6L8l7q9Q1O9l8p6k9N3M5l5o9
4200f3K2N8L3q0k6L9J8Qk5l6O3M7j03M3qJ5j4K9q4N1J3JK1j7M4p2Q7p2j5K6N3
$$ plain form
3978 37 48 -29 -37 -15 68 19 -37 -14 30 -12 -46 -58 3 37 -4 18 -45 9 4 -1 -51 -28 8 45 -5 9 -37 60 24 -45 -52 21
4010 21 27 6 31 52 0 43 96 -51 -47 68 34 -21 -54 19 91 5 -42 -39 54 4 -30 0 -19 9 74 21 -28 -3 40 35 -5
4041 -5 -49 39 27 53 -47 -37 19 -25 -4 -46 -81 61 4 -36 2 -7 76 51 -26 -43 28 23 -38 -7 5 26 30 -14 -54 39 50
4072 50 8 -67 -52 -33 37 30 -17 -12 63 -30 -45 -22 -3 -10 -31 -25 -24 4 2 -25 -42 -17 -20 12 -38 -31 82 66 39 8 -4 20 22 -54
4106 -54 -79 22 62 -13 17 -56 -29 14 -6 -22 -60 48 25 -56 -25 -20 44 -40 8 -2 34 28 -47 -49 -14 -3 2 59 -47 16 42
4137 42 70 27 -29 -28 66 49 -20 -13 60 11 -3 10 -39 22 -4 -37 23 -8 32 -20 -24 10 -7 15 -62 -34 -37 37 -10 29 -58 15
4169 15 65 -7 -11 -47 -4 15 -44 -39 -31 53 17 -56 -72 -52 59 10 -3 -52 24 62 25 -64 17 86 48 -28 -57 -4 41 6 -63
4200 -63 -41 17 50 -30 -56 -17 1 9 -16 -52 11 58 -45 -2 -10 5 -9 20 -64 -13 0 1 22 5 49 -23 64 -8 -23 3 56
4231E6j9n7l6R9np2NN3mK3m3l7M4o3P8n8M6OK2j0p7K2kM1l6j3O8Okkj1Rk0nk6
4266b0K2K1k8KJ8l1Q1n6l2N9k2J4n4Oj5mN4k6J7JJ1rkl0N7%k8k2K9KM3q6n0J19
4300D1j4l3qjP6o1j5k0P2L7J3o6l0O0m1J7p7K6N3J6p7j5M4QM3m0q2R0%l5j8M2
4332EL2j8nJ4j8k9L2nl3L3j8PK3J8%Km3j4P0jk9l1m3M5M9j5K3l2M2oj25L2M0K2
4366B4j6j9n2P1j7k5L2OQN7o7k7k4J06k4p8L9L5kJ9o6O6M0n6n4J5%P1k0j9n3j
4398c1O7o0m3M8NL4J3n8K4J9l0Rn7R0J6k2k2j8L5k3Nj5N0o5O3o8L5n0J09%m3k9
4430a2M4m2Q9p3M7n0P0p0m5M5k2Pl2MlJM1p3M7N4k4k4J6n7J28k4n7mp2J09oo3
4462e1L6J6j2Kj4K5oj9M7m2k7O4l2N3Ql6K8n9M7J6J3k4k7q3J06k5k1k6j0K7qk
$$ plain form
4231 56 37 -20 -56 43 38 -34 -29 24 20 43 0 -37 7 -56 22 -36 10 16 38 28 -49 -27 -29 12 -24 -37 31 37 35 33 22 31 11 6 -20
4266 -20 2 23 -5 -3 15 -16 65 9 -23 36 14 28 -26 -20 -35 -39 15 -11 6 7 18 9 7 -23 34 34 6 -16 13 15 58 -28 -78 41
4300 41 27 -6 -14 -15 61 0 -15 -35 37 74 87 21 -9 51 10 27 -50 -24 29 45 -32 -47 -3 5 48 8 -74 16 16 -19 -37 5
4332 5 37 19 14 28 10 -19 13 8 -25 8 -10 -3 20 38 38 40 -3 -17 53 52 23 -8 -51 -6 43 28 51 19 61 55 -70 -38 2 24
4366 24 8 -11 -63 8 -9 -34 -2 4 12 69 2 -25 -49 57 33 -45 -6 29 27 46 -20 46 86 30 -24 -9 -9 62 42 23 -30 -31
4398 -31 36 -24 -67 -19 -14 20 33 -25 -1 18 -12 -3 -60 30 46 24 2 -16 19 -4 1 -14 36 -29 34 -34 1 -49 60 60 17 -12
4430 -12 32 -10 79 6 53 3 73 3 -42 3 -19 -12 -44 -40 -43 -42 -1 -74 -27 27 3 -21 -5 -62 66 42 -15 -19 -91 18 12 -51
4462 -51 -15 1 -11 -9 -23 2 -4 -23 24 -18 -45 19 -13 40 48 12 40 -19 28 44 57 33 6 -77 29 4 -17 -43 -53 -26 -34 -36
4494c6k9R9l9J7q5Q1j9L8m2K2N7p7O5p5L7kJ4L2l6k3j0K7l3L9l2j4P2o3L6o4O5
4525B2n5k8K2O3lkk4k0K8Jl1R2p3J1Nl1ON2MJ7j9p8J1O8q0j8M0K7j1j0mK5kPk2
4560a0j8O5mk9m0JO4J8m2k6K7K7o5O8n4K2qK8m8j0N9Mp0j3N2J1j6J5KR4p5jo1
4593c3L1M7k2m7jJ3M6no5P3m4pNK1m3K2oN9o6l0O7J0m0k4N0lL4r1K1O3ll2KL4
4627C6j0K2m8k8M6qJ1J9J1j9J9o6NP2k9L2j25R1k4p3P4k4K3N1l1k7m9M5lK5k6
4658hm0M6mm4Q1k2M4l1l5N0KQp9N8o2N3O7m3n7mM3L2p9M4k9J8K8k2m3M1j8Pmq
4692a0j8M8K1l5lpJ6n2PJ1j0L4J3o1M4ml0M6k5J1PN3k7K2j6l3K2j8L3k7Pj4K1
4725B6l1qM1m3N9k5K9j7o4M6Nk3l8N8m0L8J2m3K8l8JqM9lK2no1j8M6J2n9J04l2
$$ plain form
4494 -36 -65 34 -5 12 -73 8 -11 27 -15 7 64 -13 52 -23 14 12 26 58 22 -1 -11 16 -17 22 -10 -24 48 -15 21 -43 22
4525 22 -33 -61 -39 24 21 19 -5 -25 3 4 -27 65 -8 3 8 -23 -17 35 39 56 37 -41 -30 38 -42 -60 -20 7 -4 -14 -18 7 5 12 -10
4560 -10 -28 37 33 4 -36 -35 29 47 5 -21 6 33 -32 36 -18 4 -4 24 -24 -34 25 29 -41 -54 -2 9 -7 8 10 104 29 28 -33
4593 -33 -2 45 23 -24 -25 -12 34 29 -36 37 -7 -14 -9 12 -31 -9 -15 44 -22 -52 15 25 -15 -39 11 8 42 -49 -28 35 32 0 2 36
4627 36 26 48 0 -28 18 10 21 40 51 32 51 -15 -10 62 33 65 -60 31 7 -66 8 -16 7 58 27 0 -49 -4 -7 18 -8
4658 -8 -48 -2 -6 -50 31 9 53 22 -13 37 39 47 -32 26 -36 17 84 41 -16 -20 23 55 -24 20 -9 9 37 15 -28 13 -5 2 -2 -10
4692 -10 -28 20 41 6 3 -4 12 -40 -33 -22 -32 2 15 -46 -2 -6 -36 10 -15 -4 3 56 29 51 35 2 24 6 39 12 19 5 26
4725 26 -5 -13 28 -15 44 19 48 31 -33 13 18 -5 -43 15 -25 13 25 -18 10 -28 -27 -35 14 11 33 28 -33 -51 -5 7 -52 52 20
4758B0l0Q0p1j6k7O8mml5K2J9l2M0j2Nl2l5j8K4O3k6K4m7L4n8jJ3K1M3mJ1l4j
4791@rK2n4J08o6j1jK3n0N4PJ1lk7M3m9K1n0K9K8o0MM0jn7N3rqk5K5j6M8k1J6
4825A5k7j7M7n7K2J4m%K4K2l1K5l3k4N2l1J4j1M8m4qpL2L8m0k5M0%n5J2KM2J4
4858D9q5j2L4J1pj9OL9k6K8q4M7L2Lj7j0l6N4k5N2lo6P1m4K2qL3k4N5n9L9j4l5
4891Aj3L0N0o4J4Nnl0J6J4n6P0l5Nj3QqJ2J4o2L8pK9o2N5M0o9K5rjRL8j7k5N7
4926E4o3J1K0k5j3K2Nl1J7Q%rJ6Kl6Lk3k6N1nJ3J1K5K5m0mm9L3j4O0Np1jK2j2
4961a9J1m0R1m0j8O4p8j4P7L8o2m7L5K1k4J5k0L4o5J6J2L5n9pL0K4M0n4n7J8m2
4992h5Q0lk4N1PL1k5k7L6l7O4q1N5j5J7l4K1J6o0P2o3k3N7l1P2n0l2K1Mj06O8
$$ plain form
4758 20 -10 70 -1 -17 -44 24 20 16 -19 3 22 -10 30 18 23 -9 -44 -62 -38 25 -1 23 -24 10 -48 -49 -36 -15 28 24 35 1 0
4791 0 -9 13 -41 67 1 -10 -11 12 -38 16 23 34 31 4 47 -2 19 -31 -2 26 -34 -30 10 9 -48 5 -4 -12 -37 -12 -28 20 -1 15
4825 15 -12 -29 18 -39 -17 -3 -7 -7 17 39 8 33 0 -24 28 -3 11 0 48 4 -4 -11 21 59 19 -6 34 34 -21 -9 -7 35 49
4858 49 -36 -48 -14 -3 -10 -29 -23 16 -10 18 -66 -19 13 16 -1 -11 -47 7 -18 34 31 -35 36 -8 14 6 39 15 70 11 50 36 1
4891 1 -12 18 68 4 18 23 18 -12 4 18 -38 32 -3 2 -11 -3 -11 1 15 -47 -9 -16 13 -49 6 46 -23 2 -7 -8 1 39 22 -3 54
4926 54 -9 2 22 -3 -16 6 11 -20 -3 5 5 -4 12 14 -22 -19 -42 -68 -17 -22 -9 2 27 52 12 8 -41 -8 -22 38 43 -28 -29 -7 -19
4961 -19 -8 -48 43 3 -15 49 -29 -43 34 72 10 -37 -2 19 -5 10 -10 24 -41 -25 -13 22 -37 -44 -14 10 50 -4 -61 -43 -85
4992 -85 -5 -8 -32 19 26 57 32 5 41 4 68 -13 42 27 44 10 31 47 -13 59 -4 -27 30 -1 71 21 -11 10 14 -92 -24
5023b4K5%N9q9J4rQ0r7J2L2ool4J5Qk7Q7k4K1j5p3N4J0M5l9j0L2m5K7qjlj0M9
5057E0j5lr8N8J9k6oJ4J2m9O7o5L4L5n2N0q1K8J7lL4%n4L8k6QJ12o5o4M3j8KN3
5090D9k8np0M5J03p3mj4%l1P5J2n2k9N1k4jn9M7J6ok8J5Ll3M9n8L9PJ4k2pL9l5
5124a5k9K8j5L4poM1J1j8k7Qj8NKm4Q5j8jM2j2j0r7P3LPok8J4o0K3L9jl2MN9k0
5160A4K0o4M0j8l3Q2n7J0j4J4L3oj0RjJ6k2J7l0j0J8%kO0o7K1q9R6M1o9ook1L5
5194ALK0Po5L7m9qM1kMk0L3J2qK4q3K1lN0L8m6Qp%qLoL9n2Q7r1L9J7j5k2oL5k3
5232Ek9J5K3m5j0O5Kp5Q0k7J3k9m6N0K4k0NK6j6l3L7m7L0l5N4qJOL3qn9K9k7M
5266a2kJM0l7Lj2PQ1j03Kk4Q2m2n1j9O8N6r1K4qO5o8L0M4j4j9J1M5n8K8%j9K5
$$ plain form
5023 -24 1 1 60 -29 -15 -24 56 -41 -29 3 -3 -9 -43 -28 -20 -47 40 16 37 22 -51 3 13 58 19 9 41 -4 23 15 14 11 1 50
5057 50 35 32 -66 -8 11 -15 -21 -7 5 -44 23 -42 -8 27 -25 25 -56 -28 -11 -14 20 20 -34 4 -22 -14 98 33 -31 12 -6 -4 49
5090 49 21 16 -54 -9 94 21 17 3 3 -28 47 59 7 -22 29 5 4 -55 -8 8 2 -26 -11 -8 -41 8 -50 -11 -4 10 -12 -19 20 -15
5124 -15 -44 -16 -31 3 -4 -10 31 42 24 -3 5 -13 -8 -6 -50 35 17 16 58 46 36 -61 12 15 22 16 -12 2 -58 -35 4 3 -29 -25 34 14
5160 14 34 -30 10 -8 -41 41 -16 -6 -20 -6 27 21 11 20 19 35 13 30 0 -10 8 8 6 66 -1 20 -69 27 68 -1 -7 -13 -34 1
5194 1 4 24 31 -34 3 -46 -54 -13 -15 -11 -31 2 14 6 30 -53 -32 -35 15 53 7 15 8 8 0 3 -3 36 -16 71 -20 19 36 21 -1 -7 28 5
5232 5 -24 -9 14 -31 -41 24 26 -49 31 4 17 -12 -58 -8 16 -4 1 27 11 -22 15 -32 -2 -37 17 9 10 16 49 41 -18 11 -16 -12
5266 -12 -14 -13 27 -10 -7 -19 -12 69 -34 -32 -56 26 -16 -67 -86 -18 38 -53 -29 -37 28 -40 -10 34 20 1 12 57 -1 27 27 8 33
5299C3ol9L6L9m6M8j00M5J3m3K4m3K7J4l3J8OOp3N8M7o0j7K6Rn0P7Lm6M1j3Nn3
5332d7J6L2qljL3l1NK4j0J4J0j03L5M1J8k7k2JO8k1L1j37J07j8J0%k0j9MPm8J7
5365d2P6r0J8J8J5K7nq5L9K7ONmMK4n5N8Lj7J7J4J5o1L1o5J1rL6mJ3k0l5M4O2
5399G1j33RO0L5m4k3NN6q0K6m9Q3q5P3m4J0L1K1oRo2L6P9m1J4J9k6n5J5lL8o9
5431c0J1O0k5l8oL0J6J5m6o1L7Rl4R1j0k1pk3m2J19m4j4pj5O0k7MJ9l2L8K8nm3
5464G%J3K3n3OK1o2R5l1J3nKo2P6l9J4oLnj3l5O3k1Kk7ql4Q9j2m4pM2m3Nj2L5
5500a0k6L7m1N9m7M2ojK3k7J8jJ2l6K0k1lPmOK9o3QJ9NnM1J2j00N5j1JN1r9L2
5535b4k2L6j6O8o6K2Jj3K5K4Oq4K2M3k2M4m4j0L3j7j2J8k1K1J4j1K2m6N6p3j2
$$ plain form
5299 33 27 -12 24 63 17 65 -35 10 23 -20 4 -39 -12 2 -31 -13 -7 -1 -74 -16 31 -29 -46 -20 -11 -61 16 19 -27 14 1 6 -47
5332 -47 -31 1 -7 -10 -11 22 -9 -4 20 10 24 34 -69 -34 7 25 -2 -24 -23 45 24 55 -82 25 7 17 17 -3 -22 -18 -11 -59 -42
5365 -42 34 -56 -38 -20 -5 22 17 -68 -29 -2 4 9 5 9 33 -22 36 39 22 39 53 68 7 38 -27 -16 -25 11 7 20 0 -35 9 71
5399 71 -62 -53 7 42 -2 -25 -20 36 -44 -18 -67 16 -69 4 -40 -30 1 22 16 25 -37 -1 78 37 51 70 44 -11 4 1 39 -30
5431 -30 -19 41 16 -22 -28 2 18 33 -13 -74 -37 -28 -62 29 19 -2 -9 -32 -74 45 1 -13 -20 -35 25 -2 2 21 -11 27 55 50 7
5464 7 7 20 43 -10 -4 17 -45 50 19 32 27 29 -33 43 4 18 12 15 10 -3 -38 25 4 6 -21 -29 -63 26 14 -30 -37 5 -38 -33 -45 -10
5500 -10 -36 1 -40 19 -28 14 8 7 30 3 21 20 32 -4 16 -5 -8 -1 -5 1 30 -33 -25 -6 -1 -6 35 47 -53 2 -9 -8 43 -56 -24
5535 -24 -46 -10 -26 42 -24 -2 -1 -14 11 35 41 -43 -21 22 0 44 0 -10 23 6 -6 12 -9 12 26 15 37 -9 47 -26 -38
5566c8L2j8P4r3M6R1j21NL8j2Kml5N3j9L0r6M8j1O8n3K6M3m9M5n7jJ8k7M7n5L9
5598A6l3j0K6PK0l5k2K1l0O3k4k2RrJ7M1p3P3n8LM4l4Qm3O9Po7QO7k4ok7R9r3
5632a2J7k1N8k8K4pqK5p1mQ5j7o8P4l2kk5M9nm1L4k6k3M1p5K6K8jOL5p5Pk1O9
5666A6m2NnM0M1o9j3L6j2K3J0k0k3L2j7J6mJ7n7MLj2J5l4J0M0k9N6n2jK8j6l8
5699e2O0k4j1L4j3LK4L7r8R8n7Qo4R6j1o4N9lm4L6K7o7M2k6K8k7k6M3K2m2K7m2
5731b7L5n3L0J5N9p2K8m8j8K7K4j7j1K0mK0p0N8L3%j0pj3K0j1L3k1m1j1O7o2N2
5763B5m0KK8j9Jk9RP3k1o8O3l1M0m5K5k9K5J2j1lk8J8j7K2k1O0n5mN1k7j2k6l
5796c5M7J9Jk6J7m1%O1m5L9m3J9m3P0j2p5Q4l7M4p2K4L7n8rP3k5qm3J8M6m1K2
$$ plain form
5566 -38 -6 -24 50 -43 3 94 -27 -22 16 4 6 2 -33 20 1 31 -65 -17 -28 40 -13 13 56 7 52 -5 -6 12 -15 32 -23 16
5598 16 -17 -27 -1 6 26 -9 -31 -10 -40 23 -1 -23 -14 -23 -6 35 -38 35 -23 -20 24 -10 -2 -45 24 31 -36 -28 39 15 9 -18 81 -12
5632 -12 5 -16 42 14 38 31 23 48 -23 -27 58 41 -27 47 15 13 -12 37 32 -9 25 -1 -24 17 -58 -32 -4 -5 1 36 -39 -32 -53 16
5666 16 -26 -21 -26 14 55 -14 -27 9 -3 20 30 10 -13 19 2 18 14 31 -26 -22 -19 -31 -16 -50 -40 0 -29 27 -25 -26 2 -14 -52
5699 -52 8 -16 -27 7 -6 -3 21 58 -40 58 1 9 -55 41 30 -34 25 22 -22 14 41 -26 16 -10 18 -9 -35 8 30 -12 15 -27
5731 -27 8 -45 -15 0 59 -13 15 -33 -51 -24 0 -17 -28 -8 -12 8 -62 -4 29 29 19 12 -1 19 8 41 20 -21 -32 35 -27 25
5763 25 -15 -13 15 -4 -3 -32 -23 50 29 -39 24 -7 33 -12 13 -16 9 21 10 7 -21 -3 -20 2 -19 41 -14 -18 33 6 -6 -32 -35
5796 -35 12 31 32 6 23 -18 -18 43 -2 37 -6 13 -30 40 28 -47 37 0 44 -28 -4 33 -25 -34 39 14 6 -37 -19 27 -14 8
5828HPK4m8L1o3L8N2o8N4o2jL8N4o3j0rJ37j30l1N5j2m4K1j4R0m6J2j6J4Rl1N1
5860D7n8j5OKK8K0j1q4O3m2O8J7j8nj7qk4J1M5j3l3J2J4pL4j1j0m3M5J1j9J9j6
5893HJ7%j9n1N9k4M9k5m0lN5l3J9j2p5J08j8J3j9k5K8K1n5M8M7q2k9P0k6l2M5
5924A9l6K4kJ8k0J7K1Lk2m9Qj4K9pk4K9Ll4O4m2l7L1j2M9q1O7rKQK3K8rpl1Mk1
5960a0J5j1K3m1N4j1l1N0n9K2Lo6L7N4o9L9k0KJ9k3M5k6l8O3k3K3Nr2Q3J7n9M8
5992B3l8L7oj2J7r5R1j8jL9l6J7jJ7m8K6Rj6J1m7pO1j9K6L0l2n7P3r3P8n3K0n
6025iJ8j9j4mk7P2m6J1M6p9M0nL5jqjk5mlRrJ0P8o2l6R8o0j0Lj3J0l5L1L7k4M8
6061E2o8m1J02m3n8R2o3K9N0n4J6k1l3R0l9K3n8K8qj2J5LJ7Mk4K7m3K3j7L2J0
$$ plain form
5828 8 15 39 -9 22 -41 -3 49 -19 35 -27 -28 10 64 1 -9 -18 119 -11 -42 13 1 -43 -22 -36 54 8 20 4 18 27 -4 47
5860 47 -11 -26 -20 -18 10 30 19 -65 -2 -44 24 41 23 18 1 -7 -31 -20 25 12 -21 -9 5 -2 32 21 11 -32 13 24 5 24 8
5893 8 25 25 6 -45 14 -10 39 14 -26 -29 26 -7 12 0 -75 33 15 28 9 -16 12 33 -22 26 73 -9 -38 32 6 -26 19
5924 19 -17 7 5 23 3 20 41 44 22 -27 -19 -33 -4 -11 -35 -6 -3 -37 27 -15 -52 -21 -33 16 -65 2 -7 -5 3 26 54 45 38 7 11 -10
5960 -10 5 -6 17 -24 30 19 -12 38 -21 1 4 -62 -25 29 -40 -1 -21 -19 0 -23 22 -4 -42 21 -2 21 26 -66 17 34 -25 23
5992 23 -15 22 16 4 21 -74 17 -1 -2 37 1 18 17 34 -14 12 21 5 16 -31 -38 23 4 30 60 28 -29 44 -49 29 -24 -4 -9
6025 -9 9 -10 -24 -28 -55 17 -29 -18 28 -51 -11 -16 19 18 10 9 -16 -20 -23 -14 -23 -13 65 3 -33 65 5 -5 -2 -15 -5 -40 -9 28 4 52
6061 52 -16 -57 45 2 -56 36 -27 2 52 -2 14 -7 -40 50 11 34 -24 4 -4 -16 -1 2 19 23 -1 26 -17 6 -11 21 31
6092C1k4m5RP4p8N7m0K8%Po5R0p7Kj2P3m7pL4j9j0K7LJ5l2MJ0l1N8o1J7M5m9j8
6126c1N0l3M8l1J1M4o1QJ3l0L6l1K1p4O9L1l0J2p6O6ll8M2K1r2J5M1j8l0K6qJ6
6158a6Jj6L8O0r4N7k6nJ2om2O3l2k6N4l8M4k1M6n3K0j3K3n4M5lKk3N0m0q3R0m7
6191c3nM8k0P8m9l4J2m7LK6Klj8K5N9l4J6J9n0M8k8k8QoK6mk2P5r6qL6j5J4JJ9
6226A5m4P5k1K0k6l8J5N1l6j4j9N1r9N8N8n1M0K5m7qKn2J4L9j9K3j5J9qqN3l6
6258A7m1M0o5K3R2m4l8K2n0K9Q3o1J5qj2l1rL3J9n6N5k1lL0o4KP3l5j2MJ3lK0
6291A7j2L5J2q4O8l6K1L0p3N1j5j4M7k7o5N5l4Mj7O4l6l7O6M6r3LpN7r3J2M0m9
6323f4M9L5L4n4M4k8j4mj5LJ0oJ4O1l6l4l8P2Mokj0L0p1K5j9j0kM7l5k0N7m1L4
$$ plain form
6092 31 7 -38 -29 45 -33 24 -16 12 12 19 -46 44 -33 -31 -43 30 -17 -24 10 -9 -19 8 11 26 -6 -2 8 -23 35 -26 -9 36 -13 -31
6126 -31 19 -14 34 3 14 58 -3 5 18 -12 24 -7 14 -60 9 40 10 22 -54 12 9 -29 13 34 -58 -43 -2 -20 -50 -24 -32 -16
6158 -16 -15 -31 7 67 -27 30 4 -1 11 5 -37 26 -6 -32 22 -16 28 7 53 0 20 7 30 -24 21 18 20 -3 47 7 -76 14 -33
6191 -33 -38 10 -10 68 19 -15 -3 -50 -47 -21 -19 -22 -40 -15 44 10 26 45 -5 43 15 -13 -5 -11 15 11 -11 64 -32 -40 -4 -19 -5 -4 15
6226 15 -29 46 25 45 19 -19 -4 47 11 -3 -22 29 -70 -12 46 -5 35 60 13 5 7 -45 -31 8 -11 12 -3 16 8 0 53 17
6258 17 -24 16 -49 -26 66 22 -16 6 -44 -15 68 7 22 14 2 -29 -38 -5 14 -42 13 -8 -11 19 -45 -43 30 -5 -17 -13 0 -3 17
6291 17 5 40 52 -32 36 0 21 51 -22 29 14 0 47 20 -45 10 -24 -20 -37 27 -9 -46 20 66 -27 -24 -31 26 -67 -55 -15 -64
6323 -64 -15 20 54 0 44 16 2 -2 -17 -14 -4 -10 4 65 29 -5 -43 29 33 27 25 15 45 -26 -1 -20 -30 -32 15 -20 -40 17 -24 10
6357A0n2J2j3L4m9L7M0j0n5O2l9L3j2J4O9p8K2k6k8J9klNJ6L5o2R5j13L5M4j6
6388B4j2j6K6j9j7Jl3P1k2k1k3l3P5J9k2ojJ2Kj4k2j5P8k5K5l7nM8m2lk9M5m9
6421d0P5m0rJ2j4OK9j5K4rok5K2M1l9oj7kk7rL2MNM0q1O5n7P1J5j00M3j2PK8Q
6456A9nqnkM0l8j1MM2o9j0K2M7j6l3oJ8ol2O2%j8M8k6o5M4Lk3K4pm8O3rJ7k9J4
6492AK7l3j6JM1l7L2n6J4N5l0NPl2oPK5N8l5j3J3k6m7N2kl5J9l8O1k2m1R8o3k0
6526c6kk6M0K8krmJnk0N1k1M0m9N5n4M9j5n0K5J9N6o3K2j5J8m5K0J6p0K6L6L8
6559E4j3p2L2j0Pk6M9rp1N0j9N4%n4L2Lm9L1J7l4J8OP3k1kl9PK3m4j3K7J7j6R
6593A7jj1k4O6o3PJ9L2l9k5K3krj7k3N1J5qL8p5L4p1P6l4nO8j2K2j7k1L3pj1K5
$$ plain form
6357 10 -42 -30 -43 -9 -58 -21 19 9 -46 16 -23 10 -2 12 81 3 25 -1 -29 -10 -12 -15 -10 6 41 -21 74 -39 -4 40 24
6388 24 12 -4 22 3 -14 -13 -46 25 3 -18 -41 -74 1 20 -2 -8 -9 3 5 -9 -31 -46 32 7 32 -5 -10 38 -4 -7 -36 9 -40
6421 -40 35 -5 -14 -2 -16 -10 19 4 28 19 13 -12 10 51 12 6 -11 -13 -40 -49 -17 -13 -8 32 -49 16 -41 30 45 -55 -12 -24 -17 11 19
6456 19 14 6 1 -1 39 1 -10 -6 36 -33 -43 -21 26 10 -23 -29 -11 -17 -49 13 13 -5 43 17 -48 -4 -1 -24 0 -7 -55 8 -1 16 -13 1
6492 1 28 -5 -21 -20 21 -16 16 -40 -26 29 -1 4 11 -21 -27 -20 5 63 28 15 28 2 -45 7 5 -30 -11 -49 12 -10 -51 47 -16 -36
6526 -36 -38 -64 -24 4 2 -7 -11 -10 -15 -35 16 -5 35 -14 41 -13 36 21 -29 -4 15 71 8 30 15 33 -12 8 24 -46 -20 16 54
6559 54 41 -31 1 -9 -2 -28 21 12 -59 -9 -28 26 26 -28 4 7 -42 -11 6 -28 -10 -4 69 48 46 7 14 37 -7 -20 7 24 8 17
6593 17 16 5 -19 47 -16 -9 10 42 3 -22 1 -1 -10 -27 -50 1 16 8 46 -29 5 -66 10 -24 -29 39 27 49 32 11 44 37 26 51
6627E1o3K7m0K0lL0K2jm6oO3m3l5jJn6P9k0pj9L2OJ8n1KL2M4o3pj3P4m0M4l6K0
6662A5J0k0K3Ql4Kk8N0l3Mk0M1j0m7J7m2Q2k9M7k9j0Pj2J0JNl7kK2k0qK2K0n2
6696d7M5Kj1K6ol3k5O8m5M4J9l7J9lk1N6p2K0J5k1qk3L2L1l3M5j03N7J2l9NL9
6728Hj6JK0l7J5j6K9k3L5Jjj6l6P3n5KOM1qo1O0k2m6R5Kk1kl2M9l9J2n1P1m1J0
6763Gk0L0okl8j3Q8l0l4JN7m7L7o2J3Q3o1j1j4K8mj5L1mJ4l7pJ9K1j1J1j7k8J0
6797a1L2o4Q5l9RoJ4m1oL6j5j1K8k7L3j5%J1m1k4O7p5M5qPl1M6lpj7K2J3j1J6
6831A2k3K1j6J1m5L6mj9M0m3K1J5L5k6k1L6J4q5KJ9K9m5J8O0m4j4O5kn0J8j0m0
6863c5onN5Ll5j5l3J12Nl8m4J02q0O2p8M0JJ5m4Nj6M6j2k2OJ4L1m5j5mK6k4L3
$$ plain form
6627 51 -12 15 -25 -5 -8 22 44 43 -3 -9 54 11 -24 -25 -24 -80 -1 -21 -28 -47 -15 -9 9 -42 -40 -8 36 -27 -34 -47 27 -13 31 -5 15
6662 15 25 5 28 36 2 4 -24 26 -7 -3 -23 18 8 -39 -22 -64 18 -11 36 7 -3 4 -8 2 3 8 -29 -31 -9 -29 -37 -15 5 -47
6696 -47 -2 0 -11 15 9 -24 -49 19 -26 18 37 0 19 16 -5 51 -21 -1 14 -7 -15 -38 -6 25 -8 37 -66 -9 3 -36 -31 8
6728 8 -8 -7 13 -24 -9 -25 4 -19 16 17 16 0 -36 37 -18 -16 -10 31 23 -38 22 0 -46 49 51 30 28 -4 45 6 18 -33 38 -3 7
6763 7 -13 17 11 9 -29 -42 46 16 -18 -17 40 -7 30 -32 -19 64 3 -8 -22 6 2 -13 18 14 28 -9 -16 3 24 13 24 7 -21 -11
6797 -11 21 -43 42 3 12 6 20 -21 -27 9 -6 -17 11 -16 17 2 2 13 -28 -52 15 -60 -15 -23 -16 -47 -1 -4 -11 -28 -6 7 -4 12
6831 12 -11 10 -6 5 -40 -4 -8 -27 13 -30 -9 6 41 15 -6 30 44 -41 -39 -20 9 -36 -18 42 -2 -16 49 47 -3 15 5 -35
6863 -35 -41 -46 9 12 -23 -38 -71 41 46 8 -36 66 -14 48 -30 10 11 26 -18 -13 -29 17 5 -17 -11 3 34 -11 -26 -30 -4 -28 5
6896EJo4Q1J7o6O8m5Jnl5Pj6K7NjrM1l0L9J3l2qL1l6J3LJ7j4l2j4O6m4k0n1Q3
6931dk4QJ5L1n7P5l5l5N8n1J5K5l6j0mK3j3k7nM5j7O9m1j2K1K2m9j6L2k8L1j8
6963a2k3N6k2M1j6k9j7j5M3MJ9o0K6J7qn2Jj0J06j22M9J5Lm0J0L4qQJL0J0q5Q5
6996C9k0l6Mj3MJ7N8k6m3L0j8L0j1l1Nl1J2L5M2j5m4l9O9Kl0J9k0lP2o4K4J1l2
7029clMk7j8L9M5k8OKj7k7N3j1m1LK8nn9L9M7m0J1j4K4prL1q5O8mm2Mk7P2K8n0
7065a3J1K7m8L8p6PoM8l2P0k6o6P8J4n0j1J7K0k9K7K9n2K6l2L1M3o6M2m3j0J9
7096a3M1Kk2l7L3k0J4k2n1J11o1K9l3L5n7N7J9o1NN9o8L0j9N1kn8P0l8Mj1J2j7
7128a8K9Pl3J3j6K7k0lJ4l6J6K5rK9k3l7M8p0J5O8l8J9l3L7k4m8M0j5J9K9k5K4
$$ plain form
6896 5 6 -58 23 40 -26 42 -3 -2 -7 -42 -35 -51 -24 -19 -20 -29 12 -18 21 34 2 -6 25 -11 2 5 22 8 -24 -38 28 -16 -36 -87 -4
6931 -4 -28 -20 -5 26 -31 44 9 -26 32 -19 -4 21 -15 -25 -29 -6 -19 -46 -51 -6 -23 46 5 -7 14 36 -13 -29 3 -25 6 -12
6963 -12 -35 21 -1 40 24 -5 -22 -37 6 10 29 -31 -5 12 4 -48 -47 -57 49 -73 -24 -9 -6 -46 -36 -2 -10 -2 -1 29 39 -46 39
6996 39 19 -17 -13 -26 -22 -5 53 27 -16 14 -4 26 15 -16 -11 -42 -30 5 47 32 -12 -51 18 20 -10 9 -11 -14 58 -6 18 29 -3
7029 -3 -6 -2 -29 -47 -8 37 9 15 17 0 -27 26 15 -26 -23 5 0 -59 -20 27 -13 -2 -16 8 1 -8 23 -62 6 2 -40 -36 -63 9 37 -13
7065 -13 -2 25 -23 15 -61 -54 -60 -12 -44 26 0 -66 12 26 -24 -35 -18 2 -27 0 29 -23 3 -29 2 45 -21 21 -22 -32 -13
7096 -13 28 30 8 -29 4 -16 -2 -24 -75 36 -25 4 -29 6 -51 6 25 -36 -31 28 -40 -10 -29 22 20 -38 32 -6 -2 -13 -1 -18
7128 -18 11 18 -15 -2 -18 9 -11 -14 0 -36 -20 5 -4 25 2 -35 13 -57 -42 26 -12 7 -26 11 -13 -61 -21 -36 -17 12 -13 11
7160A1Pl8J8j7K8j4N5n5Mk8J7L3j0J8p4N1j6L8j1k9K6Noj4mMKk4K7Knm2LJ1k0
7195d7L7j4j2K7RK7o6L9J1j2L5m4k5N1J3O%j7Lm5j2L4P2m7k5J4jJ0m4N7k7J6q1
7228e8L8oL2oN1l8m0K9j3J5L9n0Qn1L0J9M2nj8n9N4l8Q7l7l2Mk6M8n5O3m0Pp0
7261g6R5l4l5Q1j6k0J7j1m2K1k3L3j8K8J1l7J0lM3j6l8lQ5p2Ml2J9M0PJ3m7j2
7293b8P1j3n0n5O7Ml3J6L8J1Ln8J9k3M7j6Rk9k5l2L3O2l9M5m7J1L3m8jJ7l6N3
7325Fqk1J9N1n1RKL0J2m4k2%J8Oj5m6Q3k4k4P0r1K9m8P5qKj2L1k4m9N9k4J6m5
7359c8OK3RJml1J6kK2J1mL4l9K3n6J8P7n0J5lml2N1o7J5L3K8q3n0J00Mo6mJ9j9
7394d7K9j5K1%m5K7LNl0J7J1k3jO5lMK7Mk5qL0p1L8nk1M7k1l3N8k4l1j2Jk1L3
$$ plain form
7160 11 18 -20 -2 -19 9 -5 50 -5 -1 -29 -12 21 11 29 -45 6 -10 28 17 -12 14 19 13 -1 -5 -1 1 -23 4 6 1 -41 -38 -27 -47
7195 -47 -10 -24 -36 -9 0 27 -39 0 11 -1 34 -10 -35 16 29 35 35 18 21 -24 -36 -2 70 23 -2 12 11 21 -23 34 7 23 -58
7228 -58 -20 -26 6 0 51 13 -27 2 -11 4 43 -7 1 -50 -20 -1 41 36 18 -41 13 -25 62 25 -7 -3 -29 19 -36 27 -13 -6 -76
7261 -76 19 -15 -50 31 15 -5 12 1 -41 -20 -43 -10 -28 0 11 -26 -16 -19 24 8 -30 -33 52 -20 -16 -48 -29 11 18 31 -16 -28
7293 -28 43 30 -20 -75 -8 -4 -37 -21 17 28 31 -27 -8 -31 16 0 9 -20 -45 -77 -44 18 -21 24 -23 -12 21 -27 -28 -11 -47 6
7325 6 -2 -23 -4 47 -4 5 7 37 49 5 -17 -17 1 7 -8 -54 29 5 -19 51 -40 -11 -59 16 8 10 -2 29 5 -44 15 -9 7 -38
7359 -38 -32 -9 0 1 -3 -34 -18 -20 2 13 9 43 4 27 -29 -11 66 16 31 28 24 -8 43 -24 -9 24 52 -31 -81 19 23 -43 -47 -28 -47
7394 -47 -18 -33 -12 -12 -57 -30 -27 -22 -52 -35 -24 -47 -48 17 14 18 45 49 24 16 46 -25 13 8 -13 34 13 -20 38 14 -17 -29 -28 -49 -16
7429a6N9o1Qj6QK8j4K2qrm2P8n0M0l6p2K5L5K0j8J5J8k1L2n0M2Mn6J9LK5l2M7
7462B7n3R4l9Jp2M8pJ0j8oK8nj3j3M0j7o2O8J1p0K4K3L2k9m1NOMj3NN9o5l9O2
7496a5K3j3M6m4P7rp2Oj8j7Q3j9qj9j2O7n2j7m0O7k0j0pk8R8j01N7n2M4p3N9L2
7528A3l6J6k2M2jJ7m7P4l2KJ1m3L2k7Loj0J7j0m3N5l9M6k0M8k8L7q5M4j1p9N2
7560c0K%N8n1J6%Pk2%kK0M8n8P3l3rl8l0jK8oM3QJ6n2M1k7kj5M5p6M2k1L8m9K
7596c5K7O1l7j4m0M3Ll1K2l8K1K6m6Q8o5K0k3RML0J6m0JlJ5m0N5n7L9k2J1J07
7628A07p0om0J9j8J7k8K0J8p2M0J0rj8k0M7j6kj3K4Nl5K6pK6L3m8QJ1n2M7j9N8
7661D3K1n1l5J6M6J5q7L1pK2l1L4J6o6l3RP9mnm0j5J15n9Jm6K7K6r7Q9j7K9k7
$$ plain form
7429 -16 43 -18 -10 -26 -18 10 -4 18 10 1 -41 37 -13 27 -9 -81 -56 -21 -1 -19 -4 14 -7 25 -25 17 21 -35 -16 -13 12 -20 27
7462 27 -26 68 29 30 -42 6 -1 9 -9 -15 13 8 -5 -18 22 5 -57 11 22 -48 -24 -1 31 2 -39 -34 -28 -24 -37 -32 27 -38 -77 -15
7496 -15 8 -5 41 -3 74 65 -7 -1 -19 -36 47 28 20 1 -11 56 4 -13 -53 14 -6 -16 -23 -51 47 -54 3 -49 -5 -78 -19 13
7528 13 -23 -7 -29 13 12 29 -18 56 24 26 37 -6 26 -1 2 -4 -14 3 -7 -50 5 -34 12 -8 40 12 49 -36 8 -3 -82 -30
7560 -30 -28 -28 30 -21 -5 -5 2 -20 -20 -22 -2 46 -12 61 28 19 -19 -49 -50 -22 -28 15 23 39 -13 28 1 -1 -16 29 -47 -5 -26 12 -37 -35
7596 -35 -8 53 16 2 -38 5 8 -23 -1 -39 -18 8 -38 50 -15 5 -18 -9 -5 25 41 1 2 -1 14 -26 29 -28 11 -11 0 107
7628 107 37 31 -9 10 -8 9 -19 1 19 -53 -13 -3 -12 -30 -50 -3 -19 -21 -34 -10 -5 -40 -14 -21 5 38 -10 -2 9 -43 4 -15 43
7661 43 64 13 -22 -6 40 55 -32 -1 -8 14 -17 17 33 -33 -66 -57 22 18 13 -27 -42 73 14 15 -31 -4 22 -75 14 -3 26 -1
7693aK3l6l0L4k1k4K8M5m8M8k0M6j5k8pm9O6J3Qk5oqL0l5n5P3n3N4J5o3L5jk2
7726b9nP3n1O9q5k0PM6m2%N8m1Qm6M6N%k4Jj4L7J0o7M8k6Q4q1K6nJ4nK5j7Mk0
7761a7rO9r0Q0o6L7J9n8K8Rlj9mO0q4M5K0k8j4J5k7J15j04RK7K%j9m5L7N2o9M8
7794A6m3J1j1J8m2OO5j0k3J7Kj7K3m7nR5p6K6J9k2o2Q5k7j3M3n2M0l3L3k7M8m0
7826cj0L7Qrl4K6n4%K2K4k3rM8o6K0MK7m3k6N4m9N7L1nj3mq4R2j4j2mqK5n1N4
7861Hk2k8JP9o4nK3O5l2k1l8P2Krm5K8j1l4O4ll3l7PLLM5k8J4j5mk2J4pL4p2O0
7897hJ1M5n6oM2m9mpkoRqQ2k8L6m2M3j1ln7L3L8k4n7R1n6Mj6k0QK5j7k5K2l6Q3
7933C4j4o5K3JKK5q1L1J6J3j9K1j2O3n9jMPm7R1p5M3pql8M9OPJ5o1L4J1l7L2J
$$ plain form
7693 -1 22 -14 -44 -10 -31 -55 -27 18 -30 18 -2 44 29 1 -6 -55 11 24 32 7 1 -7 23 -12 -67 6 -47 7 22 -41 -6 -7 -29
7726 -29 -34 39 -12 57 -28 -48 -41 5 -37 -37 21 -20 -12 -58 -12 -7 -7 -31 -30 -44 -7 3 -64 -16 -42 42 -39 -13 -18 -4 -9 16 -1 3 -17
7761 -17 -26 43 -47 33 -33 4 23 -35 -7 2 -1 -20 -24 36 -48 -3 17 -11 -25 -10 -37 78 -26 -17 10 12 12 -7 -52 -15 37 -32 16
7794 16 -27 -16 -27 -9 -51 -45 20 10 -13 4 6 -11 12 -35 -40 55 -21 5 24 2 -60 25 -2 -15 28 -24 16 -17 16 -11 37 -3
7826 -3 -13 24 32 23 -11 15 -39 -39 -17 7 -16 -25 23 -43 -23 -19 8 -35 -61 -7 -56 1 32 27 14 10 -74 18 4 -8 -12 -20 5 -46 8
7861 8 -14 -42 -41 38 -26 -31 -8 57 25 4 -34 38 40 31 -14 14 3 -31 33 30 -3 -40 -33 -30 -27 18 -10 4 -11 -15 -37 -23 -30 4 -68 -8
7897 -8 3 48 -8 -14 28 -21 -25 -32 -34 -40 -31 -39 43 15 51 9 52 41 38 -19 14 52 28 -29 62 6 10 -6 -26 -18 7 -10 -35 -13 -49 34
7933 34 20 -45 -22 -21 -19 6 -75 -44 -28 -15 -34 -13 -25 38 -21 -22 -18 -11 -58 33 -42 1 -6 -14 -52 -3 3 10 25 -36 -2 9 -28 4 5
7968En0K8Jj0LN9j5j0Rn5MK1Qm5M8k2m1j2N3J7l0M4k6PJ6lk0JO2l1K1m9QK2n7
8003c9J5ML4p0P5l0K8j3j0QJ8o6L7Nj5J7lj7j9J5O3orm5L6l0ML5qqJ2jK5n4L4
8038B2j0M3m5j0l0PJ0L0j8J4k1k9M2l1M1o4L2J8m7L4M7qn4%PJ7kn8L7J6o0O6R
8071EOkJ5j2l5N4Ol4L0K0n6M1Qm7P3n5j1q0O4M1l2PKLrn5L6J5mPk2L5rl2Nj5j8
8108e5L7K2j9K9k2j3J4M7j4m3j9L6Mj5O3n5j5J3M4k9j0Rk1M6L6q5P8p3m0NL2K7
8140A4%k3J1j1n9M8K6J0n1L0m1QNj1O4l4L6l7J2K0N8q2m1P0m8Q7o8MM7n5KKO3
8173E6p5j0LN3k8k2P2j01Q4m6N0j00L2O0k9%j0L3
$$ plain form
7968 5 -45 -17 -16 -26 -23 36 21 11 20 -35 -31 -10 -2 -47 1 -21 -62 -74 -21 -4 -34 10 -16 -9 7 4 -16 -15 47 16 37 -12 -4 18 -39
8003 -39 -24 -20 14 -56 19 -11 17 4 -6 2 20 -46 -9 -4 -19 -2 -5 -22 -41 -26 37 31 22 -23 13 -17 -13 22 14 6 18 17 42 -12 22
8038 22 12 55 10 0 -30 -23 -13 17 -1 13 -8 -37 5 -26 15 -49 -17 1 -46 -12 35 27 -27 -27 -20 -3 -5 -63 -26 -10 -70 -4 5
8071 5 11 9 24 12 -23 31 37 3 33 53 -3 38 46 -1 72 17 6 -74 -10 31 -1 6 8 11 2 -53 -17 -2 -6 1 -21 14 5 -27 -22 -37 -55
8108 -55 -18 4 -15 14 -8 -21 -7 40 26 -17 -36 0 4 -11 52 -3 -18 -5 39 10 0 9 -12 34 70 -15 63 -10 -50 -45 -13 14
8140 14 14 -9 2 -9 -68 -20 6 16 -35 -5 -46 -38 -33 -44 20 -14 22 -15 -3 17 75 -7 -48 22 -26 61 -7 -3 44 -11 -9 -7 56
8173 56 -19 -29 -26 27 -1 -23 49 -52 32 -14 36 -64 -32 28 -1 -1 -11 22
8191B2
$$ Imaginary data points
##PAGE= N=2
##DATA TABLE= (X++(I..I)), XYDATA
0@%%%%%%%%%%%%%%%%%%%%%%%%%%%%%%%jMoPqQrJ1j4J6j8K3k8L2l5M0m5M8n4O2
51C3o8P4p9Q4r0R3r5R5q7P2m5qR9k66N93j282K974q565N5716L02515k48812m13610
73c10659J61718L65209m5490k78448m5788J41700J09072J3654j23574j69904R8029
84h4481K99821l5629l90406m5375M26331J29918m07230j94279L39898K27130k40347
95B5351k18451J23951J67140j2455p8940p7846l1260J34597J46687j55039k50269
106b26534J39469L25358r8005l60510M3903L52424Q792l03528m6790K22474O1126
117A18179j22899m7453K1106R419O9847M6703j38540j09882J78876J67369j90696
128B029k08149J78769K24605j50890k14059J15598J76918q2886j20187N8908N2118
$$ plain form
0 0 0 0 0 0 0 0 0 0 0 0 0 0 0 0 0 0 0 0 0 0 0 0 0 0 0 0 0 0 0 0 0 -1 3 -3 4 -4 4 -5 6 -8 8 -10 13 -15 17 -18 22 -23 25 -29 33
51 33 -35 39 -40 44 -46 47 -48 47 -40 32 -13 -21 78 -188 405 -877 2097 -6468 49248 351763 102951 -310659
73 -310659 -148941 216268 170778 -107670 -153458 -11758 97314 110968 -12606 -182510 -84481
84 -84481 215340 179711 -210695 -256070 170261 300179 -107051 -301330 38568 265698 25351
95 25351 -193100 -69149 97991 85536 6596 -71250 -102510 32087 178774 23735 -226534
106 -226534 -87065 238293 140288 -220222 -176319 176105 184897 -118631 -165421 57053 118179
117 118179 -4720 -52173 -31067 -21648 48199 94902 -43638 -153520 25356 192725 2029
128 2029 -206120 -27351 197254 46364 -167695 -52097 124821 41935 -78252 -19344 32774
139C2774m7099J7597M6933q0162n5518J29110O7387j60139p6428J73983P8158
150A26596j72209o9131J60057M8955j41821j9458J22100j5160j03586N0345Q6973
161G3661q1079p2144J03399N6112j16149l7155J19072J3120j14675J5952J05905
172F6019m9554r6227Q4142Q8209j14826q2555J37844P8675j48614p3738J45575
183C4950O4950j28554m8409J00793K2263o7022J3900L3091n8051m907J05272j3363
195E4913j49939J9085J84624j3506k03558m98K02106J6911j79172k9618J36770
206C8118L2732p9885k1811J6923m515M3775M4524r2878r2665J24418J41545j34060
218A6221j82295J22461K06147r3545k06827N4654J81307j5213j31450j6320O2668
$$ plain form
139 32774 -14325 3272 50205 -29957 -85475 43635 111022 -49117 -125545 48438 126596
150 126596 -45613 -114744 45313 94268 -47553 -67011 55089 39929 -63657 -13312 73661
161 73661 -7418 -79562 23837 79949 -36200 -73355 45717 58837 -55838 -39886 66019
172 66019 16465 -79762 4380 92589 -22237 -104792 33052 111727 -36887 -110625 34950
183 34950 99900 -28654 -77063 23730 45993 -21029 -7129 25962 -32089 -36996 68276 54913
195 54913 -95026 -75941 108683 95177 -108381 -108879 93227 110138 -69034 -98652 38118
206 38118 70850 -9035 -30846 -13923 -18438 25337 69861 -23017 -115682 8736 150281 16221
218 16221 -166074 -43613 162534 68989 -137838 -83184 98123 82910 -48540 -64860 -2192
229b192L2035J5499k8631r2432N986J56616L1490j99431p5751K15407J17489k03147
241b7062j46968J67056J56415j13783j41212N4036J01616K090m1876m4854l0276
252f4818O8400J04017o9923j68774N1187K14290j8368k34342k0519K25714N5481
263A42345j90392p8325J34219Q2261o6327o4599k662K7143O2545K5206j04926
274c3512q3330J25456J37924j23191j78945J02089J99212o8842j94550L1871J65322
285G9504j7j15775k0297N3068K4672J3043j2921p3687j2298J20523M4944j48851
297d8092p7935J56735J04018j45742j17098J20650J13811q7320r3325N3013N8421
308C7136k3124j3631K389l4521P682P9526p511j15463j96J37847J1124j45237
$$ plain form
229 -2192 29843 45342 16711 -75721 -69735 86881 118371 -81060 -156811 58596 176085 -27062
241 -27062 -174030 -6974 149441 35658 -105554 -51518 50098 52188 10312 -34542 -64818
252 -64818 3582 107599 37676 -131098 -79911 134379 116011 -118331 -138850 86864 142345
263 142345 -48047 -126372 7847 90108 23781 -40818 -43480 -16337 46208 71414 -33512
274 -33512 -116842 8614 146538 23347 -155598 -53509 145703 76861 -117689 -85818 79504
285 79504 79487 -36288 -56585 -3517 21155 34198 21277 -52410 -64708 55815 100759 -48092
297 -48092 -126027 30708 134726 -11016 -128114 -7464 106347 19027 -74298 -21285 37136
308 37136 14012 381 2770 -31751 -24069 55457 47946 -67517 -67713 70134 81258 -63979
320f3979k0987J37827K5430j18633k2250R1393J0273o1183Q946L2260l2890p492
332b1285N7578j1050p8917K3626R3865l1134r9957L6147R7077m0429q5929M5920
344a4488O8794n2908m8601O1155K7813o9337q940P5203p295p7050K0406P3186
356D7938l1591o3466M1555M8267n1546k9670O2525R971p3935Q312Q4877k2572
368C0665r3143L1783R6695l5249r3174L4505Q1397l1269o0974K8170L3362k7907
380e139j485L2034l1243m1270O0115N4360q1922o8905R3161Q1324r3016q8092
392i0078Q2501Q5569o3898p1853M1467M7114j9697j2644K911k7014O028O7115
404D7521n371j02082l510J26591J8292j37308l4694J32369M7783j12792n3518
$$ plain form
320 -63979 -84966 52861 78291 -40342 -62592 28801 39074 -22109 -13163 19097 -13793 -21285
332 -21285 36293 25243 -53674 -30048 63817 32683 -67274 -31127 65950 25521 -60408 -14488
344 -14488 54306 1398 -47203 13952 41765 -27572 -36512 38691 31396 -45654 -25248 47938
356 47938 16347 -47119 -5564 42703 -8843 -38513 24012 33983 -39952 -31640 53237 30665
368 30665 -62478 -30695 66000 30751 -62423 -27918 53479 22210 -38764 -10594 22768 -5139
380 -5139 -6624 25410 -5833 -47103 13012 67372 -14550 -83455 9706 91030 -1986 -90078
392 -90078 -7577 77992 14094 -57759 -16292 30822 11125 -1519 1392 -25622 -19594 47521
404 47521 42150 -59932 -63442 63149 81441 -55867 -90561 41808 89591 -23201 -76719
415g6719Q1475M8440m3794l1563N206L665K8136L1784n1660o9844O2434J04684
427I2244n9966j30078M6442J41935k5787j37079L643J15772J4796q0506k4517
438d3101L6342K2875J0302r255n2986j4367Q5726M3337j04742p2469J08119R5599
450A05380r7450j07871P5811J05954m8556q8966K1163N8735J317j9116j4719k4222
462c2540J7732O5467j0519r8598m143J19626K2496j26051l9588J17831N1054r7499
474a4732n3495O8715M5086l6852k6331O454n88J7762L1726l3395o2413L9300Q7744
487F8981l6370j04166K7652J08970j6027j01667N718Q3845L86n8133j51K8751
499G789o478K73J8694k5454l3953M4162M9021n5309o0969N9018O6855n6931o5793
$$ plain form
415 -76719 4756 53196 9402 -22161 -16955 -13290 14846 46630 -5030 -74874 -12440 92244
427 92244 32278 -97800 -51358 90577 64790 -72289 -68646 47126 61922 -18584 -43101
438 -43101 -6759 16116 26418 17163 -35823 -50190 35536 78873 -25869 -98338 9781 105380
450 105380 7930 -99941 -24130 81824 33268 -55698 -34535 24200 25517 6401 -8318 -32540
462 -32540 -14808 50659 40140 -58458 -62601 57025 79521 -46530 -86118 31713 82767 -14732
474 -14732 -68227 488 45574 8722 -17609 -11155 -11743 6019 37745 4350 -58063 -18763 68981
487 68981 32611 -71555 -43903 65067 49040 -52627 -46909 36936 37322 -20811 -20962 7789
499 7789 1311 1584 20278 -5176 -39129 5033 54054 -1255 -62224 -3206 63649 6718 -59075
512e9075N1168N6998m4068m1946L7576K2369l3014j006L0949j9455l0613L7160
524G043L0915m9962l0540N7859K8048o0545k2552N9485J3902n5732k600N0593
536B5914j0252m5369K3037M0028l4211l4904M2202K9049m6624k1859M7142J2497
548B6650m4531p19L9841j2863l4765K7883L0218m2079k6814N4054K4839o1715
560b0001k3502O4241K1735o0905j7874N2060J0879l9200k13K4140j4054r610L0867
573A8563k671m8607J0718O4504j3924p6346J2744Q1496q289p8747K842O7942J357
586C1582m9671k108K6465j856j391J1405k2127k5127M1002M1354n2887n7117N6536
599c940O9040n2231p4618M1668P1627k7958n9537J3774L9175k663j3015l238j5669
$$ plain form
512 -59075 -7907 49091 5023 -36923 653 23022 -9992 -10998 19951 496 -30117 7043
524 7043 37958 -12004 -42544 15315 43363 -17182 -39734 19751 33653 -22079 -24679 25914
536 25914 15662 -29707 -6670 33358 -853 -35757 6445 35494 -11130 -32989 14153 26650
548 26650 -17881 -18600 21241 8378 -26387 1496 31714 -10365 -37179 16875 41714 -20001
560 -20001 -43503 20738 42473 -18432 -36306 15754 26633 -12567 -12780 11360 -2694 -12304 18563
573 18563 15892 -32715 -21997 42507 28583 -47763 -35019 46477 38188 -40559 -37717 30225 31582
586 31582 -18089 -20197 6268 4412 3021 14426 -7701 -32828 8174 49528 -3359 -60476 -3940
599 -3940 65100 12869 -61749 -20081 51546 23588 -35949 -22175 17000 14337 1322 -1916 -17585
612a7585K732M2900M129o5038j5369P9283K8403q3556l9957P8166M7193o4360
624c059m7227M4928L9105k3256k3092K927R09J2678K4495k1788m9834K3621P0844
637E1251j8975q4668R595Q8925J550q3195j1193O8290J6691m6479j6068K1330
649b946Q760L727M590k4932k1580M0069L9582m7429n5372M7408O5623m1030o8778
662e2308L0935O3494j9942n0468J0250L1394m397q942L044j3870o353L4044J3192
675C0073m9353k1653N8252K9450o0086l4495N6128L5154m7330l0560L6111K0955
687B2646k4349p238J4158q827o569K4802K219l8965p35M9194R95n4589k002N4589
701B5329K043m9865l71M1495l578l1081R730K0239j7318j0068K5276J676l2210
$$ plain form
612 -17585 -14853 28047 32176 -32862 -48231 31052 59455 -24101 -64058 14108 61301 -3059
624 -3059 -50286 -5358 33747 10491 -12601 -9674 -8765 3913 28408 6620 -43214 -19593 51251
637 51251 32276 -52392 -42797 46128 47678 -35517 -46710 21580 38271 -8208 -24276 -2946
649 -2946 5814 9541 14131 -10801 -32381 7688 47270 -159 -55531 -8123 57500 16470 -52308
662 -52308 -21373 42121 22179 -28289 -18039 13355 8958 16 3060 -10810 -17163 16881 30073
675 30073 -19280 -40933 17319 46769 -13317 -47812 8316 43470 -3860 -34420 1691 22646
687 22646 -1703 -8941 5217 -3610 -10179 14623 16842 -22123 -22858 26336 27331 -27258 -29260 25329
701 25329 27372 -22493 -22864 18631 15053 -16028 -6298 13941 -3377 -13445 11831 13507 -18703
714a8703M974L7154r780l8929J3556L7407j6757l3095K0258K6370k4086j8453
726b0084K8091J0185l2048k593L4924l888l6198Q924L4949j2943l0958J6239K4408
739A9008j9503j5634K3164N890k7302L927L1724j2190l5860J8560L8725k2088
751H421l9286K2799L6902k1431l0942J8762K1377j6054r276J4417m552j4599J8194
764D732J6618l0116k0279L8735K4493m2931k7922M2404K9310l7485k7283K9387
776c37K1357j9603j1337J0199j913k315J6749k356l1573L590M4152j718n2659
789b7764k518N5607P396n2754j1364M4233J2693l1543j0304J6351L829j011O270
802I121j2259j8582K1821L1593k6636m2710K6583N0261k2405n2477J5742M8771
$$ plain form
714 -18703 -13729 23425 13645 -25284 -11728 25679 8922 -24173 -3915 22455 -1631 -20084
726 -20084 8007 18192 -13856 -16449 18475 14587 -21611 -12687 22262 9319 -21639 -5400 19008
739 19008 -495 -16129 7035 12925 -14377 -10450 21274 9084 -26776 -8216 30509 8421
751 8421 -30865 -8066 28836 7405 -23537 -4775 16602 548 -8728 5689 1137 -13462 4732
764 4732 21350 -8766 -29045 9690 34183 -8748 -36670 5734 35044 -2441 -29724 -337
776 -337 21020 1417 -9920 279 -1634 -3949 12800 10444 -21129 -17539 26613 24895 -27764
789 -27764 -30282 25325 32721 -20033 -31397 12836 25529 -6014 -16318 33 3862 2851 9121
802 9121 -3138 -21720 101 31694 5058 -37652 -11069 39192 16787 -35690 -19948 28823
814B8823q414l9227K375K5039P63q274k71q899m046K4062J1105l5464j9732M1779
828I619K7753m2686l3529L8640L5447l0872l2600K1410K4844j1691j3034L822
840b877j252J284J6292k889l0066J479M0672K186m6755o802M7594J0761m3569
853a3942j2666L5387J1484k4705p085J3040l22k429R892o234j9906J1832K9048
866B3394j4268l5760J4265L8961j2282l8184R956L3472p998k5518P214J5847q330
879G69n347J0910m487j4652J2567J8505j8383k1797K1757K3317k2896k2791K2273
892b55J9919k0756j4837J8846Q141j7165m57J5946o942j5130J3579J4582j8646
905c175j3554K1909J1903k3317r087K3102N065k1907n1K0023n753j7990J1389
$$ plain form
814 28823 20409 -18818 -16443 8596 9359 1085 814 -8085 -12131 11931 23036 -12428 -32160 9619
828 9619 37372 -5314 -38843 -203 35244 4372 -28228 -6818 18026 6335 -6699 -2877
840 -2877 -4129 -2845 13447 10558 -19508 -18029 22643 24829 -21926 -28728 18866 29627 -13942
853 -13942 -26608 8779 20263 -4442 -11527 1513 1191 -1238 8654 2420 -17486 -5654 23394
866 23394 9126 -26634 -12369 26592 14310 -23874 -13918 19554 11556 -13962 -6748 9099 769
879 769 -4578 6332 1845 -12807 -240 18265 -118 -21915 -158 23159 263 -22528 -255
892 -255 19664 -1092 -15929 2917 11058 -6107 -6564 9382 2440 -12690 889 15471 -3175
905 -3175 -16729 5180 17083 -6234 -15321 7781 12846 -9061 -9112 10911 5158 -12832 -1443
918a443J5968j6391j4149K0043J2125k1977r747K2149O538k0512k416J7814k744
931E258j4413Q668J1248j4738q531K0475O574k4823n457K7470M727k7618m143
944a5303K5339K819k0936n56J4815l192p999Q086J424j3972M053K0107p931k5493
958a8739R849K9206r710l0556Q461K8826o340k4036M535J6713l807p544M681k166
972f27p158J1141J1075j8368j5801K2897K0239k4573k3219K2926K4125j9301k2044
985a8688J4086J7109q778r468M259J57j394R741P31j8981j871K6251M737l0700
999a2809p944L1594J0994k9286j2387K3941J1682j6749q490Q739K956j434M438
1012E245m570j2705Q203K0571r577k6724Q688L0269o261l0587L359K7624r00k1605
$$ plain form
918 -1443 14525 -1866 -16015 4028 16153 -5824 -15571 6578 13116 -7396 -9812 8002 5258
931 5258 -9155 -487 10761 -3977 -12508 7967 14541 -10282 -15739 11731 16458 -11160 -15303
944 -15303 10036 12855 -8081 -8637 6178 2986 -5013 3073 4497 -9475 -5422 14685 6754 -18739
958 -18739 -8890 20316 10606 -19950 -11489 17337 10997 -13039 -8504 8209 4402 -3142 1539 -627
972 -627 -7785 3356 14431 -3937 -19738 3159 23398 -1175 -24394 -1468 22657 3356 -18688
985 -18688 -4602 12507 3729 -5739 -1480 -1323 -2717 7024 7755 -11226 -13097 13154 17891 -12809
999 -12809 -20753 10841 21835 -7451 -19838 4103 15785 -964 -9454 -715 2241 807 5245
1012 5245 675 -12030 -3827 16744 7167 -19557 -10869 19400 13139 -17448 -14089 13535 12635 -8970
1026h970k19J3588k92m803K900l747o797J0869J1636j5798j6428J8282J9952j8240
1040A933k1870J6333K1157j3257j8047R810J2762o998n868N120j680m470Q934
1053C859N028j4973o431J9369Q082k1501r222K1431R562j9487q303J6250N583
1066I247j2324j724Q520l256n187Q356K675j3131j043J6727Q4j8876M51J9303
1080I822j226j8026K286J5432l881j1862N997Q092q472m364J1085J204j3324J500
1094e737J4705l460j5000N024J4108o392j2089P649R113q941n924J0545K395j2058
1108f062O74J3353l340j4071N131J4018o289j2894O940J0760p352p452P915L439
1122D770q487P55R489m729j0659Q085J1815j0476j2554J1629J2436j1462j1419
$$ plain form
1026 -8970 -9189 4399 4107 -696 2204 -1543 -8340 2529 14165 -1633 -18061 221 20173 1933
1040 1933 -19937 -3604 17553 4296 -13751 -3941 8821 1823 -4045 1075 -605 -5075 3859
1053 3859 8887 -6086 -12517 6852 14934 -6567 -15789 5642 15204 -4283 -12586 3664 9247
1066 9247 -3077 -4801 3719 463 -4724 3632 6307 -6824 -7867 8860 8944 -9932 -9481 9822
1080 9822 8596 -9430 -7144 8288 4407 -7455 -1458 6634 -1838 -6202 4883 6087 -7237 -5737
1094 -5737 8968 5508 -9492 -4468 9640 3248 -8841 -1192 7921 -1020 -6944 3601 5996 -6062
1108 -6062 -5388 7965 4625 -9446 -4315 9703 3414 -9480 -2540 8220 868 -6584 1331 4770
1122 4770 -3717 -2962 6527 1798 -8861 -776 11039 563 -11991 -362 12074 612 -10807
1135a0807J0418Q994q845n467P064R54n733M039M947q884m897J3072N444j6014
1149e715o216J7295O930j6704p060J4672O345j1432m299P538J121l618L008K53
1163B118p613K006J2156l265j5941L212J8245k275j8849Q66J7477L12j4369p24
1177f644R848J65m420J520r83m025N550P447q942j0882J0866J3671j1040j5300
1191a3169R896J5394p934j3638N563J0166l557n467K137O5j833N226K564r978
1205d565m005J3481N780j5256p494J5392Q445j3769q437J1206P143p918m424M563
1219A42Q32j749L489l03p752J355J1354j377j4102P92J5258K5j4893p90J3097
1234E378Q19j0090k94O516j158k786L416o78n840L294Q374n060j0280N948J1473
$$ plain form
1135 -10807 -389 8605 -240 -5707 1357 2311 -3422 617 5564 -3320 -8217 4855 10299 -5715
1149 -5715 -11931 5364 12294 -4410 -11470 3202 9547 -1885 -6184 1354 2475 -1143 1865 2118
1163 2118 -5495 -3489 8667 5402 -10539 -7327 10918 8643 -10206 -9340 8137 8449 -5920 -6644
1177 -6644 3204 3369 -1051 469 -514 -4539 1011 8458 -484 -11366 -500 13171 2131 -13169
1191 -13169 -3273 12121 4187 -9451 -3888 6278 2721 -2746 -609 -544 -2377 2849 5413 -4565
1205 -4565 -8570 4911 10691 -4565 -12059 3333 11778 -1991 -10428 778 7921 3 -4421 142
1219 142 974 -775 2714 2411 -5341 -3986 7368 5991 -8111 -7319 7939 7964 -6929 -7719 5378
1234 5378 6197 -3893 -4187 2329 1171 -1615 1801 1123 -4717 -1423 6951 1891 -8389 -2441 9032
1249I032o070j1465N713J0361n164q233M731N311m668j979M819j318n382M107
1263b05O045o357o550P730O675q281o369Q270N383p661l792P040J532o244R99
1278a785N516l376m914N513M553p091m125P988L533q288k652P884J372p174M01
1293b645O041k419n006M490M033o454l274P929K636q745j971Q801J369q163m48
1308c826O988q46n174K383L440m278j616O130J89p727O99R027j327r664J442R430
1324E270j402q444J485O434j603m135K257J432l321J261M629l483n998N010P406
1339F798n728q385N821Q539n162p816M280O180l184l844K319J025k034K045K145
1354B999n077k620P319L439q802m372R259M961q704n056P362M550n564l124L465
$$ plain form
1249 9032 2962 -8503 -2790 7571 2407 -5826 -1095 4216 -452 -2431 2388 1070 -4312 -205
1263 -205 5840 -517 -7067 663 7338 -943 -7312 958 6341 -1320 -5112 1928 3460 -2784 -1785
1278 -1785 3731 355 -4559 954 5507 -1584 -5709 2279 5812 -2476 -5128 2756 4128 -3046 -2645
1293 -2645 3396 977 -4029 461 4494 -1960 -5234 2695 5331 -3414 -5385 3416 4785 -3378 -3826
1308 -3826 3162 2316 -2858 -475 2965 -1313 -2929 3201 3390 -4337 -3638 5389 4062 -5602 -4160 5270
1324 5270 3868 -4576 -3091 3343 1740 -2395 -138 1294 -2027 -766 3863 380 -5618 -608 6798
1339 6798 1070 -7315 -1494 7045 1883 -5933 -1653 4527 1343 -2501 -182 843 -1191 854 2999
1354 2999 -2078 -4698 2621 6060 -2742 -7114 2145 7106 -1598 -6654 708 5258 -306 -3430 35
1369C5J087j539J554N8m225Q52O807j142q785Q58R871j63r981n58Q972J019p211
1386b491r64M772L33k176R08m47k566K493M486l936o266M637P565m520q190L920
1402b442P992l088o693K206M910j631k513J515j60j779K678K378m778l153O068
1417A510L979o792m507O663M566n983m166M911L086l691j503K576m58j631K618
1432A178J039m409p96N829Q20o653q60O863R18o460p52N534K08m236N93K793j698
1449h9j525K942L29m162M97N057j046n538J355N552j495n200J823M259k022l028
1465b291K443J731k991m03L684q59m078J660M523k385m488K676M144k780l503
1480b917K836K336k878j095L024l50l175J519L505k519l762L321L804l648l615
$$ plain form
1369 35 1122 -417 1137 1195 -3030 -2178 4629 3487 -5298 -4440 5431 5268 -4713 -5271 3701 4720 -2491
1386 -2491 -3455 1317 1650 -526 382 -65 -2631 -138 4348 412 -5854 -1217 6348 1828 -6362 -2442
1402 -2442 5550 2462 -4231 -2025 2885 1254 -1259 256 96 -1683 995 3373 -1405 -4558 1510
1417 1510 5489 -1303 -5810 853 5419 -564 -4730 181 3267 -424 -1927 649 191 -1440 1178
1432 1178 2217 -2192 -2988 2841 3661 -2992 -3852 3011 3929 -2531 -3283 2251 2459 -1777 -1184 1609 -89
1449 -89 -1614 1328 1657 -2505 -2008 3049 2003 -3535 -2180 3372 1877 -3323 -1500 2759 737 -2291
1465 -2291 152 1883 -1108 -1511 2173 1314 -2764 -1104 3419 1034 -3454 -778 3366 586 -2917
1480 -2917 -81 2255 -623 -1718 1306 956 -2219 -700 2805 286 -3476 -155 3649 1 -3614
1495c614L637L114l308k275K912J201k497K79K067j677j895K992J956m140k117
1510c365M801K148m957k131M588J945l960j457K991N35j916O62R79j996j84L362
1526B045k60m582N24N378l90n681K04N407P3m715m4L408j10j892N99L13j439J086
1544g6K336k145l444K835M224k965m819K816M827k317m372J748L411j106k030
1559a077Q49L62p64J317J028k740j459L810K090m484k662M608K911m182k879L450
1575A78K328k524j535J481L98o37R36J03k400J86L645k37m533J38M881L00m830
1592b122m10M214N10l289k96K135j76q61Q91j94j816J070K698j690l414J779L838
1609B867j749l910J541L585j325k836J094J898j038q08J192l79j404J456J740
$$ plain form
1495 -3614 23 3137 -171 -2446 466 1667 -830 -551 1516 -161 -2056 936 2892 -1248 -3365
1510 -3365 1436 3584 -1373 -3504 1084 3029 -931 -2388 603 1138 -778 -116 863 -1133 -1317 2045
1526 2045 1785 -2797 -2273 3105 2715 -2966 -2762 2645 2718 -1997 -2041 1367 1257 -635 -36 277 -1162 -76
1544 -76 2260 115 -3329 -494 3730 765 -4054 -1238 3589 1272 -3100 -1352 2059 953 -1077
1559 -1077 -228 134 -630 687 1715 -1025 -2484 1326 3416 -1068 -3730 878 3789 -393 -3272 178
1575 178 2506 -18 -1553 -72 326 -311 625 728 -1672 -1486 2159 1922 -2611 -2473 2408 2708 -2122
1592 -2122 -2532 1682 2192 -1097 -1393 742 566 -295 596 402 -1414 -344 2354 664 -2750 -971 2867
1609 2867 1118 -2792 -1251 2334 1009 -1827 -733 1165 127 -681 511 132 -1272 184 1924
1624A924k074k122K550K335k759k354K710K138k441j650K040R48j755k4J340q41
1640c5j248J738J070k369j084K855R59k963q64K823P02k517k80K174l36j498Q79
1657FJ090j574o72K159M54k663k14K844R9k827M6K442k32k077M74J533r32q21
1675h65J391J58j877L30K356o34k634P51K776q33k510P84K180p51j593R07P48
1692F84r25m1J286q48j496J316J872j803k135J912K252j883k165J700J826j400
1708A52j261J033N13q08M41O14j239n97J989P76k510r18K683J218k756j194K371
1725E07J118j800q72J188L42o43L35R7j092K55J798m18k463L88K857l13k894J07
1743a503K751J24k375l1J524Q3p06K63q6p16P67J230j233j724J438K184j576k375
$$ plain form
1624 1924 -150 -2272 278 2613 -146 -2500 210 2348 -93 -1743 297 1245 -510 -534 806 -35
1640 -35 -1283 455 1525 -844 -1928 927 1886 -1077 -1941 882 1584 -933 -1213 961 625 -873 6
1657 6 1096 -478 -1150 1009 1463 -1200 -1414 1430 1529 -1298 -1252 1190 958 -1119 -645 888 -44 -865
1675 -865 526 684 -1193 -863 1493 859 -1775 -1024 1752 919 -1591 -807 1373 622 -971 -64 684
1692 684 -241 -282 1004 156 -1340 -24 1848 45 -2090 -178 2074 191 -1974 -274 1552 152
1708 152 -1109 -76 437 -371 70 684 -555 -1152 837 1613 -897 -1815 868 2086 -670 -1864 507
1725 507 1625 -175 -1047 141 483 -160 175 272 -820 -565 1233 815 -1648 -1260 1597 1284 -1610 -1503
1743 -1503 1248 1372 -1003 -1034 490 573 -133 130 44 -672 95 1325 92 -1632 -194 1990 414 -1961
1761a961J439K345j257k014Q41J472n28p78M10j2m72Q18N26j437p33J922J054
1778A635k167j231K112J399j941j204J515J032j163m56O23m9l76P99k9j286j0
1795g97J795L3k123r6K141J52k016k10J754R4j220K8P89l27k87P59j83j062L85
1814c91J549o21j715P12J776o91j711O32J337n37j003O25M67p04l8Q28m96r63
1832i44Q33J165j044j232J075J238j002j107R46Q74q56m75P77J8o48M30P07q61
1850a06p07J108P31j296p71J309P65j284o19J089L44q54n4O11l69l96P49L27j142
1869e65j96J375K07j458k35J443K63j310j46J054N9o61J45K78m53K6P30k52j099
1888g95L85J310m43j468M34J425k88j382K69J047j43p19K06J99l10K52N34o18
$$ plain form
1761 -1961 -522 1823 566 -1448 -607 865 337 -441 -31 -43 -515 303 829 -608 -1341 581 1635
1778 1635 -532 -1763 349 1748 -193 -1397 118 1150 -13 -469 154 105 -271 528 499 -787 -797
1795 -797 998 1031 -1092 -1188 953 1105 -911 -1121 633 727 -493 -465 324 -3 -290 469 286 -776 -391
1814 -391 1158 537 -1178 -466 1310 619 -1092 -460 877 340 -663 -38 429 -275 -313 515 19 -944
1832 -944 -111 1054 10 -1222 -147 1091 89 -1018 -72 802 -54 -529 248 266 -382 48 755 -106
1850 -106 -813 295 1026 -270 -1041 268 1033 -251 -870 219 563 -291 -345 266 -103 -499 250 577 -565
1869 -565 -761 614 821 -637 -872 571 834 -476 -622 432 491 -170 -25 253 -200 -174 556 304 -795
1888 -795 -410 900 457 -1011 -577 848 560 -822 -553 494 351 -368 -162 37 -273 -21 513 -105
1906a05p43R84Q83j010j093J094J120r34j084O92Q77m58o83L72J98k13K51J72
1924C20p48k23J095K89j280m30J360N78j220o88J129O05q24m05M63J27j36K42
1942B54o6n83J87R14k36j236K43J339r6j415J9J183%q86o6N88j2k35J37j28l54
1963d49M46O26o00q20O37J037o28j035M58J037l95p90L21M69j76j87J73j72k04
1982b52M29L23p40m26Q03N28q49n45P61N84p13m49M83L02l07NJ78j81k07N64J0
2003C01o06j27R15O6q77j14Q22J00p08j24N17Q4l93O2J68k64l2N50j27o72J10
2024c49O90p0p57J04Q06j36n80J22M68k23j73K11K1k98O1N54l81m98L69N80m40
2045H1n83K80O24l18m47K78K32j66n4J96k27j71L87K35m62l60O01M08o09l23M34
$$ plain form
1906 -105 -848 136 1019 9 -1084 10 1130 196 -888 -196 681 223 -460 -88 110 -103 148 320
1924 320 -428 -651 444 733 -547 -977 383 961 -259 -947 182 787 -37 -442 21 148 12 254
1942 254 188 -395 -208 706 470 -766 -523 816 720 -695 -676 507 507 -379 -445 143 131 -104 33 -95 -449
1963 -449 -3 623 23 -797 -160 877 249 -786 -328 709 314 -476 -155 314 138 -49 124 -48 -252
1982 -252 177 500 -240 -666 137 665 -184 -729 32 616 -97 -546 -63 239 -68 -63 115 -66 -273 291 301
2003 301 -305 -432 483 549 -328 -442 380 480 -228 -352 165 249 -144 -82 86 -178 -210 340 213 -459 -349
2024 -349 341 271 -486 -382 424 288 -292 -170 298 75 -98 113 134 -164 -103 451 70 -428 -59 521 81
2045 81 -502 -222 402 84 -363 -85 147 -19 -73 123 -104 -275 112 347 -115 -475 126 534 -75 -398 36
2066C6M09m09k82K42K32k33N8N9k35k3M15l0n61n6O24Q3o36j53O36J45m76k04
2088c59M11O8j77O8n1j02J62L16k65m61K28O34k23o31J63O22j16n20J2L80j5j98
2110e4K1ko6J11J86l12k96M09L42l74m28L99M91l07n02K75L17q7k14R5j7K4J55
2133A66K9l80rM44P2m94j62N07J56m46k27L60J45k36m0M5lJ6K12j07k62J41L67
2156B94j44m47J35M41m8l96o0L70J9k30J0R9p1O6P7j63j77K79K17k80l21K43L10
2179B23j33l61J18K75l5k04J11R7r6K3R4k00p6K88Q0j79k27K90J57k39j99K37
2201D4J16j09j10K6QMO2mk18lL66o2k94j2K84J12k76j06K43K2o8llMk8J39q2j10
2229e8O2K36j81k45J28K39q2k26K3J42O4j54Jm0n1J30Q5j35j02K85N0j95j64K04
$$ plain form
2066 36 445 36 -246 -4 228 -5 53 112 -123 -146 269 239 -322 -378 246 329 -307 -460 176 321 -155 -359
2088 -359 52 120 -57 11 -40 -142 20 336 71 -390 -162 472 249 -382 -219 403 287 -233 -221 159 144 -54
2110 -54 -33 -35 -101 10 196 -116 -412 -3 339 -35 -463 -64 427 120 -382 -107 210 123 -91 4 -13 11 166
2133 166 195 -185 -194 250 322 -172 -334 173 329 -117 -344 16 161 -75 -115 -70 -73 -57 155 48 -214 -73 294
2156 294 150 -297 -162 279 231 -165 -225 145 164 -66 -56 43 -28 38 115 -48 -225 54 271 -9 -330 -87 223
2179 223 90 -271 -153 122 87 -117 -6 91 -5 18 112 -88 -164 124 204 25 -202 88 245 6 -193 44
2201 44 160 51 -59 -33 -25 -21 41 37 -181 -184 182 120 -174 -186 98 210 -66 -172 71 93 25 22 19 23 -5 134 52 -58
2229 -58 4 240 59 -186 -58 181 99 -127 -104 38 102 -52 -51 -91 -142 -12 73 -62 -164 121 171 -24 -188 16
2253A6K33j39k43J08J40j9o3p5M4O8O9r0j56j2K32l5k00m8K79l2j47r2J89L8m5
2278B0q6K2rM8M0m0q2J04K32j82j70N2K72j42j42K3Q0K2j01r4Q2L8L3Nj27p6J95
2305A7M1j76k5J43J44j19j60J69K1l6LJ4K5pO4j03j7o4K11q3j80M3J91J0k41O7
2331d8P7k6r3L0J4k6N0J2j9r7J11J45j32p5Q3J06j11j37J79P5j16pO2J3j54O7
2357a7P7j32l3J52Mj46JR7J4r7m1J46%j34N1J08q0K3O1M8j52k4J72M0j48j6J92
2384A66p3j38M0O2j4p8J11m4q7RR1%j79O4J71p9j56P8J42j00j06J46Q1q2o6Q5
2410D4J3q2M2J43j62o5J25O4j54o1J51Q3j88j02K03o0r3L1J63j28r2J28L0j49
2434a16J7J69J4k15L4K71r0j65K2K47r1j53Q3R2j13p0J00N4k32Q0J19j03q2M8
$$ plain form
2253 16 249 110 -133 -25 115 96 33 -42 2 70 139 49 -107 -119 113 78 -122 -170 109 77 -70 -162 27 65 20
2278 20 -66 -44 -53 -5 35 -5 -87 17 249 67 -103 -51 221 79 -63 -40 40 62 -39 -133 -51 -13 20 25 -102 -178 17
2305 17 58 -118 -143 0 144 25 -135 34 55 19 22 36 61 54 118 15 -2 -66 145 62 -118 -75 116 126 -115 -48
2331 -48 29 3 -90 -60 -46 -72 -22 -10 -29 -126 -15 130 -2 -77 6 112 1 -136 43 118 2 -5 57 70 -84 -17
2357 -17 60 -72 -105 47 51 -95 -94 3 17 -80 -121 25 25 -109 -58 50 -30 -7 54 102 -50 -74 98 138 -10 -26 166
2384 166 93 -45 -5 57 43 -35 76 32 -55 -46 45 45 -134 -70 101 22 -134 -56 86 -14 -120 26 107 25 -41 44
2410 44 57 -25 17 160 -2 -67 58 122 -32 -93 58 141 -47 -149 54 -6 -99 -68 95 -33 -125 3 33 -116
2434 -116 -99 70 84 -131 -97 174 84 -81 -59 188 97 -56 27 119 6 -64 36 90 -142 -62 57 -46 -128 -80
2458h0K02j65j41J24J96j34j67J76J41j66m5J38r1n5J02J59k05r4K16M7j94j23
2480a59K67P0k57p1K84o2k14N7J31p9j08J61J15k98oK45qk64O7K81q5k42J45K19
2504A89j63j26P5J80j60k2Q0Pj89P9K26j55j94J17K24k06j86J44K74k45j30K04
2526B3O4j70p1K37m5j32J02J76j66j10J15J86l10m5K83Qk88P6J94k9j95N1J93
2549A47j56r3R2J18k27oK30Kk51N0K22n5k73Q4K70j01j78J56J49k48n1K39M1k65
2573a04N9K90j29k72J20K30k13k02K48J24k36r0K75j8k47N7K73j56k08J76K21
2594A98k03j97L01J10k11j09K46M5k40N0J61p4k25J40K16j95j86J86J42k31j35
2615b11K70M0k80%L01j07j60J32J32j70j15K06J38l52QL28J7l29K9L03r5j81K3
$$ plain form
2458 -80 122 -43 -184 -60 136 2 -165 11 152 -14 -59 79 -12 -67 35 194 -11 -105 111 158 -36 -159
2480 -159 108 178 -79 -150 134 72 -142 -85 46 -33 -141 20 135 -163 -169 76 68 -196 -129 152 67 -175 -30 189
2504 189 26 -100 -25 155 -5 -27 53 60 -129 -50 176 21 -173 -56 168 -38 -224 -80 194 -51 -181 23
2526 23 87 -83 -154 83 38 -94 8 184 18 -92 23 209 -101 -146 137 145 -143 -67 127 98 -97 -46 147
2549 147 -9 -102 -10 108 -119 -125 105 107 -144 -94 128 73 -200 -116 154 53 -125 31 180 -68 -119 120 161 -104
2573 -104 -45 245 116 -156 -36 194 -19 -221 27 151 -85 -175 100 82 -165 -108 165 9 -199 -23 198
2594 198 -5 -202 99 209 -2 -111 135 180 -60 -10 151 77 -148 -8 208 13 -173 13 155 -76 -211
2615 -211 59 99 -181 -181 120 13 -147 -15 117 -53 -168 38 176 -176 -168 160 177 -152 -123 180 85 -96 -73
2638g3K11p6k09J57Q3k02m9K91q6k23L5L65j83k70J19L32j69k43J39J95o6k19
2660a41K27J3j74P1K16k15k02K35K19k55j83K12K24l24j91K82J65k20j23J88k4
2681@j62J63J14k33m2K59R6l14p4L26J33m06j9K86M9l06N3J87o6j43J83J9k14
2704a11l1L39j45k68R0L21j50l21J75L33k29j92R8K47j83p8J77Ok78J32K88k03
2726A7k27K28K68k61k80K47K80k72k23K64J16k02p6K31j19j53J13J64k42j15K73
2747C1J91l10j58L66R4k95o3K68l8j51Q3J32j67q6J72J04k65p3L35j2l25JL08
2770A42o7k56J16K01j02k42J66J79k15m1K38Nl09J09L12j31l02J03L12j05k33
2791a20J06J60j96j6J51K3k50J20J69j38k51K07K44k41k65K64K16k22j23J60J19
$$ plain form
2638 -73 138 62 -147 10 93 -109 -158 133 47 -176 -141 224 41 -229 -110 222 53 -190 -51 144 78 -141
2660 -141 86 99 -75 -4 212 -3 -205 30 249 -6 -189 23 247 -77 -268 14 179 -41 -164 24 0
2681 0 -162 1 115 -118 -160 99 195 -119 -193 133 266 -140 -159 127 176 -130 -77 110 44 -99 84 103 -111
2704 -111 -142 197 52 -216 -126 195 45 -276 -101 232 3 -189 -91 156 -27 -105 72 78 -200 -68 220 17
2726 17 -210 18 286 25 -255 -8 272 0 -223 41 157 -45 -121 110 -9 -162 -49 115 -127 -242 31
2747 31 222 -88 -246 120 214 -81 -144 124 86 -65 18 150 -17 -103 69 173 -92 -165 170 158 -167 -166 142
2770 142 75 -181 -65 136 34 -208 -42 137 -78 -119 119 124 -185 -76 236 105 -197 -94 218 113 -120
2791 -120 -14 146 -50 -66 85 108 -142 -22 147 9 -242 -35 209 -32 -297 -33 183 -39 -162 -2 117
2812A17k17O4J56j42j28J51J95k21k33L50J53k74j49L01J01k81j34K82m6j54J17
2833HQ6j47q4J95P8k83l0L35M6l68l6L84m0k78l5L31n6j68Q1N7j09n9K25j4k87
2858a68R9L55j77l57J28L30j99k58J23K70j78j40J50J0j20O3K12j64j78J59L30
2879B90k65k43K67K45k50k62K45J74k02r0R5%p1R4J32k36j03K30J64l52r7L00
2901F5J60l67n6K75K1k08JJ83k9j46J33M9k11K7K45P1l85j6L80K1l56j5L44j16
2925G0j74O9J67j23r9J47l6k42J03L09r7l39Q4L65j56k48J39K39r1j90J09J11
2947A17j79K4J76m2k44J58J64j72k29J88K60k91j60K43J25j98n2J89o0o5k6J77
2969A03j41j56K57J43k85j15L05J08k57j52L12O2k81M7J60n4j59J15J04k02p3
$$ plain form
2812 117 -100 -36 120 -22 -150 1 196 -25 -258 92 245 -29 -178 123 224 -57 -191 91 45 -109 8
2833 8 94 -53 -137 58 136 -147 -177 158 204 -164 -200 184 144 -134 -169 162 106 -62 19 76 -33 -92 133 119 -168
2858 -168 -69 286 109 -248 -120 210 11 -247 -124 146 -32 -172 -22 -12 -132 -69 143 -21 -199 -40 290
2879 290 25 -218 49 294 44 -218 27 201 -1 -91 4 4 -67 27 159 -77 -180 50 214 -138 -235 65
2901 65 225 -142 -198 77 98 -110 -109 74 45 -101 32 81 -130 -103 142 213 -172 -188 192 213 -143 -158 186 70
2925 70 -104 -35 132 9 -90 57 21 -221 -118 191 94 -245 -161 204 48 -200 -61 178 87 -103 6 117
2947 117 -62 -38 138 96 -148 10 174 2 -227 -39 221 -70 -230 13 138 -60 -112 77 17 -48 -74 103
2969 103 -38 -194 63 206 -79 -194 111 219 -38 -190 122 184 -97 -50 110 56 -103 12 116 -86 -159
2990a59K80l9k58k0K96Rl32Q6K81r5k09M5J76m8j00J69n5j34K7K41j13k02R8K61
3014B05j13k72R3K84j73j98J32J09q7m9J61q1j58J36J55j88k24J99L58k89k36
3035b36K55K18k31j26J64M9j19qJ31j31r9K14j4j95q8K85J35l39q5L16L3k02j19
3058a92K78l2j85J07O6q0o8K18K8l51K2L76m5l38O2L14k8k63K4J27Qj65J20N4
3082E7j19J4K02j08k65J59K43q9l49J79K34o2k81J60J30j05q8J26m5m3Q8J49k31
3105d4j26K21J92k83j66K72J88l05j28K13Q1j52r4K27o1j43Q4J55k30j34L40L2
3127A39k41o4K38Q4k62QK04j8j10K9L5Mm3Q6o2j45J5K21K2l01N7K44Lk89O5J81
3153A00m5q7M0M6j15kJ16j1k06J47K23k09j74J48K44j29k18J00J63j13o6L9O0
$$ plain form
2990 -159 121 82 -176 -196 100 109 -223 -137 144 49 -160 -115 61 13 -87 82 27 -107 -80 161 48 -154 -56 205
3014 205 92 -180 -87 197 24 -174 -42 67 -20 -69 92 11 -147 -11 144 -44 -268 -69 289 0 -236
3035 -236 19 237 6 -120 44 93 -26 -34 97 -34 -133 81 67 -128 -216 69 204 -135 -220 96 129 -73 -192
3058 -192 86 54 -131 -24 42 -38 -106 112 140 -211 -189 187 142 -196 -134 180 152 -111 -87 40 48 -117 3 57
3082 57 -62 -48 154 46 -219 -60 183 94 -255 -76 158 96 -185 -25 105 0 -88 38 -7 -50 38 187 -44
3105 -44 -170 51 243 -40 -206 66 254 -51 -179 34 115 -37 -131 96 35 -108 -24 131 -99 -233 107 139
3127 139 -102 -166 72 156 -106 -98 106 88 -22 7 42 46 3 89 27 -118 -103 118 140 -161 -104 140 143 -146 -81 100
3153 100 55 -32 8 54 -61 -63 53 42 -164 -17 206 -3 -177 -29 215 86 -132 -32 131 18 -48 -9 51
3176E1r6P8O2j40r3J71J11j60j87K60J69k58j61J59J71j34k9N6n3m8J40N1j92
3199g2n7K72J7k64n6L18j1k01o8J99N0k13KQ9Nr9J28j6j45MK29o1k23R1K20Qk20
3226g4l9K53p0j15O0M6n6j5J05p9j43P6K47j99j68Q3K46j29k48J17J87j13j5j8
3250f1P4K1n3M4l8q8J33J11k33j03K37J24k22o9J70J00j85m4J08Ro6N9m9o1J1
3275g1J31N2k05r4K52P0k39k0J86P6j97rR2nr6J34k8q3OK21r6k08N9K57m8l11
3301a74N1K46Mj87l3J59n8m4M6k1q4Q9J24q9k12J71J71j63j13Q3J99j26j07O0
3325hO9k8k5N3r3q4J53N6j83j05K25J94l25n0J49J37j43o4J09j3qj6K7o4nJ05
3351F3Q0j86o0K02J3k12l8K23O9j64q1J50Jq0M5n0j4MJ41q5j32N1J83j01j38m
$$ plain form
3176 51 -45 33 95 -45 -138 33 144 -16 -203 57 226 -32 -193 -34 137 3 -26 30 -23 -71 69 120 -72
3199 -72 -129 143 160 -104 -160 158 147 -54 -122 77 127 -86 -84 5 10 -89 39 23 -122 -118 111 50 -173 -82 138 146 -74
3226 -74 -113 140 70 -45 15 61 5 -10 95 16 -127 -51 196 -3 -171 -88 158 29 -219 -102 85 -28 -43 -61
3250 -61 13 34 -19 25 -13 -101 32 143 -90 -193 44 168 -54 -123 47 147 -38 -82 26 35 -31 28 -21 -82 -71
3275 -71 60 112 -93 -187 65 135 -104 -124 62 138 -59 -68 24 19 -77 57 29 -54 -48 173 77 -131 -72 185 137 -174
3301 -174 -123 123 127 -60 -93 66 8 -36 10 -11 -95 -6 118 29 -183 -12 159 -4 -117 -34 165 39 -68 -8
3325 -8 61 33 8 61 -32 -116 37 93 -90 -195 30 224 -101 -151 -2 135 -8 -72 37 24 16 0 27 -37 -42 63
3351 63 143 -43 -103 99 112 -100 -138 85 154 -10 -91 59 60 -20 25 -25 -39 -35 106 21 -111 -60 123 22 -116 -120
3377a20K39q0j50RJ61J1j36J11Qr6K5R5m9j92J49J60q3k20J07K09j46p9j1J13
3401C5k3q9M7L1pK2N9j15j07K19N8j48j31J97N1j17j07J92L8p0n5O3p2K4R8j1
3427H2j86L7J05N5k08j9K16Lk07N5R3M1j24N0Ml3J3Q0k4j36R4J41j24j31P4J99
3453A50l6k52L4J66qr3K8%n0N5L5m8j04J53J02j70o9M9J53p1j28O9K9P1q1K3j
3480FlM7J7j15oP3R9j46q3J56J02j18j78J42Q3p3l1J3lk1P4k1r4N6J30k8j73J
3508i4J45L0j42mJ06K2r6KM2K7Qqj1r2L7R0m8j50P1J66o5j34L5J04N1j47m4O0
3536c9nO8Qp4p9J32K9j06l6R6R1o7p2K1J16n1q9K8M1k5K5Oj30L4P6P2j35q8J97
3565D4L4j46j8J55j1p2o5M0L2M3pp4M6oO0mj14NJ56o5j54J9J33j1m7n6Q8j3j5
$$ plain form
3377 -120 119 39 -111 -102 59 70 -66 45 53 -43 -18 77 28 -164 -15 145 62 -158 -51 158 12 -67 -78 35
3401 35 12 -77 -30 1 -6 16 75 -40 -147 72 130 -18 -149 48 99 -18 -125 67 105 35 -20 43 -29 -5 93 82
3427 82 -104 -67 38 93 -115 -134 82 85 -122 -67 26 67 -57 -7 -3 -36 -23 57 33 -103 -9 132 8 -123 -49 150
3453 150 114 -138 -104 62 54 -39 -11 -11 -61 -6 29 -19 -123 30 132 -38 -107 -58 95 24 -104 -35 -6 65 -16 7 6
3480 6 3 50 67 -48 -54 19 118 -28 -111 45 147 29 -149 -7 76 3 -28 -15 -18 -39 35 14 -80 -24 106 78 -95 -94
3508 -94 51 81 -61 -65 41 63 -33 -31 11 38 46 38 27 -65 -28 62 14 -136 -65 101 36 -98 -63 41 92 -55 -99 -39
3536 -39 -44 24 32 -42 -121 11 40 -66 -102 -6 85 18 -54 -33 83 32 -57 -29 12 -13 12 18 -112 -78 -2 70 -65 -153 44
3565 44 78 -68 -86 69 58 -14 -79 -39 -7 36 29 -45 1 -5 55 51 -63 -58 98 33 -121 -102 31 20 -27 -83 5 -8 -23
3594b3K0j2j16J45K7l4q7J32K2m1j05K5R7L2j63L2J31m1l1Ok0k0O9K4q8r4P6R2
3622E5o8j12R8Q3l7q1L2O2l3kK5p8L9J20j4j65M3Q5Pj01qQ3J10j46o5K8N5j5P
3651Gl2k3K3Q7j07o5N6J16p5k8m9O4J58j83MK3Q0l6m1L3o9M3Q9o3r2Q5J06m5j24
3680e8nJ14nn9k0O7On2pKqM6k1M0j31J22K9r3r1J45J13j42n2J6R6l7j3L5l8rJ9
3711Ik4l7KM2K2p4n1J10O2q1l7P0P3j07K5Jq4K2J08o6o4N7O6k8o5OJ59J2j63P
3741b8NL0k7j0M7jK1l2l4j01R2J30o0j35Q5R1J0j58KJ21l4K9j13J14kj6Km0l7
3770d9Q2Rn6n5K6P8m7o3P1j9N0p0o1M6M3N5oj03L2Q7L4j50j3J23M7q1n0L8O2p3
3800a3K6koJ0m8J0k5N0O9o0n5m4J20J8j27J2N0K3jmj3pP5o0j3n2Q4N4n2q0L4R6
$$ plain form
3594 -23 -3 -15 -131 14 41 7 -80 52 74 33 -72 -47 50 82 -81 -49 82 41 10 16 -4 -24 45 69 -19 -113 -37 55
3622 55 -13 -125 -27 56 19 -62 -30 32 -1 -3 22 -56 -17 103 89 -76 -33 52 59 -42 -50 33 143 -3 -68 -40 15 0 7
3651 7 -25 -48 -25 62 -45 -110 -54 62 -13 -41 -90 -26 132 -51 -47 -24 56 20 -21 12 -57 -14 75 12 -80 5 111 66 -58
3680 -58 -63 51 46 -13 -33 34 40 -12 -19 -17 -25 21 0 40 -91 31 60 -33 -124 21 134 -8 -60 -44 52 15 2 37 -1 -10 9
3711 9 -15 -52 -50 -8 14 -60 -111 -1 61 -20 -57 13 86 -21 4 5 -79 -57 51 -15 -79 -22 44 16 -49 -43 116 128 -35 -28
3741 -28 -23 7 -20 -30 17 16 37 5 -29 -130 -38 92 32 -103 -18 73 83 -75 -73 48 14 43 -70 44 42 26 28 -12 -49
3770 -49 33 42 -14 -69 -43 35 -12 -75 -4 -23 27 -43 -104 -58 -15 40 34 -69 -37 50 84 -66 -79 44 91 10 -40 -2 60 -13
3800 -13 13 11 5 15 -33 -23 -48 2 71 11 -44 -88 32 50 -77 -65 -15 8 7 3 -10 -17 58 -2 -15 -67 17 71 19 -61 -27 69
3832F9jj00j4R9n7mn4J0M7N0k4m0l3K5O7o1p1N2J17o4o9jJ19o7m6J5K6P0q3J9
3862dOpL3m2p0L7M4L2q3K0j5M3J6o7mO5N9n0j9l4J7P7k1q0L7R8lp1r6O7J19j05
3894ak1j5P6j5p1N8k8L2j6n1J5N0M4l3o4KO8j8k7k2N5pK2j7o4N0L7k4Pq3N3O1
3926E3nr0L3Q8n3l6l6M0K9k3m7rL8pL3n8L4P2Kp1m2O9K3l8L1k6M8ko5J0%K2K9
3959D6q0K6K0K3j8r1N1K5P3n2j18O5L9k6L7m1K1k3M3n1J3K2N9p1q5R1N7Lq2m0
3989f4P8k1nj3l8J0N8Mk2o7J17N0j47J5Q1K5m5J3j8L7n8K2j3l9R6K4p0j8j8O6
4019D0j4r4P8J5K0m8q0O2Ppl8L1j8L4N1o5k7K8O5J1j19K5N7K5m0l4j5Q4Ql3k2
4050a3K4K6pn8K4N8l6jm9qQ1J1j14K7R0r3M2j0k7L6M5n4j6K6O3k2q1K9kR3r2l
$$ plain form
3832 69 68 -32 -46 53 -4 -8 -62 -52 -5 45 21 -19 -52 -27 40 -21 -92 -40 77 13 -56 -57 62 -5 -51 -36 -10 60 -23 -4
3862 -4 2 -5 28 -14 -84 -47 -3 29 -54 -34 -49 -6 10 -57 -61 4 63 13 -6 -40 -23 54 33 -47 -10 88 85 14 -82 -15 104 -1
3894 -1 -22 -37 39 24 -47 11 -17 15 -1 -52 -37 13 57 24 -40 -38 30 12 -15 -37 18 11 33 16 -48 2 39 15 22 -61 -8 53
3926 53 48 -42 -9 79 26 -10 -46 -6 23 0 -47 -56 -18 -25 8 -50 -16 56 58 -13 -55 14 37 -1 30 4 52 50 -15 -5 -5 17 46
3959 46 -34 -8 12 35 17 -74 -23 2 75 23 -95 -30 9 -17 20 -21 0 -23 20 -31 -18 4 63 -8 -93 -2 55 58 -24 -64
3989 -64 14 -7 -12 -25 -63 -53 5 9 -13 -80 37 87 -60 -45 36 61 16 29 11 48 -10 12 -1 -40 56 80 10 -8 -26 40
4019 40 26 -68 10 25 45 -3 -83 -21 -14 -21 -59 -28 -46 -12 39 -26 -53 -25 40 51 -68 -43 14 39 -1 -35 -50 34 42 9 -13
4050 -13 11 37 30 -28 -4 54 18 17 -32 -40 41 52 -62 -35 55 -38 4 -6 -33 3 48 -6 -22 4 67 45 -36 -7 -9 84 -8 -11
4082a1l3K9O3l4j18O4RP3p2nK3k4N6k4p4P9K6or4R8k2P6q1K2K3n8K7j9M3jj4L2
4114E3j02J1Q0r2j2K5j6J11q5J0j2L5J2m3K8K2m1K7k7K4l6O0Np4LQM0l2M%J2J5
4146A3Om5Q1k3Pn3m0N4K3n5L8m6Q0K2m9p4N2M4o1o4N2PQ3j6n9kQ2K8j26QM9Nj8
4179Cp9M7K9J7j2qk7P1m0kJ8j14P4J5l2J7M0o3M7o5M9K6nkp5N6m2J12m5n3J8J30
4211A05j16j9NN9p4L3p2O8M2Pm7k7K8L4l5n9N1kQ3l1k2k4O2p3l2J1O2K5o5N1o
4242B2p9J31n5n9L9M4m8K4q2J6K3L0qo0M2N9l4n2O5Jkm0j5N0M3p6J6k2M7L0n9
4273iL2pm0L2k3o1Q9N0p3M1j2J1qn2J4L6j7ol3k0K1O0L2n1j5K6pL8l7k7j6R9p9
4306a2n7L6J4N2q5l4P9P8p8o5N3L0pL2m4M1k8L6p9lO0Om9MN6j2Lm7J2pN7m7j9
$$ plain form
4082 -11 -44 -15 48 14 -104 -40 -31 42 -30 -35 -12 -36 20 -4 -78 1 27 21 -73 25 3 79 -2 20 43 -15 12 -7 36 35 21 53
4114 53 -49 -38 42 -50 -62 -37 -53 58 -27 -17 -29 6 18 -25 3 25 -16 11 -16 8 -28 32 37 -37 -34 -26 14 -18 -14 -14 -2 13
4146 13 19 -26 55 32 39 -14 -54 0 23 -32 6 -40 40 62 13 -61 -9 35 -26 -90 -38 -31 52 36 -23 -25 57 85 -41 -33 16 21 3
4179 3 -76 -29 0 17 5 -3 -30 41 1 -1 17 -97 -23 -8 -40 -23 17 -46 1 -64 -15 11 6 4 -71 -15 -57 55 10 -43 -25 105
4211 105 -11 -30 -25 34 -40 -7 -79 -11 31 38 -9 -36 -8 26 -9 -68 -17 -19 64 33 11 -13 49 -24 -56 -45 17 42 -23 28 22
4242 22 -57 74 19 -40 -1 43 -5 19 -63 -47 -24 6 -2 -62 -20 39 5 -47 18 19 17 -23 -38 12 55 -21 -5 -27 20 50 -9
4273 -9 23 16 -24 8 -15 -76 13 63 -10 31 19 30 22 -30 -16 20 3 -3 -36 -56 -35 25 57 6 -9 17 10 48 11 -16 -32 67 -12
4306 -12 -69 -33 -19 33 -52 -86 -7 71 -7 -72 -19 11 4 36 -8 33 5 41 -38 -41 19 25 -24 -20 36 24 27 -20 -8 -15 42 -5 -24
4339b4M7jk9l5M1P1n5l7NJ6qj1M4Nm8N6m0J0K5m1K2jRm9K7L1k3J3p9O3K2qk4r
4373a5j0L1Ml5k0k8N8OLK9rJ0j2k1J9k3jPk0P2n6J9k5J9K1J5k2%oj2l6JK6K9k
4408A6k2k9L0Jm3k9J01l1K0j9l9J04lm9o8J58r7P6r0L5k7M6m0Qn6P7K1Mj22KP1
4439FKJ3o7kP8l1m9k1J7O9l1l6k8J49m1n7L2o2Q7j0Rj5k5P6k9nk4lL1on6l7O0
4472fL9k9K4n9M8J6o2qM9OL9q0M9k0Ml4o0N3J05k7n4l5L9rN1k2k4OlM8p1K4Pj1
4506gl3M1N3Jn0l6K1j2M0k7k7kK9N3l4j7P3j2o3l0O%N4n4m6Q1L1j9rk6J3O2p4
4539b0j3L9m8M1m0j1N6K3j9m0qJ3M2n3L7%k8N6j8j3J4l0J8j5K0k8J0qj9K3J8j1
4571a2P7p8K5J0Nn0j0P5k6j3%l7M4QJ4k6roKK3k5kLJ8k0k4J7J1Lp5J21j3J0n8
$$ plain form
4339 -24 23 22 -7 -42 -1 70 15 -22 -17 -1 -9 -20 24 29 -19 37 -3 7 32 -9 13 12 21 -28 -1 30 7 20 -59 4 26 18 -6 -15
4373 -15 -25 6 10 -25 -45 -73 -15 -9 -6 23 14 24 12 -9 10 -13 -14 -7 -27 45 -11 8 -17 2 23 38 16 16 10 -2 -38 -37 -11 18 16
4408 16 -6 -35 -5 -4 -47 -76 25 -6 14 -5 -44 60 57 8 -60 98 1 77 -13 22 -5 41 1 9 -47 30 51 55 -67 -65 6
4439 6 8 21 -46 -48 30 -1 -50 -71 -54 15 -16 -52 -80 69 28 -29 3 -59 28 18 27 12 -13 63 34 29 5 2 33 27 -29 -66 -6
4472 -6 33 4 28 -31 17 33 -29 -37 12 18 57 -23 26 6 10 -24 -84 -31 74 47 -7 -42 -3 -12 39 17 -7 -1 -4 44 -27 -3 4 -7
4506 -7 -40 1 54 55 5 -31 -10 -22 18 -9 -36 -38 -9 44 10 -7 66 54 -9 -39 -33 -33 21 -33 -79 2 33 14 5 -21 -8 54 -20
4539 -20 -33 6 -42 -1 -41 -52 4 27 8 -32 -40 -27 15 -38 -1 -1 -29 27 9 -4 10 -20 -2 -17 3 -25 -15 -23 -42 -19 -1 -12
4571 -12 65 -13 12 22 27 -23 -33 42 16 3 3 -34 10 18 32 6 -3 -9 -7 16 -9 -11 -8 10 -10 -34 -17 -6 -3 -78 43 30 40 -18
4605a8l3K5pQ3o0LO7l1Po1L0K3k1Nk1Mk1ok1L4MJ6q6P3%j8N8J4n2pL5l9O1r0O
4640d4L0L0l9j2J6N0n9O5Ll2M4o5OjK6m5k1LK4M9k6o9M2L3j8K0J2o7K9M7l3k2
4672b4Q3l1J2q4P1L3r3O5j5MJ1j5j7l7R8k8p5oK7K6L5m2k5j6P1r3P2n1R4o6N6
4703D0l9k4K1m1J04q3O4r2M0J2moN0j0k4K7j5l0%J8l5L1oJ3nk3K5rL0q1R9kn7
4736a2PL4n0L9m3L1k1M4k9K7k0m7O8m8lrN9J9k6k4L6l4qJ4J8k3ON7p5K6jK4l6
4769@Kj3j0K6l3PO1p8K3pqK6J1nl5M6K8j8p1R6o3K7n3J5M3m2l7N2K6Oj0K1o9J2
4803b4J4K1l8L3K6l9K0k9j4l3Q0o5J1qO4n3j7mK3K7j2rKJ6M5l3j9oK9L0p0L0m
4836fJ7Pl7j2M2j5j5J5k2J6oK3Rl0j0J7l1K9l6K8L6J5o1J0K1J1K2m3NN4m6jk5
$$ plain form
4605 -18 -51 -26 -33 50 -10 -7 60 29 36 -25 5 28 7 12 -9 -5 -26 -32 -53 -19 -15 1 -85 -12 -12 -30 28 42 -10 -17 18 -21 40 -50 -44
4640 -44 -14 16 -23 -35 -19 31 -28 37 40 8 52 -13 -7 -8 18 -27 -48 -45 -21 28 2 -67 -25 8 -10 10 22 -45 -16 31 -2 -24
4672 -24 59 28 40 -44 27 60 -33 32 17 21 32 17 0 -37 61 33 -42 -48 -21 5 40 -2 -27 -43 28 -65 7 -44 50 -16 40
4703 40 1 -23 -2 -43 61 -22 42 -50 -10 2 -2 -8 42 32 8 35 20 -10 -10 8 -27 4 -2 11 6 -17 8 -1 29 -52 47 45 -12
4736 -12 -5 29 -21 18 -25 6 -15 29 0 27 7 -40 28 -20 -23 -32 27 46 20 -4 32 -2 -10 4 22 -1 5 62 -13 13 12 36 0
4769 0 2 -11 -21 5 -28 -21 40 -38 -15 -22 -30 -4 7 2 -33 13 41 23 -48 48 -15 12 -41 -26 17 -25 -62 -10 16 22 12 33 -36 -24
4803 -24 -10 11 -27 6 32 -7 13 -16 -30 -63 17 -48 -37 -45 19 -34 -51 -55 -32 -5 -17 -26 -24 -8 37 4 -15 -21 8 38 -32 -2 -6
4836 -6 11 18 -19 -31 11 -4 -19 -4 -26 -10 -16 7 16 -14 -24 -7 -38 -9 -45 -17 19 34 -27 -17 4 15 37 -6 -1 53 7 6 -19
4869a9J4JK8l0j5K7k7QKo4Q0J4K6j20Q8J9p6k6J11m7N7o2K5m4N4M4m5j5Rj8L4
4900C3k5k6N8r5L8Kk3LK8L3qr8N8j5N1oj9K9r2N8k0Q9p7J7J7j4j1j7K3j6J3j3
4932b5QJ2Pn1M7k9K4j0l7M5k9k8K5M7m4MJ7m4L5j5O9l3J4l1k6K4J4kLk7N6Ql5
4965gP9l3Lm4k2M5k8k5Q1l9o1L9K4o1R2p0J9J9p2K9M8k7J3l0OP6j16P9l9L0pl1
4997c0L1l4O8m7jj7K5K0J9p7O5Mn8N0K7n0k4Q4l0m4N0j3K2l7jJ0k9L8L0j8Jrj1
5030A4pl6k5M0j3L3l9K6J6n0k1J6K8km1P4L6n5L9k0k3P4q4pMK1K1J6o2L1kL6m0
5063brQ%Nm1L4k6N0k6Nrj5M0n4N2Qk6j1M8m1l0P2m0J6n8L5L5m5J7J3OL1l9KL7
5098D2n9L1l5rLOk9PP9l8J4Jl0L4n8M4N7k8Ml9K5j1K4j1MRk4ok0j9N0lo6J25o9
$$ plain form
4869 -19 -5 -4 24 -6 -21 6 -21 -13 -11 -75 5 19 45 -75 13 32 -44 -70 41 -6 51 -11 14 -30 24 68 23 8 17 -1 33
4900 33 8 -18 40 -55 -17 -15 -38 -35 -7 26 18 -80 -22 -37 14 8 -11 18 -74 -16 -36 53 -24 -7 10 -4 -15 -32 -9 -25 -12 -25
4932 -25 -17 -5 2 -49 -2 -31 -7 -17 -54 -9 -38 -66 -41 6 -38 -34 -17 -61 -26 -41 28 -5 9 -22 -48 -24 -10 -12 -9 -36 20 28 -7
4965 -7 72 39 42 -2 -24 21 -7 -32 49 10 -51 -12 12 -49 43 -27 -8 11 -61 -32 16 -11 2 -28 -22 54 -62 17 -22 8 1 -30
4997 -30 1 -33 35 -12 -13 -30 -5 15 34 -43 22 26 -32 18 45 -5 -29 55 25 -19 31 18 40 3 2 12 -17 21 51 33 34 25 14
5030 14 7 -29 -54 -14 -27 6 -33 -7 9 -41 -62 -46 -18 -20 -61 13 49 -6 33 13 -10 64 -20 -27 -23 -2 19 35 -27 4 2 38 -2
5063 -2 -11 -3 -3 2 -39 -5 -31 19 -7 -2 -11 -26 14 -40 12 20 -6 -17 31 -10 -40 32 -8 8 -50 -15 20 -25 -8 5 11 42 3 5 42
5098 42 -17 14 -21 -30 -27 -21 -50 -43 36 -2 12 13 -17 17 -41 3 60 32 36 -3 22 11 35 24 28 37 13 7 -13 -32 18 15 -51 74 5
5133EJ2J8n1J3o3R3l1NK4j7n6K1%rK1k6M5rK1rL0n5j9KL7Nm1qN0l3%L7jm9J3K6
5169AM0m8K5nK9l5j7K4om1L1L3J2j7o0M4pj5N3o6NO3o2O1n6J5Lm3O9k0k1N5m4
5202@J4l2MJ5J2m6O5k2j3lK0K3n0N6p9K9m6K3M6K4q1J6PM5j5nm7N6l2K7K4n1J0
5235fm1N1o3J3Q0o6N4p3nL6K0j2K1N6j03j3J4N7k0K4r3R2o2J11k5n5J6qmJ1k3
5266a6j1J9l9K2mJ8j6J0l4N4m7M2L5o7qM6m5oOK3L7j9K6k5LM9rn9Lk9L8j8qK4
5300el6N4j9J6MJ1p5O3l6%m9J19K5o7j9lJ2jJ6J1k5l7j2O3K6p4M6j2M9n0J5Rk3
5333dpmJ4J7L8m4J7k3kK4m2J2j3J7L2k2K1j02Q2K9o2l5O7mMj0NJ2m8M3k9j4JM9
5367A9Kl2J6K4K6n9J1lO4j7j16P2m5RK3M1k7k5rJ6J6mk2M7m1L9p5P1m7J3N8m2
$$ plain form
5133 5 17 35 -16 -3 -66 27 -4 1 25 8 -48 -27 -27 -36 -15 -41 4 -5 16 7 37 -18 -37 -35 2 7 -34 -42 8 -25 -25 12 11 -38 -25 1
5169 1 41 -7 18 13 42 7 -10 14 8 -33 -2 31 43 26 -34 10 3 -12 41 -25 -20 43 -19 42 -14 1 4 -39 30 10 -11 44 0
5202 0 14 -18 -14 1 13 -33 32 10 -3 -6 14 37 -13 43 -36 -7 -53 -30 16 40 -41 -25 -18 27 12 7 -40 16 -16 11 35 -16 -6
5235 -6 -47 4 -59 -46 34 -32 22 -51 -56 -20 0 -12 9 65 -38 -51 -37 20 0 24 -69 23 -39 72 47 -8 8 0 -4 7 -16
5266 -16 -27 -8 -47 -25 -29 -11 -27 -17 -51 3 -44 -2 33 -34 -42 4 -41 -47 -41 -18 19 0 26 1 4 53 44 -15 -12 -41 -3 -21 -29 -5
5300 -5 -41 13 -6 10 14 25 -50 13 -23 -23 -72 47 72 5 -14 -17 -5 -6 10 21 -4 -41 -53 10 36 -38 8 -4 45 -5 10 19 -4
5333 -4 -11 -15 -1 16 54 10 27 4 2 26 -16 -4 -17 0 32 10 31 -71 11 40 -22 -57 10 6 10 0 5 17 -31 12 -17 -31 -30 19
5367 19 21 -11 5 29 55 -4 7 4 68 51 -65 7 -38 -29 -6 35 8 -17 -26 -10 6 2 -20 27 -14 25 -50 21 -26 -13 45 3
5399Ck7L9knK7n3K4mj0j2pK5k2P5o2K1rK2Jlk7L8Nl7l5%N9k9K4K2m7K5L2p9L1
5434Cj4K7nm2K2L1K6q6qN6m8L3n1K0L7J7l4L1%Pj8K6Rl8Ol3L7Q8m3q1L6l4O4o5
5468b4Q8n5rJ3mj7L2p0K0K5M7o1k2J9RK4lJ2jm0j9L1Pk6K2M8l6J0ql3R9o5oK1
5502B8K3r1P9l4nJ9K1Qmm3k5N9jKk9K0m9l0O0Lo7O8l1K4n7P1j0j8J5K1k6N4n7
5535bk5M5k8J7m2N0l0J0M4k4k1j2%k1M2%K0l1M8k7l3K5kJ9k5k2l3P4j8pL8m8j3
5568c2l5O2J7l2PK0Rk3l7N0J5k9L8k4JJ1J6o4J1N8l9J7K0l1l1KjK9J8rn2J7K3
5601Bl8M3l2L3j5L3k6k4Nj0L8lm0L6k8k5K9l1M2J7oK8n2j2K5M0k8Jpl2P1p0O3
5634B7l1K8m6K4L7Kl8m0P0l5oj2pK4qMJ7J5n1mK0L2%l7M2K8o1M0l7J4J1K1n7L1
$$ plain form
5399 3 -24 15 13 8 35 -18 6 2 -8 -20 -27 -2 -24 51 -11 10 1 23 24 21 -6 32 37 0 -35 -35 24 -5 19 41 -6 19 51 -28 3
5434 3 -11 16 11 -31 -9 22 48 -38 -46 10 -38 -5 -56 -36 1 18 -16 15 15 22 4 30 39 1 7 -26 11 99 56 -25 11 -23 41 -24
5468 -24 64 9 0 13 9 -8 24 -46 -26 -1 46 -15 -37 -18 -9 15 12 24 23 -17 -36 -5 2 -24 -2 46 10 20 12 -21 78 13 7 28
5502 28 51 -40 39 5 0 19 40 48 44 1 -24 35 34 36 7 27 -22 -52 8 11 -56 12 -19 5 -52 19 9 -9 6 27 1 55 -2
5535 -2 -27 18 -10 7 -35 15 -15 -5 39 15 -6 -18 -18 -39 3 3 23 -8 40 13 -20 5 3 22 -3 -25 -58 16 -2 -9 29 -19 -32
5568 -32 -67 -5 12 -20 -13 7 16 -7 -44 6 21 -8 30 6 7 18 34 -30 -19 39 0 17 37 6 -25 -23 -24 5 23 14 -38 -21 2
5601 2 -36 7 -25 8 -7 26 0 -24 -19 -29 9 6 -34 2 -26 -51 -22 -53 -11 6 0 28 -24 -36 -11 29 1 2 -5 -37 34 -36 27
5634 27 -4 24 -22 2 39 41 3 -37 33 -2 -8 -20 -27 -3 -11 -7 10 25 -26 -30 -10 22 22 -15 27 55 -6 34 -3 11 22 43 -14 17
5668A7m5J4J3J6rL7%m1%n6J8Q1m4k5P5l4m5N8Mk1nm0M4m0j2L4N4o3Qk5K0mM6r
5702B1q4Q3K0n4Nj0J1J7Rj9L2N%%%n4N0k5J5k5oPk2PK1M4m7mqJ1MRo1N4J1j1M
5739A0nl5j2M6Pk5K1N4r1JN2j1J3j9m0M2J4NPJQm7L7m4J7nj1RO2p8rN5p1P0k3
5774EL3k2j2l2M6j7K9o6N5n7N5Kk6M4j5o4N3K9l9j0K4RLRl9pJ7Mo6j1J04j2j5
5807A1L7m5kpK9l0K0m7j4Q7j1o9M8OJj2L4o2pl3L1M8l4N3ok6NL2m7J0qM2o2Lj3
5842c8P3j8oK3k9l6j1O4n0P5Ql4l0MM1n1K4J6j8k6j4k8J03o2K3P7q8J1kj3LOj7
5875b0RJ9M3l7K2l5M0pj4l5L0K7o5O7n6K7J0k8K7o4P4l1J4l4l7N8J2Lj0PPj9K1
5908B5k4M3l6p1O7m0L4K5k7Pj1j4K8l5J5M9o4K7MOj6mJ3J6k2K3L5j3k1l9K4k1
$$ plain form
5668 17 -28 -14 -1 15 6 43 43 2 2 -54 -36 45 1 -24 51 17 -28 30 34 13 8 -32 12 -28 -40 -6 48 -15 -7 -32 -12 -16 30 21
5702 21 -63 20 40 -14 -9 -19 -8 9 18 -1 31 36 36 36 36 -18 32 7 22 -3 -9 -2 -24 -17 4 48 1 -3 -11 0 4 13 -48 6 17 6 10
5739 10 5 -30 -42 4 11 -14 7 61 -30 -29 23 12 25 6 -34 8 22 27 34 35 43 -4 33 -11 6 1 -10 -1 61 -17 -26 29 -42 28 5
5774 5 38 16 4 -28 18 1 30 -36 19 -38 17 19 -7 37 22 -42 11 40 1 -9 15 24 27 36 -3 -10 7 11 -55 -66 38 26 11
5807 11 48 3 1 -6 23 -7 13 -34 -48 39 28 -41 7 13 14 2 36 -26 -33 -66 -35 13 -21 32 26 0 5 37 -10 0 -8 34 -28 -25 -38
5842 -38 35 17 11 34 5 -31 -42 22 -28 47 55 21 -9 -5 36 -15 9 25 7 -19 -33 -61 42 -20 3 80 -8 3 1 -12 -9 -3 -20
5875 -20 -11 8 51 14 36 1 41 34 20 -15 15 42 -23 44 -12 15 25 -3 24 -40 34 3 17 -17 -54 4 16 19 9 16 23 4 25
5908 25 1 44 8 -63 4 -36 -2 23 -4 3 -8 -22 6 -29 -14 35 -29 -2 2 8 -8 -12 1 17 -5 18 53 40 19 -20 4 -17
5940a7NM0Mr6O9L9k8m0K0K4p0M0N9K4o9K0MJ1o4L2J5r8Q4Opj4jJ9%J1m3O4n6l2
$$ plain form
5940 -17 -12 28 32 -64 5 44 16 -24 -4 20 -50 -10 49 73 4 24 28 39 -25 7 22 -76 8 14 7 -7 -8 11 11 22 -21 43 -13 -45
$$ [...]
8191b
##END NTUPLES=NMR FID
##END=
