##TITLE=1H_LY-DMAA.Per.3.12
 CDCl3
 8 sc, 
 17.02.2022
##JCAMPDX= 6.0         $$ Bruker NMR JCAMP-DX V2.0
##DATA TYPE= NMR FID
##DATA CLASS= NTUPLES
##ORIGIN= UXNMR, Bruker Analytische Messtechnik GmbH
##OWNER= root
$$ XWIN-NMR		Version 3.5
$$ Thu Feb 17 12:31:42 2022 Russian Standard Time (UT+4h)  she@DPX200
##.OBSERVE FREQUENCY= 200.131346
##.OBSERVE NUCLEUS= ^1H
##.DELAY= (6, 6)
##.ACQUISITION MODE= SIMULTANEOUS
##.ACQUISITION SCHEME= undefined
##.AVERAGES= 8
##.DIGITISER RES= 18
##SPECTROMETER/DATA SYSTEM= spect
##.PULSE SEQUENCE= zg30
##.SOLVENT NAME= D2O
##.SHIFT REFERENCE= (INTERNAL, D2O, 0, 15.7039)
##AUDIT TRAIL= $$ (NUMBER, WHEN, WHO, WHERE, WHAT)
$$ ##TITLE= Audit trail, XWIN-NMR		Version 3.5
$$ ##JCAMPDX= 5.01
$$ ##ORIGIN= Bruker BioSpin GmbH
$$ ##OWNER= she
$$ F:/spectra/data/she/nmr/H-F/1/audita.txt
$$ ##AUDIT TRAIL=  $$ (NUMBER, WHEN, WHO, WHERE, WHAT)
(   1,<2022-02-17 12:30:30.34 +0400>,<she>,<DPX200>,
      <created by zg, POWCHK disabled, PULCHK disabled
       configuration hash MD5:
       00 E9 B6 7A A2 85 ED C7 34 08 36 98 17 FE 4E 26
       data hash MD5: 16K
       72 4A 30 9F 2D 4A F6 D0 9F 24 9C 63 77 9C 41 05>)
$$ ##END=
$$ 
$$ hash MD5
$$ 52 67 12 09 F8 B9 B8 B6 05 24 89 C3 21 B8 88 AB
##$RELAX= 
##$RELAX= 
##$RELAX= 
##$RELAX= 
##$RELAX= 
##$RELAX= 
$$ Bruker specific parameters
$$ --------------------------
##$DU= <F:/spectra>
##$EXPNO= 1
##$NAME= <H-F>
##$PROCNO= 1
##$TYPE= <nmr>
##$USER= <she>
##$AMP= (0..31)
100 100 100 100 100 100 100 100 100 100 100 100 100 100 100 100 100 100 
100 100 100 100 100 100 100 100 100 100 100 100 100 100 
##$AQSEQ= 0
##$AQ_mod= 1
##$AUNM= <au_zg>
##$AUTOPOS= <>
##$BF1= 200.13
##$BF2= 200.13
##$BF3= 200.13
##$BF4= 200.13
##$BF5= 200.13
##$BF6= 200.13
##$BF7= 200.13
##$BF8= 200.13
##$BYTORDA= 1
##$CFDGTYP= 0
##$CFRGTYP= 5
##$CHEMSTR= <none>
##$CNST= (0..31)
1 1 145 1 1 1 1 1 1 1 1 1 1 1 1 1 1 1 1 1 1 1 1 1 1 1 1 1 1 1 1 1 
##$CPDPRG= <>
##$CPDPRG1= <>
##$CPDPRG2= <>
##$CPDPRG3= <>
##$CPDPRG4= <mlev>
##$CPDPRG5= <mlev>
##$CPDPRG6= <mlev>
##$CPDPRG7= <mlev>
##$CPDPRG8= <mlev>
##$CPDPRGB= <>
##$CPDPRGT= <>
##$D= (0..31)
0 1.2 0 0 0 0 0 0 0 0.06 0 0.03 0 0 0 0 0.0002 0 0 0 0 0 0 0 0 0 0 0 0 
0 0 0 
##$DATE= 1645086629
##$DBL= (0..7)
120 120 120 120 120 120 120 120 
##$DBP= (0..7)
150 150 150 150 150 150 150 150 
##$DBP07= 0
##$DBPNAM0= <>
##$DBPNAM1= <>
##$DBPNAM2= <>
##$DBPNAM3= <>
##$DBPNAM4= <>
##$DBPNAM5= <>
##$DBPNAM6= <>
##$DBPNAM7= <>
##$DBPOAL= (0..7)
0.5 0.5 0.5 0.5 0.5 0.5 0.5 0.5 
##$DBPOFFS= (0..7)
0 0 0 0 0 0 0 0 
##$DE= 6
##$DECBNUC= <off>
##$DECIM= 32
##$DECNUC= <off>
##$DECSTAT= 4
##$DIGMOD= 1
##$DIGTYP= 9
##$DL= (0..7)
0 120 120 120 120 120 120 120 
##$DP= (0..7)
150 150 150 150 150 150 150 150 
##$DP07= 0
##$DPNAME0= <>
##$DPNAME1= <>
##$DPNAME2= <>
##$DPNAME3= <>
##$DPNAME4= <>
##$DPNAME5= <>
##$DPNAME6= <>
##$DPNAME7= <>
##$DPOAL= (0..7)
0.5 0.5 0.5 0.5 0.5 0.5 0.5 0.5 
##$DPOFFS= (0..7)
0 0 0 0 0 0 0 0 
##$DQDMODE= 0
##$DR= 18
##$DS= 0
##$DSLIST= <SSSSSSSSSSSSSSS>
$$ [...]
##$SUBNAM2= <"">
##$SUBNAM3= <"">
##$SUBNAM4= <"">
##$SUBNAM5= <"">
##$SUBNAM6= <"">
##$SUBNAM7= <"">
##$SUBNAM8= <"">
##$SUBNAM9= <"">
##$SW= 18.0517287032376
##$SWIBOX= (0..15)
0 0 2 0 0 0 0 0 0 0 0 0 0 0 0 0 
##$SW_h= 3612.71676300578
##$TD= 16384
##$TD0= 1
##$TE= 0
##$TE2= 300
##$TE3= 300
##$TEG= 300
##$TL= (0..7)
0 120 120 120 120 120 120 120 
##$TP= (0..7)
150 150 150 150 150 150 150 150 
##$TP07= 0
##$TPNAME0= <>
##$TPNAME1= <>
##$TPNAME2= <>
##$TPNAME3= <>
##$TPNAME4= <>
##$TPNAME5= <>
##$TPNAME6= <>
##$TPNAME7= <>
##$TPOAL= (0..7)
0.5 0.5 0.5 0.5 0.5 0.5 0.5 0.5 
##$TPOFFS= (0..7)
0 0 0 0 0 0 0 0 
##$TUNHIN= 0
##$TUNHOUT= 0
##$TUNXOUT= 0
##$USERA1= <user>
##$USERA2= <user>
##$USERA3= <user>
##$USERA4= <user>
##$USERA5= <user>
##$V9= 5
##$VALIST= <valist>
##$VCLIST= <CCCCCCCCCCCCCCC>
##$VD= 0
##$VDLIST= <DDDDDDDDDDDDDDD>
##$VPLIST= <PPPPPPPPPPPPPPP>
##$VTLIST= <TTTTTTTTTTTTTTT>
##$WBST= 1024
##$WBSW= 4
##$XGAIN= (0..3)
0 0 0 0 
##$XL= 0
##$YL= 0
##$YMAX_a= 550593
##$YMIN_a= -482691
##$ZGOPTNS= <>
##$ZL1= 120
##$ZL2= 120
##$ZL3= 120
##$ZL4= 120
##$ABSF1= 10
##$ABSF2= 0
##$ABSG= 5
##$ABSL= 3
##$ALPHA= 0
##$AQORDER= 0
##$ASSFAC= 0
##$ASSFACI= 0
##$ASSFACX= 0
##$ASSWID= 0
##$AUNMP= <proc_1d>
##$AZFE= 0.1
##$AZFW= 0.1
##$BCFW= 1
##$BC_mod= 2
##$BYTORDP= 1
##$COROFFS= 0
##$CY= 11.3945322036743
##$DATMOD= 1
##$DC= 2
##$DFILT= <>
##$DTYPP= 0
##$F1P= 2.36226072786647
##$F2P= -0.459571619588291
##$FCOR= 0.5
##$FTSIZE= 0
##$FT_mod= 4
##$GAMMA= 1
##$GB= 0.15
##$INTBC= 1
##$INTSCL= 1
##$ISEN= 128
##$LB= 0.24
##$LEV0= 0
##$LPBIN= 0
##$MAXI= 10000
##$MC2= 0
##$MEAN= 0
##$ME_mod= 0
##$MI= 1.114404
##$NCOEF= 0
##$NC_proc= 0
##$NLEV= 6
##$NOISF1= 3.799351
##$NOISF2= 2.8
##$NSP= 1
##$NTH_PI= 0
##$NZP= 0
##$OFFSET= 15.70392
##$PC= 1
##$PHC0= -16395.09
##$PHC1= 20.20078
##$PH_mod= 1
##$PKNL= yes
##$PPARMOD= 0
##$PSCAL= 0
##$PSIGN= 0
##$REVERSE= no
##$SF= 200.130013532006
##$SI= 16384
##$SIGF1= 3
##$SIGF2= 2
##$SINO= 400
##$SIOLD= 16384
##$SREGLST= <1H.CDCl3>
##$SSB= 0
##$STSI= 0
##$STSR= 0
##$SW_p= 3612.71676300578
##$SYMM= 0
##$S_DEV= 0
##$TDeff= 0
##$TDoff= 0
##$TI= <>
##$TILT= no
##$TM1= 0
##$TM2= 0
##$TOPLEV= 0
##$USERP1= <user>
##$USERP2= <user>
##$USERP3= <user>
##$USERP4= <user>
##$USERP5= <user>
##$WDW= 1
##$XDIM= 8192
##$YMAX_p= 0
##$YMIN_p= 0
$$ End of Bruker specific parameters
$$ ---------------------------------
##NTUPLES= NMR FID
##VAR_NAME=  TIME,          FID/REAL,        FID/IMAG
##SYMBOL=    X,             R,               I
##VAR_TYPE=  INDEPENDENT,   DEPENDENT,       DEPENDENT
##VAR_FORM=  AFFN,          ASDF,            ASDF
##VAR_DIM=   8192,          8192,            8192
##UNITS=     SECONDS,       ARBITRARY UNITS, ARBITRARY UNITS
##FACTOR=    0.0002768,     1,               1
##FIRST=     0,             0,               0
##LAST=      2.2672688,     0,               0
##MIN=       0,             -482691,         0
##MAX=       2.2672688,     550593,          0
$$ Real data points
##PAGE= N=1
##DATA TABLE= (X++(R..R)), XYDATA
0@%%%%%%%%%%Qj6J6k4L2m0N0n9P4r0J13j37J61j92K25k64L05l50M07m70N38o14
$$ 0 0 0 0 0 0 0 0 0 0 0 8 -8 8 -16 16 -24 26 -33 41 -49 64 -73 88 -104 121 -143 162 -188 219 -251 287 -327
32c27O99p92Q94j008J136j274J424j590J771j969K187k425K681k960L268l607
$$ -327 372 -420 474 -534 602 -672 752 -838 933 -1036 1151 -1274 1407 -1553 1715 -1892
48a892L977m383M830n319N859o462P138p899Q760r742J0877j2209J3797j5727
$$ -1892 2085 -2298 2532 -2787 3072 -3390 3748 -4151 4609 -5133 5744 -6465 7332 -8395
62h395J8131k1227K5379l1266M0323n6184R1762l09739J15635O86174m28140n31536
$$ -8395 9736 -11491 13888 -17378 22945 -33239 58523 -251216 -135581 550593 122453 -409083
74d09083K05350N04888j05086l13212p7610J56462J72560P4418k81125k55914
$$ -409083 -203733 301155 196069 -117143 -194753 -38291 134269 208687 -72438 -328352
84c28352L07212M44442l21294n55495K71704O28589k15054o14434J24461N49540
$$ -328352 -21140 423302 102008 -453487 -181783 446806 231752 -382682 -258221 291319
94B91319m6895m15763l3149K51442Q3358n7279j16101j29479J16310L01425r8451
$$ 291319 244424 -171339 -204488 46954 130312 73033 -43068 -172547 -56237 245188 146737
105A46737m30999O0897N13990j9365n37683k1836N07787N0906m26646o4142L09599
$$ 146737 -284262 -223365 290625 271260 -266423 -288259 219528 270434 -156212 -220354 89245
116H9245N7398j69245l3280K3643n428J12183N0517k25072r4645L05834J28127
$$ 89245 146643 -22602 -55882 -32239 -37667 74516 125033 -100039 -194684 111150 239277
127B39277l50159j45198L57946J41086l33388j15483K83025P1351k16066j3989
$$ 239277 -110882 -256080 101866 242952 -90436 -205919 77106 148457 -67609 -81598
137h1598J41291m8072o6470J07131j877j54387O0284J84040j06481j91461J40825
$$ -81598 59693 11621 -54849 52282 50405 -103982 -43698 140342 33861 -157600 -16775
148a6775J76006j64161j39821J78126Q7639j84601k6759J84225l5387j77621R0213
$$ -16775 159231 -4930 -144751 33375 121014 -63587 -90346 93879 58492 -119129 -28916
159b8916J63496j31717j41468J55202J09955j59028o8622J44157J7931j13766
$$ -28916 134580 2863 -138605 16597 126552 -32476 -101098 43059 60990 -52776
169e2776M0324P3666j01831k9657J61787j1500k13223M4886K50145o6117k66891
$$ -52776 -12452 61214 -40617 -70274 91513 80013 -133210 -88324 161821 95704 -171187
180a71187P4426K59207p0380k25992N6555J68524l7766r1465J7991J704k397R1266
$$ -171187 -96761 162446 92066 -133926 -77371 91153 53387 -38078 -20087 -18383 -20780 70486
192G0486o177j77939N817K48334L132k94439j8722L10794L7553k94801n4709K48185
$$ 70486 64309 -113630 -107813 140521 143653 -150786 -169508 141286 178839 -115962 -170671 77514
204G7514O6407j75345o8185Q4491N8058J4938l5214j11820J396J95664L9507k57294
$$ 77514 143921 -31424 -99609 -15118 42940 57878 22664 -89156 -87760 107904 147411 -109883
216a09883q2797K90092J21705k91281j50434K60835J63278k03694j57042J26663
$$ -109883 -192680 97412 219117 -72164 -222598 38237 201515 -2179 -159221 -32558
226c2558J30572l9430q5672m7696K6812J25093L9598j84201j05032K19690J61921
$$ -32558 98014 58584 -27088 -74784 -47972 77121 116719 -67482 -172514 47176 209097
237B09097k28771k02294K12436K21163j74183k15284J20336J84880n8311j33311
$$ 209097 -19674 -221968 -9532 211631 37448 -177836 -57500 127380 69069 -64242
247f4242m189O5995N9466R323j02452q4266J28650J50076j37313j99695J29146
$$ -64242 -68431 -2436 57030 66353 -36099 -120365 8285 158361 21048 -178647 -49501
258d9501K27560j07287k30618P5833K09136m0009j65475N442J05207K3955l4870
$$ -49501 178059 70772 -159846 -84013 125123 85114 -80361 -74919 30288 54243 19373
269A9373m4515l7207N5090J03305n5378j56282M7316J90807l3834k04064J8033
$$ 19373 -25142 -62349 -7259 96046 40668 -115614 -68298 122509 88675 -115389 -97356
280i7356J95140l678j66689o885J22755J1240o9266r378J2367K181M1421Q614
$$ -97356 97784 94106 -72583 -79468 43287 54527 -14739 -24117 -11750 -9569 31852 40466
292D0466q6816k0158J19806K9950j37934l5238J41386L4816j30961k7700J09656
$$ 40466 -46350 -66508 53298 83248 -54686 -89924 51462 86278 -44683 -72383 37273
303C7273J4866q0905K476M8596k1877j6325M0267j2919n5469L6960O4359n4746
$$ 37273 52139 -28766 -26290 22306 429 -15896 24371 11452 -44017 -7057 57302 2556
315B556o5865O5574N9051p0572m4654P0487K4221o6818j22O0649k4262n2829M6202
$$ 2556 -63309 2265 61316 -9256 -53910 16577 40798 -26020 -26142 34507 10245 -42584 3618
328C618M4166o2456l4311P1254K3571p1165j1353O2732k564m6803J7993K5500
$$ 3618 47784 -14672 -48983 22271 45842 -25323 -36676 26056 23492 -23311 -5318 20182
340B0182l4205k260N0267k0497o4758L9422P5617n2504q1650N8309Q0692n6326
$$ 20182 -14023 -16283 33984 13487 -51271 -11849 63768 11264 -70386 -12077 68615 12289
352A2289p2441M7549N6535l3456l3784J6505O187J032K4014j6312n3598K7800
$$ 12289 -60152 -12603 43932 10476 -23308 -6803 -616 416 24430 8118 -45480 -17680
364a7680P9574l3606r8769L3645J08697k8110j08010J8449R6035o636p3975n331
$$ -17680 61894 28288 -70481 -36836 71861 43751 -64259 -45810 50225 43589 -30386 -35717
376c5717M3338J5169p782k1439k9177K2674O3405j8996r1166J1045J09295k40
$$ -35717 7621 22790 15008 -6431 -35608 -12934 50471 31475 -59691 -48646 60649 60409
388F0409j15553j1452J09741K2064r2041k9340O5013L2243l1649k9599m120K1817
$$ 60409 -55144 -66596 43145 65209 -26832 -56172 8841 41084 9435 -20164 -24284 -2467
400b467L8287r834o7310m905Q7956K0191r8609l3991R8144M3927q7489m8908O8145
$$ -2467 35820 25986 -41324 -46229 41727 61918 -36691 -70682 27462 71389 -16100 -65008 3137
413C137M7657m2760m0138J4307K7276J3813j0303l8381q493N7262K7261o8657
$$ 3137 50794 8034 -32104 -17797 9479 23292 12989 -25392 -33885 23377 50638 -18019
425a8019m3101P1926N4464o7331n9484N6053N7687l9832m9419K1366L5003k661
$$ -18019 -61120 10806 65270 -2061 -61545 -5492 52195 12363 -37056 -15690 19313 16652
437A6652j6811j4327l388K7498K2858l6279l9534M0092N1266l9307n6979L4817
$$ 16652 -159 -14486 -17874 9624 32482 -3797 -43331 -3239 48027 8720 -48259 -13442
449a3442N6037k7537m8815J9175L6523j0609k0393L087L016K999J4027p295k8457
$$ -13442 42595 15058 -33757 -14582 21941 11332 -9061 -5974 -2958 41 14068 6773 -21684
462b1684R751L9051j0827m4868J0943M5198j0552m0974J0090L2491j0046k1543
$$ -21684 -11933 27118 16291 -28577 -17634 27564 17012 -23962 -13872 18619 8573 -12970
474a2970J0435R040j0985L052J1582j3615j1792K1728J1178k6456r305K8153O107
$$ -12970 -2535 6505 -4480 -1428 10154 -3461 -15253 6475 17653 -8803 -18108 10045 16152
487A6152k6506j490K2598m169j6872J0316J0605j6368m434K1369j077k4535N154
$$ 16152 -10354 -11844 10754 6585 -10287 29 10634 -5734 -10168 11201 10124 -14411 -9257
500i257K5250q026k3374R451J8524r888j1426R554K498q820P038Q137j6134p604
$$ -9257 15993 7967 -15407 -5956 12568 2680 -8746 808 3306 -5514 1524 9661 -6473 -14077
514a4077K3906P499k9222p309L1503P339l0313o832K5699N950j8211m213Q574
$$ -14077 9829 17328 -11894 -19203 12300 19639 -10674 -17506 8193 14143 -4068 -8281 293
527B93J647J912J728j2292n845K1019J0127k7565j4241L0786J7455l0748j9137
$$ 293 1940 3852 5580 -6712 -12557 8462 18589 -8976 -23217 7569 25024 -5724 -24861
540b4861K7114J9111k0609j6863J2033J2653k347o518p130o43J5575Q353k1731
$$ -24861 2253 21364 755 -16108 -4075 8578 6231 -287 -7417 -8060 7515 15868 -5863
553e863j5569K5404K1356k5911k5249K3645K6366j8923k4705J2352K0181n003
$$ -5863 -21432 3972 25328 -583 -25832 -2187 24179 5256 -19449 -7097 13084 8081
565H081j3462k600M977R262M027j4451j2764J7537K0371j8591k5640J7373K8459
$$ 8081 -5381 -7981 -3004 6258 10285 -4166 -16930 607 20978 2387 -23253 -5880 22579
578B2579j4261k8032R992K4752m879j8678j85J0867M694j879q295o993J0189J5104
$$ 22579 8318 -19714 -9722 15030 10151 -8527 -8712 2155 6849 4970 -3325 -10318 -129 14975
592A4975j0823k1492R868K5311p937k6527N284K4728k446k0486k41J4188K360
$$ 14975 4152 -17340 -7472 17839 9902 -16625 -11341 13387 10941 -9545 -9786 4402 6762
605F762o757l579r35L971Q303l468j4305K604J8484j181k0527N9K0313R35j8051
$$ 6762 5 -3574 -4509 -538 7765 4297 -10008 -7404 11080 9899 -10628 -10569 9744 10679 -7372
620g372j459J4116J299r076p66L444l43K013J493o804k900J0522L713j2802m187
$$ -7372 -8831 5285 6584 -2492 -3258 186 -157 1856 3349 -3455 -6355 4167 7880 -4922 -9109
635i109J3666M058j3048l215J1295J821q566J83N533k218k292M259n95n951L148
$$ -9109 4557 8615 -4433 -7648 3647 5468 -3098 -2915 2618 400 -1892 2367 1772 -4179 -1031
650a031O851m930p008O000O265o433m779O065K652n710P4M796k896l870N306K904
$$ -1031 5820 890 -6118 -118 6147 -286 -5065 1000 3652 -2058 -1984 2812 -84 -3954 1352 4256
666D256p150j989Q218J260q243m68P405j93n495R18L087j694q6K455k744l358
$$ 4256 -2894 -4883 3335 4595 -3648 -4116 3289 3096 -2399 -1481 1606 -88 -174 2281 -463 -3821
682c821N515L944p486m560Q572M733q718m826P829M296o092l430L491K096n27
$$ -3821 1694 5638 -1848 -6408 2164 6897 -1821 -6647 1182 5478 -614 -4044 -553 1543 1016
697A016m72k431j331N178L136p170m676Q465N938q624o627P999O723o384o016
$$ 1016 544 -1887 -3218 1960 5096 -2074 -6750 1715 7653 -971 -7598 401 7124 740 -5276
712e276M074M783j435k968j432Q23L876J482o062l770P490N553q149o936P899
$$ -5276 -1202 3581 2146 -822 -2254 -1431 2445 3927 -2135 -5905 1585 7138 -1011 -7947 -48
727d8P474o876p206N074O314k875m622L76K568K119Q7m374k428O134M674p225
$$ -48 7426 550 -6656 -1582 4732 1857 -2765 -2389 179 2298 2385 -1989 -4417 1717 6391 -834
743h34o386P621P409p317p646O252P015m654n757K547L887m56j660j707r94L709
$$ -834 -7220 401 7810 493 -7153 -901 6114 1460 -4297 -1750 2137 1681 21 -1686 -2680 1029
759A029L366n215n347O231O795o562p462O452P484n745o538M602N040l070k966
$$ 1029 4395 -820 -6167 64 6859 297 -7165 -713 6771 1026 -5512 -910 4130 1060 -1906
774a906J445N24L61J797j970m077L278N842m478p015N149P449n568p147N468O063
$$ -1906 -461 63 424 2221 251 -3826 -548 5294 816 -6199 -1050 6399 831 -6316 -848 5215
790E215n032m377M211K362l155M3J980k350n45M502r21n981K277O977l346p336
$$ 5215 183 -4194 17 2379 -776 -733 1247 -1103 -1648 2854 1933 -4048 -1771 5206 1860 -5476
806e476M467O847n299n662N654L992n691k201N419o6m780K092L681l881k379N318
$$ -5476 -1009 5838 539 -5123 531 4523 -1168 -3369 2050 1984 -2796 -704 2977 -904 -3283 2035
822B035O63o131J153O385k978o029M816N205o231l924P357K578p910r89P955o43
$$ 2035 2698 -3433 -2280 4105 1127 -4902 -86 5119 -1112 -5036 2321 4899 -3011 -4000 3955 3312
838C312p129J982N723l210l639L999J042m704J830M909m747m941P336M574r465
$$ 3312 -3817 -1835 3888 678 -2961 1038 2080 -2624 -794 4115 -632 -5573 1763 6337 -3128
853c128m063J0829L305j1166k357J0484J421q712j40O045j091k660K502j126l778
$$ -3128 -7191 3638 6943 -4223 -6580 3904 5325 -3387 -3527 2518 1427 -1233 1269 143 -3635
868c635M913N051q449o038J1078O809j2623p260J2933O975j2054o166R815M729
$$ -3635 1278 6329 -2120 -8158 2920 9729 -2894 -10154 2779 9754 -2300 -8466 1349 6078
882F078o800k610K889K9J343K890n313n850Q814Q664j1289j0855J2663J2257j2683
$$ 6078 -722 -3332 -443 -414 929 3819 -1494 -7344 1470 10134 -1155 -12010 653 12910 227
897B27j2468J1444J1548r050r311N770N907j950j834j893k945N309P678q098j1999
$$ 227 -12241 -797 10751 1701 -7610 -1840 4067 2117 283 -1610 -4555 754 8432 334 -11665
912a1665R872J5149j0427j7081R852J7375q339j5749O071J2574l377p807O18K260
$$ -11665 -1793 13356 2929 -14152 -4300 13075 4736 -11013 -4942 7632 4255 -3552 -2934 -674
926f74J888L801l750r601N014J4539n497j8043N149J9792m334j9596L041J7414
$$ -674 1214 5015 1265 -8336 -3322 11217 5720 -12323 -7174 12618 8284 -11312 -8271 9143
940I143j837j3440N48Q090M06k119q10m242Q03J0040k63j4842l93J8214J134j9507
$$ 9143 7306 -6134 -5586 2504 2910 791 -19 -4261 -3458 6582 6319 -8523 -8916 9298 10432 -9075
956i075j801J8999K203j6668j833J2705J106p693J08K167j801L322L607q318n313
$$ -9075 -10876 8123 10326 -6342 -8175 4530 5636 -2057 -1949 218 -1583 1739 5346 -2972 -8285
971h285J2115O543j4633p220J5696O847j5278n733J3532L792j0809j097P493j828
$$ -8285 3830 10373 -4260 -11480 4216 11063 -4215 -9948 3584 7376 -3433 -4530 2963 1135
985A135l853M822L02p387L057R273n681j0186P737J0107r239q908J0023O609j0149
$$ 1135 -2718 2104 2406 -4981 -1924 7349 1668 -8518 -781 9326 87 -8821 1202 7811 -2338
1000b338l673R734L21q926K938P717o023o179Q294M253r642k012R966m14r178
$$ -2338 -6011 3723 4044 -4882 -1944 5773 -250 -6429 1865 6118 -3524 -5536 4430 4016 -5162
1015e162L015P628n693n277Q293K623j0480Q1J2123k497j2842M325J2596n567
$$ -5162 -2147 5481 -212 -5489 2804 5427 -5053 -4972 7151 4654 -8188 -3863 8733 3166
1029C166j1142O026Q535n858n095N256P66m406L830L356q444k380J2383J684j5310
$$ 3166 -7976 -1950 6585 727 -4368 888 1654 -2752 1078 4434 -4010 -6390 5993 7677 -7633
1044g633j255J6831J157j6681j030J4958R27j1537o68P063K6j573R08m053k298
$$ -7633 -8888 7943 9100 -7581 -8611 6347 7274 -4263 -4931 2132 2158 585 1493 -2560 -4858
1059d858R374L930j3781n704J6580P243j7812q267J6966Q634j4562p986J0505
$$ -4858 4516 8446 -5335 -11039 5541 12784 -5028 -13295 3671 12305 -2257 -10243 262
1072B62O348n522l627K6K61N179L714r603p572J2847J1118j4389j3672J4374J4858
$$ 262 6610 1088 -2539 -2513 -2252 2927 6641 -2962 -10534 2313 13431 -958 -14630 -256 14602
1087A4602j2721j4457R847J2423o134r039K103M330J839Q85n152o319P414J1205
$$ 14602 1881 -12576 -2729 9694 3560 -5479 -3376 954 2793 3678 -1474 -7793 -379 10826
1101A0826q672j5069Q651J7508p692j7975N832J6598l499j3419J229Q885Q15l341
$$ 10826 2154 -12915 -4264 13244 5552 -12423 -6591 10007 6508 -6911 -5682 3203 4018 677
1115F77k325k400L057Q058k981j2704K367J5785j324j7245O2J6804J029j4721
$$ 677 -1648 -4048 -991 7067 4086 -8618 -6251 9534 8210 -9035 -8973 7831 8860 -5861
1129e861j716J0992J789o369j376J348L04L585J157p774k696J0875M215j2629
$$ -5861 -7577 3415 5204 -1165 -2541 -1193 -889 2696 3853 -3921 -6617 4258 8473 -4156
1143d156n168J2966N618j2038n139R957M049p238k091L902j17q67K754k053n107
$$ -4156 -9324 3642 9260 -2778 -7917 2040 6089 -1149 -3240 662 545 -322 2432 379 -4728
1158d728M208O970n753q083O473Q246o538p484N990N859n201l489M236P39l297
$$ -4728 -520 6450 697 -7386 -913 7333 795 -6689 -699 5160 -41 -3530 706 1445 -1852
1173a852K274K465m872j641O853J149q097n56Q307L0p549O32N881j465l758K519
$$ -1852 422 2887 -1985 -3626 3227 4376 -3721 -4277 4030 4060 -3489 -2857 3024 1559 -2199 320
1189C20J203l631J195M678l386n610M868O232n716o292N774N643n030m438L912
$$ 320 1523 -2108 -913 3765 379 -5231 -363 5869 153 -6139 -365 5278 248 -4190 -278
1204b78K606k347k12P54k283O35M833j571p013K148Q471k075r212J651R019j076
$$ -278 2328 -19 -231 523 -1760 -1125 3708 2137 -4876 -2728 5743 3668 -5544 -3893 5126 4050
1220D050p811K42N665M87k981j021j89J005L415o93o165k6Q214J040r364j990
$$ 4050 -3761 -3519 2146 2633 -348 -1369 -1558 -553 2862 2169 -3996 -4022 4192 5232 -4132 -6122
1236f122R440K930q420l440O511L551l840l116R13K131J980n86m626j085O442
$$ -6122 3318 6248 -2172 -5612 899 4450 610 -2506 -1593 538 2518 1932 -2694 -3779 2663
1251B663K855p523m463P516N639o810o148N274N853l171n032J004L457J237j355
$$ 2663 5518 -2005 -6468 1048 6687 -123 -6271 -997 4856 1685 -3347 -2343 1114 2351 996
1266I96l070r29M414L102m873n037M844O361m084o925K854O774j423n862j0M077
$$ 996 -2074 -3003 1411 4513 -360 -5397 -553 5808 1724 -5201 -2347 4427 3004 -2858 -2868 1209
1282A209J373k048k256m08K723K453k551m324K002N652j234o126L38N785O87m876
$$ 1209 2582 534 -1722 -2130 593 3046 495 -3829 -1827 3825 2591 -3535 -3197 2588 3275 -1601
1298a601j438L488J857j664j869j82J608J822q32l249N1M069P73m270j623L942
$$ -1601 -3039 449 2306 642 -1227 -1409 199 2021 1189 -2060 -2009 2060 2833 -1437 -3060 882
1314H82K084l138k372K025K182q07j667n24R07J615k5k241r34K502J858k348k442
$$ 882 2966 -172 -2544 -519 1663 856 -811 -1335 -428 1187 1162 -1079 -2013 489 2347 -1 -2443
1331b443J902K691j112k501K32K059O47j356j169K98J593O54j709j551J450K186
$$ -2443 -541 2150 1038 -1463 -1231 828 1475 119 -1050 -752 841 1495 -214 -1765 -315 1871
1347A871r53k527K94K383M16k062j061J331J555m34j786n21J804J342j432j971
$$ 1871 918 -1609 -1315 1068 1484 -578 -1639 -308 1247 813 -973 -1494 310 1652 220 -1751
1363a751J016K256k49k285l48J944J041j402j489N01J837L69j867j255J659J894
$$ -1751 -735 1521 1272 -1013 -1361 583 1624 222 -1267 -766 1071 1440 -427 -1682 -23 1871
1379A871j330k322P81K431j94k345l03J744P58q99j156J26J345O81j198j532J091
$$ 1871 541 -1781 -1000 1431 1237 -1108 -1411 333 1091 192 -964 -838 507 1188 -10 -1542 -451
1396d51K128p02k495L97K603j18k304j84J797L15j168m45M57L40L38k51j140O6
$$ -451 1677 975 -1520 -1123 1480 1362 -942 -1126 671 986 -182 -627 -170 170 508 257 -883 -817
1414h17J757Q8k218j35K301K92k346k41K236P7j762P9J311k58p07M79N9o64O39
$$ -817 940 1028 -1190 -1325 976 1268 -1078 -1319 917 994 -768 -689 622 364 -343 136 195 -469 170
1433A70Q08j201q16J632P14j972n82K150K50k200J4K061l25j855N92J453q64q76
$$ 170 978 -223 -1039 593 1307 -665 -1247 903 1153 -1047 -1033 1028 703 -1152 -560 893 29 -847
1451h47J053L21j101L30J050q80r73J564P84k055n22K417K82k595M3K491k88k236
$$ -847 206 527 -574 -244 806 -74 -1047 517 1301 -754 -1276 1141 1423 -1172 -1129 1362 1074 -1162
1469a162N95J770q69j197J037L80j167M09J179j209j161J840J067k406r03K719
$$ -1162 -567 1203 334 -863 174 554 -613 -204 975 -234 -1395 445 1512 -894 -1797 922
1485I22P19k794l65K678Mk274M52J721q45r60J146K05j435N49J649j245j701J774
$$ 922 1641 -1153 -1518 1160 1164 -1110 -658 1063 218 -742 404 609 -826 -277 1372 127 -1574 200
1503B00J623k258j371K551R56k701m65K465n4k159O43J695j154j085J530N43j839
$$ 200 1823 -435 -1806 745 1701 -1000 -1465 1000 946 -1213 -570 1125 -29 -1114 416 959 -880
1520h80J72J925q29j809J532J582k045j166K361O53k577k02K730l69k600P83K243
$$ -880 -708 1217 388 -1421 111 1693 -352 -1518 843 1496 -1081 -1283 1447 1078 -1522 -739 1504
1537A504j189j772J513R32j479k30J501p64j303J580J185k346q96L025O28l315
$$ 1504 315 -1457 56 988 -491 -721 780 16 -1287 293 1478 -868 -1764 1261 1889 -1426
1553a426m30L466J43l104L9K596k97j729M64O89p07M13Q74j505j189K561J304
$$ -1426 -1856 1610 1753 -1351 -1312 1284 987 -742 -278 411 -296 117 991 -514 -1703 858 2162
1570B162l227j527L648J577l719j595L424J423k758j010J813O19o97O6n71p15
$$ 2162 -1065 -2592 1056 2633 -1086 -2681 743 2166 -592 -1602 211 830 133 199 -372 -1087
1586a087J690J508k671k106L228K760l567l023L400L029k959k710K116K077j239
$$ -1087 603 2111 -560 -2666 562 3322 -245 -3268 132 3161 202 -2508 -392 1685 446
1601D46j201J81Q7P75J105j581k196K097L251k428l863K379M203k082l990J629
$$ 446 -755 -574 -487 288 1393 -188 -2384 -287 2964 536 -3327 -948 3255 1173 -2817 -1188
1617a188L365r53k437M04J120K10K82o74j644R43K785r73l845R46M263o65m430
$$ -1188 2177 1224 -1213 -809 311 521 803 129 -1515 -572 2213 1240 -2605 -1659 2604 1939 -2491
1634b491M99L917k07l124MK088J0o83o9o85m7J902L53k939m33L521P36l790q69
$$ -2491 -1992 1925 1718 -1406 -1402 686 696 13 -56 -741 -788 1114 1467 -1472 -1905 1616 2352 -1438 -2307
1653b307L655P99l139o07K277L26j363J69K86p54O77J300j500j740K094J994k402
$$ -2307 1348 2147 -992 -1599 678 1004 -359 -190 96 -658 19 1319 -181 -1921 173 2167 -235
1670b35k049K405J844k201j440J998P27j472J37R57r12n43J728R5k259J58K663
$$ -235 -2284 121 1965 -236 -1676 322 1049 -423 -286 671 -241 -784 944 1039 -1220 -1062 1601
1687A601m74k654O30K296o86j870Q61J000r87j18J193r15j288J765J367k312j484
$$ 1601 1127 -1527 -897 1399 713 -1157 -296 704 -283 -401 792 -123 -1411 354 1721 -591 -2075
1704b075K707J452k669j328K422R76j785m95J041q1k38Q88p59j473J348K206j850
$$ -2075 632 2084 -585 -1913 509 1485 -300 -795 246 165 -73 815 56 -1417 -69 2137 287
1721B87k779K093K932j916l048J693K667j200k071O17J052O3L9n44j352J068K352
$$ 287 -2492 -399 2533 617 -2431 -738 1929 729 -1342 -725 327 390 429 -115 -1467 -399 1953
1738A953j179l260J166L929q98m151O68L915k46l251j62K155N10q47p15n92O72
$$ 1953 774 -2486 -1320 2609 1711 -2440 -1772 2143 1897 -1354 -1516 639 1149 302 -413 -1005 -333
1755c33J979n35l164J94M063J34m431n84M373Q77l750j135K743J210j412j129
$$ -333 1646 1111 -2053 -1859 2204 2338 -2093 -2677 1696 2573 -1177 -2312 431 1641 229 -900
1771i00J20P56J225r9k430o01L380J240l908j791L989K124l563k295K861K080
$$ -900 -780 -24 1201 1102 -1328 -1929 1451 2691 -1217 -3008 981 3105 -458 -2753 108 2188
1787B188j911j594O99R54K86M9j364r83K139J805k615k493K906K875k632l103
$$ 2188 277 -1317 -618 336 622 671 -693 -1676 463 2268 -347 -2840 66 2941 309 -2794
1803b794K356K758j745k159J112J272l71k42k94p92P12J878j116k679J284L147
$$ -2794 -438 2320 575 -1584 -472 800 429 187 -107 -899 -187 1691 575 -2104 -820 2327
1819B327j304l282J152L035j020k485Q51J659p13o17N82m18n00J372N15k124m79
$$ 2327 1023 -2259 -1107 1928 908 -1577 -726 933 220 -397 185 -233 -733 639 1154 -970 -1449
1836a449K698M92k893l97K795J37k346J47J742n45j003R37J94j392N18J729j198
$$ -1449 1249 1741 -1152 -1549 1246 1383 -963 -816 926 381 -622 315 509 -883 -365 1364 166
1853A66j922J587J989j860j796J807J470j645r17J490qr83Q38P14j603m26K366
$$ 166 -1756 -169 1820 -40 -1836 -29 1441 -204 -1121 369 361 -622 216 930 -673 -1099 1267
1870A267J05k909J89L053l17k935M18K475m15j797M64Q12o52L57P11j333r54K172
$$ 1267 1372 -1537 -1348 1705 1388 -1547 -1129 1346 931 -866 -402 410 -242 115 826 -507 -1461 711
1888G11J224k980j340L387J341l267j400L024J253k358r24J486M09l91K20o70
$$ 711 1935 -1045 -2385 1002 2343 -924 -2324 700 1953 -405 -1329 157 566 175 395 -275
1904b75r96J724J649k429k257K850K707l023k933K791K904k329k469J552J786
$$ -275 -1271 453 2102 -327 -2584 266 2973 -50 -2983 -192 2712 383 -2086 -534 1252
1919A252p76p54j48l31R00J492j474k602J940L396k015l939J834M200j570l788
$$ 1252 476 -278 -426 -757 143 1635 161 -2441 -501 2895 880 -3059 -1225 2975 1405 -2383
1935b383J034L128n29k039QP01L68P48p22k076P41L233o96m094N17M518k87m462
$$ -2383 -1349 1779 1250 -789 -781 -80 288 1036 314 -1762 -1021 2212 1516 -2578 -2061 2457 2170 -2292
1953b292L2L941K56l021l86J867M18n05k67q95J0K222M05l280p67L934J140m205
$$ -2292 -2260 1681 1937 -1084 -1470 397 815 310 43 -852 -842 1380 1785 -1495 -2262 1672 2812 -1393
1971a393j339L880J438l402j218K411R24j387l59K56m11R38J047j884j748K642
$$ -1393 -2732 1148 2586 -816 -2034 377 1301 -86 -445 -189 -600 338 1385 -499 -2247 395
1987C95K196k899k530L033K498k748k207K289J733j743q46J031o5l74R82k11j939
$$ 395 2591 -308 -2838 195 2693 -55 -2262 27 1760 17 -829 202 137 -237 745 534 -1405
2004a405P45K604j089l000J229L082j355k849J317K350j360j489J177N93j067
$$ -1405 -660 1944 855 -2145 -916 2166 811 -2038 -721 1629 269 -1220 -43 550 -517
2019e17L57J119j375r59K211P92k630o72K808M85k689j82K311k29j692O92R47
$$ -517 -160 959 -416 -1375 836 1628 -1002 -1674 1134 1619 -1070 -1252 1059 830 -862 -170 777
2036G77j256j30J724o12k145J149K439j568k499J785K247j784j776J602J104j282
$$ 777 -479 -609 1115 503 -1642 -493 1946 378 -2121 -336 1911 127 -1649 -47 1057 -225
2052b25k17R14p21n69J740K35k523k6L175j52l386J02L449k37k939P8K289k05
$$ -225 -442 472 -249 -818 922 1157 -1366 -1392 1783 1631 -1755 -1653 1796 1559 -1380 -1302 987 782
2070G82j284K63O6l91J140N48k158q78L041J258l553j503L674J673l419j621K799
$$ 782 -502 -239 -173 -564 576 1124 -1034 -1912 1129 2387 -1166 -2669 1005 2678 -741 -2362 437
2087D37J430j852r69P20L02N02M48j576j291K364K099k906k749L073L130k890
$$ 437 1867 15 -954 -234 68 570 1018 -558 -1849 515 2614 -292 -3041 32 3162 272
2103B72l213K368K942j685k371Q39J421N6k15r12r74J472K248j779l262J941L880
$$ 272 -2941 -573 2369 684 -1687 -848 573 629 414 -498 -1472 0 2248 469 -2793 -852 3028
2120C028j685m202J320M010p64l403K07K458J86j137n76l27P09J769p44k878M08
$$ 3028 1343 -2859 -1539 2471 1707 -1696 -1489 969 1155 18 -558 -885 -176 1593 849 -2029 -1621
2137a621L846k05m187k55M216N51l708q20K896Q73j726p05M08M06Q73O0j933o85
$$ -1621 2225 2020 -2167 -2422 1794 2345 -1363 -2183 713 1586 -140 -845 -437 -31 842 902 -1031 -1716
2155a716K886J170l353j618L473J843l235j781K537J625j785j169Q63M29P1M02
$$ -1716 1170 2340 -1013 -2631 842 2685 -550 -2331 206 1831 46 -1123 -260 169 240 642
2171F42r16j154J506J940j930k441K008K739j895k623J545K321j208j601P53P13
$$ 642 -274 -1428 78 2018 88 -2353 -345 2394 499 -2124 -579 1742 534 -1067 -314 399
2187C99l34K74O2j297J19K028j10k637Q9K940r8k816L8K337l1j703K40P87m04
$$ 399 65 339 401 -896 -777 1251 1141 -1496 -1407 1533 1435 -1381 -1343 994 963 -740 -500 287 -117
2206a17J51O47r44r85J724J271k202j498K405J577k233j531J893J182j332o64
$$ -117 34 681 -263 -1248 476 1747 -455 -1953 452 2029 -204 -1735 158 1340 8 -656
2222f56O36L0k8P02n73j487J021K130j302k644J361K820j068k808Q17K314m17
$$ -656 -20 10 -18 684 111 -1376 -355 1775 473 -2171 -810 2010 942 -1866 -1049 1265 848
2239H48j532L1O35K58M69m29j535M78K459l25l069k6L445K99l376n80K890P56
$$ 848 -684 -653 -18 240 709 280 -1255 -777 1682 1357 -1712 -1738 1707 2006 -1370 -1950 940 1696
2257A696k029q72J008P30J19m16j354K7K264N11k966j036L314J509l169j830K726
$$ 1696 -333 -1205 -197 533 652 236 -1118 -1091 1173 1684 -1282 -2318 996 2505 -664 -2494 232
2274B32K014k023j840J081J395n9o89r99QJ686R49k306j748K422K534k466k796
$$ 232 2246 223 -1617 -536 859 800 111 -888 -880 806 1755 -551 -2299 123 2657 191 -2605
2291b605K014K930j397k721O93K071O2j231o97J43J199J061j461k030J454K755
$$ -2605 -591 2339 942 -1779 -1086 985 1047 -184 -881 -738 461 1522 61 -1969 -515 2240
2307B240j180l273Q51L375m43l029j1K356M40j448p45M06P87O88o93j763M64K507
$$ 2240 1060 -2213 -1362 2013 1570 -1459 -1470 886 1326 -122 -867 -461 326 1014 321 -1442 -978 1529
2325A529r1l036k48L022P24k817r11K309R14j414q26M86N70L84j4j253m74J891
$$ 1529 1438 -1598 -1846 1176 1900 -917 -1828 481 1395 -19 -845 -359 211 595 581 -672 -1146 745
2343G45R16k168j409K268J609j993j687J566J487j047j139N12M51J03K61o08r69
$$ 745 1661 -507 -1916 352 1961 -32 -1719 -153 1334 287 -852 -340 111 214 475 -133 -1102
2360a102Q89J656j065k014R75K224q05k108N46J852l58j145OM48J79L61k08j108
$$ -1102 -213 1443 378 -1636 -661 1563 758 -1350 -804 1048 690 -455 -449 -1 178 539 331 -777
2378g77O0J832J09k323k28K353M55k297n76J814N90j190m58M50J85M01J63j131
$$ -777 -717 1115 1224 -1099 -1327 1026 1481 -816 -1392 422 1012 -178 -636 -186 -1 400 563 -568
2396e68n95J653J124k016j429J971J764j804j789J370J647q37j144J58N91M25
$$ -568 -1163 490 1614 -402 -1831 140 1904 100 -1689 -319 1328 491 -653 -495 96 521
2412E21J41r62q78J220J649j370k335J363K566j006k610O01K332j68j829j61J006
$$ 521 662 -300 -1178 42 1691 321 -2014 -651 1915 909 -1701 -1100 1232 1064 -765 -926 80
2429H0N80n2p65r17Q31J791p38k496M95K837q6k899l48K720N85k123p90J205R09
$$ 80 660 608 -157 -1074 -243 1548 810 -1686 -1191 1646 1560 -1339 -1687 1033 1618 -505 -1295 -90 819
2448H19l37p86o56N08J540q1k191l78K623Q67k711j336K547J595k125j497J334
$$ 819 482 -304 -960 -452 1088 1007 -1184 -1562 1061 1928 -783 -2119 428 2023 -102 -1599 -265
2465b65J372m65r49l68L76J012M08j703r94K006J536k032j984J814K107j384k190
$$ -265 1107 642 -307 -675 -299 713 1121 -582 -1576 430 1966 -66 -2050 -236 1871 487 -1703
2482a703R95J805m19j201j60M86O07L67r41j141J091J805j048k263R31K469o44
$$ -1703 -708 1097 678 -523 -683 -197 410 777 -164 -1305 -214 1591 543 -1720 -789 1680 1036
2499A036k352L32J971q3j376j29N71L51K04l36j034K12J661k8k079k67K280M03
$$ 1036 -1316 -984 987 904 -472 -601 -30 321 525 189 -845 -633 1028 1000 -1079 -1346 934 1337
2517A337k159n70J816O44j310n22P51J56R1J07o12n25J151Q72j454j190J600J373
$$ 1337 -822 -1392 424 1068 -242 -764 -13 143 234 341 -271 -796 355 1227 -227 -1417 183 1556
2535A556j537j445J308J295r84r13N00M19j12K01k82q04N91J272o39j785P32J950
$$ 1556 19 -1426 -118 1177 193 -720 -220 199 87 288 6 -798 -207 1065 426 -1359 -627 1323
2553A323n61j991M22J669j58j198KN98Q7R5o0q47J3J445J06j908l29K094N89k087
$$ 1323 762 -1229 -807 862 704 -494 -492 106 193 288 228 -619 -606 839 945 -963 -1292 802 1391 -696
2573f96o77J752Q03j343p25P71M46Mj58o69k82J282P36j635j153J805J437j671
$$ -696 -1373 379 1182 -161 -886 -115 331 335 177 -492 -774 508 1244 -391 -1544 261 1698 27
2591B7j691J460J674j065j403N84R48N6n17n37k45R21R55j170j605J302K006j131
$$ 27 -1664 -204 1470 405 -998 -414 534 590 73 -464 -709 212 1167 -3 -1608 -306 1700 569
2609E69k271Q22K302m36k106J58J493K72p99m97k6O58Q61o22j640M76K189k12
$$ 569 -1702 -880 1422 986 -1120 -962 531 803 4 -493 -519 139 1000 378 -1262 -786 1403 1191
2627A191k429j14K553K77k186o52J700P36r87p93K75N68N53l68j203r6J841N06
$$ 1191 -1238 -1352 1201 1478 -708 -1360 340 1076 89 -704 -429 139 692 324 -879 -975 866 1372
2645A372k131r52K228J219j958j390J616J303r96j112L33P77K68j80q63m01J250
$$ 1372 -759 -1711 517 1736 -222 -1612 4 1307 311 -801 -468 309 577 397 -466 -867 383
2662C83R92j499j434J447J753j308j847R19J816n83j459J80Q75K25k79n09l20
$$ 383 1375 -124 -1558 -111 1642 334 -1513 -594 1222 639 -820 -640 235 460 181 -328 -648
2679f48N87J074o00j610N67J933l69k030J47J809J53j597k19J000L20l44l17l17
$$ -648 -61 1013 413 -1197 -630 1303 934 -1096 -949 860 1013 -584 -803 197 517 173 -144 -461
2697d61K28Q57M5j364l38J627N88j657q45J643Q69j328q03Q70O40l06m18j56m7
$$ -461 -233 624 669 -695 -1033 594 1182 -475 -1320 323 1192 -136 -939 -69 571 265 -153 -309 -356
2716c56O69N26r82r80J165J289j089j534R72J514p11j344L62R64m8m49k65j40
$$ -356 313 839 -143 -1123 42 1331 242 -1292 -320 1194 483 -861 -499 465 417 -32 -297 -437
2734d37M53O99n03j153L78J607k59j846Q0J805J93j557l64J200M48n75m72q3M22
$$ -437 16 715 212 -941 -563 1044 785 -1061 -981 824 1017 -540 -904 296 744 169 -303 -386 36
2753C6O51j70j221j33J532M68j690q31J684R81j404j126J012J044m83q02r8M21
$$ 36 687 517 -704 -837 695 1163 -527 -1358 326 1307 -97 -1223 -211 833 350 -452 -550 -129
2771a29O62P2j110n39J310J054j312j431J242J589r28j670N15J459n2j080l45
$$ -129 533 605 -505 -1044 266 1320 8 -1423 -181 1408 480 -1190 -675 784 732 -348 -693
2788f93N96O14K5p83p67R40J277q26j722N94J934k37j902j13J687M13j265o66
$$ -693 -97 517 542 -241 -1008 -68 1209 383 -1339 -745 1189 952 -950 -1063 624 1037 -228 -894
2806h94O80P94K6p35p00N41J248k95j597q4J824M38j743p80J484R97j062j105
$$ -894 -214 580 606 -129 -829 -288 960 665 -932 -1016 808 1246 -497 -1277 207 1204 142 -963
2824i63N54R34O6o64o99L78J030J33j325o06J491J027j283j422J144J400p00j289
$$ -963 -409 525 591 -73 -772 -394 636 769 -556 -1162 329 1356 73 -1349 -205 1195 495 -794
2842g94J93J035K62o47o09R0Q97L91r70r26R24J292p03j558M20J560k6j435l13
$$ -794 -601 434 696 49 -560 -470 427 818 -152 -1078 -154 1138 435 -1123 -703 857 831 -604 -917
2861i17J088N18n55o55M2O24N31m88j048L34J354J0j459l18J397O20j178q14Q54
$$ -917 171 689 134 -521 -479 145 676 188 -860 -526 828 838 -621 -939 458 1078 -100 -914 -60
2880f0P65l42p31j76N29O30k50r07k60J227N16j167q70J030J086p72j117L87J040
$$ -60 705 363 -368 -544 -15 615 365 -542 -802 425 941 -226 -1096 -66 1020 248 -869 -482 558
2899E58j7p76l60M52O14N4p98m80P63R28o69j174M31J343j51j355j11J011M99
$$ 558 541 -235 -595 -143 471 525 -273 -753 10 938 269 -905 -474 869 718 -637 -748 263 762
2918G62p04p11L65O51J95o15o56L71J092j66j272k42J434M46j218o93Q83R53m97
$$ 762 58 -653 -288 363 558 -57 -713 -342 750 584 -688 -930 504 950 -268 -961 -78 875 378
2937C78r43O1P59L34m54p62J21J087K54j082p45J105R20q71j084M51J169j49j039
$$ 378 -565 -504 255 589 135 -627 -506 581 835 -247 -992 113 1033 162 -922 -471 698 549 -490
2956d90j97P44N45l25q19l0Q79M95q35r18P78J064l17j328N9J250K22r55n81N98
$$ -490 -687 57 602 277 -542 -572 307 802 -33 -951 -173 891 574 -754 -695 555 777 -178 -759 -161
2976a61Q79k60q69k62P34P22n51j021J87J249Q6j277m04J181O29q33q16M96Q20
$$ -161 718 458 -411 -673 61 783 232 -789 -602 647 733 -544 -948 233 862 29 -787 -291 529
2995E29Rp46l91N17P42j92r72j34J029M67r26q68Q50R03n20r09J22Q45K42o89
$$ 529 538 -208 -599 -82 660 468 -504 -638 391 858 -68 -936 -86 817 297 -612 -490 355 597 -92
3015i2m94L60O60N6q52l67P73P48n80j044M14J042o7r74k46Q62N06o23n86J74
$$ -92 -586 -226 434 490 -362 -729 44 792 212 -832 -418 624 557 -417 -663 199 705 82 -504 -330
3035c30O68K51o50n87M56Q44k56r73l7R89L35q90m95O01O60l38o16o6N57L31k72
$$ -330 338 589 -61 -648 -192 652 396 -577 -614 375 710 -180 -675 -74 586 248 -368 -434 123 454 182
3056A82p57K15Q28J36r29l86P80O68o14p55L19P51Qp12k12M61M86k02o07j35P06
$$ 182 -575 -360 468 604 -325 -711 69 737 123 -632 -313 438 446 -266 -478 -17 469 267 -340 -475 231
3077B31L68o14p10N24P62k10q40n0Q23K86o10m31L18N55J3n73l13M27O10k58q63
$$ 231 599 -15 -725 -201 561 351 -489 -539 284 570 -40 -471 -153 402 415 -158 -471 -44 566 308 -555
3098e55J24Q88N7o81m95P45N42m92n76J17N26K43n23m47L14O25j5p98j37O83N13
$$ -555 -431 457 514 -167 -662 83 625 133 -443 -326 200 443 -80 -527 -213 412 397 -401 -538 145 658
3119F58o48o16M63O53k07o50p8N48L45l99m96J41O69J13o43l67M78O58m42p04
$$ 658 10 -606 -143 510 303 -347 -425 123 468 69 -427 -286 383 496 -147 -514 -36 622 180 -524
3139e24J31P81R5p24k69M59N10k76n20p9N50L23m27n17L08O85j15p25j31O71L40
$$ -524 -393 388 483 -241 -510 -51 459 183 -337 -416 134 457 30 -487 -179 506 391 -334 -465 206 546
3160E46o27l71L96M71j15m78j98L78L88k47o00J02O32J51o31l21N28M93l68n58
$$ 546 -81 -452 -56 415 300 -178 -376 2 390 143 -457 -355 277 428 -203 -524 4 497 129 -429
3180d29J75N42M3m61k64L19M14m9m98j68N13L28l97n02K54O08j31n45r6M42K93
$$ -429 -254 288 331 -130 -394 -75 339 290 -208 -376 137 465 68 -434 -180 428 297 -248 -344 98 391
3201C91m10l38K26L53P4m38k88L48M76j73n69K6N60J61n82j80L67L86k58l42k7
$$ 391 -19 -357 -131 222 296 -142 -430 -82 394 221 -348 -322 238 399 -183 -363 4 390 132 -210 -237
3222b37L81K35m10k36J27M12P1n49k18N61K64l61m64K49M48j11l40o4K14K85j52
$$ -237 144 379 -31 -267 -140 272 343 -206 -424 137 401 40 -424 -175 273 162 -178 -242 -28 257 105
3243A05l86KM61J88m04l21L01M35j87m54LM81J38m38k37K97K70m2l29j27K54K51
$$ 105 -281 -279 182 370 -34 -355 -54 381 194 -260 -257 224 362 -76 -313 -16 254 212 -117 -244 10 261
3265B61k62l65J69M49l7l79j44L85K30k52l07J13L63L6k94k38K26L67j28l98k2
$$ 261 -1 -366 -197 252 215 -164 -308 77 307 55 -252 -139 224 260 -34 -272 -46 321 193 -205 -227
3286b27L78K17m25k90L75L16k00l73RL33M0j06k80P8L55j4k81k20L04L16k44l80
$$ -227 151 368 -57 -347 28 344 144 -229 -220 113 153 47 -233 -155 200 186 -95 -315 -11 305 61 -319
3308c19J16M23j2l56p9K37K50j74k78Q1K62O1k01k62J43L82p3m30L5L38O5k89
$$ -319 -203 220 208 -148 -227 10 260 86 -192 -111 151 212 11 -251 -108 274 201 -229 -194 144 209 -80
3330h0k28K64K40j07j63j10K84P7r8k94Q3L06O2l67j75L82K63k44l33J11L24k3
$$ -80 -308 -44 196 89 -74 -184 100 177 79 -215 -132 174 236 -131 -306 76 339 95 -238 -127 197 174
3352A74k37j60K07K15j06k15j37K96J87k85k43K34L26j69k77j4K87Q8k00j42J26
$$ 174 -63 -223 -16 199 93 -122 -259 37 224 -61 -304 -70 256 87 -190 -204 83 171 -29 -171 -45
3373d5J87N1k55q0J41K78j65l28J27K74O1l43j27K39J49j56j57j7K17N0j22j94
$$ -45 142 193 -62 -142 -1 277 112 -216 -89 185 246 -97 -224 15 164 8 -149 -166 51 101 -21 -215
3395b15J01K32j0k63o2K89J56k46k55J81K90q2j97n8K50Q4j44j85N2J71J28k69
$$ -215 -114 118 108 -155 -217 72 228 -18 -273 -92 198 116 -81 -139 111 195 51 -134 -82 89 217 -52
3417e2j34J38K65j13l00M6K39P0k49o8J28J92j32j81j7K21J48j91j57M8K88m1
$$ -52 -186 -48 217 104 -196 -150 89 159 -90 -158 -30 162 30 -151 -168 53 201 10 -147 -99 189 148
3439A48k20o6J45K13k07k07J48K02J3k34p2J00K27j22j97r4K91J76k25k87K06
$$ 148 -72 -138 7 220 13 -194 -46 156 169 -65 -137 -37 190 68 -129 -223 68 244 19 -268 -62
3460f2L21j64k36J8K17K5j22j52Q7J89Ok18n9J43K19k07j95Q7K59l9k24jJ08J82
$$ -62 259 95 -141 -123 94 119 -3 -155 -68 121 127 -91 -150 -7 212 5 -190 -103 156 117 -107 -108 0 182
3484A82k09q6k4K20R7k25j38J09K12o2k43K3K68M3k49q3J49K22j28j70j3J58J77
$$ 182 -27 -113 -137 83 180 -45 -183 -74 138 76 -167 -144 124 167 -82 -165 -16 206 78 -92 -105 53 230
3507B30j42k27L8J79O6k01j10K10J43j62j72P3J63N0k16j32J59J49l7k18j8K34
$$ 230 88 -139 -101 78 144 -57 -167 43 186 24 -148 -75 88 138 -78 -210 -51 98 61 -157 -175 59
3529E9J03j58k02J66K20p5k62MK30J10k00j17J20P7K2j55p1O0K12j08j70j2K23
$$ 59 162 4 -198 -32 188 113 -149 -145 85 195 -5 -122 -2 75 97 -58 -129 -69 143 35 -135 -147 76
3552G6Q0k20j10J77R9q4k07R8K06L3j60j21O5K49o2k40l5J80J77j81j66Q1K30
$$ 76 156 -64 -174 3 102 18 -189 -91 115 148 -12 -133 -68 181 119 -121 -156 24 201 20 -146 -65 165
3575A65m7k08l1J51J11j16j59N5J84kj35j19J21K16j16k02MK52qj48q0P1J34L8
$$ 165 118 -90 -121 30 141 25 -134 -79 105 103 -32 -151 -30 186 70 -132 -128 124 116 -32 -112 -41 93 131
3599A31j60j02J99N6o8k10N5J98l0j70l5J49J33j74r9P1J37M4j59q3J30J56o1
$$ 131 -29 -131 68 124 56 -154 -99 99 69 -101 -136 13 146 -28 -127 -56 81 125 -34 -117 13 169 108
3622A08j84n6K83k8j41j27J15K05o8k19KK03N5j69j53J45J55k0j91p8J70J68j34
$$ 108 -76 -132 151 123 -18 -145 -30 175 107 -112 -110 93 148 -21 -174 -29 126 106 -85 -163 7 175 41
3645D1k19Q0K22M2k63j18K32R0m0j79j5J94O0k01m0J38K23j57j93J7K04M2j79
$$ 41 -178 -98 124 166 -97 -215 17 107 67 -112 -127 67 127 -74 -114 24 247 90 -103 -86 118 160 -19
3668a9j28J42J38rk61k4J88J16j33j98J20J00O4j82n8J96O2o1j90M1K01L6j94
$$ -19 -147 -5 133 124 -137 -161 27 143 10 -188 -68 32 96 -86 -144 52 114 53 -137 -96 105 141 -53
3691e3m8J49J43j14k00M4J76L9j64j47J59J43n8j97NJ96P7j60r8OK59k6k01j17
$$ -53 -101 48 191 77 -123 -79 97 136 -28 -175 -16 127 69 -128 -123 73 150 -10 -108 -102 157 131 -70 -187
3715a87J86J48j40j50O3J38Q1j90j27J64J76j31j37LK04M8j71j17J14J95j11k16
$$ -187 -1 147 7 -143 -80 58 139 -51 -178 -14 162 31 -106 -103 101 149 -22 -139 -25 170 59 -157
3737a57K3J95J05j84j11Q6J60n2j68j6J22J83j72j33N5J70M9j93m7J31P5q9j56
$$ -157 -134 61 166 -18 -129 -43 117 65 -103 -119 3 186 14 -119 -64 106 155 -38 -85 46 121 32 -124
3760a24L8J97O3k03j53J58K01j22j39o0J35J43j46j73J21J99o4j12j29K17J01
$$ -124 -86 111 174 -29 -182 -24 177 55 -84 -144 -9 134 -12 -185 -64 135 71 -41 -170 47 148
3781A48j13j33M9K09j9k09o7J24J22n6j61J9K05k5j39o2J20J21q0k34P3J97l0
$$ 148 35 -98 -49 160 141 -68 -135 -11 111 55 -106 -87 118 93 -46 -108 12 133 53 -181 -108 89 59
3804E9j01j16J92P4l4j61J9J15R9q6j48j2K48n9j09q7J33J32j28j48J8K02L1j99
$$ 59 -42 -158 34 108 74 -87 -68 47 146 60 -88 -100 148 89 -20 -107 26 158 30 -118 -100 102 133 -66
3828f6q5J47J33j05j31K2J58P2j29j36P7J41q3r7l6J37Q1j07j05O0J83n0j69n5
$$ -66 -151 -4 129 24 -107 -85 73 145 16 -120 -43 98 15 -82 -118 19 100 -7 -112 -52 131 81 -88 -143
3852a43J79O9n8j19K2J63N0k36m0J01J09q1j26Q4Q2J6j26l2R1J06m3j42K0P0J40
$$ -143 36 105 47 -72 -50 113 163 -73 -113 -12 97 16 -110 -26 56 72 -54 -86 5 111 68 -74 -54 16 156
3877A56p2j40L4J28qj79jJ78Q0j87r2N3J11j6r9n7L3J67j02j03QJ76k8p1o6O5
$$ 156 84 -56 -22 106 98 -81 -82 96 176 -11 -103 -50 61 45 -54 -111 -78 89 -13 -116 -108 68 40 -31 -97 -32
3903c2J96j28j25j5J65M1q7r0J03P1k7j19kQ5J13r1j46L8J62p1p4l5N7J13r2q8
$$ -32 164 36 -89 -104 61 102 15 -75 28 99 72 -47 -49 36 149 58 -88 -50 112 41 -33 -68 -11 102 10 -78
3929g8L2O6M1p5n1P1O2m4j01L8J56Pj01o3pJ44q7p3J3N8O8j7j30P6N9mq6k0N2
$$ -78 -46 20 61 -14 -65 6 68 24 -77 -39 117 124 23 -40 -47 97 10 -63 -50 8 76 59 -71 5 64 60 -26 -46 6
3958FR0q5k5l0J16k8j48R3J8N3mj27J6L9J13n0j29J12J9j3o9qR1m2onNJ04l0r3
$$ 6 96 11 -14 -44 72 44 -104 -11 7 60 56 -71 -55 -16 97 47 -82 30 49 36 -33 -41 50 8 2 -3 2 106 76 -17
3988a7n2J19mj11M0%J06n2n6L1M9jq0l9J23K1j3m3k2K4J9Nr3J7R5k7j10K2m0J54
$$ -17 -69 50 46 -65 -25 -25 81 29 -27 4 53 52 -28 -67 56 77 64 21 -1 23 42 47 -46 -29 66 39 -71 -49 -89 65
4018F5p9n1K9K2J1j0p7M7P4j0n4M0L9L2q6n4J5J18q2K7LQ8q7Nl2j7L0RPm6k5O7
$$ 65 -14 -65 -36 -14 -3 -13 -90 -43 31 21 -33 7 46 78 -8 -62 -47 71 -11 16 19 107 20 25 -7 -24 6 15 22 -24 -49 18
4050A8k4o9N9J6M0r6Q8o4M2rj3QK0M3k1p8rR1L6q2k6PJ8JLL7Ko3N8l8M9k4ROp0
$$ 18 -6 -75 -16 0 40 -56 32 -32 10 1 -12 -4 16 59 38 -40 -49 42 78 -4 -30 -23 -5 -4 -1 36 38 -25 33 -5 44 20 29 35 -35
4085c5Q1q6kLJ7j2N6l5J6K5J4k5k0j9P3o8K2RJ9mj7Ok6O2n8MK0j2o2L6j5M9k0
$$ -35 46 -40 -42 -39 -22 -34 22 -13 3 28 42 17 -3 -22 51 -17 5 14 33 29 12 18 -8 54 -4 0 20 8 -54 -18 -33 16 -4
4118dm1K9N5Oo0j8M4L8m6pNLk2K2k0K7L9k7j9rJ0L0k9qj1K2Jn7J8jO3o7k2O2j0
$$ -4 -45 -16 39 45 -15 -33 11 49 3 -4 1 4 -18 4 -16 11 50 23 4 -5 5 35 6 -2 -13 9 10 -47 -29 -30 33 -34 -56 6 -4
4153dl9J1K6J8j6K8Pm8N5L1o9O0o0L1K7r1K2N4l7oKp8R0j2o4O6m7P9m8k4J1K1
$$ -4 -43 -32 -6 12 -4 24 31 -17 38 69 0 60 0 31 58 -33 -11 43 6 0 2 -76 14 2 -62 4 -43 36 -12 -36 -25 -4
4185dk4K5pm2P7n0J4KP2l6m1NL9J6n9nj3J05n9k4j8M8l0L3m5p8J02O3q0k1%M9
$$ -4 -28 -3 -10 -52 25 -25 -11 -9 63 27 -14 -9 30 46 -13 -18 -31 74 15 -9 -27 21 -9 24 -21 -99 3 66 -14 -35 -35 14
4217A4L6o6j9P9k8o0J0PQ3k6o5j8J02qo0k4M9J7J2j5n0J00l5Pj30J00Q9m3j09
$$ 14 50 -16 -35 44 16 -44 -34 -27 56 30 -35 -53 49 41 -19 -43 6 23 35 20 -30 70 35 42 -88 12 101 58 -51
4246e1M5k9P9n4jm8J27Ro9k9R6K4l4j62jJ50Np0n6L2Q2J0j53N9N9L6p2l3M3L7
$$ -51 -6 -35 44 -10 -11 -59 68 77 8 -21 75 99 65 -97 -98 52 57 -13 -69 -37 45 55 -98 -39 20 56 -16 -49 -6 31
4276C1l4poL2L5j8n3j1R6L0n4r4J30Oj08K2L9R4m7o0o1P2L4o2n5J3L3Q1j20k9
$$ 31 -3 -10 -16 16 51 33 -20 -31 65 95 41 -53 77 83 -25 -3 36 130 83 23 -38 34 68 6 -49 -36 -3 78 -42 -71
4306g1J15ol1m8m8N2J57j16n7M6P0Rj01m4J20N7q9p0J3J48n9m0o8N8R3o0q9L8
$$ -71 44 38 7 -41 -89 -37 120 4 -53 -7 63 72 -29 -73 47 104 15 -55 -42 106 47 7 -61 -3 90 30 -59 -21
4334b1J10Jj49L3N6k3M1j44J10O0Jq3qj2N0l7m3l3J30N1j07o1P4J07n7q9k6J47
$$ -21 89 90 -59 -26 30 7 48 -96 14 74 75 -8 -16 -28 22 -15 -58 -91 39 90 -17 -78 -4 103 46 -43 -69 78
4362G8L7j29n0L9J05l8j07J3M3L9m0l8NR3K5p8m4L3O8J1j13N4K2K6l7p8O4R2p3
$$ 78 115 -14 -64 -25 80 42 -65 -52 -9 30 -10 -48 -43 50 75 -3 -47 -14 54 65 -48 6 28 54 17 -61 3 95 22
4391B2p0nQ9K4m1q1l5J55K8j45RJ1O4j8n5oJ53l2j03l1J44J5p6o3k7R8P8j34j3
$$ 22 -48 -53 36 60 19 -62 -97 58 86 -59 -50 -39 25 7 -48 -54 99 67 -36 -67 77 92 16 -47 -74 24 102 -32 -45
4420d5M9J35o0j45oJ07N4j26j2L1K8j4p9J9N9O8r2l6L6R6l9j04JJ19M3n6q7mJ77
$$ -45 4 139 79 -66 -72 35 89 -37 -49 -18 10 -4 -83 -64 -5 63 -29 -65 -29 67 28 -76 -75 44 87 31 -56 -60 117
4449A17nj49k1P9O6j08o4K3R8J5o0q3J39k5K2o9nO2L2p6j9j6J38n3q2m0J07%m3
$$ 117 112 -37 -58 21 87 -21 -85 -62 36 51 -9 -92 47 22 44 -25 -30 32 64 -12 -31 -47 91 38 -44 -84 23 23 -20
4478b0n3M7J09L0j33m9J09M4m7j38N4R5Oq5n6J13P1q9n5l4Q3O0j06k9J11J8o3
$$ -20 -73 -26 83 113 -20 -69 40 84 37 -101 -47 48 54 -31 -87 26 97 8 -47 -81 2 62 -44 -73 38 56 -7
4505gj15M4J38Lq7m4J04M7o2r0%R5M4j47J6J6J24o3q1o2J33N4r3o3M4Q4K6q1o1
$$ -7 -122 -78 60 63 -24 -68 36 83 21 -69 -69 26 70 -77 -61 -45 79 16 -65 -127 6 60 -33 -96 -52 32 58 -23 -84
4534h4J07L9m8m5k8R6Qn3j10J26N6k3j15K9J02L7m9j50O1J48r7j02N4O2P5j30
$$ -84 23 62 14 -31 -59 37 45 -8 -118 8 64 41 -74 -45 57 94 45 -105 -44 104 7 -95 -41 21 96 -34
4560c4o7N9J09l1r6M2J7J15r4r7JJ57K1j14p2P3J11o6j01P1J00l9j02oQ1K7n2
$$ -34 -101 -42 67 36 -60 -18 -1 114 20 -77 -76 81 102 -12 -84 -11 100 34 -67 4 104 65 -37 -43 38 65 13
4587A3m5l8L7P5m7q3O5K0M6r9NJ15K4o4j00L1J05k2l3q1J23M4r2r4PJ46L0j47
$$ 13 -32 -70 -33 42 -5 -88 -23 -3 43 -56 -51 64 88 24 -76 -45 60 38 5 -76 47 91 -1 -95 -88 58 88 -59
4615e9j7P0N0rn7RQ2n3N0j49J18k4K6r8J4J06J8o1q1Q7K3K8j53J5J20Nm7p2M4
$$ -59 -76 -6 44 35 -22 -13 69 16 66 -83 35 11 37 -61 -47 59 77 16 -65 22 45 73 -80 -65 55 60 13 -59 -15
4644a5K4K9q9l5N6R7k2j26O4P8M2j28j1N3O6l7m7l1Q2M2j21L7j8N4J3p3k5M7O9
$$ -15 9 38 -51 -86 -30 67 45 -81 -17 61 103 -25 -36 17 83 46 -1 -32 50 92 -29 8 -10 44 57 -16 -41 6 75
4673G5j20m5J08J5Mo5m5O3M9l6p0k6Q7K8o9J7j0O0Qr3Q8j5N0l6p6P3P8q5p5L4
$$ 75 -45 -90 18 33 37 -28 -73 -10 39 3 -67 -93 -6 22 -47 -30 -40 20 28 -65 23 8 58 22 -54 19 97 12 -63 -29
4703b9O5j4l5m9J17k1n2%m6J29K6j49k1M7O9K5j22N0OL2m5l6L4N8N6n3j06P7P9
$$ -29 36 22 -13 -62 55 34 -18 -18 -64 65 91 -58 -79 -32 37 62 -60 -10 -4 28 -17 -53 -19 39 95 42 -64 13 92
4732I2n1j19L9O7L6o1n2L1O5n6l6MJ05M5n8j09L1J13n5q7RP6J9m3l8J9k8O1k5
$$ 92 41 -78 -39 28 64 3 -49 -18 47 -9 -45 -41 64 109 51 -58 -27 86 31 -56 -47 29 48 5 -33 -14 -42 19 -6
4761fl7P1j6m8j6LN2N0o4p0Q3L9l1q2K4R1M2j24m7Q3M8j9o9n2J43J3pj11M3M9
$$ -6 -43 28 12 -36 -52 -49 3 53 -11 -81 2 41 10 -72 -48 43 85 -39 -86 -3 45 26 -43 -95 48 61 54 -57 -14 35
4791C5k2j6p5J14j3j4p9M7K4R5j21o0R4Q6j01j03Q6L0L6j35J0P3J3L7q3K7M1M0
$$ 35 13 -3 -78 36 23 9 -70 -23 1 96 -25 -85 9 95 -6 -109 -23 7 43 -92 -82 -9 4 41 -42 -15 26 66
4819F6r8k5J04j3rk6n8M8O6j4j10P8J7n7j2o6J44l5L7j34O3J2N1p7L3K3L6j7m6
$$ 66 -32 -57 47 34 25 -1 -59 -11 55 41 -69 9 26 -31 -43 -109 35 0 37 -97 -34 -22 29 -48 -15 8 44 27 -19
4848a9l4J11j9m9l0Q7j9j5n8nJ07m1nq7N2M7No3mM1j1L2j8n7N4RJ8l5O3k8%l3
$$ -19 -53 58 39 -10 -40 47 28 13 -45 -50 57 16 11 -76 -24 23 28 -35 -39 2 -9 23 5 -52 2 11 29 -6 57 29 29 -4
4880dk7P6Jo5M7J9J1m8k6n2J47q0l0KPO2r7J8RN8j0Rn9K6J7JOm4L5L6k7o7Q1n1
$$ -4 -31 45 46 -19 28 47 58 10 -16 -68 79 -1 -31 -29 -22 40 -57 -39 -30 28 18 27 -32 -6 11 12 18 -26 9 45 18 -49 32 -19
4914a9O5n3MM4M7l4q9k8O4J9j9j4k6M8%l5rN2K2k7p4PL8P5r4m9P7oO7j00K9P5
$$ -19 46 -7 -3 41 88 54 -35 -63 1 20 1 -13 -39 9 9 -26 -35 17 39 12 -62 -55 -17 58 -36 -85 -8 -14 53 -47 -18 57
4946E7l2qjk7L0lo2O3j6Om1L7JK5P7j74K3N4NM0o5jM1n5L3o2L6N4m4n3N6O8l4
$$ 57 25 17 16 -11 19 16 -46 17 1 7 -34 3 4 29 106 -68 -45 9 14 54 -11 -12 29 -26 7 -55 -19 35 -9 -62 -6 62 28
4979B8m9L5ql0L8l1nK4K3k1k4k7Q6nk4k6k2O3j1j2K0n1M5q4Q0j9J7J5l9J0j4J1
$$ 28 -21 14 6 -24 14 -17 -22 2 25 4 -20 -47 39 34 10 -16 -38 25 14 2 22 -29 16 -68 12 -7 10 25 -14 -4 -18 -7
5011gj1J3rO6p5N9m5K5j2Kk7L3q1P6kp3J05k3Kj3m6N7jl7pM0kK7k6J4%J8l9L1
$$ -7 -18 -5 -14 52 -23 36 -9 16 4 6 -21 12 -69 7 5 -68 37 14 16 3 -43 14 13 -24 -31 9 7 34 8 22 22 40 1 32
5045C2j7ok2J9KpL0j3k8J5K8r9O7pOQMk6lN0l6ll0L7k2K3O9r7J8RL5p0L0j9N5
$$ 32 15 9 -13 6 8 1 31 18 -10 5 33 -66 1 -6 0 8 12 -14 -17 33 -3 -6 -36 1 -21 2 71 -26 -8 1 36 -34 -4 -23 32
5080C2k5mk3k5O4l3o7J14%m6L8mMmj8j4L1j4jJ2J7K0k0r2L7jN8k9l1J9N5n7lK
$$ 32 7 3 -20 -45 19 -14 -81 33 33 -13 25 21 25 21 3 -11 20 6 5 17 34 54 34 -58 -21 -22 36 7 -24 -5 50 -7 -10 -8
5114hO3j4nn3l4P0l1j0L9n9K7K8r2Q8m3L3Mm0J4J0O4o8j2MP7o2L8l6j6Lk8N7l0
$$ -8 55 41 36 -17 -51 19 -12 -22 17 -42 -15 13 -79 9 -34 -1 3 -37 -23 -13 51 -17 -29 -25 52 -10 28 -8 -24 -21 -49 8 -22
5147b2K9j9J4o1O7K2l8J7m5P6k3j3j7L4j6j5J0K2M5n4M5n7j5K4j9K5n1L7kJ3K
$$ -22 7 -12 2 -59 8 30 -8 9 -36 40 17 4 -13 21 5 -10 0 22 67 13 58 1 -14 10 -9 16 -35 2 0 13 15
5178A5k8M8k9q1O5J5J5l7k0K6K7q3P5m7K8L1J7l7J3Pk8J1j6P1n2j3K4j1J4qm9
$$ 15 -13 35 6 -75 -10 5 20 -17 -37 -11 16 -67 8 -39 -11 20 37 0 13 20 -8 3 -13 58 6 -7 17 6 20 12 -37
5209c7M2j7j3J1L7n0P7o7Onj4K8K1Jm8J8j3L5nJm6P9j5m6M5k5J3k6L7J0j0n9j2
$$ -37 5 -12 -25 -14 23 -27 50 -17 -11 -16 -30 -2 19 20 -28 -10 -23 12 7 8 -38 41 26 -20 25 0 13 -13 24 34 24 -35 -47
5242d7N3Mj5Oq1N6N3k0K2l3PL9%o5M1k1Pj8K8l2llK2rK2k8K8j06J20O1p3o7J6
$$ -47 6 10 -5 1 -80 -24 29 9 31 -2 5 44 44 -21 20 -1 6 -12 16 -16 -19 -22 0 -9 13 -15 13 -93 27 88 15 -52 -36
5275c6N3Jo4rM0K1K1m7J1N4k0mp7P8Rl6qL2P0o1m3K6k1j6M2k4k4O4l5L2n9K3M5
$$ -36 17 18 -46 -55 -15 6 27 -20 -9 45 25 21 -56 22 31 -5 -13 19 89 28 -15 11 -10 -26 16 -8 -32 32 -3 29 -30 -7 38
5308C8L3p8q2Q8J4l1l4K8K8j5n6R3J1k8N3r0L2J2j0L5m9J8O7j6q7M1nmK3J3j0
$$ 38 71 -7 -89 -1 13 -18 -52 -24 4 -11 -67 26 37 9 62 -28 4 16 6 41 -8 10 77 61 -26 15 10 6 29 42 32
5339C2j2j0m7N8j5j4l4m9J18n3Q8m8l0O7n7J3J1l2M9n8M0lm7P2l4ol1O3J8n7Q
$$ 32 20 10 -37 21 6 -8 -42 -91 27 -26 62 14 -16 51 -6 7 18 -14 35 -23 17 14 -33 39 5 -1 -32 31 49 -8 0
5370@PK6Pl0%kJ8j1l4K3K1qn5M0JK2Pj2n5J9K3j0m7P8k4k1ooj9M6K4q4R4M6o6
$$ 0 7 33 40 10 10 8 26 15 -19 4 25 17 -38 2 3 25 32 20 -35 -16 7 -3 -50 28 4 -17 -23 -29 -48 -2 22 -62 32 78 12
5405A2j8j6K4J0J8m8M8rl6K1k2j1M0J6l7lL6j1k8mN3J0m2k8l4J00Mj8kn1K0Rk0
$$ 12 -6 -22 2 12 30 -18 30 21 -15 6 -16 -27 13 29 -8 -11 25 14 -14 -18 35 45 3 -25 -59 41 45 27 25 -26 -6 3 -17
5438a7m3P8K4m4NmM3n4M9p0j2Q2K2j08Q6L5J9p8q1M4Q2r7lJ8R3m4n0j0ORM7l9
$$ -17 -60 18 42 -2 3 -1 42 -12 37 -33 -45 37 59 -49 37 72 91 13 -68 -24 58 -39 -42 -24 69 25 -25 -35 -29 -20 27 -12
5470a2MK1L6q9J7J9K2J0j09P3P2Om2m1K1j1qL3J4Rk6j1k2j9M7j2k9M1j5Qm5k8
$$ -12 -8 13 49 -40 -23 -4 18 28 -81 -8 64 70 28 -13 8 -3 -11 22 36 45 19 8 -14 -33 14 2 -27 14 -1 7 -38 -66
5502f6P5l6N0m5M6%k8L8K2m9Kl3J0j9M0lJ2o9K2O3Jn1j3K4M7k6p8K5N3l1QPj2
$$ -66 9 -27 23 -22 24 24 -4 34 56 7 9 -24 -14 -33 7 4 16 -53 -31 32 33 -18 -31 -7 40 14 -64 -39 14 -17 -9 -2 -14
5535a4K9nK5Qo1K2jj4MK6k0KOp4O2j1j1l2J15n1J9l2LJ8n1J3p%l2J30m5m5M4R2
$$ -14 15 10 35 43 -18 4 3 -11 -7 19 -1 1 7 -67 -5 -16 -27 -59 56 5 24 -8 -5 13 -38 -25 -32 -32 -64 66 21 -24 20 112
5569A12j08j3O8m6K8o3J4O2n7J1o1Q9o9O5o7M0J2j0kq0O0M3k0m0m8N4Q4r1M7n4
$$ 112 4 -9 59 13 41 -22 -8 54 -3 8 -53 36 -33 32 -35 5 17 7 5 -75 -15 28 8 -32 -80 -26 58 -33 14 -40
5599d0J07o7o5Q9j3J8J7p4J4N7J6m8m1L5P3o3r2Q8j1mJ8k8J8j3L8q4NQ4n5JrK1
$$ -40 67 0 -65 24 11 29 46 -28 -14 43 59 11 -30 5 78 15 -77 11 0 -4 14 -14 4 -9 29 -55 -50 34 -21 -20 -29 -8
5631hjm2K4K3l3O9m7%J6J1J0m0pJMM0n3RN0m0om1J33k7l3k1QM7j3m9jOJ2L9n4
$$ -8 -9 -51 -27 -4 -37 32 -15 -15 1 12 22 -18 -25 -24 -20 20 -33 -24 26 -14 -20 -61 72 45 12 -9 -1 46 33 -16 -17 -11 1 40 -14
5666a4j1O8kq1m0J43J2j00NP4q1K7J5r0N0M1np2P0rj1k3K2J6%Mm8ON0p0Q4Ll5
$$ -14 -25 43 41 -40 -80 63 75 -25 -20 54 -27 0 15 -75 -25 16 11 -61 9 0 -11 -34 -12 4 4 8 -40 -34 16 -54 30 33 -2
5699bK7K3p0OJ6OQl2K8L4m5j5J4l5J2N2l5k9QM6k8m0M8l9R1q6J5K9K1o3K2P4r5
$$ -2 25 48 -22 -16 0 6 14 -18 10 44 -1 -16 -2 -37 -25 27 -8 -37 -29 17 -11 -51 -3 -42 49 -37 -22 7 28 -35 -13 61 -34
5732c4L9Rj2j3K0K3j8kpK2pn8N4O7o7j0l7L6n1J5j7J9N4K0k6k4o7J06jj01M7K7
$$ -34 5 14 2 -11 9 32 14 12 5 27 20 -38 16 83 16 6 -31 5 -46 -31 -48 -29 25 45 19 -5 -72 34 33 -68 -21 6
5764FJ7m2L2k0M1j6q1M0MM9k7l5J6M6Jk4j1J3M5o3oP6n6M7k6l9qN1j1q2J09l9
$$ 6 23 -19 13 -7 34 18 -63 -23 -19 30 3 -32 -16 30 31 7 -4 9 54 -9 -15 61 5 52 26 -13 -21 30 19 -63 46 7
5796GM0o5m6R3O5r7l1P7k2k8j3jJ6L1jo5K8nL0k5j8M9L3j25N2K9j4L4k0PRl7M6
$$ 7 47 -18 -64 29 94 -3 -34 43 21 -7 -20 -21 -5 26 25 -40 -12 -17 13 -12 -30 19 52 -73 -21 8 -6 28 8 15 24 -13 33
5829C3km4K5LJ5n6L3Q1l9n8k6R8m6O1r1Mrj8j8j3P3l8J5k9MJ5M4m1oM0j3K0K0
$$ 33 31 -13 12 15 30 -26 7 88 49 -9 -35 63 17 78 -13 -9 -18 -36 -54 -67 6 -32 -17 -46 -42 -27 17 -24 -30 10 -3 17 37
5862C7j1k4J9k3J2J6j0pm4J3P6po1JN2q5L2J4K5k3J6l0nj3L1L5m2j1pK9J1k7N8
$$ 37 26 2 21 -2 10 26 16 9 -35 -22 54 47 -14 -13 39 -46 -14 0 25 2 18 -12 -17 -30 1 36 -6 -17 -24 5 16 -11 47
5895D7k4pm3K4K4J1k4p9M9kO5Nn0lL9Pm5j3L9J3J8p6L3L9o7P5p0%JJ2k2k5N2M1
$$ 47 23 16 -27 -3 21 32 8 -71 -22 -24 41 46 -4 -7 32 39 -6 -19 20 33 51 -25 8 47 -20 55 -15 -15 -14 -2 -24 -49 3 44
5929D4m5k0j2K4J2l6k7R1j2m3L3j0m2Q3m5L2k8J7K7l1L6K0m7l2J1n3Q6J2m3K1
$$ 44 -1 -21 -33 -9 3 -33 -60 31 19 -24 9 -1 -43 40 -5 27 -1 16 43 12 48 68 21 -11 0 -53 33 45 2 23
5959B3ojl7kJO9j2p5k5J10j7o2KQ0p3Jk4P4Qk9Om4MO0J9l0l1N3L5p9j0M7j2j2
$$ 23 17 16 -21 -23 -22 47 35 -40 -65 45 28 -34 -32 48 -25 -24 -48 26 34 5 11 -33 -29 31 50 20 -11 42 77 -2 -12 35 23 11
5993A1qj0J6P2r2rj6O4m0J3n5K8lrqQ8Mm4K9n5j4J2NK2m0N5J9K7l5l8L4k9J6j8
$$ 11 3 -7 9 81 -11 -20 -36 28 -12 1 -54 -26 -29 -38 -46 42 46 2 31 -24 -38 -26 -21 1 -39 16 35 62 27 -11 23 -6 10 -8
6027hP8j14M9l8j9J5K1M1r3J9K6M6o6OM5ok0kJ8J8k3j4N2l9k0J9m2K4J5K1k9O
$$ -8 70 -44 5 -33 -52 -37 -16 25 -68 -49 -23 23 -43 -37 8 2 -18 -20 -2 16 -7 -21 31 -8 -28 -9 -51 -27 -12 9 -20 -14
6059a4O7n0Oj4k2M9k7oOj4nM6m0l5N2L9J9n7jJ2K4k8o6P3l4j0O3Pr4N4K6l7Rk
$$ -14 53 3 9 -5 -27 22 -5 -11 -5 -19 -24 22 -18 -53 -1 38 57 0 -1 11 35 7 -59 14 -20 -30 33 40 -54 0 26 -11 -2 -4
6093djn7L8J0L2q2M2J0J2rmj5J4N8k0k7l4M5j7J2%jK0k6%J8jpj0K4j8k0Lj4N6
$$ -4 -5 -62 -24 -14 18 -64 -22 -12 0 -9 -13 -28 -14 44 24 -3 -37 8 -9 3 3 2 22 -4 -4 14 13 6 -4 20 2 -18 -15 -29 27
6128B7k1K9m9K7PK2o5K7m0K8k5L3rpk9j6N8J0M6qm0k4M8l4K3o4N4L6Jj10k5J16
$$ 27 6 35 -14 13 20 42 -23 4 -36 -8 -33 0 -9 -16 -45 -61 -3 7 53 45 5 -19 29 -5 18 -46 8 44 45 -65 -90 26
6160B6j2KL1Lp1N9m3mQnK4m6J1O3m2l9N3J4k7Qm3M7k9LNL9o2MR6m9j04R6m2J5
$$ 26 14 16 47 50 -21 38 -5 -9 -1 -6 18 -28 -17 46 4 -35 18 32 5 13 -30 17 -12 -9 -4 35 -27 -23 73 24 -80 16 -26 -11
6194a1O4j9L2l5Qm3M5m8J6J9k4K6L9l9j4o8N6j2pN0j8j1l8J5K8l2N7l9Kl1O7n4
$$ -11 53 34 66 31 39 -4 41 -7 9 28 4 30 69 30 16 -52 4 -8 -15 35 17 6 -32 -17 11 -21 36 -3 -1 -32 35 -19
6226a9K8m9N3K1q2M5nJ0k3k9O2J4pJ7o2oR8n2l3O0n2L9j6k5LN4n2QL9n6J7nk5
$$ -19 9 -40 13 34 -48 -3 -8 2 -21 -50 12 26 19 36 -26 -32 66 14 -19 41 -11 28 12 -13 -10 44 -8 0 39 -17 0 -5 -30
6259c0RJ3L1p6pR0m4ql%k0N3j2j7M2j4LqPk8L6j2o1Q3k1ro9O1L7o6K0J9K9%m9
$$ -30 -21 -8 23 -53 -60 30 -14 -22 -25 -25 -45 8 -4 -21 21 7 10 2 9 -19 17 5 -56 27 6 -3 -72 -11 26 -40 -20 -1 28 28 -21
6294b1M3K6o7NoM0kNl8o1J04J4l0l3j4K9Ol5K5j0K6k5j2jL0nm0MM0O5k8q1K0N8
$$ -21 22 48 -19 -14 -20 20 18 23 -15 -76 28 42 12 -21 -35 -6 0 -35 -10 -20 6 -19 -31 -32 -2 -7 -47 -43 -3 62 34 -47 -27 31
6328C1o9L5K0J3r8O5QqK7lj4Jk9K2j1jM2k5L1j9n0kL5K7o3M5j6%J8nk6O8Jq8Q1
$$ 31 -38 -3 17 30 -68 -3 5 -3 24 21 7 8 -21 1 -10 -11 31 6 37 18 -32 -34 1 28 -35 10 -6 -6 12 7 -19 49 50 -38 43
6363D3J3p0K1kJ3k1k7M4M2j2j7j2m4L0RLL7k4ok6M5l4k4K4n7P9k7k5l0J19p5%
$$ 43 56 -14 7 5 18 -3 -30 14 56 44 27 15 -29 1 10 13 50 26 20 -6 39 5 -19 5 -52 27 0 -25 -55 64 -11 -11
6395a1l8L0M3k1J4m2L4K2o3Q3p5N2l5J9k3k7J08q4k4P0j5m4J7k8M9j9L7q4M5J0
$$ -11 -49 -19 24 3 17 -25 9 31 -32 51 -24 28 -7 12 -11 -38 70 -14 -38 32 17 -27 -10 -38 11 -8 29 -55 -10 0
6425@l4J3rk8L6J3o2O0j9J12j66O2L7k9J4m1O5l4QoK4k2L7J2q7j7J04K8j48K7
$$ 0 -34 -21 -30 -58 -22 -9 -71 -11 -30 82 -84 -22 15 -14 0 -41 24 -10 -2 -8 16 -6 31 43 -44 -61 43 71 -77 -50
6455e0P7K5o1J3N0j8q2K9m8R4q2L8k2KL7Rm3l3O7KL4q6R7j7l6j1rN3j6m8L1Nr
$$ -50 27 52 -9 4 54 36 -46 -17 -65 29 -53 -15 -37 -35 2 11 -32 -65 2 4 38 -48 49 32 -4 -15 -24 29 13 -35 -4 1 -8
6488hnJ6J2nOj4qNN4o7m2K8L6o5K7N1k9m1N3j0o9J18q3J3N5l7J1l0K4OK4j4q0
$$ -8 -13 3 15 10 16 2 -6 -1 53 -14 -56 -28 8 -57 -30 21 -8 -49 4 -6 -75 43 -40 -27 28 -9 2 -28 -4 2 26 12 -68
6521f8P5K4m8L2J6k8lKJ0l4Jk1K3M0j3K2p3J2J5P5q6QJ4oj9P0l0nqJ8o2M9J1k6
$$ -68 7 31 -17 15 31 3 0 2 12 -22 -21 -42 -19 21 8 30 -43 -31 -16 59 -27 -19 -5 -11 -30 40 10 5 -3 15 -47 2 13 -13
6555a3J1l5M3j6O4m1Lj8m7m1J44l7l2J1PM4m9J9l3lJ6P0n7j9M0kj2n9O0Pk7k0
$$ -13 -2 -37 6 -10 54 13 16 -2 -49 -90 54 17 -15 -4 3 47 -2 17 -16 -19 -3 67 10 -9 31 29 17 -42 18 25 -2 -22
6587b2RL6n5OL%j2N0kl8K2K0m5J8rM3L6o6l0N1Kj8j6jK2J5j4k6K1N7j6q1N7nK
$$ -22 -13 23 -32 -26 -23 -23 -35 15 13 -25 -3 17 -28 -10 -19 24 60 -6 -36 15 17 -1 -17 -18 4 19 5 -21 0 57 41 -40 17 12 14
6622A4n7J7M5k7%j9M8Ql6kJ0Mm3k1J8K5JM8r2M0L8Jp9O2K6m8Pj2N5kp1J0O0j1
$$ 14 -43 -26 19 -8 -8 -27 21 29 -7 -9 1 5 -38 -59 -41 -16 -15 33 -59 -19 19 20 -59 3 29 -19 -12 -24 31 29 -42 -32 28 17
6656A7j2L2n7j5N5J1l6q2J40k6n3k3O7k2o0O7N3q4pQ7m0j3n2Q6n1L2J2j6J5o3
$$ 17 5 37 -20 -35 20 31 -5 -87 53 27 -26 -49 18 -4 -64 3 56 -28 -35 52 12 -1 -53 33 -18 14 26 10 25 -38
6686c8M6K5r1K9K9j7j7L6J9k7l5K0O2p5M9N1p2l4O7k7J6Mj8J0L7l2K1m8lK0Q8
$$ -38 8 33 -58 -29 0 -17 -34 2 21 -6 -41 -21 41 -34 15 66 -6 -40 27 0 16 20 2 12 49 17 38 -10 -13 7 95
6717I5q4j1Mkk5K2l6jK9K0On7k8N0L4m5lQ1n3k4j1O4nk4M6j6l2K3m3M2n9R1j3
$$ 95 11 0 4 2 -23 -1 -37 -38 -9 11 17 -40 -68 -18 16 -29 -32 49 -4 -28 -39 25 20 -4 42 26 -6 17 -26 16 -43 48 35
6750C5l1l8L3j2l1M4oJ1QQKJ0l7M3j0K0k9J2m5J0K4j7j7m9R2Qk9N0k9NJN0p5K3
$$ 35 4 -34 -1 -13 -44 0 -6 5 13 21 23 33 -4 39 29 49 20 32 -13 -3 21 4 -13 -62 30 38 9 59 30 35 36 86 11 34
6784C4k3j3j5J3LL5o2o0J18J4l0k1J7olpj0j5P5m1l9%K9M8m1J4J4j5N9j13K2P9
$$ 34 11 -2 -17 -4 -1 34 -28 -88 30 44 14 -7 10 4 1 -6 -16 -31 44 3 -36 -36 -7 41 0 14 28 13 72 -41 -19 60
6816F0o7oPjJ7l4K1K4pm0N0%k4Ol5kM3K7j2q7M8M7j5o9K8RL3J2n3j5J5J7RJ9l5
$$ 60 -7 -13 -6 -7 10 -24 -3 21 14 -26 24 24 0 6 -29 -31 12 39 27 -60 -12 35 20 -49 -21 -12 21 33 -20 -35 -20 -3 6 25 -10
6851a0K1jk2j8M4m4l9P7J5K4m6K0j4n7K0M3l1QN2k6l6LL7l0l2K6J8M1r8M7K5l8
$$ -10 11 10 -12 -30 14 -30 -69 8 23 47 1 21 7 -50 -30 13 -18 -10 42 16 -20 -17 20 -10 -42 -16 2 43 -55 -8 17 -21
6883b1j6N7j0n7L1P6n6p7O3PJ0k2K3j0pL5l1pm3P2M2o1l4L7rk3MJ8L7Jl9N2p9
$$ -21 -37 20 10 -47 -16 60 4 -73 -10 -3 7 -15 8 -2 -9 26 -5 -12 -55 17 59 -2 -36 1 -8 -31 -27 -9 28 29 -10 42 -37
6916c7L9P7n7k5K1J2J2j32J01J5kr3P8J9l1j7j5K7LqL3j0j0O0n9p2P0J9L5o6m
$$ -37 2 79 22 -3 18 30 42 -90 11 26 24 -69 9 28 -3 -20 -35 -8 -5 -13 20 10 0 60 1 -71 -1 18 53 -13 -17
6947a7P8po3nP2n8m3R4j3j38R2M2n4k1M0L3m6l4P8j5k5lM5L5n2Qn8O6k9RJ4J7
$$ -17 61 54 -9 -14 58 0 -43 51 38 -100 -8 34 -20 -41 -1 32 -14 -48 30 15 -10 -13 32 67 15 23 -35 31 2 11 25 42
6979D2J7p7nJ4M3k7m7jM1K8l8m1N7O3l7qKo0RK8J4k3KJ9m4J4L1j7L2n6M5l1j8
$$ 42 59 -18 -23 -9 34 7 -40 -41 0 28 -10 -51 6 69 32 24 26 -34 -25 3 17 -6 -4 15 -29 -15 16 -1 31 -25 20 -11 -29
7012b9k1O5o7Q2l6l6R1m2M1r5J2P0j8lk0JL4l1j9K3j9J9J0Qm7L8k9L7j7nK8q1
$$ -29 -50 15 -52 30 -6 -42 49 7 48 -47 -35 35 17 14 -6 -5 29 -2 -21 2 -17 2 12 20 -27 11 -18 19 2 -3 25 -56
7044e6M5m2J01p7mN3oK0l7JLQo6O8pJ0m6O7n0JJ9q%k0O6l3L2l7L3n1ON0q1N9q
$$ -56 -11 -53 48 -29 -33 20 14 34 -3 -2 1 9 -57 11 4 14 -32 35 -15 -14 5 -3 -3 -23 43 10 42 5 38 -13 -7 43 -38 21 13
7079A3j3K6n6M5J6n2j7O7Pl6l3O8o5l9O3M9k1j5j7K0J8j1mk6N7n7KPl9O4k6k0
$$ 13 0 26 -30 15 31 -21 -38 29 36 0 -33 35 -30 -69 -6 43 22 7 -10 10 28 17 13 -13 44 -13 -11 -4 -43 21 -5 -25
7111b5J7P2j6q2J2O3%j6j1jm9Q7m1j6N2n1j2O6m5P2r3k7P2rlqj3l8J7OJ6K2p4
$$ -25 -8 64 48 -34 -22 41 41 25 14 13 -36 51 10 -6 46 -5 -17 49 4 76 -17 -44 28 19 16 8 -5 -43 -26 -20 -4 18 -56
7144e6K1KK4l0j8P0l4KNO4j17M7K3L1l8l6M7J7m1L0l3L2J5k9lK6j2M5L5j25Q4
$$ -56 -35 -33 -9 -39 -57 13 -21 -19 -14 50 -67 -20 3 34 -4 -40 7 24 -17 13 -20 12 27 -2 -5 21 9 54 89 -36 48
7175D8k1o0J4Q0n2j4j0qM3k4K8m3lP0m4lJ0j7J2K4n3O2p3l2M6L7m7L8J4rJ3p3
$$ 48 27 -33 -19 61 9 -5 -15 -23 20 -4 24 -19 -22 48 4 1 11 -6 6 30 -23 39 -34 -66 -20 17 -30 8 22 13 26 -47
7207d7k2N3j1k3P0j5rj3K5m1l4P4l9K9k8L2j18Q1NJ9RpJ8m1k0N0MM4L0o4J1J1
$$ -47 -69 -16 -27 -50 20 5 -4 -17 8 -33 -67 7 -32 -3 -31 1 -117 -36 -31 -12 -3 -10 8 -33 -53 -3 1 45 75 11 22 33
7239C3J8j13M6M3m1J1J0l2M6j5nm4O5Pj09J27m4ql8J5O6n3LK1l5J5k0J16p7j8
$$ 33 51 -62 -16 27 -14 -3 7 -25 21 6 1 -43 22 29 -80 47 3 -5 -43 -28 38 -15 -12 9 -26 -11 -31 85 8 -10
7269a0K0j5lM7k8J8j8k7Q6n8QL8r7N3ol1M6m1P2o3%L4o7N7k4n4R0m2L8l7l8M3
$$ -10 10 -5 -8 39 11 29 11 -16 70 12 20 58 -39 14 8 -23 23 -18 54 -9 -9 25 -42 15 -9 -63 27 -15 23 -14 -52 -9
7301ij9mL8k8mP8%p3%M9j1m1M1l8MK5M3l6k8L4m8K9mkM8l6J7j2Jj7L8n6J8L3p
$$ -9 -28 -32 6 -22 -26 52 52 -21 -21 28 17 -24 17 -21 -17 8 51 15 -13 21 -27 2 -2 -4 44 8 25 13 14 -3 35 -21 -3 30 23
7336B3m1mN1p4qM9l0N9n5%J1M6m0JL0kK9o3Nl8K1N6K0l9K3j4L2m9M6p5L4L3Pl7
$$ 23 -18 -22 29 -45 -53 -4 -34 25 -30 -30 -19 27 -13 -12 18 16 45 -18 -13 -51 -30 26 46 7 30 16 48 -1 45 -30 4 37 44 7
7370GLpj0K9j4n4N3m9J2%rKM4l6N2k7J2l3O6l6k3N8o5M2j2Pj1PK4J6j2Mk4p8J
$$ 7 10 3 -7 22 8 -46 7 -42 -30 -30 -39 -37 7 -29 23 -4 8 -25 41 5 -18 40 -25 17 5 12 1 8 32 48 36 40 16 -62 -61
7405f1P7p1Q8p0K5K8k8NL6p6k4N3jk6K7J3o9P0K9o5M7J1Kk7j8L4nl6M8jQk9n7
$$ -61 16 -55 33 -37 -12 16 -12 -7 29 -47 -71 -18 -19 -45 -18 -5 -74 -4 25 -40 7 18 20 -7 -25 9 4 -32 16 15 23 -6 -63
7438f3N6M6Om5j1Nk1j1K5j9M3J4j2l1J5j1KJ9OK3m0M9k4o5R7q1J3K5N0o5K5l2
$$ -63 -7 39 45 0 -11 -6 -27 -38 -13 -32 11 25 13 -18 -3 -14 -12 7 13 36 -4 45 21 -44 53 -28 -15 10 60 -5 20 -12
7470a2J5L2n4K5K9o7N7l9k0%L1J1KK6k8J3J5n3k3Q3rj4j8M9j5o1L2Rl3L6l6L9
$$ -12 3 35 -19 6 35 -32 25 -14 -34 -34 -3 8 10 36 8 21 36 -17 -40 43 34 20 2 51 36 -25 7 16 -17 19 -17 22
7502B2j3j6L0l7j5M1ml9LKJ0kM0j2k1M7mn2O0Km9K2o5rJ2L2nL3mL1o0M0MJ6qk
$$ 22 9 -7 23 -14 -29 12 8 -31 -28 -26 -16 -18 22 10 -11 36 32 -20 40 42 -7 15 -50 -59 -47 -15 -20 13 9 40 -20 20 24 40 32 30
7538C0o2K4K3l3J9qK8j6j5ol1L2L3m7j7KO9l2M5o9Q4p7j6J6O3l2pll4LK2mk5O6
$$ 30 -32 -8 15 -18 1 -7 21 5 -10 -16 -47 -15 18 -29 -46 -44 25 -7 38 -31 53 -24 -40 -24 39 7 0 -3 -37 -34 -12 -16 -41 25
7572B5J6q7P4K4qp0J1rK9L4j5j7l4k0N0J7o6R3k9ql3L3M2k5l3L8K4n0J0l3P0j6
$$ 25 41 -46 28 52 44 -26 -15 -24 5 39 24 7 -27 -47 3 20 -46 47 18 10 -23 10 52 27 -6 32 56 6 16 -17 53 37
7604C7j1krJ5ok1n6N8o2Q1p2k3O8N1m8k6K3K8J0o5l5J32j01N9k5k2jL3j2j3J7
$$ 37 26 24 15 30 24 3 -53 5 -57 24 -48 -71 -3 48 0 -26 -3 25 35 -30 -65 67 -34 25 0 -22 -23 10 -2 -15 2
7635BM8o4oO8m5K1j8J5k8M1k1MmnkNk2L3M5o2K7J1j9Kj8J8l3M3k1j1%l8N0K0K
$$ 2 50 -14 -20 48 3 24 6 21 -7 34 13 17 13 8 6 11 -11 22 67 5 32 43 24 26 8 26 -7 36 15 4 4 -34 16 36 38
7670C8m5J7L9n6koQNJ4PL5q4J4j0L4k3L2m1nO6o4N0Jmm4j1O2m7J1nN0o0kJ3jQ
$$ 38 -7 10 49 -7 -9 -15 -7 -2 12 19 54 -30 -16 -26 8 -15 17 -24 -29 37 -27 23 24 20 -24 -35 27 -20 -9 -14 36 -24 -26 -13 -14 -6
7706fmP1n8l2K1oQl3M9j9K6l4M3k7M7m4k8L2Ln4M5J3j3n8L3M7n4K6l1L3PK7l5
$$ -6 -10 61 3 -29 -8 -14 -6 -39 10 -9 17 -17 26 -1 46 2 -26 6 9 -45 0 13 0 -58 -25 22 -32 -6 -37 -4 3 30 -5
7739eM3k9LJ5l9K7nJ1l5M7o8Q0m1l8L7j7j8N3j0l7N0m6k4M1L0l8l1O1L7l7kl7
$$ -5 38 9 12 27 -12 15 10 21 -14 33 -35 45 4 -34 3 -14 -32 21 11 -26 24 -22 -46 -5 25 -13 -44 17 54 17 15 -22
7771b2P0p8M5o5M4l2LL3L4N0m7k7k5K1K7m4P4r4onN1Jm0N8rk6m6P2JL0l0j5L1
$$ -22 48 -30 15 -50 -6 -38 -35 -2 32 82 35 8 -17 4 31 -13 61 -33 -39 -44 7 8 -32 26 17 -9 -55 17 18 48 18 3 34
7804C4n2n2L4L1J5j2lK4MqMpKL5p1J0L3Ln5O5mj4Q4q2m1Pm5O1n9L7L8nj5J4mK2
$$ 34 -18 -70 -36 -5 10 -2 -5 19 23 15 19 12 14 49 -22 -12 21 24 -31 34 30 16 100 18 -23 -16 -61 0 -59 -22 16 11 -4 10 6 28
7840B8k0oK2n4J3K7l0J0mK3nRm2L5j3Ll7PP8m0M5p0K3M7k9n4L1OJ2o2Q1l6LJ9
$$ 28 8 2 24 -30 -17 10 -20 -10 -14 9 4 13 -29 6 -7 -4 -41 -34 44 4 49 -21 2 49 20 -34 -3 3 15 -47 34 -2 1 20
7874B0j8j8L5k6l9lL6J1J8Lk5%K7j1l7l2N5nJ3ml6j6O6l4J0J6J2J5l5pj8K5M7
$$ 20 2 -16 19 -7 -46 -49 -13 -2 16 19 -6 -6 21 10 -27 -59 -4 -9 4 0 -36 -52 14 -20 -10 6 18 33 -2 -9 -27 -2 45
7907D5ro2K8l8J4qj4Q9o8KK1M5k8o2L5K9m4L6k5l0j1J4J2J4lN7o0j2J4k6N0ql5
$$ 45 36 -26 2 -36 -22 -30 -44 45 -23 -21 0 45 17 -45 -10 19 -25 11 -14 -44 -55 -41 -29 -15 -18 39 -21 -33 -19 -45 5 -3 -38
7940c8J7M7m2Rk5J3k8O5J1k7M1k9pl1k6P0m8LNrJ1RjQ6o3mj0K7m0k0N3jm4O2J7
$$ -38 -21 26 -16 -7 -32 -19 -47 18 29 2 43 14 7 -24 -50 20 -28 -25 -20 -29 -18 -9 -10 76 13 9 -1 26 -14 -34 19 18 -26 36 53
7975E3o5J0M8m2L0k5M3Mq0K9j5L2l3PJ9k2k5kR0o9k6RK0j5PK0J3Km0qp%K6RJ4
$$ 53 -12 -2 46 4 34 9 52 56 -24 5 -10 22 -11 -4 15 -7 -32 -34 56 -13 -39 -30 -10 -25 -18 2 15 17 -23 -31 -38 -38 -12 -3 11
8010A1Nj5j8k8K1K3K5J6j2nkk3k7j6O0N8o2k6L0j5n9O1pm6O3L7l7j9j3M0J5n5
$$ 11 16 1 -17 -45 -24 -1 24 40 28 23 21 -2 -29 -45 15 73 11 -15 15 0 -59 2 -5 -51 12 49 12 -7 -20 20 35 -20
8042b0l7P0p7N4K5m5Q6l9k7QqQjn3M2QNK6m6J0%K9m4Q5q9O0J6l1l7J6j5QpK7p
$$ -20 -57 13 -64 -10 15 -30 56 17 -10 -2 -10 -2 -3 -56 -14 -6 -1 25 -21 -11 -11 18 -26 59 -30 30 46 15 -22 -6 -21 -13 -20 7 0
8077@J2n6M1J1k6L7m1K9l6QJ6Kl4mM0Nk3N1p0L5kO1o4J9n3P6j4l2lqqJ8K1J6N
$$ 0 12 -44 -3 8 -18 19 -22 7 -29 -21 -5 -3 -37 -41 -1 4 -19 32 -38 -3 -5 56 -8 11 -42 34 20 -12 -15 -23 -31 -13 8 24 29
8112B9o0j3L9K2o2L3nm6R2n4M8k4n0J0O3n3K6k9J0j9M7j5m9N4J5K6r2P0k1K8m
$$ 29 -31 -44 -5 17 -45 -12 -17 -63 29 -25 23 -1 -51 -41 22 -31 -5 -34 -24 -43 4 -11 -60 -6 9 35 -57 13 -8 20 16
8143A6n2O9n9mL2k9J4O5r0K8P5j08L2ppK6l1K2k5L4j3M5k9Jj5J3K6k8J4J5j6%
$$ 16 -36 33 -26 -30 2 -27 -13 52 -38 -10 65 -43 -11 -18 -25 1 -30 -8 -33 1 -12 33 4 5 -10 3 29 1 15 30 14 14
8175A4p7P1o4O6m5k5Q8k4k2l2N1l2L2J6k7j5
$$ 14 -63 8 -56 10 -35 -60 28 4 -18 -50 1 -31 1 17 -10 -25
8191b5
$$ Imaginary data points
##PAGE= N=2
##DATA TABLE= (X++(I..I)), XYDATA
0@%%%%%%%%%%%%%%%%%%%%%%%%%%%%%lPqQrJ0j1J5k0K5l0L4l7M2n1N9o4P0q0R1
$$ 0 0 0 0 0 0 0 0 0 0 0 0 0 0 0 0 0 0 0 0 0 0 0 0 0 0 0 0 0 0 -3 4 -4 4 -5 5 -6 9 -11 14 -16 18 -19 23 -28 31 -33 37 -43 48
49D8j00J11j24J36j46J57j68J76j83J86j80J61j23N0Q5l37Q27j875M474j3061
$$ 48 -52 59 -65 71 -75 82 -86 90 -93 93 -87 74 -49 1 86 -251 576 -1299 3175 -9886
69i886Q5764M52955m07143o04381L14368N28674j57459m14568J1201K38710J28749
$$ -9886 75878 528833 121690 -482691 -168323 360351 202892 -211676 -200475 38235 166984
80A66984m1584k31795j66996K99937L55249l19308n06959L00856O00288k46035
$$ 166984 125400 -106395 -273391 26546 381795 62487 -444472 -143616 456672 210637
90B10637o30031J70877N89800q5248m88843M944L37503O1152j55708j03137l7531
$$ 210637 -419394 -248517 341283 256035 -232808 -227864 109639 170791 15083 -88054 -125585
101a25585J19123K19042j10121l71967Q1142M79283m0406n33063k037N29498L8202
$$ -125585 -6462 212580 102459 -269508 -188366 290917 250511 -282552 -284589 244909 283111
112B83111m72775n9681L72102O3257k41031m7378R6200J5243M6613K7701j72134
$$ 283111 -189664 -249345 122757 186014 -55017 -102395 -6195 9048 55661 83362 -88772
123h8772p3106K69795J13049l32693j39280L58402J45864l49461j31000L10801
$$ -88772 -161878 107917 220966 -111727 -251007 107395 253259 -96202 -227202 83599
133H3599R5346k51232m3927J79036j6972j03291P8474L1147j32586L2516J71800
$$ 83599 178945 -72287 -116214 62822 45850 -57441 21033 52180 -80406 -47890 123910
144A23910q4904j90481J25267J86665j53651j60196J72248J15364j82188n7716
$$ 123910 39006 -151475 -26208 160457 6806 -153390 18858 134222 -47966 -105682
154a05682J85263m685j81719O4011J71399j13048j53708J45893J26893j59659
$$ -105682 79581 74896 -106823 -42812 128587 15539 -138169 7724 134617 -25042
164b5042r0726J53703M4263j30665J0454R4631p1087n1622J32406Q336j88842
$$ -25042 -115768 37935 82198 -48467 -38013 56618 -14469 -66091 66315 74651 -114191
175a14191K9485K34021n7022k61270P2068K66284p3613k45830O4418K00176m7521
$$ -114191 -84706 149315 92293 -168977 -96909 169375 95762 -150068 -85650 114526 67005
186F7005j31974K7647M7550r496M4892l049j36105P151K15624k464k74841j0398
$$ 67005 -64969 -37322 10228 732 45624 42575 -93530 -86379 129245 126781 -148060 -158458
198a58458L06400K7901l06810m6545K75086O1587k14562o8650J31677O4713l4982
$$ -158458 147942 175843 -130967 -177512 97574 159161 -55401 -124051 7626 72339 37357
209C7357m8111o4295J9590J56072J8517k29689o1273K77663J03171k94645j37806
$$ 37357 -10754 -75049 -55459 100613 119130 -110559 -171832 105831 209002 -85643 -223449
220b23449K79737J59082k35331j62792J66992J46291q3807j10297m750N7509Q8136
$$ -223449 56288 215370 -19961 -182753 -15761 130530 46723 -63574 -68324 -10815 77321
231G7321N841j57357p2921K05222J35155k27566j84538K23664K14793j95658k21269
$$ 77321 83162 -74195 -147116 58106 193261 -34305 -218843 4821 219614 23956 -197313
242a97313J48818K03130q9772j61442K6698J01223L3056k8800q2767m7419J17620
$$ -197313 -48495 154635 64863 -96579 -69881 31342 64398 35598 -47169 -94588 23032
253B3032J18845j35301j77481J35169K16575j19736k32325R2283K22907n8274
$$ 23032 141877 6576 -170905 -35736 180839 61103 -171222 -78939 143968 85694
263H5694j89879K2362J37091J0119p0727l5413j360N1058P1508n6225j31805N2357
$$ 85694 -104185 -81823 55268 65387 -5340 -40753 -42113 8945 80453 24228 -107577 -55220
275e5220J76288m1147k00104K6040K02225j0510j83170k237J46392R768r6932
$$ -55220 121068 79921 -120183 -94143 108082 97572 -85598 -87835 58557 68325 -28607
286b8607j1119M0696O285J5231K923o5550j4477J04963K5439j30803l3258J41530
$$ -28607 -39726 970 7255 22486 25409 -40141 -54618 50345 75784 -55019 -88277 53253
298E3253L5813j37678l2048J21558K2079r6074o527O5142j2089l2222L1565J098
$$ 53253 89066 -48612 -80660 40898 62977 -33097 -39624 25518 13429 -18793 12772 13870
310A3870m8482K5701O0783m6669o6111O0849O3435o8901n2703P1017L4987o9179
$$ 13870 -34612 -8911 51872 5203 -60908 -59 63376 -5525 -58228 12789 47776 -21403
322b1403j2426O3969j2271n6940L5761M8583n5225l9272O7939K9201p2434j7527
$$ -21403 -33829 30140 17869 -39071 -3310 45273 -9952 -49224 18715 47916 -24518 -42045
334d2045O8052M574n5435J0144L6690k5944j3954M2292r289n7833L0519P0764
$$ -42045 26007 30581 -24854 -14710 21980 -3964 -17918 24374 15085 -42748 -12229 58535
346E8535m6803p9448N6337Q1925n8275p7609N2694O5347m1045m6038K5120K0483
$$ 58535 11732 -67716 -11379 70546 12271 -65338 -12644 52703 11658 -34380 -9260 11223
358A1223p601Q726r017l9056K2672O7380l1407r0154L4373J05122l1444j09807
$$ 11223 3622 12348 3331 -35725 -13053 54327 22920 -67234 -32861 72261 40817 -68990
370f8990K3865J03441j2727q6137M96N9504J0649k6017j8834j0847K2619M6875
$$ -68990 -45125 58316 45589 -40548 -40052 19452 30101 4084 -14750 -25597 -2978 43897
382D3897k1531p8427J5464J01579n946j13995n713J14185J7030j02246k6182P9667
$$ 43897 22366 -56061 -40597 60982 55036 -58959 -64672 49513 66543 -35703 -61885 17782
394A7782L1388m8905l1521J3941K6378K1677j6255n3601K734P8833J2710r4696
$$ 17782 49170 265 -31256 -17315 9063 30740 14485 -39116 -36382 42451 55161 -39535
406c9535k7427R9741L9532r4073m7181P8694M9019n6059m4731K8691L4181o4j9194
$$ -39535 -66962 32779 72311 -21762 -68943 9751 58770 2711 -42020 -13329 20852 20788 1594
419A594k6675R26M8732J8052o3986l5574P1347M9497p0496n7757O2410N9569m8412
$$ 1594 -25081 -24155 24577 42629 -21357 -56931 14416 63913 -6583 -64340 -1930 57639 9227
432I227n4271L0833M2872j1864k6248o241O898K1346J3354l2525l1807L8733M6097
$$ 9227 -45044 -14211 28661 16797 -9451 -15692 -8794 12552 25906 -6619 -38426 307 46404
445D6404m0240n5024L7408N7255l1459n3212K3519M3175j4865k8812O754J1796
$$ 46404 6164 -48860 -11452 45803 14344 -38868 -15349 27826 12961 -15851 -9097 2699
457B699K49N687n315k1571Q787L4347j0380m2603J1024M5747j0740m3728J0358
$$ 2699 2948 8635 3320 -18251 -9464 24883 14503 -28100 -17076 28671 17931 -25797 -15439
470a5439L7165j0062k7335J0211J5212j0698k913J1330q672j1891J8009J1649
$$ -15439 21726 11664 -15671 -5460 9752 -946 -3859 7471 -1201 -13092 4917 16566
482A6566k4596j0493K7824P844k7707l856K4824j244j9841P336J3857j3453p371
$$ 16566 -8030 -18523 9301 17145 -10562 -14418 10406 9162 -10679 -3343 10514 -2939 -10310
495a0310J9070J610k3203L292K5271o783k4649Q863K1235r837j5223R715P042
$$ -10310 8760 10370 -12833 -9541 15730 8947 -15702 -6839 14396 4559 -10664 -949 6093
508F093r142K114Q392j1701p888K0258P515k7035p339L0813P375l1361p115K8488
$$ 6093 -3049 -935 7457 -4244 -12132 8126 15641 -11394 -18733 12080 19455 -11906 -19021 9467
522I467O478k2065n220J3515L155l350k6p146l753J6916Q060k4694j2332K9601
$$ 9467 15945 -6120 -11340 2175 5330 1980 1954 -5192 -8945 7971 16031 -8663 -20995 8606
536H606J5922l1213j8537K9269J9311k4247j8255J6497J4980p304r763k483L098
$$ 8606 24528 -6685 -25222 4047 23358 -889 -19144 -2647 12333 5029 -4734 -7217 -4119
549d119J1554M505j8902j2076K3978J8744k5983k3629K5241K6172k1539k5894
$$ -4119 7435 11940 -6962 -19038 4940 23684 -2299 -25928 -687 25485 3946 -21948
561b1948J5902K2742q750j7009J114R298O040n65j2065q543J6219J6719j8356
$$ -21948 -6046 16696 7946 -9063 -7949 1349 7389 6824 -5241 -13784 2435 19154 798
574G98k3403J8182K7491j6148k8579J2253K6809p494k2011K320J5056K590o414
$$ 798 -22605 -4423 23068 6920 -21659 -9406 17403 9909 -12102 -9782 5274 7864 1450
587A450o562k553R437J1256j0643j8593J0578K3693r008k6305O620K5928l885
$$ 1450 -5112 -7665 1772 13028 2385 -16208 -5630 18063 9055 -17250 -10630 15298 11413
600A1413k2916J026J7447J394j0656l047K764L933M738l907j1440L137J6619j940
$$ 11413 -11503 -10477 6970 8364 -2292 -5339 -2575 1358 6096 2189 -9251 -6114 10505 8565
614H565j9759O93K0789M47j9315j199J6245J474j1636j086O296K88p40R30m509
$$ 8565 -11194 -10501 10288 10735 -8580 -9779 6466 7940 -3696 -4782 1514 1802 1062 1992 -2517
629b517k241Q818L237j1844m115J3384M210j3624l740J2366K506j0037q72P107
$$ -2517 -4758 4060 7297 -4547 -8662 4722 8932 -4692 -8432 3934 6440 -3597 -4469 2638
643B638j112l953L292Q03n108K108O395m004p074N566O825o200n659O355L719
$$ 2638 1526 -2427 865 1668 -3440 -1332 5063 1059 -6015 -449 6376 176 -5483 872 4591
658D591n935j320N237j511m301M024L323o269k548P863J544q470q38P892K11o568
$$ 4591 -1344 -2664 2573 1062 -3239 785 4108 -2161 -4709 3154 4698 -3772 -4610 3282 3493 -3075
674c075N37M403j261j661K197j358k843M222L682o515m253Q137M737q785m804
$$ -3075 -2538 1865 604 -1057 1140 -218 -3061 1161 4843 -1672 -5925 2212 6949 -1836 -6640
689f640Q347M574p005l953M786K799k050j410r76m52L806K226o264l948P857N408
$$ -6640 1707 6281 -724 -4677 109 2908 858 -552 -1528 -1980 1826 4052 -2212 -6160 1697 7105
705G105q658o377Q458O866p311o424N344N448k680l943R9J885K757M25n141k635
$$ 7105 -1553 -7930 528 7394 83 -6341 -997 4451 1771 -2172 -2073 -188 2569 2994 -2147 -4782
721d782O838M740p982o363Q118P199p441p477N960O820m055n449J534L604R44
$$ -4782 2056 6796 -1186 -7549 569 7768 327 -7150 -1190 5630 1575 -3874 -2340 1264 2208
736B208j234l323j213N302L652o717n598P548O979p491p559O826P470n482o464
$$ 2208 974 -2349 -3562 1740 5392 -1325 -6923 625 7604 113 -7446 -620 6850 1368 -5096
751e096L635M850j470k767p33L14K731K143m602m389N738O143o527p249O622P513
$$ -5096 -1461 3389 1919 -848 -1581 -1267 1464 3607 -995 -5384 354 6497 -30 -7279 -657 6856
767F856o133p054N229N863l855m038K326J727m79P68j168l008K738N025l911o596
$$ 6856 723 -6331 -1102 4761 906 -3132 -806 921 442 1210 42 -2966 -228 4797 886 -5710
783e710M917P318n420p433N559O669n324n336M627L390l822j138K538j222j210
$$ -5710 -793 6525 1105 -6328 -769 5900 576 -4760 -133 3257 -565 -1703 835 -387 -1597
798a597L458k13n307J624O618k825p251M036P151m799o328N501M889n698l068
$$ -1597 1861 1648 -3659 -2035 4583 1758 -5493 -1457 5694 895 -5433 68 4957 -741 -3809
813c809N619J043n150J006M377l091l109M613J498n768J67O324k135o250L843
$$ -3809 1810 2853 -2297 -1291 3086 -5 -3114 1499 2997 -2771 -2604 3720 1585 -4665 -822
828h22N687n520m618O856L364p805j759Q098K15p623J326O593k637m742L702K478
$$ -822 4865 -655 -5273 1583 4947 -2858 -4617 3481 3696 -3927 -2601 3992 1355 -3387 315 2793
844B793m442L36M835l266m963O052M671q428m418J0284L633j1173k837J0918J880
$$ 2793 -1649 -1313 3522 256 -4707 1345 6016 -2412 -6830 3454 7087 -4086 -6923 3995 5875
859E875r740p91P504m25m410J721Q00l080L183M384o684n533R787O505j1915p055
$$ 5875 -3865 -4656 2848 2423 -1987 -266 534 -2546 637 5021 -1663 -7196 2591 9096 -2819 -9874
875i874J2907P239j2700o678J1091N535q456l777M827J417q88J350l312m375P055
$$ -9874 3033 10272 -2428 -9106 1985 7520 -936 -4713 114 1531 643 1993 -1319 -5694 1361
890A361P269j0166r810J2196J1635j2850j2520J2285J2168j0323j0492P439P822
$$ 1361 8630 -1536 -11346 850 12485 -365 -12885 -600 11568 1245 -9247 -1808 6014
903F014l803m026K0m91L643N317o808r850R005J3787j0380j6341J0264J7451r302
$$ 6014 2211 -1815 -1795 -2286 1357 6674 -134 -9984 -979 12808 2428 -13913 -3649 13802 4500
918D500j6823P349J4301m771j0337J976N163O53P90k884o802M546J2229n274j6498
$$ 4500 -12323 -4974 9327 4556 -5781 -3805 1358 2011 2801 -83 -6885 -2339 9890 4616 -11882
933a1882N465J9168m804j9926L687J8761k404j5673J140J0902o2n181o72j087
$$ -11882 -6417 12751 7947 -11979 -8292 10469 8065 -7608 -6468 4434 4372 -809 -1481 -2568
947b568Q03P227n76j2632q6J6715Q22j9112j597J9578K013j8038j992J4865J558
$$ -2568 -1765 5462 4886 -7746 -7832 8883 9705 -9407 -11004 8574 10587 -7451 -9443 5422 6980
962F980j0260m51M914q95O00K716n854m490J0317O049j3579p038J5381P081j5663
$$ 6980 -3280 -3731 1183 288 888 3604 -2250 -6740 3577 9626 -3953 -10991 4390 11471 -4192
977d192o405J4514M760j2344k463R213l53n724L390K024o155J408Q493m418r874
$$ -4192 -10597 3917 8677 -3667 -6130 3083 2730 -2994 396 2420 -3735 -2327 6166 1748 -8126
992h126O877J0292q516r642R753P818j0101n203J0050J937r362J359Q394m569
$$ -8126 -1249 9043 527 -9115 638 8456 -1645 -6848 3202 5139 -4223 -2864 5530 961
1006I61p058P249N179r062l240R908Q70r709J659Q534m435o535P063L943r435
$$ 961 -6097 1152 6331 -2731 -5971 3937 4807 -4902 -3243 5291 856 -5679 1384 5327 -4108
1021d108j149J1378j350j2535L529J2796m968j2015N960R949o011o935N627K968
$$ -4108 -5257 6121 4771 -7764 -4235 8561 3593 -8422 -2462 7487 1476 -5459 168 3136
1035C136m850J551L887o225k956J0524K058j4048j506J6244J154j6977j027J6025
$$ 3136 -1714 -163 3724 -2501 -5457 5067 7125 -6923 -8429 7815 8969 -8008 -9035 6990
1049F990R33j3355q99R450M22m362M34j252j609O901L145j1708m834J5437O452
$$ 6990 7923 -5432 -6331 3119 3541 -821 -387 -1639 -3248 3653 6798 -4910 -9744 5693 12145
1064A2145j7425p807J7626Q571j6039q475J2679P280q051n210K750K073K667J560
$$ 12145 -5280 -13087 4539 13110 -2929 -11404 1275 8555 504 -4706 -1956 117 2784 4344
1078D344p495n721J1506R377j3844j2440J4579J4419j3742j4790J1493J3688q126
$$ 4344 -3151 -8872 2634 12011 -1833 -14273 306 14725 983 -13807 -2314 11374 3248
1091C248j0872M167O858j12j807l560l587O375Q845q229j3330Q815J6394q271
$$ 3248 -7624 -3457 3401 3289 1482 -2078 -5665 710 9555 1326 -12004 -3189 13205 4934
1105D934j7932O719J7554m645j5388K416J1358j72o216j640N12K742N341l121
$$ 4934 -12998 -6279 11275 6630 -8758 -6342 5016 4844 -1372 -3012 -2500 242 5583 2462
1119B462j0452K855J4433j903j6743P70J7266M83j5961j396J2992J760q710j754
$$ 2462 -7990 -5135 9298 7395 -9348 -8578 8688 9171 -6790 -8186 4806 6566 -2144 -3898
1133c898L887Q57J138M07n820j968R483L462j1876m851J3013N552j2692n511J1134
$$ -3898 -11 846 1984 2391 -3429 -5397 4086 7548 -4328 -9179 3834 9386 -3306 -8817 2317
1148B317M688q529l153N529J090k347J483o39l970L164O083n003p639O164Q305
$$ 2317 7005 -1524 -4677 852 1942 -405 1078 439 -3531 -367 5716 713 -6926 -762 7543
1163G543o555p995O238O793n688m758M755K076l820P91K882l605k056N985J421
$$ 7543 988 -7007 -769 6024 336 -4422 333 2409 -1411 -620 2262 -1343 -3399 2586 4007
1178D007p576q25Q248L53p991K76O885j028m906K023K526l116M9M183k419n195
$$ 4007 -3569 -4394 3854 4207 -3784 -3508 3377 2349 -2557 -534 1992 -1124 -1075 3108 689 -4506
1194d506M233N953n400o366N837O010n476n173M498L612l160j505J595r71j34
$$ -4506 -273 5680 280 -6086 -249 5761 285 -4888 -390 3222 62 -1443 152 -819 -953
1209i53L615j142n871J904P853k167q955J959R312j435q523O47O828J98m449p00
$$ -953 2662 1520 -4351 -2447 5406 3239 -5716 -3757 5555 4120 -4403 -3756 3072 3270 -1179 -1879
1225a879J280J066J815r04m857L92P163M79q871j527R510K501r044l218P509L624
$$ -1879 -599 467 2282 1378 -3479 -3087 4076 4555 -4316 -5843 3667 6168 -2876 -6094 1415 5039
1241E039n218l426K460K672O14j428l288k97N676K000p045l757P631N169p325
$$ 5039 -179 -3605 -1145 1527 2141 713 -2575 -2872 2804 4804 -2241 -5998 1633 6802 -523
1256e23o008O106O154m346n543K070M264J86k531k152K09L768K100m738m151M996
$$ -523 -6531 -425 5729 1383 -4160 -2090 2174 2360 -171 -2323 -2114 1654 3754 -984 -5135 -139
1272a39N750m453o780L502P014k214o326O84N082P24l126j838Q56K521J509k690
$$ -139 5611 1158 -5622 -2120 4894 2680 -3646 -2962 2120 2844 -282 -2120 -1264 1257 2766 76
1288G6l583K388N061j667n951O63O029K00n453j077M254J689k592j898P01J748
$$ 76 -3507 -1119 3942 2275 -3676 -3013 3016 3216 -2237 -3314 940 2629 37 -1861 -1160 588
1304E88J189j268k602M58L740M12m223j254M284J838l597k290K613K336j378k037
$$ 588 1777 509 -2093 -1635 2105 2517 -1706 -2960 1324 3162 -435 -2725 -112 2224 846 -1191
1320a191Q2J346J051m71j973n17K447J398k529k121K138K542j492k617O71K322
$$ -1191 -1109 237 1288 817 -1156 -1673 774 2172 -357 -2478 -340 2202 710 -1907 -1236 1086
1336A086K08j707q48Q11J461K12j712j089J653J851j211k404N97K568o3k176p70
$$ 1086 1294 -413 -1261 -450 1011 1223 -489 -1578 75 1926 715 -1689 -1092 1476 1413 -763 -1533
1353a533J683J315q66j783l5J790R69j625j792J265K168o95k289pK207P04j647
$$ -1533 150 1465 599 -1184 -1219 571 1540 -85 -1877 -612 1556 861 -1428 -1435 772 1476 -171
1370a71j298R76J659j3j800q55J799J657j567k177J091K418n22k439p2K020N80
$$ -171 -1469 -493 1166 1153 -647 -1502 297 1954 387 -1790 -699 1719 1197 -1242 -1314 706 1286
1387A286j417r99O02J193L17j277j194J120J933r25k341N88K586j62k535m7K131
$$ 1286 -131 -1130 -528 665 982 -295 -1489 -369 1564 639 -1702 -1114 1472 1310 -1225 -1272 859
1404H59K94j562l35Q16M04Ll20p98J99J398k1j953j47K298J67k389k38K228J18
$$ 859 1153 -409 -744 72 476 479 159 -639 -440 958 937 -1016 -1163 1135 1302 -1087 -1325 903 1021
1423A021j931o9J573j76r81M18L49n34K88P50r29p92J451P95j840n97K121M24
$$ 1021 -910 -979 594 418 -563 -145 204 -330 -42 708 -221 -1013 438 1233 -607 -1204 917 1341
1441A341k225j87K175j77j971M16J665p66j150R17N57j018k8J090o08j113J320
$$ 1341 -884 -1071 1104 927 -1044 -628 1037 271 -879 38 595 -423 -451 639 31 -1082 238
1458B38Q87j791o60K270L77k505j44K618k11k386N49K048p26j496R23Q08j096
$$ 238 1125 -666 -1326 944 1321 -1184 -1328 1290 1079 -1307 -758 1290 564 -932 -9 799 -297
1475b97p4J219q47j183J522J155k205r99K610P02k793m34K737J20k434J86K042
$$ -297 -371 848 1 -1182 340 1495 -710 -1709 901 1603 -1190 -1624 1113 1233 -1201 -1015 1027
1492A027o27j372J022O89j353J64J594r08j701J571J675k049j458K398J110k564
$$ 1027 400 -972 50 739 -614 -450 1144 236 -1465 106 1781 -268 -1726 672 1782 -782
1508g82p27K468K67k323L53J926r33j419J314Q24j710j39J903n72j852J154J769
$$ -782 -1509 959 1226 -1097 -744 1182 249 -1170 144 968 -742 -881 1022 450 -1402 -248 1521
1525A521j744j386K188J003k530m52K749j22k647O04K405r67j983J304J292j481
$$ 1521 -223 -1609 579 1582 -948 -1400 1349 1227 -1420 -816 1589 622 -1361 -57 1235 -246
1541b46n79J513l29j426J190J177j965j008K663P17l125n32L414K94l316k2K928
$$ -246 -825 688 359 -1067 123 1300 -665 -1673 990 1707 -1418 -1950 1464 1758 -1558 -1580 1348
1558A348j26k275M59J237n67j31Q13j031r87K013J312k973j447L463J645l831
$$ 1348 1222 -1053 -594 643 76 -55 758 -273 -1260 753 2065 -908 -2355 1108 2753 -1078
1574a078j660L653J527l077j368K257R17j208l75L7l81J196J156k196j827K962
$$ -1078 -2738 915 2442 -635 -2003 254 1171 -37 -412 -375 -756 440 1596 -600 -2427 535
1590E35K499l401k952L522L142l190k975K633K388j616j723O83O07L39N59j249
$$ 535 3034 -367 -3319 203 3345 155 -2820 -187 2201 585 -1138 -455 152 491 1050 -199
1606a99j747J902K716k314l565K369M132k313m072J822L748j291k926O47J847
$$ -199 -1946 -44 2672 358 -3207 -838 3294 981 -3091 -1269 2479 1188 -1738 -1091 756
1621G56k8m93n21q63P93K359j022l290R18M126q39m447N98M262l86l637Q0K699
$$ 756 728 235 -286 -1149 -356 2003 981 -2309 -1391 2735 1896 -2551 -1953 2309 1923 -1714 -1634 1065
1639A065Rj440l8J7l2J294J64k441m02L353O11l809p62L862Q28l426p45K794M41
$$ 1065 1074 -366 -404 -387 -419 875 1039 -1402 -1804 1549 2160 -1649 -2411 1451 2279 -1147 -1892 902 1343
1658A343j843n0Q15m58K16J061j198j462J741J903k283j996K381J961k366j661
$$ 1343 -500 -550 265 -193 23 1084 -114 -1576 165 2068 -215 -2211 170 2131 -235 -1896
1674a896K087J079j651l80J189n53o02J261L73j995L1K543l74k639N64K528o41
$$ -1896 191 1270 -381 -761 428 -125 -727 534 907 -1088 -1057 1486 1112 -1527 -963 1565 924
1691I24k138P18J486r00o07J053m13j214J311J336k025j430K465J428k615j521
$$ 924 -1214 -496 990 90 -517 536 123 -1091 220 1556 -469 -1899 566 1994 -621 -2142
1707b142K609J180k081p84J414K47n09L71k57j090R51J954j628k541K048K912
$$ -2142 467 1647 -434 -1218 196 443 -66 305 48 -1042 -91 1863 235 -2306 -258 2654
1723B654k084l059J855K905j462k455Q81J594l00m98l33p39Q71J826j075k962
$$ 2654 570 -2489 -634 2271 809 -1646 -765 829 529 31 -302 -1041 -170 1656 581 -2381
1739b381J249L649j093m048Q18M028m03l558LK736L48j466o13J23P30J320o89
$$ -2381 -1132 2517 1424 -2624 -1806 2222 1819 -1739 -1736 1000 1348 -118 -731 -608 122 1442 753
1756G53k616M15L718j72m284l42M506P36m174j059L316J194k224j132Q28Q79O28
$$ 753 -1863 -1448 2270 2098 -2186 -2528 1978 2714 -1460 -2519 797 1991 -233 -1365 -537 342 970
1773I70l89j940k02K991Q94l711j446L977J960l832k176L222K254k453j826J325
$$ 970 581 -1359 -1561 1430 2324 -1387 -2833 1144 3104 -728 -2904 318 2572 119 -1707 -382
1789c82J242j48m52r36m68J809J345k460k219K796K779k764l094K552K927k013
$$ -382 860 712 260 -676 -1144 665 2010 -450 -2669 127 2906 142 -2952 -400 2527 514
1805E14k561J463J753p25p42L7k59M62J459r54k325J221K968j308l282J236L259
$$ 514 -2047 -584 1169 444 -298 -261 -520 -58 1401 447 -1878 -657 2311 1003 -2279 -1043 2216
1822B216j194k804R98K081q75j120O26Q6n41R54M69j833n39K531N07k854m05K901
$$ 2216 1022 -1782 -784 1297 422 -698 -72 14 -527 427 896 -937 -1476 1055 1562 -1292 -1697 1204
1840A204L21k623RK106l18j436P27O30j202K55J493q28j893J335K078j681k040
$$ 1204 1525 -1098 -1089 1017 699 -737 -10 620 -582 -327 1166 338 -1555 -220 1858 177 -1863
1857a863J859J651j809j220J619N27j357M24Q88j254n46K050K38k669P2L009k47
$$ -1863 -4 1647 -162 -1382 237 764 -593 -169 719 -535 -1081 969 1207 -1462 -1390 1619 1372
1874A372k996M22K704m02k124M07J322n78k94P05q22q73J859J079k713j234L149
$$ 1372 -1624 -1202 1502 1100 -1024 -617 705 127 -167 538 -284 -1157 702 1781 -932 -2166 983
1891I83J392l419j412L222J327k658j139J905P26r01j89j14m88J133J374k067
$$ 983 2375 -1044 -2456 766 2093 -565 -1704 201 927 26 -163 -277 -765 368 1742 -325
1907c25j986K683K455k903k885K933K991k579k837J960K156j104j384L64K43M83
$$ -325 -2311 372 2827 -76 -2961 -28 2963 384 -2453 -493 1663 559 -825 -461 -218 265
1923B65R43j278k063J770L025j992l787K033M125j788m005J296L590q00k640L43
$$ 265 1208 -70 -2133 -363 2662 670 -3117 -1084 3041 1253 -2752 -1456 2134 1334 -1306 -963
1939i63J393J98J7o06j404P39K674p48l691O01M360m70m511J36M294Q2l543l78
$$ -963 430 628 645 39 -1365 -626 2048 1300 -2391 -1790 2570 2100 -2411 -2275 2019 2101 -1442 -1820
1957a820K491M35j155m12j68Q7J653K22k790n25L573R52l987j349M208J324l709
$$ -1820 671 1106 -49 -461 -629 -542 1111 1333 -1457 -1982 1591 2543 -1444 -2793 1415 2739 -970
1974i70j348K971J026j892n98O94Q3L61O99j488j375K217J996k789k378K999K548
$$ -970 -2318 653 1679 -213 -811 -117 -34 327 1026 -462 -1837 380 2376 -413 -2791 208 2756
1991B756k945k402K586J969k029j286J446L56o09N33Pj474N29K309r32k793J144
$$ 2756 -189 -2591 -5 1964 -65 -1351 95 451 -158 375 382 -1092 -563 1746 814 -1979 -835
2008h35L074j331l035J398K588j329j975J266J046j216K9J043r76r64J737R39
$$ -835 2239 908 -2127 -729 1859 530 -1445 -179 867 -349 -320 723 -253 -1217 520 1459
2024A459k405q30K882N93k863l06K554M9k085M75J315r40n12J480k39j996R44
$$ 1459 -946 -1776 1106 1699 -1164 -1470 1084 1133 -952 -477 838 -102 -614 866 627 -1369 -425
2041d25K266j419k440J713K388j869k048J690J504j471o79J149l38p27J248M05
$$ -425 1841 422 -2018 -305 2083 214 -1834 -144 1360 -111 -790 359 21 -706 542 947
2057I47k126j20K842l9l295J60L465k01l229J37K727j67j782J83P03l06M91M62
$$ 947 -1179 -1299 1543 1504 -1791 -1631 1834 1633 -1596 -1459 1268 1101 -681 -498 205 -101 390 852
2075H52j651p75K585J149l370j353L647J589l579j699L117J609k321j277J322
$$ 852 -799 -1574 1011 2160 -1210 -2563 1084 2673 -906 -2605 512 2121 -200 -1477 -155
2090a55O43o0Q0j024r77K034J822k757k454L076L011l052l245K616L168k019k698
$$ -155 488 428 508 -516 -1493 541 2363 -394 -2848 228 3239 187 -3058 -442 2726 707 -1991
2107a991J215J849k99r10m55l96J146J691j693k771J948L577j829m095J507M188
$$ -1991 -776 1073 774 -136 -591 -987 159 1850 157 -2614 -666 2911 1082 -3013 -1506 2682
2123B682j058l733N15K928O4j768m59M04P25J026p62k327N62L374k83m099o5M300
$$ 2682 1624 -2109 -1594 1334 1398 -370 -829 -425 300 1326 564 -1763 -1201 2173 1890 -2209 -2274 2026
2141B026L56m028o98L324Q82k289q94J119N59K73j89j456l52K527R05l220j331
$$ 2026 2382 -1646 -2344 980 1862 -427 -1321 -202 357 630 441 -1015 -1367 1160 2065 -1155 -2486
2158b486L506J716l376j911K990J724k233j374J372P86m91N5n58q18J221J614
$$ -2486 1020 2736 -640 -2551 439 2163 -70 -1444 -72 714 223 278 -280 -1098 123 1737
2174A737j778k243K014K647j998k710J725K517j392j921R18J244n92j79K29q10
$$ 1737 -41 -2284 -270 2377 379 -2331 -606 1911 519 -1402 -484 760 168 -11 218 -592
2190e92L8J729j61k423J30K870j12k993J88K604l3k108J04J210k00l97M83n69
$$ -592 -554 1175 1014 -1409 -1279 1591 1479 -1514 -1326 1278 1245 -863 -759 451 251 -146 337 -232
2208b32q20J435J155k070j347K292J612k393j583K150J376j627r99J089L43k88
$$ -232 -1052 383 1538 -532 -1879 413 2025 -368 -1951 199 1575 -52 -1051 38 381 93
2224I3K96l20j108Q30J907j246k399J294K719j213k816R83K605p34j917J89J146
$$ 93 389 69 -1039 -209 1698 452 -1947 -653 2066 853 -1963 -980 1625 891 -1026 -837 309
2241C09J00p2l60j018M46K053l91k803J82L314J17l400m41L152P14k428q92J536
$$ 309 409 337 -23 -1041 -595 1458 1067 -1736 -1554 1760 1877 -1523 -1964 1188 1902 -526 -1418 118
2259A18Q51m66n79q10J92J875J68k604q03L175J307l291j754L025J999k474j952
$$ 118 969 503 -76 -886 -694 1181 1349 -1255 -2058 1117 2424 -867 -2621 404 2403 -71 -2023
2276b023J650J684o11j102n06M22J391M54k067j316K393K152k443k687K217K931
$$ -2023 -373 1311 700 -402 -908 -486 905 1359 -708 -2024 369 2521 78 -2609 -392 2539
2292B539j716k862J000K523m16j672l82O55R57M41j327j517J491K366j350l028
$$ 2539 823 -2039 -1039 1484 1068 -604 -986 -331 626 1067 -260 -1777 -286 2080 730 -2298
2308b298J055L377o90l180J73K791K39j909o31R04P73J63p12j228N09K207k78
$$ -2298 -1243 2134 1444 -1736 -1563 1228 1467 -442 -1073 -169 604 767 55 -1173 -664 1543 1265
2325A265k798j19L083M40k992q00K593R49j883r52J003P15j00l01q19j36J619
$$ 1265 -1533 -1652 1431 1871 -1121 -1921 672 1621 -262 -1214 -211 504 404 103 -716 -852 767
2342G67O17k049j115K212J615k243j703J872J645j361j340P52Q10j71r3l68o42
$$ 767 1384 -665 -1780 432 2047 -196 -1899 -27 1618 257 -1083 -331 479 308 215 -153 -795
2359g95Q38J248j033j814J016K162r21k252O94K066m94j499J47R14o7Jo8q25J82
$$ -795 43 1291 258 -1556 -540 1622 701 -1551 -857 1209 715 -784 -637 277 210 211 143 -682 -500
2378e00J505k6k074j60K360M16k445n22K073O00j533n65Q25L55K6j11p58l66J436
$$ -500 1005 979 -1095 -1255 1105 1521 -924 -1446 627 1227 -306 -871 -46 309 335 224 -534 -900 536
2397E36Q00j839j288K012J611j864j791J615J736j129j436N28R41J23k01p46m69
$$ 536 1336 -503 -1791 221 1832 -32 -1823 -208 1528 399 -1037 -509 432 555 354 -392 -861
2414h61J051J324j351j982J377K445j213k627P98K514l78k145qJ436M05n94p16
$$ -861 190 1514 163 -1819 -442 2003 790 -1837 -1039 1475 1097 -1048 -1056 380 785 191 -525
2431e25l36Q32J344p59k175O15K704l13k876j12K830M69k456p04J723Q73q19r01
$$ -525 -861 -29 1315 556 -1619 -1004 1700 1387 -1489 -1601 1229 1698 -758 -1462 261 1134 315 -586
2449e86j79P34J087k70j989j81K523O75k750j177K703J416k229j626J659J541
$$ -586 -765 -31 1056 786 -1203 -1384 1139 1814 -936 -2113 590 2006 -223 -1849 -190 1351
2465A351r21j199Q4O98P18k8j377o44J815J307j998j790J947K081j640k233J250
$$ 1351 430 -769 -685 13 731 703 -674 -1318 497 1804 -194 -1984 -37 2044 404 -1829 -579
2482e79J964o82j516R3Q49L65np74p86R94J538j140k002R94K384p92k428M77K228
$$ -579 1385 703 -813 -720 129 494 489 -285 -1071 -77 1461 321 -1681 -687 1697 905 -1523 -1046 1182
2501A182j86j646j13R94K34j19l64o03K41J306l0j985p9K205L80k308n33J995
$$ 1182 996 -650 -763 231 465 346 -18 -621 -380 926 896 -1089 -1168 1037 1417 -891 -1424 571
2519E71O39j614n52R86M10l25m9l68l63J033O13j302j064J565J381j617j422J416
$$ 571 1210 -404 -956 30 440 115 66 -302 -665 368 981 -321 -1385 180 1561 -56 -1478 -62
2537f2J370j136j042O80N97k37p2j57m99M36J075o89j508O81J893o13k066N35
$$ -62 1308 172 -870 -190 407 170 98 -59 -558 -122 953 264 -1244 -563 1330 717 -1349 -814
2555h14J845k47j525R9R57J9k78j1m93N7J131O6j645k24J972M90k200o01J978
$$ -814 1031 784 -741 -642 315 334 56 45 -448 -391 740 806 -839 -1063 909 1399 -801 -1402 576
2574E76P33j575p41J008O38m02l33l45l6R78M77j489r28J795J284j804j592J675
$$ 576 1309 -266 -1007 1 639 237 -96 -441 -477 501 978 -511 -1439 356 1640 -164 -1756 -81
2592h1J666j300j581Q36J287l13p65k44R7P93N08r93j303J246J789j149k172Q64
$$ -81 1585 285 -1296 -460 827 514 -251 -495 -398 395 903 -90 -1393 -147 1642 493 -1679 -815
2610h15K409p00k167K93J776O4j087m97M15N88M84o68j260O10J924m03k342Q6
$$ -815 1594 894 -1273 -980 796 860 -227 -724 -309 279 763 95 -1165 -555 1369 966 -1376 -1290
2628a290K554J91k335n15J998P19j452p60O10O99J63m80q94P7J656K13j967p55
$$ -1290 1264 1455 -880 -1395 603 1322 -130 -890 -280 419 582 102 -792 -715 941 1154 -813 -1568
2646a568K183J117k110j356J738J409j260j224O19R94Jm93n71p2J112O24j380
$$ -1568 615 1732 -378 -1734 4 1413 153 -1071 -452 542 543 50 -521 -593 519 1143 -237
2663b37j173J452J634j453j785J154J845q41j604L20J296k3o09l93r6N60P60o12
$$ -237 -1410 42 1676 223 -1562 -408 1437 596 -1008 -688 608 585 -24 -417 -513 47 807 195
2681A95j379O32J786m46k008K72K013r2j660k05J345K81p17l47J0L12O13j01j191
$$ 195 -1184 -552 1234 788 -1220 -948 1065 973 -687 -892 453 734 17 -330 -320 -8 605 504 -687
2700f87j59J539M68j728p19J655Q50j449q54J054P77o12n04L1J82L94K96p97p08
$$ -687 -846 693 1161 -567 -1286 369 1219 -230 -1084 -30 747 135 -369 -338 -156 238 534 -263 -971
2719i71J080J141j092j468J057J462p82j386M81J147j40p57j12J83L26M04m64
$$ -971 109 1250 158 -1310 -253 1209 427 -959 -478 669 529 -228 -340 -157 169 573 109
2736A09r76M33J519m63j716K25J765Q9j737k24J313M45q85m05K23M15M28k74r73
$$ 109 -867 -434 1085 622 -1094 -869 896 985 -752 -976 337 782 -103 -508 -285 130 558 284 -689
2755f89M1J421K32j651o16J801Q49j578j068J220J050o40j034J61O68L91k07r48
$$ -689 -648 773 1005 -646 -1262 539 1388 -190 -1258 -38 1012 372 -662 -501 167 558 351 -597
2773e97k23J174P75j276j313J390J498j073j676P30J581k42j294j79Q78M92k49
$$ -597 -820 354 1129 -147 -1460 -70 1428 355 -1321 -591 990 748 -546 -725 153 645 396
2790C96q07l64Q86R99q59j478O14J897m73j902N1J792L21j502n89R67P61l48p62
$$ 396 -411 -775 111 1110 251 -1227 -613 1284 811 -1091 -1040 752 1073 -429 -1018 -51 710 362 -400
2809d00l79P55Q98l40j473N1J783L00j852o20J707Q50j257j113Q21J064j96r46
$$ -400 -779 -24 874 534 -939 -888 895 1195 -657 -1277 430 1280 23 -1090 -269 795 599 -347
2827c47l19N16Q66m9j313m05J447Q56j403j209J173J453q61j396L44J331j7q49
$$ -347 -666 -150 716 667 -646 -1051 396 1252 -151 -1360 -187 1266 405 -991 -647 684 667 -182
2845a82m88M56P04J86r70o43R58J133p72j485N66J536k10j562n8J227M02q30n38
$$ -182 -670 -214 490 676 -294 -937 21 1154 382 -1103 -537 999 789 -773 -831 396 798 -32 -570
2864e70K44O27K50n73p63M65J100j34j445j65J515N20j386p01J032Q30o06p88
$$ -570 -326 301 551 -22 -785 -320 780 646 -799 -964 551 1071 -315 -1016 16 846 240 -548
2882e48J44O81L47m57p06m5J093L50j174p58J182J019r67j106M80J242k31r87
$$ -548 -404 277 624 167 -539 -584 509 859 -315 -1073 109 1128 161 -945 -465 777 546 -441
2900d41j68O01N26j47q29k03Q05P59p63j089N26J346k48j362m9J242K98r25n50
$$ -441 -609 -8 518 371 -458 -661 144 903 140 -949 -423 923 675 -687 -736 506 804 -121 -671
2919f71N11O70j0o44n12N32Q56k57j224j0J311L31j270o07J029Q31o92q75K78
$$ -671 -160 510 500 -144 -656 -124 732 475 -749 -759 552 883 -387 -994 35 866 174 -701 -423
2938d23Q31J85o64o23L51R58L2j083m64J166Q19j022j052P09J188m32j038j03
$$ -423 408 593 -71 -694 -343 615 647 -436 -900 266 1085 63 -989 -280 908 476 -562 -665
2956f65R05M28o20o20J07Q28K94q78o70P60J091n74j254K43J282J45j129m57Q91
$$ -665 240 668 48 -572 -465 363 657 -221 -891 -131 960 386 -868 -625 657 802 -327 -784 107
2975A07O16m15p50m8P62M52o25q61L48J190j40j189l27J257N30j018o77N86Q35
$$ 107 723 308 -442 -490 272 724 99 -762 -414 776 636 -553 -880 377 907 -111 -788 -202 633
2994F33k10q41k08O65N59l24q90M4J026L68j068o13R07Q49o59r98L55R31J8p61
$$ 633 423 -418 -626 39 598 274 -616 -572 454 822 -246 -859 48 897 238 -760 -405 526 544 -217
3014b17l79M94O17j57p46k49P38O93p38q60N58R88k71j037p2R61K97o30o01M07
$$ -217 -596 -102 515 358 -388 -637 101 794 56 -804 -246 742 471 -566 -638 323 620 -10 -611 -204
3034b04O06N3o29m57N84P58l81r14N7J030J74r59m00P36O03m43p10J14O34K29
$$ -204 402 455 -174 -631 -47 711 330 -584 -527 503 677 -282 -682 54 657 214 -496 -382 252 481
3054D81n15n48K89P94m9q30k78Q48M87o62o97M69P85k26o84j17N51M13l53n85
$$ 481 -34 -582 -293 501 452 -378 -656 192 679 17 -680 -211 574 348 -336 -453 98 511 158 -427
3074d27J80N76K59p02n51O01P61l60q58P4Q22J74o95m60N06N50j64n69j98N66
$$ -427 -247 329 588 -114 -665 -64 697 337 -521 -447 375 549 -146 -606 -100 450 286 -283 -481 85
3094H5M26m32o72K29Q73J6q82k41P51M62n90m98K67N71%n21l03L96N01j78o79
$$ 85 511 79 -593 -364 509 525 -357 -598 153 615 25 -473 -206 365 365 -156 -459 -63 438 260 -419
3115d19p6Q06K30o43n35N14O70l12o80LP02K14n11m10K80N52N9o75l27O43O13
$$ -419 -495 311 541 -102 -637 -123 547 235 -445 -442 260 474 -37 -447 -167 385 444 -231 -558 85 698
3136F98n54o80J92P62j3o94j79N80L69l88m59KN75K43n06n05M29O15j92p45J9
$$ 698 144 -536 -344 418 405 -289 -468 112 481 93 -366 -364 211 454 -52 -557 -128 487 295 -450 -431
$$ [...]
8191D8
##END NTUPLES=NMR FID
##END=
