##TITLE=1H_LY-DMAA.Per.3.10
 CDCl3
 8 sc, 
 14.02.2022
##JCAMPDX= 6.0         $$ Bruker NMR JCAMP-DX V2.0
##DATA TYPE= NMR FID
##DATA CLASS= NTUPLES
##ORIGIN= UXNMR, Bruker Analytische Messtechnik GmbH
##OWNER= root
$$ XWIN-NMR		Version 3.5
$$ Mon Feb 14 13:18:37 2022 Russian Standard Time (UT+4h)  she@DPX200
##.OBSERVE FREQUENCY= 200.131346
##.OBSERVE NUCLEUS= ^1H
##.DELAY= (6, 6)
##.ACQUISITION MODE= SIMULTANEOUS
##.ACQUISITION SCHEME= undefined
##.AVERAGES= 24
##.DIGITISER RES= 18
##SPECTROMETER/DATA SYSTEM= spect
##.PULSE SEQUENCE= zg30
##.SOLVENT NAME= CDCl3
##.SHIFT REFERENCE= (INTERNAL, CDCl3, 0, 15.7039)
##AUDIT TRAIL= $$ (NUMBER, WHEN, WHO, WHERE, WHAT)
$$ ##TITLE= Audit trail, XWIN-NMR		Version 3.5
$$ ##JCAMPDX= 5.01
$$ ##ORIGIN= Bruker BioSpin GmbH
$$ ##OWNER= she
$$ F:/spectra/data/she/nmr/H-F/1/audita.txt
$$ ##AUDIT TRAIL=  $$ (NUMBER, WHEN, WHO, WHERE, WHAT)
(   1,<2022-02-14 13:16:31.73 +0400>,<she>,<DPX200>,
      <created by zg, POWCHK disabled, PULCHK disabled
       configuration hash MD5:
       00 E9 B6 7A A2 85 ED C7 34 08 36 98 17 FE 4E 26
       data hash MD5: 16K
       2B 19 99 B9 16 85 A2 28 C2 E3 9C A5 43 B5 79 F4>)
$$ ##END=
$$ 
$$ hash MD5
$$ CE 71 67 BA FF 8A 87 E3 7A 3F CC D5 86 2A B4 9C
##$RELAX= 
##$RELAX= 
##$RELAX= 
##$RELAX= 
##$RELAX= 
##$RELAX= 
$$ Bruker specific parameters
$$ --------------------------
##$DU= <F:/spectra>
##$EXPNO= 1
##$NAME= <H-F>
##$PROCNO= 1
##$TYPE= <nmr>
##$USER= <she>
##$AMP= (0..31)
100 100 100 100 100 100 100 100 100 100 100 100 100 100 100 100 100 100 
100 100 100 100 100 100 100 100 100 100 100 100 100 100 
##$AQSEQ= 0
##$AQ_mod= 1
##$AUNM= <au_zg>
##$AUTOPOS= <>
##$BF1= 200.13
##$BF2= 200.13
##$BF3= 200.13
##$BF4= 200.13
##$BF5= 200.13
##$BF6= 200.13
##$BF7= 200.13
##$BF8= 200.13
##$BYTORDA= 1
##$CFDGTYP= 0
##$CFRGTYP= 5
##$CHEMSTR= <none>
##$CNST= (0..31)
1 1 145 1 1 1 1 1 1 1 1 1 1 1 1 1 1 1 1 1 1 1 1 1 1 1 1 1 1 1 1 1 
##$CPDPRG= <>
##$CPDPRG1= <>
##$CPDPRG2= <>
##$CPDPRG3= <>
##$CPDPRG4= <mlev>
##$CPDPRG5= <mlev>
##$CPDPRG6= <mlev>
##$CPDPRG7= <mlev>
##$CPDPRG8= <mlev>
##$CPDPRGB= <>
##$CPDPRGT= <>
##$D= (0..31)
0 1.2 0 0 0 0 0 0 0 0.06 0 0.03 0 0 0 0 0.0002 0 0 0 0 0 0 0 0 0 0 0 0 
0 0 0 
##$DATE= 1644830191
##$DBL= (0..7)
120 120 120 120 120 120 120 120 
##$DBP= (0..7)
150 150 150 150 150 150 150 150 
##$DBP07= 0
##$DBPNAM0= <>
##$DBPNAM1= <>
##$DBPNAM2= <>
##$DBPNAM3= <>
##$DBPNAM4= <>
##$DBPNAM5= <>
##$DBPNAM6= <>
##$DBPNAM7= <>
##$DBPOAL= (0..7)
0.5 0.5 0.5 0.5 0.5 0.5 0.5 0.5 
##$DBPOFFS= (0..7)
0 0 0 0 0 0 0 0 
##$DE= 6
##$DECBNUC= <off>
##$DECIM= 32
##$DECNUC= <off>
##$DECSTAT= 4
##$DIGMOD= 1
##$DIGTYP= 9
##$DL= (0..7)
0 120 120 120 120 120 120 120 
##$DP= (0..7)
150 150 150 150 150 150 150 150 
##$DP07= 0
##$DPNAME0= <>
##$DPNAME1= <>
##$DPNAME2= <>
##$DPNAME3= <>
##$DPNAME4= <>
##$DPNAME5= <>
##$DPNAME6= <>
##$DPNAME7= <>
##$DPOAL= (0..7)
0.5 0.5 0.5 0.5 0.5 0.5 0.5 0.5 
##$DPOFFS= (0..7)
0 0 0 0 0 0 0 0 
##$DQDMODE= 0
##$DR= 18
##$DS= 0
$$ [...]
##$SUBNAM2= <"">
##$SUBNAM3= <"">
##$SUBNAM4= <"">
##$SUBNAM5= <"">
##$SUBNAM6= <"">
##$SUBNAM7= <"">
##$SUBNAM8= <"">
##$SUBNAM9= <"">
##$SW= 18.0517287032376
##$SWIBOX= (0..15)
0 0 2 0 0 0 0 0 0 0 0 0 0 0 0 0 
##$SW_h= 3612.71676300578
##$TD= 16384
##$TD0= 1
##$TE= 0
##$TE2= 300
##$TE3= 300
##$TEG= 300
##$TL= (0..7)
0 120 120 120 120 120 120 120 
##$TP= (0..7)
150 150 150 150 150 150 150 150 
##$TP07= 0
##$TPNAME0= <>
##$TPNAME1= <>
##$TPNAME2= <>
##$TPNAME3= <>
##$TPNAME4= <>
##$TPNAME5= <>
##$TPNAME6= <>
##$TPNAME7= <>
##$TPOAL= (0..7)
0.5 0.5 0.5 0.5 0.5 0.5 0.5 0.5 
##$TPOFFS= (0..7)
0 0 0 0 0 0 0 0 
##$TUNHIN= 0
##$TUNHOUT= 0
##$TUNXOUT= 0
##$USERA1= <user>
##$USERA2= <user>
##$USERA3= <user>
##$USERA4= <user>
##$USERA5= <user>
##$V9= 5
##$VALIST= <valist>
##$VCLIST= <CCCCCCCCCCCCCCC>
##$VD= 0
##$VDLIST= <DDDDDDDDDDDDDDD>
##$VPLIST= <PPPPPPPPPPPPPPP>
##$VTLIST= <TTTTTTTTTTTTTTT>
##$WBST= 1024
##$WBSW= 4
##$XGAIN= (0..3)
0 0 0 0 
##$XL= 0
##$YL= 0
##$YMAX_a= 154100
##$YMIN_a= -149405
##$ZGOPTNS= <>
##$ZL1= 120
##$ZL2= 120
##$ZL3= 120
##$ZL4= 120
##$ABSF1= 10
##$ABSF2= 0
##$ABSG= 5
##$ABSL= 3
##$ALPHA= 0
##$AQORDER= 0
##$ASSFAC= 0
##$ASSFACI= 0
##$ASSFACX= 0
##$ASSWID= 0
##$AUNMP= <proc_1d>
##$AZFE= 0.1
##$AZFW= 0.1
##$BCFW= 1
##$BC_mod= 2
##$BYTORDP= 1
##$COROFFS= 0
##$CY= 11.3945322036743
##$DATMOD= 1
##$DC= 2
##$DFILT= <>
##$DTYPP= 0
##$F1P= 2.36226072786647
##$F2P= -0.459571619588291
##$FCOR= 0.5
##$FTSIZE= 0
##$FT_mod= 4
##$GAMMA= 1
##$GB= 0.15
##$INTBC= 1
##$INTSCL= 1
##$ISEN= 128
##$LB= 0.24
##$LEV0= 0
##$LPBIN= 0
##$MAXI= 10000
##$MC2= 0
##$MEAN= 0
##$ME_mod= 0
##$MI= 1.114404
##$NCOEF= 0
##$NC_proc= 0
##$NLEV= 6
##$NOISF1= 3.799351
##$NOISF2= 2.8
##$NSP= 1
##$NTH_PI= 0
##$NZP= 0
##$OFFSET= 15.70392
##$PC= 1
##$PHC0= -16327.09
##$PHC1= 35.40078
##$PH_mod= 1
##$PKNL= yes
##$PPARMOD= 0
##$PSCAL= 0
##$PSIGN= 0
##$REVERSE= no
##$SF= 200.130013532006
##$SI= 16384
##$SIGF1= 3
##$SIGF2= 2
##$SINO= 400
##$SIOLD= 16384
##$SREGLST= <1H.CDCl3>
##$SSB= 0
##$STSI= 0
##$STSR= 0
##$SW_p= 3612.71676300578
##$SYMM= 0
##$S_DEV= 0
##$TDeff= 0
##$TDoff= 0
##$TI= <>
##$TILT= no
##$TM1= 0
##$TM2= 0
##$TOPLEV= 0
##$USERP1= <user>
##$USERP2= <user>
##$USERP3= <user>
##$USERP4= <user>
##$USERP5= <user>
##$WDW= 1
##$XDIM= 8192
##$YMAX_p= 0
##$YMIN_p= 0
$$ End of Bruker specific parameters
$$ ---------------------------------
##NTUPLES= NMR FID
##VAR_NAME=  TIME,          FID/REAL,        FID/IMAG
##SYMBOL=    X,             R,               I
##VAR_TYPE=  INDEPENDENT,   DEPENDENT,       DEPENDENT
##VAR_FORM=  AFFN,          ASDF,            ASDF
##VAR_DIM=   8192,          8192,            8192
##UNITS=     SECONDS,       ARBITRARY UNITS, ARBITRARY UNITS
##FACTOR=    0.0002768,     1,               1
##FIRST=     0,             0,               0
##LAST=      2.2672688,     0,               0
##MIN=       0,             -149405,         0
##MAX=       2.2672688,     154100,          0
$$ Real data points
##PAGE= N=1
##DATA TABLE= (X++(R..R)), XYDATA
$$ [...]
550D04L0o84j663J977L248k762m761K926N808k600o326J838O098r31n146mL606
567A058O95j577j025m87R01K534l30m153m81N186J530n518k460N184L152m227
583a8l442K828L162j285k411k96J222J486K37k334j759K616L085k377m068J757
599a597M511q29m379r4L746Q89k620j357J289J479J24j166j380N66K294K29k821
616a116j078K851J826k545k325J870K454j048k236J89J673M73q58r19j1J039R18
633A157q48j636M72K149P4k298o13K128J094j720j344J098J356m29j121j74O00
650e5O08oq41o98Q22J285o24j722K88J921J24j910m53J682P01j215p23O83O13
669D80j20k47l53k06P24O76r14j177R98J509r30j748P55J712n86j551L97J177
$$ y = [404, 434, -250, -1913, 64, 3312, 550, -4211, -1285, 4523, 1923, -4403, -2565, 3533, 2602, -2544, -2548, 1058, 1753, 176, -849, -1336, -435, 2099, 1769, -2384, -2865, 2321, 3851, -1667, -4127, 1057, 4209, -18, -3460, -632, 2530, 1245, -1166, -1462, -240, 1246, 1483, -851, -2610, 6, 3091, 714, -3354, -1597, 2914, 2085, -2294, -2388, 1358, 2247, -373, -1730, -441, 1038, 1162, -4, -1384, -818, 1476, 1705, -1116, -2194, 657, 2483, -62, -2387, -517, 1937, 889, -1347, -1158, 515, 988, 130, -789, -800, 239, 1157, 309, -1327, -855, 1294, 1368, -930, -1543, 585, 1679, -41, -1385, -287, 1069, 640, -481, -655, -55, 553, 547, -294, -992, -170, 1115, 491, -1231, -943, 978, 1102, -808, -1261, 421, 1122, -93, -816, -133, 480, 360, 113, -240, -446, 278, 954, 40, -1137, -139, 1370, 440, -1308, -553, 1159, 573, -978, -581, 596]
687E96k95p02K27J42k64M20L69q84m58J286O10j537o44J680O51j675n19J596L38
706I37j414r8J204k45r25N07O29q11l48J022j4j207L70J273p42j294J104J224
724A172j386j121J665R63j742p89J760N63j580k95J313l4r08M75M13r40J02J417
742A048n79j915R57K282j236k545J285K618j228k426J007K013p43j330M75M74
758A57k85N38K24j516k54K427L92l076o00L464Q51l481j077L140J108k468j010
775a466J557O39n62q1m66o66J338J478k011k277K402K952k476l326K245L420j803
792H97l057J246K400o29j378J18J55K17J187m10k401L41L394j41m083j76M269
809A949M95m084p19L416P63k474o12J350K15j59M12r46j088J843J833k441k402
$$ y = [596, 301, -401, -174, -32, -296, 124, 493, -391, -849, 437, 1047, -490, -1134, 546, 1197, -478, -997, 599, 937, -477, -575, 629, 384, -541, -34, 595, -216, -564, 458, 444, -763, -393, 880, 138, -1156, -52, 1172, -214, -1335, 330, 1293, -449, -1238, 522, 1085, -495, -790, 523, 489, -419, 56, 469, -471, -369, 1048, 469, -1446, -489, 1793, 557, -1988, -703, 1915, 687, -1739, -732, 1281, 538, -792, -317, 157, -128, 410, 634, -882, -1136, 1291, 1683, -1393, -1993, 1471, 2322, -1159, -2236, 904, 2012, -456, -1466, 91, 730, 168, 87, -379, -1045, 293, 1771, -240, -2517, -115, 2837, 361, -2965, -720, 2700, 897, -2160, -914, 1486, 857, -521, -403, -248, -31, 1156, 746, -1655, -1314, 2080, 1939, -2144, -2320, 1949, 2444, -1640, -2359, 1057, 1820, -654, -1266, 84, 299, 140, 552, -394, -1482, 361, 2194, -247, -2649]
826b649K781K786k771k877K520K670k105k139J606J300j096l62O84p21l64J698
842I61J26k563J2L167j45l419K23L372l37l036N37K474p95j709J115R49j451j48
860f67J773n82j979J205K027j689j902K017J585k224j115K306N02k338J11K307
876A337p49k196J290J981j648j689J895J263j946o58J856rj663Q04J387j561j153
893a459K328Q81k927o72L266N31l372m10L132K25k617qJ800l68q17Q04j88j340
911a211J184J941j996k478K554K946k778l160K711L120k302k724J713K010j052
926D78r89L98k42Q9J571m58k817N47L774m28m460J72M649J69m387m68L621O69
944A888k503o19J128L70L38J58j679q32K809J647l560k385L880K977l762l235
$$ y = [-2649, 132, 2918, 147, -2730, -210, 2460, 355, -1784, -178, 1122, 26, -336, 348, -373, -737, 961, 1087, -1476, -1464, 1703, 1558, -1861, -1638, 1734, 1397, -1639, -1102, 1372, 577, -1132, -17, 932, -519, -667, 1106, 524, -1455, -250, 1777, 88, -1814, 203, 1788, -436, -1551, 755, 1257, -1081, -970, 1337, 588, -1608, -318, 1663, 15, -1674, 221, 1484, -462, -1120, 736, 727, -936, -132, 1255, -306, -1459, 869, 1750, -1177, -1849, 1417, 1948, -1424, -1834, 1298, 1523, -1094, -1102, 698, 330, -487, 317, 129, -1211, -27, 1914, -82, -2560, -6, 2940, 162, -2998, -287, 2833, 531, -2193, -480, 1530, 478, -511, -113, -355, -266, 1305, 847, -1970, -1423, 2351, 1923, -2537, -2365, 2284, 2453, -1934, -2402, 1219, 1888, -615, -1234, -106, 264, 602, 760, -919, -1751, 1058, 2705, -855, -3240, 640, 3617, -145, -3380]
960c380L213L141k413k658J426J706m16n56l89q36R75K198j308l398J365M236
976B906j134m624P56M561l48l981ML010K07j700j96L18r0J070M97k249j029L115
994A093J547l620j996L704K221l434k175K836J833k069j236J235M11m51N98j91
1010C06j581P07K464r88l103J142L429j143l430J099L032j021k369R55J513j019
1026gn68J137m35j275J249J406j913j464K338J399k528j191K537Q30k324l12K066
1043I45k61j712Q85J367j468r84J901O74k205l12K247n4k108M13J807q52j382
1060a099J286Q45j770l24K181j99k468N60K621q22k533R72K271j015j720J029
1076a85J024j051j49J106p66j177J626J315k327j449K782J541k948j568K772J463
$$ y = [-3380, -167, 2974, 561, -2097, -671, 1035, 619, 63, -326, -1162, -187, 2011, 703, -2695, -1330, 2906, 1772, -2852, -2096, 2465, 2117, -1864, -1860, 1150, 1357, -343, -539, -221, -311, 759, 1256, -993, -2022, 1093, 2640, -980, -2976, 728, 2949, -485, -2660, 176, 2009, -60, -1296, -61, 350, -101, 497, 306, -1275, -568, 1896, 908, -2195, -1053, 2376, 1233, -2197, -1098, 1934, 913, -1456, -501, 1012, -7, -575, 562, 127, -1148, 101, 1507, -406, -1870, 468, 1867, -661, -1852, 685, 1515, -809, -1121, 945, 684, -1028, -143, 1224, -244, -1228, 673, 1347, -858, -1170, 1077, 1023, -1085, -672, 1135, 283, -1099, 187, 1032, -738, -1062, 1119, 920, -1548, -988, 1633, 811, -1722, -750, 1521, 506, -1214, -185, 839, -212, -361, 745, -21, -1198, 428, 1743, -584, -2033, 749, 2290, -658, -2226, 546, 2009]
1092B009k385j160J728O37r64L9J92q34M56J704r60k503J288L105j319l460J184
1109a243L507q98l151N49K469k18j498J2L23jQ85J30k003m42K900P99l441j249
1127b570L653J545l408j697K834J642k016j263J037O45m5K03p93j123J441K009
1143B094j786k776J861L273j685l487J328L263q90k660M14J764q3o77j25m54R8
1160e28J563M2k459l33L075P22l359r96L270J209k832j187K161R82j318n75M95
1177f8o0K79P78r13j494J326K085j559k499J541K627j389k499J144K058q79j390
1194i12O43O22n24K31N05j004n31J669N96k117o42K342O78k317o05K086M28j733
1212e85j35J272k79p81P14L12j157P5J499l59j762N77J807p01j680P82J425q79
$$ y = [2009, -376, -1536, 192, 829, -135, -96, 96, -738, -282, 1422, 462, -2041, -753, 2352, 1033, -2427, -1243, 2264, 1366, -1785, -1236, 1233, 1015, -483, -471, -148, -149, 736, 866, -1137, -1579, 1321, 2120, -1321, -2570, 1083, 2628, -780, -2477, 357, 1999, -17, -1280, -243, 402, 357, 560, -233, -1356, 85, 2094, 308, -2468, -607, 2666, 981, -2506, -1178, 2085, 1195, -1465, -1051, 713, 630, -47, -172, -626, -528, 1035, 1077, -1382, -1715, 1360, 2082, -1277, -2273, 997, 2206, -626, -1813, 348, 1330, 12, -563, -68, -128, 151, 929, 16, -1478, -152, 1933, 374, -2125, -584, 2043, 654, -1845, -701, 1357, 478, -912, -269, 353, -171, 60, 565, -439, -970, 699, 1295, -822, -1464, 878, 1556, -761, -1366, 720, 1148, -585, -720, 552, 273, -508, 206, 518, -639, -564, 935, 576, -1186, -609, 1198, 497, -1183, -401, 1024, 145]
1230A45r98R70N30j065j4J202m72j293Q65J322j108j297J238J136j259q62J171
1247B11M40j019KQ67n51p32J090O16j512n32J828M82j932m41J854M01j587k62
1265g77J220K4p06K99J50o78L28J085p48j433R82J721j090j908R98J912q65j703
1283a189O34J283l84o98J90J7q6O92J23j348k05J852L96k148n62K196P65k030
1301e02q38J640P66j080n60M60K02J30K59o53q07J001J307j210j719J206J970
1318A572j059k012P86J831m38j451J59Q67J20j96j87n11J52J179j7j663k21J957
1336H68M91k052o95J865Q08j512q09J009O44m63l38l2j30M92N81q01j024R53J412
1355A267r62j608Q06J679n91j528L97J170j68p25M5J59LL65M6q26k19J228L30
$$ y = [145, -853, 117, 647, -418, -432, 770, 298, -995, -130, 1192, 84, -1213, 25, 1161, -98, -960, 211, 651, -368, -366, 501, -50, -782, 308, 924, -588, -1120, 708, 1190, -742, -1183, 671, 1072, -515, -777, 443, 467, -239, 60, 210, -468, -140, 945, 197, -1236, -254, 1467, 377, -1531, -533, 1379, 514, -1189, -555, 728, 344, -354, -164, -147, -233, 459, 582, -766, -971, 881, 1277, -871, -1433, 763, 1528, -502, -1340, 300, 1066, -14, -574, -114, 88, 218, 477, -176, -983, 18, 1325, 115, -1604, -398, 1572, 513, -1499, -713, 1118, 680, -771, -612, 255, 375, 179, -8, -519, -367, 812, 795, -868, -1089, 868, 1359, -693, -1388, 477, 1285, -227, -1036, -27, 617, 154, -184, -216, -346, 146, 727, -74, -1098, -145, 1267, 305, -1303, -497, 1182, 591, -937, -540, 630, 462, -263, -218, -59, -56, 309, 355, -471, -690, 538, 868]
1374H68j424n00J462O24j377o02J095N63p88l64M64P2j38K88j29n98L01Q98l63
1393C52j139M07J193l44j175K88R82k36o96K08L46k50m1L45l04m31N37N45p34
1412a47o04P96O64p69n98O75M79n32k59M11Lk75K92J88n53j14P43J21q96j73R40
1433C92J71q81j67P13J02n15NK47j78J2L21j60n33L06P20l77q19L68Q69l13p94
1454e11K25O58j25m23Q8J20o1J62J07m47j94O60K99p98m00Q09M88p53n27O05M71
1475D53l72l55J64J79nJ03j60l77K80N85k60p76K24Q96j19r13j1Q00Q7o08j48
1496c33L47J50o3j11j99l5M15K16n78l74O32N42o10o13N05O32l38n69J67M44L
1517B30k17j15l9J94K67j59n25Q7O73j0p43j20P13K24o37k81M51L11k83k51P2
$$ y = [868, -556, -1056, 406, 1030, -347, -949, 146, 709, -79, -443, 21, 93, -45, 243, 114, -484, -183, 715, 352, -787, -380, 813, 469, -706, -418, 564, 328, -368, -160, 186, -64, -105, 240, -64, -495, 42, 587, -147, -751, 45, 709, -60, -658, 17, 496, -36, -295, 116, 119, -156, 136, 324, -229, -343, 400, 521, -375, -548, 392, 563, -318, -485, 228, 330, -185, -180, 67, -111, -99, 222, 62, -471, -165, 555, 178, -641, -273, 596, 283, -511, -286, 372, 247, -176, -88, 32, -29, 133, 240, -207, -401, 259, 558, -240, -640, 169, 657, -96, -623, -18, 453, 81, -274, -110, 69, 64, 167, 7, -370, -90, 495, 235, -541, -317, 579, 460, -453, -464, 336, 423, -185, -333, 14, 164, 101, -10, -209, -244, 171, 387, -191, -565, 67, 609, -1, -614, -109, 523, 185, -384, -217, 227, 230, 13, -102, -141, 53, 320, 161, -364, -277, 396, 386, -357, -477, 236, 460, -177, -458, -7, 304, 21, -230, -158]
1538a58J28J41N0k82k31L62M07l53n25L18O03k04o06P8N41K8l95o3J69R1K3r6
1560B6j91%L49R4m69k14M92K99m63l61L78L91k61l51J56K52m0r0n5m7J03K22j16
1583A04l63N3M92Ln42m3N16Q4m41j33L27J40k02r9N5MQ8Q6j74j92K26L14k62l86
1607c45K65M25k07m23J59L67r5k92P4J54n5k7P5j15j11K42J02l08j67L39J97l69
1629a15j79L50J52l03j20K82N3j96M2J54j51o0K10N3k89mL27l4l73P1L65j16l24
1652b05J36K81k18k22K46J34k63q2K81lk89O2L13j47k62K34J94k75j30L38P0l78
1674a85J3M07r4l79J33L83j67l54K13K89k61j82K48P2k88O8K77j97k90L10K62
1695B78l92k51M40K40m78j94M71J42m15k9L04l5k36J76J41l02m7M23l5n06J10
$$ y = [-158, -30, 111, 161, -121, -352, 10, 417, 64, -461, -143, 460, 256, -350, -272, 269, 297, -98, -161, 8, 99, 122, 26, -165, -165, 184, 278, -191, -405, 87, 386, -77, -438, -60, 331, 70, -281, -125, 127, 87, -3, -58, -105, -2, 220, 104, -259, -206, 286, 289, -253, -296, 220, 304, -137, -270, 57, 197, -5, -104, -49, -45, 43, 129, -45, -237, -11, 303, 41, -345, -80, 345, 138, -285, -126, 241, 146, -146, -72, 82, 27, 0, 75, -40, -151, 91, 193, -115, -282, 57, 254, -115, -294, 56, 208, -95, -215, 67, 120, -76, -34, 120, -31, -91, 119, 172, -117, -121, 206, 172, -201, -130, 235, 119, -205, -69, 212, -6, -228, 18, 152, -111, -193, 88, 85, -204, -142, 171, 24, -238, -4, 190, -85, -215, 123, 193, -185, -172, 235, 141, -238, -105, 278, 111, -243, -30, 259, -2, -184, 64, 136, -152, -84, 193, -4, -294, 16, 278, -114, -365, 75, 315, -163, -357, 114, 256, -159, -188, 116, 81, -155, 21, 162, -140, -187, 236, 201, -305, -195]
1716a95N54j63n85J99N48k22m84K36L56k32k15K61K6k53J34K95k92l19M33L26
1736D08n25k96N59K80n84k08N22J33m79j9L75j13k64K55J22l73l9M80k9n68J34
1757b29O04k23n74K71N59l13m58L82L32m10j45L94J5m10J27M09k88l83M44K83
1777C87n33k07N58J38o17o3O20q2n59J49N36k69m38L57L12l96j66M49mm32J56
1798a04M53l13m33M60L99n74l32O73K50o98j75O54R5o09N2M58j95l05L17J49m72
1819b50K4N82j78o84L07P34l62p68M24P20m18o17L88M64l53k25K99k3k73K97K46
1840C34n32k60P56K36q88k56R34K62r20k30Q19J58o30o2M17p0j74K77r7m45L09
1861f2O18m50p79N21Q99n84q72N34Q13m93o46L80M01k89j07K01j96j71M85J69
$$ y = [-195, 359, 196, -389, -190, 358, 136, -348, -112, 244, 12, -203, 58, 84, -169, -35, 260, -32, -351, 82, 408, -117, -413, 146, 426, -158, -366, 156, 289, -190, -209, 166, 53, -211, 44, 166, -207, -246, 234, 205, -363, -229, 375, 152, -422, -151, 408, 95, -363, 19, 351, -59, -204, 190, 205, -205, -78, 331, 43, -340, 104, 387, -146, -353, 205, 343, -274, -337, 283, 201, -358, -209, 327, 58, -380, -23, 289, -107, -273, 176, 172, -260, -104, 349, 36, -397, 63, 462, -112, -444, 229, 479, -219, -394, 260, 355, -254, -202, 256, 61, -244, 73, 222, -250, -226, 356, 178, -506, -199, 535, 173, -595, -171, 549, 131, -486, -98, 366, 13, -212, 87, 64, -209, 88, 334, -198, -458, 298, 534, -354, -610, 324, 586, -334, -564, 255, 413, -217, -279, 138, 68, -106, 171, 74, -371, -62, 556, 106, -673, -152, 747, 163, -709, -175, 638, 145, -501, -121, 280, -9, -116, 85, -111, -282, 203, 372]
1881C72p50j69R53J93j043j96J031K01r32j47P57Q9n21L9K69j96k9L78j81o15
1901d97L95P30n12q15N41Q40n61p86N15O50m91m14L99J52l43J27L08l85k75O35
1921B13K62p84k29Q72K25r21j15Q44L0p03R4N38k45l59M07J65n66L1O36j45p47
1942d97K73P14l63o62M24N60m75l93N07K21n68%N87j90o20L95N86m72n66N85M40
1963D86n81l16N86J21n34R4M51l06l87N13L24o95k65Q13K09q56j50Q71M6p28P
1984b97N76j43l47K94Q8m31R7O19k99p59M39Q47n08r08M97Q74m84p26M08M98l08
2005B7k25K39j05j64M02J89p00j94R22K40j053k82J102L04r88k91P96K31n24j13
2025a87K29o4L7K96l13n28M78P54o05r20O05J000n57r76M50Q38l12o19J88L01
$$ y = [372, -378, -547, 406, 599, -444, -640, 391, 592, -340, -487, 270, 359, -162, -123, 146, -50, -79, 299, 118, -497, -102, 628, 116, -699, -158, 682, 121, -665, -150, 500, 9, -405, -6, 146, -197, -70, 238, -147, -422, 213, 475, -309, -538, 334, 559, -362, -477, 367, 397, -306, -212, 326, 81, -278, 129, 294, -272, -241, 395, 250, -497, -224, 490, 127, -535, -111, 449, -26, -419, 88, 309, -259, -259, 328, 138, -482, -87, 499, 27, -539, 46, 486, -95, -411, 175, 296, -238, -144, 307, 1, -386, 127, 451, -244, -509, 304, 513, -343, -493, 378, 424, -304, -297, 279, 136, -211, 83, 171, -260, -163, 456, 157, -602, -163, 684, 176, -732, -235, 639, 155, -571, -163, 335, 27, -198, 41, -64, -228, 174, 363, -337, -531, 391, 631, -422, -704, 398, 702, -286, -577, 219, 450, -74, -187, 42, -22, 15, 311, -2, -530, -52, 702, 97, -823, -218, 782, 225, -751, -301, 537, 225, -394, -206, 95]
2045I5q2Q5M3m38l4P42J01r82j52J099K59j115l13J020K91q13k47N33J30k44K7
2066En0k33K73M93m55p14N46Q65n95r01N23Q97m54p41L38N30k46k26J48n6j32
2087a85L78J49o56j83Q36K13r16k35R04K21p89j90O43Q6m27M5K34k54JM07j40
2108A42n73K53P20l42p53L52P46l65o31L16M61l02k40K95k2k92K29L49m48l77
2128d82N86L85o53m06O77L33n72k67M83J04l18R3J91k81p6M89Ro70L8P94o4q11
2150d18P4P19k4o22M6L92q8j79J74q9k84L12L87m93n11O16N63o03o29N79O11m60
2172G3m77L07L23j90q0O7j89M6M59j02o60N5Q58k2r28o1Q89J12p64j53N48J46
2194B57k69q4lo6K99J96n06l50O08N43p04o22O16P05n23o55L96N03j96l17J3Q0
$$ y = [95, 13, 98, 141, -297, -331, 411, 512, -470, -622, 477, 736, -379, -692, 328, 619, -194, -441, 92, 222, -22, 5, -45, -278, -5, 488, 33, -681, -135, 730, 135, -766, -243, 654, 200, -541, -203, 327, 81, -145, 3, -53, -185, 193, 342, -314, -497, 339, 552, -364, -599, 305, 526, -263, -453, 190, 276, -151, -106, 128, -126, -125, 282, 142, -431, -178, 542, 200, -553, -201, 545, 180, -451, -135, 326, 24, -216, 79, 57, -235, -6, 343, -105, -482, 104, 489, -164, -570, 107, 440, -132, -399, 84, 188, -130, -37, 154, -127, -203, 286, 295, -375, -337, 457, 393, -418, -344, 375, 351, -271, -225, 167, 79, -100, 74, -15, -299, 13, 400, -93, -604, 12, 575, -28, -657, -78, 533, 73, -404, -97, 226, 36, -44, 23, -166, -120, 339, 237, -423, -368, 490, 468, -460, -521, 368, 480, -284, -437, 111, 257, -12, -96, -99, -165, 134, 330, -176, -526, 82, 625, -79, -701, -85, 620, 97, -558, -162, 341, 145, -172, -159, -79]
2216g9R6K22j50n02J60P37j39q50K5R01N3q51j22P12J63m77j40K01R5P3K0l05
2238a57k06N07L45n78m78N85N87n67o14M43N56l18m03J43K12l1K2o8k56R1N07
2259C22r4o40M9P26Rp16l5O26P7m80n2K86K1p4O3j29j76K78L05m13l83M31M69
2282D70m34m81L56M32k82l54J96J87j29K0N2k16j6M05L0n15m8N75J09n87j00M97
2304A67J10l71q8K28Ol8Q4j02k04J91L53k89m36L07N16k94n14K12M51j58l26R2
2326a03J32l3N2J7k53k6M12Q0n19j44N74J94n61k27M83K31l46j81J68R5nL1j39
2349f8j88K65L38l28m66L23N66k80n70J86N60j05m30NK51P2m9r2j66O2L57J0n41
2372b88p4O02J37n99k49N71K45m29k60K69K00p0j05q5k8K55J82l36l50L74M88
$$ y = [-79, 17, 239, 89, -413, -253, 484, 345, -505, -480, 421, 474, -377, -499, 213, 376, -101, -241, -40, 55, 128, 148, -157, -363, 144, 489, -89, -567, 18, 605, 38, -576, -133, 423, 105, -298, -155, 57, 26, 48, -20, -276, -185, 322, 228, -412, -363, 363, 372, -344, -379, 247, 324, -156, -208, 78, 99, 25, 88, -41, -217, 61, 366, -47, -430, 1, 470, 36, -445, -89, 343, 61, -293, -97, 90, -39, -19, 33, -183, -199, 206, 236, -279, -327, 248, 357, -230, -330, 167, 277, -94, -182, 46, 52, 14, 98, -4, -208, -17, 336, 47, -389, -82, 434, 140, -374, -162, 289, 131, -195, -103, 29, -4, 48, 65, -188, -214, 198, 278, -241, -385, 189, 383, -178, -405, 78, 309, -37, -218, -50, 45, 40, 71, -68, -256, 9, 347, 19, -447, -124, 442, 162, -408, -222, 338, 233, -197, -192, 59, 131, 82, -10, -176, -114, 243, 253, -288, -362, 240, 377, -222, -471, 100, 345, -84, -344, -75, 125, 55, -50, -135, -163, 92, 274, -62, -412, -38, 450]
2393D50l46n45L00N49j69m96P2L64kj82o8j4O6K16o9l57k0N00O8n76j38N54J92
2416C49m83k01L36J96j97j22L7K4J15J02k26k06K83L38k95m25K77M65k10m50J47
2437a46L80j03k26K2O7lJ20j1k52l0L61R6m84j14M71J51m14j69L35J40k30p4J07
2460fJ3j2J01r2k35J63L31j94l73J78M09j77l68J09L23q5j82M3O9o2R8N4j88j10
2484a93L00J71l74j58L63K01l58j94K69J50j89q5R4j1nJ15r6k43J50L26j52m17
2506c36J47M46j06m18O0L34qk22nQ3mR7L3k08p8L08J34l65k02M10K48l71k76L09
2530A0K53k33j69R0R8j3L8j13j50J41K69j62l85J57M36j08m60O1M18ll21j3J69
2553A0O2k2k9j29rK61O8l42j66M16K14m20k34L58K31k45k59J77J74n6q6k9o5J28
$$ y = [450, 104, -441, -141, 408, 239, -257, -185, 179, 177, -5, -73, -87, -21, 195, 126, -231, -251, 249, 317, -259, -397, 157, 349, -134, -335, 1, 197, 0, -122, -85, -61, 54, 156, -70, -276, 7, 345, 50, -375, -98, 367, 157, -293, -146, 234, 131, -95, -73, -6, -9, 111, 100, -152, -182, 179, 275, -209, -323, 148, 299, -115, -284, 51, 191, -39, -113, -6, 7, -5, 96, 4, -231, -68, 263, 69, -304, -126, 283, 106, -262, -153, 170, 85, -97, -54, 15, -47, 51, 105, -83, -193, 107, 278, -96, -254, 109, 310, -48, -242, 27, 177, -12, -97, -3, -14, -19, 96, 0, -243, -93, 233, 81, -336, -189, 257, 151, -267, -207, 127, 119, -103, -108, -25, -29, 68, 101, -107, -185, 123, 257, -108, -310, 100, 348, -23, -299, 10, 263, 30, -139, -49, 49, 36, 74, -39, -189, -48, 221, 59, -326, -169, 267, 159, -301, -240, 178, 175, -146, -159, 10, 72, 50, 21, -108, -117, 144, 212, -130, -296, 120, 334, -86, -320, 38, 269, 24, -235, -58, 116, 60, -26, -55, -120, 8]
2577HJ59j62k74J42M06j45m27J11M20p1l53kK65N0j71k4jQJ48K4k51q7L35J32
2601B40l52j80L58K25l01k20K16J81j31j14N9pO7J00j00k16R9L06j07l59J02L37
2623B03n9l24PK85j7j90mP4j2M1N1j56q5K16J53k80j65K70K22k57j94K07J73j43
2647A6j09J00L3k0O5l6j62N6K46o8l04L5L09j2l07nK46M5j92m0R0j6J9N4j10j03
2673a70J84J58j99k20K27K44k23k33J72J93r7j35O8O4nK2j8j46L3K29rl16KL15
2697A40M3l12q0K98N7j98p3J30M0l3J6p4q1J42J59k16j94J86K62k01k51J31K87
2720A78r7k25L6J31J7l1l2q2O3J80l6k78J3L09N3l42m8K92Q5k29j14J41J03m8
2744C9o4l5j0J27Q4j85j69K15K18k03k69J56K90j18k51M3J92%r5m2j0N8J14m3
$$ y = [8, 167, 5, -269, -127, 279, 134, -293, -182, 238, 167, -186, -188, 77, 127, -44, -68, -69, -61, 87, 111, -140, -227, 108, 240, -112, -292, 66, 291, -10, -230, -14, 167, 36, -78, -19, -26, 41, 141, 41, -175, -76, 230, 123, -236, -134, 203, 144, -180, -173, 112, 95, -95, -99, -25, -37, 4, 55, -101, -186, 30, 183, -97, -262, 8, 230, -27, -221, -14, 159, 16, -93, 7, 40, 20, 85, 49, -113, -57, 189, 121, -183, -148, 161, 149, -158, -163, 83, 128, -64, -104, -14, -30, -11, 43, -67, -170, 14, 172, -27, -247, -20, 224, 1, -232, -60, 133, 36, -99, -31, 33, 28, 50, 32, -114, -81, 148, 139, -177, -175, 140, 183, -129, -209, 89, 146, -52, -125, 5, 45, 12, 28, -46, -127, 15, 174, -42, -236, -50, 212, 11, -240, -109, 178, 81, -144, -108, 23, 40, 9, -23, -105, -42, 138, 102, -176, -163, 146, 199, -143, -191, 101, 186, -43, -157, -16, 87, 39, -25, -60, -70, 57, 141, -44, -213, 2, 220, 17, -252, -96, 194, 76, -175, -132, 60, 60, -35, -77, -87, -29, 85, 42]
2768D2j87J6K75K3l06m5K96J11k75j16J92J21j11r7K7K7O3K7j29j21J60J78j62
2791Ik24J34K50j07k49N5K24l4j32pO0K6M3m4j11MK07J8k38n6K60Q1k14j02J71
2816B4J21j27r0L7N0L2j3m6q2J03J35j02k16J09K20p6k17L0K04Kj55l4Q7J5j2
2841a%r1PJ34N1j81p7J82J23j94j22J47J30j05j04M3P5J3j0l2n1O7J27q2j76N9
2867f8K10k9k16JJ98K6j53n4R4L0j5l7p1PJ09L9j50r9J64J44j70j35J31J60q0
2892C6j36M3R6K3o5j4l7N8J02m4j52M7J80j5k08k2J92N3j85n5J03P3o6l2l5K1
2918c9Q2Qj08r1J58J21j59j63J25J92r2j61K6J26L1q9m0L3O6N2o0j37M8J91j6
2943A04k10k2J94P0j91o4J25P5o2p0mM6O6k5r6l3J05J17j32j54J17J55n6j81N1
$$ y = [42, -145, -129, 146, 169, -137, -182, 114, 225, -50, -166, 26, 147, 36, -61, -34, -7, 56, 83, -46, -167, -7, 171, 9, -215, -81, 169, 62, -187, -132, 92, 58, -74, -81, -21, 5, 48, 4, -107, -103, 104, 122, -116, -172, 88, 169, -45, -147, 24, 145, 18, -72, -35, 15, 47, 34, -12, -94, 9, 144, 42, -174, -65, 155, 79, -138, -108, 96, 98, -57, -91, -4, 11, -1, -1, -92, -85, 49, 100, -81, -158, 24, 147, -47, -169, -22, 108, 3, -101, -58, 17, 30, 20, -12, -63, 4, 131, 49, -127, -68, 142, 113, -103, -102, 96, 122, -31, -85, 9, 39, 24, -13, -84, -77, 32, 71, -79, -178, -14, 130, -40, -175, -44, 116, 36, -100, -57, 39, 62, -3, -17, -54, 4, 106, 62, -90, -43, 137, 122, -86, -108, 84, 137, -48, -103, 0, 73, 7, -25, -60, -39, 43, 51, -57, -148, 10, 131, -28, -191, -66, 126, 34, -127, -101, 25, 56, -33, -73, -40, 26, 78, 18, -119, -71, 120, 104, -106, -128, 66, 136, -55, -119, 6, 81, 19, -51, -55, -9, 57, 32, -64, -97, 8, 125, -7, -161, -44, 111, 55, -126, -75]
2968g5J15J8j04m2N4N6J7o4n6K2J33j1j40l3J72M7j65n2J19J04p5q6J6N5L7k5
2994C7o4l2J06O7j10j30P2J64m9j75K3J30K1j15k7O2K2qk2m3JJ17pr7o3J38Q8
3021A06j29q6J14Q7p4n8J8O7jj3m9k0O2P6q8j00O0J13qj72QJ27J5j05n0P6M5j3
3049Hl9l1kQ6J6r8o3J19R2j06j02Q6J26p4p9L2N7J2j8m6j2M3O6n3j07M2J37j8
3077G4j49k3J71J6j08n2O3N3j9m4l7K9O6J2r5o6J06P6q2j05N0J20l7j20K5P0L8
3104C2n1j7j9M9M9l8o9J5J35Jj62nJ31N0j27l3O8O5k7o9qK7L6Pp6m0O8P4r1q6
3134a11N2J15k9j09j6J02J8o6k1K3K8M2m8n0L1R6Nj08k1J06N2r4n5O4O4l8m1j8
3162b7L5L9j8n2l6N2O8o8r2L6J16m2j09L1P6J2p2MJ9L6J0l4n1K7P1K9j04l1R8
$$ y = [-75, 40, 58, -46, -88, -34, 22, 39, -25, -81, -59, 74, 63, -77, -110, 62, 109, -56, -108, 11, 115, 40, -46, -30, 25, 62, 37, -27, -59, 47, 114, 4, -126, -54, 110, 61, -114, -91, 39, 60, -55, -82, -20, 2, -6, -28, -71, -70, 47, 40, -57, -120, 18, 106, -23, -109, 5, 92, 18, -40, -22, 45, 44, 31, -18, -38, 24, 100, 12, -88, -28, 85, 77, -95, -87, 40, 55, -50, -100, -24, 21, 8, -31, -62, -64, 22, 38, -60, -123, -4, 88, -18, -120, -34, 92, 18, -61, -29, 28, 40, 22, -24, -36, 7, 73, 20, -87, -45, 92, 74, -75, -98, 73, 89, -19, -71, -8, 45, 26, -18, -55, -26, 40, 52, -43, -109, -3, 73, -9, -114, -64, 56, 19, -101, -76, -6, 32, -19, -36, -55, -6, 43, 5, -64, -49, 86, 87, -75, -80, 51, 101, -26, -59, 9, 74, 47, -22, -30, -3, 33, 40, -36, -76, -8, 66, -25, -111, -59, 56, 27, -82, -98, 4, 22, -44, -65, -42, -14, 28, -20, -70, -39, 57, 62, -46, -67, 39, 91, -3, -58, 6, 70, 32, -9, -27, 8, 47, 29, -23, -59, -7, 61, -7, -99, -63, 53, 11, -98, -67, 9, 21, -51, -47, -28, 8, 18, -16, -67, -40, 31, 60, -44, -75, 23]
3191B3N5q7n3M5N7k8m4LL5QJ1l6l0M8N7m3p8M5P5k6r8PQ4J0p1j0J0L2Mk2k7j1
3223e5O0K7r9j1Q5M2p9m2N7O7m3l1PK0K3J1l2k9J4O9j1r8PQ3J1q1j7P7K1p6j0
3254c3RJ9K0k8l5KL9J4n8n0P6O5o6n2K9P2j1n8J2K3K9j4l3KJ9P2l3q8L2R0Lq3
3286a5j5O6Ml6n4L8J1J0k6l1L4K0Nm4k9L8O5n3p1N0O6j9n4qK6L3j4l3JK1L8k2
3318Bn7J6P1K4p6l5R3K1n2o0M1L9qqm9J1L6M4m7m8L0O6m6o1J2P7l6o2K7K0J2k9
3350c2j1mJ8J9J1o9K1O1Qp9mO8K3m8k2L1L5J3k9oRJ7J0m9k8L6M5k8o6K5O0l2n0
3383d7nL5K7l6Pj0kJ8mo3J2Q1J9o5n0P3L5k9m3K5L8J5k8onK1K4m5l6N4N5m0n8
3416c3J6P1k2m5l3M4Rj3l5J6J8K1j6n4JM7L5o2m4P0M0n4m6M0L3J5m6J3J9J2Qm2
$$ y = [23, 78, -9, -62, -17, 40, 12, -32, -29, 6, 14, 25, -11, -41, 7, 64, 21, -57, -12, 63, 37, -61, -54, 30, 40, -31, -41, -31, 1, 5, -17, -44, -55, 5, 32, -67, -78, 7, 49, -30, -72, -15, 52, 9, -22, -15, 5, 28, 39, 7, -22, -8, 61, 50, -48, -41, 42, 53, -28, -45, 32, 53, -23, -33, -24, -5, 15, -13, -48, -46, -7, 7, -51, -101, -25, 40, -26, -78, -49, 23, 12, -46, -34, -11, 18, 4, -29, -27, -8, 64, 31, -57, -25, 65, 68, -15, -30, 36, 40, 4, -50, -12, -1, 9, -17, -48, -14, 6, 11, -33, -62, -24, 41, -12, -83, -33, 33, 14, -40, -48, -22, 11, -3, -36, -35, -14, 24, 2, -55, -39, 32, 56, -20, -55, 38, 59, 7, -53, -12, 27, 19, 11, -38, -27, 9, 53, 6, -42, -12, 54, 8, -53, -41, 36, 0, -62, -35, -15, -3, -32, -43, -47, -29, -10, 1, -68, -47, 14, 22, -57, -61, 7, 30, -18, -40, -9, 26, 39, 10, 4, 13, 30, 40, -9, -37, -1, 44, 16, -50, -25, 35, 3, -47, -52, -17, 10, -26, -19, -29, -31, -13, -17, -80, -68, 13, 32, -33, -83, -10, 25, -4, -47, -22, 16, 31, 3, -3, -8, 13, 37, -8, -44, 10, 65, 25, -33, -17, 54, 32, -13, -46, -2, 7, -6, -41, -25, -7, 14, -2, -56, -55, -8, 27, -35, -79, -9, 31, -23, -69, -29, 4, 19, -27, -14, 5, 17, 25, -17]
3448a7oK5N7m1m7J3N2Qo2J2K6K2l1k2j3K4L3k4l7J2J6J4l8l8M9M2o5l9L2O5j8
3479Dn8K5J0J6qqj7K6K7on0J4O2Lo5J0K8L3l4kJJ2mlm5QM9j5l3n0M4O4n3n6K9
3514d2M0ml5k3K7K0Rl0lK3L1k6l3K0M7J0n0jN0J1m7k6K0J8K6j5j7j7M6Jl6l5K1
3547b0N9l9l4%L9Mm6LL1%J1k9j9J8K4j2n5J9O8J1o5JL3M3l6l5K2L1rj5j8J5N7
3580E7k9j2l0N0K4l1n1J4N8jo9LJ4L1l1j0j8J6Nom4J9L0K3o5j3M1L5m4rK6K8J1
3613B2m3kL5J9Pk5j6J4K7l1k8J9N6Kp5rK8L9m9rrL1Ol0k7%L9J1m8k2N6J6m0rk
3648d7N1%k4k1K2L8pl3j1M9M1m4k4lO5rn4PK5K0l2k8J6J2K5l8k7J4M0l0m1J4K0
3681a4K3k7m0K2M0k1rmlM3ol0k3K8K6k5j7J5M1J6n5j4M7J9j2m5RM6lk2k7K3J6
$$ y = [-17, -23, 2, 59, 18, -29, -16, 36, 44, -18, -6, 20, 42, 11, -11, -24, 0, 33, 9, -28, -16, 0, 14, -24, -62, -13, 29, -36, -75, -43, 22, 4, -54, -29, -19, -3, -11, -19, -36, -10, 17, 11, -39, -25, 37, 40, -25, -15, 13, 46, 12, 10, 11, 23, 19, 16, -29, -21, 28, 13, -20, -70, -26, 38, -15, -71, -42, -2, -6, -41, -64, -37, -17, -8, -38, -41, -18, 13, -13, -46, -26, 21, 31, -19, -20, 30, 41, -6, -32, -12, 6, 32, 17, 0, -17, 29, 30, -6, -41, -20, 39, 0, -34, -34, 5, 9, -37, -34, -3, -3, 8, -21, -40, -22, 2, -10, -65, -46, 22, 33, -32, -31, 2, 45, 9, -26, -4, 27, 18, 3, -15, 0, 57, 28, 16, -14, 36, 60, 29, -22, -8, 50, 49, -20, -17, -3, 28, -3, -13, -31, -15, -10, -16, -60, -41, -11, 12, -53, -66, -25, 10, -34, -43, -17, 11, 22, -21, -23, 12, 31, 38, 13, -3, 11, 38, 7, -21, -2, 54, 56, -19, -28, 0, 39, -10, -19, -28, 3, 9, -21, -48, -48, -9, 2, -46, -68, -12, 4, -36, -45, -47, 4, 4, -20, -41, -19, 19, 12, -21, -32, 17, 58, 14, -10, -13, 52, 43, -11, -4, 21, 41, 9, -19, -3, 9, 34, -4, -31, -17, 23, -7, -48, -34, -14, 9, -18, -58, -36, 4, -17, -26, -30, -33, 10, 4, -26, -49, -21, 5, -20, -37, -22, 19, 35, -20, -34, 13, 32, 20, -25, -16, 30, 27, 5, -22, 1, 17]
3714A7Nl7j2K2M3k6o7J8N0mo0j0M0L1k7l2j2L8L2ro9L0N8Jl8%L2K2k0l9K4K7j4
3747A4j8nJ7K2j4k6rL6Rk3l4JO1j3o4KL8Ok0m5K3J6K7l4j2j4N7Om5k4N4M5l8j4
3781a8jL7J4m3j5M2M1j7m9JL1J5l4k0PL6jl9j7L2J7j2m1K0J8k2pk0KL6J1m9nJ8
3815c2N3m3m2K2N4jl5k1K5N1l0j3j0N0J4j2n2ON2Jk7j8%M5l7rjL8kn0J0J5nQn1
3850d7NK4J5j7l9K4K6J3j8l6K5K9Km5J7M1j6qk2K4K0J8k4l4M5Oj7k2%M4k2j5J
3883cJ6J8k2j4j3J4jj8m2K9K9j1l1oK2L3j7k6J3L5Pl4k5K3M3j7k7rL7J7om8L3
3916aK4Ql5j2QM0k4k1k0L6K7m6k9K5K2Lk6l5L3J4j0l7J5K7j7j1l0L7K3nj8pL5
3949gRll5K3RK9k7j1J8J8%j8j7L6J3l2pj0K7j6j8j1PL0k5k2j7M0K5n5J4qL8k7
$$ y = [17, 22, -15, -27, -5, 38, 12, -55, -37, 13, 9, -51, -61, -21, 10, -17, -49, -61, -23, 9, 0, -69, -39, 19, 20, -18, -18, 14, 36, 16, -23, 1, 28, 14, -4, -9, 8, 30, 16, -10, -19, 17, 26, 3, -31, -30, 31, 18, -46, -44, -6, 0, -20, -65, -42, -26, 1, -33, -45, -59, -2, 4, -41, -65, -11, 34, -4, -18, -19, 18, 32, -11, -26, 16, 57, 40, -9, -8, 23, 38, 4, -16, -9, 27, 26, -13, -30, 2, 19, 7, -34, -14, 4, -18, -25, -45, -43, -7, 4, -45, -50, -32, 21, -22, -64, -42, 12, 11, -24, -45, -20, 31, 1, -12, -22, 28, 42, 30, -22, -16, 36, 37, 10, -8, -8, 37, 0, -9, -10, 28, 26, -24, -14, 1, -4, 4, -47, -42, -18, -3, -20, -59, -35, -9, 4, -14, -50, -25, 4, 6, -39, -22, 19, 3, -5, -27, -3, 17, 35, 11, -23, 22, 28, 11, -11, -11, 33, 11, -4, -3, 13, 31, 9, -5, -18, -4, -5, -23, -65, -36, -7, -18, -49, -55, -33, 0, -17, -43, -30, 5, 12, -22, -47, -24, 19, 2, -25, -34, 3, 20, 14, -34, -1, 23, 31, -4, -16, -8, 32, 8, -13, -33, 3, 30, -16, -45, -20, 2, 5, -21, -56, -23, -9, -19, -56, -41, -14, -31, -42, -72, -35, -12, -17, -35, -42, -7, 2, -1, -36, -13, -4, 25, -2, -13, 5, 23, 23, 5, -12, 24, 37, 5, -2, -12, 15, -1, -19, -30, -23, 7, -18, -40, -57, -17, 8, -47, -33, -41, -3, -30]
3983c0%j8J3K4ql2J3K9Qpj9L6mLj9NJ9K5k6JjK0pll1KL2pm0jK3kol5K3J5j7j1
4021c3%J7%Pl5%L1RKk6K4K3j9l2K8K2J5k8k4J4L8Qm6KK0lK0m3mK9mpl7J6K5k3
4057a4k6J8J3Qpk2pM5qk6%pL4j5j2pK7jklJ2KKk0J3K1J2Pm3J5J6Ql6RNKJ3m1J0
4096epJ9ql4J1L2j0j4j3J5J8j8j8MjK0j9k8K1M7qpj3K2QJ1oj3K6Rk4k1K3kLk2
4132bJ4Pj6Mmk9K7j1j4kJ6nj0mmK7Ok4j3K7j2J3j0j1J5PKj8RK0nQj0K5j2j%j9
4170iJ7J2ok4PJ4j5jj6J7Mj4qKmJ1j1j3J0QJk1K6j1l%kK4j8K4k8mK1K1j9j1J7
4207bJ7mq%ONpj4J5j3PqqK7j0Ll5J1j8L3k0j2J3j4J0Nk9J4J0Nk2J3j6K2Njj6K7
4245iJ6k1J9%mlj2K0kJRk4MJ0K%j3LJlj5jJ2J8l8PnPk2lJ0K%j0J8LpJ3j9K7j8
$$ y = [-30, -30, -48, -35, -11, -19, -51, -38, -9, -1, -8, -27, 9, 5, 8, -11, -6, 13, 38, 12, 13, 12, 32, 25, 22, -9, -7, 25, 18, -22, -23, 0, -2, -8, -43, -20, -5, -22, -33, -33, -16, -16, -9, -44, -44, -13, -4, -2, -28, -4, 19, 0, -32, -4, 18, 33, 5, -19, -5, 33, 41, -5, -3, 17, 14, 34, -9, -13, 16, 12, 5, -32, -16, 9, -14, -40, -22, -9, -1, -8, -30, -37, 8, 0, -26, -26, -33, 1, -14, -26, -33, -6, -7, -9, -12, 0, 2, 4, -16, -3, 18, 30, 37, -6, 9, 25, 33, -3, 6, 11, 13, 26, -15, -5, -12, 7, -1, -35, -24, 8, -2, -16, -29, -14, 4, -14, -32, -28, -29, -9, -28, -56, -35, 12, 4, -3, -16, 6, 14, 25, 19, 6, 32, 41, 17, -4, 19, 17, 20, -2, 12, 19, 3, 7, 3, -26, 1, -10, -24, -26, -10, -15, -25, -29, -33, -6, 0, -24, -37, -10, -22, -9, -19, -30, -15, -8, -6, -24, -15, 5, 0, 8, -2, 23, 11, 10, 10, -9, 8, 20, 14, -10, -3, 11, -4, -5, -21, -4, 0, -14, -22, -20, -24, -13, -24, -37, -27, -19, -18, -39, -13, -24, -27, -27, -29, -5, -23, 1, -27, -31, -10, 11, -8, -19, -2, 15, 11, 3, 3, 9, 14, 7, -7, 8, -5, 2, -6, -14, 13, 3, 6, -29, -18, -36, -3, -23, -35, -22, -36, -26, -21, -50, -36, -26, -21, -43, -30, -46, -24, -19, -20, -36, -9, 7, -14, 5, 5, 1, -2, -14, 6, 4, 5, 14, -10, -6, 4, 6, 6, -7, -4, -3, -6, -21, -22, -10, 8, -30, -23, -28, -21, -43, -46, -36, -34, -34, -44, -26, -23, -30, -17, -36, -9, -27]
4286b7K6j9MK5j1J8Kj6rJ8%j7OljRL%jj6J3j6J7j5j1Lj5OJ1oj1LJ1ok2J1J5J0
4324a1J1j6jj0qRK1kRK5j3lk0JK6ProLj1Kpj1J3kk1L2j4j5Kj4Pj8J8Jj5J5Ok6
4363d5J4J5j6%OJ6Pj3lJ0JnnJ9J2kKJ2Jj3Ok2kjmJ3k2K0qJ2k4lNk1J1oQj1J0o
4403c2mQJ6k2RmK2j7J3rJ0K4Mk0QNKRM%j6J5j0j6J4oJ6k1JJ6j4rj3J2lRpk3mJ3
4443b0Koj6J4J1j0j3J7J7J0k5K2Jrj5MJ0K1pLLPlNj6NJ1mNk7MQk5K4j3j5OPj0
4482a7k9L2k2mM%K0j5lkJ4J0KQMj2jMJ9jLk5K6ljLK3k3J2Lj5Lj9JkkrjqK6k5L
4524a9j5Mj%MJ3j4ojJ9J2Pj6OJ2jrLROj3j0J2J2rQjRkoljkmJ2l6lLjJj0K8l1R
4568b5QqRj0qLjPmj2J3J6QJ1mMk3K4Pk9L6j9OMQj9K1J1k1OKk7J5l0K1J3j4j1j4
$$ y = [-27, -1, -20, -16, 9, -2, 16, 18, 2, -7, 11, 11, -6, 0, -3, -4, 5, 8, 8, 7, -9, 4, -12, 5, -10, -21, -18, -33, -27, -16, -22, -33, -30, -19, -25, -47, -36, -21, -11, 0, -16, -17, -27, -35, -26, -5, -7, 2, 27, 14, 11, -9, -8, 18, 25, 16, 10, 13, 2, 4, -3, -14, -1, -3, -24, 8, -6, -21, -19, -33, -26, -44, -26, -25, -40, -25, -19, -45, -31, -16, -32, -32, -26, -10, -3, -16, -19, -9, -8, -13, -18, 1, 13, 11, 13, 25, 26, 13, 19, -3, -5, -6, -10, 3, -19, 1, -7, 5, -19, -22, -17, -38, -27, -33, -25, -36, -26, -32, -36, -28, -12, -34, -25, -29, -7, -24, -11, -20, -10, 14, 18, -2, 6, 11, 13, 22, 26, 26, 10, 25, 15, -1, 13, 7, 23, 2, 3, 19, 5, -4, -17, -5, -8, 1, -6, -29, -33, -20, -18, -24, -40, -26, -15, -25, -38, -21, -4, 6, -19, 3, 4, -5, -20, -16, -6, 15, 8, 11, 14, 21, 18, 23, 7, 12, 23, 19, 24, -3, 1, 9, -16, 8, -5, -20, -14, -7, -17, -46, -14, -36, -40, -36, -36, -16, -31, -34, -36, -22, -12, -10, -2, 2, -10, -11, -7, 12, 11, 14, -11, 15, 12, 11, 14, 37, 14, 26, 29, 14, 17, -2, -1, -3, -5, -14, -15, -23, 3, -22, -19, -34, -30, -31, -31, -27, -14, -28, -34, -35, -16, -4, 3, -13, -7, 5, 4, -5, -2, 7, 13, 0, -10, 2, 14, 5, 13, 12, 21, 19, 13, 10, 9, 7, 3, 15, -21, -24, -21, -22, -21, -31, -3, -34, -25, -17, -25, -16, -26, -34, -31, -32, -25, -29, -41, -28, -12, -4, 7, 3, 7, -16, 8, 15, -14, 22, 3, 9, 13, 21, 2, 23, 34, 13, 19, 21, -6, 9, -21, 0, 13, -1, -12, -26]
4607b6K1%l1%NJQj1jj5J7jJ1Qk3L8kKnmL0j8MJ1%J1j6Pmj2nJ7j3K2k3pj6NjJ1
4647ek0MjMk2qK5J0j7joK9Qj0j0jJ6mj1LJ2J7k1J4%QJ1k9J0J1Roj4kLJ1Ll5J2
4686cJ1j2Rl6lK8j9kj2J9Rk1MJ4j5klJ4QpopK7NJ1nj3K2Llqj3L6j4KqomJ4j9K6
4727B1Pk0k4%pJ3j1j3%Q%jQj9K4Nj1qP%J6Kj4NJ1J9j5%PoJ6j0KJ0qj0Oj4K0j4
4767BKj2J6p%j9LJ7kk8oJ1mJ1j0MJ0JjOJ%Pl0J1LJ9lj6K2J1J9j8K2k1nRj1Nll
4808A3Jpj0NJ7l9J3jpRk2%J5Pk2mJ5J7j4k1J6kjMLkRMk1L1QjK3l7K0OJ2m1PJL0
4849C4k1pRmmj7Mj3PJ4j1k1%K9k0pj6K1Oj8K2lj4LRj6M2qLj7J0%oQkL4pqOLj5
4890IJ1j1Nj8L3j3j2oLJk3R%Mj0qn%J0nJ1j3J6Mqj6L1Lj7K5rj7J9mk%K6j4Poj8
$$ y = [-26, -5, -5, -36, -36, -31, -30, -22, -33, -34, -49, -32, -33, -22, -14, -37, 1, -1, 1, -4, -8, 22, 4, 8, 19, 19, 30, 14, 21, 17, 5, 0, 17, 4, 26, 3, -4, -20, -15, -16, -5, -25, -21, -22, -18, -40, -48, -23, -13, -30, -31, -37, -8, 0, -10, -20, -21, -5, -9, -20, -17, -5, 12, -9, 5, 5, 13, 24, -5, 5, 16, 25, 19, 5, 3, 6, 17, 20, -15, -3, 8, -4, 5, -31, -34, -6, -25, -27, -39, -20, -11, -32, -28, -14, -29, -31, -34, -20, -12, -19, -25, -32, -5, 0, 11, 6, -7, 15, 18, 15, 7, -6, 30, 16, 18, 10, 4, 0, 14, -5, 21, 28, 8, -16, -16, -23, -10, -21, -34, -34, -26, -26, -27, -19, -38, -14, -9, -20, -28, -21, -21, -5, -3, -17, -12, -1, 18, 3, 3, 10, 4, 20, 10, 12, 22, 14, 4, 10, -4, 16, 2, 4, -8, 8, 1, 1, -18, -15, 2, 0, -28, -34, -23, -27, -16, -26, -22, -12, -11, -12, -6, -5, -5, 2, -28, -17, -14, 5, 2, -14, 8, 19, 38, 20, 42, 21, 16, 25, 14, 19, 16, 13, 14, 7, -3, 2, 19, -20, -7, -8, -15, -6, -28, -28, -13, -6, -28, -32, -17, 0, -14, -35, -19, -21, -22, -18, -15, -17, -8, -4, -25, 6, 14, 13, 36, -1, 19, 25, 37, -4, 3, 4, 34, 13, 6, 15, 11, 7, -10, -6, -19, -12, 2, -9, -30, -30, -1, -21, -28, -44, -23, -17, -35, -13, -16, -30, -27, -18, -34, 8, 0, 3, -14, -4, -4, -10, -2, -4, 30, 23, 15, 21, 24, 9, 20, 9, 14, -4, 29, 16, 4, -2, 1, 2, -21, -12, -12, -8, -18, -26, -31, -31, -21, -26, -15, -28, -12, -8, -16, -32, -1, 2, -15, 10, 1, -16, 3, -1, -3, -3, 23, 9, 16, 10, -8]
4931hK6j3pPrQmk0LJ6j6kLJ5j6mrQj3J3qk6J1L4jk8L7J0j7MKoL5k1Nk8N2kjk7
4971CoK9J3Jk2jJ3qj8kmj3J4j4J1j2%qLqJ8k0%j1QK3qJ6jj1K0k0J4qLK0PpNLj2
5012A0kLQJ5k3J6l5K2llnj2J5k0j4J7qJ1j7j6J0%j8K6j1PKnRJ6j7KJ5j0K2k5K6
5049HJ1j2qL1j2lJ0lj5RORonj8nq%J1k0J3Oj1j9K0jOj2kj8J9j6MJ2rK7j3K7k2
5088iJ3J1j0J4klj2LoK2Oj4k0K7%%j5Ok0J7OPk7l%MqMj0j5J0JPl2J7lL3j8J0P
5128bQQMqPpK7k1K3k2MmpNjK1j8oOj3nJj2kKkRl3J9LqlJ3%j4Pj2J4MKj7K2Okj1
5173a5K5QLnj1K2l1K7JKnkMJ1j9jj3J7j0j7M%J2k3J3rprJ9k1Lj0K6lRj1nK3k9
5212b7M2j2LJ5J4%lk4%OJ4mQk1J6jMj8jJ3k3J0j7PNk1qJJ6k1KjjJ3J1j9K2k2j2
$$ y = [-8, 18, 5, -2, 5, -4, 4, 0, -20, -17, -1, -17, -19, -16, -1, -17, -21, -30, -22, -35, -22, -30, -56, -45, -11, -12, -40, -3, 7, -10, -6, -4, -10, 25, 4, 9, -19, 33, 31, 30, 3, -3, 26, 39, 40, 18, 17, 30, 22, 4, 2, -2, -15, -1, -15, -4, -16, -16, -24, -21, -29, -11, -31, -31, -42, -34, -11, -19, -3, -4, -15, 5, -15, -1, -9, -6, 14, 21, 14, 19, 22, 10, 8, 11, 19, 34, 11, 27, -8, 14, 11, 8, 3, -9, 6, -14, -28, -11, -19, -8, -25, -41, -31, -31, -49, -23, -34, -27, -25, -30, -21, -5, -22, -20, -5, -15, 7, -18, 8, 19, 7, -1, 30, 18, 15, 25, 22, 7, 16, 22, 31, 25, 20, 2, -3, -11, -11, 0, -20, -7, -1, -12, -31, -11, -12, -6, -18, -20, -38, -19, -35, -31, -19, -28, -1, -14, 13, -9, 4, 15, 5, 19, 17, 14, 2, 5, -1, 21, 27, 13, -7, 20, 20, 20, 5, 11, -9, 8, 14, 21, -6, -9, -9, -5, -13, -9, -19, -34, -24, -23, -16, -48, -31, -34, -1, -19, -9, -2, 6, 14, 18, 10, 17, 10, 37, 16, 39, 17, 21, 17, 10, 15, 14, 35, 17, 11, 17, 4, -1, 0, -12, -14, -12, -14, -5, -38, -19, -16, -24, -27, -14, -14, -28, -21, -33, -19, -15, -13, -30, -8, -2, -4, -15, 10, 18, 21, 16, 5, 27, -4, 23, 24, 26, 21, 19, 23, 34, 15, 14, 1, 18, 8, -9, -5, -5, 7, -16, -3, -12, -19, -28, -9, -30, -27, -37, -11, -14, -5, -16, -21, 2, -27, 15, 3, 6, 21, 35, 35, 32, 8, 8, 14, 28, 24, 32, 11, 27, 26, 30, 12, 11, 24, 1, 11, -6, 1, 6, -15, -23, -22, -6, -27, -25, -26, -27, -14, -3, -22, 0, -22, -34]
5251c4J4J6jJ4pMJ2j3J2j3RkJ3Nj5lPMkj9J5Pk5JLj1lj5J8j8K5j1mnkJ0oJj2K0
5291a1J7k4qOLQOlJ0KJ2Jj0MJ7j7j1K2jrKnlkj0k2K8J2mnj4lJrN%p%oNKJ4l3K8
5335a2j5J9Nj8j1JPJ8mJ9j9%PLL0j8J0j6J9mj4rJQkj6K7l3Q%qj3K4k1Nj2j3J4
5373c3QJ0k1K3JOmj2nJ6kRMJ8%k0J1K0j8J7pmjj3PqjojkJ9k0j9LOJ2k4Ooj9K1
5414b9j5LK1nj7PL1nk1LK8j6MKL4k3J7j3J1k5J4J3poK3k2qj8K7mqk0J2JkoqJ1
5452a6j7NMj0JK4k0rL4oqJ3kJ4j0QqJkJ9j0J3lPj3J1qJ0j3j6J1J4Ok2j4J9Pk7
5490a3J1j4PmKoj3K6j8Oj0rK5mrMQmK5rMqPlMJ2kj6J6oKK4k3j1K6k3j2J3lok3
5531b7J0LQ%lj7R%j1J2j6J1J2MpJ1j6K8l9K7jPJnkqPPNMj1K9k9RJ2j4lj5%pK5
$$ y = [-34, -20, -4, -5, 9, 2, 6, 18, 5, 17, 4, 13, 11, 24, 29, 14, 11, 18, 22, 20, 1, 16, 23, -2, -1, 2, -9, -12, -27, -9, -27, -2, -13, -17, -22, -24, -14, -20, -19, -31, -11, 6, -18, -26, -20, -17, -9, -3, -6, 4, 6, 18, 19, 9, 13, 30, 13, 2, 24, 23, 14, 16, 11, 8, 6, -4, -26, 2, 14, 10, 5, -9, -12, -11, -20, -15, -15, -22, -22, -28, -23, -21, -7, -40, -12, -27, -8, -3, -21, -32, -31, -24, -6, -10, 9, -10, -10, -3, 0, 30, 12, 22, 6, 25, 21, 7, -2, -1, 7, 5, -11, 16, -17, -9, -9, -17, -30, -6, -27, -22, -34, -47, -33, -25, -15, -36, -13, -12, -6, -10, -22, -27, -11, -13, -4, 0, 18, 18, -2, 9, 29, 11, 28, 21, 17, 16, 3, 10, 2, 1, -5, -6, -8, 11, -9, -28, -25, -19, -7, -31, -25, -31, -50, -29, -44, -41, -20, -25, -42, -35, -4, -9, -30, -27, 1, -15, -11, -9, 25, 2, 19, 6, 17, -8, 6, 19, 12, 6, 29, 7, -1, -19, 8, 4, -4, -24, -12, -11, -13, -19, -27, -16, -33, -28, -24, -34, -33, -9, -29, -38, -4, -10, -18, -5, -7, 7, -3, 5, -3, -2, -4, 15, 5, 18, 15, 22, 9, 20, 12, 22, 9, -7, 4, 18, 24, 2, -12, 7, 14, -13, -2, -16, -9, -13, -11, -17, -30, -4, -22, -16, -26, -35, -10, -14, -23, -19, -11, -15, 10, 1, 5, -3, 4, 1, 5, 17, 15, -1, 15, 9, 11, 35, 12, 1, 27, 4, -8, 5, 2, -4, -27, -17, -14, -6, -6, -9, -26, -17, -17, -28, -16, -32, -21, -9, -5, -12, -1, -17, 11, -28, -1, -2, 5, 6, 1, -1, -9, -2, 5, 10, 14, 3, 32, 3, 12, 24, 10, 7, -8, -8, -15, 10]
5572A0k6J4pkl%j5J0J2l7nL5j2oQKRmJ5j6J0K2j2QqkK1lj2J2mLnpRJ7j7nj0Kj0
5613iJ5nj2k4K6k3K5qj1pJJ6nPrJ5j0pjK3%J0%JMrKPl%MrOK0kj1J2pnl0K1Lpk4
5657b0lJ0jKj2NJ0Oqj9K1j2KM%J2lj6jK3Pj5J1K5Prkj5lK4k1J5Nj1PMj3rqMk9
5698b6L4j1krrKj3jM0m6P%J0J6k1J4LQk7L3%n%J2NnOoOJ6nq%jMlj5kJ4lj2%mj4
5742a8J0pj2OPmPk8J7nPMj9J9q%RQpJ3MQJ2mrJ1j3K6Jk0Kj7QJ1Rk1J5pp%Jrj6
5785a6j2OKJ3l5J7j6K0Pj2J9k1JJ6jkRkJ2l3J2J2ONOJ1Lj0jpJ8lj7MoPj2ol1M3
5825Fj7rPj3J0jQk8mJ1%O%mK5k9JOK0j4qJ9jJ7lnjJ2rJ9%k2K4PpomQjk5RJ0l2
5868a8KJ2j1kj1j5NJ1J2qj1lJ1K5j2LmJ7j3rRL2j9j2K2Mj1%LnJ2J9k4JmK2j4n
$$ y = [10, -16, -2, -9, -11, -14, -14, -29, -19, -7, -44, -49, -14, -26, -32, -24, -22, -13, -17, -2, -18, -8, 14, 2, 10, 2, 0, 21, 18, 6, 18, 14, 17, 12, 5, 14, 31, 14, 9, -1, 1, -9, 6, 1, -11, -35, -9, -32, -7, -15, -26, -33, -32, -16, -21, -14, -23, -8, -18, -25, -26, -3, -3, 7, 7, 8, 12, 3, 5, 12, 9, 9, 13, 4, 10, 30, 28, 17, 29, 22, 17, -13, 8, 11, 4, -20, -23, -13, -14, -12, -24, -19, -9, -3, -11, -30, -9, -21, -19, -15, -15, -3, -6, -22, -23, 0, 7, -8, 3, 28, 35, 26, 24, 9, 6, 30, 9, 24, 29, 18, 25, 29, 16, 7, -1, 3, -26, 8, -3, -5, -14, -23, -21, -34, -35, 5, -41, -34, -34, -24, -8, -29, -15, -12, -4, -31, 2, 2, -3, -3, 9, 14, 9, 15, 9, 15, 31, 26, 18, 18, 17, 21, 18, 3, 1, 15, 12, 0, 0, -4, -18, -8, -15, -27, -21, -14, -18, -11, -39, -22, -27, -20, -16, -35, -16, -24, -24, -15, -7, -14, -1, 3, 11, 23, 19, 10, 21, 8, 34, 35, 15, 17, 0, 8, 19, 28, 7, 22, 15, 8, 8, 9, 0, -16, -28, -22, -20, -7, -42, -25, -41, -21, -14, -26, -7, -28, -27, -11, -12, -14, -5, -7, 5, -28, -16, -4, 2, 7, 13, 24, 27, 17, 16, 9, 27, 24, 7, 11, 5, 12, 0, -6, -37, 6, -11, -20, -13, -26, -16, -17, -9, -37, -41, -30, -30, -24, -24, -28, -3, -32, -31, -25, -5, -19, -27, -8, -9, 8, 5, 0, -1, 11, 2, 21, 21, -1, 23, 30, 23, 17, 13, 21, 20, -5, 4, 14, -18, -16, -4, -15, -17, -28, -43, -38, -27, -15, -23, -34, -37, -26, -1, -13, -10, -14, 3, -10, -19, -10, 22, 3, -9, 13, 17, 6, 6, 9, 4, 16, 35, 11, 12, 8, 30, 16, 11]
5906A1j2J1Qk5nK%Pj7KqJ5j6pJ2J2mmPlK0qj3KK7pj6J1OPQM%%j7QmJ0lk1J6j6
5948@lJ2j2J3k3JPnJj6J0Qk9OKJ2nj1RJ0RRlj0J2j8K6k7L0L0j5k7J9Qj8OJNlN
5988B6j0oj2rJ7kj4qJ8j3npJ0%k2K2j5J0LoOk9M2j1%J3RPj5j8K9J6j6N%kklJ2
6027B0Kj0Nj5OmLJ0pj0j1NpKpJ5qk0mrJ8j0Q%K7j1nj6N3j7lJ5rlmoJ0K4Jkj6J3
6069B3JLkjNpk9J3lop%J1j0mO%j6JJj1J1j5J4PRj7J6OLNKPq%J7MkJ6k8K1Mk0j
6113A9NQk7%J6l0K5k0MmrNjJ1j1KJ1j8NKJk1rK0PkPJ1J5j8PJ4rlQJ2oj4K7k2J4
6154C2Qm%k2j0J6k9OJ3kj5J4j4J6j1rJ6Mop%j1mlJ6j4J8Nj5RK1mllJ2Nkj2K7m
6194C4nPj2mmLllqJ9j5qlrojj4K1JQk1qK8k5QJ6j2Rlj9K6J2NK1rj3MrJ6Rnj1N
$$ y = [11, -1, 10, 18, -7, -12, -10, -10, -3, -20, -18, -26, -11, -27, -34, -22, -10, -14, -18, -11, -14, 6, -2, -15, -13, 14, 7, -9, 2, 8, 15, 23, 27, 27, 27, 10, 18, 14, 24, 21, 0, 16, 0, -3, 9, -3, 10, -13, -12, -5, -10, -9, -25, -15, -7, -36, -30, -28, -16, -21, -32, -23, -13, -4, 5, 2, -8, 4, -14, 12, -15, 15, 45, 30, 3, 22, 30, 12, 18, 19, 24, 21, 26, 16, 10, -2, -11, 6, 4, -10, -18, 0, -13, -18, -25, -15, -15, -37, -15, -30, -20, -17, -23, -17, -46, -4, -15, -15, -2, 7, 14, -1, -19, 10, 26, 10, 15, 15, 13, 11, 8, 20, 22, 12, 17, 2, 8, 4, 7, 17, 10, 0, -11, -6, -13, -11, -18, -3, -11, -31, -35, -44, -26, -36, -28, -28, -1, -12, -17, -33, 20, 3, 0, 15, 6, 3, -1, -7, 3, 27, 28, 26, 10, 23, 24, 27, 25, 24, 29, 22, -7, 6, 3, -3, -10, -10, 1, -9, -13, -7, -7, -23, -22, -21, -32, -21, -36, -22, -15, -6, -23, -7, -1, 2, 7, 9, 16, 8, 8, 25, 29, 27, 43, 15, 36, 40, 20, 19, 24, 32, 5, 5, 21, -9, 16, -4, 0, -4, -13, -8, -9, 2, -9, -7, 4, -14, -9, -7, -6, -27, -36, -16, -9, -11, -4, 7, 22, 4, 11, 25, 16, 13, 21, 33, 27, 13, 40, 18, 32, 40, 36, 36, 14, 4, 20, -9, -3, 10, 8, -7, 7, -7, 9, -2, -11, 5, 9, 3, -4, -4, -15, -19, -22, -6, -20, -2, 3, -12, -3, 18, 14, 11, 8, 20, 25, 23, 11, 38, 34, 29, 36, 24, 20, 16, 19, 16, 13, 5, 24, 9, 1, -2, -11, -17, -18, -32, -11, -10, -2, -23, -31, -3, -28, -20, -4, -16, -7, -10, -29, -3, 9, 14, 35, 26, 13, 17, 8, 24, 33, 28, 17, 22]
6237B2J9j5j7J6j3RJj1kj1j7J1MNk7J0qK4j5k2MLK2j0j1J9lKj3K8Mj4RJ5j7RK
6274A2J0JkJ4k7%J8j2J6j5roPj9K4j1%jj1j1kJ3k7K0kQj6lJ5qPkJ9kJ4rLJpRQ
6315A7LqJ8moRk7RJ0mk1K9jj4Lnj9J5Prj2j2PpqJ7j4jJ3kJJ8k8J3Nj1L0j3Lj5
6355a4K0MNj2kJ8J5oj4K%j7QJ7j2QJ5l5kPj5oLKlnj8J8mNNkJ4OrQl1M1mlqOj2
6398gQJ3jLJ3mJ3j6j2Oj4oJ8Qmnj1JqOmk0JOk1J2nJ0mk0J7K8k3QQJlRj1K4pRj4
6441BJ2J3k0oK1j6L3Mj7mJj4QJj7J4qj1rJ6mqjpj4QJ8j6qJ5LpJ5oK2j9kJ4Qk5
6481a1J3K1JJ1lj8QK1k8K0Nprj3Mmj8K6j0j8Nj3J6qkojkjjQPj6J7j2lJ3J6j8Q
6521bJ4Nj4RJ1J0j4jNPrqJ8j8Oj2J3j9mK%Jrk%n%Pj7J2kj4LK0qLRk4L6j2Oj4J6
$$ y = [22, 41, 26, 9, 25, 12, 21, 22, 11, 9, -2, -19, -8, -4, 1, -26, -16, -24, 0, -15, -37, -33, -30, -8, -18, -29, -10, -13, -11, -24, 4, 8, -6, 3, 18, 1, 10, 12, 22, 23, 21, 35, 8, 8, 26, 14, 30, 15, 6, 0, 7, -12, 12, 1, 1, 0, -11, -22, -24, -11, -38, -18, -20, -12, -28, -31, -16, -24, -17, -19, 0, -2, 12, 3, 6, 7, 0, 9, 17, 20, 12, 30, 26, 20, 29, 2, 11, 21, 17, -4, 25, 24, 10, 13, 8, -11, 4, 11, 2, -10, -22, -15, -22, -30, -13, -27, -28, -15, -17, -16, 2, -26, -13, -8, -19, 11, -2, 1, -14, 6, 10, 15, 3, 1, 19, 34, 28, 14, 16, 16, -1, 7, 24, 12, 20, 35, 0, -2, 5, -10, -16, -13, -11, -14, -19, -37, -19, -23, -18, -13, -15, -1, 5, -4, 4, -27, 14, 10, 7, -1, 5, -7, 1, 14, 13, 16, 29, 25, 38, 22, 10, 16, 2, -4, 14, 22, 18, 13, 2, 3, -5, 1, -3, -23, -22, -16, -37, -25, -30, -20, -24, -44, -27, 1, -22, -14, -6, -5, -8, 1, -10, 14, 7, 16, 2, 14, 27, 7, 1, 22, 6, 39, 43, 26, 22, 23, 9, 17, 18, 1, 15, 7, -4, -13, 3, -1, -9, -10, -17, -31, -23, -5, -21, -29, -14, -11, -18, -3, -9, 13, -6, -8, 6, 14, -11, 2, 23, 24, 35, 32, 14, 22, 43, 15, 35, 40, 33, 24, 11, 15, 11, -7, 19, 9, -9, -4, -17, -1, -9, -11, -17, -18, -20, -21, -22, -14, -7, -23, -6, -18, -21, -8, 8, -10, -2, 12, 17, 3, 12, 23, 33, 19, 18, 23, 30, 21, 13, 31, 13, 19, 7, 20, 1, -3, -1, -1, 0, -9, -11, -11, -16, -16, -9, -26, -14, -16, -30, -27, -7, -15, -12, -3, -27, 9, -3, 3, -11, 5]
6564Ej1J6k1L0LmJ1nJ8k3KPNJ3k8JKj1Mk0Ok2LjNJk8L7j7JNjLn%MJ6j5kK7QnJ
6607A5oJ2%KKj7LQJ5Jj4Rlj3mRLj8j6%J2j5QN%jj3mqPk1L6j9KKqM3k5%J4j7K1
6649GmJ5LJ6pjRj4j9K3J0j4mmljN%J1l4NLJ1k7nkPQk7Rj1J4Pk6J0K0J2j0jJ8k
6690GqJ4PmlRJQj2JjOj1J1j5K4l3jj2J6nj7Oj5%J8oqmJ5JrPkLnkokkL0lRlrK0
6736A5j4J3lJ3lj1K1rj4%K2j8J2j3k1J4j7J4j4j0p%Rj2J0Oj0O%kKQLmJ0J1Jj3
6774eK3l3J2noJ0J0J7j0j3L1j3%J4j8J0k5J3J%j8Ol1PQQqJ1k2MMj7MJ1%rJ7Lj1
6813b0JJ9J4j3J5j7J4MPj2mNNk4L2oj4lKoJ7j3%Nqqj0Qlj1J2k3NJ3qJ9qmJ7j0
6853a1j5J2K7k9J5jK0jk0J4J8%j1pJ1J6k6J5j2l9K1K0Rk2jJ0k5K1j5j2qPKqNQ
$$ y = [5, -6, 10, -11, 19, 22, 18, 29, 24, 42, 19, 21, 28, 33, 46, 18, 19, 21, 10, 14, -6, 0, -22, -19, -20, -15, -14, -42, -5, -22, -21, -16, -17, -14, -19, -19, -15, 1, -14, -16, 11, 19, 14, 15, 9, 21, 21, 23, 25, 8, 11, 19, 34, 35, 21, 30, 27, 14, 10, 19, 22, 4, -12, -12, 0, -15, -7, -2, -2, -3, -16, -20, -28, -21, -42, -6, -25, -23, -21, -29, 14, -11, -11, 3, -14, 7, 3, 18, 21, 37, 30, 29, 38, 24, 5, 28, 38, 24, 20, 16, 13, 12, 17, 17, 28, -6, -1, 2, 13, -14, -19, -21, -14, -6, -33, -24, -35, -21, -14, -40, -30, -10, 2, -8, -9, 9, 7, -1, 13, 20, 16, 13, 22, 23, 31, 19, 20, 19, 25, 14, 25, 10, 34, 1, 0, -12, 4, -1, -18, -12, -27, -27, -9, -15, -23, -27, -12, -11, -20, -13, -15, -12, -17, -19, -25, -27, -29, 1, -2, 7, 4, -5, 15, 1, 14, 11, 24, 21, 10, 31, 22, 8, 8, 30, 12, 24, 11, -10, 4, -13, 1, -13, -23, -30, -30, -21, -33, -23, -17, -27, -21, -21, -23, -21, -13, -10, -14, -4, 7, 8, -5, 18, -15, -3, -8, -14, -4, 6, 23, 13, 0, 31, 18, 18, 32, 14, 24, -1, 12, 13, 13, -5, 1, -30, -23, -15, -7, -15, -4, -26, -22, -18, -35, -31, -20, -20, -29, -12, -9, -20, -19, 0, 14, 1, 16, -1, 13, 17, 24, 12, 8, 13, 18, -6, 26, 20, 6, 3, 5, -1, 16, 3, 3, 8, 0, -8, -18, -10, -13, -24, -12, -35, -30, -17, -25, -6, -14, -18, -1, -11, -26, -14, 13, -16, -1, -2, 18, 17, -3, 11, 29, 29, 18, 11, 22, 38, 12, 27, 15, -24, -3, 17, 26, 4, 3, 13, -12, 9, -6, -18, -26, -19, -17, -25, -20, -12]
6889a2%nQM%qJ1pK1qJ4k4J6mNJ3j3RoPjlmMj1MLkJ5j1j7J7j8Oj8Qkj1QJ0j6J2
6931fj4MRkOj5J4kmQJ2j4nK1j1kK3poLOpMqnJ8Kj7J0j2%Mk8LJ6rmJ1j2Mjl0NJ1
6975b7oJ1J7j6OJLK1j7jMKMK1j1RJ0%Lj6OJ2j7jMok0K0l6K1qpQJ3j9kRLl4J0o
7016c2pK9k3kJ3LJ2nJ3mMQLmMJkLJ8j8nK4Lk0J7l0LJ7Ll6OOornnJ5k2J1pJ7j4
7058b3m%PlPQpJ8LLj3LMJ0J0noJlJ1qK0j3mrJ9kj2jMj9nJ1k0OJ9k8Mjj3NlOO%
7103a7J0r%JJ3mRJ7j3J0pK6l0J9k0K5Pj4J5k2j2J1Qj3kQk5J4k3J5kpOLj7mnJ0
7141a9KmLNj9j7K9kJ0J8rlJ3rJ6J3JrJ6k3K3j7kJ8j8J0Lk0J3j3Nkk2JmJ5kk4P
7180a7KLKPj8j3J3Nj6K2lRmnJ1J9Lj1J1k0L6j3%Kj2NrJ4mqJ6j5Orj2J0j3J7j9
$$ y = [-12, -12, -17, -9, -5, -5, -13, -2, -9, 12, 4, 18, -6, 10, 6, 11, 24, 11, 20, 14, 21, 20, 17, 13, 17, 6, 10, 13, 11, 26, 15, -2, 15, -3, 3, -15, -7, -9, -20, -12, -2, -18, -6, -20, -16, -7, -9, -3, -18, -4, -6, -10, -2, 10, -4, -9, 12, 1, -1, 22, 15, 9, 12, 18, 11, 15, 7, 2, 20, 22, 5, 15, 3, 3, 7, -21, -18, -2, -11, -15, -4, -16, -12, -13, -43, -38, -27, -33, -22, -5, -21, -15, -14, -11, 10, -7, -8, -4, -2, 2, 23, 12, 21, 31, 31, 34, 18, 24, 36, 19, 18, 22, 16, -4, 16, -20, 1, -7, -14, -6, 7, -12, -14, -5, -2, -36, -26, -32, -39, -10, -33, -35, -22, -19, -7, -12, 1, -3, 1, 9, 12, 8, 12, 13, 11, 14, 32, 14, 9, 33, 36, 16, 33, 3, 6, 23, 26, -10, -4, 2, -4, -13, -18, -23, -8, -30, -19, -26, -9, -23, -27, -27, -20, -23, -16, -8, -15, 3, 6, 9, -4, -1, 3, 13, 23, 18, 12, 13, 10, 21, 13, 33, 20, 16, 7, 26, 24, 12, 11, 15, -4, -9, 2, -18, -12, 7, -21, -17, -18, -31, -26, -29, -23, -17, -17, -7, -16, -16, -15, -2, -6, 3, 20, 7, 17, 10, 36, 6, 25, 5, 30, 37, 23, 38, 16, 4, 15, 23, 10, 8, 16, -9, 5, -18, -3, -5, -12, -6, -3, -20, -24, -29, -19, -17, -21, -18, -13, -32, -49, -20, -22, -12, 6, -3, -6, 7, -2, 14, 27, 28, 19, 35, 12, 35, 18, 16, 34, 16, 26, 29, 9, 22, 9, 14, 12, -10, -9, -13, 2, 0, -24, -17, -15, -12, -10, -3, -21, -34, -21, -16, -32, -10, -13, -4, -8, -13, -2, 17, 20, 9, 20, 0, 36, 23, 23, 25, 13, 18, 9, 23, 19, 11, 27, 12, 18, 9, -3, 7, -6, 11, -8]
7219hOj3K2qk1rK0j5J6OoNJ2mj9QmJ3L2qom%LKRJ0qJ0j4j5kJ8j2RRqrj6Kj4QJ
7262bnommQj2J6JJNoJ0j2kNlJ3j2K2LpK0k%Qj7J3Kok3J9plJ9j0plj1OJ6l0jrK
7306a5Lpj2J7Qnj0J2rJ4j2K0k2K3J1j9lL7rNk0J0K6j2kJ1k1Qj1J9Ll6J1nKKoO
7344A2k1J2j4oM%pj5J6mK6j9oOOK4j5JKmJQLjPLlLQJj1J0ppJ1j2qJ1qpjoJ7j0
7388@j2jlJj3NKJ7ok5K4JJPqKJ1K3mj5J3j7K3ljlJ%JoLoRkPOj9klpj3MNJ1j7j1
7434b0k0J6rOQnK6j4j3RJ5J9k2QJOJ6nj1JJ7klLLn%QLm2L4k3J0mk3KqM2l2j5%
7475b3Qj0MKJ0plk1J4Nkj%J6Kj7J8mK2%j7K4qJ2j1j0j2M6k8kNnJ6n2K8kMJ2k9
7514a6Nj0J1j5%lJ0mPj5NJ2Qjj1OlrK7%JJ1KJ4k2nRlJ4mJ2j4j3Mj1J1j6J1k4n
$$ y = [-8, -2, -15, 7, -1, -22, -31, -11, -26, -10, -4, -10, -5, 7, 3, -16, -8, -12, 1, 33, 25, 19, 15, 15, 18, 20, 29, 39, 31, 41, 27, 12, 10, 28, 16, 25, 34, 26, 17, 1, 3, -11, -3, -2, -7, -13, -17, -21, -13, -25, -9, -8, -7, -2, -8, 2, -10, -12, -7, -10, 3, -9, 13, 16, 9, 29, 27, 27, 35, 18, 31, 33, 27, 4, 23, 16, 13, 32, 22, 15, 12, 1, 7, 23, -7, -8, -17, -15, -12, -19, -31, -14, -6, -11, -21, -9, -18, -4, -16, 4, -18, 5, 16, -3, -6, 31, 22, 27, 7, 17, 43, 31, 29, 40, 19, 27, 16, 35, 38, 2, 13, 8, 10, 12, 6, 12, -9, 3, -11, -17, -13, -13, -20, -35, -19, -23, 3, -16, -22, -16, -10, 14, -1, 0, 2, -2, -1, 7, 10, 9, 16, 19, 16, 19, 27, 28, 17, 27, 20, 13, 24, 12, 4, 15, 7, 0, -1, -7, 10, 0, -12, -13, -16, -15, -28, -23, -21, -4, -10, -35, -11, -10, -9, -2, -10, -8, 3, 26, 22, 7, 20, 3, 26, 23, 22, 19, 20, 20, 21, 15, 18, 12, 21, 19, 26, 32, 13, 11, 8, 1, -12, -8, -3, 8, -9, -20, -40, -24, -33, -27, -19, -24, 2, -12, -25, -16, -1, 18, -4, 4, 5, 11, 27, 22, 11, 12, 29, 27, 24, 27, 30, 25, 25, 33, 36, -6, 28, 5, 15, 11, -12, -10, -18, 24, -8, -23, -23, -15, -25, -21, -19, -9, -16, -19, -40, -26, -21, -23, -24, -24, -8, -6, -23, -5, -9, 13, 13, -4, 20, 12, 24, 13, 3, -9, 37, 9, 7, 12, 7, 23, -29, -1, -3, 1, 13, -16, -11, -21, -10, -25, -25, -28, -18, -22, -15, -30, -25, -13, -5, -6, -17, -11, -14, -23, 4, 4, 5, 16, 18, 32, 10, 5, 14, 11, 25, 21, 33, 19, 6, 10, -1, 10, -6, 5, -19, -24]
7554b4NJ7j6PjMj5JNjmRjJj3j3K9LPrj4L2Mj7J%MkNK8pMj4j6K8j5j2K1roplPK
7598Ej0Roj6Pl0J5kMQMl4L0J1nM%K1j7kJ6nKqJ4PqPJ3k2KnjnJRqk4PK5j8J0k1
7641a6J5j9QKqj2J8Oj5Lj3J1J1j4J2ljJ6K2j4mO%J3rmJPJj0%KRj0j3J1j1j5J4
7680crN%j0nrJ5Pj9J2j4jKLQMpJ5j9J4J5j1OMRpK2j4qK4qKJ8k5J0rmkRj3rjj1
7723a4rLj5J0K8k4pOj1RMnRrJ9MJ7k3NoK9qj2K8k3LLnj2K8j1JmKoJ4LroJj7jj1
7766b2pM1k5j0Lj4jK4pJ0j4QlKmJMJ2J3ojJ1j7K4k9L3kJpjj6PP%Jj4oJ3j3Nj2
7807a1%Qj6lJ3Om1J5JJ1j5J4kJ2olqL0k3L1j1Q%NkJ1j4J2J1j8MjklKMj9kJ1%o
7848Cj5Pk6J1Jj2J3j8J8j4kK5j2RMl5K4lQJ4qQk7K4jK1j3OJ3mJpj5K5rj6J0jJ6
$$ y = [-24, -19, -2, -18, -11, -12, -8, -23, -22, -17, -18, -22, -13, -14, -13, -26, -39, -10, -7, 0, -9, -23, 9, 13, -4, -3, -3, 1, -1, 4, 32, 25, 29, 15, -1, 27, 12, 0, 21, 12, 6, -1, -4, 3, 5, -5, 4, -2, -18, -11, -41, -26, -28, -24, -16, -12, -46, -16, -5, -10, -6, -6, 15, -2, -4, 12, 7, 9, 1, 15, 22, 14, 21, 34, 12, 14, 9, 8, 3, 4, 13, 5, -19, -12, 13, -5, 5, -16, -1, -20, -12, -10, -18, -30, -12, -6, -21, -18, -31, -20, -9, -23, -11, -14, -15, 1, 23, 9, 5, 11, 11, 24, 15, 11, 12, 19, 20, 10, 10, 12, 21, 11, -2, 9, -2, -17, -3, -12, -7, -7, -17, -22, -31, -16, -9, -28, -16, -30, -31, -29, -26, -18, -14, -21, -6, -25, -11, 4, -7, -1, 3, 12, 5, 27, 13, 5, 29, 21, 23, 41, 16, 26, 17, 13, 11, 20, 7, -2, -3, -14, -23, -20, -35, -25, 3, -21, -28, -22, -33, -24, -20, -25, -16, -25, -6, -2, 15, -8, -3, -9, 20, 12, 0, 28, 5, 8, 11, 6, -6, 22, 11, 12, 8, 10, 4, 18, 21, 12, 6, 7, -10, -11, -22, -29, 12, -13, -23, -20, -34, -35, -11, -18, -8, -22, -14, -17, -15, -19, -18, -14, -2, 11, 5, 4, 15, -2, 22, -7, 26, 24, 25, 18, 17, 1, 8, 15, 15, 16, 2, -4, 9, -4, 1, -11, -11, -3, -19, -22, -9, -3, -44, -29, -28, -17, -32, -18, -20, -8, -14, -17, -25, 5, -18, 13, 2, 10, 10, 15, 13, 24, 10, 22, 33, 15, 19, 18, 16, 13, 15, 19, 0, -2, 9, 9, 3, -12, -5, -31, -20, -19, -31, -18, -36, -18, -32, -34, -9, -21, -12, -8, -43, -19, -22, -14, 0, -8, 0, -27, -3, -4, 17, 4, 10, 23, 19, 20, 13, -2, 23, 14, -2, 8, 7, 23]
7887B3k2j7K2mj3j5J5k1j3K5nKNmnnJ8J1K%rJ2lmK1Nj9J4qJ6j6kJ5QOj2Jk9PR
7927A1pqJ4j3mmJ9k3J8k2J2l%k2K3mj1lP%NmoMQJ9j0Rj7K3nMJ3J7k6J6j9K1l3
7966aK6j6mL%Ol0J0koJ2qjmJ2k2k%PLk1J8k8L8j8J9mJ7j9K7j8J6m%LNmKJ7omM
8008B3Jj5rjKj9OjnlkJ7okJ4mnl4J6MNNj0%J3JPJ1j2KJ1j4J6j3J6pK3k6OK0j5
8049A6J0knj4rJ5j1J5Jl1K2k8lJ5Krj3jJ1komKpL2nnK7j7OqOnJ4pnRNNNoJ8pl3
8093gK9j5PJoKj0jrj0RpNj4PMKk2KpK7j0j2K4J2rJORoJ1rJ7mnKj9K9k6J7Nj1L
8136A2Oj6LnJ2Nk9J1j4KnPMolmj1J7Mj5j6MK7j5QJ3J3%j4L3j7K%JJ6k8J9j2%M
8176A3J5k1K1j4j6Nj1JK3mqqqj%
$$ y = [23, 1, -16, 6, 2, -11, -26, -11, -32, -45, -20, -25, -23, -18, -22, -27, -32, -14, -3, -1, -1, -10, 2, -1, -5, 16, 21, 2, 16, 8, 24, 8, 6, 21, 29, 35, 23, 24, -5, 2, 11, 4, -4, 10, -3, -7, -11, 8, -15, 3, -19, -7, -10, -10, -32, -9, -13, -24, -27, -20, -20, -15, -19, -25, -21, -13, 6, -4, 5, -12, 11, 6, 10, 23, 40, 14, 30, 11, 32, -1, 25, 9, 5, 8, 8, 14, -16, -6, -8, -14, -2, -10, -11, -15, -3, -25, -27, -27, -20, -17, -38, -20, -48, -10, -28, -9, -13, 4, -15, 12, -6, 10, 6, 6, 9, 14, 10, 12, 29, 23, 19, 23, 24, 9, 0, -1, 1, -18, -12, -13, -18, -21, -23, -6, -12, -14, 0, -4, -9, -43, -27, -23, -18, -13, -23, -23, -10, -9, -2, 9, -3, -1, 10, -4, 12, -1, 15, 8, 31, 5, 11, 31, 16, 26, 24, 19, 5, -4, 11, 0, 15, 16, -15, 7, -21, -24, -9, -7, -16, -29, -30, -19, -21, -27, -31, -29, -36, -4, -9, -14, 13, -4, 2, -6, 0, -5, 9, 2, -3, 6, 11, 16, 21, 15, 33, 26, -7, 22, 7, 14, 15, 9, 11, 1, 0, -9, -19, -10, -17, -12, -26, -19, -15, -13, -35, -33, -40, -13, -23, -35, -11, 1, -8, -7, -1, 8, 2, 13, 4, 21, 17, 12, 14, -5, 24, -2, 15, 20, 9, 12, 18, 2, 5, 0, 12, 17, -12, -1, -15, -13, -18, -11, -7, -13, -16, -20, -31, -14, -10, -25, -41, -37, -10, -25, -17, -4, 9, 9, -5, 28, 11, 13, 13, 14, 30, 2, 21, 9, 9, 13, 28, 7, 28, 14, -2, 3, -8, -7, 16, 12, 4, -4, -12, -13, -13]
8191a3
$$ Imaginary data points
##PAGE= N=2
##DATA TABLE= (X++(I..I)), XYDATA
0@%%%%%%%%%%%%%%%%%%Jk5M8m8M8m8M8p2R6r6R7j21J44j68J92k16K41k65L12l49
38a81L74m10M60n22N92o50P22q01Q73r63J062j172J295j426J576j743J921k126
56a119K359k624K929l282L702m217M857n679O783q335J0706j4828K3944p9073
70f3877N2078J65899j38987j32121P1433J32681l7296q4917j7914M3674M6189
81C6842K0607p4418p2955P6328J27338p2401j59589N0195J79571k7399j73501
92h9382r90J52020K0798j11003l5283O2054L5904p067k7509m3417P935Q6815J6227
105F7102j15787m2725J30475O4975j28795p9938J14303Q3680q9381p5657N9466
116a2282N6014k8620k7617J434n882J9605L9664l2842o9701L8422R1657l7826
$$ y = [0, 0, 0, 0, 0, 0, 0, 0, 0, 0, 0, 0, 0, 0, 0, 0, 0, 0, 0, 1, -24, 24, -24, 24, -24, 24, -48, 48, -48, 49, -72, 72, -96, 96, -120, 121, -144, 168, -181, 193, -217, 243, -279, 313, -337, 385, -416, 457, -506, 556, -616, 679, -747, 829, -914, 1007, -1119, 1240, -1384, 1545, -1737, 1965, -2252, 2605, -3074, 3709, -4626, 6080, -8748, 15196, -63877, -11799, 154100, 15113, -117008, -45575, 87106, 49810, -35107, -53021, -9347, 36842, 57449, -16969, -89924, -13596, 113742, 41341, -118248, -68053, 111518, 84119, -89382, -90372, 61648, 82446, -28557, -63840, -1786, 34118, 27051, -458, -43875, -35940, 50875, 67102, -48685, -91410, 39065, 104040, -24755, -104693, 9610, 93290, 3909, -71748, -12282, 43732, 15112, -12505, -11071, -16953, 2652, 42316, 9474, -60227, -21805, 69852, 32026]
128C2026j03286L3152J03289k7036r2661K1739P3246j8857m8184J9176K0957k2195
140h634N281K6972k7722l1771M5010L4913n6146l4719O1433L0493o1802k2036
152c8728N8583J0053n3285M002M6811j8351m0195L1074L3201m0519k5832M5504
164A2318J7386m5774p304M1632m590l4164J8278K5003l2823j5693M7146P776n9292
177c0101j995O7558j250p0214K378O6290k381n5693K551L8979m186j8249Q220
190A907m470j5020K6200K4277m4523l4897N7100M5021o2401n2716O0183N6083
202E6744n1007n3428L6724M4182j9622k8282K528P200J2120J6838k1937m1399
214c9339K6035O3066k4135p8939J6999Q6550o669q4671m638P3145J4143n3356
$$ y = [32026, -71260, -38108, 65181, 38145, -54516, -32777, 40469, 21612, -26572, -7396, 13561, -8634, -3353, 23619, -4103, -35874, 9136, 44049, -12097, -46816, 14617, 45110, -16692, -38728, 19855, 29908, -23377, -19375, 27436, 9085, -31110, -36, 33165, -7354, -33186, 12318, 29704, -16070, -23374, 18258, 13668, -20496, -2218, 22785, -10038, -25731, 21415, 29191, -30101, -32096, 35462, 34212, -36002, -33624, 32666, 30285, -25408, -22857, 16122, 11936, -6313, 1907, -2563, -17583, 8617, 32894, -11629, -46526, 10574, 55595, -6806, -59522, 661, 56744, 5737, -47691, -10967, 33215, 13593, -14689, -12161, -4961, 7159, 23997, 2060, -39339, -13304, 49762, 25627, -53312, -36313, 50237, 43568, -41103, -45741, 27404, 41547, -11809]
226a1809j9775K7727J9844M85j3987k7662K936N0501J1866o6161k7803P3167M2171
239F1500p0931n2205O0652N5856m4200n1983K4419M0539m337k2877j3180Q77K5897
252A0027K2487l2625m4288L2848O1570k7593p1954J8274P4126p085o7835l495
264c5543N3895J1572l4231j5355J1439J4508J1484q859l1917k80M7500J1279n6520
277b1028k2085N8515L0490n3917l4955M3950L4223l0641k8255J5961J7787k224
289G821m040r113j0956J6727K5278k0499l6896K0850M4260j8308m6601J4390M3755
302B6668j0090l6239O626K5307m590j2600M409n36n849J2475Q129k1851j0900
315a9041K8180J2922l1172j3653L1003J2447k8360r163K4003M203j8907K001J3820
$$ y = [-11809, -31584, -3857, 15987, 16472, 2485, -25177, -22241, 28260, 40126, -26035, -53838, 19329, 61500, -9431, -61636, -984, 54872, 10672, -41311, -16892, 23647, 19310, -3567, -16747, -15870, 10027, 32514, -111, -44399, -11551, 50019, 22426, -49528, -31254, 42872, 35787, -32048, -35543, 18352, 29924, -4307, -19662, -8223, 6285, 17769, 8910, -23007, -23287, 24213, 35492, -21028, -43113, 15402, 45892, -8025, -42980, 970, 35193, 4552, -23703, -7742, 10045, 7821, 3781, -5332, -16288, 439, 25717, 5218, -31678, -10828, 33432, 15124, -31477, -17087, 26668, 16578, -19661, -13035, 12272, 7682, -4918, -509, -1045, -6894, 5581, 13710, -8141, -19041, 9139, 22061, -9111, -22764, 8239, 20686, -7674, -16837, 7166, 11369, -7538, -5537, 8283]
328H283q629q962J4684M815j9146j346K1721j674k1963M613J9998p755j6323J1246
342d38J1467j5062o188J8575J192k1487K764K3251n582k3331P109K1339p742j7173
356a1306P838J1083p830l431Q219m749r148J2596J0713j8915j2740K3207J4756
369B0293k4840j6106K3618J6143j9822j4406J4005J0634p279m810L78k721N498
382E85J0967r616j8888J1390K5582j0931k9929Q557L1230m922k8972R55K3464
395I472K521j5211m643N290M806N319l012j4983n92K2558N322k7353j0284K8652
409G862J4547k6647j7230K1605J7642j4577j5468O517J0810J418m029q055m005
422i610J2650J2123j4572j9301J4106K4548j1454k7010P387K6326k755k2541j560
$$ y = [8283, -346, -9308, 5376, 10191, -8955, -10301, 11420, 9746, -12217, -7604, 12394, 4639, -11684, -438, 11029, -4033, -10221, 8354, 9546, -11941, -9177, 14074, 8492, -14839, -7730, 13609, 5867, -11306, -3468, 7615, -215, -3646, 4573, -176, -9324, 3272, 13985, -4930, -17670, 5537, 20293, -4547, -20653, 2965, 19108, -714, -15120, -1115, 9519, 2240, -2570, -2192, -4913, 585, 11552, 1936, -16952, -5562, 20020, 9089, -20840, -12283, 18947, 14025, -14947, -13992, 9472, 11993, -3218, -7861, -2571, 2235, 7554, 4542, -10441, -11033, 11525, 16847, -10506, -20790, 7862, 22409, -4238, -21468, 137, 17779, 3202, -12266, -5749, 5061, 6479, 2450, -5605, -9610, 3040, 15163, 591, -18710, -4604, 19944, 8490, -18520, -11133, 15193, 12438, -10103, -11663]
435a1663J6213M668q128o063p92N409R253l128j6125m18K0618M486k2525q192
449a6387K1706J0871j8511j1830J3610J1037p874q198K054L880L072J378o808
462b000o778Q939J1539r475j4927Q498J6625o684j6435M385J4331k225j0753N78
476d382O014K67q82k59l945n36P950J845j0645l253J1989M420j1885m915J0635
491B418M661q510l502O027J580l497P68J292l316L68N537j524p189K082P996k365
507B826p884K445O891k551n252K853L199l333j001L978r47m625K543N151l513
522G80n321L980N003l870m173L457K759k908r69K319j021k048L046J894m742k033
538c847N860K306o331k571O065K664n096k398L616J764j846o44J23q00J397K470
$$ y = [-11663, 4550, 9218, 1090, -4973, -5765, -356, 8897, 5769, -10356, -10774, 9844, 14330, -8195, -16387, 5319, 16190, -2321, -14151, -541, 10496, 2622, -5576, -3522, 358, 3430, 4808, -2000, -8778, 161, 11700, 2225, -12702, -4204, 12421, 5737, -10698, -6313, 8018, 5793, -4960, -4382, 1632, 1899, 1017, 758, -3187, -3723, 4227, 6072, -4573, -7826, 4163, 8583, -3302, -8217, 2418, 7079, -1431, -4933, 1094, 2674, -823, -55, 1237, -2079, -1711, 3826, 2302, -4887, -2805, 5191, 2826, -5058, -2613, 4278, 1727, -3525, -672, 2527, -806, -1807, 2171, 1224, -3401, -858, 4293, 780, -4541, -561, 4442, 572, -3601, -144, 2615, -293, -1262, 1057, 36, -2012, 1034, 2928, -1814, -3847, 2013, 4319, -2012, -4583, 1482, 4146, -950, -3348, 268, 2032, 186, -458, -335, -1135, 262, 2732]
554B732k442m045K913N353k830o163K259O290j402n734M40M427L70k657r20N38
570h71J018J551o71l389m8M751J027n429k003N448K886m773l321L559L380k042
586A073k860M66J862R31n11j990j014K512K436k536l636K050M330j290m540L58
602b359M113N39l232j165J990J471n58j356p55R13J901j70k622o49K900J474k726
619b91k107K215K434j466k426O31J980J37j316p40M16J012M94j015j310O85J962
636A295k24k250l71K258R06j941j240J426J419p88j250J24R09M22l33p47l59Q62
654A18R96p50j540M63J844j00j958l02J781O11j482p06R54O73l80m66r9M6N74
673B77M57q48r51R99J400r88j648Q69J772p07j670M95J360l36r48K16M25k65J40
$$ y = [2732, 290, -3755, -842, 4511, 1681, -4482, -2223, 4067, 2665, -3069, -2629, 1798, 2168, -489, -1409, -871, 147, 1698, 1027, -2362, -2410, 2341, 3368, -2061, -4064, 1384, 4270, -503, -3824, -265, 3115, 1073, -1787, -1321, 541, 1472, 961, -1029, -2043, 469, 2905, 369, -3267, -1217, 3113, 1823, -2717, -2359, 1754, 2293, -939, -2104, -114, 1357, 799, -557, -1312, -399, 1502, 1332, -1290, -1939, 961, 2435, -291, -2398, -183, 2251, 785, -1641, -1010, 970, 1107, -209, -949, -533, 479, 973, -42, -1352, -667, 1295, 1071, -1179, -1550, 708, 1614, -327, -1567, -141, 1278, 490, -760, -636, 273, 695, 362, -385, -744, 118, 1114, 364, -1176, -713, 1131, 1031, -927, -1229, 552, 1163, -319, -1025, -71, 602, 222, -244, -343, -297, 277, 734, -114, -1065, -66, 1334, 346, -1302, -433, 1339, 632, -1038, -543, 817, 481, -467, -251, 174, -91, 49]
692D9L04o86m28J102N52j436o27J631O78j702n94J673M44j494k00J331n4j075
710e32L94P96o83m91R16J68j142J91J222n69j290R32J244j290j208J555J069j753
728d71q97J805O90j716m21J471J54j109K45O76o63j51J202l63j641P64K120j105
746E90k454J277K573j250k572J106K233q71j691O06Q84l70K0K45j044k06J980
763A056K94k755m80L318P49l520r69L364J121k816j094K043Q57j033m24J8k73
780e44R20J060j723j878K235K612k482l185K386L413k064l276J523K792r29j928
796a068L86P96Q4N48l26j812M00K932k41l791oM212L47m229o40L807P48k992p38
815a583J914M47p61Q0m29p50J418J451k182k106K655K631k794k853K679K814k322
$$ y = [49, 353, -333, -761, 341, 893, -543, -1170, 461, 1139, -563, -1157, 516, 960, -534, -734, 597, 543, -532, -138, 658, -25, -516, 400, 568, -574, -383, 839, 270, -1020, -88, 1156, -134, -1342, 213, 1282, -471, -1368, 437, 1127, -589, -1010, 461, 615, -494, -249, 427, -236, -387, 815, 452, -1189, -425, 1695, 590, -1864, -587, 1986, 736, -1836, -730, 1503, 632, -1059, -453, 431, 61, 81, 326, -718, -924, 1056, 1350, -1405, -1885, 1433, 2182, -1338, -2307, 1057, 2178, -638, -1732, 311, 1168, 135, -289, -271, -544, 376, 1436, -287, -2165, 70, 2682, 200, -2985, -599, 2814, 750, -2526, -1003, 1789, 860, -1068, -682, 114, 198, 746, 420, -1392, -992, 1940, 1699, -2092, -2098, 2114, 2461, -1768, -2408, 1399, 2147, -845, -1583, 331, 778, 17, 97, -332, -1082, 336, 1787, -395, -2501, 154, 2785, -9, -2862, -183, 2631, 309]
832C09k422J868J743j341q49R11j84n21J213K47k178n2K867r0l332J78L409k56
850A520l244L94K784o60k122R84J317j298n21J648k48j864R25K017j454j964J863
867G7J768k121j359K287P99k315k10K320m24k291J023K082j509j859J805J496
883A569j947r84J898L49j752L78J532j166j263J962J009k610p72L140O01l357
899a413m60L298K98k899j06K204j53j341N45L10j079O99J647j633k231K326K741
916B753k722l083K774L191k535k965K041K430j391j516P35M07j44Q98k71k198
932a596N13L329n29m198L29M602pm569l45M030N86l109o90J857N19m20j27j014
950h39m83K279J254l205k044L781K727l853l145L535L262k831k939J903K247r25
$$ y = [309, -2113, -245, 1498, 157, -692, 219, 35, -486, 727, 974, -1204, -1256, 1611, 1521, -1811, -1633, 1776, 1520, -1724, -1330, 1454, 794, -1328, -344, 973, -325, -846, 802, 554, -1310, -385, 1632, 178, -1786, 77, 1845, -276, -1635, 652, 1451, -864, -1074, 1246, 822, -1469, -446, 1636, 127, -1732, 73, 1569, -378, -1362, 536, 885, -867, -489, 1043, -123, -1386, 576, 1585, -1025, -1797, 1343, 1944, -1413, -1873, 1425, 1723, -1176, -1282, 922, 769, -572, -27, 283, -796, -97, 1550, -83, -2314, 12, 2753, 31, -3052, -278, 2913, 378, -2587, -546, 1884, 493, -1023, -288, 119, -25, 873, 602, -1596, -1083, 2246, 1717, -2481, -2152, 2450, 2443, -2126, -2471, 1559, 2145, -964, -1654, 203, 722, 302, 175, -839, -1322, 957, 2211, -994, -3038, 743, 3470, -383, -3528, 7, 3269, 438, -2501, -598, 1649, 724]
966G24j178oj59P35J543j218k845J367L852j266m512R48M667n57m313J37L542
983A461J47k374k45J024J02L92K84j675p55K726J300l386j796L686K161l618k264
1000b830L161K072k500j579J658Q22q49Q7J13j105M75K052q71k815J100L313j151
1017A153l452J126L256j053k718R99J942r76j034J081P8j240Q47J343j609j454
1033a711K154J434k468j322K563J006k466n80K225M8j899N63J552j167j191J728
1049D69Q25k079m91K284J44k229K53J991o47j603J077J109j554n87J986M4k335
1066a343L60K580p22k625R06K440j015k026J032J396j019n79J052k97j125J203
1082B18J278k019j373K609J516k905j542K869J549k627j325K053R19j357l45N71
$$ y = [724, -454, -460, -619, 116, 1659, 441, -2404, -1037, 2815, 1549, -2963, -2015, 2652, 2095, -2218, -2081, 1461, 1608, -766, -1011, 13, 115, 507, 791, -884, -1639, 1087, 2387, -999, -2795, 891, 3052, -566, -2830, 331, 2403, -97, -1676, -18, 804, -45, 42, 155, -950, -475, 1577, 706, -2109, -1009, 2304, 1153, -2299, -1173, 2083, 1030, -1688, -689, 1253, 277, -757, 324, 402, -838, 9, 1352, -257, -1711, 443, 1877, -591, -1913, 650, 1656, -810, -1390, 835, 883, -1016, -453, 1099, -68, -1259, 469, 1294, -785, -1276, 1008, 1152, -1077, -824, 1167, 520, -1083, -6, 1103, -451, -1038, 948, 992, -1343, -983, 1597, 875, -1750, -844, 1596, 581, -1445, -413, 983, -36, -615, 437, 140, -985, 218, 1496, -523, -1896, 713, 2229, -676, -2218, 651, 2200, -427, -1752, 301, 1220, -137, -482, 89]
1098H9m17J33J259p42k116J158K807j325l335J291L528j061l357P34K868l76k007
1115h69J10R44J5L03J9j448k78K493O19l240j032L595J383l558j667L162J715
1132B266k464j473J505R86n40k51l88o26J129J571j614k423J864L075j791l415
1148b589J521L403j098l018O49K265k38j254m6J12J21J016k2k050k15K827N04
1165A888l262q56L345J120l078j232K535J116j749p79R08K64p3M46o44j136J151
1182c6J797j458k306J551K593j474k610J270K292j012j763P48J019o01j94N10
1198C26o25n24J378N57j922o11K266O77k364o17K223N42j923k81J506n2j042M97
1216A1N62r50j54J376k31j657M51J783o33j799P68J577q57j235R38P86j042k73
$$ y = [89, -328, -195, 1064, 322, -1794, -636, 2171, 846, -2489, -1198, 2330, 1269, -2088, -1354, 1514, 1138, -869, -759, 185, 200, 503, 522, -926, -1204, 1289, 1908, -1332, -2364, 1231, 2614, -944, -2611, 551, 2266, -198, -1671, -166, 820, 280, 29, -359, -985, 144, 1715, 101, -2322, -458, 2617, 826, -2589, -1068, 2335, 1237, -1781, -1132, 1133, 895, -359, -405, -293, -172, 844, 822, -1228, -1443, 1384, 1888, -1374, -2230, 1115, 2235, -843, -2075, 460, 1576, -173, -952, -44, 220, 147, 593, -51, -1187, -36, 1761, 303, -2003, -452, 2141, 667, -1943, -673, 1619, 607, -1156, -408, 611, 10, -184, 326, -299, -823, 555, 1112, -810, -1421, 845, 1522, -842, -1459, 764, 1306, -617, -898, 608, 556, -486, 11, 573, -377, -531, 845, 614, -1043, -592, 1191, 558, -1241, -473, 1104, 247, -988, -50, 736, -306, -579]
1234e79J144k23j262O92J326j012j308J197J259j279j005J228O73j082k47R25
1250D47k72p95P99O81j320n78J673N27j903m74J924M23j768l01J389J44r67J37
1268b34M46m63Q9Q71n15j278Q69J642j062j858J080J923r60j827P51J486m85j021
1286e46K76L62j33L38P8j043j45J629K89k036m71K211O85k139q01J857Q30j358
1304a17o72P49M08j58K8l96n55Q42J067j147j540J246J878j170k030R06J959n88
1322G10j686K72J182k8n21j36j88J88Q82q0j428j10J845L53j998n90J957P97j754
1341c33q04J258P62p52n15J85J12L04L22o57q37Q97J220r34j545Q64J664o82j625
1360a096M99J383k70r69R2M78j6R1L2o20j13J041K75j338m10J457N54j444o10
$$ y = [-579, 565, 342, -920, -228, 1098, 86, -1222, -25, 1234, -45, -1050, 178, 851, -231, -478, 447, 175, -620, 179, 860, -460, -1038, 635, 1162, -741, -1215, 709, 1132, -636, -937, 452, 596, -371, -234, 212, -251, -162, 709, 194, -1084, -215, 1427, 365, -1493, -413, 1510, 550, -1277, -526, 960, 475, -546, -270, 92, -41, 297, 375, -668, -813, 816, 1105, -931, -1402, 809, 1494, -645, -1446, 411, 1241, -117, -789, -40, 368, 210, 238, -158, -713, 129, 1196, 49, -1491, -245, 1633, 463, -1567, -661, 1298, 710, -976, -704, 478, 450, -71, -207, -395, -207, 675, 595, -833, -943, 902, 1255, -743, -1333, 624, 1421, -333, -1137, 121, 883, 131, -384, -199, -87, 217, 539, -118, -955, -58, 1162, 228, -1317, -453, 1211, 529, -1096, -597, 786, 516, -453, -361, 117, 101, 192, 224, -396, -509, 532, 807, -531, -941, 516, 1070, -374, -984]
1379i84J245N80r67m66O01K20k58P6j3m32K30P88l88j002M01J176l72j205L37
1398d33J094k69q41K04N59k29k12L08j44m23M57M83o40o14P68O47p87o61P36N60
1418E63o21l62M61J49l31J39K44m14j70O71J51q42j28R29J41r03j78Q30J19o17
1438a69o9L57p3j26K47r8m57K58O20l67p68L90Q58l45q49K68P47j80n21R4K84
1459A01o0L4Q3l11j45N68K55p48l61Q15M60q13n14O75N16n01m35K86K64q1n1r4
1481e7k41K36M64k75p03K67Q59j68r02N5Q74N1p23j28N11J37j92j29o3K5L30R4
1503C22n08k92O14M40o20o01N72O48m34o33K40N40r0l24m2R6J51J53j65l94J40
1524a87O01o3p15o8P56J74o91k67N69K84l69k86J60J67O4m1k28j44L38L15l89
$$ y = [-984, 261, 841, -126, -592, 9, 229, -29, 47, 34, -398, -168, 620, 232, -770, -369, 807, 435, -770, -433, 661, 392, -449, -245, 314, 85, -127, 181, 37, -386, 71, 554, -86, -700, 68, 715, -72, -733, 3, 563, -58, -420, 41, 190, -141, -2, 242, -172, -342, 329, 480, -362, -490, 439, 580, -323, -501, 329, 448, -169, -238, 119, 46, -80, 167, 69, -388, -130, 490, 123, -645, -255, 603, 258, -591, -323, 424, 244, -277, -183, 101, 41, 75, 158, -153, -298, 270, 525, -223, -584, 231, 691, -122, -636, 39, 555, 54, -381, -95, 169, 88, 37, -57, -298, -62, 402, 127, -576, -309, 550, 382, -520, -465, 409, 460, -263, -391, 120, 257, 65, -64, -127, -102, 228, 322, -186, -478, 136, 576, -44, -645, -73, 575, 141, -492, -252, 288, 198, -126, -168, -72, 79, 232, 67, -327, -187, 414, 351, -364, -432, 324, 498, -193, -460, 109, 393, 24, -262, -102, 65, 129, 88, -140, -284, 54, 369, -20]
1545b0m59L43N93k64o14J62N76k0m87l8L14J04j10r6j03N6K70L7m17j75N08K61
1567D21m97l58M32L81l60l55J96L20r2j80j2J3R6J44j00k92R6M33o2m99J4N19
1589B58O6m72j06L95J36k69j37J39N6k1L1r9j68J91K54k44l47K56M08k29m22J83
1611a41L83j41l13J06K02m9j02J05o3p8J69J34k68j64L35J86l86j95L73J79l35
1632f3j65K98R1k61MK02j07j24J80O9k41n6L42j5l45L7L87p6l58J17L12j72k60
1655b04K30J82k77j04K77L4k89L3K82r7k86J66K52k59j59K95J00l42j2L85m6m07
1677b46J10M23j62l72K22L01k33k20K50J16k80RK73j42k62K59K65l95k46M26K35
1698C31m75k17M55J87m37r0L69Jk75J08K03k38q6L74j5m47P7N54j50n78J74N86
$$ y = [-20, -479, -136, 457, 193, -421, -259, 317, 297, -190, -228, 86, 190, 80, -16, -119, -63, 207, 244, -173, -348, 160, 421, -76, -434, -2, 379, 19, -336, -140, 180, 88, -92, -104, -91, 5, 149, 49, -243, -147, 286, 224, -275, -261, 258, 324, -148, -254, 141, 277, 8, -129, 10, 66, 45, 76, -23, -191, 0, 254, 10, -337, -81, 327, 98, -324, -141, 242, 101, -212, -106, 96, 47, -55, 50, -13, -91, 78, 212, -56, -220, 115, 301, -85, -280, 93, 272, -63, -228, 70, 161, -100, -96, 106, -1, -125, 55, 124, -117, -173, 169, 154, -191, -154, 233, 157, -201, -84, 228, 56, -204, 26, 208, -69, -173, 104, 138, -151, -118, 164, 67, -219, -53, 199, -60, -219, 76, 176, -166, -178, 207, 161, -246, -136, 287, 125, -247, -25, 276, 43, -177, 73, 189, -91, -82, 191, 49, -213, 46, 311, -84, -330, 96, 331, -144, -361, 94, 281, -156, -246, 123, 124, -151, -43, 160, -78, -164, 210, 195, -252, -175, 379, 229, -349, -175, 411]
1720D11k17n22K12M40k29l11K33J27k75M8K76k16l09L63L27m75l27N56L22n92
1740a58k54N65J81n06o2M04l6l12J64K22k92j31M55qn46J11N77j73o17K41N70
1761C95k97m90L60L75l74k47M09O7l93O5M11k29l67L53L23m54k76N59J88o12p7
1782c11O21l4o12J32N67k46m86L35L62l89k42M31O9m38P2M79k46m48M10M17n32
1803h9l70O40K92o65k15O75J32o18l0N34j28l91K41K19l80o8N33j13o14K10P32
1824E27l56p66L71P78m17o70L95N56l84l36L43J08k70J47K61m08k54O69K37q43
1844c12k42R28K46r52k36Q79J86p40j12N19j0k83J63M3l35J65N34l56p05M78Q56
1865G14n68q80N63Q51m82p50M12N64l36k95K59m4j76L56J45o34j66Q77J79j029
$$ y = [411, 194, -328, -116, 324, 95, -216, 17, 144, -131, -83, 193, -23, -332, 31, 358, -117, -444, 112, 434, -158, -412, 153, 334, -172, -234, 170, 134, -178, -14, 208, -84, -215, 240, 232, -314, -203, 374, 201, -416, -175, 395, 98, -392, -32, 343, -31, -278, 131, 198, -195, -130, 281, 52, -315, 38, 361, -93, -369, 190, 378, -234, -311, 310, 276, -336, -204, 363, 117, -369, -34, 328, -61, -303, 128, 197, -241, -169, 310, 64, -384, 26, 443, -89, -459, 181, 473, -192, -407, 268, 400, -218, -248, 286, 158, -233, 8, 227, -153, -221, 312, 199, -415, -205, 527, 171, -595, -224, 554, 137, -533, -138, 418, 34, -302, 41, 149, -121, 26, 287, -121, -375, 294, 531, -312, -554, 374, 620, -332, -568, 311, 497, -243, -355, 164, 154, -129, 34, 77, -258, -93, 441, 85, -620, -142, 714, 146, -734, -171, 680, 198, -552, -140, 424, 88, -207, 52, 8, -168, 188, 333, -301, -467, 410, 589, -440]
1885d40j92J037K04r76k01Q54J39o57pM13j42j26K94r6m91K97O60m53p83N55Q24
1906G13n54q25N29P39n04n53M37K90l90j7L41k64l17N25K72p25k32Q58K25r13
1926c65j40Q48J10p70M8N88j49m36L03K82m87p4N96p3o94J92P23k86p16L60O14
1947D74m46m86M98L03n60o6N60r3o01K88O32m80n53N47N15o10l58N82K41n55l2
1968b00N05j83m56M08L62n97l03P69K21q51j78Q40J18p80n0O52p5m71K31K19l47
1989a66MN21k06o81L84Q09m91q51N21Q81n16p79M21O12l40l82K56Q6k01K63J62
2010C07n83j85Q40K12j008k57J077L00j019l31Q95K71o48j89L76M0p7J77j82m15
2030c99M02O45n48q47O10R59n96r98M87R49l95p44K36M80j48j27P6k40l8N91O6
$$ y = [-440, -632, 405, 609, -367, -568, 286, 425, -232, -239, 174, 32, -94, 200, 104, -387, -90, 570, 117, -666, -111, 713, 159, -666, -137, 602, 98, -455, -18, 272, -118, -135, 206, -58, -375, 150, 422, -303, -535, 323, 548, -365, -505, 343, 453, -317, -269, 319, 170, -266, 37, 319, -168, -242, 354, 281, -413, -221, 502, 216, -500, -140, 474, 28, -458, 40, 343, -217, -283, 277, 184, -417, -129, 503, 23, -530, 17, 532, -78, -436, 146, 387, -168, -200, 305, 122, -334, 74, 436, -161, -464, 305, 526, -325, -503, 337, 455, -325, -375, 277, 202, -269, -38, 181, -166, -162, 359, 153, -528, -144, 665, 174, -677, -156, 725, 209, -570, -149, 463, 123, -259, -3, 83, -118, 145, 307, -276, -461, 379, 591, -417, -674, 403, 703, -316, -647, 248, 519, -129, -318, 58, 98, 21, 198, 16, -399, 3, 648, 100, -747, -137, 822, 226, -772, -285, 664, 269, -475, -239, 241, 93, -34, 42, -198, -236, 355, 421]
2051D21q50j40J073J84j102k70J056L28r06l07O70K13m12m6J11j59J78L70l93
2070A9o02N28P65n79q97N63R05m97q14L83O40k65l72J71R9j59K43J40n05j69P50
2091C47J96q80k29R09K79q70k34P32J57n54m8L40j43j21L37r4n10K42O23k96p56
2112e73L73P48l36o98L31N47l10l46K90J30l13J22L41l38l79N26L72o26l84O46
2132A23L90o24l11N25J98m16k3K89k02j33L96N3n73JP30o1p73M5P78m2o83N2M95
2155B34o3k82J22M3k12J73L58m19m67N58N46o29o13O14O15n00n73M10L96k49k05
2176a43J20m0nL29o9n77R0P90p3q64j6R02O9q11j46O51J45m12j12J31J0J44J22
2199B35l86l13N65M79o77n74O43O73n86o82M66O13k79m27J05J98L2R1j34l44J58
$$ y = [421, -429, -569, 504, 688, -414, -684, 372, 700, -206, -513, 157, 370, -42, -88, 23, -136, 42, 412, 19, -583, -55, 710, 131, -766, -203, 702, 205, -609, -226, 414, 149, -223, -52, 47, -112, 131, 271, -234, -403, 347, 543, -337, -566, 343, 622, -248, -482, 250, 407, -147, -195, 145, 2, -119, 218, 124, -386, -144, 479, 183, -573, -200, 548, 212, -486, -155, 392, 82, -264, 26, 156, -157, -35, 306, -32, -411, 115, 487, -139, -523, 123, 513, -111, -422, 103, 301, -115, -138, 151, -51, -184, 212, 265, -308, -307, 423, 362, -411, -366, 412, 370, -313, -261, 234, 171, -111, 11, 54, -158, 15, 373, -46, -513, 45, 591, -38, -651, -37, 578, 78, -495, -85, 311, 62, -143, -23, -63, -68, 261, 192, -385, -295, 495, 422, -442, -458, 444, 513, -298, -444, 207, 352, -60, -172, -41, -31, 113, 235, -151, -464, 101, 580, -97, -671, -28, 645, 59, -623, -157, 456, 177, -250, -145, 53, 85, 176, 42, -302, -144]
2220a44O26j65q00Q8R03j4q92r7Q09J02n61j75L37J09n4j9j99j17L95K93n55m23
2242e53O13N58o04n93M99N77l59n00K27L38j01r9k7j30P2L83j13n46O1O97l4p53
2264c87rO90O6n65r9M13P6k01K8n0q3J84K36l50l38M25M25m42m81L96M81l24m04
2287c13K38K37j34p7P6j19k7K81M6m53n9N52R8n85r1N19J39m31j30L18N1j50N3
2310C9rj78J48L06k49m23L02M92l02n07K47M64j66m29J25K40o9k4lj31k7L55K1
2333B22m58j16N73J80o11k10N49K50m19k22K67J66r2n8p8q7K05K48l03m00L10
2354h4N29k90n89K35N70j40m95M2L58K8j66o8q1J05K53k3m58k3N77J00n91k16
2376d27O09K53n02k87L53K44j76j63kL5J72J19k90k71L36M12l60n23L27N69k49
$$ y = [-144, 482, 317, -483, -395, 508, 494, -398, -495, 314, 416, -145, -320, 17, 126, 72, 53, -146, -263, 132, 425, -130, -553, 60, 618, 14, -579, -80, 497, 138, -362, -135, 203, 102, 3, -24, -154, -82, 301, 188, -358, -297, 400, 366, -387, -396, 294, 360, -205, -304, 109, 185, -16, 12, -38, -121, 63, 299, -51, -389, 36, 461, 19, -462, -66, 415, 91, -313, -75, 162, 28, -49, 27, -92, -119, 162, 208, -245, -304, 248, 346, -239, -330, 189, 328, -103, -233, 85, 136, -14, 39, 30, -148, 0, 306, 57, -366, -64, 428, 126, -381, -134, 330, 164, -265, -140, 100, 31, 7, 4, -127, -154, 201, 222, -236, -352, 221, 401, -210, -420, 129, 379, -40, -262, 5, 171, 79, 21, -57, -144, 61, 309, 6, -394, -84, 445, 155, -434, -199, 371, 231, -264, -222, 136, 164, -2, -70, -151, -46, 207, 184, -274, -297, 280, 380, -211, -427, 182, 435, -67, -354, -1, 243, 67, -96, -98, -63, 109, 228, -62, -333, 3, 415, 55, -468, -141, 428, 179]
2397A79n22J49M29l6k75m1Q1P1J42r1l00L2M42J6n27j26N71J75n23j89L99J98
2419B54k49k01J34Q7K0L1j41j68K48K99k86l97K98M44k21m82K04L97j27k79M9
2440h6J57k8J5oj69j4L15K6m22r4M63J37m50j55L80J47k81r1J47M4n0P8o4j84
2464a85J55K68j79l52J97L93j62l97J34L55j10k42M9J26n1L0L9j28j02K63J04
2485B05l26j63L83K16m01j86L17J62k52j10J38M8l1N7k9j83R7K82j21l75J12M41
2507B81j06m24O0L72k6k71pJ52J0j7K7j49m2K59J31l82j61M08K10l85k67L49K70
2530B92k57k06J47J05k1l2m7j10J13K21j45l49J52M16j32m45P0M55j4l93j2K53
2552F1L9r2m6l6nK24M4l12j10L88J85m10k32L76K46l15k39J86K24j11j11k2oR9
$$ y = [179, -343, -194, 235, 199, -76, -117, -36, 35, 177, 86, -214, -182, 260, 276, -251, -377, 194, 369, -154, -343, 56, 254, 5, -196, -62, 25, 45, 76, -65, -233, 15, 314, 28, -369, -71, 373, 152, -330, -126, 271, 144, -135, -86, 71, 43, 58, 52, -117, -131, 184, 210, -212, -306, 157, 294, -156, -311, 69, 216, -65, -156, -9, 35, -15, 63, -1, -185, -30, 238, 59, -293, -96, 297, 135, -262, -128, 227, 117, -125, -76, 50, -1, 29, 68, -60, -162, 101, 205, -121, -284, 99, 315, -86, -272, 45, 207, -45, -155, -17, 31, 0, 57, 28, -155, -58, 224, 103, -272, -160, 281, 175, -249, -189, 183, 157, -114, -121, 31, 41, 24, 51, -98, -140, 119, 250, -132, -293, 115, 325, -60, -327, 22, 292, 35, -171, -24, 81, 60, 28, -19, -129, -16, 205, 60, -289, -137, 279, 147, -298, -228, 227, 213, -180, -192, 61, 100, 8, -38, -74, -79, 145, 189, -123, -233, 155, 340, -70, -302, 74, 320, 5, -234, -48, 176, 65, -46, -68, -74, 25]
2576B5J18j41k33J41L54j58m15J10M53q4m06M3L21K9k08l4N7K2Q2K0k13n3L08
2599A38J21l56j89L81K15l22k45K58K00j80j52Q9O6pN5o5j54J09K50j06l45J18
2621a21L68o9l93O2L18l3k24J8J13j0j0K0q6q0K02J04k50j36K57J89k72k08K35
2644fJ87j70j47J28P8p2K1kq8K2J95m4k89O8L29m1l28KK71J3k14l7J20K7k4L3
2670C2p4r9J56J44j97k07K40K52k40k28J99K23j59j71R2J03j5l9Op9J8J90rk92
2694a54J8L14K0l18p5K91Q0k41r0J80N5n9m8j9l9J08J23j81j91K24K25k03k68
2717b48J93K73j25k43O7J85Jr6l7pN7J14m9k36K9K91K3l42l4L13Q4k96q4J90Q7
2742A10r6q1J2L7O3N3j34j25J95J84j94k40J78K49j36k47O2K37l0j51k0P1K2N2
$$ y = [25, 143, 2, -231, -90, 264, 106, -309, -199, 254, 170, -236, -193, 128, 157, -51, -85, -28, -6, 76, 96, -117, -170, 138, 259, -97, -286, 95, 310, -12, -257, 1, 201, 21, -131, -42, 24, 17, 72, 7, -147, -38, 212, 106, -239, -121, 247, 178, -215, -153, 165, 132, -92, -74, 39, 29, 19, 39, -47, -127, 75, 179, -71, -207, 50, 239, -33, -241, -6, 181, 11, -136, -8, 70, -2, 19, 17, -71, -49, 146, 102, -187, -119, 210, 169, -159, -157, 114, 127, -87, -124, -4, 23, -1, 32, -42, -141, 15, 159, -38, -245, -5, 247, 7, -221, -22, 201, 42, -129, -37, 66, 51, 12, 18, -61, -43, 147, 138, -154, -136, 178, 198, -120, -195, 96, 176, -65, -155, 25, 80, 21, -27, -46, -85, 23, 146, -35, -226, -2, 223, 20, -248, -55, 218, 93, -150, -83, 102, 103, 7, -30, -37, 20, 134, 85, -151, -122, 169, 192, -150, -184, 129, 213, -83, -167, 23, 110, 14, -67, -55, -18, 45, 98, -36, -161, 34, 218, 24, -216, -38, 211, 75, -172, -110, 127, 97, -54, -74, -3, 19, 71]
2766G1m0j50L6K45j2k86m9L10P6k57j15K08J42j50j06M0P4K2j2j09q1J65J51j74
2790ak11J67K45j31k61Q9K30n4j82RJ07M0j3m2p3M4J35J3k15l8K50Q0k38j26K31
2815E5J22j70j03R7P5k1k1m0n6Q9J11j29j70J02K25r6k37N8K28k3j80j0J32J1
2839D9m1j0n2K3R9M4j83n1K09Q9j98j40J79J47j23j59J02R4l5l8j7l3M2J06o8
2864C5j76Q7J79m2k21L4J98J3j84j5J22N8m8l9l1J4Q4K6j52n1J45J21j75j44J43
2889a9J64j14j61Q7J26rp2l6j5P4P4p2j27M6K03n0k14K8J76N4j90p2J38R5r2o7
2915d5rN5N0J0j05o5J51Q3j41j43J34J56r4j71N1J62k1r2l2O4M7K3l2j11M5J50
2941A20j9k09J1J90N3j94p4J43J01r8r4J4N3M4k3j01j8J23O7j26j08J18J54q9
$$ y = [71, 31, -119, -83, 162, 150, -136, -185, 125, 201, -56, -171, 37, 179, 29, -77, -37, 37, 59, 47, -62, -143, 22, 173, -1, -212, -45, 200, 69, -192, -103, 127, 73, -109, -100, 7, 47, 34, -8, -81, -37, 98, 111, -104, -142, 108, 188, -50, -176, 55, 177, 7, -96, 1, 76, 55, 34, -6, -62, 27, 138, 9, -161, -59, 166, 70, -167, -109, 119, 96, -84, -94, 38, 49, 8, -2, -54, -31, 68, 112, -71, -122, 87, 176, -22, -162, 17, 164, 41, -118, -16, 78, 43, 5, -12, -45, -3, 103, 35, -141, -54, 125, 83, -138, -104, 94, 107, -77, -92, 30, 88, 40, 1, -30, -16, 68, 94, -58, -109, 36, 157, -18, -162, -19, 145, 31, -130, -43, 83, 74, 2, -34, -49, 25, 99, 27, -100, -54, 149, 99, -115, -87, 89, 143, -47, -119, 19, 114, 22, -45, -54, 1, 51, 61, -44, -109, 42, 125, -16, -159, -25, 131, 37, -134, -83, 79, 58, -34, -66, -2, 45, 68, 36, -75, -30, 120, 101, -108, -97, 93, 146, -48, -122, 21, 122, 24, -70, -56, -3, 41, 18, -83, -101, 22, 89, -37, -145, -27, 127, 38]
2965C8j68P9J49j7j44MN7O6k2m9m9L3J04kj44k5J67N7j74q8J51R6j11r5O1P0q
2992C6k3n9K5O5N1r3j07Q7J28q0j49M6J64k4j16k1P4M4k2l8k5J7P3j8j17lJ25
3019D0O0j20j07J29J03j08p5P0P8l8l9m0kO2N8p0q6P7J15m7j32J5J28j0j31oO9
3046gM7l7m5j9L8L9J3q0k8J01P4j23q7J07J01p3q3M3O9j0m2l1J6O3K6n4j01M6
3074c7J36m6j34jJ50Jj04n9R4N8m8o3nM1M4jp6k1Q2P0r1j14R8J54j02j05M2P1
3102C4K4q4j2L0L8J5k3r4N0R7k1j12j1J18K7r8p2R6O4n0m9J8J6K8Ko8l8J04M6
3131G5p8r3R1Q6n6j02L4R0Ko6l6L6N0Oo6l8M2R1k0r5qJ01K7q1m8Q7L6n9m7L3L0
3162B4J4k9l5j9N4N1o6p2M6R2l1j11M8O8Oj01nO8K1Kk1l6OO8j1q7%Q8L7q5m9P8
$$ y = [38, -130, -51, 98, 81, -63, -59, -2, 64, 42, -7, -56, -23, 81, 79, -65, -90, 77, 134, -40, -128, 23, 119, 8, -87, -26, 44, 36, 13, -46, -21, 44, 95, 2, -105, -18, 110, 30, -119, -73, 91, 67, -49, -70, 4, 48, 26, -12, -37, -20, 53, 35, -82, -85, 40, 100, -20, -127, 2, 105, -3, -78, -8, 70, 32, -7, -47, -49, 13, 71, 1, -85, -8, 107, 60, -72, -57, 71, 61, -70, -76, -7, 40, 3, -42, -61, -23, 16, 29, -51, -79, 22, 96, -27, -114, -7, 94, 21, -62, -19, 50, 40, -2, -33, -17, 46, 72, 18, -83, -37, 99, 53, -81, -82, 68, 69, -35, -94, 0, 58, 10, -53, -58, -17, 27, 26, -50, -71, 11, 81, -10, -124, -26, 128, 26, -79, -37, 34, 58, -26, -38, -8, 30, 45, 22, -72, -22, 75, 54, -58, -69, 49, 76, -22, -94, 2, 66, 16, -33, -15, 1, 29, 31, -37, -75, 29, 75, -3, -96, -5, 81, 25, -77, -43, 47, 49, -17, -53, -17, 33, 39, -27, -65, -23, 68, 48, -47, -55, 46, 73, -8, -56, 31, 67, 8, -39, -6, 24, 38, 9, -26, -45, 9, 60, -6, -78, -32, 60, 29, -82, -34, 34, 40, -61, -66, 2, 23, 25, 4, -32, -26, 42, 31, -56, -56, 32, 69, -16, -65, 13]
3194A3M8m8k7PJ8J2pl4k3M0O2o1p5M2Q7j8j16K2R8ko5MJ8NNl4j3KQ2j6m4m0P5
3227A7N6q1m2L6O9m5m6J0K8K0j2j5l4N0L9l8p1J9Q4%j02K1N4K4p0j0L6K3Nl1m1
3258d7K4O4k6l8m1O9L5o6n9O0R0o0m7J2L4K0j4j6pK4K1j5m2%Q7qq0j6J02Mo4m1
3290d1N4K4l3j0j8NL2Rn7k1N1M3n3n1K9Q0l0o3J4N9J6k8k3jK9M5l8k9oO8oo0l4
3323d4Q1M0q5k8O0K2m2j0j7J8J6J5n0o1P0O6m3q1N4O0k4o4J4M6Ok9k0L3PK7j7
3354B0l5KM6J3p2k9R8%m3m0M0M7n7j3NJ5J4oNm7L9M3l5n5K9O9k4p7K8K7K3m7k2
3387c9L5jJ9jm4k0P0Pn9j3M5O5n7n9P4J8k5k9OJ0K9qk4k0J7O8n1p2L2O5j0q3J7
3420c8N2%m1mML7mj1l8J2N2%m3l8O8K8m8m8M1O4l7l6J6K8J3J0k3l9K7L4k5o1K3
$$ y = [13, 61, 13, -14, -7, 11, 23, 16, -18, -41, -1, 61, 0, -75, -33, 54, 36, -80, -58, 40, 38, -27, -23, -5, 0, 5, -29, -42, -40, 42, 26, -18, -58, 17, 73, -8, -50, -14, 55, 10, -36, -26, 2, 22, 10, -5, -39, 11, 50, 12, -59, -40, 44, 44, -58, -37, 17, 41, -29, -39, -3, 20, 25, -6, -47, -23, 41, 15, -23, -64, 5, 40, -26, -85, -25, 65, 5, -42, -30, 4, 24, 10, -6, -13, 11, 32, 17, -25, -25, 62, 54, -26, -42, 60, 64, 0, -41, 13, 37, 4, -6, -24, -19, 13, 22, -35, -56, -5, 38, -15, -66, -37, 43, 13, -50, -36, 23, 39, 11, -12, -13, 16, 61, 23, -6, -12, 56, 50, -10, -44, 37, 77, -8, -36, 24, 46, 4, -6, -23, -5, 11, 26, -24, -85, -15, 51, 8, -73, -19, 41, 17, -47, -33, 13, 19, -10, -30, 3, 10, 37, 20, -15, -13, 33, 46, -26, -55, 43, 43, 0, -40, 0, 47, -10, -23, -18, -3, 11, 5, 10, -37, 2, 45, 10, -45, -16, 53, 29, -48, -20, 7, 30, -17, -39, -4, -5, 14, 13, -31, -51, 19, 26, -33, -46, -1, 64, 7, -52, 22, 40, 15, -14, -8, 2, 31, 23, -1, -21, -4, 64, 13, -59, -27, 38, 28, -55, -38, 14, 14, -27, -31, -27, 10, 6, -5, -43, -31, 21, 21, -22, -60, 8, 36, -12, -60, -19, 45, 8, -28, -12, 16, 29, 39, 16, -23, 4, 38, 13, -48, -25]
3453b5O4j5n7NN2nk0l1J1J8Ok6k4L0J9K4m7k5N9K7m0n3M6N1l5l7J3J8K2j9k9j
3485b4M0rj2l2K4O0j9o1J2L2J3k3l5L1L1pm4MK0K9k0k8m7N8L7l3n1K6M5k7l6J8
3517b8L2%j5j6j0L4Rqm1J2O6No2mN7K2p9j0L8K3j9k4jRM8rm8j9M8L2n5n2O4J2
3551A1j1n6K3J9J6j2l1L1K2JJn9L3N4j3m8k8P1K5m3k9M4J0j9jk1j3L8%l7l5K9
3583b8N6m4l5K8Q3l3n6j0N8rj5l4ON4Kj8l1j1N9Pn8PL9K4l5l4K1M3j0n8J8QL6
3616C0j5k8j9M3K9k5l5j3O7l0k9oM9J8m2j7K2J5Ol8j7PM5j6m7NN4Nm1j9K7M5j1
3649A9m3J0J5OJ0m2RL1J7l3k8K9O7j6n7pK3L1k4m3K3J8J6n3KJ6L2j4o1PK6K3k0
3682a1l3K8M3j5m7j1N7J3k6l2K0J9L8m4j2NM6k4l0JL5K9m9l0L5J1j0lk3J0L5k
$$ y = [-25, 39, 24, -33, -28, 24, 19, -1, -32, -21, -3, 3, -23, -47, -17, 2, 26, -21, -46, 13, 40, 0, -53, -7, 44, 9, -28, -15, 3, 25, 6, -23, -24, 16, 7, -5, -37, -13, 47, 28, -33, -21, 11, 24, 1, -34, -3, 28, 21, -23, -19, 1, 30, 10, -18, -65, -7, 30, -3, -54, -28, 17, -10, -46, -28, 4, 4, -11, -27, -37, -3, 6, -2, -43, -31, 35, 40, -22, -26, 31, 53, -26, -36, 2, 25, 6, -18, -19, -10, 38, 29, -19, -38, 10, 42, -13, -65, -1, 11, 0, -56, -33, -14, 2, -10, -41, -10, 12, 13, 14, -45, -12, 42, 29, -19, -47, 24, 49, 6, -23, 21, 31, 12, 11, -10, -23, 15, 15, -22, -57, -28, 28, -16, -51, -23, 60, 27, -29, -39, 19, 10, -5, -39, -33, 21, 23, 5, -26, -37, 22, 29, -29, -22, 17, 41, 6, -28, -7, 36, 26, -32, -14, -6, 30, 15, -13, -32, 11, 40, 15, -20, -33, 34, 4, -25, -31, 18, 36, -6, -23, -1, 14, 20, -18, -35, -28, 17, 1, -46, -41, 13, 18, -23, -42, -15, 30, 19, -24, -14, 1, 7, 17, -25, -16, 15, 32, -1, -29, 0, 67, 51, -6, -13, 10, 41, 17, -26, -3, 15, 31, -22, -20, -4, 28, 14, -47, -40, -14, 9, -11, -44, -16, 27, 12, -35, -46, 11, 24, -2, -34, -14, 5, 43, -1, -13, -8, 38, 14, -16, -15, 20, 49, 0, -30, 5, 16, 6, 3, -20, -10, 25, 23]
3714B3l6l4M8M8o8j9L8M6k6m0j4L3J4pn0J8L6Rl3pK0L0nl7LJ7L3m3j0J2L8Ln0
3747a0j9L3L0j3l6j2K3K8k8k5K0L9j6m7LL7J8m6qj2M2Pk8j8K3M0k0k6jL8J3k5
3779Dl5K9L8j4l5j2L0K1Pl3k0N2K5p9J1J3K1j3l3QM2Jl0k8J4M0J5n3j0OM2j2m6
3812c4J5L3J8k2k8L7L1j7l1k8L3K8rm4J2M2Rl0k0J8L9k3n3j4N3K4k8l5J3L0mj0
3844El4L6K5Qm0j7L5J0j7l2K0K5k3poJ3M6k8k9J9J8Ol4j5L3Pj5k7oN4Jj5l3JK6
3879A0Jrl1J0L5k2l9K9K1Pk0j4K0K6pm3J3KMRk0MK2J1k9lK6L9l9ol2N6j1j9k3
3914b2K7J5j0j8J7J1Opn3J7J1Qm0k0M2J6rj6pM8lj0k9NL5%m5j5L3K3%k6KK4K1
3949C1l5%J5J4k8qj0K6K1Jl1NK0Nl2lJ9Okl3k0L9J5j8j6JL4J3l7oJ7K0rl4kL3
$$ y = [23, -13, -47, 1, 49, -19, -38, 0, 46, 20, -20, -34, -1, 13, 6, -44, -26, 10, 19, -14, -21, -1, 29, 24, -13, -10, 7, 40, -3, -13, -1, 37, 40, -10, -29, 4, 34, 21, -15, -27, -4, 24, -4, -29, -9, 30, 14, -33, -30, 7, 25, -21, -29, -41, 1, 8, -20, -38, -15, 25, 5, -21, -22, 16, 29, 4, -31, -2, 36, 22, -13, -25, 5, 26, 33, 0, -20, 32, 57, -22, -11, 2, 23, 10, -23, -15, 27, 28, -2, -30, -16, 24, 39, -14, -24, -18, 24, 12, -34, -19, 14, 32, 10, -18, 19, 50, 33, 2, -26, 7, 35, 26, -18, -6, 36, 45, 15, -5, 13, 52, 29, -24, -38, 15, 39, 11, -24, -11, 19, 15, 5, -29, 7, 32, 40, 0, -17, 18, 28, 11, -21, -1, 24, 1, -6, -12, 1, 47, 19, -10, 9, 27, 33, -1, -16, 17, 24, 9, -18, -24, 30, 31, 16, -17, -16, 10, 11, 2, -29, -19, 16, -6, -45, -16, 5, 12, -8, -22, -2, 24, 17, -26, -13, -11, -7, 2, -18, -14, 8, 19, -10, -13, 13, 52, 13, 7, -25, 31, 20, 1, -22, 5, 20, 10, -8, 9, 20, 26, 19, -34, -17, -6, 2, -38, -58, -16, 0, -9, -25, -32, 16, 13, 3, -26, -21, 14, 14, -31, -46, -13, 10, 10, -16, -14, 10, 31, -4, -4, 11, 25, -3, -11, -21, 5, 26, 27, -4, 1, 21, 26, -6, -9, 10, 16, 14, -19, -39, 0, 15, -3, -19, -18, 16, 29, -8, -14, 3, 23, 14, -20, -22, 11]
3985A1kQn4K7K4K4l8j5J6K7j9l2K3J6J7k3j3KL3k2nk5L7mk2pQJ1Ll6pK5OJ5k3
4020a4qK8Nj5j1j9N2j1k5RJ9K0j8j6J1K3nk0j2QK2%m3NMK6j8j1LJ8Nl4mJ7K7k5
4056gk8K0K0j4Ljj5K4J3l4mK0K5pj5j6M4Qk7rK1J2rk0JmNpopK7%l0JJ2%K1qj7
4095hJ9Nj6mNrK6k2oK3Mj0rJ0K4j8poK4Ll6J9j6K9jj3Nj4K0Nl2J4Qlpj9JQK0j2
4135Dj8J0J8j2j9J1J2jj5qj2K6Kj4J8RrKk1J7QQj2k5J8L3k2j4pK6Qj2j3qM1pm9
4172b7K9j8K6kj5QQj4Oj3mL2j5k5MK0kJ0j7mK1OKj0pK7l8K1j4J6Mpj7J7J4pk4
4209iNJ7rMj9KpK9k7J1MOk6K2j0PK1k0j6%J5j1N%lJ6KPj2pJ7j9kJ1j4L4k5Pj8
4248a2K5Nj0LQLj1Rj7lPj7J6LQk0QpRJ2k9j2K4Nj1JJ3Kj5J9k3pJ6Qj3PK0j0j4
$$ y = [11, 9, 17, -37, -10, 14, 38, 0, -15, 1, 28, 9, -23, 0, 16, 33, 10, -3, -1, 32, 10, 5, -20, 17, 13, -9, -16, -8, 3, 6, -30, -37, -12, -6, 9, -14, -22, 6, 11, -4, -15, -34, 18, 7, -18, -9, 10, 30, 12, -4, 7, 30, 25, 5, -7, 1, 23, 23, -20, -15, -11, 15, -3, -14, -11, 7, 12, -22, -26, -9, 18, -7, -35, -15, 5, -9, -6, -7, -22, 2, 15, -19, -23, -3, 22, 15, 0, -16, 28, 36, 9, 0, 21, 33, 24, 4, 5, 1, 6, -1, -7, -14, 13, 13, -17, -16, -4, -4, 17, 9, -8, 11, 16, 0, -4, 1, -8, 18, -4, -10, 13, 17, 7, -2, 8, 32, 14, 7, 1, 25, 28, -8, 11, -5, 24, 23, 10, 15, 1, 21, 26, -6, 8, 16, 13, 6, -13, -12, -4, 16, 4, -14, -4, 14, 2, -17, -6, 6, 5, -10, -18, -30, -4, -2, -16, 2, 11, 2, 4, -17, 0, 8, 16, 4, -21, -3, 30, 8, -6, -13, 13, 21, 9, -4, -12, 29, 22, -27, 2, -16, 10, 8, -7, 1, 9, -5, 1, -12, -16, 16, 1, -24, -20, 0, -2, 8, -9, -13, 8, 14, 16, 6, -1, 26, -12, 9, -5, 11, 15, 8, -9, 8, 22, 15, -9, -4, 13, 4, 8, -11, -9, -16, 13, -14, -3, 1, 7, -19, 3, -7, 0, 21, 1, -15, -15, 0, -11, -6, -6, -9, 7, 9, 16, 4, -3, 14, -5, -7, 4, -10, 24, -1, 6, -12, 13, 18, 8, 11, 19, 22, 11, 20, 3, 0, 7, -10, 6, 9, 17, -3, 5, -2, 7, 19, -10, -22, 2, 7, -4, -3, 10, 12, -3, 16, -7, -14, 2, 10, -3, 4, 24, 14, 0]
4287@PPl%j0mJ5J0qjj3J5J2k5j7oK0qojK3k3K2nLlJk9K7mJ3j1LQ%rRj0K5k9jJ1
4329EoK0j5QQrj1J7l4L0JrkMJj%Ppmk5J9PqnJ8rMMk0ojJ6Jj5J1jK4l0L4k7J7o
4372EkJ5j8J2j2mKJ4Lj9K2j9RoqjJ1%j3J7k2J4okJnJ0nk0J6KKQjqjJ3J0knkMO
4415A5j0Pj0QJ3k2J0PKj2rJK2k4Oj7J4lnKLJ2nj4K1jj7J7j3j5K5k3K5j0J1j3J5
4452A3pqJ8J1l5OK4njj4jlj7L2k2kKnJ4QJ7k5Jkj8L1k5J0LkJ5nnLnRj3jJ4j2N
4493CjlMK3l2MJ3J1jQk4Oj1J2NnqPJj0Nj7K3l8J5j1K0J0j7Oj3J4k0J5nJ6knKN
4533EQPk1Rj4J1oLK2olOk8%RkNMmkoJ4Olj4Lj3J5j0j1J2k2J4lrK4KQk2J3pK2L
4576A9k6JJ3lMrMkL1k2j8QK0nj4mnJ4qJ0JqomMk%J3rRJqJ1j3MKK2k3jNK1j2j2
$$ y = [0, 7, 14, 11, 11, 1, -3, 12, 22, 14, 13, 0, 15, 27, 2, -15, -21, -1, -9, -15, -16, 7, -16, 6, 1, 4, 1, 2, -27, 0, -4, 9, -2, 1, 9, 9, 0, 9, -1, 24, -5, -6, 5, -1, 19, 4, 12, 20, 11, 0, 17, -17, 13, 14, 5, 3, 7, 8, 7, 7, 14, 7, 3, -22, -3, 4, -4, -9, 9, 0, 4, 8, -12, -18, -19, -3, -2, -17, -6, -7, 17, -13, 21, -6, 11, 5, 3, 18, 0, 12, 0, -4, -2, 12, 15, -4, 18, -1, 8, 2, -6, -7, 4, 4, -9, 8, -14, 0, -6, -8, -7, -12, -2, -7, -27, -11, -9, -7, 1, 0, -8, -9, 4, 14, 12, 7, 5, 9, 15, 5, 12, 2, 10, 23, 1, 11, 18, 20, 8, -1, 0, 22, -2, 4, -13, 1, -2, -7, -5, -2, 10, 5, -9, 12, 11, -6, 11, -2, -17, 8, -15, 10, 0, 11, -2, 13, 6, -2, 16, 27, -8, -2, 22, 17, 16, 2, 1, -2, -19, 13, -9, -11, -9, -14, 0, 8, 25, 0, 1, -1, -19, 12, -13, -3, 0, -2, 13, 8, 3, 6, 1, 10, -3, -4, 10, -2, 3, 2, -1, 3, 26, -6, -2, 11, 22, 21, 29, 5, 11, 0, 12, 17, 12, 4, 11, 12, 2, 7, -10, 13, -25, -10, -21, -1, 9, -8, -2, -15, -1, -21, -6, -11, 5, 3, -2, 0, 5, 13, 20, -1, 8, -6, 5, -1, 2, 24, 18, 15, 21, -7, -7, 2, 0, 5, 9, 5, 3, -3, 11, 17, 14, 0, 3, -10, 5, -5, -16, -4, -26, -12, -15, -24, 0, 2, 10, -12, 1, -6, 16, 19, -7, -6, 7, 4, 8, -1, 3, 1, 32, 10, -8, 0, 20, 15, 1, -3, -8, 6, -2, 8, 9, 1, -5, -9, -5, -7, -7, 6, -3, 6, 7, -1, 10, -3, 1, 3, 25, 2, 1, 6, 27, 15, 3]
4619CnOJ6j0rKJ9rLk1K2Qj2J5k0J1Lj1LqJJ6Kj7Noj2Lj3K7rKl4M2Kk7JJ4J9j8
4659DooL1j8LLLomPqK1%JrkLj1rLj5KK3rjj1K9k8mLJ3Jmk1J4K2k4pJ3LK4Qk7Q
4703A2LqNkOlJ6k9NKJ8k0pQoJ2j3mQnQj0Q%K1pj6kJ1Qk2jNppJ5LJ6j5K0k6J3J0
4746B3j7J%j1K0j1lJJKOnj5K0mJ1k2J0OQnlplmLllJ0k6K4jjk3qL2j1jnK0%P%j3
4790@J8j1JMJMJ6rj8oK7Mk1j6KK2j2lj0J8%j3QoK9l1OPoJ2j9l%J3Ok0J9mJ4j4
4830Ij1RK5j8rJ3j2J9j1JMqJ2%k1QKkNj6K1j1J1j2mj3J3JqLNlMnqOJ7nk5J9kJ1
4872A4KMKJ8k2nOmKmnJ3k2J1JKRpqJK1k7NPl3L1Rlk5J9KQpj4NmJ1jj6J8%MkqK6
4917C4rJ2l3J9JnkqJ1k6J7oMJ2j2MrnkJj2K1r%mMKK0l0J3KnJ0Mk0K0kLj8NK7j1
$$ y = [3, -2, 4, 20, 10, 1, 3, 22, 13, 16, -5, 17, 25, 13, 28, 8, 19, 22, 11, 14, 6, 7, 23, 25, 8, 13, 7, -5, -2, -15, 12, 3, 5, -29, 13, 15, -12, -11, 3, 22, 4, -2, -8, 23, 5, 8, 11, 14, 8, 4, 11, 3, 24, 24, 25, 16, 14, 17, 6, -3, 0, -15, -13, 10, 1, 0, -11, 18, -10, -14, -11, 2, 3, -1, -22, -8, 14, -10, -17, -4, -1, 23, 31, 4, 12, 15, 7, 12, 10, 16, 13, 29, 0, 5, 7, 25, 5, -2, 6, 0, 12, -1, -5, 3, -2, 6, -4, 4, 4, 25, 18, 2, 0, 11, 19, -3, -4, 1, -6, -13, 2, 5, 21, 6, 26, 0, 13, 23, 6, 7, 7, -4, 16, 5, 2, 3, 4, 6, 12, 7, -8, 12, 8, 19, -3, 7, 13, 21, 16, 13, 6, 3, -1, 2, -1, -4, 6, -20, 4, 3, 2, -21, -29, 3, -8, -9, -14, 6, 6, 13, 13, 0, 18, 7, 8, 12, 13, 17, 33, 24, 6, 0, 27, 31, 10, -6, -4, 18, 6, 3, -7, 11, 11, -2, 6, 0, 29, -2, 4, 11, 5, 17, -2, -5, -5, 8, 14, -6, 13, 9, 23, 9, -2, 7, 32, 14, 5, 18, 6, 25, 14, 15, 19, 11, 23, 23, 2, 10, 12, 10, 15, -1, 20, 9, 20, 8, 4, -9, 4, 5, -3, 0, 5, 2, 6, 1, -7, -1, 16, 11, -14, 5, 3, 14, 16, 20, 22, 40, 18, 13, 19, 15, 17, 13, 8, 21, -1, 10, 11, 13, 22, 15, 7, 8, 29, 2, 7, 14, -19, 12, 21, 18, -7, 12, 14, 22, 15, 1, 6, 2, 13, 12, -4, 14, 14, 18, 16, 8, 34, 25, 37, 4, 23, 24, 19, 17, 9, 20, -6, 11, 5, 9, 21, 9, 13, 4, -1, -3, -2, -14, 7, -2, -2, -6, -2, 0, 20, -10, 3, 5, 0, 10, 14, -6, 14, 12, 15, -3, 2, 29, 18]
4959A8Kk0RJ8j5j0OJ5kqkolJ0qQqJ5k6oOJ0KNkj4lJ9nj0LJ3Opj4POnj7RjLJ8j0
5003FMKJ3k0lJ4Kj9PLNmlJ7k0PpkKOJl0J4K9qrlRjj4K8k4J0%J3k5kL1j2Jj2LJ8
5046B7J2j4j0NkNpk7J5J2pMj4NM%j4K2k1Pkj8MNMnJ0j0L3k3mpJ7qOJ0k7K1j%j
5087FJRkkOLrLj0MpNJ4n%mmjnLKj2JK3j5QrlOnk7L2LkNk3L0l1J8krJ3j6K8k4p
5133a1L3Ok7J0JpPj9K0k5QKlJ0J4m2K6nKrJ6l0K5J5j4oOj1NJ4rPJjqqJ6kj3PJ6
5174A7k5L0lnj2J1J5k3Nj3Pj0KnJ9j2J3k9J4Qj6pJ3oKQJj4J3N%J1J9k6J0lpqJ4
5213A3j5MJ0lnLk6J2K0l0J4j4K1KLj3ORj2Mj1KJ8J0k3L4m0K6j9j5J2KPk0QJ1J
5250FJ5mkJ0k4J4J3j9%lJ9Rj8mLMJ8l3Jj6LjOnLJ0k9L3%mJ1ok4J3j0kJ5%J0J0
$$ y = [18, 20, 0, 9, 27, 12, 2, 8, 23, 21, 13, 11, 5, 2, 12, 4, 12, 4, 19, -7, -13, -7, 3, 5, 10, 8, -6, -9, 10, 5, -5, -2, 11, 17, 10, -4, 3, 9, 4, -13, -4, -5, -2, 16, 6, 10, 12, 25, 5, 2, 16, 18, -1, 6, 9, 14, 10, 7, 24, 4, 11, 4, 2, 4, 10, 11, -19, -5, 24, 16, 7, 4, 13, 12, -2, 26, 2, 12, 12, 25, 0, -2, 29, 17, 18, 6, 9, 27, 39, 25, 15, 20, 18, 23, 16, -11, 4, 16, 9, 13, -1, 4, 8, 8, -6, 16, -5, 2, 0, -18, -14, -9, -5, -10, 0, -10, 23, 0, -4, -11, 6, -2, 4, 14, -13, 8, 7, 7, 6, 7, 16, 14, 12, 18, 21, 12, 15, 5, 9, 2, 7, 21, 16, 16, 12, 8, 7, 2, 5, 7, -5, -4, 19, 4, 12, 3, 0, 6, 1, -26, 6, 9, 7, 12, -11, 19, -12, 6, 4, -5, 8, -8, 20, -4, -11, 22, 28, 1, 11, 12, 5, 12, -7, 13, -12, -4, -2, -5, 5, 19, -23, 3, -2, 0, -9, 7, -23, 2, 17, 3, -3, 3, -8, -3, 11, 2, 9, 10, 9, 1, -7, 9, 7, -6, 1, 17, -8, 22, 19, 14, 2, 13, 28, 5, 10, -3, 4, -6, -4, -9, 10, -2, 11, -18, -4, 4, -12, -19, -6, -12, -10, -2, -1, -15, -2, 3, 3, 14, 33, 7, 17, 14, 7, -1, 13, -2, 2, 12, 9, 4, 7, -19, -7, 13, -17, -3, -17, 4, 6, 9, -4, 2, 11, -1, 3, -8, -6, 12, 22, -1, 33, -7, 19, 0, -15, -3, -1, 6, -14, -6, 5, 6, 21, 17, 15, 25, 1, 15, 28, 9, 9, 6, 25, 34, 16, 12, 15, 19, 37, 4, 5, -11, -8, -9, -3, -8, -5, 5, -24, 9, 9, 5, 16, 10, -14, -1, -11, -13, 2, 2, 12, 22]
5290B2j6NlOkJ2nJ1j8%jjQkPmnRj1Ok1lMmj5J0J9r%qJ3j6K1j1lJ0J0k7J1JoJ3
5332GJ6j0%nLmLj0J5k3J4Ml%mpj1L8j4J4%j6pkpJ9j5J4j2KrNJjJ7rnqRJ6qlpQ
5376ENj8K8nj0QoJj7K9J0l1J0L0l6J4kNrpJ5pomMrlrJ9j3MJ1mQjj7lKj2K0J4j5
5418bk3K7K4lKJk6J2Lj6K8k3J6kj2J7k1J8jk1LJ6k0J7rqpK1j7MJ2k2J2j2J5j3
5454a0MJ2kJ1k1LK2qKlK9k1Jj9L0j0QJj7Njj5QrK2Oj6jmjj6RLj5QM%%NoK1l3K8
5497A4kj3LK1k0NJ2k1J9Roj5J6pJ3k3MJ3oj5Lj5J1J9j4QrNoQJ6j2l3NK1j3Kkj
5536fJoK1pJ0LKk4kJ0J9j9oK3Mj3J6l3J5j6L0Kk5LrJ6k0K6kpLk0K6Jk7J5j0Ko
5575a0mJ8qJ1MMk1J4Mk6J0j2K7lqJ8j6pJ3J1k2J3J4j9jmPj5KRQKjk2Q%OJPj4%
$$ y = [22, 6, 11, 8, 14, 12, 24, 19, 30, 12, 12, 11, 10, 18, 16, 23, 19, 14, 23, 12, 18, -3, -6, -2, -6, -21, -11, 8, -1, -1, -9, 4, -12, 9, -2, -5, 5, 15, -12, -1, 0, -6, 7, 23, 13, 13, 8, 11, 7, 10, 0, 15, -8, 6, 10, 7, 7, 3, -4, -15, 23, 9, 23, 23, 7, 0, -2, -9, 10, -5, 9, -3, -1, -10, -5, -4, -5, 12, 3, -2, -10, -1, 15, 7, 4, -3, 5, 10, -8, 20, 15, 5, 13, 7, 8, -9, 20, 30, -1, 9, 39, 3, 17, 15, 20, 11, 4, 19, 12, 6, 2, 6, -3, -6, -15, 4, -9, -5, 6, 2, 10, 9, -8, -11, -9, -21, -1, 13, -2, -25, 2, 26, 23, 25, 26, 0, 12, 15, -1, 27, 4, 20, 18, 6, 23, 2, 20, 19, -2, 1, 17, -3, 14, 5, -3, -10, 11, -6, -2, 10, -12, 0, -12, 3, -10, -6, 6, 4, 15, -6, -3, 19, 11, 13, 10, 39, 18, 19, 0, 30, 20, 28, 29, 12, 17, 16, 1, 9, 0, 22, 28, 12, 11, 7, 6, -10, -1, 2, -13, -5, -1, -1, -1, 4, -2, 19, -14, 14, 12, -1, 2, 23, 3, 8, 20, -1, 18, 27, 21, 6, 22, 15, 28, 5, 9, 22, 16, 1, 4, -11, 0, 19, 5, 13, 4, 9, 3, 11, 27, 15, -18, -13, 8, -5, -3, -5, -6, -5, -11, 10, 3, 13, 16, 18, -6, -8, 2, 21, 2, -4, 19, 23, 10, 26, -7, 8, -8, 22, 24, -1, 2, -7, 9, -11, 15, 13, 6, 9, -11, 15, 16, -11, 4, -6, -4, -10, -14, 4, -4, 7, 11, 15, -6, 8, 12, -14, -4, -16, 11, 8, 0, 18, 2, -5, 8, 19, -3, 10, 24, 5, 4, 0, 7, -8, -6, 3, 11, 13, 12, -10, -2, -2, 4, 5, 12, -2, -2]
5616bOk0K3qNlmj7J4J0j6J2Nk1K9k4kJ7J1Jj6nL6l0J0J8j9qJ8k5OJ0rK0j9Lk6
5653b0J6KNj3%j6RkJ7Kj9M1j5jmLrkkJ3jKLJk1K1RNrpJ5j4OJj4njPj3MOJ3jk8
5697a6mK8j6j1J5Llj3J6j4K3J1j8Oj4J8oProJ1pkMlJ0j0J7j0jPMk7NPlqOlJ9j5
5738brlK1j9J5prLJ8k6KK8j6j1j5L6Mj2kK2nlqOj7K6k0MKK0k5Rj0J1Ppj6OnjM
5779dlLj2K1j9J9j9lK7Jk2OoLrJ7qjj0K2qRMj4K0j7QJ6k8OJ8J2nj2J6k8J0j2J1
5818Ik6J5Ok5KPOpKJ2Lj7lK3j7jK0jkrK1kk2KM%mJ0nJ1l0K2K1lqJjkk%j6kJ4K
5862HnrJ1J1l4J7pLQOjqJ1j7K0j0jK%Lj0K7l1OJ3MkJ1j4j2QJ9j9qJ2kR%k3J1K0
5903B7j5j2prJ6Ok8L4nkk1PRJj%j4RnK0k9M2jk1RJ0J3qj1j2K4j3J8k9LrK4k3j0
$$ y = [-2, 4, -16, 7, -1, 4, 1, -3, -20, -6, 4, -12, 0, 5, -16, 13, -11, -13, 4, 15, 16, 0, -5, 31, 1, 11, 29, 10, 2, 20, -5, 1, 11, 2, 22, 3, 6, -20, -4, -2, 3, -10, -10, -26, -17, -19, -2, 0, -19, 22, 7, 6, 2, 5, -4, -6, -8, 5, 4, 6, 9, 10, -11, 10, 19, 24, 15, 8, 23, 9, 15, 16, 2, -3, -4, 3, -10, -6, 0, 13, 12, -16, -20, 8, -8, -19, -4, -1, -4, -17, -1, -15, 8, 19, 1, 7, -7, 11, 5, 12, 3, -3, 8, 1, -1, 3, 0, 10, 0, 17, 7, 6, 13, 17, -10, -5, 2, -1, -9, -3, -6, 13, -2, -11, -14, 7, -12, 3, -4, -13, -10, 8, -18, -16, 12, -4, -15, -30, 6, 10, -2, -4, 18, 13, 10, 2, 8, -9, 17, -3, 1, 3, 23, -2, 7, -3, 8, 15, 8, -8, -2, -7, -8, -4, -7, -4, -16, 5, -14, 5, -14, -17, 10, 11, -11, -5, -11, -8, -17, 0, -8, -9, -19, 3, -5, 4, 8, -6, 14, -3, 5, 21, -7, -1, 17, 29, 24, 12, 28, 0, 10, -2, 9, -17, -2, 4, -21, -19, -12, -6, -13, -11, 1, 4, -13, -16, 7, -10, -11, 9, 8, 6, -3, 18, 16, -6, -4, 0, 0, -4, 6, 1, 12, -18, 4, 25, 22, 14, 15, 14, 12, 10, 10, -6, -8, 6, 8, 3, -6, 5, 16, -18, -1, -8, -5, 3, 9, 8, 0, 11, -6, 14, 4, 3, 5, 5, 8, -2, 25, -6, 0, 13, 17, 15, 26, 12, 0, 8, 27, 8, 0, 12, 10, 19, 19, -4, 7, 27, 12, 0, -7, -16, 0, 6, -22, 12, 7, 5, -16, -9, 0, 1, 0, 0, -14, -5, -10, 10, -19, 23, 22, 1, 10, 20, 33, 25, 14, 2, 26, 13, 31, 2, 5, -4, 20, -3, -13]
5942a3K8j5JoKj4NJ3j5j6J8J4j1PmJ7noj5K4j0kj2NJ2JJ0OJ0j3j0J4J8j7jl1N
5979fj4J6Nj2Nl%J8j3Mj3K0j6J1l6J8QPk2J5J2pqJ8k3J0K0k0rMlJ6J0%j0%mj1
6017a3K0J7k5J4j4RklRKpJpkQj3K4k1k3L6j6j1J1oJ3jqNJ6pJ1rmJ4rk1K5%j0j1
6057hLK1kLk2J6J3l0%MkJ6j5MoKj2J3j6kJ2j4J8j3ROj5J4j3jJ0NqmPLj2qJ0J6
6097Bj0J0J0kj5OmK6j3Oj5J0j6J6j3QKMl3J3nP%j8J5qJ7j0J1qpNKqJ9Lj3MlJ2
6137Gj2mPKkkM%J1j1JkPRj5Rj2j6J2J7j7jLKlj%Lj0J0J0j4LLj0Qj3QPJ8k4J1k
6180AJMJ6nJ5l1KMONj2j1K0nmPj4RmKjkjnqJ1Nj1Nj1JNPojJ0j3K0lKj6PJ5qoO
6226HlmLlRj0MNj3J8nMooRmk6K7j6J4Lk4K1j8j2J6PnoNKK3ok7K6j5K2jJ1l9K0
$$ y = [-13, 15, 0, 1, -5, -3, -17, -12, 1, -14, -30, -12, 2, -9, -2, -6, 11, 6, 0, -15, 9, -1, -3, -15, -10, 2, 3, 13, 19, 29, 16, 6, 20, 38, 21, 20, -11, -6, -20, -4, 1, -11, -6, -9, -9, 9, -4, 0, -13, 7, -9, 2, -34, -16, -8, -1, -23, -8, 4, -3, -11, 7, -16, -6, 14, -6, -15, -11, -14, 2, 12, 12, 2, 2, -2, -13, 7, 24, -1, 13, -1, 8, 6, 3, 12, 14, 7, 8, 1, -1, 7, -6, 18, -3, -26, 10, -6, -17, -6, -12, 1, 0, -8, -3, 13, 6, 17, 8, 4, 18, 9, -12, 13, 13, 3, -8, -5, 16, 14, 17, -5, 11, 24, -6, -6, -2, -4, 12, -3, 1, -5, -3, -15, -2, -18, -20, -8, -22, -4, -17, -8, -2, -17, -3, -16, -17, -7, -2, -10, -14, -7, -4, -16, -24, -14, 2, -8, 2, 12, 10, -5, 1, -3, 23, 10, 16, 1, 11, -5, 11, -2, 6, 8, 12, -21, -8, -13, -6, -6, -24, -9, -17, 0, -10, 1, -7, -14, -9, -7, -15, 4, 7, -6, -2, -5, 7, -5, -9, -2, 0, -2, -4, 0, 0, 11, 0, 1, -1, 6, 15, 0, 9, -3, -19, -7, 10, -7, -8, -5, -3, -6, -7, -7, -4, -14, -4, 6, -8, -5, -2, -12, -4, -17, -9, -2, 16, -8, 3, 1, 2, 6, 22, 17, 32, 1, 3, 7, 13, 18, 6, -5, 15, 10, 6, 13, -1, 8, 4, 6, 5, 3, 2, -3, -11, 0, 5, -6, -1, -12, -11, -6, 1, -5, -6, 4, -9, 11, 8, 10, -6, 1, 16, 8, 2, 8, 5, 1, 4, 1, 10, 0, 4, 9, -4, 14, 9, 13, 7, 1, 10, 6, -20, 7, -9, 5, 8, -16, 5, -13, -25, -9, -2, -7, -13, -8, -6, 17, 11, -16, 10, -5, 17, 16, 27, -12, 8]
6267HKqJ6J0k2J7k4NJ2jJk2J1Nk0rJ8k4K5rPNJ2oqMj7J0lJ1j5jQj1K6J3j3J2j1
6306A4JpKqK2j8lJ7k2PPMmlKJ4m0K3oj9K1k0RJ5roJ8J2k3J6k3NjMQmKMJLj1K1
6348B5Nj9MOmj6QmJ5pn%J5j3J4rj7r%J9k4K2mk4K9j6J3j4J5rNnJJ8j7mK2l5L4
6387A5j5J4j6J1oJ5j1j8K8k0J8k3J5lJ7ll0J6qM%Mj2J6ml8J4R%M%PLrLKOj1lp
6427a6J7%RqoK9Qj0Lj3JPk5oQMJ5j0oJ4j4J2lj4RlqoJ5j5J9j4MJ0Qj4KKJMrro
6470a4J7%jJ7j9J7MK%%Jj3Rj4pRKnK1j7J1j7K1pnpRj5J5j7k1K3j1K0j9J5KNnj1
6510eJ9rpmPQj8J9NLJ1rj3J8j0J9pmj0LNj6J3rnKJ8j9K2l0J1j7jJ2roK0j5nMO
6551cPj2J9lj1mK3J4k0mK1Nlk1lPpmJ6nJj5PnnJ2nj%J3j4%j4J7j3Ok4J3J0NMK
$$ y = [8, 10, 2, 18, 28, 6, 23, -1, 4, 16, 15, 16, -6, 5, 10, -10, -19, -1, -25, 0, -9, -2, 3, 15, 9, 1, 5, -12, -2, -5, 6, -9, -10, -2, -13, 13, 26, 13, 25, 14, 15, 8, 10, 2, 24, 6, 3, 20, -2, 5, 12, 16, 12, 9, 11, 25, -15, 8, 2, -17, 4, -16, -7, 8, -1, -7, 11, 23, 0, 16, -7, -2, -3, 1, 9, 5, 7, 11, 12, 15, 4, 25, 30, 11, 15, 21, 17, 1, 9, 5, 20, 13, 8, 8, 23, 10, 24, 15, -2, -11, -11, 8, -16, 6, 2, -22, 7, -9, 4, -10, 5, -4, 1, -4, -3, 15, -2, -6, 16, -19, 15, 0, 14, -2, 9, 3, 18, 7, -11, 17, -3, 15, -8, 7, 4, 21, 18, -12, 4, -4, 0, 0, 4, -8, 8, 4, -34, -20, -11, -11, -7, -7, 0, 3, -6, -3, -1, 5, -6, -9, -16, 1, 1, 10, 2, -4, 25, 33, 23, 26, 13, 14, 21, -4, -10, -2, 2, 17, 7, 1, 15, 1, 13, 10, -4, 5, 2, -6, -12, 3, -12, 7, -7, -3, 7, 15, 1, 3, 5, 6, 10, 1, -8, -14, 3, 3, 2, 19, 0, 17, 21, 23, 23, 23, 24, 11, 20, 6, -1, 8, 10, 5, 26, 9, 20, 3, 24, 17, 12, 5, 14, -1, 14, -3, -24, -1, -12, 8, -11, 4, 6, 11, 6, -5, 14, 5, -2, -6, 1, 9, -9, 10, 15, 18, 29, 20, 7, 25, 15, 34, 27, 23, 13, 16, 21, 5, 18, 9, 4, 6, 24, 5, 27, -3, 8, -9, -10, 2, -7, -13, 7, -8, -13, -9, -3, 4, -8, 11, 8, -3, -7, 16, 30, 10, 6, 27, 32, 29, 8, 5, 12, 5, 1, 17, 12, 13, -2, 5, 0, -5, 7, 2, 1, 1, 14, 0, 0, -14, 3, -10, -4, -28, -15, -5, 0, 4, 6]
6593Fjjo%PrK3j2J4k0jJ3pPKrJ0oLmMpj2J2K2j3j3OJ5j0k2K4j0j5J9kqMj2J4n
6634@PNj3LNNorJ8j2qJ1Kj5jJ9Nj2OpQj0nJ6j7qK4kk1K8Kj0J4l2mJ2kJ5j9j6J5
6675iJ5mPkOj7J2ojJ1KlnOJMnj0lK3qk3J6J1nj9RLqlMLj2K0j8L7l0k5K9%mJ4j8
6718ekK5k8K7nj5NLmQrOQj2LJ0%j4JnJ3nKqkLj4J1rJ9Oj4jJ1MqrmJ1j6j0K3kk
6762dpKJ7kJ0j3PQJl0kL1kj4J1mJ7j9jQLj0OmpQj0KnJJKJ6j0k7K2jMmJOj6%J5
6806Gj1J1oMK2pj5J3j9NK7Lj1LJj8oJ5j2J2NJk1j0OJ6noJ3k0mMMPj1KmJ0lkK0
6847B0j8J8j1J2j1J5j3jJ7j1J2j6Nj8J9moJ8j4OK0l6J5Qk7rK0lj4Ll%J2rlPOm
6885BJ3Mj4J3j1k3K8j6OK4j2mj3J9rJ4j9nj2K7K2j7k4K1nJlMOj8M%JJ0lj2J3j0
$$ y = [6, 5, 4, -2, -2, 5, -4, 19, 7, 21, 1, 0, 13, 6, 13, 15, 6, 16, 10, 13, 9, 13, 6, -6, 6, 28, 15, 2, 8, 23, 13, -9, 15, 5, -10, 9, 7, -1, 3, -9, 5, 0, 7, 12, -1, 2, 7, 12, 6, -3, 15, 3, -5, 6, 8, -7, -8, 11, 16, 4, 10, 3, 11, 1, -4, 12, -5, -13, 11, 9, -12, 16, 18, 8, 22, -10, -14, -2, -4, 11, -8, -24, -9, 6, 2, 9, 7, 13, -4, 8, 2, 1, 12, 14, 11, 6, 12, 13, 17, 12, 2, -1, 22, 14, -9, 7, 18, 13, -6, 3, 6, -2, -5, -1, 2, -10, 10, -8, 29, -1, -26, 3, 3, -1, 13, -5, -7, 18, -10, 17, 12, -3, 2, 5, 1, 9, 0, 6, 14, 2, 5, 15, 15, 1, 2, -3, 10, 5, 7, -1, -3, 0, -14, -3, -12, 7, 13, -1, -2, 9, 13, 5, -4, -8, 3, -13, -23, 0, -2, -4, -11, -9, 8, 6, 16, 3, 10, 18, 19, -11, -13, 18, 16, 2, 13, 9, 26, 7, 6, 14, 17, 7, 13, 9, 2, 10, 0, 2, -3, -2, -1, 1, 17, 7, -20, 2, 1, 5, 1, 2, 8, -8, -8, 7, -4, 7, 1, 5, 27, 20, 5, 18, -1, 4, 31, 34, 23, 26, 27, 9, 3, 18, 6, 18, 23, 24, 3, -7, -1, 15, 10, 4, 17, -3, -7, -3, 1, 8, -3, -1, -5, 5, 2, 0, 20, 2, 20, 9, 21, 10, 25, 12, 11, 28, 17, 29, 13, 18, 0, 19, 15, 9, 27, 13, 19, 39, 3, 18, 26, -1, -10, 10, 7, -7, -4, -7, -7, 5, -4, -7, 0, 6, 2, 15, 19, 5, 18, 7, -16, 12, -4, 2, 26, 14, 10, -3, 16, 7, 21, 2, -3, -15, 12, 34, 17, -7, 14, 9, 10, 7, 11, 17, -1, 3, 3, 4, 14, 11, -1, 12, 2]
6923BJNj7J9qJ0J0k2j1K2lKjJNJ8Mk3pRJ4lj9MJ1rplLrMJ4klj1JJ0Mj2mNk6K5
6966Ck1K6LPj7oJ3j6KMmJ1nOKlJN%NQk4J4npPJ%J9j1j4j4J8Rj4j4J8j4Lj0J1j3
7008a6Oj3L2nNJpJ5j6Rk%j7J9j3J1jP%MmJj8J3J1j0oj1J0OKNk5J7j0JJ2k2J4j4
7048ij3nK0%N%J3Kk6L7qmmoLJJ6qj3K0Oj2Q%p%KqnJ6j6Lk%J2oOj2J2j4Mj0rK2
7092A1Jm1K3nK2pJ0j4MnK9j3j1j5J3lJ7JRk0J0rQ%j0Nj0j1JQQkj8K2K0l6J5j6
7130imJ5pmKj0J9nMj1%J1J1Jk3J8MpNj3RlOJ0pRj4%J3J3k5qJ4j9kJ5KJj1jQ%j4
7173gJ0k3J5j3PL0j4JkNKj1J3nKoRj8J5%j0j1K5J2k1lK0lj3MJ1k0lL4l3j6L7k5
$$ y = [2, 3, 8, -9, 10, 2, 12, 22, 0, -11, 11, 8, 10, 9, 10, 15, 33, 37, 14, 7, 16, 30, 27, 8, 12, 23, 14, 7, 4, 7, -2, 2, 16, 14, 11, 0, 1, 11, 15, 3, -1, 4, -22, 3, -18, 8, 11, 18, 1, -5, 8, -8, -6, -2, -6, 5, 0, 6, 8, 5, 6, 11, 11, 16, 24, 0, 14, 9, 2, 9, 10, 10, 29, 18, 4, -10, 8, 17, 3, -11, 7, -7, -4, -14, -3, -16, -10, -23, 9, 4, 9, 10, 3, 18, 2, 11, 9, 9, -8, 11, -2, 9, 8, 15, 15, 19, 15, 16, -2, 11, 22, 12, 6, -5, 5, 11, 13, 18, -7, 10, 0, 1, 13, -9, 5, -9, -22, -27, -7, -7, -2, -2, 11, 13, -13, 24, 16, 12, 8, 2, 5, 6, 22, 14, 1, 21, 27, 15, 23, 23, 16, 16, 18, 10, 5, 21, 5, 8, 6, 6, 18, 12, 18, 6, 18, 4, 8, -2, -11, 11, 12, -29, -6, -11, 11, 4, 14, 0, 4, -1, 28, 15, 4, -11, 2, -1, 16, 17, 26, 6, 16, 7, 15, 15, 5, 10, 0, -11, -10, -2, 6, 4, -14, 8, 28, -8, 7, -9, -13, 2, -5, -9, -7, -17, 2, -3, 1, -10, -10, 1, 12, 13, -10, 8, 12, 5, 10, -3, 6, 3, 9, 19, 12, 21, 7, 7, 20, 33, 8, 0, 14, -5, -7, 8, 10, 11, 0, -1, 7, 7, -7, 3, -20, -5, -18, -11, 19, 5, 6, 4, 9, 11, 0, 13, 8, 10, 4, 13, -5, 10, 10, 0, -11, 14, 26, 5, 2, 22, 19, 6, 10, 21, 1, -2, 32, -1, -17, 20, -5]
$$ [...]
8191A0
##END NTUPLES=NMR FID
##END=
