##TITLE=1H_LY-DMAA.Per.2.9
 CDCl3
 8 sc, 
 11.02.2022
##JCAMPDX= 6.0         $$ Bruker NMR JCAMP-DX V2.0
##DATA TYPE= NMR FID
##DATA CLASS= NTUPLES
##ORIGIN= UXNMR, Bruker Analytische Messtechnik GmbH
##OWNER= root
$$ XWIN-NMR		Version 3.5
$$ Fri Feb 11 11:25:05 2022 Russian Standard Time (UT+4h)  she@DPX200
##.OBSERVE FREQUENCY= 200.131346
##.OBSERVE NUCLEUS= ^1H
##.DELAY= (6, 6)
##.ACQUISITION MODE= SIMULTANEOUS
##.ACQUISITION SCHEME= undefined
##.AVERAGES= 8
##.DIGITISER RES= 18
##SPECTROMETER/DATA SYSTEM= spect
##.PULSE SEQUENCE= zg30
##.SOLVENT NAME= CDCl3
##.SHIFT REFERENCE= (INTERNAL, CDCl3, 0, 15.7039)
##AUDIT TRAIL= $$ (NUMBER, WHEN, WHO, WHERE, WHAT)
$$ ##TITLE= Audit trail, XWIN-NMR		Version 3.5
$$ ##JCAMPDX= 5.01
$$ ##ORIGIN= Bruker BioSpin GmbH
$$ ##OWNER= she
$$ F:/spectra/data/she/nmr/H-F/1/audita.txt
$$ ##AUDIT TRAIL=  $$ (NUMBER, WHEN, WHO, WHERE, WHAT)
(   1,<2022-02-11 11:23:10.39 +0400>,<she>,<DPX200>,
      <created by zg, POWCHK disabled, PULCHK disabled
       configuration hash MD5:
       00 E9 B6 7A A2 85 ED C7 34 08 36 98 17 FE 4E 26
       data hash MD5: 16K
       EA 1C B2 E3 F1 71 2A 76 CF C2 79 24 FE 6E D7 85>)
$$ ##END=
$$ 
$$ hash MD5
$$ F7 B6 8E 4F C1 80 F4 C4 13 2E 0D 72 41 5C F9 06
##$RELAX= 
##$RELAX= 
##$RELAX= 
##$RELAX= 
##$RELAX= 
##$RELAX= 
$$ Bruker specific parameters
$$ --------------------------
##$DU= <F:/spectra>
##$EXPNO= 1
##$NAME= <H-F>
##$PROCNO= 1
##$TYPE= <nmr>
##$USER= <she>
##$AMP= (0..31)
100 100 100 100 100 100 100 100 100 100 100 100 100 100 100 100 100 100 
100 100 100 100 100 100 100 100 100 100 100 100 100 100 
##$AQSEQ= 0
##$AQ_mod= 1
##$AUNM= <au_zg>
##$AUTOPOS= <>
##$BF1= 200.13
##$BF2= 200.13
##$BF3= 200.13
##$BF4= 200.13
##$BF5= 200.13
##$BF6= 200.13
##$BF7= 200.13
##$BF8= 200.13
##$BYTORDA= 1
##$CFDGTYP= 0
##$CFRGTYP= 5
##$CHEMSTR= <none>
##$CNST= (0..31)
1 1 145 1 1 1 1 1 1 1 1 1 1 1 1 1 1 1 1 1 1 1 1 1 1 1 1 1 1 1 1 1 
##$CPDPRG= <>
##$CPDPRG1= <>
##$CPDPRG2= <>
##$CPDPRG3= <>
##$CPDPRG4= <mlev>
##$CPDPRG5= <mlev>
##$CPDPRG6= <mlev>
##$CPDPRG7= <mlev>
##$CPDPRG8= <mlev>
##$CPDPRGB= <>
##$CPDPRGT= <>
##$D= (0..31)
0 1.2 0 0 0 0 0 0 0 0.06 0 0.03 0 0 0 0 0.0002 0 0 0 0 0 0 0 0 0 0 0 0 
0 0 0 
##$DATE= 1644564190
##$DBL= (0..7)
120 120 120 120 120 120 120 120 
##$DBP= (0..7)
150 150 150 150 150 150 150 150 
##$DBP07= 0
##$DBPNAM0= <>
##$DBPNAM1= <>
##$DBPNAM2= <>
##$DBPNAM3= <>
##$DBPNAM4= <>
##$DBPNAM5= <>
##$DBPNAM6= <>
##$DBPNAM7= <>
##$DBPOAL= (0..7)
0.5 0.5 0.5 0.5 0.5 0.5 0.5 0.5 
##$DBPOFFS= (0..7)
0 0 0 0 0 0 0 0 
##$DE= 6
##$DECBNUC= <off>
##$DECIM= 32
##$DECNUC= <off>
##$DECSTAT= 4
##$DIGMOD= 1
##$DIGTYP= 9
##$DL= (0..7)
0 120 120 120 120 120 120 120 
##$DP= (0..7)
150 150 150 150 150 150 150 150 
##$DP07= 0
##$DPNAME0= <>
##$DPNAME1= <>
##$DPNAME2= <>
##$DPNAME3= <>
##$DPNAME4= <>
##$DPNAME5= <>
##$DPNAME6= <>
##$DPNAME7= <>
##$DPOAL= (0..7)
0.5 0.5 0.5 0.5 0.5 0.5 0.5 0.5 
##$DPOFFS= (0..7)
0 0 0 0 0 0 0 0 
##$DQDMODE= 0
##$DR= 18
##$DS= 0
##$DSLIST= <SSSSSSSSSSSSSSS>
$$ [...]
##$SUBNAM2= <"">
##$SUBNAM3= <"">
##$SUBNAM4= <"">
##$SUBNAM5= <"">
##$SUBNAM6= <"">
##$SUBNAM7= <"">
##$SUBNAM8= <"">
##$SUBNAM9= <"">
##$SW= 18.0517287032376
##$SWIBOX= (0..15)
0 0 2 0 0 0 0 0 0 0 0 0 0 0 0 0 
##$SW_h= 3612.71676300578
##$TD= 16384
##$TD0= 1
##$TE= 0
##$TE2= 300
##$TE3= 300
##$TEG= 300
##$TL= (0..7)
0 120 120 120 120 120 120 120 
##$TP= (0..7)
150 150 150 150 150 150 150 150 
##$TP07= 0
##$TPNAME0= <>
##$TPNAME1= <>
##$TPNAME2= <>
##$TPNAME3= <>
##$TPNAME4= <>
##$TPNAME5= <>
##$TPNAME6= <>
##$TPNAME7= <>
##$TPOAL= (0..7)
0.5 0.5 0.5 0.5 0.5 0.5 0.5 0.5 
##$TPOFFS= (0..7)
0 0 0 0 0 0 0 0 
##$TUNHIN= 0
##$TUNHOUT= 0
##$TUNXOUT= 0
##$USERA1= <user>
##$USERA2= <user>
##$USERA3= <user>
##$USERA4= <user>
##$USERA5= <user>
##$V9= 5
##$VALIST= <valist>
##$VCLIST= <CCCCCCCCCCCCCCC>
##$VD= 0
##$VDLIST= <DDDDDDDDDDDDDDD>
##$VPLIST= <PPPPPPPPPPPPPPP>
##$VTLIST= <TTTTTTTTTTTTTTT>
##$WBST= 1024
##$WBSW= 4
##$XGAIN= (0..3)
0 0 0 0 
##$XL= 0
##$YL= 0
##$YMAX_a= 33367
##$YMIN_a= -32651
##$ZGOPTNS= <>
##$ZL1= 120
##$ZL2= 120
##$ZL3= 120
##$ZL4= 120
##$ABSF1= 10
##$ABSF2= 0
##$ABSG= 5
##$ABSL= 3
##$ALPHA= 0
##$AQORDER= 0
##$ASSFAC= 0
##$ASSFACI= 0
##$ASSFACX= 0
##$ASSWID= 0
##$AUNMP= <proc_1d>
##$AZFE= 0.1
##$AZFW= 0.1
##$BCFW= 1
##$BC_mod= 2
##$BYTORDP= 1
##$COROFFS= 0
##$CY= 11.3945322036743
##$DATMOD= 1
##$DC= 2
##$DFILT= <>
##$DTYPP= 0
##$F1P= 2.36226072786647
##$F2P= -0.459571619588291
##$FCOR= 0.5
##$FTSIZE= 0
##$FT_mod= 4
##$GAMMA= 1
##$GB= 0.15
##$INTBC= 1
##$INTSCL= 1
##$ISEN= 128
##$LB= 0.24
##$LEV0= 0
##$LPBIN= 0
##$MAXI= 10000
##$MC2= 0
##$MEAN= 0
##$ME_mod= 0
##$MI= 1.114404
##$NCOEF= 0
##$NC_proc= 0
##$NLEV= 6
##$NOISF1= 3.799351
##$NOISF2= 2.8
##$NSP= 1
##$NTH_PI= 0
##$NZP= 0
##$OFFSET= 15.70392
##$PC= 1
##$PHC0= -16317.24
##$PHC1= 21.40078
##$PH_mod= 1
##$PKNL= yes
##$PPARMOD= 0
##$PSCAL= 0
##$PSIGN= 0
##$REVERSE= no
##$SF= 200.130013532006
##$SI= 16384
##$SIGF1= 3
##$SIGF2= 2
##$SINO= 400
##$SIOLD= 16384
##$SREGLST= <1H.CDCl3>
##$SSB= 0
##$STSI= 0
##$STSR= 0
##$SW_p= 3612.71676300578
##$SYMM= 0
##$S_DEV= 0
##$TDeff= 0
##$TDoff= 0
##$TI= <>
##$TILT= no
##$TM1= 0
##$TM2= 0
##$TOPLEV= 0
##$USERP1= <user>
##$USERP2= <user>
##$USERP3= <user>
##$USERP4= <user>
##$USERP5= <user>
##$WDW= 1
##$XDIM= 8192
##$YMAX_p= 0
##$YMIN_p= 0
$$ End of Bruker specific parameters
$$ ---------------------------------
##NTUPLES= NMR FID
##VAR_NAME=  TIME,          FID/REAL,        FID/IMAG
##SYMBOL=    X,             R,               I
##VAR_TYPE=  INDEPENDENT,   DEPENDENT,       DEPENDENT
##VAR_FORM=  AFFN,          ASDF,            ASDF
##VAR_DIM=   8192,          8192,            8192
##UNITS=     SECONDS,       ARBITRARY UNITS, ARBITRARY UNITS
##FACTOR=    0.0002768,     1,               1
##FIRST=     0,             0,               0
##LAST=      2.2672688,     0,               0
##MIN=       0,             -32651,          0
##MAX=       2.2672688,     33367,           0
$$ Real data points
##PAGE= N=1
##DATA TABLE= (X++(R..R)), XYDATA
$$ plain form
0 0 0 0 0 0 0 0 0 0 0 0 0 0 0 0 0 0 0 0 0 0 0 0 0 0 0 0 0 0 0 0 0 0 2 -8 8 -8 8 -8 8 -8 8 -8 10 -15 16 -16 16 -17 23
49 23 -24 24 -26 31 -33 39 -42 47 -53 58 -67 79 -90 109 -134 170 -227 325 -547 1205 -7060 -32651
71 -32651 -4121 28813 10707 -20737 -13792 10457 13437 409 -8771 -9811 1125 16183 8662
84 8662 -18234 -17870 16149 24877 -11123 -28411 4285 27819 2408 -23372 -7842 15503 10002
97 10002 -6209 -8809 -2903 4347 10117 2156 -14576 -9519 15907 16479 -13857 -21227 9619 23131
111 23131 -4118 -21376 -672 16934 4079 -10396 -5168 3061 3799 3847 -243 -9198 -4792 11984
125 11984 9747 -12554 -13923 10889 16181 -8115 -16429 4737 14377 -1839 -10472 231 5662
138 5662 -44 -674 1393 -3458 -3449 6653 6149 -8273 -8459 8598 10048 -7809 -10357 6533 9373
$$ packed form
0@%%%%%%%%%%%%%%%%%%%%%%%%%%%%%%%%Kj0J6j6J6j6J6j6J6j6J8k5L1l2L2l3M0
49B3m7M8n0N7o4P2q1Q9j00J11j25J46j69J99k43L04l97N52q72J752q265k5591
71c2651K8530L2934j8106l1444O945K4249K980j3028r180j040J0936J5058p521
84H662k6896L64L4019Q728l6000j7288L2696K3534k5411k5780J5530K3345n501
97A0002j6211k600N906P250N770p961j6732N057K5426N72l0336p370L0846J3512
111B3131k7249j7258K0704J7606j2855j4475N228Q229P38M8m090q955M406J6776
125A1984k237k2301j369K4812N292k4296q314K1166R640j6216q633J0703N431
138E662n706o30K067m851RJ0102n04j4422j86J7057J450j7857k548J6890K840
$$ plain form
153 9373 -5418 -7522 4536 4895 -4350 -2209 4577 -443 -5356 2424 6114 -3795 -6579 4644 6557
168 6557 -5119 -5869 5608 4853 -5998 -3329 6717 1917 -7471 -629 8276 -162 -8670 605 8455
183 8455 -854 -7606 1047 6007 -1599 -3993 2507 1660 -4086 397 6014 -1888 -8117 2569 9976
198 9976 -2360 -11039 1584 11208 -278 -9972 -742 7708 1311 -4454 -796 988 -720 2312
212 2312 3210 -4773 -6303 5971 9370 -5885 -11907 4378 13034 -2207 -12681 -233 10550 2091
226 2091 -7029 -2908 2714 2335 1859 -112 -5546 -3061 8075 6937 -8734 -10374 7846 12928 -5472
241 -5472 -13742 2444 12678 557 -9776 -2730 5461 3456 -639 -2667 -4124 168 7737 3251
255 3251 -9889 -7163 10075 10538 -8511 -12660 5713 13076 -2272 -11441 -795 8178 3009 -3586
$$ packed form
153I373j4791k104J2058L59r245K141O786n020m913P780L690r909k784J1223J913
168F557j1676p50J1477p55j0851K669J0046m800r388O842Q905q438q508R275P850
183H455r309o752Q653M960p606k394O500q47n746M483N617p902o229J0686P407
198I976j2336q679J2623R624j1486r694R230Q450o397n765L658J784j708L032
212B312Q98p983j530J2274L399j5255o022J6285Q656j5241j0474J2448J0783q459
226B091r120M121N622l79m76j971n434K485J1136j138j5671j640J8220N082j8400
241e472q270J6186J0234j2121j0333P046Q191k005m095k028j457M292P569m486
255C251j3140K726J7238M63j9049m149J8373P363j5348r169J0646Q973n169o595
$$ plain form
269 -3586 -3551 -1326 2550 5871 42 -9186 -3479 10789 7069 -10573 -10074 8620 11623 -5701 -11523
284 -11523 2311 9466 488 -5996 -2298 1622 2631 2938 -1441 -6737 -845 9385 3820 -10329
298 -10329 -6588 9779 8697 -7823 -9442 5190 8759 -2436 -6630 182 3442 1072 260 -1229
312 -1229 -3914 179 6743 1531 -8573 -3639 9059 5469 -8359 -6591 6770 6732 -4659 -5654 2729
327 2729 3757 -1116 -1079 397 -1698 -317 4268 1033 -6127 -2070 7163 3128 -7339 -3896 6701
342 6701 4006 -5710 -3547 4433 2331 -3422 -784 2602 -1031 -2198 2714 2123 -3997 -2155 4928
357 4928 2308 -5261 -2148 5338 1857 -5008 -1111 4700 264 -4330 761 4064 -1734 -3885 2469
372 2469 3628 -3036 -3360 3212 2723 -3334 -1967 3278 806 -3348 430 3528 -1667 -3851 2754 4362
$$ packed form
269c586L5K225L876L321n829r228N707J4268l720j7642M99J8694L003j7324n822
284a1523J3834P155q978o484L698L920J009L07m379n296N892J0230n565j4149
298a0329L741J6367j082j6520j619J4632L569j1195m194O812L260k370q12j489
312a229k685M093O564n212j0104M934J2698l590j3828J768J3361l8j1391r95Q383
327B729J028m873L7J476k095J381M585l235p160M057R233m035j0467L443J0597
342F701k695r716K163P980k102n753K638L386l633j167M912n91o120J842P083
357D928k620p569L113P486l481o865L897N811m436m594N091L303n798k151O354
372B469J159o664l24O572m89o057J367N245k472m154L778L098n195k184O605J608
$$ plain form
388 4362 -3409 -4748 3712 5037 -3466 -4817 3006 4176 -2339 -2928 1842 1238 -1577 708 1777 -2652
404 -2652 -2424 4168 3342 -5201 -4476 5431 5314 -5007 -5741 3974 5430 -2647 -4337 1371 2562 -396
420 -396 -191 111 -2273 -426 4541 1476 -6124 -2867 6933 4382 -6711 -5517 5612 5971 -3944 -5529
436 -5529 2006 4077 -341 -1887 -811 -913 1041 3647 -449 -5941 -873 7441 2586 -7834 -4155
451 -4155 7242 5340 -5653 -5553 3667 4881 -1496 -3157 -235 725 1304 2087 -1463 -4746 718 6763
467 6763 598 -7973 -2283 7989 3701 -7066 -4658 5272 4692 -3120 -3788 1002 2043 730 401
482 401 -1616 -2961 1733 5338 -936 -6953 -262 7788 1760 -7512 -2930 6373 3557 -4584 -3378
497 -3378 2547 2355 -703 -660 -761 -1528 1427 3636 -1446 -5432 815 6572 125 -6916 -1091 6460
$$ packed form
388D362p771j339Q460J325q503j351P823J170o515n89M770o04k815K285J069m429
404b652K28O592q26q543P25R907j17j0321p34R715J456q077j690N708J191k958
420c96K05L02k384J847M967l065p600L257R800k551j1093J194J1129L59r915j585
436e529P535K071m418j546J076j02J954K606m096n492N068Q314m855j0420L679
451d155J1397j902j0993J00R220J214o377j661K922R60N79P83l550l283N464O045
467F763o165q571N690J0272m288j0767K408R930n80p812o68M790J041j313l29
482D01k017j345M694L605o274o017O691Q050o028r272M582R303k816q141J206
497c378N925j92l058M3j01p67K955K209n082l986O247N757o447p041N825P551
$$ plain form
513 6460 1840 -5296 -1964 3805 1623 -2098 -572 688 -840 436 2476 -956 -3949 1016 5064
528 5064 -684 -5686 155 5647 273 -5122 -517 4116 381 -2973 133 1755 -973 -743 1998
543 1998 27 -2963 407 3795 -536 -4206 580 4340 -543 -4065 662 3603 -912 -2925 1337
558 1337 2198 -1903 -1589 2440 1017 -2953 -610 3218 212 -3330 158 3195 -618 -2907 1176 2560
574 2560 -1778 -2144 2464 1887 -2992 -1623 3448 1515 -3568 -1311 3491 1091 -3105 -671 2553 25
590 25 -1952 799 1341 -1833 -1001 2790 826 -3708 -915 4243 1129 -4446 -1402 4209 1543 -3555
606 -3555 -1393 2670 936 -1601 14 721 -1145 5 2487 -270 -3710 187 4637 220 -5121
621 -5121 -799 5030 1284 -4445 -1608 3354 1429 -2088 -832 710 -263 381 1646 -1079 -3128 1265
$$ packed form
513F460m620p136L332N769k182l721J526J260j528J276K040l432k993M965M048
528E064n748n002N841N492n374n395M605M633l735l354L106J622k728K30K741
543A998j971k990L370L388m331l670M786L760m883l522M727K941m515k013M262
558A337Q61m101L14M029j423l970K343L828l006l542L488L037l813k289M083J384
574B560m338l66M608n77m879J369N071j933n083K257M802k400m196K434L224k528
590B5j977K751N42l174Q32L791j964m534K793N158l114n575L044N611k666n098
606c555K162M063j734k537J615P07j866J150K482k757l440L897M450m417n341
621e121M322N829l746n729K837M962j925l517J256J542r73O44J265k725k049M393
$$ plain form
637 1265 4411 -937 -5270 319 5615 518 -5204 -1148 4305 1519 -2882 -1339 1347 623 148 571
653 571 -1271 -2059 1841 3506 -1875 -4700 1366 5376 -590 -5442 -259 4823 903 -3701 -1159 2211
669 2211 886 -597 -61 -771 -1102 1789 2497 -2194 -3720 2138 4689 -1603 -5120 868 4931 -137
685 -137 -4194 -419 2971 543 -1518 -246 3 -548 1220 1586 -2066 -2709 2383 3686 -2227 -4296
701 -4296 1769 4483 -1102 -4076 548 3292 -155 -2082 162 808 -486 421 1108 -1395 -1935 1981
717 1981 2686 -2215 -3301 2047 3547 -1766 -3467 1344 2969 -1031 -2169 900 1216 -977 -185 1311
733 1311 -657 -1691 1384 2195 -1745 -2505 1972 2738 -1932 -2638 1833 2332 -1706 -1805 1626 1124 -1683
750 -1683 -442 1765 -253 -1963 749 2076 -1182 -2179 1428 2110 -1594 -1885 1728 1552 -1822 -1083
$$ packed form
637A265L146n348m333N589N296n097n722M056N453k786m401J543K686p24m75M23
653E71j842p88L900J665n381k825O066M010n966m852N183N082l920m604K542L370
669B211j325j483N36p10l31K891P08m691j526N858K551o292l517N988M063n068
685a37m057L775L390k428k061J272K49n51J768L66l652o43N092J303n913k069
701d296O065K714n585k974M624K744l447j927K244O46j294R07O87k503n40L916
717A981P05m901j086N348J500n313j701M811J625m000j138L069L16k193P92J496
733A311j968j034L075Q11l940p60M477P66m670p06M471M99m038r9L431n02k807
750a683J241K207k018j710K712J327l258r97L607O82l704k91L613j76l374P39
$$ plain form
766 -1083 1999 644 -2125 -156 2317 -177 -2383 493 2390 -676 -2229 868 1931 -1037 -1493
781 -1493 1254 942 -1580 -434 1924 -65 -2319 387 2642 -601 -2853 673 2882 -620 -2651
796 -2651 606 2212 -580 -1527 758 803 -1059 -24 1505 -612 -2045 1059 2572 -1261 -2998 1201
812 1201 3163 -995 -3063 686 2612 -460 -1913 359 996 -505 -43 908 -800 -1436 1463 2112
828 2112 -1745 -2672 1796 3111 -1520 -3188 1116 2946 -667 -2331 340 1420 -240 -406 398 -664
844 -664 -870 1506 1448 -2095 -2135 2296 2697 -2186 -3037 1794 3035 -1244 -2610 748 1904 -338 -867
861 -867 268 -190 -409 1245 877 -2000 -1445 2462 2052 -2543 -2514 2278 2686 -1845 -2571 1244 2026 -766
879 -766 -1266 401 256 -348 725 514 -1605 -906 2238 1393 -2532 -1820 2552 2148 -2218 -2160 1794 1941
$$ packed form
766a083L082j355k769J969K473k494k206K876J897l066j553L097J063k968m56
781a493K747l12k522J146K358j989k254K706K255l243k252L526K209l502k031
796b651L257J606k792r47K285M5j862J035J529k117j433L104J513l833j737M199
812A201J962m158k068L749J926l072j453K272O37j501M62R51j708o36K899O49
828B112l857r27M468J315m631j668M304J830l613j664K671J080j660j66Q04j062
844f64k06K376n8l543m0M431M01m883q51M831J241m279j366L358J156k242n29
861h67J135m58k19J654l68k877N55L907m10m595K9M792M08m531p26L815P82k792
879g66n00J667j45o04J073k11k119O99L144q45l925P12M372m04m366N8L954J47
$$ plain form
897 1941 -1258 -1343 848 604 -556 296 496 -1146 -643 1841 922 -2320 -1254 2490 1512 -2430 -1639
914 -1639 2124 1496 -1731 -1142 1321 615 -977 101 798 -782 -719 1422 817 -1870 -923 2139 1053
931 1053 -2194 -1088 2079 979 -1859 -734 1570 337 -1325 131 1107 -649 -991 1109 914 -1471
947 -1471 -869 1736 839 -1815 -711 1851 548 -1729 -240 1636 -70 -1480 466 1371 -803 -1241
963 -1241 1122 1156 -1346 -1051 1456 845 -1535 -623 1487 286 -1459 83 1406 -490 -1372 849 1393
980 1393 -1148 -1368 1370 1372 -1420 -1224 1428 1069 -1284 -724 1193 337 -1074 174 1026 -670 -1061 1115
998 1115 1123 -1479 -1268 1647 1344 -1707 -1375 1559 1245 -1359 -980 1068 535 -845 16 703 -617 -653
1016 -653 1228 778 -1663 -914 1974 1146 -2024 -1258 1916 1279 -1612 -1105 1235 741 -847 -223 553
$$ packed form
897A941l199q5K191k44j160Q52K00j642N03K484r19l242J066L744r78l942P91
914a639L763o28l227N89K463p06j592J078O97j580O3K141o05k687R47L062j086
931A053l247J106L167j100k838J125K304j233j662J456R76j756l42K100j95k385
947a471O02K605q97k654J104K562j303k277J489J876j706j410J946R05k174m38
963a241K363L4k502K95K507o11k380R12K110j201j745J542J323j896q82K221N44
980A393k541k20K738Kk792J96K652l59k353N60J917q56j411J248Q52j696l91K176
998A115Qk602K11K915l03l051L32K934l14k604L79K048n33j380Q61O87j320l6
1016f53J881m50k441P49K888q28l170P66L174o37k891N07K340m94j588O24P76
$$ plain form
1033 553 -418 -402 1061 390 -1653 -539 2026 745 -2211 -964 2147 1115 -1880 -1082 1477 885 -1003
1050 -1003 -454 591 -91 -288 760 149 -1368 -164 1878 325 -2205 -582 2265 772 -2130 -892
1066 -892 1773 808 -1320 -559 808 108 -396 462 111 -1067 25 1630 37 -2025 -162 2237 371
1083 371 -2192 -498 1951 544 -1561 -421 1078 106 -631 307 237 -835 -5 1304 -105 -1736 61
1100 61 1970 26 -2036 -144 1945 228 -1630 -152 1291 28 -831 295 472 -632 -133 1068
1116 1068 -37 -1388 149 1666 -140 -1792 112 1752 -112 -1598 122 1302 -258 -992 434
1131 434 616 -714 -334 995 109 -1245 64 1445 -154 -1515 240 1527 -287 -1355 411 1193
1147 1193 -506 -936 698 697 -880 -441 1059 255 -1207 -97 1290 -52 -1308 169 1230 -316
$$ packed form
1033E53r71J6J463o71k043J114K565j281k956J247L111j032k995P98K559n92j888
1050a003N49J045o82j97J048o11j517J204K042j553k530J623K847j493k902J238
1066h92K665r65k128P61J367p00n04Q58l51j178J092J605j593k062J863K399j866
1083C71k563J694K449j407k105J140J499r72p37R38p0j072Q30J309j409j631J797
1100F1J909j944k062J892K089j717j858J478J443j263q59J126J77j104M99J201
1116A068j105j351J537J517j806j652J904J640j864j486J720J180j560p34J426
1131D34J82j330L80J329q86j354J309J381j599j361J755J287j814j068J766P82
1147A193j699m30J634jj577M39J500q04j462J110J387j342j256J477J061j546
$$ plain form
1163 -316 -1121 463 939 -660 -750 856 582 -1036 -425 1203 317 -1280 -186 1319 101 -1241 56
1180 56 1118 -217 -910 436 710 -672 -523 935 367 -1184 -275 1360 204 -1450 -169 1450 122
1197 122 -1308 -43 1116 -94 -835 324 573 -565 -313 890 152 -1161 -20 1414 14 -1551
1213 -1551 -38 1554 66 -1450 -85 1193 -8 -909 122 524 -397 -229 681 -23 -1017 186 1323
1230 1323 -215 -1519 194 1629 -87 -1537 41 1343 4 -992 104 637 -246 -236 540 -75 -846
1247 -846 302 1155 -439 -1420 412 1548 -355 -1574 232 1402 -169 -1155 128 761 -224 -365 397
1264 397 -13 -633 341 946 -506 -1183 601 1407 -534 -1454 470 1408 -329 -1192 266 892 -251 -511
1282 -511 341 116 -517 231 738 -489 -976 625 1173 -677 -1287 612 1275 -534 -1134 459 913 -404
$$ packed form
1163c16q05J584M76j599r0J606k74j618O11J628q86j597J094J505j218j342J297
1180E6J062j335o93J346K74j382J49J458n68j551R09J635j156j654J281J619j328
1197A22j430J265J159j210p41J159K49j138K52J203p38j313J141J434j400j565
1213a551J513J592j488j516J365J278j201r01J031M02r21J68R10p04r94J203J137
1230A323j538j304J713J435j716j450J578J302j339r96J096N33q83J0P76o15p71
1247h46J148Q53j594r81J832J136j903j219J806J170j571r86J283O33r85j41P62
1264C97m10o20R74O05j452o77J784Q06j941r20J924R38j737q63J458O26j143k60
1282e11Q52k25o33P48N07j227m87J601N48j850o10J899O63j809o00J593M54j317
$$ plain form
1300 -404 -574 440 221 -519 120 680 -396 -828 589 984 -690 -1075 720 1090 -679 -1010 632 830
1318 830 -580 -580 556 276 -600 8 663 -265 -743 484 857 -599 -883 694 911 -697 -815 693
1336 693 678 -666 -484 669 249 -684 -6 728 -211 -790 371 799 -529 -813 602 758 -655 -649 692
1355 692 515 -705 -309 757 136 -772 78 834 -220 -827 389 851 -456 -786 541 704 -581 -562
1373 -562 604 375 -661 -179 700 -36 -789 179 832 -326 -891 409 887 -460 -825 483 721 -460
1391 -460 -524 517 344 -525 -84 625 -125 -686 331 809 -439 -864 507 909 -521 -875 505 760
1409 760 -475 -585 438 341 -463 -84 486 -190 -595 402 700 -578 -794 661 879 -654 -867 603
1427 603 810 -520 -637 453 410 -388 -131 394 -153 -446 408 546 -609 -669 730 759 -760 -807 702
$$ packed form
1300d04j70J014k19p40O39N60j076m32J417L95j674l85J795L70j769l31J642J98
1318H30j410%J136k80q76O08O55r28m78J227L73j456k84J577K17j608j18J508
1336F93j5j344J82J153m20r33O78P34r39n79J161M28j328k84J415J56j413OJ341
1355F92j77j220L96J066o21r08Q50P56j054o07J216M62j307l30J327J63j285J9
1373e62J166k29j036M82Q79p36p53R68O53j158n65J300M78j347l65J308K38j181
1391d60o4J041j73q69M41P09p50n61J017M78j248m25J371M02j430l54J380K55
1409G60j235j10J023r7q04L79N70o76m05R97K98j278k16J455K18j533k13J470
1427F03K07j330j17J090m3p98K57N25n47k93Q54J38j155o0J399K9j519m7J509
$$ plain form
1446 702 782 -596 -674 507 482 -409 -216 359 -76 -357 364 434 -583 -519 747 615 -814 -682 794 692
1466 692 -730 -639 602 477 -490 -268 393 -15 -352 274 351 -529 -396 721 475 -815 -515 865 564
1485 564 -788 -519 721 452 -564 -255 469 58 -364 201 327 -428 -344 620 353 -767 -417 813 413
1504 413 -808 -419 728 336 -645 -211 513 31 -427 163 379 -367 -335 555 327 -671 -315 759 324
1523 324 -747 -278 735 224 -656 -106 566 -23 -489 190 409 -367 -373 500 310 -627 -287 664 238 -705
1543 -705 -212 678 121 -628 -13 563 -105 -492 254 437 -369 -382 498 350 -573 -301 610 263 -609 -176
1563 -176 583 68 -561 47 490 -181 -463 304 413 -436 -384 527 369 -571 -321 599 271 -573 -182 544
1583 544 57 -475 71 431 -234 -382 380 357 -528 -357 583 334 -640 -338 626 267 -583 -213 509 83
$$ packed form
1446G02Q0j378p8J181k5q91J93N75m35k81P21P0j017O4J266j32j429J32J476j02
1466F92j422R1J241j25r67K22O61m08l37O26P7q80J33J117k46j290L00J380l01
1485E64j352K69J240k69j016L09P24m11m22N65J26p55Q4R64k67j120L50J230m00
1504D13j221L89J147l92r81M34P24m82m58N90K16p46L2Q90k28r98L56J074m35
1523C24j071M69J013n11q80N50O72n89m66O79K19p76oQ73j90r37L40R51m26r43
1543g05M93Q90n57p49O15N76o68l87P46J83q06j3Q80j48r23K72R11l47q72M33
1563a76P59n15o29O08M43o71k82P67J09q49N2R11j58r40K50R20l28q44L91P26
1583E44m87n32N46L60o65j48P62k3q85J71R40k49r74L02R64l59q50L70P22m26
$$ plain form
1603 83 -432 48 354 -209 -298 379 290 -511 -274 638 303 -653 -284 668 280 -591 -221 513 116 -410 9
1624 9 310 -188 -255 327 191 -527 -207 619 192 -697 -217 699 217 -660 -199 569 143 -446 -21 319 -111
1645 -111 -206 313 154 -447 -99 606 113 -680 -112 722 146 -683 -150 601 111 -490 -34 341 -98 -232
1665 -232 234 122 -394 -73 531 46 -636 -59 679 72 -663 -72 619 63 -505 -2 385 -78 -247 208
1685 208 150 -331 -46 472 7 -567 18 633 -18 -655 23 610 -10 -523 58 412 -116 -271 210 176 -310
1706 -310 -59 421 0 -505 51 578 -70 -588 74 551 -89 -491 118 393 -174 -299 223 176 -315 -95
1726 -95 388 26 -456 44 511 -70 -502 102 513 -111 -423 175 369 -192 -266 276 191 -322 -94 407 29
1747 29 -445 22 465 -79 -482 107 423 -149 -387 192 301 -262 -240 305 134 -368 -70 413 11 -450 33
$$ packed form
1603H3n15M80L06n63q9O77q9q01K37R12l35r56L69R52l88q71L70P34l97n26M19
1624IL01m98o7N82j36p18L20Q26m27q89M80R16m82q77M61P68m26n89M25L40m30
1645a11r5N19j59o01L48P05m93p93N68Q34n76q29N33P51m90o01M56L75m39j34
1665b32M66j12n16L21O04m85o82N77P38o07p35N91O91n56n68N03L87m63j69M55
1685B08n8m81K85N18m65n74N85O15o51o37O78N87o20n13N81L54n28j55M81l4m86
1706c10K51M80m21n05N56N27o48n18O62M77o40m02O09K75n67j25N22m7m91K20
1726i5M83l62m82N00M67n81m32O04M11o24l12N98J94n61p4N42q5n13K28N01l78
1747B9m74M67M43n44m03N89L16n72k38N79J09n63K2N45j71n02K98M83m02m61M83
$$ plain form
1768 33 477 -59 -431 114 414 -120 -326 197 272 -234 -175 322 112 -365 -39 425 -4 -457 31 467 -69
1789 -69 -446 79 388 -120 -312 160 223 -217 -142 283 61 -349 18 430 -47 -461 84 493 -88 -451 113
1810 113 409 -110 -310 145 209 -190 -104 261 15 -335 60 410 -104 -453 126 478 -128 -451 125 406 -119
1831 -119 -317 145 229 -169 -98 229 4 -290 79 353 -147 -413 163 447 -177 -445 166 415 -144 -333 137
1852 137 237 -159 -119 199 14 -233 96 323 -150 -355 198 409 -198 -409 221 397 -191 -326 181 244 -182
1873 -182 -134 192 16 -238 72 265 -164 -327 210 362 -247 -366 234 347 -225 -309 203 245 -187 -127 218
1894 218 44 -201 67 259 -127 -272 206 319 -226 -320 252 317 -245 -273 222 216 -216 -140 204 41 -232 36
1916 36 231 -130 -264 186 272 -229 -276 235 276 -251 -232 253 180 -239 -101 237 42 -240 60 251 -121 -261
$$ packed form
1768C3M44n36l72N45L00n34k06N23P5n06N9M97k10m77L26M64m29m53M88M36n36
1789f9l77N25L09n08j92M72O3m40P5M25k22m10L67M12m77m14N45M09n81l63N64
1810A13K96n19k00M55O4l99Q6L65k46l50L95L50n14l49N79L52o06l23N76K81n25
1831a19j98M62Q4l98P1L27k25k94L69K74n00k66N76K84o24k68O11K49n59j89M70
1852A37J00l96M0L18j85k47L29K27m73k05N53K11o07k11O30J76n88j35N07O3m26
1873a82M8L26j76k54L10J93m29j63N37J52o09j19O00J13n72q4N12M2m32O0L45
1894B18j74k45K68J92l86j45M78J13n45r4N72O5n62k8M95om32P6L44j63k73K68
1916C6J95l61j34M50Q6n01m7N11M1n27J9M85p3m19J38L38j95k82L00J91l72j40
$$ plain form
1938 -261 179 267 -209 -253 223 226 -234 -198 237 143 -232 -77 241 17 -239 63 253 -111 -249 172 262 -195
1960 -195 -243 209 221 -212 -187 219 128 -225 -52 217 -17 -237 73 237 -146 -251 178 256 -199 -232 220 221 -203
1983 -203 -156 207 118 -187 -21 217 -31 -202 123 242 -160 -238 206 253 -214 -242 200 211 -215 -169 197 105 -193
2006 -193 -32 174 -63 -200 110 197 -185 -211 221 220 -229 -234 221 212 -204 -156 207 111 -168 -22 165 -40 -158
2029 -158 121 176 -191 -185 238 194 -249 -209 242 195 -239 -172 197 98 -183 -40 155 -50 -144 118 152 -186 -155 237
2053 237 177 -252 -168 263 170 -246 -141 219 96 -173 -58 151 -33 -129 102 125 -170 -118 212 138 -244 -139
2075 -139 266 137 -245 -107 228 97 -190 -29 168 -23 -138 87 116 -159 -116 211 101 -242 -109 249 106
2096 106 -249 -101 229 66 -204 -16 175 -34 -138 98 134 -130 -84 199 90 -215 -85 245 90 -234 -48
$$ packed form
1938b61M40Q8m76m4M76Lm60L6M35r4l75J55L18k24k56L02J90l64j38M21R0m57
1960a95m8M52J2m33K5M06r1l53J73K69k34k20L10J64l83j05M29P8m55l3M52Jm24
1983b03M7L63q9l05J66K38k48j71L25J19m02p8M44M7m67k8M42J1m26M6L66r2k98
2006a93J61K06k37j37L10Q7l82k6M32jm49nM55rm16M8L63r6k79J46J87k05j18
2029a58K79N5l67OM23m4m43M0M51m7m34O7L69r9k81J43J95k05r4K62L4l38L1L92
2053B37o0m29Q4M31r3m16J05L60j23k69J15K09j84r6K31K3k95N2L30p4l82J05
2075a39M05j29l82J38L35j31k87J61J97j91j15K25K9k75M3L27j10l43J33L58j43
2096A06l55J48L30j63k70J88J91k09j04K36L6k64M6K83j09l05J30L30j55l24J86
$$ plain form
2117 -48 231 40 -199 6 176 -45 -140 98 109 -149 -101 171 82 -211 -78 218 58 -225 -52 209 21 -187
2139 -187 17 166 -60 -133 111 119 -138 -92 192 96 -196 -55 223 66 -198 -25 192 5 -177 36 145 -71
2161 -71 -124 107 95 -158 -93 179 58 -212 -66 201 38 -209 -35 179 10 -161 30 139 -77 -117 117 99
2183 99 -152 -77 177 81 -202 -56 206 64 -196 -40 176 1 -145 43 122 -71 -93 130 78 -155 -61 187
2205 187 57 -207 -50 216 48 -196 -16 182 2 -143 35 108 -79 -87 109 48 -146 -41 175 39 -194
2226 -194 -30 205 14 -194 -11 177 3 -137 34 115 -49 -64 104 52 -129 -18 182 29 -191 -15 196
2247 196 9 -201 -7 175 -18 -156 15 103 -63 -69 92 30 -133 -9 165 1 -185 14 207 -11 -189
2268 -189 31 192 -16 -138 49 121 -55 -58 105 43 -112 4 156 -9 -168 26 177 -26 -179 26 161
$$ packed form
2117d8K79j91k39K05J70k21r5K38J1k58M8K72q9k93J33K96j60k83J73K61j88k08
2139a87K04J49k26p3K44Qk57M6K84r6k92J41K78j57k64J73K17j87j82K13J09k16
2161g1n3K31j2k53O5K72j21k70J46K67j63k47J74K14j69j71J91J09k16m0K34j8
2183I9k51P5K54r6k83J46K62j42k60J56K16j75j46J88P9j93k2K23n2k33R4K48
2205A87j30k64J57K66j68k44J80J98j80j45J78P3j87qJ96o1j94J05K16j36k33
2226a94J64K35j91k08J83J88j74j40J71Q1j64j5J68n2j81J11K00j53k20J76K11
2247A96j87k10J94J82j93j38J71Q8j66oJ61o2j63J24J74j64j86J99J93k18j78
2268a89K20J61k08j22J87P2j76lJ63o2j55J16J52j65j59J94J51k03j53K05J35
$$ plain form
2289 161 -39 -143 37 123 -65 -74 81 46 -108 -9 136 -6 -153 25 161 -33 -169 40 155 -47 -128 56
2311 56 106 -58 -66 86 32 -110 -7 123 -13 -141 27 162 -30 -157 51 145 -53 -116 64 109 -77 -57 95
2334 95 33 -105 -6 135 -13 -139 36 140 -40 -140 41 121 -55 -113 60 85 -68 -39 89 30 -99 2 123
2357 123 -12 -131 36 144 -29 -135 58 127 -37 -91 64 79 -66 -46 92 26 -108 4 117 -32 -148 25
2379 25 118 -51 -128 42 108 -61 -87 62 68 -79 -42 88 20 -92 28 126 -24 -111 56 135 -44 -116 61 116 -52
2404 -52 -83 70 63 -67 -29 79 1 -100 13 100 -41 -118 48 114 -65 -128 54 110 -58 -83 54 56 -57 -21 87
2429 87 13 -78 29 107 -45 -88 76 119 -57 -109 80 110 -53 -70 79 60 -57 -21 69 8 -68 38 98 -43 -80
2454 -80 72 103 -64 -110 73 100 -68 -65 73 52 -71 -19 61 2 -69 31 80 -46 -84 60 92 -79 -93 77 86 -80
$$ packed form
2289A61k00j04J80Q6j88rJ55l5j54R9J45j42j47J78J36j94j36K09J15k02q1J84
2311E6N0j64qJ52n4j42J03J30j36j28J68J35j92j27K08R4j98o3J80M5j86K0J52
2334I5o2j38R9J41j48j26J75J04j80j00J81Q0j76n8J73K5j53K9J28n9j29J01J21
2357A23j35j19J67J08j73j06J93O9j64n4J55J5j45K0J38o6j34J12J13j49j16J73
2379B5R3j69p7J70O6j69k6J49Oj47L7J30o8j12J20R8j50q7J67P9j79p2J77N5j68
2404e2l1J53pj30L8J08p8j01J13Q7j41p7J66O6j79o3J82N6j68k5J37Kj13L6J08
2429H7p4r1J07P8j52m3J64M3j76n2J89L0j63j7J49j9j17L6R0o1p6J06O0j41l7
2454h0J52L1j67m6J83K7j68LJ38k1j23N2Q0n9p1J00M9j26l8J44L2j71j4J70Rj66
$$ plain form
2480 -80 -73 76 55 -56 -10 76 3 -58 43 88 -39 -65 80 90 -75 -75 83 82 -65 -56 73 41 -70 -28 68 -10 -63
2507 -63 22 65 -50 -58 70 71 -63 -69 73 73 -69 -42 90 44 -57 -9 77 -5 -47 39 72 -35 -51 63 70 -74 -52 94
2535 94 53 -74 -58 74 28 -78 -14 60 -18 -68 25 57 -59 -47 67 47 -63 -56 77 57 -72 -31 72 38 -64 6
2561 6 70 -12 -54 42 78 -35 -50 63 66 -72 -34 77 62 -64 -23 78 19 -50 4 70 -13 -51 50 52 -57 -42 71
2588 71 52 -69 -52 68 28 -65 -34 68 25 -50 -2 42 -21 -53 38 50 -60 -38 70 49 -71 -34 90 47 -60 -30
2614 -30 68 25 -47 16 54 -21 -38 46 38 -54 -42 63 39 -75 -31 67 25 -80 -36 49 4 -64 -8 41 -21 -38 40 35 -57 -30
2644 -30 69 43 -73 -25 87 31 -61 -13 77 19 -45 9 37 -20 -26 34 30 -52 -23 71 23 -80 -28 74 15 -71 -15 60 9
2673 9 -56 -1 29 -35 -32 39 28 -44 -19 63 26 -61 -23 74 15 -64 -9 64 7 -58 2 53 -17 -31 28 17 -32 -21 61 12 -67
$$ packed form
2480h0PJ49k1j11M6Q6p3o1J01M5j27k6J45J0j65%J58jj47RJ29l2j11M2R6p8n3
2507f3Q5M3j15qJ28Jj34oJ42%j42K7J32m6j01M8Q6q2m2Q6L3j07j6J14Pj44K2J46
2535I4m1j27J6J32m6j06O4P4p8n0R3L2j16J2J14k0j10PJ33k0j29M1J03l4j02P0
2561FO4q2m2R6L6j13j5J13Lj38L8J11j5j26M1J01n9o9N4O6q3l8J01Kj09J5J13
2588G1j9j21J7J20m0r3L1J02m3p5M8M4o3l2R1J2j10K2J08k1j20L7J24m3j07L0
2614c0R8m3p2O3L8p5j7Q4qr2J2J05k4j14M4R8m2j05M4Q5m5o8N6M9o2j7P8nr2K7
2644c0R9k6j16M8J12n6r2M8R0n8o4N4K8n7oO0mq2K9R4m8j03N2J02n9q6N6P5n1
2673Io5N5L0o4LP1j1p2K5Q2l7q7L8R7n9p9N5P3n7o5O0N1p0j4N9j1m9J1Q2m9p9
$$ plain form
2704 -67 -13 63 10 -71 -10 54 3 -43 14 25 -26 -23 34 17 -40 -23 43 7 -66 -10 54 6 -69 1 51 -7 -38 19 38 -20 -21
2735 -21 48 29 -42 -7 57 14 -45 -2 68 11 -54 3 52 -3 -43 17 37 -31 -29 33 12 -51 -9 37 2 -54 -2 55 -10 -54 4
2766 4 51 -7 -38 20 40 -11 -8 38 25 -35 4 59 5 -50 12 61 4 -40 7 41 -9 -30 20 24 -15 -21 21 5 -43 -4 46 2
2798 2 -53 8 60 -7 -52 9 51 -8 -37 25 28 -22 -19 39 11 -30 16 43 0 -47 11 53 -1 -47 11 36 -15 -31 11 24 -22 -19
2830 -19 29 17 -26 -1 32 3 -43 15 50 -16 -47 4 30 -13 -22 19 24 -16 -11 25 -7 -32 7 37 -4 -39 20 46 -13 -45 13 53
2862 53 -9 -24 22 28 -5 -7 29 2 -33 9 29 -17 -48 15 30 -23 -50 17 28 -19 -17 21 15 -22 -17 20 -2 -28 6 25 -11 -37 18
2895 18 42 -12 -35 20 41 -4 -19 27 23 -15 4 32 2 -16 19 33 -12 -32 14 27 -22 -26 17 19 -20 -28 16 3 -25 -21 21 -9 -33
2928 -33 4 32 -6 -27 11 44 -14 -29 27 26 -29 -18 33 21 -13 -7 25 5 -16 13 22 -13 -31 10 24 -29 -24 16 21 -18 -19 14 18 -28
$$ packed form
2704f7N4P6n3q1O1O4n1m6N7J1n1LN7j7n7J7O6l6p3N6O4m8p5P0N0n8l1N7J9n8j
2735b1O9j9p1L5O4m3n9M3P0n7o5N7M9n5m0O0K0o8KO2k1o3M2M6l5n6N2N7o5m4N8
2766DM7n8l1N8K0n1LM6j3o0L9N5n4n5O2M9n7m4M7L4n0k1N0Ml9oM2j6m8L9N0m4
2798Bn5O1N2o7m5O1M2n9k9O2Ln0LN8k8m1M6K7m3m7N8M2n4m6N8K5n1j6M2J3m6L
2830a9M8j2m3K5L3k9m6N8L5o6l1N1K6m3rM1Nm0NL6l2k5L9L0m1l5N9K6n9l2N8M0
2862E3o2j5M6Ol3kL6k7l5M2K0m6l1O3J5n3k7O7J1m7KL8ol7NL7k2k6L4J9l6k6N5
2895A8K4n4k3N5K1m5j5M6ml8J9K8l0j8L5J4m5k0M6J3m9mM3Kl9qM4j3k8MM2l0k4
2928c3L7K8l8k1L8L3n8j5N6jn5J1N1j2l4OL2k0k1K9Rl5j8M1J4n3NM0Nl9jL3Mm6
$$ plain form
2962 -28 -1 16 -15 -29 7 23 -24 -32 14 20 -24 -20 15 17 -29 -16 21 9 -8 -11 10 6 -23 10 23 -9 -21 21 26 -23 -20 26 23 -10 -11
2997 -11 16 12 -15 -7 18 -16 -27 -3 9 -25 -24 15 5 -22 -23 25 13 -9 -16 20 16 -22 -3 18 -3 -4 18 18 -13 -11 27 28 -13 -21 16 16
3033 16 -10 -6 19 2 -26 0 3 -1 -20 7 0 -28 -16 13 22 -24 -29 8 10 -9 -4 20 5 -14 1 25 1 -12 17 12 -16 -6 18 10 -15
3068 -15 -20 28 16 -18 -9 25 0 -14 4 15 -2 -21 14 13 -12 -11 15 10 -35 -12 14 9 -21 2 15 -6 -15 2 12 -9 -8 1 14 -21 -16
3103 -16 25 15 -9 -9 22 12 -6 -9 23 2 -8 17 26 2 -10 15 20 -7 5 20 18 -24 -10 14 5 -22 -6 15 4 -17 0 8 -11 -3
3137 -3 11 6 -22 -25 25 6 -4 5 15 17 -12 6 26 9 -1 4 15 10 -1 20 16 -6 2 20 5 -14 -6 14 -9 -22 7 8 3 -5 5 15 -19
3174 -19 -17 15 7 -18 4 25 13 -2 -1 31 7 0 11 11 12 -1 11 12 18 -1 18 10 -2 -8 27 10 -10 -9 18 3 -12 12 1 2 -20 9
3210 9 5 -11 -3 3 -4 -12 12 9 5 -11 3 31 5 -5 4 14 1 -2 3 8 8 -10 14 13 1 5 13 12 -7 3 24 8 -8 3 28 15 -10 10 14
$$ packed form
2962b8K7J7l1j4L6J6m7qM6Om4ML5Km6J3L7j2j7lK1mk9L3J3l2j2M2Nm9LM6ll3j
2997a1K7mk7QK5l4j1K4J2l4JL9j0k7jM8j2k2pL6ml8J9K1k1jK2%l1KL8Jm1qL7%
3033A6k6MK5j7k8K6Lmj9K7pk8J2K9Rm6nL7Kj9NK4j5j9J5K4k4j3K9nk8J0K4qk5
3068a5nM8j2l4RL4k5j4J8J1j7j9L5jk5JK6nm5K3K6nl0K3J3k1rJ7J0k1JRJ3l5N
3103a6M1j0k4%L1j0j8lL2k1j0K5Rk4j2K5Nk7J2J5km2J4K4rk7J6K1j1k1J7Qj9Q
3137cJ4nk8lN0j9j0RJ0Kk9J8K0j7j0NJ1nj1K1mk2QJ8j5j9QK0k3j3K9JnqJ0J0l4
3174a9KL2qk5K2K1j2j5JL2k4pJ1%Jj3J2JOj9J9qj2oL5j7k0JK7j5j5K4j1Jk2K9
3210Imj6QOpqK4lmj6J4K8k6j0RJ0j3lNN%j8K4jj2MQjj9J0K1j6j6J1K5j3k5K0M
$$ plain form
3249 14 -1 -7 9 7 -4 -1 18 -4 -3 4 17 3 -17 5 12 3 -14 8 1 -5 -1 14 9 -1 15 22 10 -3 9 29 1 -6 10 19 6 -3 8 22
3287 22 -2 9 14 4 -13 2 4 -3 -14 2 9 -9 -11 0 15 2 -5 12 14 3 6 15 4 -1 10 21 17 7 23 18 10 -4 15 21 1 4 11 14 7
3326 7 -1 21 6 5 4 12 -6 -14 9 6 -7 1 0 8 -9 -10 9 -5 -5 -6 0 2 2 -4 17 1 -5 6 17 -7 -14 0 21 -8 -1 8 10 1 -1 4 0 3 10 14 2
3371 2 3 10 10 -4 -4 4 10 1 -4 -10 15 7 -1 1 -1 -1 -7 11 -3 -8 -1 12 -8 -5 11 21 -1 4 15 10 8 11 21 9 -6 13 20 11 8 11 15 -11 -5 5 -3
3416 -3 -10 -2 -11 -6 -12 -10 -1 -12 -10 0 6 -4 -9 14 10 -8 1 12 11 -8 9 -6 5 4 11 11 3 5 18 7 -5 -11 22 10 -9 4 3 5 -7 0 -2 -7 -3
3459 -3 1 2 -6 -3 -2 7 -3 -2 9 2 -5 -4 12 11 -8 11 10 7 7 19 2 1 -5 6 6 8 -1 11 15 -3 10 10 17 11 2 12 19 4 3 0 8 -6 4 1 -1 0
3505 0 -4 -2 -3 0 -7 8 -4 -3 10 8 9 13 16 5 5 21 14 5 9 5 17 1 8 16 8 18 6 7 4 4 8 8 4 -3 7 2 -6 -4 2 3 0 -3 5 0 -1 -7 10 -2 1
3554 1 13 13 11 3 3 4 13 2 26 26 0 0 15 5 15 1 10 3 6 0 10 8 6 26 2 2 9 15 -5 -1 2 12 -3 10 -6 4 -3 5 11 3 3 13 6
$$ packed form
3249A4j5oJ6kj1LJ9k2JPJ3j4k0K2Prj7K2poMJ5nj0J6Pj2j3J2K0k8pJ6Rj3rJ1J4
3287B2k4J1Nj0j7J5Kpj1J6Pj8kJ1J5j3pJ7Kj1LRj1nJ1J1mj0J6nqj4J9Ok0LPLp
3326GqK2j5jjQj8qK3lj3QjQj7jJ9j4%jOK%oK1j6oJ1J1k4pJ4K1k9PRKrkNmLPMj2
3371BJP%j4%QOrnoK5qqKk%oJ8j4nPJ3k0LJ6J0k2NJ1nkLJ0j2j5J9PrlLMk6OJ0q
3416cpQrNoKRj1KJ0Oj0nK3mj8RJ1jj9J7j5J1jP%qKJ3j1j2oL3j2j9J3jKj2PknM
3459cMJqLJRj0JJ1ppJJ6jj9J9jl%J2j7joJ1%KrJ2Mj8J3%PorJ0Pj5jlQj4J0lkJ
3505@mKjLpJ5j2JJ3kJMLj1%J6prMmJ2j6PQqJ0j2Jl%M%mpJ0nqKOJllQnjoJ7j2L
3554AJ2%kq%JRj1K4%k6%J5j0J0j4RpLoJ0kkK0k4%POk0MLJ0j5J3j6J0pQOq%J0p
$$ plain form
3597 6 9 3 4 11 8 10 6 8 21 1 -4 9 2 7 7 0 7 5 3 8 4 10 1 -1 -3 5 17 6 -1 3 0 0 -10 10 -10 2 6 12 1 -6 -5 -1 4 10 3 6 10 2 17 18
3647 18 5 13 5 13 -5 12 11 5 7 15 19 2 3 8 10 0 6 -2 -5 -2 -3 4 -3 -2 6 -5 2 -16 1 -7 -5 -6 0 12 -1 3 5 8 4 0 13 7 13 11 5 -1 1 14
3695 14 14 10 1 10 15 6 -2 3 -4 0 4 4 4 -6 0 5 -5 -10 -5 2 -2 -11 7 9 6 4 8 4 3 7 5 5 15 17 21 7 4 11 15 15 11 13 10 20 12 17 12 -1 20 14 19 7
3747 7 10 3 10 -2 1 2 -3 -2 3 -8 5 2 13 0 -1 -2 0 -3 -6 9 19 7 10 15 16 5 6 7 15 7 10 10 14 13 9 15 9 5 15 2 -2 6 0 13 2 5 6 8
3795 8 7 -7 9 3 -5 6 6 9 4 3 3 8 7 1 7 4 9 13 15 0 2 11 12 13 5 8 21 7 11 -2 9 9 8 -3 11 0 6 1 -6 8 12 3 -11 -4 -6 0 -1 6
3843 6 4 2 11 5 2 3 4 4 3 0 6 6 11 9 4 18 10 11 14 11 11 14 11 15 12 5 8 7 2 5 6 2 -6 12 -1 -4 4 1 -1 -1 -1 -2 8 -3 2 12 13 6 -1 2 9 18 10 11 17
3898 17 16 5 18 22 11 14 18 12 16 20 10 4 2 15 13 8 2 4 7 11 1 9 -1 4 12 7 -1 2 -3 7 15 -1 8 2 13 0 14 16 3 15 14 17 15 13 15 0
3944 0 10 16 16 12 10 18 11 7 12 4 13 11 8 8 2 8 4 -1 2 -4 6 -1 4 3 2 -5 -1 3 5 8 9 7 3 13 25 7 9 8 8 9 17 6 11 7 10 8 17 14 7 5 11 13 14 6 14
$$ packed form
3597FLoJPlKmKJ3k0nJ3pN%pPkkNmOrkkQJ2j1pMl%j0K0k0J2MOj1pJMNOpLMqJ5J
3647A8j3QqQj8J7joKQMj7JNKj0OqlLjPpJQj1Pj8J7qKjOJ2j3MKLmmJ3oOkooKJ3
3695A4%mrRNrqNpMM%%j0ONj0nNPmrJ8KlkMmjMk%J0KMj4lPM%mKlJ0qNnj3K1oNj2
3747GLpPj2LJnJNj1J3lJ1j3jjKllJ5J0j2LNJj1JJQqL%MjmOomJ0j3mQoJ3j1LJK
3795Hjj4J6oqJ1%Lnj%NjoOlNMKj5KRJJqLJ3j4Mj3J1%jj1J4j1OnpJ4Mrj4PkOjP
3843FkkRolJJ%jlO%NknJ4qJLl%LlMlpLjnLJmqJ8j3lQlk%%jJ0j1NJ0JppLPRqJO
3898A7jj1J3Mj1LMoMMj0okJ3knoKLMj0Qj0NQnqLnJ0Qj6RoJ1j3J4Kj3J2jLkkKj5
3944@J0O%mkQpmNqRkl%oOmnLoJ0pNjjpMMKLJkmJ0J2j8Kj%JQj1NmLkRlpkOKJqQ
$$ plain form
3999 14 3 -9 3 -4 -8 4 4 18 2 -2 6 12 -2 7 -1 8 1 17 18 3 15 6 19 4 5 15 17 5 20 13 20 6 14 13 9 9 -8 11 -2 3 -2
4040 -2 0 -9 5 -2 -6 -4 6 -11 1 5 5 -1 2 0 1 16 -1 3 11 7 12 17 11 16 10 8 12 9 10 14 6 -6 1 12 6 5 19 4 4 6 0 6 8 4 -1 0 0 0 13 4
4090 4 4 8 7 11 2 11 1 7 1 10 6 8 1 3 13 17 17 19 13 10 7 15 17 13 20 13 12 15 14 9 5 10 7 11 5 8 3 9 12 10 2 2 1 -1 2 5 7 14 -4 4 4 1 13 8 5 5 6
4147 6 3 8 12 19 15 8 16 10 8 4 8 0 14 8 7 14 8 16 9 20 3 6 8 -7 7 12 -1 -10 -3 1 2 -2 9 1 8 -2 14 9 4 13 22 14 4 24 23 9 19 13
4195 13 8 15 13 11 11 12 15 7 20 8 13 1 0 4 1 -3 4 -5 0 12 -3 5 1 3 9 4 -2 6 5 5 6 13 16 4 13 6 8 2 21 10 11 10 5 19 6 10 9 2 2 11
4245 11 3 7 4 -1 9 3 6 12 -3 -1 8 5 10 9 10 4 -1 4 -3 -6 -8 14 5 14 16 5 6 11 15 5 12 12 6 10 5 14 9 13 12 0 4 6 8 6 3 -6 5 -4 5 7 1 13
4297 13 1 10 4 3 -3 10 7 11 3 11 -1 11 13 13 5 6 10 10 17 9 9 -3 3 11 9 9 7 -2 2 3 0 12 15 5 3 14 -2 3 4 -3 14 5 -3 5 -2 -2 0 5 9 9
4347 9 7 10 6 -2 8 17 3 4 11 22 16 18 10 10 8 7 10 7 9 8 0 0 -6 0 1 3 -2 2 5 4 7 5 -6 -1 1 -11 4 2 6 0 -8 1 4 2 -8 4 7 3 -4 4 3 6 10
$$ packed form
3999A4j1j2J2pmJ2%J4j6mQOj4RqRpJ6Jj5J2rJ3j5JJ0Kj2J5pPj4Qjm%j7J9j3Nn
4040bKrJ4pmKJ0j7J2M%oLkJJ5j7MQmNNoNokMlJMqj2PJ1ojJ4j5%KoOKmnJ%%J3r
4090D%MjMrRj0OoRmKpKJ0M%KollQKmPpjLjnmNlMoLnOLkq%jkLLKPj8Q%lJ2nl%J
4147FlNMPmpQokmMqJ4ojPoQpJ1j7LKj5J4Nj3rPMJmJ1qPj0J6nnRRqj0K0jj4J0o
4195A3nPkk%JLqJ3j2Nj2jMlmPrNJ2j5QmKOnoQj%JPLj2RpKoJ9j1JjnJ4j3Mjp%R
4245A1qMlnJ0oLOj5KRlNjJonNplkK2rRKj1JNMj0P%oMnRnMjj2MKKklrJ1rRKoJ2
4297A3j2RojoJ3lMqQj2J2K%qJM%Pq%j2OQk%krMJlJ2Lj0kJ1j6NJpJ7rqQp%KNM%
4347IkLmqJ0Rj4JPJ1oKq%kjLlKjq%oOJKnMLjLkj1NKj2J5kMoqRLkj0J2LmpQjLM
$$ plain form
4400 10 0 0 4 5 12 -1 6 14 2 -3 -3 1 1 -5 -11 -5 -1 1 0 0 -5 -9 4 -11 -16 -4 6 -7 -9 -6 -6 2 3 9 -3 -2 12 3 8 6 2 4 7 3 2 7 3 12 12 1
4450 1 10 3 0 2 -12 -5 -1 8 6 -5 -8 -5 7 3 -5 -1 -6 -4 2 4 1 -2 7 -1 1 -4 23 14 14 15 22 14 3 18 12 6 7 -7 -1 8 14 13 2 7 6 -3 6 6 -2 4 2 13
4502 13 -1 10 -1 -7 -7 3 0 -1 -3 -14 12 10 3 1 -8 2 11 2 -10 8 10 4 17 15 -1 20 4 8 12 13 12 7 2 6 14 3 9 10 0 -1 -2 0 7 6 0
4547 0 5 1 12 -7 4 -5 5 1 1 12 8 11 3 16 13 8 7 3 9 13 5 9 11 11 5 17 9 10 4 14 5 9 0 13 13 3 2 -4 3 -12 3 9 -6 -8 2 0 15
4594 15 12 -4 -4 15 10 10 3 8 5 7 6 5 13 5 7 8 6 6 5 4 -8 8 6 7 4 2 3 3 8 -8 6 3 8 7 0 -5 -1 -2 7 -1 -9 3 -12 -2 -1 5 -2 7 8 -2
4644 -2 9 8 7 1 7 3 5 13 -1 8 12 10 -5 2 6 5 8 4 -4 -4 3 8 7 2 8 0 4 -4 -5 1 -4 3 8 8 -3 -2 5 3 8 4 5 10 6 0 11 6 3 9 12 5 10 13 3 5 10
4699 10 0 10 3 -12 -1 -6 -1 7 8 -4 -10 1 1 -4 -8 -12 6 -3 10 0 5 9 -2 13 -4 10 1 1 5 8 12 -6 9 9 18 12 -3 1 5 16 11 12 8
4742 8 9 0 8 -8 6 2 -1 1 5 3 -1 1 1 -2 -7 -3 -1 1 3 -1 6 6 4 4 4 3 -2 -5 3 4 -2 11 10 3 2 14 11 7 3 1 3 2 -6 2 2 11 4 -7 -2 -3 -9 2 -5 0 -5
$$ packed form
4400A0j0%MJPj3PQj2n%M%ooOMKj%nmJ3j5nJ2J0j3kL%QJOj2JJ4rNkmKLmjNmR%j1
4450ARplKj4PMRkj1lLJ2mqMnKOKllRqKnK7r%JPqj1J5ooJj4OROjj1NjrR%qOkJ1
4502A3j4J1j1o%J0ljkj1K6kpkrJ0Rrj2J8KoJ3kj6K1j6MMJjnnMQj1OJj0jjKPjo
4547@NmJ1j9J1rJ0m%J1mLqJ3lnjmOMqMK%oJ2qJoJ0rMrJ3%j0joPj5J5Oj5kJ0kJ5
4594A5lj6%J9n%pNlKjjQqKJk%jjj2J6kJlkJ%Nj6J4lNjpnMjRqqJ2j5J0JOpRJj0
4644bJ1jjoOmKQj4RMkj5PMjLmq%PNjnOqMqjOnPN%j1JPkNmJNmoJ1nlOLpNLj0KN
4699A0j0J0pj5J1nNQJj2oJ1%nmmJ8rJ3j0NMj1J5j7J4r%MLMj8J5%Roj5MMJ1nJm
4742HJrQj6J4mlKMkmK%lnMKKKmP%k%%jnlQJoJ3jpjJ2lmmkKjqQ%Rpj1NjoJ1pNn
$$ plain form
4797 -5 -8 5 2 1 2 -1 5 6 0 -1 5 13 1 18 14 20 3 6 16 6 7 8 2 14 9 -2 18 10 -1 8 5 9 3 3 4 1 -8 4 1 4 -8 4 3 -1 -6 -1 0 9
4845 9 13 -9 4 -4 -8 0 1 -1 17 6 6 13 12 15 11 15 2 4 8 10 0 13 -2 22 0 -4 9 11 -2 11 -14 -6 3 3 -2 4 -2 -7 -1 2 3 -2 12 5 -3 12
4891 12 5 4 1 11 9 10 13 5 20 5 4 19 7 17 6 7 9 2 9 13 15 4 0 2 2 5 -3 -2 1 4 -2 -5 6 2 3 -4 -1 12 2 -6 3 13 5 10 0 13
4937 13 20 16 11 17 3 22 10 3 2 8 11 10 3 13 3 6 4 1 -3 0 5 6 -2 -3 -2 1 -2 -7 0 0 -2 -6 4 -3 -1 -7 13 17 5 3 10 10 5 13 11 9 11 16 12 7 15 7
4989 7 16 7 9 3 -2 2 13 2 5 -2 7 4 3 5 6 7 7 -1 -1 0 -1 -2 -2 6 2 -3 5 6 6 17 8 9 5 1 12 9 13 13 2 8 17 15 2 8 4 1 -1 -3 -1 -9 3 0 1 1
5043 1 -1 9 0 1 -1 0 6 -11 -8 2 -5 2 3 -6 -3 -1 5 9 -1 -3 6 0 2 5 1 18 5 4 6 9 3 5 12 -5 3 7 -7 -4 -1 4 5 1 2 -5 -1 0 -6 -1 4 -2 -13 3
5095 3 1 4 8 -1 11 7 7 -2 8 2 10 12 -2 2 1 7 -3 1 6 4 5 7 3 1 8 4 5 -2 -2 -8 0 6 3 5 6 -3 -1 -10 -5 -8 -5 -2 -1 -7 0 -1 2 1 1 -3 0 6 3 0 15 11
5151 11 0 -3 6 6 11 1 2 2 -3 -1 -9 3 -11 -2 -2 0 -9 -8 -2 -9 -6 3 1 -12 -4 -10 -7 3 -6 4 4 3 1 9 4 0 7 0 5 9 15 8 8 9 11 -1 8 5 11 11 1
$$ packed form
4797elJ3ljJlOJojOQj2J7mOj7LJ0j0JJoJ2nj1K0qj1RlMo%JlrJ2lLj2J2jmnNJR
4845IMk2J3qmQJkJ8j1%PjLmMj3KMKj0J3j5K4k2mJ3Kj3J3k5QR%nOonOLJnJ4pqJ5
4891A2pjlJ0kJLqJ5j5jJ5j2J0j1JKpPMKj1mK%LqJLLolJ1mJpLJ3j0qRJ0qNj0J3
4937A3PmnOj4J9j2pjOLjpJ0j0LklmLNJqjJLlnP%kmJ0pKoK0Mj2kP%nQkkKNmnQq
4989GRrKonMJ1j1LpRljKJJ%q%Jjj%QmnQJ%J1rJmmJ1lM%j1ORkj3OmlkkKqJ2lJ%
5043AkJ0rJkJOj7LJ0pPJrLKOMj0kRoKLmJ7j3jKLoKPj7QMj4LLNJmJpMJoNNoj1J6
5095CkLMrJ2m%rJ0oQKj4MjOj0MNkJKmkPmJp%oQOlKJrKrNlLLJoPjLj%mLOllJ5m
5151A1j1lR%Nj0J%nKqJ2j4R%KrJOpLRkj3QoLJ0rJ0%jkQnmPpNMOp%JKj2RlO%j0
$$ plain form
5202 1 8 4 1 -3 0 5 -2 8 3 -4 -3 -4 10 -4 -5 6 1 2 -4 -8 7 10 1 0 4 0 2 13 8 9 -2 11 11 6 4 9 3 14 11 8 -1 4 1 4 5 1 -4 -1 3 -5 1 -6
5254 -6 -6 3 0 2 -8 5 4 -4 15 8 12 11 10 7 8 15 9 6 11 7 7 8 15 4 3 18 4 3 4 5 14 6 3 13 -1 1 6 -3 -9 5 0 1 -7 -5 -5 4 -11 2 2 -6
5304 -6 5 -4 7 2 8 3 13 7 8 10 8 13 8 12 4 10 8 13 15 10 11 3 4 13 -1 5 1 -2 9 2 0 4 -5 -7 0 5 -10 -7 -6 1 6 -1 -4 5 -3 1 2 5 14 1 1 1 8 11
5358 11 16 11 11 7 4 12 -2 -5 -2 3 4 -2 3 -1 -8 5 2 -6 3 -1 -5 -3 -7 -11 -8 8 -1 -5 -2 -5 3 -1 -3 -1 3 2 1 4 8 9 0 11 11 3 10 2 16 0 -5 -1 6 12 5 -6
5412 -6 -2 1 9 4 -4 -3 0 -1 6 -5 4 4 2 -1 -1 0 -8 6 -7 3 -1 3 12 4 6 10 10 4 -5 12 5 10 -1 3 12 9 4 11 9 7 3 8 4 4 -2 -14 -5 -14 -1 -7 -1 -12
5464 -12 -6 -10 -3 -2 -1 7 5 5 -1 -3 0 -7 5 1 9 9 2 4 -1 11 2 3 -1 8 2 2 3 18 1 -2 -4 -8 1 6 0 4 -4 6 10 -6 4 0 4 -8 -2 -7 -8 -4 0 5 0 -9
5516 -9 0 7 13 10 9 7 12 9 10 11 4 10 3 7 8 5 8 4 5 6 9 2 -4 -5 0 -10 -4 -11 1 -3 -4 10 2 -7 -10 -2 4 -5 3 -1 15 3 2 8 2 4 7 8 10 9 4 7 5 9 1 6
5572 6 12 0 13 5 11 6 2 7 -2 -8 4 -5 -1 -4 -3 -4 -7 2 1 4 -3 2 -5 -4 0 -9 3 5 0 2 8 -2 15 10 11 11 0 15 3 -10 9 8 7 6 -6 8 0 0
$$ packed form
5202APmlmLNpJ0npJjJ4j4jJ1nJomJ5LrjMmKJ1nJj1J3%nkNoJ1llrNlLJmnLMqOp
5254f%RlKj0J3jqJ9pMjjlJPolNm%JPj1jJ5j4jJJRqlJ0j4KNroJ4nJqK%Rj5J3%q
5304fJ1rJ1nOnJ0oJKkNnMqOkNKnJqJRj4OmlJ1pkMrkPNj5LJPNplRqMJLRj3%%PL
5358A1Nn%mlQj4lLNJoNmpJ3lqRmmKmmLJ6rmLlQmkKMjjLMJrJ1%qPqJ4j6nMPOpj1
5412fMLQnqJLjPj1R%kl%JqJ4j3J0mMRqKM%orJ7pNj1MRlnPkkmNm%oj2RrJ3oOj1
5464a2OmPJJQk%okLpJ2mQ%pKnJ2rJmRo%JJ5j7lkmRNoMqJ0Mj6J0mMj2OnjMMNnr
5516iRPOljkNlJJpOpMJlLmJJLpojNj0OpJ2mjJ4qrlQOrQmJ6j2jOoKLJKjnLkMqN
5572FOj2J3qOnmNroJ2rMlJjlRjLpNpJMrJ2KnKOj0J7nJ%j1J5j2j3J9jjjj2J4q%
$$ plain form
5620 0 -10 -6 3 -1 2 -5 -6 1 -5 2 -8 -6 -7 2 -6 -4 -5 -3 6 4 10 3 -1 5 13 1 15 17 7 5 -1 12 3 7 7 5 7 6 2 1 4 0 6 -1 -3 0 2 -3 -4 -9 -1 -8 -10 -10 -3
5675 -3 -10 -5 4 -3 8 7 0 -2 13 -2 6 12 2 15 4 5 18 -4 6 8 9 7 13 6 1 -8 1 -1 9 5 0 -1 -10 1 1 1 10 5 5 -3 0 3 0 -2 -3 5 -4 3 -6 10
5725 10 4 -2 15 1 15 12 7 8 12 16 13 11 10 10 3 3 2 7 7 11 -1 1 -14 3 0 -2 1 -3 4 -14 -14 -11 -3 -5 1 -8 -3 -1 4 2 -1 -1 1 3 5 4 9 5 -2 0 0 0 5
5778 5 5 1 -3 13 8 12 10 13 -4 2 -2 -11 4 -7 3 2 2 -3 2 -6 -7 -5 0 -1 -1 -4 3 -9 -2 3 -19 -6 10 11 14 -4 5 2 5 23 5 9 6 2 -5 2 9 1 3
5827 3 -3 4 -6 -2 -8 -1 2 -7 -5 -1 0 -1 -10 -1 -13 -7 -1 -1 -9 -8 0 0 -4 1 -4 0 2 4 -6 1 7 4 2 1 7 11 10 7 3 3 -4 2 6 2 6 3 6 -2 1 -12 5 -1 -8 1 -1 7
5883 7 -3 0 9 2 0 -3 -5 2 2 4 9 8 9 4 3 6 3 11 13 6 6 10 8 9 16 -4 9 6 4 3 4 -2 -2 -3 1 -9 0 9 5 0 -7 3 -1 2 3 2 0 -1 0 7 11 5 -4 6 17
5938 17 13 9 3 -6 11 7 2 10 7 -4 1 0 7 0 9 5 2 -6 5 3 -5 -4 -9 -12 -7 -10 -6 -3 -17 7 -16 -5 -2 -11 5 6 -2 7 17 3 7 0 0 6 -4 3 16 1
5986 1 3 0 -1 -7 -13 0 -6 5 2 5 0 0 -6 -13 -1 -8 -4 -7 -9 -13 3 -6 -6 -11 2 -18 -3 8 -1 11 0 4 3 7 6 5 3 1 1 4 11 3 9 9 2 -8 -11 6 -12
$$ packed form
5620@j0MRmLpjPoPj0KjRqKjKRkOpmOQj2J4Kj0koJ3rM%kKjmjLmOpkLKnjnQpk%P
5675cpNRpJ1jpkJ5j5QOj0J3j1JJ3k2J0KJkOpnrRkJ0mnjrJ1%%Rn%qLLlkjQrPrJ6
5725A0ooJ7j4J4lnJMMlkj%p%jN%Mj2Kj5J7lkLmPj8%LQkOrNKNkl%KKKjNmpK%%N
5778E%mmJ6nMkLj7OmrJ5j1J0j%nNqjKNj%lPj2PNk2J3J6JLj8RlLJ8j8MlmpPPqK
5827CoPj0MoPLrKMJjrRj2OO%qJQ%mNnMKKj0POlkjOMjlm%pOMmMlLqLj3J7opRkQ
5883Gj0LRpklkP%KNjJnjLlQKp%MkJPk0J3lkjJo%jMj0RRmnpJ0mLJjkjJPMorJ0J1
5938A7mmorJ7mnQlj1NjPpRmlqJ1kqJnlNlMLj4K4k3J1LrJ6JqRJ0j4Mp%Oj0PJ3j5
5986AKljooJ3oJ1lLn%opJ2pMlkmJ6r%nJ3k0J5J1rJ2j1MjMjjkk%LPqO%pj0lJ7j8
$$ plain form
6035 -12 -8 -9 -2 -8 -6 -3 3 -2 -6 -12 -5 -13 -2 -2 -10 -1 1 3 -4 -3 -1 -5 -10 3 1 -1 -2 -1 8 -1 5 9 6 6 5 11 10 9 4 6 7 5 -2 2 0 7 0 4 0 -4 -9 -8 2 -8 0 0
6091 0 0 -8 3 1 6 -5 -7 10 -4 5 4 2 10 9 4 2 -3 3 11 12 11 12 6 12 0 1 11 2 -2 3 4 3 -10 -2 -5 -9 4 -10 -17 -2 -1 0 -8 -2 3 -11 -9 -1 0 -2
6141 -2 4 -1 2 -5 5 4 1 -8 -1 -4 5 3 2 4 0 8 -6 5 -9 -1 -1 -5 -11 2 -6 -7 -1 -5 -3 -1 -4 -9 0 -8 -5 -4 -6 5 -6 -7 4 4 -4 4 6 -2 0 6 -3 -8 4 7
6193 7 -6 4 11 -11 1 -1 9 15 -3 -6 -3 0 -7 -12 -6 -2 -4 -9 -4 4 -3 -1 -11 8 -4 -3 1 -11 -6 -2 14 -7 -1 4 -1 6 4 7 5 0 14 16 10 15 10 1 10 7
6241 7 0 -12 3 9 -6 4 -8 10 -4 2 3 -10 -4 1 -4 0 6 -2 -7 -11 2 -7 3 8 8 7 10 13 10 0 7 15 1 0 14 11 9 6 5 7 -4 4 -2 -1 8 -5
6287 -5 -10 5 6 -3 4 -14 -10 1 -2 -3 -3 -4 -3 -3 -2 -3 -5 -3 -3 5 4 5 11 12 -2 7 4 7 -1 4 2 8 6 9 9 5 3 -1 6 2 -1 -4 -3 -5 2 -12 1 -9 1 5 8 0 -6
6340 -6 1 -5 6 -11 -1 -1 -3 0 5 7 7 13 7 8 16 17 14 10 19 0 15 7 5 9 8 -3 -3 10 -3 11 16 -11 0 -2 4 -6 -5 2 -2 -2 6 1 0 -4 3 -2 3 0 -2
6389 -2 4 -3 1 6 7 10 9 7 22 10 4 13 1 13 2 15 7 11 3 5 8 9 4 7 12 -6 8 -8 -6 4 -3 -8 -6 -1 -6 3 -9 3 -1 4 5 -1 -4 5 0 -3 14 -2
$$ packed form
6035a2MjPoKLOnmoPqJ1%qRKKpJKmnJ3kkjJRrOMl%jOjjnKJkpMkPpMmmnJJ0j0Q%
6091@%qJ1kNj1kJ7j4RjkQjnknOQJjJoOj2JJ0rmNJjj3QlmJ3j4pJ5JJqONj4KQJk
6141bOnLpJ0jlrPlRkjKmQj4J1j4Q%moJ3qjOmKKlnRqLJkJ1j1jJ1%qQKqKOrnJ2L
6193Gj3J0Pk2J2kJ0Oj8lLLpnOMknNQpKj0J9j2JMj2NMJ6k1ONnPkLknJ4KoNnrRl
6241Gpj2J5Oj5J0j2J8j4OJj3ONnMOqnmJ3rJ0N%jLLlj0PQj4jJ4lkljKj1QoJRj3
6287enJ5JrPj8MJ1lj%jJ%JjkK%QjJOJj4RlLqNkOkL%mkmPmllJkPj4J3j0J0MLqo
6340fPoJ1j7J0%kLNK%OoJQJlmRj9J5qkMjj1%J3j3J4Nk7J1kOj0JPm%QnjmPnNlk
6389bOpMNJLjkJ5j2oRj2J2j1J3qMqKLJnLNj8J4j6KJ0pnKNnRj2J2mNJolRnlJ7j6
$$ plain form
6437 -2 15 3 9 -3 4 6 7 14 10 5 8 13 9 9 -2 11 13 -4 4 -1 12 -6 2 6 3 4 -1 3 -2 2 2 -4 4 -2 -1 8 10 3 8 3 11 8 15 11 1 5 4 5 6 11 7 2
6489 2 6 14 3 3 12 -4 -7 -1 -1 3 -1 -10 -6 -1 -5 -5 -3 1 2 -7 2 5 0 -2 2 0 8 7 16 3 1 11 3 4 3 6 2 5 11 8 9 0 13 0 0 -5 -7 -11 -3 -6 2 -4 -1 -4 -4
6544 -4 7 -1 0 -2 2 3 -4 1 5 2 1 -1 11 7 4 4 5 3 12 17 9 18 7 -5 6 31 3 12 5 12 9 3 4 8 11 5 -4 -6 -6 -1 -4 0 0 -9 -3 1 -2 8 -2 -4 5 2
6596 2 -10 -2 10 5 -4 5 7 9 8 1 6 7 9 12 8 14 7 5 1 -5 6 4 3 0 1 0 -7 2 -7 -3 -10 -5 -3 -4 -7 -7 -3 -8 -7 5 2 1 0 13 -10 10 7 8 16 9 11 16 14 3
6650 3 18 7 0 6 4 3 11 9 8 -1 6 -6 9 -5 10 -2 -4 4 1 -2 3 -1 -8 -3 -5 0 -10 7 9 5 -11 0 1 1 5 2 2 5 6 1 13 6 12 4 8 7 3 8 6
6699 6 5 4 9 1 14 1 6 7 4 -7 2 -6 -5 -3 3 9 -6 -7 1 0 -4 7 0 10 -1 8 7 9 5 3 4 0 8 14 10 11 7 17 10 3 11 0 4 -3 3 0 -5 -5 0 2 7 -1
6751 -1 -3 10 1 -11 -1 1 -3 4 -1 -3 -7 -1 7 -1 10 10 -3 6 2 13 12 6 1 7 7 9 12 8 -2 5 12 5 0 3 -1 -2 -9 5 9 6 -3 -2 3 -6 -8 -4 -6 -6 -7 2 -2 -5 -1
6804 -1 8 2 -3 4 2 10 8 8 7 11 2 4 1 4 6 9 10 8 13 -2 -1 10 -3 4 -6 0 -1 -4 -9 -8 5 3 -1 0 -8 -1 4 3 1 -6 -7 0 4 5 -6 8 14 13 12 6 -1 12 7
$$ packed form
6437bJ7j2Oj2PKJPmnLNm%j1J3Kj7QnJ3j8QMlJnMnM%oQoJRKpNnQlPmj0MjJJNmn
6489BMQj1%Rj6lO%MmrMNm%KMJrRLnkMkQjRj3kJ0qJjLmLOlJrJ3j3%nkmQlQoLl%
6544dJ1qJkMJpNMljkJ2ml%JkRNqRj1j2J1K5k8RpPloJMLork%NlM%rOMlJ0j0kRl
6596Bj2QJ2nrRKKjpNJKLmOpkmoJ1kjlJjpRrMpNKjl%MnJJ2ljjJ3k3K0lJQpKNkj1
6650CJ5j1pOkjQkjrPj2J5j4J5j2kQllNmpNkNj0J7Kmj6J1J%Ml%LJnJ2pOqMjmNk
6699FjjNqJ3j3NJlj1RqJKOOj5jQjmJ1pJ0j1RjKmkJmQOmJmJ0ppQj1MpOln%NKNq
6751akJ3rj2J0KmPnkmOQqJ1%j3RmJ1jonO%KLmj0PPpnLmjpJ4MlrJNrkMk%jRmlM
6804aRonPkQk%jMrKlLKLJkNj5JJ1j3Pj0OjlnJJ3kmJqPNjkpjPMJj1J4OjjopJ3n
$$ plain form
6857 7 -1 18 15 10 13 8 8 7 13 -1 0 10 5 -12 -1 -5 -2 -3 1 4 -5 1 -13 0 -11 2 6 3 2 -10 4 -3 2 9 6 8 13 -3 19 0 0 11 1 11
6901 11 4 8 16 5 1 2 9 8 6 0 9 4 0 -3 -3 2 -6 -6 -1 -1 -1 -8 -4 -5 -7 0 -1 6 3 4 5 10 0 -2 3 2 7 3 12 -4 16 0 2 3 3 4 1 6 10 0 9 6 -10
6954 -10 6 3 0 0 5 -1 -1 -6 4 6 -6 -1 -8 -5 -3 -1 -5 -2 0 5 13 7 6 7 13 21 6 14 3 7 11 9 15 17 6 2 13 5 6 0 3 1 -7 -8 -8 -2 -4 -6 -5 -8 -1 4 -5
7007 -5 4 -1 -1 5 0 -5 2 4 9 -4 3 10 7 10 4 7 -1 9 9 8 0 -4 -4 6 1 -9 -7 -1 -3 2 6 -4 -9 2 -9 -9 0 -4 -6 -10 -10 -5 -2 6 -6 -8 5 -11 1 1
7057 1 10 -3 5 0 0 -3 7 4 18 -2 6 12 -4 4 10 13 7 3 5 6 1 1 6 3 0 -12 -10 -10 3 1 -2 -7 -5 -6 -3 -5 -6 0 8 3 5 10 0 3 1 5 0 7 7 6 1 2 6
7110 6 7 4 5 1 -5 8 10 -2 13 9 0 -8 -12 -4 -9 -9 -4 -14 -4 6 0 1 -4 1 1 -13 5 6 -4 6 11 17 2 5 -2 11 2 5 12 15 14 5 9 -6 -2 9 9
7157 9 -3 -7 -5 -7 -4 3 2 3 -2 -8 -11 -1 2 -1 6 4 0 -11 -5 -9 -3 2 -4 1 3 5 10 2 4 1 -9 11 3 -1 3 6 9 9 3 2 4 1 2 5 3 -7 -7 7 -8 -2 -5 -11 -4
7210 -4 -9 -9 -3 -11 0 -3 -12 -7 5 3 -3 -2 15 -3 -1 -3 0 -1 10 -1 0 4 3 11 8 9 1 2 1 1 4 11 -7 2 -4 -6 -2 1 -3 3 13 -12 -8 -11 0 -9 -4 -3 -6 -8 0
$$ packed form
6857GqJ9lnLn%jOj4JJ0nj7J1mLjMLrOj4J3j1J3Mljj2J4pNPlKNj6K2j9%J1j0J0
6901A1pMQj1mJPjkoRnml%Nq%N%%pMjkPjPlJJNj0kNjNmRj6K0j6KJ%JlNMj0Rlj6
6954a0J6ll%No%nJ0Kj2NpLKKmLKNQojJOQj5Qj1MMkOKj1mJ1qJoLkqj%OkkJlPNr
7007eRn%OnnPKNj3PPlLoLqJ0%jqm%J0nj0KOkNMj0nJ1j1%Rmkm%NLQj2kJ3j6J2%
7057ARj3Qn%lJ0lJ4k0QOj6QOLomKJn%Nllj2K%J3klnKjLkjOQnKNj0LkMnP%jnJM
7110FJlJmoJ3Kj2J5mrqmQn%Nj0J0J0oJnN%j4J8Jj0J0NOj5LpJ3rLPLjrMj5MJ1%
7157Ij2mKkLPjJnolJ0LlPkmj1OmONoNKKNqKlj0K0qmMLL%ojKlJLkj0%J4j5OloP
7210dn%OqJ1lrNJ2koJJ7j8KkLjJ1j1JMjQlJqJj%LPj8RokMLmOJ0k5MlJ1rNJlkQ
$$ plain form
7261 0 3 0 11 1 3 13 0 14 4 9 13 5 12 20 6 7 16 9 19 5 2 3 2 1 4 -5 -3 -5 8 1 -8 -3 -6 -9 -3 7 -5 -1 1 1 -2 5 4 -12 2 3 2
7308 2 3 0 4 15 -4 8 11 6 2 15 5 10 3 3 3 0 4 -7 3 8 3 6 9 3 -2 -4 -2 7 -1 -7 -7 -5 -9 -5 4 -9 -3 7 -1 0 1 0 -3 4 3 10 8 0 0 2 10 3
7360 3 -4 8 12 0 3 0 -5 5 1 -4 -1 -9 3 3 3 -3 -2 -4 -3 -5 -15 -6 -8 -11 12 3 -6 0 9 7 2 5 6 4 10 2 16 6 12 3 16 10 16 6 8 0 10 3 0 10
7410 10 -1 5 -1 9 -3 1 2 -7 -5 -3 -3 -1 -12 -9 0 -3 -3 -3 -9 4 3 -3 2 13 -3 8 1 4 10 1 10 7 -2 0 1 7 3 -5 -1 6 -7 11 0 3 4 10 0 1
7458 1 -2 -11 -5 5 -8 -8 -9 -5 -3 -7 -8 -6 -9 -3 2 -1 5 -9 -2 -5 0 15 7 2 1 12 11 8 8 5 6 -2 -6 4 2 -15 4 0 -3 -4 -5 -6 -8 -4 8 -8 -5 0 1 0 -5
7509 -5 3 -8 -2 -6 9 -2 -1 0 1 12 12 10 1 6 9 4 -4 8 16 -2 10 2 1 -4 1 -1 10 1 3 -2 -9 6 4 5 0 -7 8 -1 -8 -3 -6 -4 -5 -15 -7 7 -4 1
7557 1 0 5 7 -1 12 7 10 14 8 4 6 4 1 -3 -3 -4 -2 3 11 6 -1 3 6 -4 -5 -9 -12 -11 -1 -3 -11 0 -6 7 5 -6 -2 -1 1 -8 0 8 -1 -5 4 2 10 -1 1 15 16 11 1
7610 1 13 6 15 7 4 1 2 11 -2 0 -4 -5 -5 -6 -9 -2 -15 -10 -14 -14 -5 -3 6 -7 1 -13 8 -4 3 7 -3 1 3 6 17 -2 11 7 -2 2 2 -3 -7 7 1 1 3 -6 -8
$$ packed form
7261@LlJ1j0KJ0j3J4j0NMqPQj4JRpJ0j4lJjjLrKkJ3prNllOJ0j2MK%lPjj6J4Jj
7308BJlMJ1j9J2LnmJ3j0Np%%lMj1J0NnLLonkKRqo%KmMRj3OJ0qJJjlPjPkq%KQp
7360CpJ2Mj2LlnJ0mnLqJ2%%oJkJkj0RklK3rrORknLJkOqJ4j0OrJ3oOj0KqJ0plJ0
7410A0j1OoJ0j2MJrKK%Kj1LRl%%oJ3joNJ1j6J1pLOrRlrKJOmqMPj3J8j1LJOj0J
7458AlrOJ0j3%jMKmjKlONlOj4PlNJ5qnjJ1jl%lJqmJ0kj7J9mljjjkMJ2j6LNJjn
7509eQj1OmJ5j1JJJJ1%krNLnqJ2Qj8J2qjnNkJ1rKnpJ5kJnpJ5rpNlKjj0QJ4j1N
7557AjNKqJ3nLMomKklm%jKNQnpMLj0jmlJJ0kqJ1oJ3kj1MJKrQQrmRkQj1KJ4Jnj0
7610AJ2pRqllJRj3Kmj%jlPj3Nm%RKRj3Qj4K1j2PMj0MKLJ1j9J3mrM%nmJ4o%Krk
$$ plain form
7659 -8 7 0 -10 -6 -2 1 -4 -6 -16 0 -9 -11 8 -8 -9 -4 -8 5 -15 -4 6 -1 -9 -1 0 10 -1 4 4 3 6 10 8 3 8 -1 7 6 5 3 -2 1 -5 1 -3 2 -2 -9 -11
7708 -11 -5 -2 -1 -7 -8 3 -11 -4 4 0 0 -7 3 -9 -3 -1 -9 -1 3 2 15 -4 13 -5 3 -1 5 7 10 -2 1 2 -7 3 -4 2 -7 1 -7 -12 -9 6 -9 -12 0 -6 9
7755 9 -9 2 -2 -6 3 -2 3 0 2 1 5 2 2 6 11 3 17 12 11 13 1 4 16 8 0 6 8 10 -4 -1 3 -10 -7 -8 -7 1 -13 -11 -6 -3 0 -5 -4 -7 4 -4 0 0 -14 -3
7805 -3 -5 -4 3 -6 -6 1 2 16 8 5 13 5 -2 1 -4 3 -7 11 4 -4 5 -9 8 -9 4 -4 1 3 2 2 -5 -2 4 -2 6 -7 -2 -6 -5 -6 -6 2 8 -2 5 7 4 6 5 12 1
7856 1 13 11 9 4 11 9 3 -2 -2 9 5 -3 -9 1 6 -2 -5 -6 -9 -15 -18 -9 -11 -5 -11 -10 -6 -14 2 -7 -3 -7 -6 -2 2 11 13 0 -1 -2 1 3 1 -8 5 1 12 -1 -3 2 -3 1 2
7909 2 -3 -4 -7 -13 -1 -5 -2 -2 -5 -9 6 -1 -2 -5 -1 -9 0 -13 -4 -7 9 2 -1 4 7 4 1 12 2 9 2 4 3 12 -1 -5 5 4 3 -2 -7 1 -9 -3 -7 -15 -9 -8 -10 -15 -10 -8
7961 -8 -5 -10 -4 -7 4 1 0 -3 1 -11 -3 6 -1 7 3 -3 11 2 4 5 8 3 8 4 7 -7 -9 5 -2 -2 -1 1 1 -3 0 1 -12 -12 -12 -5 6 -4 -13 -2 -12 -10 -14 -8 -1 -7 0
8012 0 -10 5 4 2 5 7 13 2 4 5 8 12 0 2 14 8 2 10 5 3 3 -3 -2 -3 -6 -11 -10 -11 -6 -7 -7 -9 -9 -1 5 -12 -9 -1 -17 -11 -5 -4 -4 -18 -1 0 0 7 7 7 6 -2
$$ packed form
7659hJ5pj0MMLnkj0J6rkJ9j6jNmJ3k0J1J0pqQJJ0j1N%jLMknNrQjjknLoOmNmpk
7708a1OLJojJ1j4PQm%pJ0j2OKqQMjJ3j9J7j8QmOKLj2LJrJ0pOrQqnLJ5j5lJ2oJ5
7755Ij8J1mmRnNlKjMl%MNqJ4njKj2LJ2qqOKKj4LMj3LjJQj4KNLLnJlJ1qM%j4J1
7805ckJPr%PJJ4qlQqpLnPj0J8pqRj4J7j7J3qNKj%pLOoQj3NmJj%QOj0PKlKjPj1
7856AJ2kknPkon%J1mqoJ0NqljlolRkOoJMqJ6rMmJMMRKj3jjLKkrJ3mJ1j3kNnMJ
7909BnjloJ2mL%lmJ5pjlMqRj3RlJ6plNLllJ1j0PpKjRj3mJ0jjnnQj0OmqOJknNK
7961hLnOlJ1ljlMj2QRpQmoJ4rKJLnNmLj4kJ4p%JK%mLJj3%%PJ1j0rJ1j0KmOPoP
8012@j0J5jkLKOj1KJLMj2KJ2ooQnk%oJjlnJjNj%k%QOj7LQj6OOJ%j4J7J%P%%jq
$$ plain form
8064 -2 6 -1 -7 1 -2 3 5 10 1 4 5 2 -1 1 8 -3 -10 -4 -14 -9 -5 -13 3 -8 -6 -7 -2 -8 -2 -4 4 -4 -4 -9 -9 1 -2 0 -1 1 -2 11 -4 -3 6 7 2 6 1 -3 6 9 3 -10
8118 -10 -1 -3 -3 8 -3 2 -13 -15 1 -11 -8 -2 -9 3 -10 -1 -1 -2 -2 5 3 4 -3 7 12 5 2 6 10 9 -2 8 12 9 10 4 2 9 11 2 -5 6 -4 -3 1 -8 -17 0
8166 0 -15 -8 -5 -8 -1 -15 2 -1 -3 3 -13 -7 -2 -6 1 -8 9 -5 2 9 5 4 12 11 5
$$ packed form
8064bQpoQlNKNrLJllKPj1pOj0NMqJ6j1KjNoOkQq%n%J0lKjKlJ3j5JRJnMnmRLoj3
8118a0Rk%J1j1Nj5kJ6j2LOpJ2j3R%j%PkJpJ0NplMMjj1J0MlJokPKrpJ1j0JMrrJ7
8166@j5PLlPj4J7lkOj6ONmPrJ7j4PPmjQjo
8191E
$$ Imaginary data points
##PAGE= N=2
##DATA TABLE= (X++(I..I)), XYDATA
$$ plain form
0 0 0 0 0 0 0 0 0 0 0 0 0 0 0 0 0 0 0 0 0 0 0 -8 8 -8 8 -8 8 -8 16 -16 16 -17 24 -24 25 -32 33 -40 41 -48 56 -60
42 -60 65 -73 81 -89 97 -110 121 -134 146 -162 178 -197 218 -240 267 -297 334 -376 425 -486 562
63 562 -662 800 -999 1313 -1892 3296 -14006 -3571 33367 6285 -24201 -13567 16394 13520
77 13520 -4493 -12013 -4998 4972 13822 3461 -17460 -13612 17919 21656 -13700 -27205 8001
90 8001 28537 -715 -26153 -5332 19664 9396 -11037 -9833 1398 6878 6678 -1308 -12833
103 -12833 -5838 15586 13128 -15309 -19193 11938 22632 -6884 -22606 1626 19539 2662 -13770
116 -13770 -4851 6816 4844 612 -2218 -6735 -2157 10919 7329 -12569 -12047 11883 15248 -9679
130 -9679 -16656 6356 15594 -3245 -12683 784 8072 10 -3192 571 -1531 -2331 5246 4803 -7600
$$ packed form
0@%%%%%%%%%%%%%%%%%%%%%qJ6j6J6j6J6j6K4l2L2l3M1m8M9n7O5p3Q1q9J04j16
42f0J25j38J54j70J86k07K31k55K80l08L40l75M15m58N07n64O31p10Q01r11J048
63E62j224J462j799K312l205N188j7302J0435L6938k7082l0486J0634K9961k874
77A3520j8013p520P015R970Q850j0361k0921L848L1531L737l5356j3505L5206
90H001K0536k9252k5438K0821K4996j0268k0433J204J1231N480k00p986j1525
103a2833O995K1424k458k8437l884L1131J0694k9516j5722K4232J7913j6877j6432
116a3770Q919J1667j972m232k830m517M578J3076l590j9898N22K3930L365k4927
130i679o977K3012R238j8839r438J3467P288q062l202L763k102q00P577m43j2403
$$ plain form
145 -7600 -7318 8659 9456 -8217 -10297 7261 10067 -5903 -8512 4936 6273 -4363 -3566 4382
159 4382 802 -4987 1465 5699 -3259 -6469 4213 6570 -4964 -6323 5340 5387 -5790 -4110 6339
174 6339 2625 -7051 -1194 7938 230 -8472 461 8685 -689 -8071 968 6910 -1256 -5030 1983
189 1983 2832 -3256 -616 4971 -1270 -7126 2286 9067 -2605 -10647 1996 11243 -970 -10751 -283
204 -283 8980 1139 -6119 -1161 2781 207 773 1900 -3638 -4664 5558 7893 -6084 -10752 5263
219 5263 12659 -3377 -13101 941 11779 1238 -8985 -2710 4875 2755 -428 -1444 -3860 -1366
233 -1366 7009 4983 -8603 -8716 8515 11854 -6747 -13518 4050 13494 -841 -11400 -1749 7786
247 7786 3316 -3092 -3269 -1841 1559 6069 1413 -9083 -5266 10171 8903 -9548 -11839 7182
$$ packed form
145g600K82J5977P97j7673k080J7558K806j5970k609J3448J337j0636P97P948
159D382l580n789O452M234q958l210J0682K357j1534j359J1663M7j1177J680J0449
174F339l714r676N857R132p708q702Q933Q224r374p382R039N942q166l774P013
189A983Q49o088K640N587o241n856R412O781j1672q042J2643R247j2213r781J0468
204b83R263p841p258M958L942k574N66J127n538j026J0222K335j3977m668J6015
219E263P396j6036r724J4042J0838j0541j0223O275P585k120l183j016k416K494
233a366Q375k026j3586j13J7231L339j8601o771J7568R444j4335j0559R651R535
247G786m470o408j77J428L400M510m656j0496L817J5437j268j8451k291J9021
$$ plain form
261 7182 13073 -4051 -12535 641 10007 2056 -5955 -3459 1162 3311 3764 -1358 -7670 -1636 10270
276 10270 5345 -10877 -8666 9807 11071 -7251 -11813 3991 10701 -829 -7918 -1598 3825 2605
290 2605 650 -2261 -4987 381 8216 2268 -10084 -5273 10240 7782 -8913 -9235 6596 9321
304 9321 -3755 -7798 1245 5147 624 -1585 -1273 -2134 841 5434 603 -7811 -2594 8964 4593
319 4593 -8869 -6183 7615 6764 -5779 -6341 3641 4780 -1857 -2488 663 -304 -236 3075 631 -5267
335 -5267 -1504 6786 2651 -7324 -3547 7119 4048 -6239 -3851 5058 2982 -3917 -1609 2935 -141
350 -141 -2385 1862 2102 -3434 -2142 4498 2225 -5162 -2249 5352 2047 -5169 -1486 4900 743 -4470
366 -4470 293 4221 -1237 -3950 2155 3787 -2762 -3513 3149 3062 -3305 -2401 3283 1377 -3334 -242
$$ packed form
261G182N891j7124q484J3176R366p951q011K496M621K149M53n122o312O034J1906
276A0270m925j6222K211J8473J264j8322m562J5804O710j1530p089O320N423j220
290B605j955k911k726N368P835n948j2352M811J5513k458j6695l22J5831K725
304I321j3076m043R043L902m523k209L12q61K975M593m831q414N217J1558m371
319D593j3462K686J3798q51j2543n62R982J139o637o31L151r67O8L311k444n898
335e267L763Q290m135r975L777J0666l071j0287K388Q909k076o899K308M544l076
350a41k244M247K40n536J292O640k273p387K913P601l305p216L683O386m157n213
366d470M763L928n458k713O105J632o549p51O662q7o367R04N684j906m711L092
$$ plain form
382 -242 3376 -1108 -3720 2217 4060 -3151 -4597 3601 4938 -3634 -4978 3289 4591 -2643 -3560 2099
398 2099 2166 -1627 -227 1661 -1684 -2023 3495 2871 -4756 -3923 5397 4917 -5318 -5627 4515 5639
414 5639 -3366 -5019 1951 3500 -860 -1452 138 -1061 -191 3476 889 -5421 -2126 6668 3661 -6911
430 -6911 -4987 6293 5883 -4810 -5842 2987 4935 -1117 -3066 -323 520 1024 2294 -873 -4895
445 -4895 -164 6783 1676 -7800 -3425 7656 4808 -6550 -5565 4696 5345 -2549 -4106 586 2023
460 2023 891 702 -1475 -3462 1194 5868 -111 -7498 -1437 8125 3032 -7666 -4296 6228 4769
475 4769 -4246 -4389 2015 3015 -87 -906 -1288 -1700 1784 4207 -1416 -6236 402 7520 1051 -7739
491 -7739 -2368 7064 3365 -5503 -3540 3587 2969 -1567 -1577 -111 -418 1178 2585 -1558 -4612 1157
$$ packed form
382b42L618m484k612N937J843p211j446Q198J337q572j344Q267J302p234r17N659
398B099O7l793J400J888l345l39N518o24p627Q33R320m80j0235l09J0142J124
414E639r005j653O970J549m360n92J590j199Q70L667k587o310L295Q794l007j0572
430f911J924J1280m10j0693j032Q829J948o052j949K743Q43N04J270l167m022
445d895M731O947n107r476M375J1081k848j1358R85J0261O49p894j557M692J437
460B023j132j89k177j987M656M674n979p387O061R562n093j0698L370J0524j459
475D769r015j43O404J000l102q19l82m12L484K423n623m820O638P118o469q790
491g739N371R432l699q868J963P127o18m536j0J466l07J596J407m143l054N769
$$ plain form
507 1157 6066 -399 -6872 -654 6755 1483 -5976 -1988 4575 1875 -2945 -1138 1394 -69 -38 1686
523 1686 -723 -3203 1076 4592 -834 -5409 454 5765 77 -5444 -440 4653 479 -3585 -192
538 -192 2322 -558 -1253 1430 309 -2527 196 3385 -512 -4064 556 4329 -554 -4236 610 3883
554 3883 -739 -3229 1137 2590 -1591 -1854 2198 1307 -2704 -798 3124 409 -3306 -37 3271 -387
570 -387 -3083 867 2722 -1491 -2366 2100 1995 -2756 -1753 3243 1567 -3537 -1402 3585 1229 -3320
586 -3320 -880 2865 391 -2233 383 1649 -1302 -1144 2325 877 -3288 -853 4002 990 -4407
601 -4407 -1286 4357 1481 -3932 -1516 3134 1206 -2138 -500 1138 -541 -294 1833 -152 -3101
616 -3101 293 4245 -2 -4928 -477 5179 1070 -4803 -1483 3945 1561 -2751 -1224 1368 312
$$ packed form
507A157M909o465o473O218P409n272p459L988O563k700m820J807K532j463L1J724
523A686k409k480M279L516n426m575N863N311n688n521N004N093m174m064L393
538a92K514k880o95K683j121k836K723L189l897l552M620L773m883l682M846L273
554C883m622k490M366J453m181k63M052q91m011J906L922k715l715L269L308l658
570c87k696L950J855m213q75M466j05m751J003M996j676n104K135M987k356m549
586c320K440L745k474k624K616J266k951J58L469j448m165K435M855l012n397
601d407L121N643k876n413K416M650j928l344J638J638j679K47K127j985k949
616c101L394L952m247m926M451N656m109n873L320N428k384m312J527K592j056
$$ plain form
631 312 -157 909 -823 -2435 1205 3798 -1180 -4933 650 5511 99 -5486 -844 4834 1410 -3608
647 -3608 -1467 2144 1078 -536 -44 -740 -1280 1648 2800 -1915 -4146 1661 5102 -1023 -5515 134
663 134 5181 586 -4335 -1110 2934 1058 -1415 -564 -150 -484 1319 1781 -2064 -3140 2227 4274
679 4274 -1904 -4961 1271 5120 -458 -4608 -158 3665 560 -2245 -444 756 -104 644 1034 -1714
695 -1714 -2169 2273 3220 -2373 -4043 1998 4438 -1456 -4358 792 3736 -314 -2707 128 1457 -276
711 -276 -149 789 -944 -1511 1749 2337 -2135 -3029 2170 3473 -1930 -3556 1535 3242 -1191 -2619 932
728 932 1686 -917 -708 1103 -247 -1488 1048 1939 -1594 -2360 1903 2669 -1945 -2701 1910 2529 -1749
745 -1749 -2067 1665 1486 -1647 -780 1714 86 -1869 501 2009 -1021 -2162 1289 2123 -1535 -2045
$$ packed form
631C12m69J066j732j612L640K593m978l753N583M861n412n585M642N678l424n018
647c608K141L611j066j614M92o96n40K928J152m715k231N807L441o125m492N649
663A34N047m595m921L225M044j876k473Q51M14l34J803M62l845j076N367K047
679D274o178l057O232L849n578m150M450L823l105k805J801J200q60P48L90k748
695a714m55M442R47n593j670O041K440n894k902N150K944m050k393K835J329j733
711b76J27R38j733n67L260N88m472q94N199J303n403j626N091J707m433j428L551
728I32P54k603K09J811j350j241K536Q91l533p66M263P66m614p56M611O19m278
745a749l18L732j79l133Q67K494j628j955K370J508l030j141L451Q34l658n10
$$ plain form
761 -2045 1638 1736 -1778 -1337 1899 868 -2053 -385 2248 1 -2343 373 2438 -552 -2308 796
777 796 2123 -921 -1702 1156 1236 -1395 -682 1750 163 -2138 222 2482 -547 -2796 626 2859
793 2859 -685 -2816 596 2438 -607 -1911 649 1169 -871 -393 1277 -306 -1757 871 2338 -1168
809 -1168 -2791 1277 3132 -1111 -3147 854 2880 -554 -2293 379 1456 -417 -532 655 -405
824 -405 -1167 1153 1762 -1652 -2419 1801 2912 -1684 -3189 1340 3118 -883 -2664 497 1917 -254
840 -254 -916 294 -132 -590 1112 1132 -1839 -1810 2226 2434 -2284 -2915 2007 3078 -1533 -2883 981 2302
858 2302 -527 -1401 265 349 -295 765 641 -1647 -1134 2289 1778 -2533 -2300 2464 2654 -2076 -2672 1536
876 1536 2332 -992 -1687 539 757 -366 208 378 -1222 -710 1936 1128 -2428 -1638 2561 2011 -2407
$$ packed form
761b045L683R8l514M41L236j031k921J668K633k247k344K716K065k990j756L104
777G96J327l044p81K858Q0k631P13K432j587k301K360K260l029k249L422K233
793B859l544k131L412J842l045j304K560N20k040M78J670j583j451K628J467l506
809a168j623M068J855m243k036M001K026l434j739K672J077j873j15J187j060
824d05p62K320O09l414p67M220J111m596j505M529J778m001j781L161J420k171
840b54o62J210m26m58J702K0k971K9M036K08m718o31M922J071m611j350L864J321
858B302k829q74J666Q4o44J060j24k288N13L423n11m311K33M764J90m730n96M208
876A536P96l324o95K226K18j123N74J70j600N12K646q08l556P90M199n50m418
$$ plain form
893 -2407 -2191 2037 2099 -1517 -1648 1057 1026 -661 -141 531 -714 -544 1538 780 -2107 -1093 2449 1396
911 1396 -2500 -1619 2268 1570 -1947 -1382 1479 863 -1151 -282 844 -442 -748 1112 753 -1668 -855
928 -855 2043 1011 -2174 -1063 2172 1067 -1957 -864 1732 573 -1425 -107 1219 -381 -1035 875
944 875 944 -1311 -907 1608 843 -1802 -792 1837 631 -1800 -413 1680 102 -1544 262 1426
960 1426 -636 -1313 982 1212 -1249 -1102 1429 953 -1500 -741 1515 464 -1483 -119 1433 -294
976 -294 -1394 666 1368 -1018 -1384 1262 1366 -1412 -1303 1430 1166 -1359 -906 1267 554 -1104 -65
993 -65 1056 -411 -1019 907 1084 -1304 -1199 1576 1310 -1702 -1369 1630 1310 -1479 -1148 1204 761 -972
1011 -972 -297 745 -337 -668 930 694 -1449 -827 1852 1041 -2011 -1190 2018 1316 -1756 -1199 1454
$$ packed form
893b407K16M228O2l616j31K705l1j687N20O72j245J70K082p58k887J014L542j053
911A396l896Q81L887o98l517N65K861o16k014Q69J126j286l06J860l59k421Q13
928h55K898j032l185J111L235j105l024J093K596j159j998J318J326j600o54J910
944H75O9k255M04K515p65k645J010K629j206k431J387K093j578j646J806J164
960A426k062o77K295K30k461J47K531m76k453P59K256j051j947J364J552j727
976b94j100K060P02k386l66K646J04k778J09K733k64k525M53K173p13j658J039
993f5J121j467o08J926J77k388J05K775k66l012L33K999l20k789L31K352m43j733
1011i72O75J042j082l31J598k36k143O22K679q11l052Q21L208p02l072N57K653
$$ plain form
1028 1454 971 -1019 -494 693 -81 -457 749 374 -1380 -461 1837 606 -2176 -886 2185 1039
1044 1039 -2070 -1145 1683 995 -1266 -710 786 202 -413 417 196 -1058 -134 1666 258 -2059 -440
1061 -440 2286 688 -2209 -848 1967 873 -1548 -720 1053 349 -596 157 220 -780 -37 1348 -28
1078 -28 -1873 -96 2148 263 -2253 -457 2089 542 -1774 -495 1325 293 -844 79 421 -566
1094 -566 -100 1061 -63 -1531 86 1862 -31 -2038 -96 2003 188 -1824 -216 1462 97
1109 97 -1052 128 654 -454 -279 862 46 -1226 112 1567 -143 -1736 132 1792 -103 -1695
1125 -1695 96 1440 -191 -1162 333 783 -605 -493 848 184 -1154 -30 1339 -131 -1498 185
1141 185 1521 -262 -1453 346 1297 -437 -1049 617 833 -767 -554 979 358 -1125 -165 1273 30
$$ packed form
1028A454m83j990N25J187p74l76J206l75j754R19K298j231k782J290L071j146
1044A039l109R25K828o88k261N56J496n84o15Q30k21j254R24J800j408k317J619
1061d40K726j598k897J361K815j094k421Q28J773p04r45P53O3j000P43J385j376
1078b8j845J777K244j885k516J796K546j547k316J279J820j032j137R23L42r87
1094e66M66J161j124j468J617J776j893k007J942K099j815k012J608J678j365
1109I7j149J180N26j108J75J141q16j272J338J455j710j593J868J660j895j592
1125a695J791J344j631r71J495M50j388J12J341o64j338J124J369j470j367J683
1141A85J336j783j191J799R51j734o12J666K16j600K13J533o21j483R60J438j243
$$ plain form
1158 30 -1306 99 1275 -254 -1208 376 1009 -579 -865 731 641 -984 -526 1105 342 -1277 -263
1175 -263 1298 133 -1291 -23 1183 -125 -1002 331 836 -538 -601 817 453 -1059 -308 1290 238
1192 238 -1419 -189 1450 150 -1400 -110 1213 -33 -993 169 690 -463 -454 722 205 -1045 -96
1209 -96 1300 15 -1508 -21 1569 62 -1517 -84 1332 54 -1046 47 713 -253 -383 522
1225 522 81 -863 113 1163 -213 -1445 203 1580 -145 -1604 59 1455 -11 -1187 36 838
1241 838 -155 -428 383 84 -673 217 1014 -386 -1297 432 1499 -400 -1596 290 1499 -211 -1319
1258 -1319 119 948 -186 -573 283 160 -524 180 792 -437 -1072 575 1315 -568 -1434 530 1469 -393
1276 -393 -1300 308 1066 -241 -692 298 316 -422 59 603 -377 -864 549 1062 -686 -1262 632 1270 -607
$$ packed form
1158C0j336J405J176j529r54J584O33j588k86J596r0j625M58J631p63j619J014
1175b63J561j165j424J268J206j308q77J333N05j374o3J418l64j512P51J598j052
1192B38j657J230J639j300j550J290J323j246r60J162N21j153RJ176n17j250R49
1209i6J396j285j523J487J590j507j579J433J416j278j100J093O66r66j30R05
1225E22m41r44R76J050j376j232J648J377j725j459J663J396j466j176J223Q02
1241H38r93k73Q11k99p57Q90P97j400r11J729J067j899j196J886J209j710j108
1258a319J438Q29j134l87Q56j23o84P04O12j229o35J647P40j883q66J964R39j862
1276c93r07J608P58j307m51R90J8p38M81N44r80m87J413N13j748n76J894O38j877
$$ plain form
1295 -607 -1252 470 1024 -440 -750 407 391 -472 -47 592 -258 -740 513 920 -637 -1025 720 1109
1313 1109 -685 -1057 657 936 -593 -709 574 425 -580 -145 607 -159 -722 377 795 -567 -887
1330 -887 653 892 -705 -870 702 750 -693 -587 663 367 -668 -126 705 -101 -736 300 784 -457
1348 -457 -800 577 770 -637 -714 657 571 -696 -415 725 216 -765 -18 801 -160 -836 311 839 -425
1367 -425 -819 510 751 -545 -636 591 463 -646 -288 685 70 -757 100 809 -273 -886 372 880
1385 880 -461 -897 454 775 -490 -648 484 439 -521 -219 576 -27 -640 243 765 -392 -826 500
1403 500 914 -522 -893 523 833 -483 -678 449 455 -445 -229 450 -80 -555 288 622 -530 -781 595
1422 595 822 -668 -892 629 832 -574 -741 486 537 -406 -268 399 4 -413 294 511 -508 -595 685
$$ packed form
1295f07o45J722N54j464l10J157j6q63M25O39q50m82J253M07j557l88J745L89
1313A109j794l72J714K79j529j16J283j49j005M35P52p66n63J099M18j362l20
1330h87J540K39j597j65J572M8j443J06J250k96j035N42Q31q06o35J036M84j241
1348d57l43J377J93j407p7J371q6j267K81J140n09r81P47Q19r61o76J147N28j264
1367d25l94J329K41j296r1J227j28j109L58R73o15q27Q57P09j082o13J258N08
1385H80j341m36J351L21j265j58J132m5r60L02P95o03o13Q83N22j157m34J326
1403E00M14j436l71J416L10j316j95J127Or00K16O79n30m75Q43L34j152k51J376
1422E95K27j490k24J521K03j406j67J227N1r43J38O67l95m17P07K17j019q7J280
$$ plain form
1441 685 728 -735 -790 736 796 -662 -745 549 574 -464 -363 347 56 -359 208 383 -485 -478 666 555
1461 555 -794 -656 814 691 -765 -667 663 557 -555 -376 440 128 -362 139 339 -419 -377 623 419
1480 419 -788 -504 856 546 -841 -544 756 495 -652 -344 523 166 -405 80 355 -313 -330 541 353
1499 353 -704 -391 793 404 -826 -438 749 363 -698 -291 567 118 -489 44 385 -271 -348 452 321
1518 321 -623 -319 725 328 -755 -299 760 272 -678 -144 633 61 -527 116 450 -266 -389 425 331
1537 331 -577 -325 639 256 -714 -252 675 144 -671 -82 564 -64 -549 173 455 -326 -409 449 373 -522 -320
1558 -320 603 295 -596 -210 614 139 -566 -5 525 -117 -476 260 435 -384 -407 483 371 -577 -357 585
1578 585 283 -605 -244 546 112 -518 -9 448 -159 -410 296 378 -452 -354 548 353 -615 -332 633 306 -609
$$ packed form
1441F85M3j463n5J526O0j458q3J294K5j038J01P10k91m15N67J75q68PJ144j11
1461E55j349J38J470j23j456R8J330j06j112J79Q16l12m90N01K00p58M2J000k04
1480D19j207K84J360l10j387K97J300k61j147L08Q67l57n71M85K75o68j7Q71j88
1499C53j057L13J184l89j230L88J187l86j061M07Q58m49o07N33L41o56p7Q00j31
1518C21r44L04J044l97j083M56J059m88r50N34P77n72n88O43L34p16j23Q14r4
1537C31r08K52R64l83r70M62R27n31q15N89O46o28m85P22K82p81q3Q58p6q95K02
1558c20R23l08q91L86Q24m75p05N61N30o42l59P36J75q19k3Q90j12r48K20R42
1578E85l02q88L61P90m34o30N09M57o07k51P06Q2q30R8R02j95r68K83R65l27r15
$$ plain form
1599 -609 -239 551 156 -461 -26 390 -129 -327 291 296 -459 -279 589 288 -641 -286 679 295 -637 -260 555
1620 555 177 -462 -66 364 -96 -278 246 215 -430 -209 563 189 -674 -225 703 210 -710 -226 607 174
1640 174 -496 -76 376 -45 -260 230 194 -365 -117 550 116 -641 -96 739 152 -695 -131 649 139 -535
1660 -535 -69 412 -30 -295 156 154 -334 -101 454 37 -610 -65 654 56 -688 -72 640 62 -566 -34 448
1681 448 -23 -304 148 218 -251 -85 417 49 -508 28 618 4 -631 15 632 -27 -573 33 461 -88
1701 -88 -348 147 211 -269 -136 363 30 -472 22 537 -74 -579 80 582 -71 -529 114 439 -139 -340 202
1722 202 231 -278 -141 347 47 -424 17 484 -58 -519 80 504 -116 -472 145 409 -173 -319 235 221 -306
1743 -306 -147 360 54 -424 8 454 -51 -485 87 449 -144 -420 163 332 -231 -285 272 175 -351 -124 397
$$ packed form
1599f09L70P90l95o17M35M16n19j98O18Np55J80Q68l01r29L55R65l84r32L77Q15
1620E55l78o39L96M30m60j82N24l1o45K21P72l74q63M49R28m93r20M84Q33m33
1640A74o70M20M52m21k15M90l6n59K48O67m34p57N45Q35n87q47N64P80n10o74
1660e35M66M81m42k65M51km88K33N55m17o47N45P19n98p44O16P12n78o28N32M82
1681D48m71k81M52P0m69J66N02l68n57N36N90o14o35O46O17o59n46O06M28n49
1701h8k60M95O4m80J33M99l33n02M94N15o11n05O59N02o53m58O43L25n78k01N42
1722B02K9n09J37M88l00m71M41M67n42m61N99M24o20l56O17K64n82j46N54j4n27
1743c06J59N07l06m78M32M46n05m34N72L62n93k76N83J69n63n4N57r7n26K27N21
$$ plain form
1764 397 41 -444 13 475 -45 -457 93 447 -103 -361 172 308 -204 -209 286 146 -333 -63 419 24 -458
1785 -458 13 475 -62 -471 59 411 -107 -364 116 258 -203 -187 239 66 -336 -25 386 -36 -453 70
1805 70 488 -78 -459 110 444 -87 -342 144 272 -161 -146 234 63 -291 32 371 -88 -437 112 460 -141
1826 -141 -483 116 427 -138 -382 109 267 -165 -167 185 43 -259 40 312 -122 -395 151 435 -165 -449 172
1847 172 435 -156 -371 153 293 -150 -180 179 67 -217 34 277 -126 -335 183 396 -208 -418 210 396
1867 396 -201 -371 176 287 -181 -201 175 80 -217 15 254 -136 -320 183 327 -239 -370 236 361 -241 -348
1888 -348 212 260 -202 -189 206 94 -208 17 240 -101 -247 182 298 -206 -314 251 330 -237 -296 240 249 -228
1910 -228 -172 211 75 -226 -11 211 -106 -265 136 257 -226 -292 226 259 -270 -252 250 207 -239 -149 253 72
$$ packed form
1764C97l56m85M57M62n20m12N50L54n50k58N33J36n12nM95j40m79K70M82l95m82
1785d58M71M62n37m09N30L52n18k57M80J42m61J6M26j73m02L11M11m22m17N23
1805G0M18n66l81N69L34n31k55M86J28m33J5L80j71l54L23L39m59l49N49L48o01
1826a41l42N99L11n65k44M91J58m32kL52j42l02K99K72m34k73N46K84o00k84O21
1847A72K63n91k15N24J40m43l0L59j12k84K51K43m03k09N18K13o04k10O28J86
1867C96n97j70N47J11m68k0L76r5k97K32K39l90j84N03J44n66j31O06J25o02j07
1888c48N60M8m62J3L95j12l02K25K23l41j46M29J16n04j08N65P9n67n9N36Rm77
1910b28N6L83j36l01K15K22l17j59M01J21m83o6N18L3n29J8N02m3m46R0M02j81
$$ plain form
1932 72 -226 23 252 -83 -237 160 267 -192 -251 230 262 -225 -219 242 176 -237 -118 226 39 -259 6 234
1954 234 -102 -266 131 245 -197 -263 197 220 -231 -206 215 150 -221 -87 218 10 -221 52 252 -110 -248
1975 -248 164 261 -186 -247 201 222 -210 -189 205 129 -213 -69 201 -11 -211 89 233 -139 -243 175 244 -211
1997 -211 -257 210 215 -223 -199 191 129 -203 -83 163 -10 -182 77 186 -162 -218 191 217 -224 -226 227 223 -214 -174
2021 -174 212 144 -179 -64 169 6 -156 96 173 -157 -176 215 203 -240 -207 249 195 -250 -187 207 116 -200 -73
2044 -73 147 -23 -160 65 132 -172 -161 211 147 -254 -162 266 181 -245 -140 241 141 -192 -68 190 14 -123
2066 -123 86 141 -125 -131 197 127 -234 -140 256 131 -268 -147 234 87 -221 -71 166 -8 -167 41 123 -132
2088 -132 -127 177 114 -231 -112 243 105 -246 -97 253 86 -212 -39 188 -9 -145 60 133 -122 -105 172 103
$$ packed form
1932G2k98K49K29l35j54L97J07m59n9M81L2m87OM61o6m13J19L44j87k98K65K28
1954B34l36j64L97J14m42o6M60K3m51K5M21o5l71J34L05k08k31K73K00l62j38
1975b48M12R7m47o1M48K1m32K1L94p6l42J44K70k12k00L00J44l72j04M18O9m55
1997b11m6M67Nm38K4L90o2l32J20K46j73j72K59J09l48n6M09K6m41kM53mm37M0
2021a74L86o8l23J15K33j63j62K52P7l30j9L91j2m43L3M56n4m45O3L94r1l16J27
2044g3K20j70j37K25O7l04J1L72o4m01R2M28q5m26J05L81j00l33J24K58j76j37
2066a23K09N5k66oL28p0l61R4L96j25l99J21L81j47l08J50K37j74j59K08Q2k55
2088a32NL04o3l45J19L55j38l51J49L50j67k98J73K27j97j36K05P3k55J7K77o9
$$ plain form
2110 103 -202 -85 237 90 -240 -65 231 56 -215 -31 179 -30 -158 58 120 -119 -110 146 85 -202 -98
2131 -98 210 56 -243 -69 209 26 -215 -7 165 -43 -160 81 127 -122 -105 167 89 -181 -70 220 71
2152 71 -214 -37 209 25 -184 11 157 -60 -152 94 105 -136 -114 152 71 -207 -103 181 37 -225 -59 179
2174 179 -4 -182 4 141 -52 -125 100 99 -127 -86 178 77 -175 -58 212 68 -193 -25 205 26 -162
2195 -162 10 137 -59 -110 94 73 -149 -75 173 45 -209 -63 201 25 -228 -47 174 -2 -167 4 119
2216 119 -66 -106 95 64 -130 -52 174 35 -193 -28 218 32 -196 -13 195 6 -161 18 126 -39 -92
2237 -92 87 57 -121 -41 163 20 -181 -13 198 3 -221 -18 180 -12 -166 21 116 -49 -98 67 49 -122
2259 -122 -30 138 -6 -186 6 189 -11 -195 14 192 -19 -150 39 141 -42 -86 81 62 -93 -5 143
$$ packed form
2110A03l05J17L22j47l30J75K96j75k71J84K10k09j28K16O2k39RK56o1k87J04
2131i8L08j54k99J74K78j83k41K08J72k08j17K41M6k49J7K72p8k70J11K90j49
2152G1k85J77K46j84k09J95J46k17r2K46J1k41K2K66q1k78J04K84j44k62J66K38
2174A79j83j78J86J37j93p3K25jk26M1K64j01k52J17K70j44k61J68K30j79j88
2195a62J72J27j96n1K04k1k22P4K48j28k54J46K64j76k53J81K21j76j65J71J15
2216A19j85m0K01l1j94P8K26j39k28J65K46j86k28J83K08j89j67J79J08j65n3
2237i2J79l0j78Q0K04j43k01J68K11j95k24K03J98j92j54J87R5j65m9J65j8j71
2259a22R2J68j44j80J92J83k00j84K09J78k11j31J89J02j83m4J67j9j55Q8J48
$$ plain form
2280 143 2 -155 17 179 -19 -181 19 162 -40 -165 27 111 -67 -95 59 45 -109 -31 105 -8 -151
2301 -151 4 161 -42 -170 36 165 -32 -133 58 138 -50 -77 99 63 -78 -17 126 1 -130 23 156
2322 156 -43 -157 44 148 -51 -141 48 93 -75 -91 76 47 -103 -19 105 -13 -134 13 148 -27 -139 50
2344 50 126 -49 -117 67 99 -59 -62 93 49 -87 -8 121 1 -133 29 136 -40 -140 43 123 -48 -119 49
2367 49 87 -71 -58 94 14 -107 -14 101 -18 -132 27 130 -54 -144 36 115 -62 -114 58 77 -73 -65 85 20
2391 20 -95 17 106 -23 -116 47 136 -29 -117 58 133 -47 -95 58 84 -61 -39 69 23 -92 14 93 -39 -124
2415 -124 34 114 -71 -137 45 107 -63 -113 40 68 -71 -32 73 20 -77 17 104 -42 -88 71 125 -53 -102 81
2439 81 118 -59 -86 79 81 -58 -46 62 7 -76 9 87 -44 -102 43 95 -83 -114 59 90 -82 -92 56 55 -67 -47
$$ packed form
2280A43j41j57J72J62j98j62K00J43k02j25J92Q4j78k8J54j4j54P8J36j13j43
2301a51J55J57k03j28K06J29j97j01J91Q0j88k7J76l6j41O1J43j25j31J53J33
2322A56j99j14K01J04j99r0J89M5j68j6J67k9j50Q4J24j18j21J47J35j75j12J89
2344E0P6j75o8J84L2j58lJ55m4j36P9J29j20j34J62J07j76j00J83Q0j71p1J68
2367D9L8j58J3J52q0j21R3J15j19j14J59J03j84r0J80P9j77n2J72J9j50QJ50o5
2391B0j15J12Q9j29r3J63Q9j65q8J75P5j80m8J53K6j45K2J08m6j15J06P9j32q5
2415a24J58Q0j85o6J82O2j70n0J53K8j39L9J05n3r7R4Q7j46m6J59N4j78m9J83
2439H1L7j77k7J65Kj39J2J08n5q3Q5P8j31n8J45N2j78l1J73L1j72j0J48jj22K0
$$ plain form
2465 -47 59 6 -70 17 74 -38 -72 71 103 -64 -84 85 101 -65 -64 82 62 -61 -31 65 13 -66 19 73 -32 -83
2491 -83 64 78 -81 -81 80 83 -84 -72 78 53 -73 -30 63 5 -68 11 64 -38 -75 56 61 -75 -67 71 81 -63 -50
2518 -50 85 57 -63 -19 83 18 -55 34 87 -27 -56 64 78 -59 -57 81 55 -77 -55 71 33 -70 -31 52 -5 -73
2544 -73 13 35 -53 -64 47 54 -57 -70 79 43 -73 -48 79 35 -65 -7 67 14 -46 46 66 -30 -47 66 64 -57 -55 67
2572 67 53 -81 -59 59 14 -77 -23 33 -18 -69 4 44 -60 -65 50 51 -77 -62 61 31 -77 -50 67 31 -62 3 53
2599 53 6 -47 39 58 -40 -35 70 54 -61 -32 80 58 -64 -25 69 29 -69 -18 51 -14 -51 15 36 -53 -47 58 35 -72
2627 -72 -48 67 31 -82 -38 55 16 -59 -14 40 -6 -33 32 42 -49 -33 61 38 -56 -26 74 35 -67 -23 81 33 -51 3
2655 3 57 -5 -30 31 30 -50 -25 52 14 -73 -43 58 9 -90 -42 51 0 -74 -4 37 -24 -33 31 32 -41 -30 51 24 -57 -16 77 22
$$ packed form
2465d7J06n3p6Q7N7j12l4J43L2j67k0J69J6j66JJ46k0j23L0R6n2p9Q5N4j05n1
2491h3J47J4j59%J61Lj67J2J50k5j26M3R3n8p3P9N3j02l7J31Nj36QJ38J0j44J3
2518e0J35k8j20M4J02o5p3Q9N3j14k9J20J4j37KJ38k6j32K2J26l8j03L9Q3n7o8
2544g3Q6K2q8j1J11Pj11j3J49l6j16K5J27m4j00N8P4n3o0R2K0r6j7J13kj21KJ22
2572F7j4j34K2J18m5r1N4N6n1n1P3M0j04nJ15Jj28J5J23l0j08K7J17l6r3O5N0
2599E3m7n3Q6J9r8NJ05j6j15K9J12k2j22L9R4m0r8N1O9o5l7O6K1q9OJ05k3j07
2627g2K4J15l6j13M4R3l9p5M5N4m6k7O5J0r1J6R4k3r4L0J00l9j02M4J04m8q4N4
2655CN4o2k5O1jq0K5P7l8q7L0J01m9r9M8R3n1p4P0M1o1rO4Jp3J1Q1k7q1M1R3n5
$$ plain form
2687 22 -58 1 75 11 -48 17 55 -4 -34 28 33 -33 -25 41 11 -67 -20 50 0 -74 -10 45 -14 -65 -2 42 -24 -37 11 24 -41
2718 -41 -13 50 14 -61 -4 68 15 -60 5 59 5 -44 10 43 -10 -28 33 33 -27 -11 51 16 -55 -8 51 4 -69 -2 46 -14 -61
2749 -61 -6 33 -26 -44 11 9 -41 -26 37 -6 -63 -9 62 0 -58 0 60 8 -41 11 37 -18 -10 36 26 -34 2 38 10 -47 8
2780 8 60 3 -45 -4 45 -22 -49 9 25 -39 -36 18 2 -49 -16 24 -13 -65 -12 39 -21 -61 -8 45 -17 -39 19 40 -14 -5 34 27
2812 27 -14 3 56 4 -29 14 53 4 -41 16 47 -9 -47 8 25 -22 -25 17 -2 -37 -6 29 -11 -54 4 41 -13 -49 10 32 -18
2843 -18 -35 11 32 -15 -13 23 12 -16 1 45 -1 -36 24 49 -9 -27 25 44 -13 -28 18 24 -9 -18 23 4 -30 -3 27 -12 -51 8
2875 8 33 -22 -36 5 20 -23 -41 8 18 -14 -13 27 -5 -14 15 28 -9 -21 19 46 0 -23 16 41 -4 -23 24 31 -8 -4 29 7 -18
2908 -18 12 26 -4 -35 9 23 -30 -38 8 19 -34 -40 11 18 -31 -20 6 -5 -20 8 22 -6 -13 12 37 -1 -9 35 33 -1 -10 39 34 0
$$ packed form
2687B2q0N9P4o4n9O5L8n9l0O2No6QO6l0p8M7P0n0p4O4N5n9n1O3M4o6j3M8J3o5
2718d1K8O3l6p5N7P2n3p5O5N4n4m9N4L3n3j8O1%o0J6O2l5p1M7N9m7p3O7M8o0m7
2749f1N5L9n9j8N5kn0J5O3m3n7N4P1o2n8N8O0n2m9N2K6n5QM6j0o0L6L6k8n7N5
2780HN2n7m8M1M9o7k7N8J6o4LN4j6n1L3M0l7n2N3N1o0m0N3N3o2k2N8K1n4RL9p
2812B7m1J7N3n2l3M3L9m9m5N7L1n6l8N5J7m7lM2j9l5L1L5m0m3N8L7n4l6N9K2n0
2843a8j7M6K1m7KL6j1k8J7M4m6l5O0K5n8j8N2J9n7j5M6Ol3rM1j9l4K7L0l9l9N9
2875HK5n5j4M1J5m3j8M9J0l2JM0l2rK9J3l7j2M0K7m6k3L9K5m5j9M7Pl9ML3k2k5
2908a8L0J4l0l1M4J4n3qM6J1n3oN1Pm9J1K6j1j5K8J4k8pK5K5l8qM4kl4rM9nl4
$$ plain form
2942 0 -5 26 20 -12 23 20 -12 -24 19 20 -26 -29 18 14 -37 -26 4 2 -25 -18 16 2 -33 -2 23 -17 -23 6 23 -16 -12 27 40 -8 -19 33
2978 33 29 -3 2 21 10 -3 16 33 -7 -14 23 31 -16 -26 26 20 -23 -26 12 10 -32 -7 2 -8 -9 7 19 -17 -27 13 20 -32 -21 24 18 -19
3014 -19 -16 33 26 -3 3 21 13 3 22 22 -12 -12 25 24 -8 -20 35 17 -19 -3 28 6 -16 -7 4 -11 -17 11 5 -26 -31 7 9 -39 -16 19
3050 19 2 -25 -8 9 6 -4 0 20 0 0 24 24 -5 -8 17 23 -17 -5 23 13 -16 6 30 10 -13 2 3 -10 -20 -1 -1 -16 -16 8 -4
3085 -4 -25 -27 5 2 -17 -16 12 7 -19 4 9 2 -6 19 18 -10 -2 22 15 -13 9 30 13 -12 -2 22 16 -14 -6 11 0 -14 -6 -1 -23 -11 2 1
3123 1 -26 -17 13 -2 -28 -22 16 -14 -15 -2 4 -5 -6 -2 3 -14 -7 7 8 -12 -2 21 14 -12 4 17 11 2 5 11 0 -6 9 3 -11 1 19 2 -25
3162 -25 -5 5 -9 -21 -6 7 -7 -23 -12 0 -11 -26 -1 1 -11 -13 7 2 -8 0 24 11 -16 -6 15 5 2 12 13 9 5 11 20 -1 4 13
3198 13 -6 -25 -4 13 0 -26 -16 9 -18 -8 -6 -5 -10 -8 -3 -8 -17 -14 8 -3 -15 2 13 12 -4 8 30 10 -1 3 9 -2 4 23 7 0 10
$$ packed form
2942@nL1ol2L5ll2j2M3Jm6lM7mn1J1L0kk7PL4j4l5L1K5m0oK9J7l9ML9J3m8j1N2
2978C3ml2NJ9j1j3J9J7m0pL7Qm7j0N2om3lL8km2K5Rj0jJ6J2l6j0M0Pn2J1M5ol7
3014a9LM9pk9OJ8qj0J9%l4%L7jl2j2N5j8l6J6L1k2k2RJ1j5oK8ol1nL8Km8K3L5
3050A9j7k7J7J7lj0MK0k0%K4%k9lK5Om0J2K8j0k9K2K4k0k3J5Jj3j0J9%j5%K4j2
3085dk1kL2lj9JK8nk6K3NpqK5jk8QK4pk8K2K1j7k5J0K4ol0QJ7j1j4QNk2J2J3j
3123Ak7RL0j5k6OL8l0jJ3OrjMNj7PJ4Jk0J0K3pk6J6J3orLOj1oJ5oj4J2J8j7k7
3162b5K0J0j4j2J5J3j4j6J1J2j1j5K5Kj2kK0nj0QK4j3k7J0K1j0lJ0JmmORk1NR
3198A3j9j9K1J7j3k6J0K5k7J0KJnKNnrLK2j1j2J7J1jj6J2K2k0j1MOj1OJ9j6pJ0
$$ plain form
3235 10 27 3 -4 7 15 -1 -16 -3 -4 -5 -13 1 -1 -14 -6 2 -3 -5 -10 10 -11 -15 -7 4 0 -20 15 14 8 -9 7 14 -6 14 22 8 1 14 17 6
3275 6 -6 2 20 0 -3 11 20 -2 -9 8 -3 -9 -14 2 -3 -12 -8 -2 -12 -19 -12 0 -8 -14 3 0 -12 -18 3 4 2 1 9 5 -2 -1 11 11 1 9 18 6 -10 11
3319 11 23 6 -8 12 2 -1 -1 0 -16 -22 -3 -3 -18 -24 -9 -5 -21 -13 -5 -7 -12 -15 -3 -4 4 -4 9 2 -5 4 9 12 9 10 15 12 -1 11 4 2 -2 13 5 2 -2
3364 -2 0 -2 -2 -10 0 -9 -16 -5 2 -11 -18 -5 -10 -7 1 8 -7 -8 -6 0 -3 -5 0 6 8 -1 8 11 3 -1 20 6 0 11 19 13 4 9 20 -6 -10 7 7 4 -1 3 -8 -5 -13
3413 -13 -5 -1 -10 -19 -5 -9 -17 -14 -17 -9 -21 4 2 -15 0 4 10 -8 -11 6 -2 -3 1 3 6 -3 1 12 9 1 15 12 -2 3 -4 18 -21 -16 -3 -6 -9 -14 -5 -5 -7 -16 -13
3460 -13 -24 -12 -11 -2 -14 -16 -9 -4 -4 0 3 7 1 3 8 4 1 3 14 5 18 17 14 4 -4 11 -1 1 -1 4 -3 -18 -13 2 -14 -18 -4 -14 -7 -19 -9 -8 -21 -12
3504 -12 -1 0 -9 -16 -5 -4 -7 1 17 9 -2 -7 19 5 7 8 12 5 2 18 23 6 13 4 1 -1 -12 0 -2 -1 -7 1 -15 -8 -1 -12 -20 -16 -4 -6 -18 -11 -5 -5 -3 -6
3550 -6 -6 2 2 -3 6 1 1 7 6 10 -1 14 1 1 11 15 10 0 0 9 11 -2 -4 -3 -6 -1 0 -14 -16 -15 2 -13 -18 -14 -9 -15 -21 -9 -2 -9 -3 -7 1 -11 -1 3 6 3 14
$$ packed form
3235A0J7k4pJ1Qj6j5J3jjqJ4kj3QQnknK0k1mQJ1mk0L5joj7J6Pk0K0Qj4pJ3Lj1
3275Fj2QJ8k0lJ4Rk2pJ7j1onJ6nrMOj0pPJ2qoJ7lj2oK1JkjQmpJJ2%j0QRj2j6K1
3319A1J2j7j4K0j0l%Jj6oJ9%j5oJ5Mj6QQknlJ2jQqJ3ppRNLlJNlj3J2pkmJ5qlm
3364bKk%qJ0rpJ1Pj3pJ3nLQPj5jKOlkNOKrRLqmK1j4oJ1QorNJ1k6mJ7%lnMj1Lq
3413a3QMrrJ4mqLlQj2K5kj7J5MOj8lJ7qjMKLrMJ1lqJ4lj4NpK2l9NJ3llnR%krL
3460a3j1J2JRj2kPN%MLMoKNmlKJ1rJ3jlj0qJ5j2KkNpj5NJ5j6mJ4j0Pj2J0Jj3R
3504a2J1JrpJ1JlQJ6qj1nK6j4KJMplJ6Nj7Prlkj1J2kJoQj6PPj1qMJ2kj2PO%Kl
3550f%Q%nRn%OjMj1J5j3%J0Mnj0%RKj3kJlNJj4kJJ7j5nMNooJ2PpOmQj2J0MLlJ1
$$ plain form
3599 14 8 7 3 8 17 14 5 3 13 11 6 7 -4 -2 -6 -4 8 -17 -3 10 -13 -11 -9 0 -2 -19 -16 -9 -11 -16 -6 -11 -8 -6 -5 -2 -6 3 2 2 1 5 10 10 0 15 19 17 6
3648 6 13 9 3 9 4 0 -7 -6 9 0 -5 4 -4 -3 -1 -12 -1 0 -10 -2 -6 -7 3 -8 -9 -7 -3 -6 0 -3 -9 6 -2 -6 8 -6 1 4 11 9 7 13 8 9 7 6 13 6 -4 0 3
3699 3 -1 4 -9 -8 1 -19 -14 -15 -6 -10 -7 -11 -20 2 -4 -12 -12 2 6 4 4 4 -6 15 9 15 15 7 12 8 6 7 5 15 12 3 7 4 2 -8 -5 1 -9 -9 2 -9 -17 -4 -16
3748 -16 -13 -12 1 -13 -10 -6 1 -9 -7 -9 0 -11 -3 2 3 4 -2 0 8 10 7 5 10 1 12 6 11 4 -1 12 2 -5 5 -9 -10 4 0 -3 -15 -14 -2 -3 -13 -12 -8 -5 -9
3795 -9 -8 -4 -5 -2 -13 -11 -2 -5 -2 8 4 2 13 16 1 1 20 1 -1 8 11 8 8 -4 0 -5 9 7 3 0 -1 1 -4 -1 -10 -6 -17 -10 -14 -7 -8 -8 -22 -9 -12 -8 0 -7 -3 -2
3845 -2 4 -2 1 -3 8 6 10 1 11 9 0 5 5 0 0 8 4 11 0 -2 -15 -12 5 -12 0 -10 -5 -1 -6 -13 -9 -5 -5 -4 -11 -4 -3 -13 -4 1 -3 7 4 4 3 8 9 11 5 12 -1
3896 -1 13 7 13 16 8 5 0 0 4 14 6 8 -4 -11 -5 -3 -9 7 -3 -4 -14 -11 4 -13 -11 3 0 -8 0 -8 0 3 5 12 3 4 -4 15 2 -1 5 3 14 7 15 8 8 5 12
3945 12 8 4 -2 -4 -1 -6 -6 -6 -6 0 -6 -12 9 -10 -3 -8 -7 -7 -8 -6 0 5 -3 6 7 3 13 13 0 11 4 3 11 13 5 9 10 15 16 6 9 5 4 3 0 0 -6 -5 8 -15 -10 -10
$$ packed form
3599A4ojmNRlrkJ0knJj1KmKJ2k5J4J3k3KKRkj7LPknJ0nLKJLmRj%jMN%j0J5Mkj1
3648FPmoOnmpJJ5rnRqJKj1J1Jj0QmjJ0j1jKMlOloJ5qmJ4j4PLPkkOnJkjPpj0ML
3699CmNj3JRk0NjRmLmrK2oq%J4Mk%%j0K1oO%qNmkJkJ0lrMlkj0LOj0%J1j1qJ3j2
3748a6LJJ3j4LMPj0KkRj1QNJJoKQKlkNrJ1oNpnJ3j0pJ0j4jJ4mlj2JJ2jj0JMLm
3795iJMjLj1KRlLJ0mkJ1Lj5%J9j9kRLl%j2MnJ4kmljKnLrMj1PmPj%j4J3lMQpMJ
3845bOoLmJ1kMrJ0krN%n%QmPj1kj3LJ7j7J2j0NMnpMM%JpPJj0RNmJ0l%jNJKoPj3
3896aJ4oOLqln%MJ0qKj2pOKoJ6j0jj0LJ5j7KJ4lqQqQLKPrJqJ9j3lOkJ1pQp%lP
3945A2mmokLn%%%OooK1j9PnJ%jKONqRJmJ0%j3J1pjQKqMJNJj0Lmjjl%oJJ3k3N%
$$ plain form
3997 -10 -10 -13 -9 -11 -2 -17 -5 -4 -6 -8 -2 12 7 4 -1 7 11 -5 9 9 19 14 9 13 9 8 2 10 1 0 -1 -2 8 11 3 -11 -6 -8 -8 -16 -12 -4 -4 -12 -11 -6 -6 -11 -19 -5 -8
4048 -8 -3 3 -6 -2 10 5 6 8 -2 6 15 2 4 3 18 5 10 9 14 11 5 12 1 3 -1 15 7 -2 7 5 -5 -4 -10 -8 -16 2 -12 -19 0 -12 -7 6 -8 -3 0 0 -7
4095 -7 8 2 10 3 3 5 7 15 13 9 13 12 9 12 5 4 7 -1 0 2 0 -9 -1 -8 -4 -5 -6 -11 -7 -6 -14 -6 -4 -14 -8 -2 -5 -2 10 1 -1 8 10 11 7 13 8 -5 7 15 4 1 8 9 2
4150 2 8 4 -1 5 -3 -8 -7 -4 -5 -15 -15 -9 -5 -3 -10 -5 -19 -10 -7 -10 -10 -6 -12 -5 -2 -4 3 9 6 3 4 4 11 15 12 8 14 12 19 11 4 9 16 4 0 2 15 2 0 -8 -7 1 -12 2
4204 2 -1 3 -8 -16 -14 -9 -10 -13 -1 4 -4 -1 0 -2 -10 -3 10 10 11 5 14 14 16 13 9 20 19 1 8 3 16 4 3 7 4 1 -2 -2 0 -4 -3 -13 -18 -9 -10 -16 -12 -11 -14 -5 -1 2 -2
4257 -2 -5 -1 -7 -9 3 -7 -3 -1 -3 8 2 11 9 13 1 2 5 7 -5 5 10 9 -1 3 3 -1 -2 -6 -10 -1 -16 -10 -15 -1 -10 -5 1 -4 -7 -3 -1 3 -2 -1 0 -5 -9 -1 5 7 13 6
4309 6 6 2 9 16 2 14 13 12 4 -7 9 7 3 1 8 -3 -11 2 -10 -8 -9 -15 -7 -16 -21 -21 -13 -9 -1 -15 -8 -8 -17 -16 -1 -6 2 3 -6 1 10 9 2 12 4 7 4 10 7 13 6
4360 6 1 7 6 0 -7 -6 -10 -7 -6 -7 -16 -23 -12 -12 -14 -8 -4 -3 3 -1 3 -6 -6 -11 -4 0 4 9 -5 5 8 8 8 12 4 4 10 9 4 6 3 10 4 -7 8 0 9 3 -2 -1 -6 9 -11 -8
$$ packed form
3997a0%lMkRj5J2JkkOJ4nlnQMj6J4%J0nnMmjoQrjjjJ0Lqj4Nk%qMQ%qJN%nqJ4l
4048hNOrMJ2nJKj0QRj3KjJ5j3NjNloPj1KmJ6qrRkj0JoKqJ8j4pJ9j2NJ3j4NL%p
4095gJ5oQp%KKQkmMjlLpjLqJKkrQpMjjnMJqQKj0OOlLJ2rkRKJmOnj3J2Qj1lPJp
4150BOmnOqnJLjj0%OMKpNj4RLl%MoPLkPOllJ%PMlmOkPqpNPj2mKJ3j3kqJQj3J4
4204BlMj1qKNjlJ2NqLJkqPJ3%JoR%KlmJ1jj8PnJ3j2jMlll%KmJj0nRjoMJlRMLm
4257blMokJ2j0MKkJ1oRkMj2JLKj2J0Njj0M%mjmmRj5OnJ4rNOnlMKMnJJnmQOKOp
4309F%mPPj4J2jjqj1J6kmkPj1qJ3j2KjoQrn%QMQj4P%rJJ5nQJrPRjpJ0qLlOlOp
4360FnOjopJmLJjrpJ1%kOMJOmMr%nPMMNj4J0L%%Mq%OjnKlPoj1J5qRonJnJ5k0L
$$ plain form
4414 -8 -12 -2 -6 -2 -10 -6 -8 -1 -7 -11 5 -6 1 0 -3 2 1 4 13 8 16 4 12 4 4 1 -2 -1 0 5 -4 10 -2 -7 2 -8 0 -6 -5 -10 -7 -13 -6 -17 -13 0 -6 -5 -15 -15 -16
4465 -16 -4 -6 -1 6 2 8 2 10 14 3 2 8 7 4 12 18 12 10 10 4 1 12 -8 -1 -3 -5 -13 -6 -6 -16 -18 -12 -10 -13 -4 -4 -15 -7 -16 -7 -11 -3 -1 3 -7 8 5 0 7 11 5 4
4517 4 5 18 -1 8 4 -11 6 -6 9 -11 4 -4 9 -3 -6 -6 -6 -10 -4 -15 -7 -20 -18 -8 -8 -18 -14 -11 -8 -23 -7 -8 -11 -5 -1 1 5 -1 8 6 2 -2 -2 3 4
4562 4 6 15 4 7 11 -5 -1 0 4 5 0 1 -8 6 -8 -9 -8 -9 -7 -20 -6 -15 -7 -11 -12 -1 -2 -14 -4 -9 3 -4 0 -1 8 -4 7 6 13 5 14 9 1 15 6 4 2 8
4610 8 6 9 1 5 -3 3 -2 -9 -13 -10 -12 -4 -9 -8 -9 -6 -3 -12 -11 0 -4 -7 -11 5 -2 -1 3 0 4 6 12 5 -5 5 1 6 9 10 -1 8 15 -2 4 -7 4 -12 -1 -5 -16 -16
4660 -16 -11 -16 -12 -13 -15 -21 -11 -20 -6 -5 -17 -13 -13 2 3 -6 -6 3 -7 4 8 1 -1 6 -4 5 6 4 4 3 6 -1 -4 -3 6 2 2 -10 -6 -11 -3 -17 -5 -11 -10 -13 -5 -17 -6
4709 -6 -6 -7 -8 -6 -15 -1 -2 -13 1 -5 10 -3 6 5 1 7 13 7 -2 6 14 17 9 3 2 2 -9 -1 1 1 -6 -16 -3 -12 -4 -8 -13 -15 -7 -16 -6 -7 -15 -11 -18 -17 0 -10 -9 2
4759 2 -4 6 10 -3 7 8 11 7 13 8 10 3 10 14 6 2 -6 1 -6 3 -14 -2 -12 -15 0 -17 -2 -5 4 -11 -14 -9 -7 -7 -10 -10 -6 -1 -3 -7 -4 2 -2 0 14 -3 1 5 7
$$ packed form
4414hmJ0mMqMkPomJ6j1PjlNjLRnQj2Qq%llJJNrJ4j2nRj0QoJnLoPj1MJ3oJj0%j
4465a6J2kNPmOoQMj1jOjlQOok%olJ1k0PkkqP%j0kOKlR%j1QrRmQKMj0J5lnPMoj
4517DJJ3j9Rmj5J7j2J5k0J5qJ3j2l%%mOj1Qj3KJ0%j0MLLj5J6jlOMKMoRkmm%NJ
4562DKRj1LMj6MJMJnJrJ4j4jJjKj3J4rQmjJ1jj2J0nJ2pMjRj2J1jPqRnqJ4rkkO
4610HkLqMqOnpmLkQnJjLLrJJ1mlmJ6pJMlMKOpj0J0mNLJj1RPj7Oj1J1j6J1mj1%
4660a6NnMjkoJ0rJ4Jj2M%J5Jr%Rj0J1MpkPj0RJk%jLplJRm%j2MnQj4J2oJlQj2J1
4709f%jjKrJ4jj1J4oJ5j3RjmOOorQQLqoj%j1QK%pj0J3rQmnkQrJ0jqMpJJ7j0JJ1
4759BoJ0Mj3J0JLmOnKpPMqmqPpRj7J2j0lJ5j7J5lRj5lNK%l%MNkmLOmKJ4j7MMK
$$ plain form
4808 7 5 14 20 8 13 14 8 1 6 8 -2 -7 3 -5 4 -2 3 -12 -6 -5 -9 -8 -15 -16 -10 -4 -7 -13 -15 -7 -9 -3 -2 -2 -8 -3 5 -3 6 -4 20 2 8 8 14 22 5 10 11 7 4 -2 8
4861 8 0 2 -3 -3 4 -4 4 -12 -6 -8 -10 -8 -3 -4 -7 -14 -17 -7 -7 -6 1 -1 2 9 5 9 -1 11 13 13 20 14 3 17 7 13 8 7 20 9 1 -1 3 15 -5 -5 -9 -3 2 -8
4911 -8 -4 -8 -9 -12 -5 -10 5 -8 -10 -14 -7 -4 -15 7 -2 -6 -1 6 -1 1 1 2 4 8 18 13 4 11 5 11 6 7 -4 2 3 17 4 7 -3 -15 -5 7 1 3 -15 2 -6
4958 -6 -16 -1 -6 -15 -7 -1 -2 -6 7 4 -1 6 2 6 18 12 4 13 5 9 10 10 6 12 10 8 16 7 15 10 -3 6 1 8 -2 12 1 -6 -8 -14 -1 -8 8 -3 -9 -14 -10 0 -12
5007 -12 1 -8 1 5 5 13 10 7 12 27 8 14 15 12 11 13 11 22 12 6 16 13 4 2 5 -3 -3 -9 -12 -2 -7 -10 -1 1 -7 -9 -2 -2 -7 1 -7 0 3 1 1 15 8 9 3 10 8 16
5059 16 13 16 16 14 15 14 12 11 18 3 10 -4 5 0 7 -10 -2 -4 -8 -3 -14 -10 -1 -4 -1 -9 -7 2 1 -1 -5 4 -1 1 -7 -2 7 0 3 6 16 13 11 10 9 16 16 11 12 15 14 4 -1 3
5113 3 3 7 6 -4 -12 -5 -9 -4 -13 -11 -6 -9 1 0 -9 -4 -8 6 9 1 1 0 11 18 8 5 10 18 11 19 21 13 10 14 8 2 12 -2 5 3 9 11 5 3 2 -5 -7 -12 3 -12 -2
5164 -2 -8 -17 0 -14 -2 -13 -8 1 -7 -10 -9 -2 -1 11 8 14 6 9 10 12 21 6 13 17 13 3 23 14 5 5 6 10 -3 -4 3 1 -9 -17 -17 -6 -19 -4 -16 -15 -2 -14
$$ packed form
4808GkROj2NJopNKj0nJ0qRoNj5OJmJpjOOlokQkOJ%oNQqRj0K4j8O%OQj7NJmloJ0
4861HqKn%PqQj6OkkKNjlplJ0%JPkLPmMj0J2K%Poj1J4j0OnjJ3j1qkMJ2k0%mONj0
4911hMmjlPnJ5j3kmPLj1K2rmNPpK%JKMJ0nrPoOnJj1OJJ4j3Lj0j2J0J2oKj8J7q
4958fj0J5nrQOjmJ3lnPmMJ2oqRqMJ%mOkkQrQnj3RnPj0J4j1pkoJ3pJ6j1onMJ0j2
5007a2J3rRM%QllNJ5j9OJljKkJ1j0oJ0lrkLq%olJ0nlRKqkP%nQqPLk%J4pJoPkQ
5059A6lL%kJjkjPj5Pj4RnPj7QkmNj1MRlLqKRjkmRnKqNRpLLJ0lkjjP%nJLjj0nM
5113C%Mjj0qPmNrKNlJ0jrNmJ4Lq%jJ1Pj0lNQpQKqlMooJ0j4PkOKokjpknJ5j5J0
5164borJ7j4J2j1NRqlJPJJ2lOqLJKRj5PMmj0K0rr%JMj3jPkj0q%J1j3J5j2JJ3j2
$$ plain form
5210 -14 -8 -4 3 -4 10 -1 0 -3 6 3 1 1 16 9 13 11 17 15 5 3 6 4 11 15 3 -2 10 -2 3 -4 -3 -9 -11 -12 -9 -9 -5 -2 -17 -10 -7 -2 -11 -5 -10 1 -4 1 1 6 6
5261 6 4 11 10 1 5 13 9 6 11 16 17 16 10 5 12 7 -10 6 -5 -3 0 -2 5 -8 -7 -7 -16 -15 -6 -9 -10 5 -4 -10 -5 -10 -9 1 1 -8 4 4 3 9 -3 -4 -1 12 10 25 10
5312 10 9 9 16 5 8 11 -2 2 7 -8 -4 -2 -2 -7 -3 -16 -10 -2 0 -12 -19 -2 -15 -16 -8 -6 -9 2 -11 1 -4 -13 0 -4 16 12 4 -2 5 5 13 14 10 11 9 4 -4 11
5360 11 6 2 2 0 -1 -3 -1 -17 -9 -6 -9 -12 -8 -7 -16 -7 -9 2 -4 1 -7 -8 -3 9 10 11 1 18 10 8 -3 12 7 9 10 21 18 15 -1 15 9 7 -1 0 5 2 -7 -7 -2 -8
5410 -8 -10 -10 -9 -15 -6 0 -15 -8 -9 -11 0 -4 -4 2 -8 5 -8 9 15 4 -7 10 5 19 21 -3 8 7 3 4 5 8 -1 3 4 -5 -1 -2 0 -9 -2 -15 -10 -10 -12 -17 -9 -12
5458 -12 -18 -6 -5 -17 -7 -6 -8 -6 -1 -7 0 3 10 1 5 5 8 7 9 8 6 6 5 5 6 6 8 -3 -1 -5 -6 -2 5 -10 -6 -12 -7 -8 -12 -16 -16 -15 -20 -11 -2 -11 -4 0 -8 -5 1 1 -4 -1 4
5513 4 4 13 18 10 1 19 12 10 8 15 14 4 8 7 10 4 10 3 -8 3 -16 5 -6 -16 -5 -11 -15 -5 -21 -20 -12 -12 -4 -2 -7 5 -5 6 -4 6 2 10 12 8 11
5558 11 10 16 5 18 13 11 1 12 6 5 -8 11 1 -8 2 -11 -6 -1 -7 1 -4 -7 -7 -3 -7 -11 -12 -12 -2 -1 -13 -5 10 1 -4 6 8 1 9 6 8 15 13 3 8 7
$$ packed form
5210a4OMPpJ4j1JlRlk%J5pMkOkj0kLkPMj2nJ2j2NpJokjL%MLj5PLNrOnJ1nN%N%
5261FkPjrMQmlNNJjonPnj7J6j1KLkPj3J%rJRljJ5roNnJJ0%rJ2%jOj2jLJ3kJ5j5
5312A0j%Pj1LLj3MNj5MK%nMj3OQKj2pJ7j3jQKlJ1j3J2nrJ3mK0mqoP%QJmJknqJ5
5360A1nm%kjkKj6QLllMJrRkJ1oNqjNJ2JJj0J7qkj1J5nKJJ1llj6J6okqJNlr%No
5410hk%JoROj5PjkJ1m%Oj0J3j3J7Oj1j1J7nJ4Kk4J1jmJJLrMJrMjKrPj3N%knQl
5458a2oJ2Jj2J0JkKNoPLPrM%LjKjk%j%J%Kj1KmjMPj5MoNjmm%JnRRrPMqLO%nLN
5513D%RNqrJ8pkkPjj0MjLoOpj1J1j9K1j1j0J1omJ0j6JQ%QKnJ2j0J1j0J0mQKmL
5558A1jOj1J3nkj0J1ojj3J9j0rJ0j3NNoQnl%Mmmj%J0Jj2QJ5rnJ0KpQlKPkj0Nj
$$ plain form
5604 7 14 11 10 11 1 5 6 11 -10 -5 -3 4 -9 -8 -10 -14 -14 -15 -17 -24 -12 -16 -10 -17 -14 -4 -12 4 -13 -12 7 -2 5 15 5 1 9 4 10 4 10 8 11 6 6 11 15 5 -3 5
5654 5 8 -5 -6 4 -7 -15 -14 -12 -11 1 -2 -12 -13 -6 -5 -15 -7 -4 3 -15 7 -1 -2 9 1 4 5 -4 2 14 15 7 6 10 7 5 8 8 11 2 -11 -4 1 -10 -10 -15 -9 -8 -11
5703 -11 -13 -13 -7 -17 -6 -12 -7 -8 -11 -5 -7 -8 0 1 1 -7 7 -2 -3 14 2 13 9 8 14 0 2 18 6 -5 9 6 3 13 5 3 7 -8 -8 0 -13 -12 -5 -16 -12
5748 -12 -7 -18 -14 -16 -7 -18 -10 -7 -5 -9 -5 7 4 8 10 3 13 -1 4 0 10 8 -3 1 6 7 9 4 6 6 -8 0 -8 -1 -9 -12 -8 1 -10 -11 -17 -14 -17 -14 -6 -7 -5 -4 -9 -3 3
5799 3 9 -1 -2 9 8 19 2 10 7 4 11 8 4 5 14 11 7 0 7 -1 10 -2 2 -3 -1 -13 -4 -4 -15 -5 -7 -6 -12 -9 -21 -6 -9 -12 4 3 -13 -3 1 1 8 3 13
5846 13 -1 3 11 7 9 6 10 6 14 8 5 6 3 1 -3 8 5 -2 0 -12 2 -4 -5 0 -6 2 -14 -11 -9 -20 -8 0 0 -13 -16 -4 -2 -1 2 3 -7 2 8 3 5 14 7 9 3 4
5896 4 15 17 3 10 -1 3 5 0 3 -11 -12 -1 -6 -10 -7 -14 -8 -15 -16 -2 -15 -9 -8 -11 -9 -10 0 0 3 -2 0 -1 -1 9 11 -2 4 7 5 8 1 7 4 1 2 12 3 1 -2 -5
5946 -5 -3 1 -1 -16 -8 -8 0 -11 -5 -12 -14 -13 -9 -15 -2 -1 -3 -11 0 -11 -3 -6 -2 0 7 -4 2 8 5 9 11 4 8 0 3 18 1 -1 2 4 4 -2 5 -8 -9 -4 -2 -8 -7 -17 -20
$$ packed form
5604GPljJj0MJNk1NKPj3Jkm%jkpJ2mOpLJ0qJ6j7JJ9rPJ0j0mQnOoOkLn%NMj0qQ
5654ELj3jJ0j1qJKJJ2lj0jPJj0QLPj8K2qjJ1qLJrOJ2JqjMlkL%Lrj3PNj1%nOJl
5703a1k%Oj0J1oNjlOkjQJ%qJ4rjJ7j2J1mjOj4KJ6j2j1J4llJ0qkMj5%Qj3JPj1M
5748a2Nj1MkRj1QLKmMJ2lMKpJ0j4NmJ0kj1MNJKnK%j4QqPqlMRj1joLlLQjKJnOO
5799COj0jJ1jJ1j7QllPlmJRlmpPqJ1j2MnKj2R%j1J0kJoLj2J5llJ6jj6J0M%PnJ0
5846A3j4MQmKlMmQolJlkmJ1lpKj2J4ojNoQj6LKj1J2Q%j3lJ2KJLJj0ROnKRpKoJ
5896DJ1Kj4Pj1MKnLj4jJ1nmLpOpjJ4j3OJlKjJ0%LnKj%J0Kj3OLkLpOllJJ0rkll
5946eKMkj5Q%Qj1OpkJMoJ3JkqJ1j1QlMKPj1OOlMKpMqLJ5j7kLK%oPj3jNKoJj0l
$$ plain form
5997 -20 -8 -9 -15 -3 -11 -16 0 -7 -1 -5 -2 -2 -7 -4 8 5 -4 -1 0 3 8 14 2 10 3 14 4 -1 -7 -8 5 0 -4 -11 -11 0 1 -16 -12 -13 -15 -11 -7 -11 -6 -14 -13 -11 -17 -8
6047 -8 -5 -2 -5 2 -1 -3 4 1 9 6 14 9 -2 8 6 6 9 14 -2 7 4 4 6 -11 -7 -2 -10 -6 -12 -7 -19 -13 -13 -4 -14 -8 -15 -19 -9 -13 2 -11 -8 -6 2 -1 -5 2 -4 -7 7
6098 7 6 8 4 5 3 5 -5 6 10 9 1 -7 1 5 0 -11 -7 -15 -4 -15 -7 -25 -12 -15 -23 -4 -20 -12 -10 -16 -20 -4 -3 -4 -8 -7 -9 0 -2 -3 6 5 4 11 -5 7 13 12 8
6147 8 -5 2 -1 4 -1 0 3 -7 1 -10 -2 -6 -9 -16 -19 2 -10 -1 -10 -11 -9 -23 -10 -20 -8 -9 0 3 -8 -1 7 3 6 14 8 4 6 4 13 8 6 7 6 0 7 -10 -1 7 -7
6196 -7 2 -5 -10 -11 -3 -9 -11 -10 -20 -21 -14 -11 -5 -7 -10 -11 -14 0 -7 -9 0 3 1 -6 -2 1 1 7 3 2 13 7 9 1 13 13 -3 -11 7 2 -8 -5 3 -6 -11 -12 -14 -7 -10 -18 -9 -12 -7 -16
6250 -16 -13 -9 -10 -5 -16 -14 -3 -5 0 -5 -1 -5 5 2 3 11 -1 0 9 7 1 2 3 5 5 10 -5 -1 0 -8 -2 -7 -14 -8 -14 -11 -14 -21 -13 -15 -14 -12 -19 -14 -17 7 0 5 -9 6 4 4
6302 4 5 10 8 0 14 5 8 9 2 14 2 4 -3 3 7 3 2 -3 -4 1 -10 -1 8 -7 -4 -4 -10 -12 -16 -8 -9 -23 2 -14 4 2 -2 -7 -3 -6 4 -5 -1 9 8 2 1 13 10
6351 10 9 8 8 8 9 1 8 7 4 -2 -11 3 -9 4 -5 -10 -4 -12 -5 -6 -2 -11 -12 -12 -17 -18 -6 0 -15 0 -7 -6 2 -6 7 1 -7 0 7 5 4 5 8 13 3 12 -1 9 3 0
$$ packed form
5997b0J2joJ2qnJ6pOmL%nLJ2lrLJLNOj2QpJ1j0nojJ3nmp%J1Jj7MjkMMmNqJKoR
6047hLLlPlkPlQlQnj1J0k%LNj6Rl%Kj7MNqMoNj2O%Rj0OpmJ0mJ5j3LKQlmPolJ4
6098GjKmJkKj0J1MjqqQMnj1MqJ1j1Qj8J3lqJ9j6QKomJ6JjmJkRkjRjjPj6J2Ojm
6147Hj3PlNnJLj0Qj1QmlplK1j2RrjKj4J3j0J2jRLj1PQmLQomKkRnkJjoPj7RQj4
6196gRpnjQokJj0jPLOkljlJ4pkRLkpML%OmjJ1oKqJ2%j6qJ8nj0LQrnjkPlqRlNr
6250a6LMjNj1KJ1kNnMmJ0lJQj2JRkoJJK%Nj5MJqOnpOoLlpQkJKpNlK4pNj4J5k%
6302DJNkqJ4rLJpJ2j2KpOMmjnjNj1RRj5L%okmQjj4K5j6J8kmnMlJ0rMJ0jojJ2l
6351A0jj%%JqPjlorJ4j2J3rnOqPjMrj%njJ2Oj5J5pJQqJ3oqPPkjJLNj0Rj3J0ol
$$ plain form
6401 0 -3 2 -4 -10 -15 -6 -20 -6 -10 -11 -14 -29 -22 -13 -13 -6 -19 -18 -3 -11 -6 -9 2 -9 4 -4 8 7 0 8 5 2 -1 5 8 4 10 5 8 7 1 -7 0 -5 3 1 -6 -11 -7 2 -14
6452 -14 -24 -19 -13 -9 -14 -7 -16 -12 -4 -15 -12 -2 -12 -3 7 -3 2 7 0 3 -2 8 12 9 4 2 6 14 5 0 2 -2 5 2 -4 -7 -5 -1 -11 -4 -11 -7 -14 -20 -14 -29 -13 -20 -20 -11
6502 -11 -15 -8 -5 -7 -18 -2 -4 -15 -11 3 4 4 12 10 1 10 0 8 12 -5 5 2 5 3 -10 -3 -3 -5 5 -12 -15 -6 -19 -21 -22 -21 -7 -11 -17 -9 -12 -12 -7 -13 4 0 -15
6549 -15 1 -13 4 4 3 2 5 9 12 -1 6 11 9 10 11 9 13 9 10 9 3 -10 -13 -1 -4 -15 -8 -1 -4 -10 -10 -4 -7 -7 -9 -5 -10 -6 -9 -3 1 0 -6 7 10 1 6 14 15 4 9
6600 9 11 9 6 7 3 7 7 2 2 -8 -1 -4 -4 -11 -17 -24 -14 -19 -11 -15 -8 -11 -20 -9 -11 -12 -18 -8 -11 -6 -4 -10 -4 -4 -4 -1 9 6 -2 4 13 9 5 13 5 8 6 4 8 -2 2 -2 -4 5 -2
6655 -2 -7 -11 -6 -17 -14 -6 -5 -5 -18 -14 -21 -18 -19 -19 -14 -12 -10 -9 -2 -5 -5 5 -5 -8 3 2 0 8 1 11 3 2 7 15 6 4 -4 6 3 6 -11 -11 -5 -6 -7 -8 -10 -15 -10 -5 -6 -9 -14
6708 -14 -12 -10 -15 -5 -7 -10 -9 -11 -21 1 3 -3 1 7 3 9 13 5 0 7 14 10 7 2 4 11 -2 -3 3 -5 0 -7 -1 0 -9 -10 -13 -11 -11 -12 -6 -6 -6 -10 -4 -17 -4 -5 -6 2 4 0 4 12
6762 12 -1 3 4 15 6 15 12 4 3 13 11 7 10 4 2 -4 7 7 -3 -5 -11 -4 -11 -12 -10 -2 -6 -10 -13 -17 -10 2 2 -8 -13 -17 -3 4 3 4 16 3 12 5 12 10 13 25 19
$$ packed form
6401@lNoonRj4J4mjlj5PR%Pj3JJ5qNlJ1j1J3qJ2jpQlllOLmOnLjoqPnQkpnMRj6
6452a4j0NOMnPrMQj1LJ0j0RJ0j0NNpLnJ0MlnkMQrnKmPlolKMj0PpMpoOj5J6p%R
6502a1mPLkj1J6kj1MJ4J%QkrRj0QMj7J0lLkj3P%kJ0j7lRj3kjJJ4moQl%NoJ7mj5
6549a5J6j4J7%jjLMLj3PNkJJkMmJjoj3lJ2lj1PPlo%Ol%kMnMlOMjoJ3LrNQJj1N
6600IKklJmM%n%j0Pl%popJ0nQmPlrJ1kjoJ0lNKoO%%LJ0lqORmmQqLkkMj0MmkRp
6655bnmNj1LQJ%j3MpLj%NKKJPl%J0j0lJ1jkQpJ0qjNQrkqJ0lLj7%OjjjknNNjln
6708a4KKnJ0klJkj0K2KoMOmOMqnPPmlnKPj3jOqNpOJrjlK%jO%%mOj3J3jjQKmMQ
6762A2j3MJJ1rRlqjJ0kmLokoJ1%j0koPpjKQmmlmPJ2%j0nmJ4PjJJ2j3RpPkLJ2o
$$ plain form
6811 19 2 13 6 18 9 5 7 -2 -3 2 -2 -1 -7 -6 -7 -1 -8 -10 -15 -17 1 -5 -10 -7 -2 1 -2 -7 -1 -2 -2 1 5 8 12 13 13 12 -3 9 17 14 14 11 3 14 12 -2 0 0 4 0
6863 0 -8 -12 -1 -7 -2 -9 -12 -11 -21 -9 -3 -17 -5 -10 -16 -3 -14 -7 4 -10 -1 0 -6 11 16 6 2 7 6 4 11 5 4 8 1 7 2 -1 -2 0 4 0 -11 -2 10 -6 -6
6910 -6 -1 0 -12 -13 -7 -12 -9 -4 -4 -11 -3 -7 4 1 3 1 0 11 14 5 12 10 13 12 16 20 10 5 1 2 16 0 -6 -5 -8 -4 -7 -9 -5 -10 -15 -15 -15 -20 -14 -8 -16 -17 -9 -13 -4 -8 1 -5 -2
6965 -2 8 -6 4 -1 1 2 8 5 4 7 2 6 4 15 18 4 11 1 2 8 8 5 -2 -1 -10 -6 -8 -9 -19 -9 -12 -3 -13 -15 -9 -2 -14 -6 4 -7 -9 -1 -5 -3 5 -4 5 8 2
7014 2 4 11 3 4 5 6 19 12 8 8 9 -7 6 7 -4 7 -3 -9 -7 -11 -17 -4 -2 -26 -13 -13 -16 -8 -19 -15 -2 -7 -1 -3 -3 -4 -8 -2 10 6 5 14 7 18 7 12 10
7061 10 4 4 0 9 4 2 -5 7 -7 -3 -5 -13 -6 -10 -7 -12 -12 -12 -1 -15 -13 -6 -13 -14 -8 -9 -10 -14 -4 -7 2 8 14 1 6 3 3 -2 10 12 10 8 0 11 5 8 3 -7 8 -5
7111 -5 -3 -4 -4 0 -11 -5 -13 -16 2 -16 -7 -21 -3 -6 -11 -11 -8 -3 -12 -6 -7 -5 7 12 -1 12 6 0 4 7 4 17 15 0 12 11 6 10 9 1 14 -5 1 -9 3 -4
7157 -4 -6 -5 -14 -15 -2 -11 -13 -7 -14 -13 -3 -10 -3 -12 -7 2 -6 -2 3 3 8 4 9 12 -2 -3 4 10 10 5 2 9 8 9 10 -1 -12 -8 -1 -16 -1 -8 -9 -14 -21 -9 -5 -6 -8 -16 -1 -10
$$ packed form
6811A9j7J1pJ2rmKrjNmJoJjOpknkJ8onLNLlnOj%LMLMJ%jj5J2Ql%lqJ1kj4K%Mm
6863@qmJ1oNplJj0J2Oj4J2noJ3j1PJ1j4RJoJ7Nj0mNjkPojMpOnljKMmj1RJ2j6%
6910fNJj2jOnLN%pQmJ1lKkjJ1LrPkLjMMj0nmJJ4j6oJlMlkMnn%%nOOqjQmRmRoL
6965bJ0j4J0nKJOljLnMkJ1Lj4Pj0JO%lpJrMkjj0J0lRj0kOPj2QJ0j1kQmKQrRLo
7014BKPqJJJJ3pm%Jj6J3Jj1J1j0oKmoJ3Kk4J3%lQj1MJ3nOk%jmOJ2mjRpJ1j1Nk
7061A0o%mRnkpJ2j4MkqPmLn%%J1j4KPpjOjjmJ0lROOj3Nl%nJ2KkkqJ1oLnj0J5j3
7111eKj%Mj1OqlJ8j8Rj4J8ln%LNrOjKJ2Nj3J3ooMLlJ3kj5J2jnMjqJ3j9Oj0J2p
7157dkJrjJ3rkOpJJ0pPrNRqMN%NmNLj4jPO%nlPjJJj1j1MPj5J5pjnpJ2MjkqJ5r
$$ plain form
7209 -10 -8 -1 -8 -11 -4 5 8 5 2 5 8 6 11 9 10 11 21 -2 12 8 8 0 10 3 9 -2 7 -5 2 -5 -13 -9 -13 -3 -2 -10 -12 -7 -11 -10 -3 -4 -10 -12 -4 -10 -7 4 3 -3 2 6
7261 6 11 7 8 11 10 15 7 13 15 -2 1 -1 2 4 -7 2 2 -14 7 -13 -4 1 -8 -16 0 -9 -7 -12 -14 -13 -4 -10 -13 -10 -4 -4 -3 9 -7 -2 9 8 3 3 -3 9 10 11 10 15 10
7312 10 10 3 9 9 0 2 -7 -11 0 -6 -9 -11 -11 -10 -13 -18 -14 -14 -13 -22 -24 -5 -16 -13 -5 -5 -3 -5 -6 2 11 10 1 6 9 10 4 4 4 10 8 16 6 10 0 1 3 -3 -7 -1 -6 -13 -11 -12 -4
7367 -4 -7 -10 -18 -14 -13 -11 -10 -13 -8 6 -12 -13 -6 -12 -5 -5 -2 -1 2 1 -2 17 3 18 11 13 5 8 9 -1 4 6 9 1 -2 -3 6 -18 0 -12 -8 -11 -2 -17 -27 -16 -15 -15 -9
7416 -9 -10 -13 -11 -1 -5 0 2 3 1 0 2 -5 19 10 4 1 -9 14 12 14 13 5 4 2 13 8 1 2 -11 -1 -3 -3 0 -2 -7 -14 -15 -14 -11 -22 -9 -13 -12 -2 -4 -14 -8 -10 -7 4
7466 4 0 6 -2 1 2 -1 15 4 2 11 6 13 3 11 8 -6 4 3 -3 -1 1 -4 -7 -12 -15 -14 -15 -13 -24 -25 -11 -7 -15 -15 -11 -14 -13 -6 3 0 1 -10 7 2 7 -1 7 7 3 9 -2
7517 -2 12 4 12 4 -1 10 5 7 -7 -1 -10 -5 -1 -2 -13 -10 -11 -17 -14 -17 -11 -12 -15 -11 -10 -13 -7 -8 -8 -11 0 -4 -1 -3 11 6 9 13 9 8 9 5 9 9 15 0 7 0 6 -2 -5 -3 0 2
7571 2 -9 -12 -8 -5 -15 -6 -7 -15 -12 -10 -12 -9 -6 -9 -3 -18 -8 -7 1 7 5 3 -1 7 3 13 15 15 8 16 11 16 19 4 13 2 9 3 -5 -7 -6 -9 -5 -6 -18 -9 -10 -14 0 -35 -11
$$ packed form
7209a0KPplPRLllLLkNkJJJ0k3J4m%qJ0pOj1Rj2PpqMmJ0JqkNmJPjokQoLJ1joNM
7261FNmJLjNqOKj7LkLKj1R%j6K1k0RNrqJ6rKnkJRolLO%JJ2j6NJ1jn%oJ2JJjNn
7312A0%pO%rKrmJ1olk%JlnM%JrkJ9j1LQ%KkjQRjrNLJo%%OkQj0Mj0JKomOnpKjQ
7367dllqMJKJlNJ4j8jPoP%LJLjlJ9j4J5pKqLJj0NKLqljRk4J8j2MlRj5j0J1J%O
7416ijlKJ0mNKJkjKpK4rolj0K3kKjqjkJ1npJj3J0k%LknpjJLj1J3mJJ0kj0OkLJ1
7466DmOqLJlJ6j1kRnPj0Qlj4J0joKKnlnlJjKj1jJ4Mq%MlJPRlJj1J7nNqQ%mOj1
7517bJ4qQqnJ1nKj4OrNMjj1LjoLlOjlMJlOj%lJ1mLkJ4nLMmjJmM%Oj5PpOqlKLK
7571Bj1lMLj0RjqLKkLLlOj5J0JQOkkmQmJ0K%pQnNLj5Rj1PoqkJlMjj2RjmJ4l5K4
$$ plain form
7622 -11 -11 -10 -14 -9 -7 -6 -5 -2 4 -6 0 0 -8 14 16 15 8 7 5 2 10 11 5 12 10 3 5 3 5 2 -3 -7 -5 -9 -14 -12 -16 -16 -6 -26 -17 -19 -10 -6 -12 -8 -11 -9 -12 -5 -7 4 -7 -4
7676 -4 -3 5 -4 4 1 5 -2 13 7 8 11 15 -2 6 1 6 -1 4 -16 -14 2 -7 -19 -25 -8 -10 -18 -13 -19 -26 -19 -23 -17 -10 -14 -13 -9 -4 -12 0 -2 2 13 1 9 5 19 6 8 10
7726 10 11 6 13 2 5 1 2 5 -15 0 -10 -6 -12 -5 -6 -11 -6 -8 -25 -22 -23 -18 -18 0 -16 2 -12 -6 -9 4 6 -3 -7 18 -1 4 14 18 13 14 12 12 5 2 9 5 9
7773 9 1 1 7 -6 -9 -7 -4 -12 -3 -1 -9 -13 -13 -16 -10 -9 -12 -4 -9 -8 -8 -8 -3 6 -3 -1 -3 10 4 10 8 14 11 6 11 10 7 11 6 13 3 8 14 6 12 -1 -15 -3 -9 -9 -7 -12 -15 -2
7827 -2 1 -8 1 -17 -6 -17 -21 -4 -14 1 -7 -4 -7 -3 -3 4 -5 6 4 9 3 2 1 10 14 0 10 7 8 -1 -10 10 13 4 7 -4 2 -9 -8 -7 -20 -13 -18 -18 -4 -6 -7
7874 -7 -8 1 -9 3 -3 -2 -1 -4 -8 -9 7 -9 6 3 4 9 2 -3 -4 -4 9 7 3 4 9 -2 3 -10 -1 -5 -1 -8 -7 -8 -19 -18 -31 -18 -17 -11 0 -14 -12 -10 -11 0 -10
7921 -10 -3 -3 -3 -2 8 3 1 -3 1 12 16 -5 -1 -2 4 5 -2 -7 -4 -11 5 1 -7 -24 -2 -10 -2 -19 -14 -10 -22 -16 -20 -13 -19 -14 -11 -7 -12 -11 -2 -6 -13 -2 -3 3 8 11 -3 3
7971 3 2 4 18 0 7 5 8 10 6 -4 -10 3 -8 2 1 -8 2 -8 -12 -3 -11 -13 -13 -10 -13 -9 -20 -16 -8 -15 -1 -1 -5 -14 -2 -3 0 7 8 -2 7 7 7 9 1 3 8 4 5
$$ packed form
7622a1%JmNKJJLOj0O%qK2KjpjklQJoPkpKkKlnmKmnKm%J0k0RkRMoMlKlPkJ1j1L
7676dJQrQlMpJ5oJLMj7QnNpNk0KJ6rj2oJ7kqNopPmOPmJMNqJ2kMJ1j2QmJ4j3KK
7726A0JnPj1LmJLk0J5j0MoPjnNkj7LjN%J8j6J8j4OlJ3KrmK5j9NJ0MnJk%plPmM
7773Iq%Oj3lKLqRKqm%lOJlQnJ%%NRrKkJ3oOkOlnNjlMnPj0NOqOj3j4J2o%KnlJ3
7827bLrRj8J1j1mJ7j0J5qLlM%PrJ1kNojjRMj4J0lJrrK0LrLj1Oj1JJj3Pn%J4kj
7874gjRj0J2oJJlmjJ6j6J5lJNpnj%J3kmJNj1Nj3RmMpJjj1Jj3J3JOJ1j4KKjJ1j0
7921a0P%%JJ0nkmMJ1Mk1MjOJpnLpJ6mqj7K2qQj7NMj2OmPoNLMnJRmpJ1jONLj4O
7971CjKJ4j8PkLKmj0oJ3j1J0jrJ0j0mRqk%LlMj1MQpJ4%mrJ2jLPJj0R%%KqKNmJ
$$ plain form
8020 5 13 10 7 -5 10 -1 4 -10 -10 -7 -15 -10 -23 -16 -13 -16 -19 -18 -14 -15 -12 -5 -6 -12 0 -1 -14 -5 -3 -4 1 -1 2 3 1 10 14 17 -2 4 6 9 2 10 3 -2 -6 -9 -4 -3 0 -7 1
8073 1 -12 -10 -7 -7 -10 -16 -20 -17 -15 -21 -12 -9 -19 -6 -3 -10 -4 0 -3 6 1 3 2 9 18 3 13 7 3 8 11 4 -3 4 2 1 3 -2 7 -10 0 -7 -15 -12 -15 -23 -16 -20 -18 -12 -18 -16 -19 -6
$$ packed form
8020EQllj2J5j1Nj4%LqNj3PLllJMjLPjoJ2jj3RKjNkLJkRMLj9OKLpQpnmlNJLpQ
8073Aj3KL%lomLKoRLj0J3LpOMlRnKjPRj5J0omNLppPkjKnRj7J0pqLlqPmKOoKlJ3
$$ [...]
8191F
##END NTUPLES=NMR FID
##END=
