##TITLE=1H_LY-DMAA.Per.2.8
 CDCl3
 8 sc, 
 11.02.2022
##JCAMPDX= 6.0         $$ Bruker NMR JCAMP-DX V2.0
##DATA TYPE= NMR FID
##DATA CLASS= NTUPLES
##ORIGIN= UXNMR, Bruker Analytische Messtechnik GmbH
##OWNER= root
$$ XWIN-NMR		Version 3.5
$$ Fri Feb 11 10:18:06 2022 Russian Standard Time (UT+4h)  she@DPX200
##.OBSERVE FREQUENCY= 200.131346
##.OBSERVE NUCLEUS= ^1H
##.DELAY= (6, 6)
##.ACQUISITION MODE= SIMULTANEOUS
##.ACQUISITION SCHEME= undefined
##.AVERAGES= 8
##.DIGITISER RES= 18
##SPECTROMETER/DATA SYSTEM= spect
##.PULSE SEQUENCE= zg30
##.SOLVENT NAME= CDCl3
##.SHIFT REFERENCE= (INTERNAL, CDCl3, 0, 15.7039)
##AUDIT TRAIL= $$ (NUMBER, WHEN, WHO, WHERE, WHAT)
$$ ##TITLE= Audit trail, XWIN-NMR		Version 3.5
$$ ##JCAMPDX= 5.01
$$ ##ORIGIN= Bruker BioSpin GmbH
$$ ##OWNER= she
$$ F:/spectra/data/she/nmr/H-F/1/audita.txt
$$ ##AUDIT TRAIL=  $$ (NUMBER, WHEN, WHO, WHERE, WHAT)
(   1,<2022-02-11 10:16:45.54 +0400>,<she>,<DPX200>,
      <created by zg, POWCHK disabled, PULCHK disabled
       configuration hash MD5:
       00 E9 B6 7A A2 85 ED C7 34 08 36 98 17 FE 4E 26
       data hash MD5: 16K
       15 24 AF B2 CF 75 62 31 5B 56 55 C0 15 D5 73 D6>)
$$ ##END=
$$ 
$$ hash MD5
$$ CD 46 E9 3D B4 9B 76 A0 85 E9 E1 74 56 52 F0 38
##$RELAX= 
##$RELAX= 
##$RELAX= 
##$RELAX= 
##$RELAX= 
##$RELAX= 
$$ Bruker specific parameters
$$ --------------------------
##$DU= <F:/spectra>
##$EXPNO= 1
##$NAME= <H-F>
##$PROCNO= 1
##$TYPE= <nmr>
##$USER= <she>
##$AMP= (0..31)
100 100 100 100 100 100 100 100 100 100 100 100 100 100 100 100 100 100 
100 100 100 100 100 100 100 100 100 100 100 100 100 100 
##$AQSEQ= 0
##$AQ_mod= 1
##$AUNM= <au_zg>
##$AUTOPOS= <>
##$BF1= 200.13
##$BF2= 200.13
##$BF3= 200.13
##$BF4= 200.13
##$BF5= 200.13
##$BF6= 200.13
##$BF7= 200.13
##$BF8= 200.13
##$BYTORDA= 1
##$CFDGTYP= 0
##$CFRGTYP= 5
##$CHEMSTR= <none>
##$CNST= (0..31)
1 1 145 1 1 1 1 1 1 1 1 1 1 1 1 1 1 1 1 1 1 1 1 1 1 1 1 1 1 1 1 1 
##$CPDPRG= <>
##$CPDPRG1= <>
##$CPDPRG2= <>
##$CPDPRG3= <>
##$CPDPRG4= <mlev>
##$CPDPRG5= <mlev>
##$CPDPRG6= <mlev>
##$CPDPRG7= <mlev>
##$CPDPRG8= <mlev>
##$CPDPRGB= <>
##$CPDPRGT= <>
##$D= (0..31)
0 1.2 0 0 0 0 0 0 0 0.06 0 0.03 0 0 0 0 0.0002 0 0 0 0 0 0 0 0 0 0 0 0 
0 0 0 
##$DATE= 1644560205
##$DBL= (0..7)
120 120 120 120 120 120 120 120 
##$DBP= (0..7)
150 150 150 150 150 150 150 150 
##$DBP07= 0
##$DBPNAM0= <>
##$DBPNAM1= <>
##$DBPNAM2= <>
##$DBPNAM3= <>
##$DBPNAM4= <>
##$DBPNAM5= <>
##$DBPNAM6= <>
##$DBPNAM7= <>
##$DBPOAL= (0..7)
0.5 0.5 0.5 0.5 0.5 0.5 0.5 0.5 
##$DBPOFFS= (0..7)
0 0 0 0 0 0 0 0 
##$DE= 6
##$DECBNUC= <off>
##$DECIM= 32
##$DECNUC= <off>
##$DECSTAT= 4
##$DIGMOD= 1
##$DIGTYP= 9
##$DL= (0..7)
0 120 120 120 120 120 120 120 
##$DP= (0..7)
150 150 150 150 150 150 150 150 
##$DP07= 0
##$DPNAME0= <>
##$DPNAME1= <>
##$DPNAME2= <>
##$DPNAME3= <>
##$DPNAME4= <>
##$DPNAME5= <>
##$DPNAME6= <>
##$DPNAME7= <>
##$DPOAL= (0..7)
0.5 0.5 0.5 0.5 0.5 0.5 0.5 0.5 
##$DPOFFS= (0..7)
0 0 0 0 0 0 0 0 
##$DQDMODE= 0
##$DR= 18
##$DS= 0
##$DSLIST= <SSSSSSSSSSSSSSS>
$$ [...]
##$SUBNAM2= <"">
##$SUBNAM3= <"">
##$SUBNAM4= <"">
##$SUBNAM5= <"">
##$SUBNAM6= <"">
##$SUBNAM7= <"">
##$SUBNAM8= <"">
##$SUBNAM9= <"">
##$SW= 18.0517287032376
##$SWIBOX= (0..15)
0 0 2 0 0 0 0 0 0 0 0 0 0 0 0 0 
##$SW_h= 3612.71676300578
##$TD= 16384
##$TD0= 1
##$TE= 0
##$TE2= 300
##$TE3= 300
##$TEG= 300
##$TL= (0..7)
0 120 120 120 120 120 120 120 
##$TP= (0..7)
150 150 150 150 150 150 150 150 
##$TP07= 0
##$TPNAME0= <>
##$TPNAME1= <>
##$TPNAME2= <>
##$TPNAME3= <>
##$TPNAME4= <>
##$TPNAME5= <>
##$TPNAME6= <>
##$TPNAME7= <>
##$TPOAL= (0..7)
0.5 0.5 0.5 0.5 0.5 0.5 0.5 0.5 
##$TPOFFS= (0..7)
0 0 0 0 0 0 0 0 
##$TUNHIN= 0
##$TUNHOUT= 0
##$TUNXOUT= 0
##$USERA1= <user>
##$USERA2= <user>
##$USERA3= <user>
##$USERA4= <user>
##$USERA5= <user>
##$V9= 5
##$VALIST= <valist>
##$VCLIST= <CCCCCCCCCCCCCCC>
##$VD= 0
##$VDLIST= <DDDDDDDDDDDDDDD>
##$VPLIST= <PPPPPPPPPPPPPPP>
##$VTLIST= <TTTTTTTTTTTTTTT>
##$WBST= 1024
##$WBSW= 4
##$XGAIN= (0..3)
0 0 0 0 
##$XL= 0
##$YL= 0
##$YMAX_a= 36339
##$YMIN_a= -35501
##$ZGOPTNS= <>
##$ZL1= 120
##$ZL2= 120
##$ZL3= 120
##$ZL4= 120
##$ABSF1= 10
##$ABSF2= 0
##$ABSG= 5
##$ABSL= 3
##$ALPHA= 0
##$AQORDER= 0
##$ASSFAC= 0
##$ASSFACI= 0
##$ASSFACX= 0
##$ASSWID= 0
##$AUNMP= <proc_1d>
##$AZFE= 0.1
##$AZFW= 0.1
##$BCFW= 1
##$BC_mod= 2
##$BYTORDP= 1
##$COROFFS= 0
##$CY= 11.3945322036743
##$DATMOD= 1
##$DC= 2
##$DFILT= <>
##$DTYPP= 0
##$F1P= 2.36226072786647
##$F2P= -0.459571619588291
##$FCOR= 0.5
##$FTSIZE= 0
##$FT_mod= 4
##$GAMMA= 1
##$GB= 0.15
##$INTBC= 1
##$INTSCL= 1
##$ISEN= 128
##$LB= 0.24
##$LEV0= 0
##$LPBIN= 0
##$MAXI= 10000
##$MC2= 0
##$MEAN= 0
##$ME_mod= 0
##$MI= 1.114404
##$NCOEF= 0
##$NC_proc= 0
##$NLEV= 6
##$NOISF1= 3.799351
##$NOISF2= 2.8
##$NSP= 1
##$NTH_PI= 0
##$NZP= 0
##$OFFSET= 15.70392
##$PC= 1
##$PHC0= -16310.04
##$PHC1= 11.80078
##$PH_mod= 1
##$PKNL= yes
##$PPARMOD= 0
##$PSCAL= 0
##$PSIGN= 0
##$REVERSE= no
##$SF= 200.130013532006
##$SI= 16384
##$SIGF1= 3
##$SIGF2= 2
##$SINO= 400
##$SIOLD= 16384
##$SREGLST= <1H.CDCl3>
##$SSB= 0
##$STSI= 0
##$STSR= 0
##$SW_p= 3612.71676300578
##$SYMM= 0
##$S_DEV= 0
##$TDeff= 0
##$TDoff= 0
##$TI= <>
##$TILT= no
##$TM1= 0
##$TM2= 0
##$TOPLEV= 0
##$USERP1= <user>
##$USERP2= <user>
##$USERP3= <user>
##$USERP4= <user>
##$USERP5= <user>
##$WDW= 1
##$XDIM= 8192
##$YMAX_p= 0
##$YMIN_p= 0
$$ End of Bruker specific parameters
$$ ---------------------------------
##NTUPLES= NMR FID
##VAR_NAME=  TIME,          FID/REAL,        FID/IMAG
##SYMBOL=    X,             R,               I
##VAR_TYPE=  INDEPENDENT,   DEPENDENT,       DEPENDENT
##VAR_FORM=  AFFN,          ASDF,            ASDF
##VAR_DIM=   8192,          8192,            8192
##UNITS=     SECONDS,       ARBITRARY UNITS, ARBITRARY UNITS
##FACTOR=    0.0002768,     1,               1
##FIRST=     0,             0,               0
##LAST=      2.2672688,     0,               0
##MIN=       0,             -35501,          0
##MAX=       2.2672688,     36339,           0
$$ Real data points
##PAGE= N=1
##DATA TABLE= (X++(R..R)), XYDATA
0@%%%%%%%%%%%%%%%%%%%%%%%%%%%%%%%lJ1j6J6j6J6j6J6j6J6j9K6l1L2l2L4m1
$$ 0 0 0 0 0 0 0 0 0 0 0 0 0 0 0 0 0 0 0 0 0 0 0 0 0 0 0 0 0 0 0 0 -3 8 -8 8 -8 8 -8 8 -8 8 -11 15 -16 16 -16 18 -23
48b3M7m8N2o0O6p3Q1q9R9j10J24j41J63j91K24k69L37m42O16r72J942r123k7711
$$ -23 24 -24 28 -32 34 -39 42 -47 52 -58 66 -75 88 -103 121 -148 189 -253 363 -609 1333 -7790 -35501
71c5501L1549L5433k0494l3934Q491K6296K456j4374r559o07J2323J5671r895
$$ -35501 -3952 31481 10987 -22947 -14456 11840 14296 -78 -9637 -10244 2079 17750 7855
84G855k8874L419L7493N645m0682j4692L7928K1676l0647k4753K0306K3241r182
$$ 7855 -21019 -17600 19893 25538 -15144 -29836 8092 29768 -879 -25632 -5326 17915 8733
97H733j7027p88P158P786M895j0767j6881R653K6864n252l3150r44L5053P212
$$ 8733 -8294 -9082 -1924 5862 10757 -10 -16891 -7238 19626 14374 -18776 -19720 15333 22545
111B2545l2514j1970K6297J3912j7760j2442Q560P583m51k18n458q295Q399J6443
$$ 22545 -9969 -21939 4358 18270 510 -11932 -3372 4211 3760 3542 -1916 -10211 -1812 14631
125A4631q489k2869O384K6536l024k7032k94K4479K658j9569l155J3322J722o915
$$ 14631 6142 -16727 -10343 16193 13169 -13863 -14157 10322 12980 -6589 -9744 3578 5300 -1615
139a615J478J346n794K852J0294n329j4301O301J6938o184j7927N530J7124n009
$$ -1615 -137 1209 -4585 -1733 8561 3232 -11069 -4768 12170 5986 -11941 -6411 10713 5704
153E704j4891N002J1659n705q057P020M626q673j623J0233o95j1289K517J1597
$$ 5704 -9187 -4185 7474 1769 -6288 732 5358 -3315 -4938 5295 4600 -6689 -4172 7425
167G425l988j0974N454R623p081p769Q958N802j0939m113J2757K826j4045k041
$$ 7425 3437 -7537 -2083 7540 459 -7310 1648 7450 -3489 -7602 5155 7981 -6064 -8105
181h105J4354J499j3537r48J1492l1q553J707N153m277j763P526r68j1093K635
$$ -8105 6249 7748 -5789 -6737 4755 4724 -3829 -2122 3031 -1246 -3009 4517 3549 -7544 -4909
196d909J4524l016j7043K281J8128p60j7335r17J4693K024j0411k021N140N06
$$ -4909 9615 6599 -10444 -8163 9965 9205 -8130 -9047 5646 7670 -2741 -4762 378 884
210H84K99K577n099o848Q321J1646r689j6064Q985J9160o616k0172L258J8726
$$ 884 1183 3760 -1339 -8187 134 11780 2091 -13973 -4988 14172 7556 -12616 -9358 9368
224I368J54j4800k638Q978L457k056k233m729r92J0339N753j3951j1032J4995
$$ 9368 9522 -5278 -7916 1062 4519 2463 230 -4499 -5491 4848 10601 -3350 -14382 613
238F13J5783j3547j8944J0089J9684n561j7731J057J3124K363o600l924p78L171
$$ 613 16396 2849 -16095 -6006 13678 8117 -9614 -8557 4567 6930 330 -3594 -4372 -1201
252a201P949l37j3661m059J7134R072j7850j3571J5972J6506j1983j7107O916
$$ -1201 6748 6411 -7250 -11309 5825 14897 -2953 -16524 -552 15954 3971 -13136 -6220
265f220J4997j815j0427k168L983M284L208m137j0114J857J5506J960j8646o371
$$ -6220 8777 6962 -3465 -5633 -1650 2634 5842 1705 -8409 -6552 8954 10914 -7732 -14103
279a4103J9066J0326j6973j2792J2876J3152p780j1051K740O828J341j079l660
$$ -14103 4963 15289 -1684 -14476 -1600 11552 3772 -7279 -4539 2289 3630 2551 -1109
292a109n202M003J1018k525j5416j98J7727L418j7741o229J5631P822j1960p805
$$ -1109 -6311 -2308 8710 6185 -9231 -9429 8298 11716 -6025 -12254 3377 11199 -761 -8566
306h566P492N918l055k594n50j817K838O478l609j0636L027J3650j501j5047l49
$$ -8566 -1074 4844 1789 -805 -1355 -3172 -334 6144 2535 -8101 -5074 8576 7075 -7972 -8321
321h321J4727J972j2842k751R847K469o313j044K917j374j8M255j954p125K927
$$ -8321 6406 8378 -4464 -7215 2632 5101 -1212 -2256 661 -713 -731 3524 1570 -5555 -2628
336b628R462l110j0920K748J1263k290j0548K031Q944k192o837K888M557l980
$$ -2628 6834 3724 -7196 -4448 6815 4525 -6023 -3992 4952 2760 -4077 -1189 3368 -612
350f12k405N285N81o460Q44P295j859p635K689P390l442o657M273N557n207m351
$$ -612 -3017 2268 2849 -3611 -2767 4528 2669 -4966 -2277 5113 1671 -4986 -713 4844 -363 -4714
366d714O224L165p159k178P779J417p981p77P589J14o625P61N188j950l497L565
$$ -4714 1510 4675 -2484 -4662 3117 4534 -3447 -4224 3365 3479 -3146 -2385 2803 853 -2644 921
382I21J805n418m18P346l94r080O53J0256l82j0598j47R909O10q218p07N717J32
$$ 921 2726 -2692 -3110 4236 3842 -5238 -4585 5671 5289 -5309 -5456 4453 5063 -3155 -3862 1855 1987
399A987k823J263j46l372K578N906m131q524M660J0693m141j1945K888J1940j248
$$ 1987 -836 427 281 -3091 -513 5393 1262 -7262 -2602 8091 3950 -7995 -5107 6833 5585
414E585j0520k14P860J058m262r18L14l68L445K599o300n491P924Q442q136j0858
$$ 5585 -4935 -5149 2711 3769 -493 -1411 -1097 -1465 1980 4579 -1721 -7212 712 9154 1018 -9840
430i840O996J2120m891j1936K370J0087p6o876j416K682J709J846o39n961j535
$$ -9840 -2844 9276 4385 -7551 -5181 4906 4830 -2046 -3462 -780 929 2775 2136 -3825 -5360
445e360Q988M442j0550p380J0514R735q985j0865O425J0472l462q459P69N068
$$ -5360 3628 8070 -2480 -9860 654 10389 1404 -9461 -3036 7436 3974 -4485 -3716 1352
459A352J102q21j763l658J098P571P09j0463l143J1786N684j1514p662R789Q555
$$ 1352 2454 1633 -130 -3788 -2690 4881 5590 -4873 -8016 3770 9454 -2060 -9722 67 8622
474H622p066q053L960O129j074k996j021q77J995M859j729q301M61J0674J455
$$ 8622 1556 -6497 -2537 3592 2518 -478 -1499 -2376 -381 4478 2749 -5552 -5091 5583 7038
489G038j1685l442J1195M950r445n574O853N007l942l320J292O75P11K483j790
$$ 7038 -4647 -8089 3106 8056 -1389 -6963 -110 4897 955 -2365 -1073 -398 313 2796 1006
504A006n558J891Q120j203r746O7J0267J102r629j890Q051K061n907j471L586
$$ 1006 -4552 -2661 5459 4256 -5490 -5423 4844 5946 -3683 -5573 2478 4539 -1368 -2839 747
519G47R3j421J800k98l904J360N799j777p245J697P996j372p977J043P204q75
$$ 747 840 -581 1219 921 -2983 -1623 4176 2399 -4846 -3149 4847 3475 -4502 -3459 3745 2870
535B870n937J122M359j741k663K656J190l712L8M684r10n363J498N638j900n505
$$ 2870 -3067 -1945 2414 673 -1990 666 1856 -1856 -1818 2866 1956 -3407 -1909 3729 1829 -3676
551c676K288M976k751m201L324L234l979k321M617J460n085p99N301J96n169M25
$$ -3676 -1388 3588 837 -3364 -40 3194 -785 -3106 1511 2971 -2114 -2913 2388 2584 -2585 -2160
567b160M657j108l829J954K874k988j869M151J026n269m42O192J90o756j65O791
$$ -2160 2497 1389 -2440 -486 2388 -600 -2469 1682 2708 -2561 -3003 3189 3379 -3377 -3542 3249
583C249K58o236k76N099M3l565O01J776j690q7L142j282m743K100O228k255p399
$$ 3249 3507 -2729 -3005 2094 2137 -1428 -827 949 -741 -828 2314 1032 -3711 -1611 4617 2362 -5037
600e037J913P883j159p577L50O426K61m549m17K262j21J87J295k345k965L857
$$ -5037 -3124 4759 3600 -3977 -3627 2799 3060 -1489 -1906 356 235 422 1717 -628 -3593 264
616B64M822m549o544M403P749l583q137K336P522r84n987m8L669M97q61j80j948
$$ 264 5086 537 -6007 -1604 6145 2562 -5575 -3239 4283 3299 -2688 -2736 933 1430 569 389 -1559
633a559q79M313K531n895m410O535O115o155p272M972P522l295o770J536N015
$$ -1559 -2438 1875 4406 -1489 -5899 636 6751 596 -6676 -1704 5818 2523 -4247 -2711 2304
648B304j09k515o77m20N85L283K86n601j715P023L431p469m940O900N906n530
$$ 2304 2195 -320 -997 -1417 -832 2451 2737 -2864 -4579 2444 5875 -1594 -6534 366 6272 742
664G42o004L731N183j874l457L74J074N21J649o69m205J04O170R86p377k282P629
$$ 742 -5262 -1531 3652 1778 -1679 -1305 -231 290 1939 1270 -2935 -2831 3339 4325 -3052 -5334 2295
681B295L422p005m077N657L996l898l211K132J652o13M26m11k649Q02M676n69
$$ 2295 5717 -1288 -5365 292 4288 390 -2821 -689 963 350 776 365 -2284 -1482 3194 2625
697B625o189o7P006R04p038j586O330J922n072j750L527J005j950K10O09j722
$$ 2625 -3564 -3631 3375 4279 -2759 -4345 1985 3907 -1165 -2915 612 1617 -333 -123 486 -1236
713a236K98L258p55m588Q32N442o31n786L56N567j50m914K22L893n76k715J222
$$ -1236 -938 2320 1565 -3023 -2191 3251 2620 -3166 -2810 2757 2607 -2307 -2085 1808 1232 -1483 -261
730b61J566k032n82K900j60l664O81M175r99m370J221M236j473l782J759L140
$$ -261 1305 -727 -1309 1591 1431 -2233 -1552 2623 1624 -2746 -1525 2711 1238 -2544 -785 2355
746B355k178k385K654J619l125r45L502L87l699R1L686n32l398J012K911j558
$$ 2355 177 -2208 446 2065 -1060 -2005 1497 1884 -1815 -1724 1962 1430 -1968 -956 1955 397
762C97k281K204J631k899j066L577O10m122l46M432K03m414j21M014l9l310L52
$$ 397 -1884 320 1951 -948 -2014 1563 2173 -1949 -2295 2137 2340 -2074 -2195 1819 1780 -1530 -1178
779a178K353q94j301J675L14k614M45L627r08m513J069N085q94n221N58M895k28
$$ -1178 1175 281 -1020 655 969 -1645 -1200 2427 1519 -2994 -1925 3160 2266 -2955 -2397 2498 2270
796B270m044R0K771k21j266P29k45j621J528K706k414l854K770M790k631n356
$$ 2270 -1774 -1684 1087 866 -400 329 84 -1537 -9 2697 283 -3571 -801 3989 1358 -3998
812c998K105N353j364m760O45L586j64j945P9J36m73J598J297k940k406L799L513
$$ -3998 -1893 3460 2096 -2664 -2019 1567 1403 -542 -463 -327 -800 798 2095 -845 -3251 548 4061
829D061l999m421L651M915k862m843J882M083r10k767K20R97M5Q87J99k653q89
$$ 4061 62 -4359 -708 4207 1345 -3498 -1616 2467 1557 -1210 -990 7 52 939 1138 -1515 -2404
846b404M018J866m795k856M873L685m389m080L461L901k284l108J159J751k82
$$ -2404 1614 3480 -1315 -4171 702 4387 -2 -4082 -621 3280 996 -2112 -953 798 516
861E16m7j47j762Q3L370L98m544j157N134J931n072k547M475K793l489k533K306
$$ 516 469 322 -1440 -1357 2013 2411 -2133 -3290 1844 3775 -1297 -3844 631 3424 -65 -2598 -292
878b92J754j164n56K92q77K06K358l03l600M9M462M27m829r40M671J300m068j380
$$ -292 1462 298 -258 34 -843 -637 1721 1418 -2182 -2133 2329 2756 -2073 -3013 1658 2958 -1110 -2490
896b490L137J066k084l95J066n69k55J646k56k711M63L578m45m071K72M177o2
$$ -2490 647 1713 -371 -766 300 -269 -524 1122 866 -1845 -1382 2196 1751 -2320 -2048 2129 2067
913B067l900lL293j00k495M73J624r91q25J651J75k302K84K821n49l159P00L212
$$ 2067 -1833 -1836 1457 1357 -1138 -665 959 -32 -857 794 969 -1333 -1049 1772 1223 -1936 -1236 1976
931A976q07l032R20K629j121k110J408J507j755r53K111M60k410m7K613k97k608
$$ 1976 1169 -1863 -943 1686 565 -1545 -137 1370 -385 -1338 773 1233 -1177 -1224 1389 1092 -1516
948a516N90K450q69k143J229J708j604j246K040Q08k468m37K791J79k976rK982
$$ -1516 -926 1524 655 -1488 -259 1449 -155 -1401 639 1447 -1021 -1458 1333 1512 -1464 -1473 1509
965A509j68k732L41K252n87j652R61R69j459l28K046j83k642N38L122o59l409
$$ 1509 1341 -1391 -1050 1202 615 -1037 -76 893 -566 -894 1152 969 -1673 -1135 1987 1328 -2081
982b081O09L436m87l115L46K512l30j680M96P28q86J98J458r77k128J481K800
$$ -2081 -1472 1964 1477 -1638 -1292 1220 890 -790 -294 434 -452 -254 1204 227 -1901 -420 2380
999B380j690l326J608L585j294l455Q78K960n03k116L02J025l46J38O91j224j264
$$ 2380 690 -2636 -1028 2557 1263 -2192 -1314 1646 1143 -973 -671 354 8 146 837 -387 -1651
1016a651K082J960k571k647K670L136k405l335J886L107j279k480P04J505l48
$$ -1651 431 2391 -180 -2827 -157 2979 574 -2761 -875 2232 953 -1527 -823 682 334
1031C34l00K78r57m88K040R78k813j600L218K192l164k616K785K709k121k423
$$ 334 34 312 -645 -1133 907 1885 -928 -2528 690 2882 -282 -2898 -113 2596 475 -1948
1047a948J388J767p26p84K56l83q0J540J93k519n82L188J075l488j546L348J865
$$ -1948 -560 1207 481 -303 -47 -430 -510 1030 1223 -1296 -1878 1310 2385 -1103 -2649 699 2564
1064B564k897j883K181J585j403r48P00N1j86R89o6j969P2K765J61l263m71L392
$$ 2564 -333 -2216 -35 1550 147 -801 -101 -50 -236 753 687 -1282 -1210 1555 1716 -1547 -2018 1374
1082A374P68l163r32K668Q53j977n43J252l9n80P37R1j493J86K179k81k678K14
$$ 1374 2142 -1021 -1953 715 1568 -409 -952 300 261 -319 418 509 -984 -798 1381 1100 -1578 -1364
1100a364K929r4k891qK597L8k127J07J527l96r18Q16L80j312L8J771l07k131M56
$$ -1364 1565 1471 -1420 -1428 1169 1207 -920 -813 714 318 -600 216 596 -716 -678 1093 786 -1345 -889
1119h89K329n18k343N73K147o37j826P85J392j006r09J258M86j531j17J788j76
$$ -889 1440 922 -1421 -848 1299 662 -1164 -379 1013 7 -902 356 842 -689 -806 982 806
1136H06j925M11J928n82j822P67J576r76j241J197Q74j466n23J716K18j921nK026
$$ 806 -1119 -708 1220 638 -1184 -417 1159 183 -1058 139 1013 -453 -976 740 958 -963 -968 1058
1154A058j72k006K93J852m24j553O08J148q36p03J147K77j485R3J832l22k107
$$ 1058 886 -1120 -827 1025 601 -952 -344 804 -32 -735 412 689 -796 -703 1129 807 -1300
1171a300M38K268m62k247M37K016l89j632M29J062n65m55Q24j49j207O52J607
$$ -1300 -862 1406 944 -1303 -866 1150 761 -871 -442 620 55 -400 424 275 -932 -280 1327
1188A327r84k010J131K272j080k358R21K208o97j814N14J224m32m85N04k54p36
$$ 1327 343 -1667 -536 1736 656 -1702 -781 1427 730 -1084 -570 654 222 -263 241 -13 -749
1205g49R24J124j443j526J713J897j733k155J551K168j215j943Q34J467n23p68
$$ -749 175 1299 -144 -1670 43 1940 207 -1948 -397 1771 556 -1387 -553 914 391 -377
1221c77L15l0l07Q10N16j521q21J975J221k172j567K107J772j811j763J371J481
$$ -377 -62 -92 -399 411 927 -594 -1415 560 1781 -391 -1958 149 1921 110 -1653 -282 1199
1238A199q93r56M89K40k30N28J93j305l04J907N63k275q73K390J125k231j244
$$ 1199 306 -650 -161 79 -151 377 570 -735 -1039 868 1431 -844 -1717 673 1798 -433 -1677
1255a677J875J157j374q58Q62L66m07K65J23r55jJ585M0k068j91K295M15k314
$$ -1677 198 1355 -19 -877 -15 351 -56 209 332 -623 -624 961 1001 -1067 -1258 1037 1452 -862
1273h62n99K090O50j695n51J190K71p03J58K76o69PJ221j62j662J73J972q1k088
$$ -862 -1461 629 1279 -416 -967 223 494 -209 -51 225 -444 -437 784 622 -1040 -867 1105 1024 -1064
1292a064kJ999P2j723l3J338j06r13L76M80p10j25J062j27j406K77J618l40j735
$$ -1064 -1066 933 1005 -718 -751 587 481 -432 -56 424 -286 -411 651 524 -882 -605 1013 673 -1062
1311a062L70J677l86j506M33J226n48q61O91N19q97k11J123l2j292K29J392l50
$$ -1062 -692 985 599 -907 -474 752 204 -657 34 553 -344 -555 568 536 -756 -527 865 515
1329E15j388M39J301n20j125O48Q70p86n91R53L16j134j04J276o6j372K09J363
$$ 515 -873 -434 867 347 -778 -130 740 -46 -637 316 632 -502 -606 670 604 -768 -559 804
1347H04l02j277L99J073n00q07O40N08q45j94J070o3j284K44J440l32j537L83
$$ 804 502 -775 -376 697 197 -610 30 538 -307 -501 569 506 -778 -534 906 574 -963 -580
1365e80J498l80j333L81J044m12o70M85K84o81J14R20m46j163O63J391p42j548
$$ -580 918 538 -795 -414 630 218 -452 33 317 -364 -250 670 224 -939 -276 1115 373 -1175
1383a175P35J560o12j442M93J159l71p70L55K65m25K13O10o59q48R61J114j130
$$ -1175 -440 1120 508 -934 -441 718 347 -423 -68 197 -228 -15 595 -64 -912 49 1163 33
1401C3j335J107J455r69j446P85J230n67q50L78L79l02J65L52o79m96J128P04
$$ 33 -1302 -195 1260 291 -1155 -370 860 293 -557 -179 200 -102 63 415 -264 -760 368 1072
1419A072j381r43J491J125j403j211J196J130q96q94N82M93l28k6K05n32j81J001
$$ 1072 -309 -1252 239 1364 -39 -1250 -54 1076 180 -714 -132 361 33 7 212 -320 -501 500
1437E00K94j401m57J592O53j606q21J469Q71j190p65Q41N12m84j43K45l21q9Q07
$$ 500 794 -607 -1064 528 1181 -425 -1246 223 1094 -96 -861 -20 492 8 -135 110 -211 -300 507
1456E07M3j206r5J477K36j608l70J572M34j368m36J073L17p36p3L90k54j37O38
$$ 507 550 -656 -751 726 962 -646 -1016 556 990 -378 -814 259 576 -160 -233 157 -97 -234 404
1475D04m9r96J31J275j08j447M8J476K7j376o1J141K1q42J16N22l18k29N65nq29
$$ 404 355 -641 -510 765 657 -790 -742 734 761 -615 -676 465 486 -356 -240 282 -36 -265 300 295 -534
1496e34J62J053k40j197K69J217k36j172K57R97k76p70L69M99m75k60O41M3q06
$$ -534 -372 681 441 -756 -487 730 494 -678 -421 576 300 -470 -101 398 -77 -337 304 347 -459
1515d59J36R25k42j000K98J001l50r23L94P64m69n62N54L50o72j39P89l8q93J65
$$ -459 -323 602 360 -640 -342 659 309 -614 -220 544 75 -487 67 417 -255 -394 395 357 -536 -371
1535c71R50k44r57L08Q92l47p43M25N44m94l38O12J16p43R1Q52k12r60L05R97
$$ -371 579 335 -622 -314 578 231 -512 -87 457 -37 -375 237 353 -390 -299 553 341 -619 -314 683
1555F83l38r82L41Q55l32o78L42M32m11j56N05r9o57L28P99m55r54N38J023n25
$$ 683 345 -637 -296 559 227 -451 -109 323 -88 -244 261 162 -495 -167 632 177 -777 -239 784 259
1575B59j002M58R06l72p02L11M34l02j02L42k17m56N07O07p03p76Q15Q68p89r25
$$ 259 -743 -285 621 249 -453 -142 292 -10 -112 230 13 -443 64 671 -32 -808 7 875 86 -839
1595h39O91Q88n52p40M07M75k79j63K45k09k76N40L64p91n07R56O54r86p56Q91
$$ -839 -148 740 188 -552 -145 330 51 -112 133 -76 -352 188 552 -239 -746 210 864 -122 -878 13
1615A3P92p53p11N57N15l54k35K08j04j39M49J62p58k30R57L69j073m76J066N62
$$ 13 805 52 -659 -102 413 59 -176 32 -72 -211 238 400 -358 -588 369 738 -335 -811 255 817
1635H17r54n36P30M59n06k62K89j4j24L13N0o48k8Q86Q9j058j66J083K69j039
$$ 817 -137 -673 57 516 10 -252 37 23 -101 212 262 -386 -414 472 561 -497 -663 420 689 -350
1655c50l11Q59K77o29j68L91nj84K55L4n09O0P49o6r19M4R96J7r71n9Q52Q0o89
$$ -350 -661 198 475 -154 -322 69 64 -120 135 169 -340 -280 469 403 -516 -472 524 541 -430 -489 363 443 -246
1678b46k1M74r0k66K44Q3m35L8O12j31p59J50Q52j68q45J49P74j46o32J67M63
$$ -246 -267 207 117 -149 95 178 -257 -219 393 262 -497 -347 505 337 -508 -359 415 269 -363 -196 267
1699B67k37k66L43J01m64M5N73j32o68K07P05k35o93K41O34k59n03K83L56l57
$$ 267 30 -236 107 208 -256 -211 362 230 -438 -231 474 239 -454 -213 421 162 -341 -58 298 -59
1719e9j94M26O1n21N4O05j55o27J83O48k17n99K39M95k68l71L24K13l79q2M72
$$ -59 -253 173 234 -287 -233 372 217 -410 -227 421 204 -395 -156 339 71 -300 24 237 -142 -224 248
1740B48n2n60J56O26k19o50K34O41k41n66K38M36k38k90L05R5l52Q0M37k19n23
$$ 248 196 -364 -208 418 199 -451 -217 424 183 -383 -145 291 53 -237 68 163 -189 -109 328 109 -414
1761d14L03O12l61o45L40O62l07n96K72M34k30k50K24M4k78J66L32l26m47M46
$$ -414 -111 501 140 -505 -165 497 190 -406 -134 300 70 -180 44 88 -190 -24 308 -18 -465 -19
1781a9N37m99o13M87O21m04n86L37M60k37k77J81N5j55J67J99l62k68N23L85o31
$$ -19 518 19 -594 -107 514 110 -476 -139 321 84 -193 -12 43 -112 55 254 -108 -376 147 532 -99
1802i9m70O34N34n58n50M61M49l36l05K21R5j43J24J09l58j35N44K08o73k82P10
$$ -99 -569 65 599 41 -509 -48 401 65 -240 -19 76 -67 57 166 -192 -327 217 425 -248 -530 180
1823A80L52o68l86N81L72m43k83L02J21j62O8Q2k88l9M79O0o27r6O99J83p24k34
$$ 180 532 -136 -522 59 431 -12 -295 7 128 -34 34 116 -172 -211 268 328 -299 -395 304 487 -237 -471
1845d71O48K36n23k06L79J09k31L8R8k10qL90l6n33J0O41J6o76n0O45P5n59o4
$$ -471 177 413 -110 -316 63 172 -59 -21 77 -133 -141 249 213 -320 -310 331 347 -329 -379 266 341 -218 -282
1868b82M26J6k81Q3J35k10k0L68q2m76R7N66r1n91Q8N71n7n10O5L91o9k82J47
$$ -282 144 160 -121 -38 97 -113 -133 235 153 -323 -226 340 249 -342 -254 317 260 -250 -185 206 137 -145 2
1891BJ50k61j8L33n4m29J10M78j36n06J40M83j38m32J42L34j66k39K25J08k78
$$ 2 152 -109 -127 206 152 -277 -167 311 175 -331 -191 292 154 -278 -136 198 32 -207 18 126 -152
1912a52lL61p1m18J24M55j49m47J64M10j59l34J76K50k09j41K57L1l18M9L84j32
$$ -152 -155 206 135 -283 -159 296 147 -300 -136 274 115 -219 -43 207 -2 -143 114 145 -173 -124 260 128
1934A28m28J64M43j81m30J69L80j67k95J68J87k02n7K40m8k97J40L63k02m15K27
$$ 128 -300 -136 307 126 -304 -135 245 78 -217 -49 138 -64 -121 119 71 -226 -86 277 75 -340 -113
1955a13M54k21m40J98L86j71k70J50J42j44j9J74j09k41K30K98k85l75L20M10
$$ -113 341 120 -320 -122 264 93 -177 -27 115 -29 -48 126 17 -224 6 304 19 -356 -36 374
1975C74l14m14K75L65k12k85J61J48j27jJ23j30j64K71K09l62k74M08L20l96l51
$$ 374 60 -354 -79 286 74 -211 -50 98 -29 -30 93 -37 -201 70 279 -83 -357 51 371 -25 -376
1996c76L44L46k76k81K09J67j34j9P3j25p2K64J21l80j57M31K25m53k69M28K77
$$ -376 -32 314 38 -243 -34 133 -1 -20 53 -72 -144 120 241 -139 -296 135 360 -93 -362 66 343
2017C43l59k37K53J68j68n0Q1q7m7K19M2l52o5M35J08m64j63M60J82l98j60K99
$$ 343 -16 -253 0 168 0 -50 31 -56 -103 116 158 -194 -259 176 284 -180 -343 117 299 -99 -259 40
2039D0J14j86m2J08o1l5J86Jl09K3L81K4m52l0M34P1m14p5L25P5k45k6J53p6n4
$$ 40 154 -32 -74 34 -27 -62 124 125 -184 -161 220 244 -208 -238 196 267 -147 -222 103 178 -67 -93 60 -16 -70
2064g0J46%k51M0L35n2l84L3M08j6l87J0L34j7k49N7J45r5o1J54Pk41N2L03p6
$$ -70 76 76 -175 -135 200 148 -236 -203 205 189 -198 -188 146 129 -120 -63 82 -13 -74 80 87 -154 -102 201 125
2089A25l32P7L53p2l29O7K67p8k08J19J12j41m8J84j9k41P3K79q5l20J05L08r0
$$ 125 -207 -130 223 151 -178 -111 156 78 -130 -11 101 -40 -88 96 77 -164 -91 188 103 -217 -112 196 106
2112A06k87J00K27j04j68J30Q1j61kJ92n4k39R7K77j09k95J23K85j16k54J01K02
$$ 106 -181 -81 146 42 -126 4 85 -76 -78 114 60 -179 -82 195 86 -209 -86 199 83 -171 -70 132
2134A32j11j01J15L6j49M3J95j14k31J42K57j51k86J51K64j24k52J25J67j05q6
$$ 132 21 -80 35 71 -78 -35 160 46 -185 -43 214 63 -223 -72 192 68 -184 -59 108 3 -83
2155h3J06j4j29R6J63j64j95J97K52k11k75K12K67j77k30J50J68j13q2Q7pp9R9
$$ -83 23 9 -120 -24 139 -25 -220 -23 229 18 -257 -45 222 45 -185 -35 133 20 -62 25 18 -61 38
2178C8J02j75j44K29J95k69k26K57K26k28k11J79J50j16r9P7Qn7R4O0j95q2K76
$$ 38 140 -35 -179 50 245 -24 -250 7 233 5 -206 -27 123 7 -92 -15 -7 -64 30 90 -105 -187 89
2201H9J11k95j47L00J76k70j70K09J56j71p1Q4J1l8Q1K3j78j4K38M7l09o8L19
$$ 89 200 -95 -242 58 234 -36 -206 3 159 -12 -83 1 12 -26 55 78 -100 -114 124 171 -138 -206 113
2224A13J02l11j07K68Q4j94n9J11K5o4N5K3j49J7K24k9k75J2K96J6k89l9K63L5
$$ 113 215 -96 -203 65 149 -45 -104 7 32 -32 23 46 -103 -86 138 109 -166 -154 142 158 -131 -170 93 128
2248A28k10j9J39k0o3P5J0j27K2J85l6k43M7K70l0k71J7K52j4k00K9J13l6o7Q0
$$ 128 -82 -101 38 18 -45 30 40 -87 -65 120 84 -159 -112 158 128 -143 -126 126 112 -88 -59 54 18 -49 31
2273C1jj19L2J62n7k03O3K26o9k27N8K20o1j75O4J16o7o0R4lj18N0J60o6j84Q1
$$ 31 30 -89 -57 105 48 -155 -92 134 65 -162 -104 116 55 -120 -56 60 -7 -67 27 24 -94 -44 116 50 -134 -53
2299e3K17r6k09Q0J84o4j47P7P0p5l4J06l7j25N5J64q8j74R9J78r4j84J04J51
$$ -53 164 68 -141 -61 123 59 -88 -11 59 -16 -50 56 19 -106 -51 113 25 -149 -50 128 34 -150 -46 105
2323A05q9j16Q8M7p3pJ12n0j29J01J43j13j72J26J77j17j60R9J42q3j08P8M7o2
$$ 105 16 -100 -12 35 -38 -45 67 17 -112 -11 132 19 -153 -27 150 33 -127 -28 114 31 -77 1 48 -14
2347a4PQ5p1j09J05J27j42j48J54J62j51j52J23J29q2j04O9L2m9K6N7r1o8J36
$$ -14 -7 78 7 -102 3 130 -12 -160 -6 156 5 -147 -24 105 23 -81 -12 20 -29 -3 54 -37 -105 31
2371C1P9j58j07J73J38j69j28J44J13j05r9Q4L8l4PL6p4l3J39M3j76o7J99Q9k08
$$ 31 110 -48 -155 18 156 -13 -141 3 116 11 -88 -4 34 0 7 43 -31 -64 75 118 -58 -125 74 163 -45
2396d5j00J77Q8j39p3Q4L6l8%K0p7KJ20J4j62l1J90M6j92n6J85P0j53n9J14K4
$$ -45 -145 32 120 -19 -92 -8 28 -10 -10 10 -67 -65 55 69 -93 -124 66 112 -80 -136 49 119 -34 -93 21 45
2422D5m7J2Rn3OJ09j1j59J5J83lj87j9J83K1j65j8J09J3o8jK7n3K0Q5m0j22M5
$$ 45 -2 10 19 -34 -28 81 70 -89 -74 109 106 -81 -100 83 104 -61 -79 30 43 -25 -26 1 -52 -32 53 13 -109 -64
2450f4J61l7j78K8J69jj54MJ11qo7M0K4n2J6P7l6j11N8J26m8j53L6J54m6j18K7
$$ -64 97 60 -118 -90 79 78 -76 -72 39 31 -36 4 28 -24 -8 69 33 -78 -20 106 58 -95 -59 95 49 -69 -42
2477d2R3l0n7L8J3n3K7O3m8r5O6J15o4j40O2J44o5j07M6Q4m1o3O5No1L8O2n0r2
$$ -42 51 21 -36 2 15 -38 -11 52 4 -91 -25 90 26 -114 -52 92 27 -80 -34 50 9 -54 11 16 -45 -7 55 5 -87
2506h7O6J22q4j20P2J19o6q8M9P4m2m6N6j6m5L6P5q5r0R7R8r0j18P8J16p5q7O8
$$ -87 -21 101 17 -103 -31 88 22 -66 -17 57 15 -31 25 9 -36 0 75 -10 -100 -3 95 5 -113 -35 81 6 -81 -13
2534a3M0m5j7M8j9m0M8N9p8p5J12P5j03q5R7Q7q0p3O3M8m1k6L4j3l7N6L9r6n6
$$ -13 27 -18 -35 13 -6 -46 2 61 -17 -92 20 95 -8 -93 4 91 11 -62 1 49 8 -18 16 3 -34 22 61 -35 -91
2563i1J10Q1j33p4J08O9q9p2P6M6m7j9L3k3j8O5J9r8j7J20L6j39k8J04O9j02n7
$$ -91 19 100 -33 -107 1 70 -19 -91 -15 31 -16 -35 -2 -25 -43 22 41 -57 -74 46 82 -57 -85 19 88 -14 -71
2590g1R2L3n2k3K8j1%N0pq6j8J21J0j24j5J14L8j15m1Q9K5n9rK9j6pN9k4p9J4
$$ -71 21 54 2 -21 7 -4 -4 46 39 -47 -65 56 66 -58 -73 41 79 -36 -77 12 37 -22 -31 -2 -18 -25 34 10 -69 -55
2620e5R9jj20J5J20nj01k6R5K3o5MK4pjM6k2n9L1Q8m0j08L4J06j1j13OQ1mn9J
$$ -55 44 43 -77 -62 58 53 -48 -74 21 44 -21 -17 7 0 -1 45 23 -36 -5 83 43 -65 -31 75 64 -49 -43 38 34 -25 -24
2651b4L3k6jL2k3n0L3P2m6q9M3J06l0j00K3P1jo0K2L7l3MM0k8m4M4P0n1p6M8P5
$$ -24 9 -17 -18 14 -9 -59 -26 46 0 -89 -46 60 30 -70 -47 24 23 -37 -15 22 -11 -7 33 5 -39 5 75 24 -52 -4 71
2682G1k9r3K7P0k1m5MJ8k2OL5l8l2L5O5n6o0M7P3n1o4L5O6k7m2K3K3l3J7M4n4
$$ 71 42 -51 -24 46 25 -20 -16 2 -20 -14 21 -17 -49 -14 51 -5 -65 -18 55 4 -60 -25 41 14 -28 -5 18 -15 2 46 -8
2713hm0N9M5o4n1N7P1o0n9N3M4k7l5J5Mj2K1K8n5k9O3K4o2m4N7O9p6n5O2L2k8
$$ -8 -48 11 56 -8 -59 -2 69 9 -50 3 47 20 -15 0 4 -8 13 41 -14 -43 20 44 -18 -62 -5 64 -12 -67 -5 27 -1
2744al2K0RrNK3m7j5Q1Qp1k2P1L8p0m1O6M3n3j6K4%rJ7Nm4OO4pp6k0Q4K1o9m5
$$ -1 -33 -13 -4 -13 -8 15 -32 -47 34 42 -29 -51 20 58 -12 -53 13 56 3 -13 11 11 2 19 24 -20 -14 50 43 -33 -53 31 52 -17 -62
2779f2N8L7m9k8L7Oj4Rjl9J3O4qo8pQ9Ko8JO7Pn2j0K2J4j0N%k2ML9lp3PP6kq1
$$ -62 -4 33 -16 -44 -7 -1 -15 -6 -7 -46 -33 31 23 -45 -52 37 39 -29 -28 39 46 -6 -16 6 20 10 15 15 -7 -3 36 33 -40 -33 43 41 -40
2816d0j4P3Mm7j5L6Pj5%Mk1J2M4k0o4L4O0j5p6K3N5Ll9jL0nk7K7ll5L7J9l2m5
$$ -40 -54 19 23 -24 -39 -3 4 -11 -11 -7 -28 -16 28 8 -56 -22 38 23 -53 -30 25 28 -11 -12 18 13 -14 13 10 -25 12 31 -1 -46
2850d6L6N0j1o6K1O3j7n0KL4j3j3J0pj3K1K1k7m7L1N0l5l6J2N4j3m6J5M0k0mj
$$ -46 -10 40 29 -37 -16 47 30 -20 -18 16 3 -10 0 -7 -20 1 22 -5 -52 -21 29 -6 -42 -30 24 11 -35 -20 20 0 -4 -5
2882eRj9K2L0k8l7L6M3m2m7L8L3j3l6J6J8j9kLlk7K2L2n3k1L8M4m7l4K3M1k0l6
$$ -5 4 -15 7 37 9 -28 8 51 9 -38 0 33 20 -16 0 18 -1 -3 0 -3 -30 -8 24 -29 -50 -12 32 -15 -49 -26 15 -5 -41
2915d1K8K7k4LMj3QK9J6n0pM4L6o0l5N1K2l2k1K4J1rpjmoK0Qn4JL7L5o3l0M3L3
$$ -41 -13 14 -10 -7 -3 -16 -8 21 37 -13 -20 24 60 0 -35 16 38 6 -15 9 20 11 4 3 -1 -7 13 21 -33 -32 5 40 -23 -53 -10 23
2951B3m3k4L1J7j8J1Nk4J1L2Jm6%M4J9n4j6N4J3l8j2K1J5j7jnj4PL1pl6oL8J1
$$ 23 -20 -44 -13 4 -14 -3 2 -22 -11 21 22 -24 -24 20 39 -15 -31 23 36 -2 -14 7 22 5 4 -1 -15 -8 23 16 -20 -26 12 23
2985B3m8jM2%k7k0K8jj3J1Nj5LK6k1k2J7M1j2m2nN6Ql7qK8oj3J3jrJ5J5k3k8K5
$$ 23 -25 -26 16 16 -11 -31 -3 -4 -17 -6 -1 -16 -13 13 -8 -30 -13 28 16 -26 -31 25 33 -4 -12 16 10 -3 10 9 0 15 30 7 -21 4
3021DL4k1m5OM9j3k8qJ4J1j8kkj0J8J3j8k5K8J6jl5J2M7j5l3J3K6klnllJ2J5k9
$$ 4 38 17 -28 -22 27 14 -14 -22 -8 3 -15 -17 -19 -29 -11 2 -16 -41 -13 3 2 -33 -21 26 11 -22 -9 17 15 12 7 4 1 13 28 -1
3057alJ6K4k6l4J9K5j0k6RK1j4ormJ3KRk7pK9Rl2j1J9L4j7k6J8J5%j1J0j6MJ6
$$ -1 -4 12 36 10 -24 -5 20 10 -16 -7 14 0 -6 -15 -19 -6 -4 5 -22 -29 0 9 -23 -34 -15 19 2 -24 -6 9 9 -2 8 -8 -4 12
3093A2Nk2jJ8J5l1mJ8J8k3k4J3J9j3rNkkJ2Ll5%K8J0k3j8L3Mj7j4J2K7k0mlJ1
$$ 12 17 -5 -6 12 27 -4 -8 10 28 5 -19 -6 13 0 -9 -4 -6 -8 4 7 -28 -28 0 10 -13 -31 2 6 -11 -25 -13 14 -6 -10 -13 -2
3129bKJ0rrpK8J4l6J1K5Lk6j0J8P%j3r%J9Prk5KJ7Nm1nL5Qk6mJ7jpjKkkJ5lj1
$$ -2 0 10 1 -8 -15 13 27 -9 2 27 30 4 -6 12 19 19 6 -3 -3 16 23 14 -11 -9 8 13 -28 -33 2 10 -16 -20 -3 -4 -11 -12 -10 -12 -14 1 -2 -13
3171a3LL2kk5kK5K2m2nK9Nk1kJ2j5J6lpj5NK0k3j4J1K0qk3oJ6J7k5KJ3KjqJ0k4
$$ -13 -10 22 20 -5 -7 18 40 -2 -7 22 27 6 4 16 1 17 14 7 -8 -3 17 -6 -20 -9 11 3 -20 -26 -10 7 -18 -16 -3 -1 -2 -10 0 -24
3209b4K0J5mk3J5K8j8k2J5K0nk1OLQlnqPLJ0j0k5J8J0j3k1J0J5%rmKojJ4j1Jm
$$ -24 -4 11 7 -16 -1 27 9 -13 2 22 17 -4 2 5 13 10 5 -3 4 7 17 7 -18 0 10 -3 -24 -14 1 1 -8 -12 -10 -16 -17 -3 -14 -13 -17
3248a7Qkj4J4K9k1k0J6J3mqpJ8jMm%oJ1J0k5LK4lj1k0OK1j8rJ0j1MRk0%RKJ6k1
$$ -17 -9 -11 -25 -11 18 -3 -23 -7 6 2 -6 -13 5 4 8 4 4 -2 9 19 -6 -3 21 18 7 -13 -7 14 -4 -13 -3 -14 -10 -1 -21 -21 -12 -10 6 -15
3288a5j1K7Ok1rJ0K5j4j9J5J0MJ2oj8RK1mj7qK0Lk4oJ5J0j5mMNj2J2Lk0LJlj8
$$ -15 -26 1 7 -14 -23 -13 12 -2 -21 -6 4 8 20 14 -4 5 26 22 5 -3 17 20 -4 -10 5 15 0 -4 0 5 -7 5 8 -12 -9 -8 -11 -29
3326b9lL0%j4LPNpPp%NMoqJ2K1lj8kK1Lk0kJ0Llk1NJ2j3J0mkNJ8k2j9LJ5kj8o
$$ -29 -32 -2 -2 -16 -13 -6 -1 -8 -1 -8 -8 -3 1 -5 -13 -1 20 17 -1 -3 18 21 1 -1 9 12 9 -12 -7 5 -8 2 -2 -4 1 19 -3 -22 -19 -4 -6 -24 -30
3369c0L6j3j9J4jJ2pKlqJ8J3j4rJ0J2nj6J1K6j5pnNmlQj7QMQj2j1J2PJk2L%Oj4
$$ -30 6 -7 -26 -12 -13 -1 -8 -6 -9 -17 1 14 0 -9 1 13 8 -8 3 29 14 7 2 7 3 0 8 -9 -1 3 11 -1 -12 0 7 8 -14 -11 -11 -5 -19
3410a9PkmJ0KkrJ2Lmj0J2J9j5j3J0J5%j5J3jkjJ2rkLqJj2J9Mj4j7K4Ok1j4J1R
$$ -19 -12 -14 -18 -8 -6 -8 -17 -5 -2 -6 -16 -4 15 0 -13 -3 12 12 -3 10 9 7 6 18 9 7 10 2 3 -9 10 14 0 -17 7 13 -8 -22 -11 -2
3450brJ2k0NNOlj0LJ3Rj7j1J7J1qj3RR%qOJQJmj2LJJ2k8J2Oj1LnOKmnMoLPqrM
$$ -2 -11 1 -19 -14 -9 -3 -6 -16 -13 0 9 -8 -19 -2 9 1 -12 -3 6 6 -2 4 5 13 14 10 -2 1 2 14 -14 -2 4 -7 -4 -9 -3 -1 -5 -10 -6 -12 -9 -2 -10 -19 -15
3497a5J3lk1J5J3knpPJ3j5jJLMRrj0J6KJ6k6PNrRk2PLmpJ0nPJmj8PRnrJLKn%J6
$$ -15 -2 -5 -26 -11 2 0 -5 -12 -5 8 -7 -8 -7 -4 0 9 0 -10 6 8 24 -2 5 10 1 10 -12 -5 -2 -6 -13 -3 -8 -1 0 -4 -22 -15 -6 -11 -20 -19 -16 -14 -19 -19 -3
3544cmRj3KQJ5j1KoK2pqj6J3%LpNmOonPolNk1K1oJ%j2KJ4jj4lJ5llQomJ3Jk3O
$$ -3 -7 2 -11 -9 -1 14 3 5 -1 21 14 6 -10 3 3 6 -1 4 0 6 0 -5 2 -4 -7 -2 -23 -2 -8 -7 -7 -19 -17 -3 -4 -18 -21 -6 -9 -12 -4 -10 -14 -1 0 -23 -17
3591a7K0Nj8QLRloRrQmJ1lo%j1KmNojpLKNqkj2K1qkP%Rmj9JK2mkmJ9%j2nLJ4r
$$ -17 3 8 -10 -2 1 10 7 1 10 1 9 5 16 13 7 7 -4 -2 -6 -1 -7 -8 -15 -12 -10 -5 -13 -15 -27 -6 -14 -16 -9 -9 0 -4 -23 -22 0 -4 -6 -10 9 9 -3 -8 -5 9 0
3640@lOK%Pjj5J2NoqpJ0okomRlJnLj0QrJ5j3K1m%%LlKOqJ4l%%rJ0nJjlJ0mj0J2
$$ 0 -3 3 5 5 12 11 -4 8 13 7 -1 -8 2 -4 -6 -12 -16 -7 -10 -9 -14 -11 -21 -13 -22 -7 -20 1 -3 -3 -3 0 -3 -1 5 -3 11 8 8 8 -1 9 4 5 4 1 11 7 -3 9
3690InKj5JMlRr%K%j1lLPRj2rJ6kknJ6j0J6o%J1j0jLmQQqlrJ1rRk1J1LLlj5J8
$$ 9 4 6 -9 -8 -4 -7 2 -7 -7 -5 -5 -16 -19 -16 -9 0 -12 -21 -5 -7 -9 -14 2 -8 8 2 2 13 3 2 5 1 9 17 9 6 -3 8 -1 8 -13 -2 1 4 1 -14 4
3737DrmKnOj%koqK2Kj5OJMolJ5l%J0k2MJ4Qqj0J8j0kkN%kkjJ0rPj2mPkLr%JOj3
$$ 4 -5 -9 -7 -12 -6 -7 -7 -9 -15 -23 -1 1 -14 -8 -7 -3 -9 -12 3 0 0 10 -12 -8 6 14 6 -4 14 4 2 0 5 5 3 1 0 10 1 8 -4 -8 -1 -3 0 -9 -9 -8 -2 -15
3787a5qPJ1rJN%PkNknQJ1rjOmOj2QJ1nj0mMpNJnoK2rj4NJ1j5%nQjpmqJ2LNmQ%
$$ -15 -23 -16 -5 -14 -13 -8 -8 -1 -3 2 0 -5 3 14 5 4 10 6 12 0 8 19 14 4 0 4 -3 2 3 -2 -8 14 5 -9 -4 7 -8 -8 -13 -5 -6 -13 -17 -25 -13 -10 -5 -9 -1 -1
3837aLooOJ3Kj3J0J3j7J5qrJ2j1NJnOnpoQlLkJKqkJLj0%mJ4jkNLj1KjJ3j6J9o
$$ -1 2 -4 -10 -4 9 11 -2 8 21 4 19 11 2 14 3 8 9 4 10 5 -2 -8 0 -3 0 -2 -1 1 -7 -9 -8 -5 -15 -15 -19 -5 -6 -8 -3 0 -11 -9 -10 3 -13 6 0
3884@mJ1KrJ1NlJQ%rkLj4MNj0K%qJmJ%%JJ3j5jKJoQqKMmKJ3%%j1J1J4k0NkPjN
$$ 0 -4 7 9 0 11 16 13 14 22 22 13 11 14 0 4 9 -1 1 1 -7 -6 -10 -9 -9 -9 -8 5 -10 -11 -9 -8 -14 -6 -14 -12 -8 -12 -10 3 3 3 -8 3 17 -3 2 0 7 6 11
3934A1lNkrJ1j5J2j5PoQpkjlnJ3j3LnJ2qJJj1J4ljQ%jNj1OJ0KpPljJM%mJ0rLJ
$$ 11 8 13 11 2 13 -2 10 -5 2 -4 4 -3 -5 -6 -9 -14 -1 -14 -11 -16 -4 -12 -11 -10 -21 -7 -10 -11 -3 -3 -4 1 -10 -4 6 8 1 8 5 4 5 9 9 5 15 6 9 10
3982A0nJ0pj5LPmj1mKkJ0Kj0jJ9jrkLOrJMLKoOjO%joJ3rJnNnJ0j1J9pqLmkpMK
$$ 10 5 15 8 -7 -4 3 -1 -12 -16 -14 -16 -6 -4 -14 -15 4 3 -6 -8 -5 1 -8 -7 -3 0 2 -4 2 1 7 7 6 0 13 4 5 0 5 0 10 -1 18 11 3 6 2 0 -7 -3 -1
4032anLkl%mJ4qj1OP%mmJ0j1J1LqJ4lLPj2LoJ3j0K2k4RLmqkQjkmljPj0pkJ0j3
$$ -1 -6 -3 -5 -8 -8 -12 2 -6 -17 -11 -4 -4 -8 -12 -2 -13 -2 1 -7 7 4 7 14 2 5 -1 12 2 24 0 9 12 8 0 -2 6 5 3 -1 -4 -5 2 -8 -15 -17 -7 -20
4079b0J1noJ1nJ2QlqpkJ0J1Lj%pKKNjnRj4QlJ3k3J1rJ3oNj1oRMj0jnJ2opLlNM
$$ -20 -9 -14 -20 -9 -14 -2 6 3 -5 -12 -14 -4 7 10 9 9 2 4 6 11 10 5 14 0 8 5 18 -5 6 -3 10 4 9 -2 -8 1 5 -5 -6 -11 1 -5 -12 -9 -12 -7 -3
4126cJpPmpNKJ1rJ3Jj4J6oKNjLmqJ3ppmJ3lJ%kj1NLj1JnOKpj0J8r%LnLmQJMj0
$$ -3 -2 -9 -2 -6 -13 -8 -6 5 -4 9 10 -4 12 6 8 13 12 15 11 3 16 9 2 -2 11 8 9 9 7 -4 1 4 -7 -6 -11 -5 -3 -10 -20 -2 -11 -11 -8 -13 -10 -14 -6 -5 -1 -11
4176a1NJ1kLlQj3J0omJ9j3MNlj2nMJ0j5J6oj5KKJJlkjnJ6plLQqOMoJmJ3oRj4J2
$$ -11 -6 5 3 6 3 11 -2 8 2 -2 17 4 8 13 10 -2 -7 -3 7 -8 8 2 -13 -11 -9 -8 -7 -10 -12 -13 -18 -2 -9 -12 -9 -1 -9 -3 1 -5 -4 -8 5 -1 8 -6 6
4223FNjkKNmkjnlNJqmkLPj1LNJj1JKqjnJ0LKj3LJ0MMj2RomJ1Nj2jK1omnOlNKq
$$ 6 11 10 8 10 15 11 9 8 3 0 5 6 -2 -6 -8 -5 2 -9 -6 -1 0 -11 -10 -8 -16 -17 -22 -12 -9 -7 -20 -17 -7 -3 1 -11 -2 -8 -12 -1 4 -8 -9 12 6 2 -3 3 0 5 7 -1
4275aJ0j0Pk1K%PLmmqNJLKnooJ2KjRjKqQNJMmlKjJ0j0J1%%oJjrLlOpr%KOjrQL
$$ -1 9 -1 6 -15 -13 -13 -6 -3 -7 -11 -19 -14 -13 -10 -8 -13 -19 -25 -13 -11 -12 -3 -4 -2 -10 -2 3 4 8 4 1 3 2 12 2 13 13 13 7 8 7 -2 1 -2 4 -3 -12 -12 -10 -4 -5 -14 -6 -3
4329cookMj2J2lNOQojlRp%MNJKoNKnmLJ0nOj5J0jmplMnMmJnJ0oqLmLJ0JlMmkk
$$ -3 -9 -15 -17 -13 -25 -13 -16 -11 -5 3 -3 -4 -7 2 -5 -5 -1 4 5 7 1 6 8 3 -1 2 12 7 13 -2 8 7 3 -4 -7 -3 -8 -4 -8 -7 -12 -2 -8 -16 -13 -17 -14 -4 -3 -6 -2 -6 -8 -10
4383a0J1qLkMOkL%Onj2J3%NjpJJoQj8QrRloKqNNjj3J0nKJ2p%oQljNRm%QmOJpJ2
$$ -10 1 -7 -4 -6 -2 4 2 5 5 11 6 -6 7 7 12 11 4 5 6 0 8 -10 -2 -11 -2 -5 -11 -9 -17 -12 -7 -8 -21 -11 -16 -14 -2 -9 -9 -15 -7 -10 -11 -6 3 -1 -1 7 3 9 10 3 15
4436A5rnLQk1K0j4J2Nj4oJj4J2JJnnJ0lmKQoJnJ4%JqRnQNj0OkQlJqKJ3j6MqjP
$$ 15 6 1 4 12 -9 11 -3 9 14 0 -6 -5 -19 -7 -6 -5 -10 -15 -5 -8 -12 -10 -2 -8 -7 -12 2 2 3 -5 4 -1 7 12 2 8 6 14 11 12 4 6 19 3 7 -1 -2 5
4484E%qKKj2OkOrKOnn%J2rl%PkKnOKnJJ1pJ0Qj4ROrRj3nLJ2okKMpkLqojKjLKk
$$ 5 5 -3 -1 1 -11 -5 -7 -1 -10 -8 -2 -7 -12 -12 0 -9 -12 -12 -5 -7 -5 -10 -4 -2 -7 -6 5 -2 8 16 2 11 17 8 17 4 -1 2 14 8 6 8 12 5 3 6 -2 -8 -9 -7 -8 -5 -3 -5
4538ej4J5jj5J1QrM%lMjOllMMQj1J1KjJm%lkOj5J1Oj1Jkj6J4nNj4PQj5Rj7J5M
$$ -5 -19 -4 -5 -20 -9 -1 -10 -6 -6 -9 -5 -6 0 -3 -6 -2 2 10 -1 10 12 11 12 8 8 5 3 9 -6 5 11 0 1 -1 -17 -3 -8 -3 -17 -10 -2 -17 -8 -25 -10 -6
4584fjj0MlPK%oJ0pMJ2loMOKqkJ5nqJ3lj6LOlpNJpklJ0jqJ3j4nNLnLKJ2npjQm
$$ -6 -7 -17 -13 -16 -9 -7 -7 -13 -3 -10 -6 6 3 -3 1 7 9 1 -1 14 9 1 14 11 -5 -2 4 1 -6 -1 0 -7 -9 -12 -2 -3 -11 2 -12 -17 -12 -9 -14 -11 -9 3 -2 -9 -10 -2 -6
4635fJ4j0NJ0j8LPJ4qjmPPj8OojLrJ3k2J4MrnMMqQq%mKkMKMNp%PqPNKj6J3RpN
$$ -6 8 -2 3 13 -5 -2 5 19 11 10 6 13 20 2 8 2 1 4 -5 8 -14 0 4 -5 -10 -6 -2 -10 -2 -10 -10 -14 -12 -14 -10 -8 -4 1 -6 -6 1 -7 0 5 7 -9 4 13 6 11
4685A1mljJ1pkKMj2MoKj0nMLN%llKjj1J4Pj0jLmQqNQJk%OkJOoj1J5PpKj0OKpp
$$ 11 7 4 3 14 7 5 7 11 -1 3 -3 -1 -11 -16 -12 -9 -4 -4 -7 -10 -8 -9 -20 -6 1 -9 -10 -7 -11 -3 -11 -6 2 3 1 1 7 5 6 12 6 -5 10 17 10 12 2 8 10 3 -4
4736dKlPrmJ0j0lKkMLmoQpJ4rQpJOmkJ1Nj7J5KoJ3np%kKOJj0J0qNJj2JM%orP%
$$ -4 -2 -5 2 -7 -11 -1 -11 -14 -12 -14 -10 -7 -11 -17 -9 -16 -2 -11 -3 -10 -9 -3 -7 -9 2 7 -10 5 7 1 14 9 2 2 0 2 8 9 -1 9 1 6 7 -5 -4 0 0 -6 -15 -8 -8
4787hj4NQlnJJ3j2N%lNNjkKJ2klM%LrKOJlJkkoqLMLj1Kjjj%MorQJ1j5J0lRj7R
$$ -8 -22 -17 -9 -12 -17 -16 -3 -15 -10 -10 -13 -8 -3 -4 -6 -4 8 6 3 7 7 10 1 3 9 10 7 8 6 4 -2 -10 -7 -3 0 -11 -9 -10 -11 -12 -12 -8 -14 -23 -15 -4 -19 -9 -12 -3 -20 -11
4839a1kQ%OKKNpKMMj8J3j2J0%%KmjJ1lo%oj1K2j3JmlNnKlmNQj6J1jKj4OJ0rJ6
$$ -11 -13 -5 -5 1 3 5 10 3 5 9 13 -5 8 -4 6 6 6 8 4 3 14 11 5 5 -1 -12 10 -3 -2 -6 -9 -4 -9 -7 -10 -14 -9 -1 -17 -6 -7 -5 -19 -13 -3 -12 4
4886DqLjkjJ3qJ0pNJkKqJjjKqNmOqjPrj2kNJJ2j6RjMJ2j7LQJ3pOpLqLJQoNkPm
$$ 4 -4 -1 -2 -4 -5 8 0 10 3 8 9 7 9 1 2 1 0 2 -6 -1 -5 1 -7 -8 -1 -10 -22 -24 -19 -18 -6 -22 -13 -14 -10 2 -15 -12 -4 9 2 8 1 4 -4 -1 0 8 2 7 5 12 8
4939HNkrrJ1kjokRj2LjJmj1NNjJpL%NnQmkJ0J1j1lJNMqJ6j0NPokkJ1k3ONrJj0
$$ 8 13 11 2 -7 4 2 1 -5 -7 2 -10 -7 -8 -7 -11 -22 -17 -12 -13 -12 -19 -16 -16 -11 -16 -8 -12 -14 -4 7 -4 -7 -6 -1 3 -5 11 1 6 13 7 5 3 14 -9 -3 2 -7 -6 -16
4989a6K1j2Nj2NOrmlLklOmJjJ1Mj1J3mLjpRkqJ1JmOPj3J6qNj2JNMrKkJ%oNj3M
$$ -16 5 -7 -2 -14 -9 -3 -12 -16 -19 -16 -18 -21 -15 -19 -18 -19 -8 -4 -15 -2 -6 -3 -4 -11 -2 -4 -12 -1 0 -4 2 9 -4 12 4 9 -3 -2 3 7 -2 0 -2 -1 -1 -7 -2 -15 -11
5038a1o%oJ1Qj6PLJjOLlLlJ%jnJ0jQnKmMmkNljKJ0j3knj%oNNj1lJ4qNj3NjMmJ3
$$ -11 -17 -17 -23 -12 -4 -20 -13 -10 -9 -10 -4 -1 -4 -1 -4 -3 -3 -4 -9 1 0 8 3 5 1 5 1 -1 4 1 0 2 12 -1 -3 -8 -9 -9 -15 -10 -5 -16 -19 -5 -13 -8 -21 -16 -17 -13 -17 -4
5090dnmONK%jLJ4q%Lo%%j5J0MnNlkolQJ0nj8J2%mrL%KlqJ0llPqkK0nj2J1NnjJ2
$$ -4 -9 -13 -7 -2 0 0 -1 2 16 8 8 11 5 5 5 -10 0 4 -1 4 1 -1 -7 -10 -2 8 3 -15 -3 -3 -7 -16 -13 -13 -11 -14 -22 -12 -15 -18 -11 -19 -21 -1 -6 -18 -7 -2 -7 -8 4
5141Dm%kNlJ0j7J4Pj5MPnj1NoQoPj9Nlj0J2J0j1NLmpQOM%Qj4lNjjK%J0nkRqJ1
$$ 4 0 0 -2 3 0 10 -7 7 14 -1 3 10 5 -6 -1 -7 1 -5 2 -17 -12 -15 -25 -13 -3 -14 -9 -6 -10 -17 -9 -3 1 1 9 -5 -8 -3 -4 -5 -3 -3 7 2 0 9 1 12
5189A2Qj1%pQqPjjj4kQrOrMpOmMkJjLLpLpJ1nJ1kQLrNLkOnoNkPj4O%kJ%J0j0q
$$ 12 20 9 9 2 10 2 9 8 7 -7 -9 -1 -10 -4 -13 -9 -16 -10 -14 -10 -12 -11 -12 -9 -6 -13 -10 -17 -6 -11 0 -2 6 9 0 5 8 6 12 7 1 6 4 11 -3 3 3 1 2 2 12 2 -6
5242fkmPnR%nqjLPOj0PqkPlnJ6MpjRLllOoQj4%Op%JOJn%qPmPj5lQj2Qj2PkKoK
$$ -6 -8 -12 -5 -10 -1 -1 -6 -14 -15 -12 -5 1 -9 -2 -10 -12 -5 -8 -13 3 7 0 -1 8 11 8 5 11 5 13 -1 -1 5 -2 -2 -1 5 6 1 1 -7 0 -4 3 -12 -15 -7 -19 -11 -23 -16 -18 -16 -22 -20
5297b0NNj3K2j3J3Lj2OQlkJ0qlJ2mj5OLMNroOjNmqJ0jj1n%Rj3J4rKLoRMrJlPj
$$ -20 -15 -10 -23 -1 -14 -1 2 -10 -4 4 1 -1 9 1 -2 10 6 -9 -3 0 4 9 0 -6 0 -1 4 0 -8 2 1 -10 -15 -15 -6 -19 -5 -14 -12 -9 -15 -6 -2 -11 -10 -13 -6 -7
5345gkoKJ0jNNNklLpOlmkNLnkm%kkRnjlKrpJ7j5J8j7J5j4J0R%njnPJOPknnNQo
$$ -7 -9 -15 -13 -3 -4 1 6 11 9 6 9 2 8 5 1 -1 4 7 2 0 -4 -4 -6 -8 1 -4 -5 -8 -6 -15 -22 -5 -20 -2 -19 -4 -18 -8 1 1 -4 -5 -10 -3 -2 4 11 9 4 -1 4 12 6
5398Fj0J0Mkj2Pl%JnmJKN%nKnljpkkLK0j2%J1lMrJ6kkKMoQ%kpJ6%Jj6lPqLoNk
$$ 6 -4 6 10 8 -4 3 0 0 1 -4 -8 -7 -5 0 0 -5 -3 -8 -11 -12 -19 -21 -23 -20 0 -12 -12 -1 -4 0 -9 7 5 3 5 9 3 11 11 9 2 18 18 19 3 0 7 -1 2 -4 1 -1
5450amPJrjqRmOj6NJ3pOjj1JOLlQJloJ0OrMjOj2J6j6RMpnOJ0j4nkO%Lnj6MJ1m
$$ -1 -5 2 3 -6 -7 -15 -6 -10 -4 -20 -15 -2 -9 -3 -4 -15 -14 -8 -5 -8 0 1 -2 -8 2 8 -1 3 2 8 -4 12 -4 5 9 2 -3 3 13 -1 -6 -8 -2 -2 1 -4 -20 -16 -5 -9
5500ikQrlLLQj2JlJ2Qj8OOkKjkJMjlJ0l%LmMrNrPlmRj4MoOJKj1MKjJoKOKOOj1
$$ -9 -11 -3 -12 -15 -12 -9 -1 -13 -12 -15 -3 5 -13 -7 -1 -3 -1 -2 -4 -3 1 0 -3 7 4 4 7 3 7 -2 3 -6 1 -2 -6 3 -11 -7 -13 -7 -6 -4 -15 -11 -9 -10 -9 -15 -13 -7 -5 1 7 -4
5554dkQjN%JmkOjPm%JplNmJjnMj5J3j9J7nJm%nKLJ0jj2OqRkJJ0kjMNjkQqQj1J
$$ -4 -6 2 1 6 6 7 3 1 7 6 13 9 9 10 3 0 5 1 2 1 -4 0 -15 -2 -21 -4 -9 -8 -12 -12 -17 -15 -12 -2 -3 -15 -9 -17 -8 -10 -9 1 -1 -2 2 7 6 4 12 4 12 1 2
5607BNJ8j7KokPj4KpPoJlkK%NpMNmMj3NnJ5llNNqLJJ3qOlnLPj1K%OJo%Lj1MJ0
$$ 2 7 25 8 10 4 2 9 -5 -3 -10 -3 -9 -8 -11 -13 -11 -11 -6 -13 -9 -4 -8 -4 -17 -12 -17 -2 -5 -8 -3 2 -6 -3 -2 11 3 9 6 1 4 11 0 2 2 8 9 3 3 6 -5 -1 9
5659Ij4Nj4J2lknJPpJ3npKLj1jJ4KqKJ0jmlJ0J0on%J2oqPLoonJ0jj3R%LjrnqO
$$ 9 -5 0 -14 -2 -5 -7 -12 -11 -4 -11 2 -3 -10 -8 -5 -16 -17 -3 -1 -9 -7 3 2 -2 -5 5 15 9 4 4 16 10 2 9 12 6 0 -5 5 4 -9 0 0 3 2 -7 -12 -20 -14
5708a4jMLoLJpLkRmJ0qL%kkOJJ1nOJj0LkpMKlJ1rRj3%nqQkpOOj0NNqjknNJ1oj
$$ -14 -15 -11 -8 -14 -11 -10 -17 -14 -16 -7 -11 -1 -9 -6 -6 -8 -10 -4 -3 8 3 9 10 0 3 1 -6 -2 0 -3 8 -1 8 -5 -5 -10 -18 -10 -12 -19 -13 -7 -17 -12 -7 -15 -16 -18 -23 -18 -7 -13 -14
5761a4P%J7k0J6oLkPjkJ0Klrj0KJ6k4NkOjJj4NMj0MjpPJ%Oj3LQmrJ4nkQNlKjK
$$ -14 -7 -7 10 -10 6 0 3 1 8 7 5 15 17 14 5 -5 -3 13 -11 -6 -8 -2 -3 -2 -16 -11 -7 -17 -13 -14 -21 -14 -13 -13 -7 -20 -17 -9 -13 -22 -8 -13 -15 -7 -2 -5 -3 -4 -2
5810bRnQnmJJJ3qkmmNKrKJ1j0j2Mj4K7k6PJkmlPkRmL%Njj2J5MmOj3%J4rQKOmJ
$$ -2 7 2 10 5 1 2 3 16 8 6 2 -2 3 5 -4 -2 9 -1 -13 -9 -23 4 -22 -15 -14 -16 -20 -23 -16 -18 -9 -13 -10 -10 -5 -6 -18 -3 1 -3 3 -10 -10 4 -5 3 5 11 7 8
5860HqmNQj3MLmn%mkOrj0J4%j5J4oJ0mMJKj0J4qJjROJ0k0ONMqQlkKnQj3kQkjj0
$$ 8 0 -4 1 9 -4 0 3 -1 -6 -6 -10 -12 -6 -15 -25 -11 -11 -26 -12 -18 -8 -12 -8 -7 -5 -15 -1 -9 -8 -9 0 6 16 -4 2 7 11 3 11 8 6 8 3 11 -2 -4 4 2 1 -9
5910iJMqKKj2J0mPnklLQmlpJ0MJ3mjmPjpRMLkqQOokj1J3j5MQolpLKjj0MmPjj%
$$ -9 -8 -4 -12 -10 -8 -20 -10 -14 -7 -12 -14 -17 -14 -6 -10 -13 -20 -10 -6 7 3 2 -2 5 4 -3 6 10 13 11 3 11 17 11 9 -2 11 -4 0 8 2 -1 -8 -5 -3 -4 -14 -10 -14 -7 -8 -9 -9
5963ij0OJ2j3J1pNnpPRMKok%PMoPjlmRj3J0ojknjN%qmpOMlJj1RJjnJ4j6RMrJ8
$$ -9 -19 -13 -1 -14 -3 -10 -5 -10 -17 -10 -1 3 5 -1 -3 -3 4 8 2 9 8 5 1 10 -3 7 1 0 -2 -7 -8 -3 -3 -11 -15 -22 -16 -12 -15 -14 -25 -16 -15 -16 -21 -7 -23 -14 -10 -19 -1
6014aj2PKQRj7nJ8j2RqmkJ0OpnqjJ0LKj1KqolONjNopQQoMJLoj0J4Oj4oJ9JQkn
$$ -1 -13 -6 -4 4 13 -4 -9 9 -3 6 -2 -6 -8 2 8 1 -4 -12 -13 -3 0 2 -9 -7 -15 -21 -24 -18 -13 -14 -9 -15 -22 -14 -6 -12 -8 -7 -4 -10 -20 -6 0 -14 -20 -1 0 8 6 1
6064A%KjJjKJLj0Lp%J3j5Qj0KoRp%NKooJ3j2M%KNrO%JLQmoLMKQmKnNpqJ2mMnm
$$ 1 1 3 2 3 2 4 5 8 -2 1 -6 -6 7 -8 0 -10 -8 -14 -5 -12 -12 -7 -5 -11 -17 -4 -16 -12 -12 -10 -5 -14 -8 -8 -7 -4 4 0 -6 -3 1 3 11 7 9 4 9 2 -6 6 2 6 1 -3
6118cKj0J5j7QoJ3nj3RlpkJ0LqJ8mpjmMmJ6nkJ7j3J4j5RnmJ7Jj0jqjJ0rJJ1qO
$$ -3 -1 -11 4 -13 -5 -11 2 -3 -16 -7 -10 -17 -19 -9 -6 -14 4 0 -7 -8 -12 -8 -12 4 -1 -3 14 1 15 0 9 4 0 17 18 8 7 -1 -2 8 -1 0 11 3 9
6163Ij2lPj6QnJ3j7LNj0kJ1LJPjmkljLNLRoj1RmJNRj3%lMjKrPlrllQj%kJpkMk
$$ 9 -3 -6 1 -15 -7 -12 1 -16 -13 -8 -18 -20 -9 -6 -5 2 1 -3 -5 -8 -9 -6 -1 2 11 5 -6 3 -1 0 5 14 1 1 -2 2 1 3 -6 1 -2 -11 -14 -17 -9 -10 -10 -12 -11 -18 -20 -16 -18
6216a8NRJopJ8j3LJ0Kj1K2pp%mN%JLKoLqJ3j8LoOLj3kJ1pJ0nJKpLlk%nJ1kOln
$$ -18 -13 -4 -3 -9 -16 2 -11 -8 2 4 -7 15 8 1 1 -3 2 2 3 6 8 2 5 -3 10 -8 -5 -11 -5 -2 -15 -17 -6 -13 -3 -8 -7 -5 -12 -9 -12 -14 -14 -19 -8 -10 -4 -7 -12
6265a2JOknQRj0J3nknPOnKlmJPmqn%nQqR%%rLNj0lQnJPnQkoOOmLJ4qOqnQrRKn
$$ -12 -11 -5 -7 -12 -4 5 -5 8 3 1 -4 3 9 4 6 3 -1 0 7 3 -5 -10 -10 -15 -7 -15 -6 -6 -6 -15 -12 -7 -17 -20 -12 -17 -16 -9 -14 -6 -8 -14 -8 -2 -6 -3 11 3 9 1 -4 4 -5 4 6 1
6321AOkmjnlKKoQj5LRok%Qjj2J4j0NjkMKjNJKkNj2J2mLj0J3lKmNKjrp%J1j3JM
$$ 1 7 5 1 0 -5 -8 -6 -4 -10 -2 -17 -14 -5 -11 -13 -13 -5 -6 -18 -4 -14 -9 -10 -12 -8 -6 -7 -2 -1 1 -1 4 -8 4 0 3 -7 6 3 5 1 6 8 7 -2 -9 -9 2 -11 -10 -6
6372fMr%%rOnJ0rMKPnomPJMoJ8pJPlkPpPNj4MNnKmpljMKjOk0J2qRJlK%oJQk1J1
$$ -6 -2 -11 -11 -11 -20 -14 -19 -9 -18 -14 -12 -5 -10 -16 -20 -13 -12 -8 -14 4 -3 -2 5 2 0 7 0 7 12 -2 2 7 2 4 0 -7 -10 -11 -7 -5 -6 0 -20 -8 -16 -7 -6 -9 -7 -7 -13 -12 -4 -25 -14
6427a4MkjOMJJ1j6J0Pj3NLJqJ5j3Qkj0KJ0qMqrQKmJr%lkJ2pj3PQ%%KNmLQojJ4
$$ -14 -10 -12 -13 -7 -3 -2 9 -7 3 10 -3 2 5 6 -2 13 0 8 6 -4 -2 8 0 4 -4 -13 -5 -3 -7 -6 -15 -15 -18 -20 -8 -15 -28 -21 -13 -13 -13 -11 -6 -10 -7 1 -5 -6 8
6476HrPlRrKLKmkPj0pRjlKm%Qj4nRoO%j3%J0pPqPkj0nK1LlnJJ3j0LKLJ1j3J1o
$$ 8 -1 6 3 12 3 5 8 10 6 4 11 1 -6 3 2 -1 1 -3 -3 5 -9 -14 -5 -11 -5 -5 -18 -18 -8 -15 -8 -16 -9 -11 -21 -26 -5 -2 -5 -10 -9 4 -6 -3 -1 2 13 0 11 5
6526ENKKrLqKLjj0Jn%Rj1nLKj0LlN%kO%JnJ4pKPj4J0JjLRqOlMjmj0MJ0lMojro
$$ 5 10 12 14 5 8 0 2 5 4 -6 -5 -10 -10 -1 -12 -17 -14 -12 -22 -19 -22 -17 -17 -19 -13 -13 -12 -17 -3 -10 -8 -1 -15 -5 -4 -5 -2 7 -1 5 2 6 5 1 -9 -5 5 2 6 0 -1 -10 -16
6579a6R%%Lnl%rJ1MqkMm%J5j2NKLkqJ5Lj6J4Kj3J1J1j5J3lrRljj0MkkLkLj1mR
$$ -16 -7 -7 -7 -4 -9 -12 -12 -21 -10 -6 -14 -16 -12 -16 -16 -1 -13 -8 -6 -3 -5 -13 2 5 -11 3 5 -8 3 14 -1 12 9 0 9 6 5 -5 -1 -3 -5 -2 -4 -1 -12 -16 -7
6626golnJ8ollPnOKJ0j5ROj0J4j7J0KmPjmmMLLnnRJj3%kJ1Nk2QqjRJj0kRlpRn
$$ -7 -13 -16 -21 -3 -9 -12 -15 -8 -13 -7 -5 5 -10 -1 5 -5 9 -8 2 4 0 7 6 2 -2 2 5 8 3 -2 7 8 -5 -5 -7 4 9 -13 -5 -13 -14 -5 -4 -14 -16 -7 -10 -17 -8 -13
6676a3jJ5j7MNJ0j3MJ%J%OOj5ONkkJ0Jj3oJ0Jmkm%Lj8QJLPj0QrKlJLmOolJ2J2
$$ -13 -14 1 -16 -12 -7 3 -10 -6 -5 -5 -4 -4 2 8 -7 -1 4 2 0 10 11 -2 -8 2 3 -1 -3 -7 -7 -4 -22 -14 -13 -10 -3 -13 -5 -14 -12 -15 -14 -11 -15 -9 -15 -18 -6 6
6724Fj0nMQmKJJ0Nj0%%KklmJJkKOj0mjj%rJ0j0kONnJ6j2lJ%kkJ4plJ1nJ2j7K1
$$ 6 -4 -9 -5 3 -1 1 2 12 17 7 7 7 9 7 4 0 1 2 0 2 8 -2 -6 -7 -8 -8 -17 -7 -17 -19 -13 -8 -13 3 -9 -12 -11 -11 -13 -15 -1 -8 -11 0 -5 7 -10 11
6772A1j0NlNqONkoj2OJ5lqqk%JNpmjPMj1mJ0oqRNqJLMMpJ4Oj0PlM%ojKJOj0mO
$$ 11 1 6 3 8 0 6 11 9 3 -9 -3 12 9 1 -7 -9 -9 -8 -3 -10 -14 -15 -8 -4 -15 -19 -9 -15 -23 -14 -9 -17 -16 -13 -9 -5 -12 2 8 -2 5 2 6 6 0 -1 1 2 8 -2 -6 0
6824@mjkRjpJ0nprMQrnLlMPJkLPpMqmJ5kJ0nmJ1lNqNpOoOj4PMjKKmqJjnjlPLj0
$$ 0 -4 -5 -7 2 1 -6 4 -1 -8 -17 -13 -5 -14 -19 -16 -19 -15 -8 -7 -9 -6 1 -6 -2 -10 -14 1 -1 9 4 0 11 8 13 5 10 3 9 3 9 -5 2 6 5 7 9 5 -3 -2 -3 -8 -9 -12 -5 -2 -12
6880a2K%OLLk0J6kKnQmoJ3jmJ0pPnJ0rJ6j7JPo%kjKrkkJlNmkKqMlQJj1rJ2%Pj0
$$ -12 -10 -10 -4 -1 2 -18 -2 -4 -2 -7 1 -3 -9 4 3 -1 9 2 9 4 14 5 21 4 5 12 6 6 4 3 5 -4 -6 -8 -7 -10 -5 -9 -11 -9 -17 -13 -16 -8 -7 -18 -27 -15 -15 -8 -18
6931a8J2oJ8nnjPMmJQKj0OJnlKjNljrNJ0j7NNj0lj2J0MKoLkJ0oJ0j2KJ2Mj1Lp
$$ -18 -6 -12 6 1 -4 -5 2 6 2 3 11 13 3 9 10 5 2 4 3 8 5 4 -5 0 10 -7 -2 3 -7 -10 -22 -12 -8 -6 -12 -9 -11 -1 -7 3 -9 -7 5 9 -2 1 -6
6978fMONjMloJ2j0OpOQj3Pj4MjnlQlpJ0rkJoNkJ0%qKOpjMLmJ1Oj6J7j7J3JOqm
$$ -6 -2 4 9 8 12 9 3 15 5 11 4 10 18 5 12 -2 2 1 -4 -7 1 -2 -9 1 -8 -10 -9 -15 -10 -12 -2 -2 -10 -8 -2 -9 -10 -6 -3 -7 4 10 -6 11 -6 7 8 14 6 2
7028BKpLO%%oPQk0%Nk%olNqMOj3MJjKOrJ3jjkQj4QNJjjMjkLlMjqP%Pj6Mo%MjN
$$ 2 4 -3 0 6 6 6 0 7 15 -5 -5 0 -2 -2 -8 -11 -6 -14 -10 -4 -17 -13 -12 -13 -11 -5 -14 -1 -2 -3 -5 3 -11 -3 2 3 2 1 5 4 2 5 2 6 5 -3 4 4 11 -5 -1 -7 -7 -3 -4 1
7084Aj%j0%%JonNQNj0jQJpJ9j1jMKJ3j1J1mqOQqnQj1QKj5J2nrLjQqj2QolMjKK
$$ 1 0 0 -10 -10 -10 -9 -15 -20 -15 -7 -2 -12 -13 -5 -4 -11 8 -3 -4 0 2 15 4 15 11 3 9 17 9 4 12 1 9 11 -4 8 3 -6 -3 -4 4 -4 -16 -8 -14 -17 -13 -14 -12 -10
7134a0OqKkLMmOMrJ7jnjJj%OKj5LOKqPokkJ3j4PoqPLj6PkLNj0J4jqlJ0nJ1j0M
$$ -10 -4 -12 -10 -12 -9 -5 -9 -3 1 -8 9 8 3 2 3 2 2 8 10 -5 -2 4 6 -2 5 -1 -3 -5 8 -6 1 -5 -13 -6 -3 -19 -12 -14 -11 -6 -16 -2 -3 -11 -14 -4 -9 2 -8 -4
7184dPnPMqPlJjQpn%NoQjjj0Pkj2K%JjmPoRj5KQj2J7pMp%J3Mj6J3nOLKmLJj3K1
$$ -4 3 -2 5 9 1 8 5 6 5 13 6 1 1 6 0 8 7 6 -4 3 1 -11 -9 -9 -8 -9 -13 -6 -12 -3 -18 -16 -8 -20 -3 -10 -6 -13 -13 0 4 -12 1 -4 2 5 7 3 6 7 -6 15
7236A5j3OmKNoLj4J%M%qLm%jjNj0PQj1JmPMpKOj4J6JKoMOJkJ1j0KPpKLJj0LrJ
$$ 15 2 8 4 6 11 5 8 -6 -5 -5 -1 -1 -9 -6 -10 -10 -11 -12 -7 -17 -10 -2 -13 -12 -16 -9 -5 -12 -10 -4 -18 -2 -1 1 -5 -1 5 6 4 15 5 7 14 7 9 12 13 3 6 -3 -2
7287boJ7j1mKlj%%Noj2J6KnJ0oo%LnKJJ7j6PJ4qLnLQnqMjLJ5j9qNLkKnmJkkmk
$$ -2 -8 9 -2 -6 -4 -7 -8 -8 -8 -3 -9 -21 -5 -3 -8 2 -4 -10 -10 -7 -12 -10 -9 8 -8 -1 13 5 8 3 6 14 9 1 5 4 7 22 3 -5 0 3 1 3 -2 -6 -5 -7 -9 -13 -15
7338a5NmMLoRoQpNK%jLMkqJ5Jj5J3MLjKJrOrKnJ%rNpOKkJkLqNlJlpRjOnkPNqK
$$ -15 -10 -14 -10 -7 -13 -4 -10 -2 -9 -4 -2 -2 -3 0 4 2 -6 9 10 -5 8 12 15 14 16 17 8 14 5 7 2 3 3 -6 -1 -8 -2 0 -2 -1 -3 0 -8 -3 -6 -5 -8 -15 -6 -7 -1 -6 -8 -1 4 -4 -2
7395b%KpJ6qJ2j1jJ2olNRr%rNjj4J9j7OjjoLJLj4MNKoMoQmLrJ8oMNnKOj0QL%n
$$ -2 -2 0 -7 9 1 13 2 1 13 7 4 9 18 9 9 0 5 4 -10 9 -8 -2 -3 -4 -10 -7 -6 -3 -17 -13 -8 -6 -12 -8 -14 -6 -10 -7 -16 2 -4 0 5 0 2 8 -2 6 9 9 4
7446DNJOKnjpJpKJMpoMoPj0kRQj0lOl%kkJ0MmLoRQqjrjJ3JJ5k2NNoJ1oj3oRrM
$$ 4 9 10 16 18 13 12 5 6 -1 1 2 6 -1 -7 -3 -9 -2 -12 -14 -5 3 -7 -10 -4 -7 -7 -9 -11 -1 3 -1 2 -4 5 13 5 4 -5 -6 7 8 23 1 6 11 5 16 10 -3 -9 0 -9 -5
7499elJJLooQQpmj1J5MrNj0QQpJ5Lj7NjkJ3j0QNjnNqN%ljNppJ1j5Rj7J1lQj6N
$$ -5 -8 -7 -6 -3 -9 -15 -7 1 -6 -10 -21 -6 -2 -11 -6 -16 -8 0 -7 8 11 -6 -1 -2 -4 9 -1 7 12 11 6 11 3 8 8 5 4 9 2 -5 6 -9 0 -17 -6 -9 -1 -17 -12
7548a2jOPj1jjJnJ6pOlQoQPj3RJNjj3J0qJ0pKjlKKjj5JlPNlrNqJJmRj0J0j4MM
$$ -12 -13 -7 0 -11 -12 -13 -12 -17 -1 -8 -2 -5 3 -3 5 12 -1 8 9 14 13 0 10 2 12 5 7 6 3 5 7 6 -9 -8 -11 -4 1 -2 -11 -6 -14 -13 -12 -16 -7 -17 -7 -21 -17 -13
7598a3jMMkkMKjP%LJNjLnKlJ3k2MJl%Oj5PRj1mrKK%MLnpQkKjOkjLPPJqpRMKnN
$$ -13 -14 -10 -6 -8 -10 -6 -4 -5 2 2 5 6 11 10 13 8 10 7 20 -2 2 3 0 0 6 -9 -2 7 -4 -8 -17 -15 -13 -13 -9 -6 -11 -18 -10 -12 -10 -11 -5 -7 -8 -5 2 9 10 2 -5 4 8 10 5 10
7654A0%oj%MnKLolNm%jMj3KPpj%NJLkOnkL%noJ1NKqKJ0lnKnJ7j3OoLJ1k0RmQj7
$$ 10 10 4 3 3 7 2 4 7 1 -2 3 -1 -1 -2 2 -11 -9 -2 -9 -10 -10 -5 -4 -1 -3 3 -2 -4 -1 -1 -6 -12 -1 4 6 -2 0 10 7 2 4 -1 16 3 9 3 6 17 -3 6 2 10 -7
7707gKJ1j2rNJ0j2MoMkLkj2J0jRJjrJ1LpPkoR%LkJ1nj1J1jRj4J6j7Qj0NjmlJ0
$$ -7 -5 6 -6 -15 -10 0 -12 -8 -14 -10 -12 -9 -11 -23 -13 -14 -5 -4 -5 -14 -3 0 -7 0 -2 -8 1 1 4 2 13 8 -3 8 7 16 2 18 1 9 -1 4 3 -1 -4 6
7753Fj4J5j4%LoLrPK%%j%KKoPJOnR%oJ0MrjlQojjKLjoppMLkJ2j8NNj0J6j5Omn
$$ 6 -8 7 -7 -7 -4 -10 -7 -16 -9 -7 -7 -7 -8 -8 -6 -4 -10 -3 -2 4 -1 8 8 2 12 16 7 6 3 11 5 4 3 5 8 7 1 -6 -13 -9 -6 -8 4 -14 -9 -4 -14 2 -13 -7 -11 -16
7805a6J2j0QQj1Rj0J2%llM%RqJLLLnmKKLj0RnoqO%pJPojmoOQprJ6lNllNLPkJn
$$ -16 -4 -14 -6 2 -9 0 -10 2 2 -1 -4 0 0 9 1 2 5 8 11 6 2 4 6 9 -1 8 3 -3 -11 -5 -5 -12 -11 -4 -10 -11 -15 -21 -15 -7 -14 -23 -7 -10 -5 -8 -11 -6 -3 4 2 3 -2
7858bPmMkOnOpmM%KRj3lqM%rOKnp%PnPmKkoJ0RmjJjJJ2nJ0%%prRJ%jk%jjMQJp
$$ -2 5 1 5 3 9 4 10 3 -1 3 3 5 14 1 -2 -10 -6 -6 -15 -9 -7 -12 -19 -19 -12 -17 -10 -14 -12 -14 -20 -10 -1 -5 -6 -5 -6 -5 7 2 12 12 12 5 -4 5 6 6 5 3 3 2 1 5 13 14 7
7915GLj3J0j1Lj4MRkj2J3oJLmnPJ3j1RnolJ1NnlPJkPRnrKPj4LJ7j8mRkj1MnnK
$$ 7 10 -3 7 -4 -1 -15 -11 -2 -4 -16 -3 -9 -8 -5 -9 -14 -7 6 -5 4 -1 -7 -10 1 6 1 -2 5 6 4 11 20 15 6 8 15 1 4 21 3 -1 8 6 -5 -1 -6 -11 -9
7963iPKj8J5mJpQkKlOLj3J8o%j2J5%OoJ2j1LJ6k1NrKRlNkj3Pj0Qj%j4J4j5J5r
$$ -9 -2 0 -18 -3 -7 -6 -13 -5 -7 -5 -8 -2 1 -12 6 0 0 -12 3 3 9 3 15 4 7 23 2 7 -2 0 9 6 11 9 -4 3 -7 1 0 0 -14 0 -15 0 -9
8008iMJpQmrK1prkJ1JLjQ%JLKpPlnQ%pPj2jRlj1k%MjKqnQLmrK%J0nJ0j2nJ1nK
$$ -9 -5 -4 -11 -3 -7 -16 5 -2 -11 -13 -2 -1 2 1 9 9 10 13 15 8 15 12 7 15 15 8 15 3 2 11 8 -3 -5 -5 -1 -2 0 -8 -13 -5 -2 -6 -15 -13 -13 -3 -8 2 -10 -15 -4 -9 -7
8061gJ%J%LN%KmMJ1rJ%qPjkklJjLMjKj4JqRoKmJ0klLJpL%JJ1lJLRj1PjLKMj2N
$$ -7 -6 -6 -5 -5 -2 3 3 5 1 5 16 7 8 8 0 7 6 4 2 -1 0 -1 2 6 5 7 -7 -6 -14 -5 -11 -9 -13 -3 -5 -8 -5 -4 -11 -8 -8 -7 4 1 2 5 14 3 10 9 12 14 18 6 11
8116A1NmMj0NKpj4J8Mk3J8mj2KjnPOj0LjjKolJ4j5ONLJ3qLoJN%MkPOpjNqkjpJ1
$$ 11 16 12 16 6 11 13 6 -8 10 14 -9 9 5 -7 -5 -6 -11 -4 2 -8 -5 -6 -7 -5 -11 -14 0 -15 -9 -4 -1 12 4 7 1 2 7 7 11 9 16 22 15 14 19 11 9 8 1 12
8166A2j4kMoJOmJjkoNmOJj0QoJ1KMq%jP
$$ 12 -2 -4 0 -6 -5 1 -3 -2 -3 -5 -11 -6 -10 -4 -3 -13 -5 -11 0 2 6 -2 -2 -3 4
8191D
$$ Imaginary data points
##PAGE= N=2
##DATA TABLE= (X++(I..I)), XYDATA
0@%%%%%%%%%%%%%%%%%%%%JrJ6j6J6j6J6j7K5l2L2m0M8m8N6o4P2q1Q9j01J10j22
$$ 0 0 0 0 0 0 0 0 0 0 0 0 0 0 0 0 0 0 0 0 0 1 -8 8 -8 8 -8 8 -9 16 -16 16 -24 24 -24 32 -32 40 -41 48 -53 57 -65
42f5J38j54J70j86K03k27K50k74L06l37L70m08M49m96N51o14O84p68Q69r89J139
$$ -65 73 -81 89 -97 106 -121 129 -145 161 -176 194 -214 235 -261 290 -324 360 -408 461 -528 611
63F11j330J587j952K507l475N626j8716J1640L9841l0122l2818J2461L2425m024
$$ 611 -719 868 -1084 1423 -2052 3574 -15142 -3502 36339 6217 -26601 -14140 18285 14261
77A4261j9640p521P989J0805Q931j2316k2121O591L4297N43l9460j0644M0261
$$ 14261 -5379 -12900 -4911 5894 14825 2509 -19612 -13021 21276 21819 -17641 -28285 11976
90A1976J8292l4535k4017K5920K4396j4559k0839M038J2332M838j365r708j1101
$$ 11976 30268 -4267 -28284 -2364 22032 7473 -13366 -9328 3004 7842 6477 -3231 -14332
103a4332J0771K2184p723l0567K336L4650M212l4311r830K9780J3371k2233j3607
$$ -14332 -3561 18623 10900 -19667 -17331 17319 21531 -12780 -22610 7170 20541 -1692 -15299
116a5299J3128J0398m269m139k897l957P279J2495q783j9958P635K5085m800k7190
$$ -15299 -2171 8227 3958 -181 -3078 -7035 244 12739 3956 -16002 -8367 16718 11918 -15272
130a5272J280K6100J656k2261l147J6550K693j0067l03L995l547R77Q087m290
$$ -15272 -13992 12108 13764 -8497 -11644 4906 7599 -2468 -2771 1224 -2323 -1346 6741 2451
144B451j2412N994J5816o342j7644N877J7736n244j6165M901J3359n275r884O290
$$ 2451 -9961 -3967 11849 5507 -12137 -6260 11476 6232 -9933 -5032 8327 3052 -6832 -542
158e42O295p845l060R476L93j0852J652J1562l276j1386M720J0389o231q706P990
$$ -542 5753 -2092 -5152 4324 4717 -6135 -4483 7079 3803 -7583 -2863 7526 1295 -7411 579
173E79O782r929m900J1900L411j3489k397J4345J748j4100j264J2656N22j0124
$$ 579 7361 -2568 -7468 4432 7843 -5646 -8043 6302 8050 -6050 -7314 5342 5864 -4260
187d260P45O899k906l437N831K53r274J940J2878k995j5911K783J7798j586j7952
$$ -4260 -3515 3384 478 -2959 2872 3125 -6149 -4209 8669 5674 -10237 -7454 10344 8758 -9194
202i194j03J6268J586j2716k186P859J472k394Q67k833m588O898R232r272j3966
$$ -9194 -9297 6971 8557 -4159 -6345 1514 2986 592 1459 -1374 -5962 936 10168 896 -13070
217a3070R568J7811p981j9957M997J9759j512j7047j568J2073L290n565l138j386
$$ -13070 -3502 14309 6328 -13629 -8632 11127 9615 -7432 -9000 3073 6363 798 -2340 -3726
231c726Q64P732L259j2425q373J4798J3548j4552j7613J2016J9655p894j9048
$$ -3726 -2862 4870 8129 -4296 -12669 2129 15677 1125 -16488 -4472 15183 7289 -11759
244a1759L221J5716Q58j0076l389K898L845M466k009j1054j731J5736O555j7855
$$ -11759 -8538 7178 8036 -2040 -5429 -2531 1314 5780 3771 -7283 -9014 6722 13277 -4578
258d578j1454J7222J5306j4184j7136R525J6413m291j2995l53P403L475m15m478
$$ -4578 -16032 1190 16496 2312 -14824 -5299 11114 6823 -6172 -6525 878 4353 3938 -540
272e40o770L251J3042r8j7412m145J9188Q468j8314j1811J5103J3267j0396j2413
$$ -540 -7310 -4059 8983 8885 -8527 -12672 6516 14984 -3330 -15141 -38 13229 2833 -9580
286i580N190R166n58m046k748k031M048Q244l458j3429J279J6863J813j8013m918
$$ -9580 -4390 4776 4218 172 -2576 -4607 -559 7685 4227 -9202 -7923 8940 10753 -7260 -12178
301a2178J6942P195j3931q036R760P086n210m456J118M77J868M145l410q664L456
$$ -12178 4764 11959 -1972 -10008 -248 6838 1628 -2828 -1710 -1233 635 4780 1370 -7294 -3838
316c838J2324k360j4564N87J5089J221j3940k480J1443K760q097j881M585p4j367
$$ -3838 8486 6126 -8438 -7851 7238 8459 -5481 -7961 3482 6242 -1855 -3736 849 775 -592
331e92K807j093n718K556Q368l098j0306K963J1229k519j1036K092R835k043p938
$$ -592 2215 1122 -4596 -2040 6328 3230 -7076 -4113 7116 4597 -6439 -4347 5488 3445 -4493
346d493K462N703l399l473M630J437n887J84O930j389p530K313P575l049p074
$$ -4493 -2031 3672 273 -3200 1430 2867 -3020 -2836 4094 2705 -4825 -2512 5063 2014 -5060
361e060L847O149m717m956N718L741o695k666P510J776p949j093P853M44p178
$$ -5060 -1213 4936 219 -4737 981 4722 -1973 -4639 2871 4647 -3302 -4395 3458 3902 -3276
376c276K84N953j316m367K714K613m465j060O395p6q239N88R779n69j0541J62
$$ -3276 -2992 2961 1645 -2722 -8 2605 -1860 -2920 3475 3399 -4840 -4252 5527 4958 -5583 -5421
392e421J0372M13r155p42P048N19m275M48J306k247J458M602l485p255M509R699
$$ -5421 4951 5364 -3791 -4533 2515 3034 -1241 -793 513 -1734 -276 4326 841 -6414 -1905 7794
408G794m513j1465L574J2108k085j1401M76R333P26o151j125K319M17J644J399
$$ 7794 3281 -8184 -4610 7498 5413 -5988 -5512 3821 4547 -1604 -2729 -410 7 1651 3050
423C050n009l997P280P002q222r721P709J1654o041j2224L652J1203j175q632
$$ 3050 -1959 -5956 1324 8326 104 -9617 -1908 9746 3705 -8519 -4867 6336 5161 -3471
437c471q01M854J717m19j346l997l12P616K949r991n936J0731Q680r898j0465
$$ -3471 -4272 582 2299 1880 534 -3463 -3775 3841 6790 -3201 -9137 1594 10274 376 -10089
452a0089P787J0884m948r634K025O923L07l019j604j437J575N731l12r185j891
$$ -10089 -2302 8582 3634 -6000 -3975 2948 3255 236 -1368 -2805 -1230 4501 4189 -4996 -6887
467f887J1329M430j1844o787J0821Q249q532q482N505P260k441m684j05J129J670
$$ -6887 4442 8872 -2972 -9759 1062 9311 779 -7703 -2198 5062 2621 -2063 -2168 -1039 631
482F31K916k021o678J210R656M49j1358k461J1609M288j0447n396Q211N433n403
$$ 631 3547 1526 -5152 -3942 5714 6163 -5195 -7656 3953 8241 -2206 -7602 609 6042 639
497F39m301K550K092j91Q64j377m053J940O916j621r065O67J0151N38j0077j556
$$ 639 -3662 -1112 980 789 1653 276 -3777 -1837 5079 3458 -5607 -4940 5211 5749 -4328 -5884
513e884Q956K069p038j836M737Q73k450Q15M74k843R24M877j653o569J790P699
$$ -5884 3072 5141 -1897 -3733 1004 1877 -573 242 716 -2127 -1203 3674 2021 -4548 -2758 4941
529D941j577q060J160P674r23o612R42N157j394l507K177J892l187n17M212n08
$$ 4941 3364 -4696 -3536 4138 3215 -3397 -2455 2702 1308 -2199 -22 1870 -1317 -1834 2378 1870
545A870n063J233N566j719n617K101N286k499m612L022L731l645k778M302J879
$$ 1870 -3193 -1960 3606 1887 -3730 -1629 3657 1158 -3454 -432 3299 -346 -3124 1178 3057
560C057m879j117N220M82n280J04M948p38m286J509L350k451k347L567J430m740
$$ 3057 -1822 -2939 2281 2763 -2517 -2413 2535 1797 -2489 -980 2370 -81 -2428 1139 2569 -2171
576b171p00N789K64o505j57O863K01o575l02N734K13m377K22K670j090r01K372
$$ -2171 -2871 2918 3182 -3323 -3480 3383 3584 -2991 -3293 2441 2654 -1723 -1501 1169 79 -822 1550
593A550o73l938J768N514k271o870K133P734j572p826P51P095Pn556m27L468K38
$$ 1550 877 -3061 -1293 4221 1950 -4920 -2787 4947 3375 -4451 -3700 3395 3402 -2154 -2581 887 1125
610A125j014O21j296k088L198L870m304n716M579P234m095q034K978P961j677
$$ 1125 111 732 -564 -2652 546 4416 112 -5604 -1025 6209 2114 -5920 -2942 5019 3342
625C342o846M09M890L54k313m33n63k74L218J667n236l460O342N309o449o761
$$ 3342 -3504 -3095 1795 2149 -164 -597 -1160 -1434 1784 3451 -1785 -5245 1097 6406 -43 -6804
641f804N630P521m166p260K389O030p70l837l72J061P24J893k44m518r52O417
$$ -6804 -1174 6347 2181 -5079 -2690 3340 2570 -1267 -1639 -578 146 2039 1795 -2723 -3675 2742
657B742K563p375m238P293N512o315o057M659N705k793m394J050K330J71K96o96
$$ 2742 5305 -2070 -6308 985 6497 182 -5875 -1216 4489 1696 -2698 -1648 682 853 1149 453
673D53k960M51N285L99o866j653P639K887p426l826O399M142m811l728L012K510
$$ 453 -2507 -2056 3229 3628 -3238 -4891 2748 5635 -1791 -5617 782 4924 113 -3615 -603 1907
689A907j313o68Pj526O81L711p44n524K94O716M58p118j278O776J820n750j921
$$ 1907 594 -74 -67 -1593 -912 2799 2055 -3469 -3175 3541 3999 -3119 -4397 2379 4199 -1551 -3472
706c472M333J455k720m55J258r58j01K507n86l977Q34N077p61n672M80N730k42
$$ -3472 861 2316 -404 -859 399 -559 -660 1847 1261 -2716 -1882 3195 2434 -3238 -2758 2972 2730
723B730n285J64M419l61l299Q50K134j603j051K484J63l285M55L952q37m321J112
$$ 2730 -2555 -2391 2028 1667 -1632 -782 1352 -251 -1302 1182 1345 -1940 -1485 2467 1630 -2691 -1579
740a579M348j339m044J610L488j959k777K399K009k912j277L322O53l626j44L721
$$ -1579 2769 1430 -2614 -1004 2484 525 -2252 147 2156 -756 -2033 1289 1942 -1684 -1828 1893
756A893l11l579P64L178j266k618J876J949k551j303L249Q18l867m60M311K63
$$ 1893 1582 -1997 -1233 1945 679 -1939 -63 1886 -665 -1968 1281 2099 -1768 -2228 2083 2346
772B346m458j53M257M9l703J66K860n90j843J255P92k137R9L130p32m102J019
$$ 2346 -2112 -2265 1992 2041 -1662 -1496 1364 774 -1069 186 978 -1159 -1060 2070 1338 -2764 -1745
789a745M865j006n236P35N148l99m522J21L451r6k027M36M93j133R20K154k028
$$ -1745 3120 2114 -3122 -2387 2761 2362 -2160 -2039 1412 1316 -711 -275 218 -915 5 2159 131
806A31l296K657M355k764n120K390N440j747n143R85M223l54k805O8J038k19P52
$$ 131 -3165 -508 3847 1083 -4037 -1647 3793 2046 -3097 -2112 2111 1757 -1048 -980 58 -161 591
823E91Q50k325j827L455K965l976m004L887M760l319m934K363M547j375l486N18
$$ 591 1441 -884 -2711 744 3709 -267 -4271 -384 4376 1057 -3877 -1514 3033 1658 -1828 -1310
839a310J908j3o1Pj811n02L398J333m470k371M926L303m720l935L960M094k893
$$ -1310 598 585 524 531 -1280 -1782 1616 2949 -1521 -3892 1034 4337 -383 -4318 -358 3736 843
856H43l586J714K497o79r30L4q69J67K608J16m028p54M920J543n169k277M840
$$ 843 -2743 -1029 1468 789 -141 -107 -976 -809 1799 1915 -2113 -2867 2053 3596 -1573 -3850 990
873I90K716m023k718K888K198j713j215O91j50MJ637l04l013J96M094J85m701
$$ 990 3706 -317 -3035 -147 2051 338 -877 -186 -336 -332 1305 1001 -2012 -1816 2278 2463 -2238
890b238o98M818J162m418j384L641J265k610p71J555o3o22J107m7k218M15L169
$$ -2238 -2936 1882 3044 -1374 -2758 883 2148 -462 -1233 322 259 -363 744 697 -1521 -1106 2063
907B063m76l878L61M185j62m096J0L632l7k903K56K055p14j201J319M82j987Q9
$$ 2063 1587 -2291 -1930 2255 2093 -2003 -1993 1639 1602 -1301 -1045 1010 296 -905 414 896 -1091 -1002
925a002K580m31l010O33L233p53l174Q60K853r92k416J267J822j590j237J928
$$ -1002 1578 1147 -1863 -1230 2003 1250 -1924 -1064 1789 797 -1619 -352 1470 -120 -1357 571
941E71P12k276k49K516j12k626M23K547p05k318J048J926j394j478J818J023k251
$$ 571 1283 -993 -1242 1274 1162 -1464 -1041 1506 801 -1517 -469 1457 63 -1415 403 1426 -825
958h25o24K654K99k914p8L014r9k880K39K517m38j992P62J315j202o49J763L3
$$ -825 -1449 1205 1504 -1410 -1488 1526 1427 -1453 -1214 1303 865 -1127 -365 950 -252 -901 862 895
976H95k336L71K902o07l301O45L476n56l320M21K857l15k122L91J215o72k58J168
$$ 895 -1441 -1070 1832 1225 -2076 -1431 2045 1489 -1831 -1410 1447 1132 -990 -599 616 -56 -314 854
994H54o08j807J266K481j630l093J681L479j464l570J078L256o81k581L76J595
$$ 854 246 -1561 -295 2186 556 -2537 -856 2623 1159 -2411 -1333 1923 1242 -1339 -963 632
1010F32k81m51M82o93r60J717J590k375k301K685K906k569l291K178L282j592
$$ 632 351 -100 382 -311 -1271 446 2036 -339 -2640 45 2951 382 -2909 -731 2551 959
1026I59k836R66K014m79r19K65l30l52J523P18k485j295L068J916l244k443L028
$$ 959 -1877 -911 1103 624 -295 -30 -360 -712 811 1529 -956 -2251 817 2733 -511 -2954 74
1043G4K699k465k627J763K138j040j286M49K22j26R64J10k067l54K905Q16l399
$$ 74 2773 308 -2319 -556 1582 542 -744 -295 -73 -199 765 875 -1192 -1546 1359 2175 -1224
1060a224j307L459J718l154j920K552J793j805j312J044N10m15M79K2j505J08
$$ -1224 -2531 928 2646 -508 -2428 124 1917 112 -1200 -156 354 -61 418 440 -1065 -957
1076i57K413J6l061l03L380O34l324q76K955R30k349p28J624K72r05L68L16j135
$$ -957 1456 1472 -1589 -1892 1488 2122 -1202 -2078 877 1807 -542 -1270 354 626 -279 89 405 -730
1094g30Q4J867k81k460K66K842j54k948J0K784M8k374OJ837k27j229O12O39j051
$$ -730 -646 1221 940 -1520 -1254 1588 1434 -1514 -1504 1280 1328 -1046 -1040 797 570 -659 -47 592 -459
1113d59j52J549k02j954L93K258n00k372N58K261n87k010O95J603q78j158J117
$$ -459 -611 938 736 -1218 -825 1433 933 -1439 -881 1380 793 -1217 -522 1081 203 -955 162
1130A62O98j396k98J674o0j869L04J956m97j902O84J715q68j414J091J067j334
$$ 162 860 -536 -834 840 780 -1089 -785 1171 674 -1228 -544 1171 303 -1111 -20 1047 -287
1147b87o91J584L70j824j05K004j04k033K37J928l47j725N10J361p17r32R87M77
$$ -287 -978 606 976 -848 -953 1051 947 -1086 -849 1079 732 -993 -483 878 161 -771 216 693
1165F93j318q2J676k33j986L99K228m61k293M49K170m08j849L95J365m76p57O71
$$ 693 -625 -707 969 736 -1250 -851 1377 916 -1377 -928 1242 834 -1015 -620 745 269 -488 183
1183A83J43j005M29J402q49j825J075K188j143k353J024K305q03k046N90J548
$$ 183 326 -679 -250 1152 303 -1522 -447 1741 598 -1755 -731 1574 771 -1275 -685 863
1199H63m54q65M51J20o06O14R29j248j298J611J721j751k044J677K168j402k081
$$ 863 409 -456 -5 115 -491 123 1052 -196 -1494 117 1838 87 -1957 -280 1888 486 -1595
1216a595J027J742o77j145L94L83k93M31L90j199o48J779J021k116j403K173J695
$$ -1595 -568 1174 497 -648 -254 129 -164 267 657 -542 -1190 589 1610 -506 -1909 264 1959
1233A959j968j792J606J650j128j245O83O10l32J44J94r52k11J622M23k133p18
$$ 1959 -9 -1801 -195 1455 327 -918 -235 375 43 187 381 -571 -782 840 1263 -870 -1588
1250a588K362J007k337j211K065J231j625j045J111O41o25p0K65o22l1J278Mj842
$$ -1588 774 1781 -556 -1767 298 1529 -96 -1141 -30 611 -14 -84 181 -441 -472 806 810 -1032
1268a032j14K210L22k341n14K236O45j916o25J445M48r49q3M80m16j08R44j05
$$ -1032 -1146 1064 1386 -955 -1469 767 1412 -504 -1129 316 764 -185 -268 212 -204 -312 632 527
1286E27j459J71J842j33k056L6K063M8j882o1J552k7j122K23O89n28l05R02j5
$$ 527 -932 -761 1081 948 -1108 -1072 991 1039 -843 -904 648 621 -501 -278 411 -117 -422 480 465
1305D65j235K19J525l23j688L54J711l64j601M04J350m75j053O15P00p99l63J012
$$ 465 -770 -551 974 651 -1037 -683 1028 664 -937 -533 817 342 -711 -96 604 -195 -558 454
1323D54Q4j209J34J356k95j405M09J364m94j223N81J009p13p25Q70M50j040k20
$$ 454 538 -671 -537 819 524 -881 -472 892 398 -825 -244 765 52 -673 197 647 -393 -613
1341f13J212Nj342J46J386k53j346L39J193m36r58N72O65p47l52R50O5j163J50
$$ -613 599 604 -738 -592 794 541 -805 -466 727 291 -667 -95 570 -177 -529 421 486 -677 -527
1360e27J383l00j497L63J540l88j432L85J215m02q66M46M72n76p3P91l07j041
$$ -527 856 556 -941 -578 962 574 -858 -473 742 340 -526 -80 392 -184 -257 534 227 -814
1378h14N70J283p19j489P47J578o84j525N46J328m26r78L64N08l70j7N10m48p24
$$ -814 -244 1039 320 -1169 -422 1156 472 -1053 -507 821 395 -583 -219 289 -81 -98 412 -36 -760
1397g60Q33R83j058j242J149J428j073j474Q92J336o54j056M51O19l31j05L08
$$ -760 73 1056 -2 -1244 -95 1333 260 -1214 -322 1014 360 -696 -245 374 43 -62 246
1414B46m38m03R14O00j275q32J454J050j471j181J318J191j048j038P50P13m48
$$ 246 -192 -595 319 919 -356 -1188 266 1316 -155 -1336 -18 1173 125 -913 -163 550 102
1431A02k81K64k65j65P80K16j226l66J520N64j627p47J561Q53j343q39J032O58
$$ 102 -179 85 -180 -345 435 651 -575 -941 579 1143 -484 -1231 330 1183 -160 -999 33 691
1449F91o78l33L62r6j29N55N5j014o4J370J55j560l12J612M16j479m72J236L91
$$ 691 13 -320 42 -54 -183 372 427 -587 -651 719 874 -686 -998 614 1030 -449 -921 315 706
1468G06q96k11N40q0k58M58K1q14Q5J149j21j381P9J495k5j436m0J267M3r84M4
$$ 706 -190 -401 139 59 -199 259 280 -534 -449 700 579 -802 -723 772 747 -689 -729 538 581 -403 -359
1489c59O88k21l62M35J08o96Q8R52k03j154K46J229k42j223K37J089k49q81L00
$$ -359 329 108 -254 181 289 -407 -319 633 430 -724 -478 751 509 -714 -477 612 363 -518 -218
1508b18O39m10l80N47J40p11L6Q90j91r83K82J019l25r79L89Q45m30o67N12M56
$$ -218 421 11 -369 178 318 -393 -357 533 342 -641 -359 660 335 -644 -255 590 160 -507 5 461
1528D61o08k45P28N0q52J13R33k21r65K85R20l29q26L87O58m64m34N41K21o68
$$ 461 -147 -392 336 386 -466 -353 580 359 -606 -321 599 270 -556 -169 489 25 -409 132 353 -315
1548c15jP92j55r21K76R91l28j007L46R19l22p78L38N43l63k87M47K4n73K19P30
$$ -315 -316 476 321 -600 -324 667 339 -668 -322 597 275 -503 -165 378 15 -272 175 199 -374 -155 575
1569E75m20q70N05R97n43j022M96R72m22q16L54N74l07k75L36p5l89L70N30o18
$$ 575 155 -715 -210 787 244 -778 -282 690 268 -548 -194 380 73 -202 134 59 -330 40 570 -48
1589d8o94P65Q42q16r23P42R47o42q35M67O25l26l20K41l0k23L58L16o76m29Q83
$$ -48 -742 23 865 49 -874 -132 815 173 -662 -195 430 104 -216 25 -5 -228 130 446 -230 -659 224
1610B24N87r69p25R73P76q31p60O46O26m38l82K59O8j51K59J42n99k00Q79K76
$$ 224 811 -158 -883 90 866 35 -725 -79 547 109 -273 -14 54 -97 162 304 -295 -495 384 660
1630F60j043m10J088N20j009n75Q42N24o16l71L88J31k00J83O6m88k0P74N1r88
$$ 660 -383 -793 295 815 -194 -769 73 597 -19 -390 -2 129 -71 112 178 -310 -330 444 495 -493
1650d93j13J091K17j081k88R57K90p42k45N14J05l07J32R8l82J5O32o6q32N2R69
$$ -493 -606 485 702 -379 -667 290 580 -162 -407 107 212 -95 37 135 -247 -232 400 334 -498 -446 523
1671E23j0r99m0R25P5p85m9N91l9l63J68J71l44nN26r3o95J46Q12j63q56J45Q08
$$ 523 513 -486 -526 399 474 -311 -360 231 192 -171 -3 168 -176 -181 345 252 -443 -297 515 352 -504 -359 449
1694D49j37p05J47N62j92l62K66J82l98j2N23j07o18J70P10k31p14K43O72k43
$$ 449 312 -393 -246 316 124 -238 28 210 -188 -200 323 216 -402 -232 478 247 -467 -224 448 205
1714B05n67K43M47l17k84L81J21m61JN64j08o34J67O58k06o39K45N44k45m39K88
$$ 205 -362 -119 328 11 -273 108 229 -232 -231 333 225 -409 -242 416 210 -429 -184 360 115 -324 -36
1735c6K96l42j43M39kn21J21O01j90o60K34O52k33o20K39N08k32l78K61J85l08
$$ -36 260 -82 -225 214 212 -309 -188 413 223 -437 -203 449 216 -404 -165 343 111 -267 -6 179 -129
1756a29k2M03j46n08K72N85l31o55L59O62l19o20K80N21k47l37K13J51k30N5L03
$$ -129 -151 252 106 -402 -130 455 124 -531 -172 490 171 -449 -169 352 105 -232 -19 132 -98 -43 260
1777B60k55l93M11M83m80n76N00O21m63o17L84N18k68l93K14J76j80N2J99k85
$$ 260 5 -388 23 506 26 -550 -50 571 108 -509 -125 393 125 -268 -54 122 -58 -6 193 -92
1797i2k33M53L22n75m37O35N11o08n38N25M94m02l82K81K02j71PJ19k51j07M57
$$ -92 -325 128 450 -125 -562 73 584 -24 -562 -37 457 55 -327 -46 156 -15 -8 111 -140 -247 210
1818B10J63o21k37P03L27p08l93O36L99n12l26L69K02k25k5J14j87m4L89M6n65
$$ 210 373 -248 -485 218 545 -163 -556 80 479 -33 -359 10 212 -13 -38 76 -111 -155 234 280 -285
1839b85q6O74J59p27j94O74K23n78k17M36J52k88m1J58j26m4L09k1m76L0O03p
$$ -285 -371 303 462 -265 -459 215 438 -140 -357 79 231 -57 -98 60 -66 -110 199 178 -298 -268 335 328
1861C28o78k1O76N6n89r1N05M2l49L5K02j65n2K78l2m22Q8N22r9n92R0N90o9n61
$$ 328 -350 -371 305 361 -228 -319 186 228 -121 -86 116 -49 -101 177 145 -277 -189 333 234 -358 -268 322 253 -308
1885c08N9M62p6l28J24K06j87r9K97k2l70R5M38j21m97J46N01j32m61J32L97j55
$$ -308 -249 213 137 -191 -67 139 -48 -147 150 128 -242 -147 291 170 -327 -181 320 188 -273 -141 256 101
1907A01k85J86J59k48n5L26m3l83J02M29j53m44J58M33j46m10J82L03k00j93K35
$$ 101 -184 2 161 -87 -142 184 141 -242 -140 289 136 -308 -150 283 137 -273 -91 212 12 -181 54
1928E4Q6k84K0L46r6m05J49M39j70m42J82M00j72l32J64K27j69j33K23Kk71J06
$$ 54 140 -144 -124 222 126 -279 -130 309 139 -303 -121 279 107 -225 -61 166 -3 -136 87 89 -182 -76
1950g6L33j79l88K30M17k19m39K08M04j70l40J54K32j57r0J66n0k14J81K67k65
$$ -76 257 78 -310 -80 337 118 -321 -113 291 121 -219 -65 167 10 -80 86 36 -178 3 270 5
1971El42L21L85l33m05K84L90k36l24J79K25j39q6J23o1j41K21J88l23k55L94
$$ 5 -337 -16 369 36 -369 -85 305 69 -255 -76 149 10 -76 47 -14 -155 66 254 -69 -324 70
1992G0L12m07l44L72L64l18l13K25K33j53j07R6n5p9J91R6l26j30M08J90m64k27
$$ 70 382 -25 -369 3 367 49 -264 -39 194 41 -66 30 -25 -104 87 183 -143 -273 135 325 -139 -366
2014c66M38K73l82k67K90K17j96j21J23j5n3J45M5k86m4L98Q9m63j25M64J62m34
$$ -366 72 345 -37 -304 -14 203 7 -114 9 -6 -59 86 131 -155 -199 199 288 -175 -300 164 326 -108
2036a08j72L60J48k63r0J48qp3J37J1k44jL58Nm33k6M48P9m38q2L73O4k83l2J85
$$ -108 -280 80 228 -35 -125 23 15 -58 79 90 -154 -155 203 208 -225 -251 197 276 -162 -244 129 193 -90 -122 63
2061F3l1r1J07J8j96J2L03l8l65L9L91j9l93J3L49nk84J7K08o1j01J25K6k01L3
$$ 63 32 -59 48 66 -130 -118 185 147 -218 -179 212 193 -200 -187 162 157 -127 -110 98 37 -64 61 87 -114 -81
2086h1K62o0l28P8L52o7l45N4L17q7k45R1J60j17p1J52Ok25N8K69p4l09R9L14
$$ -81 181 121 -207 -129 223 156 -189 -135 182 95 -150 -59 101 -16 -87 65 71 -154 -96 173 99 -210 -111 203
2110B03r1k89Q4K51r4j90J21J11j41l9J70j9k20P5K68j13k81J19K87j21k77J17
$$ 203 112 -177 -93 158 64 -126 -5 106 -35 -74 96 77 -143 -68 200 87 -194 -75 212 91 -186 -69
2132f9K18j09j67J17Q5j40LJ76p8k18J26K63j53k85J61K82j42k58J31K06j08j23
$$ -69 149 40 -127 -10 75 -65 -62 114 36 -182 -56 207 54 -231 -70 212 70 -188 -57 149 41 -82
2154h2R4M3j14M7J47j25j95J89K20k10k59K15K72k06k50J54K08j15j26Q6M5r6
$$ -82 12 55 -59 -12 135 10 -185 4 224 14 -245 -30 242 36 -214 -60 148 33 -93 -7 38 -58
2176e8O4R2j48j17K17J67k55k10K65K32k40k44J99K13j60j28R2O2p5N1N6j44p3
$$ -58 6 98 -50 -167 50 217 -38 -248 17 249 9 -235 -36 177 17 -111 -19 43 -32 19 75 -69 -142
2199a42K32J01k75j44L10J63k93j76K50J62j94j08J22N0p7M8L4j38k9K26K3k81
$$ -142 90 191 -84 -228 82 245 -48 -224 26 188 -6 -114 8 58 -19 29 63 -75 -104 122 145 -136
2221a36n4L13P6l07r8K59J22k33p9J64K4p5J6L2r7oJ95j8k46J0K86K1k94k9K73
$$ -136 -190 123 199 -108 -206 53 175 -58 -137 27 51 -24 -8 24 -73 -79 116 98 -148 -138 148 169 -125 -154 119
2246A19L3k09n9J84Kj14M8L6j03J5J58l3k30M9K57m6k66K5K67k3k24K0J66l2r8
$$ 119 152 -57 -116 68 70 -44 4 40 -63 -48 110 77 -153 -104 153 107 -159 -134 133 110 -114 -94 72 40 -58
2271e8O3M3r4JJ50m6j89P4K20q5k33O5K30o2j91N0J56o8q5P5K7r5K2J34n2j84
$$ -58 5 48 -46 -45 105 59 -130 -56 164 79 -154 -89 141 79 -112 -62 94 26 -59 16 43 -52 -30 104 52 -132
2297a32P8K00q0k08Q2J98q0j59O0J21p8n6Q9Pj20L6J49p8j68J02J81j05j78R2
$$ -132 -54 146 66 -142 -60 138 58 -101 -41 80 2 -54 35 42 -78 -42 107 29 -139 -37 144 39 -139 -47
2321d7J77r1j38O6R1o5k7Q8l9r5P3J25r9j57J22J75j19j79J08J52q6j22O6P9p7
$$ -47 130 39 -99 -33 58 -7 -34 54 15 -80 -7 118 19 -138 -16 159 40 -139 -31 121 35 -87 -21 58 -19
2346a9j0P3n3r1J06J08j36j35J54J55j60j49J32J52r9j22P9P0m7j0M3n0n1R9Q3
$$ -19 -29 44 -9 -100 6 114 -22 -157 -3 152 -8 -157 -25 127 28 -94 -15 55 8 -2 41 -9 -60 39 122
2371A22j58r3J76J22j78j37J59J30j37j06R2O8o0j5L6n0k8J03L7j58m9J86P3j91
$$ 122 -36 -129 47 169 -9 -146 13 143 6 -100 -8 60 0 -15 21 -29 -57 46 83 -75 -124 62 135 -56
2395e6j04J91R7j50r3J21N7n9j8L7m3j1J03%j45k2J79L6j91n4J85O3j60o4J15
$$ -56 -160 31 128 -22 -115 6 63 4 -14 23 -20 -31 72 72 -73 -95 84 120 -71 -125 60 123 -37 -101 14
2420A4O1r5lL1k9oQ3rj40K5J61Jj99lJ96J7j83j6J37Rq1qN1k8k2Q8k8j02M0J38
$$ 14 75 -20 -23 8 -21 -27 56 47 -93 -68 93 94 -105 -108 88 105 -78 -94 43 52 -29 -37 14 -14 -36 52 24 -78 -38 100
2450A00l1j77L9J79j8j72RJ37j6q9J7M7l5lO3k1j07M8J26n3j47L2J69m1j43L1
$$ 100 69 -108 -69 110 92 -80 -71 66 50 -39 -22 25 -10 -13 50 29 -78 -30 96 43 -104 -72 97 56 -87 -56
2476e6J08k8q2M7L6n0lP5l5r1M9J27o8j31P4J33o1j30N8J09n8o4M4L0m7MO5m0
$$ -56 52 24 -58 -11 25 -25 -28 47 12 -79 -30 97 29 -102 -28 105 44 -86 -28 81 23 -41 3 33 -14 -10 55 15
2504A5r0O2J01p6j20P9J15o5j05N3Q2m9n4N6J1n4K2P0o4q2R1R5q1j10Q3J07o6
$$ 15 -75 -13 88 12 -108 -29 86 21 -84 -31 51 2 -52 4 15 -39 -17 53 -11 -93 -2 93 12 -98 -15 92 26
2531B6r6N8P7m1n3L8On0M8M2o9n8R2P5j10q2Q5J08q4r3O7O9n0m5M1ll4N7K7p7
$$ 26 -70 -12 65 24 -29 9 15 -35 13 55 -14 -72 20 95 -15 -97 -12 96 12 -81 -14 55 5 -40 1 -2 -36 21 48 -29
2561b9m4J00N8j20o0J17O7r8q3Q6O3n5l8M0J0k7M4J5q2j9J10L1j34m2J38L8j04
$$ -29 -73 27 85 -35 -95 22 89 -9 -92 -6 57 2 -36 4 14 -13 31 46 -36 -55 55 86 -48 -90 48 86 -18
2588a8n8R4M6p4j1L8j5k2M1J1p6mR4Oj30j7J49J5j13k8R1K8p0k9N6Mk1L8no0K2
$$ -18 -76 18 64 -10 -21 17 2 -20 21 32 -44 -48 46 52 -78 -95 54 69 -44 -72 19 47 -23 -52 4 8 -13 25 20 -40 -18
2619a8Q4j8j03PJ21Jj20k0J07K1r1kM9j2k1K9j0n4L6P0l4q9K3J04k8r8K0R2rp2
$$ -18 66 48 -55 -48 73 74 -46 -66 41 62 -29 -31 18 6 -15 14 4 -50 -14 56 22 -67 -44 60 32 -66 -46 46 37 -35
2649c5J2K5Mk1K9jm6K8O9m5q4M7R6l5r5K0Q4k4p3K8L9k1k1M0l2l4L4P2n4q2O7
$$ -35 -23 2 6 -15 14 13 -33 -5 64 19 -65 -18 78 43 -52 -32 52 28 -45 -17 22 1 -20 20 -12 -46 -12 60 6 -76 -9
2680iP6n8o9L6P2k9o1K7K3k0jK5j5m5M6M9n0o3N7P4n4o7N2O5l9m9K0L7k5JL1m4
$$ -9 67 9 -60 -24 48 19 -42 -15 8 -12 -13 12 -3 -48 -2 47 -3 -66 -9 65 11 -56 -4 61 22 -27 -7 30 5 6 37 -7
2712gk4M8L8o1n6O9N4o0n8M5N7m3l5J6K3j8%L9m8k2N0L9o7m4P7M6o1o7O3O4l6
$$ -7 -31 17 55 -6 -62 7 61 1 -57 -12 45 2 -33 -17 6 -12 -12 27 -21 -43 7 46 -21 -65 12 58 -3 -70 -7 57 21
2743B1m8K1K5k0J0J6l2j8O0J0o0l3P1K7o2m6O4L6l5l6J9K6j6NNl3JN8Po6j9P5
$$ 21 -27 -6 19 -1 9 25 -7 -25 35 45 -15 -48 23 50 -12 -58 6 42 7 -29 -10 16 0 5 10 -23 -22 36 43 -23 -42 33
2775C3K0q4j8N8M3n6j3L4OrmNl6K0M9j6o3LP0J0q7j2P6J6n7oK7J0k1LqoOL6j9
$$ 33 53 -31 -49 9 52 -4 -17 17 23 14 10 15 -21 -1 48 32 -31 -28 42 52 -35 -47 29 45 -12 -18 9 19 -2 1 -7 -13 -7 29 10
2810A0m9kP6kp6MP7lo3JL3J2j6%J2l6K8L0j1o4K9O4j7o8LP5j0n8QL3nm%Kl0K1
$$ 10 -39 -41 35 33 -43 -39 38 35 -28 -27 6 18 2 2 14 -22 6 36 25 -39 -10 54 37 -31 -28 47 37 -21 -13 20 15 11 11 13 -17 4
2846DK3k3m0K5M6k6n0K6N5k7n2KM5pj0JJ4j7J8K8m5k5L7M8l6l7K1N1k9l9NM2j2
$$ 4 27 4 -36 -11 35 9 -41 -15 40 13 -39 -37 8 1 -9 -8 6 -11 7 35 -10 -35 2 50 14 -23 -2 49 20 -19 -14 28 16
2879A6k2%Qk3L0J2l6rJ5L7l1m2L9L9k4l9J3L9k4j1J4j1jK1J9l7k0M4L9m8m6M4
$$ 16 -6 -6 2 -21 9 21 -15 -24 -9 28 -3 -45 -6 33 9 -30 -17 22 -2 -13 1 -10 -11 10 29 -8 -28 16 55 7 -39 5
2911EM4k8m2K4K2j2k3RLpK7ol8j1M8L5n9k5M4K5m3k3K7K2j5%klKJ8qk4mM7J1n6
$$ 5 49 21 -21 3 25 13 -10 -1 2 -5 22 16 -22 -33 15 50 -9 -34 10 35 -8 -31 -4 18 3 3 1 -2 0 18 10 -14 -18 29 40 -16
2947a6j5M5K6m5j4K3J1rj5J2JqL0%n1JN7mm6rM5K3n3k2M4J3k6lOrJK6j6k9QL8
$$ -16 -31 14 40 -5 -19 4 15 6 -9 3 4 -4 26 26 -25 -24 33 29 -17 -26 19 42 -11 -33 11 24 -2 -5 1 -8 -7 19 3 -26 -18 20
2983B0Jm1j0M3K0m2k3L5K7k9LMjPLQl2J6K7qn7K0M3Ln1jK3Qk1kLrJ9Mqk3J2M0
$$ 20 21 -20 -30 13 33 -9 -32 3 30 1 4 8 7 14 17 25 -7 9 36 28 -29 -9 34 37 -14 -15 8 16 -5 -7 -4 -13 6 10 2 -21 -9 31
3021C1k7l4K0M3k6l1KL9J2k6KJ%Q%j5j2K0K5ql6J8K6j9l3J6K2j0j5kLJPQj7j1
$$ 31 4 -30 -10 33 7 -24 -22 17 29 3 5 6 6 14 14 -1 -13 7 32 24 -12 6 32 13 -20 -4 18 8 -7 -9 -6 -5 2 10 -7 -18
3057a8K3Nql3J7M2rm7K5K3j8j8J3KLJ1oj1j3J9K8l3j6K4K3j0l2J4L1k5rjK0j0
$$ -18 5 10 2 -31 -14 28 19 -28 -3 20 2 -16 -3 -1 2 13 7 -4 -17 2 30 -3 -19 5 28 18 -14 0 31 6 -3 -4 16 6
3091FNJj2qJ1J1k1j8K5L4l6k5K9J8k2pjJ2mOPk1j4M5Kj2l9M2J2j8j7J6J0Mk7J3
$$ 6 11 12 0 -8 3 14 -7 -25 0 34 -2 -27 2 20 -2 -9 -10 2 -2 4 11 -10 -24 21 23 11 -28 14 26 8 -9 7 17 21 -6 7
3127GMoRrmmJ7kk7lK9J5l5j0J1K6k1j0QLOKj2KrL4j4l1J8K4Ll7%K8Mj9LMRjml
$$ 7 11 5 14 5 1 -3 14 12 -15 -18 11 26 -9 -19 -8 18 -3 -13 -5 -2 4 6 -6 -4 -13 21 7 -24 -6 18 21 -16 -16 12 16 -3 0 4 13 12 8 5
3169Ej5RJ7Om9J6K0J2l4j4L0Rj4j5QPPonLJ0J3j7j8JK8Jk5KJ4J3k1KQLP%j2Lp
$$ 5 -10 -1 16 22 -27 -11 9 21 -13 -27 3 12 -2 -17 -9 -2 5 -1 -6 -3 7 20 3 -15 -14 14 15 -10 -8 6 19 -2 0 8 11 18 18 6 9 2
3209BK3k2j1J2K2rk6OJ6Nj9KNNnoJj2J8J2k9k0K5K0j8j9J7K1mj5rJ3NMmm%PJ2
$$ 2 25 3 -8 4 26 17 -9 -3 13 18 -1 1 6 11 6 0 1 -11 7 19 -10 -30 -5 15 -3 -22 -5 16 12 -3 -12 1 6 10 6 2 2 9 21
3248B1j8j1J7K6k5k6J8K2rk5J0J0o%Kj5RJ6mj9j3K4Nj9%PJ2rqNJ0mOJKj2K0ll
$$ 21 3 -8 9 35 10 -16 2 24 15 -10 0 10 4 4 6 -9 0 16 12 -7 -20 4 9 -10 -10 -3 9 0 -8 -3 7 3 9 10 12 0 20 17 14
3287A4j3K1Lk5mQK4k1j2MPMj0lJ%J4j2pJK0Mk2rOJ2qj1J4MQj3JJ0j5J5kj7%L3
$$ 14 1 22 25 0 -4 4 28 7 -5 -1 6 10 0 -3 -2 -2 12 0 -7 -6 14 18 -4 -13 -7 5 -3 -14 0 4 12 -1 0 10 -5 10 8 -9 -9 24
3327B4qj9nK3Lj5mQMJjlJKlJj3NJ4mk3QLPj3nK7j9MlmkRQ%j6NJ5Mj5mK0jj4j0
$$ 24 16 -3 -8 15 18 3 -1 7 11 12 11 8 9 11 8 9 -4 1 15 11 -12 -4 -1 6 -7 -12 15 -4 0 -3 -7 -9 0 8 8 -8 -3 12 16 1 -3 17 16 2 -8
3372hK0%mJj0J4J0mqj2J1J7k4pJK5j7k1KK4rj0MNoJJJj2NK2j4PlJ4j0LkjJ0rj
$$ -8 12 12 8 9 -1 13 23 19 11 -1 10 27 3 -4 -3 22 5 -16 -14 10 1 -9 -5 0 -6 -5 -4 -3 -15 -10 12 -2 5 2 16 6 9 7 6 16 7 6
3414FqMJ3nj3lJ7kqnRJ2j6lkJ4kj2OjKJ2rj7%OK1k4LJ2Np%j1JJ0LmJJOnrOJ4%
$$ 6 -2 2 15 10 -3 -6 11 9 1 -4 5 17 1 -2 -4 10 8 -4 2 1 3 15 6 -11 -11 -5 16 -8 -5 7 12 5 5 -6 -5 5 8 4 5 6 12 7 -2 4 18 18
3460A8j5j1J9nlqQlQMj3QLLj1rJRJ2j2j5J9jopjJ3Jn%%LoRj3MJ8Qj6qJ2Mnj1J0
$$ 18 3 -8 11 6 3 -5 3 0 8 12 -1 7 10 13 2 -7 -6 3 15 3 -12 7 6 0 -7 -8 5 6 1 1 1 4 -2 7 -6 -2 16 24 8 0 12 16 11 0 10
3505A0J0oopKJ5j2qj0J1J0j3lJ4oQk1J2rJ6j9J3j0PRKmkrJ2j0MLJKrLJ6j1mrP
$$ 10 20 14 8 1 3 18 6 -2 -12 -1 9 -4 -7 7 1 9 -12 0 -9 7 -12 1 -9 -2 7 9 5 3 -6 6 -4 0 3 4 6 -3 0 16 5 1 -8 -1
3547aQ%Rj6lMRrkmJ5j4jlPRJj1RoJ1j4%nK0Jmj6PK0nj1kJ0Jjj0KMJ8k0mjQOoj9
$$ -1 7 7 16 0 -3 1 10 1 -1 -5 10 -4 -5 -8 -1 8 9 -2 7 1 12 -2 -2 -7 13 14 10 -6 1 21 16 5 3 13 14 13 3 5 9 27 7 3 2 10 16 10 -9
3594iJ4J3j5rkQqMkJ0nOkj2PJ2mj5JJ2NpjLJJkNnMLnoNNNj9%Qj%nLLRj3oNLoq
$$ -9 5 18 3 -6 -8 0 -8 -4 -6 4 -1 5 3 -9 -2 10 6 -9 -8 4 9 2 1 4 5 6 4 9 4 8 11 6 0 5 10 15 -4 -4 4 3 3 -2 1 4 13 0 -6 -1 2 -4 -12
3645a2MJMQqnJ3Kj3RmK0lj1JkPlOj3QkN%qJ3j0mJLKKoKkJ%olJKjnK%KnrJ3J4j9
$$ -12 -8 -7 -3 5 -3 -8 5 7 -6 3 -1 19 16 5 6 4 11 8 14 1 9 7 12 12 4 17 7 3 4 7 9 11 5 7 5 6 6 0 -3 -2 0 -1 -6 -4 -4 -2 -7 -16 -3 11 -8
3696hJ1nJJ2ojQJKpqJ6kJj5nJ1lLjokJ2j0QoMkNk5J0OnJJ0j2Pj0lK%J4j3ONjJ
$$ -8 3 -2 -1 11 5 4 12 13 15 8 0 16 14 15 0 -5 6 3 6 5 -1 -3 9 -1 7 1 5 3 8 -17 -7 -1 -6 -5 5 -7 0 -10 -13 -11 -11 3 -10 -4 1 0 1
3743Aj4NJ2MoJ2rlJ0lMjlkjlj1J9mj3pK1pnqJ1Nlj3J9j7J0jJjnJ1Pj2j2K6Jj4
$$ 1 -13 -8 4 8 2 14 5 2 12 9 13 12 9 7 6 3 -8 11 7 -6 -13 8 1 -4 -12 -1 4 1 -12 7 -10 0 -1 0 -1 -6 5 12 0 -12 14 15 1
3786AJ%J8j8%Kj3K0lJ0j3kLProJ1njj4QPkknJ2pOj7jNJKKMjljj2J3J4j6%NnJ0
$$ 1 2 2 20 2 2 4 -9 11 8 18 5 3 6 13 4 -2 9 4 3 -11 -3 4 2 0 -5 7 0 6 -11 -12 -7 -6 -4 -2 2 1 -2 -3 -15 -2 12 -4 -4 1 -4 6
3832FJ0k0QOmLqoJ5mjllRqRj6JRrOj0QmpOJ2llnLJPj1kRPKj4J3pRNk0J2jMK%k1
$$ 6 16 -4 4 10 6 9 1 -5 10 6 5 2 -1 8 0 9 -7 -6 3 -6 0 -10 -2 -6 -13 -7 5 2 -1 -6 -3 -2 5 -6 -8 1 8 10 -4 9 2 11 16 -4 8 7 11 13 13 -8
3882hJ7k%LplNpMJkNqpkJ6j0kMKnmNPkkOqPPJ3j5kMLj4MLOmmjJkNoklJ1Jj5jk
$$ -8 9 7 7 10 3 0 5 -2 2 3 1 6 -2 -9 -11 5 -5 -7 -3 -1 -6 -10 -5 2 0 -2 4 -4 3 10 23 8 6 10 13 -1 3 6 12 8 4 3 4 2 7 1 -1 -4 7 8 -7 -8 -10
3935a0J7kj1j3J9kJKrRjNmj3K0j0jkNOplJ8pPj7KJRkknMNnKmjmjnNqJLMmjPmL
$$ -10 7 5 -6 -19 0 -2 -1 1 -8 1 0 5 1 -12 8 -2 -3 -5 0 6 -1 -4 14 7 14 -3 -1 0 9 7 5 0 4 9 4 6 2 1 -3 -4 -9 -4 -12 -11 -8 -4 -8 -9 -2 -6 -3
3986cKqJ3j6QPnjKMlOkmNoPlJQnPj5KLLppJ3j4J3k4J1%OmlJ0pK%%lK1j0j0%J0
$$ -3 -1 -9 4 -12 -4 3 -2 -3 -1 3 0 6 4 0 5 -1 6 3 4 12 7 14 -1 1 4 7 0 -7 6 -8 5 -19 -8 -8 -2 -6 -9 1 -6 -4 -4 -4 -7 14 4 -6 -6 4
4034DjOnj1QoRlNMo%lQn%j6QMj0OrOKKlQj0Poj1J5kKj4OMRpk%LJ1j2j%kJ6oJ2
$$ 4 3 9 4 -7 1 -5 4 1 6 10 4 4 1 9 4 4 -12 -4 0 -10 -4 -13 -7 -5 -3 -6 2 -8 -1 -7 -18 -3 -5 -3 -17 -11 -7 2 -5 -7 -7 -4 7 -5 -6 -6 -8 8 2 14
4084A4j4NRj7PrJ8j8LJ1j1ONj1Lm%Pj1lNkJ3j5PkLj1JkMlJ0qJ1JlkNR%jrPLj0
$$ 14 0 5 14 -3 4 -5 13 -5 -2 9 -2 4 9 -2 1 -3 -3 4 -7 -10 -5 -7 6 -9 -2 -4 -1 -12 -11 -13 -9 -12 -2 -10 1 2 -1 -3 2 11 11 10 1 8 11 1
4130AjPMokMLj0J6rMj1Mj4LOoJ5j2MjlMLmkoJ3j0LPMqoONNqklJ2mLjoJn%O%qJ
$$ 1 0 7 11 5 3 7 10 0 16 7 11 0 4 -10 -7 -1 -7 8 -4 0 -1 -4 0 3 -1 -3 -9 4 -6 -3 4 8 0 -6 0 5 10 2 0 -3 9 5 8 7 1 2 -3 -3 3 3 -5 -4
4182dPj4J6j0%J1rkpLNjK%nnNPNj1J5oKkLljmKPqOLkjRj4NPKj3JNpkRj4J2j2n
$$ -4 3 -11 5 -5 -5 6 -3 -5 -12 -9 -4 -5 -3 -3 -8 -13 -8 -1 4 -7 8 2 4 2 5 2 1 -3 -1 6 -2 4 7 5 4 13 -1 4 11 13 0 1 6 -1 -3 6 -8 4 -8 -13
4232a3LLmM%KKmQnKNrOPjJNj1J2qpOKjjoMKkqJ0nRokPj3%KLnnJ0Oj9QJPlJojJ4
$$ -13 -10 -7 -11 -7 -7 -5 -3 -7 1 -4 -2 3 -6 0 7 6 7 12 1 13 5 -2 4 6 5 4 -2 2 4 2 -6 4 -1 8 2 0 7 -6 -6 -4 -1 -6 -11 -1 5 -14 -6 -5 2 -1 0 -6 -7 7
4286GmnJ8mr%QrKMlkOj1kJ0JpLrNlMJpJQppMNmLpJ4pLmOM%Qk1PR%nj0J4j8RKj
$$ 7 3 -2 16 12 3 3 11 2 4 8 5 3 9 -2 -4 6 7 0 3 -6 -1 -4 0 1 -6 -5 3 -4 -11 -7 -2 -6 -3 -10 4 -3 0 -4 2 6 6 14 -7 0 9 9 4 -6 8 -10 -1 1 0
4339@LKMj9J6Jj0OrLqjRjj0%J0nkPkPkj5J0nJ9nmlnJ4qJ1nkLnJ2oLKrrJ9j4Rr
$$ 0 3 5 9 -10 6 7 -3 3 -6 -3 -11 -12 -3 -4 -14 -14 -4 -9 -11 -4 -6 1 -1 -16 -6 -11 8 3 -1 -4 -9 5 -3 8 3 1 4 -1 11 5 8 10 1 -8 11 -3 6 -3
4387cmPjMnJJj4JJOkNoQj0MRj3KJ3mjKoPJkmJ4j4kJ4mm%lJJ1pkj5J2J0j1pjRk
$$ -3 -7 0 -1 3 -2 -1 0 -14 -13 -12 -6 -8 -3 -9 -1 -11 -7 2 -11 -9 4 0 -1 1 -5 2 3 1 -3 11 -3 -5 9 5 1 1 -2 -1 10 3 1 -14 -2 8 -3 -10 -11 -2 -4
4436dnMJ5j4ljkJJ6j2pJ0jlLkjK0j4Qj0PLRj5mjJ9pjOlqpRjoQj0J5j4mMmkmJP
$$ -4 -9 -5 10 -4 -7 -8 -10 -9 7 -5 -12 -2 -3 -6 -3 -5 -6 14 0 8 -2 5 8 17 2 -2 -3 16 9 8 14 11 3 -4 5 4 -2 6 -4 11 -3 -7 -3 -7 -9 -13 -12 -5
4484ekoJ7qjOlj3OJ8nmMOrjJ0mKMmJ%njLmlrJ7jrNn%%j1J0k%%Rk2J3Rj2Rj1J4
$$ -5 -7 -13 4 -4 -5 1 -2 -15 -9 9 4 0 4 10 1 0 10 6 8 12 8 9 9 4 3 6 2 -1 -10 7 6 -3 2 -3 -3 -3 -14 -4 -6 -6 -6 3 -19 -6 3 -9 0 -11 3
4533CqPNmJKJj3NMJ7k3J2j1RLnopJ1qOmN%kjjMjnl%%OjJ2j3LLJkMJjknkP%qR%
$$ 3 -5 2 7 3 4 6 7 -6 -1 3 20 -3 9 -2 7 10 5 -1 -8 3 -5 1 -3 2 2 0 -1 -2 2 1 -4 -7 -7 -7 -1 -2 10 -3 0 3 4 2 6 7 6 4 -1 -3 4 4 -4 5 5
4586EMlOjrmLOpOkoLpLpKJ4pqMJPmkLjKQJk0R%kjJ4jrNJMLj1PqKMllKJ5rlLnQ
$$ 5 9 6 12 11 2 -2 1 7 0 6 4 -2 1 -6 -3 -10 -8 6 -1 -9 -5 -4 3 -1 -3 0 -1 1 9 10 -10 -1 -1 -3 -4 10 9 0 5 6 10 13 2 9 1 3 7 4 1 3 18 9 6 9 4 12
4642A2j3rKKj0J9nj3OPmkKKj%l%RPj0oJ3j3J2JkJj4LJ6llLoMqJKpPj0J6j0jQj4
$$ 12 -1 -10 -8 -6 -16 3 -2 -15 -9 -2 -6 -8 -6 -4 -5 -5 -8 -8 1 8 -2 -8 5 -8 4 5 3 4 -10 -7 9 6 3 6 0 4 -4 -3 -1 -8 -1 -11 5 -5 -6 2 -12
4689a2%ljJ2p%PnLnJ0MnNpKJLJ3j9QOj4QJ1kj0JpRkkoOLlJJnnpmJ3rJ1%j%LMj0
$$ -12 -12 -15 -16 -4 -11 -11 -4 -9 -6 -11 -1 3 -2 3 -4 -2 -1 2 15 -4 4 10 -4 4 15 13 3 4 -3 6 4 2 -4 2 5 2 3 4 -1 -6 -13 -17 -4 -13 -2 -2 -3 -3 0 4 -6
4740foJ0kMn%KJ7j3OnkO%j0J1JnKlJ3k1J1m%pJ1poMkMj5QK%j1PNLlOlKn%J4k5
$$ -6 -12 -2 -4 0 -5 -5 -3 14 1 7 2 0 6 6 -4 7 8 3 5 2 15 -6 5 1 1 -6 5 -2 -8 -4 -6 -2 -17 -9 -7 -7 -18 -11 -6 -3 -6 0 -3 -1 -6 -6 8 -17
4788a7J6OkRqPj1Oj2J5pRo%lJjnJ0kjj1NnRqmNm%LrJ1Qj1NJ0pQpj2J5nnOknK0
$$ -17 -1 5 3 12 4 11 0 6 -6 9 2 11 5 5 2 3 2 -3 7 5 4 -7 -2 -7 2 -6 -10 -5 -9 -9 -6 -15 -4 4 -7 -2 8 1 9 2 -10 5 0 -5 1 -1 -6 14
4836A4pn%oM%N%kK%nJKKoqLLm%LJ%nKoJ6mj0NLnLK%JJpKJ0J0klpJkj1KJ0mkNl
$$ 14 7 2 2 -4 0 0 5 5 3 5 5 0 1 3 5 -1 -9 -6 -3 -7 -7 -4 -3 -3 -8 -6 -12 4 0 -10 -5 -2 -7 -4 -2 -2 -1 0 -7 -5 5 15 13 10 3 4 2 -9 -7 3 -1 -3 2 -1
4890aMNj1J2j7Oj1J3Oj4mlJ2mJ0j5J2njMLrOPrQqJ4qNMKmNpMlMj3J0rKmJ0j7Q
$$ -1 3 8 -3 9 -8 -2 -13 0 6 -8 -12 -15 -3 -7 3 -12 0 -5 -6 -2 1 -8 -2 5 -4 4 -4 10 2 7 11 13 9 14 7 11 8 12 -1 9 0 2 -2 8 -9 -1
4936apjKKjkjOKMnOmnJMRj3nK0j4MLmNnPkK%nJ0j4lKJ0j8J6o%KpKk%KKloLPLr
$$ -1 -8 -9 -7 -5 -6 -8 -9 -3 -1 3 -2 4 0 -5 -4 0 9 -4 -9 11 -3 1 4 0 5 0 7 5 7 7 2 12 -2 -5 -3 7 -11 5 -1 -1 1 -6 -4 -6 -6 -4 -2 -5 -11 -8 -1 2 -7
4989gjmJ2j4J1mNJ0roRRlNlpJ1nlNj4OLrRj2RjmpLKqLM%plMkJ0%kNqNNlmJ2nL
$$ -7 -8 -12 0 -14 -3 -7 -2 8 -1 -7 2 11 8 13 10 3 14 9 6 11 -3 3 6 -3 6 -6 3 2 -2 -9 -6 -4 -12 -9 -5 -5 -12 -15 -11 -13 -3 -3 -5 0 -8 -3 2 -1 -5 7 2 5
5041ElkMQmj1PJ1oqklRlJnmLkKnJ2npmNm%NMmmmJ6pkpJ4Nj1kJnJ1LLlmOmKjRM
$$ 5 2 0 4 12 8 -3 4 15 9 1 -1 -4 5 2 3 -2 -6 -3 -5 -3 -8 4 -1 -8 -12 -7 -11 -11 -6 -2 -6 -10 -14 2 -5 -7 -14 0 5 -6 -8 -7 -12 -1 2 5 2 -2 4 0 2 1 10 14
5095A4j3jmLjj4LOLPj1KLqlNRnm%%%RmoKJ2jKl%J0q%jllKNKjmQj8J8pnj0J1jJ
$$ 14 1 0 -4 -1 -2 -16 -13 -7 -4 3 -8 -6 -3 -11 -14 -9 0 -5 -9 -9 -9 -9 0 -4 -10 -8 4 3 5 2 2 12 4 4 3 0 -3 -1 4 6 5 1 9 -9 9 2 -3 -13 -2 -3 -2
5146bj5RkMJoP%joJ1m%%%PQj4KJ0j4JJ7j7J2joNnJ1Jj8RjjqJkMPj6J4oMj9J3L
$$ -2 -17 -8 -10 -6 -5 -11 -4 -4 -5 -11 0 -4 -4 -4 -4 3 11 -3 -1 9 -5 -4 13 -4 8 7 1 6 1 12 13 -5 4 3 2 -6 -5 -7 -3 4 -12 2 -4 0 -19 -6 -3
5193cmljLlNNNqlJ0MoQnKmPpjJ5j5Oj0%J1%Jl%qNmKmlj%Rj1Pj4J0LqkJ2pJ7k5
$$ -3 -7 -10 -11 -8 -11 -6 -1 4 -4 -7 3 7 1 9 4 6 2 9 2 1 16 1 7 -3 -3 8 8 9 6 6 -2 3 -1 1 -3 -6 -7 -7 2 -9 -2 -16 -6 -3 -11 -13 -1 -8 9 -16
5243a6KMMRlj7J4KlO%lpJ5pJ0j3jJ0Lj3%Rj1Rj6J5%pl%pQJjQql%lJ1PpjoNKLl
$$ -16 -14 -10 -6 3 0 -17 -3 -1 -4 2 2 -1 -8 7 0 10 -3 -4 6 9 -4 -4 5 -6 3 -13 2 2 -5 -8 -8 -15 -7 -6 -7 1 -7 -10 -10 -13 -2 5 -2 -3 -9 -4 -2 1 -2
5292bRllJONjj4Qp%LjKJjqMLJj3OOj1rJ7oqJ2Nj4QjmJNmJ0kJj3J5oJ4mJrJ0nj1
$$ -2 7 4 1 2 8 13 12 -2 6 -1 -1 2 1 3 4 3 -5 -1 2 3 -10 -4 2 -9 -18 -1 -7 -15 -3 2 -12 -4 -5 -9 -8 -3 -7 3 1 2 -11 4 -2 12 8 9 0 10 5 -6
5342fQMjLqMoLjNmq%KKlLj6J4rPKL%oQj4K0j1KJkLKJLljJlJ2mqJ0oJ3j4Oj5Pn
$$ -6 2 6 5 8 0 4 -2 1 0 5 1 -7 -7 -5 -3 -6 -3 -19 -5 -14 -7 -5 -2 -2 -8 0 -14 6 -5 -3 -2 -4 -1 1 2 5 2 1 2 -1 11 7 -1 9 3 16 2 8 -7 0 -5
5393ekNkoMjqJkJRKnJ3oMoj%nJJ3%pQo%JNRll%JKj9Q%Jj1J0LMqlmkJpJ2jrJ7j0
$$ -5 -7 -2 -4 -10 -6 -7 -15 -14 -16 -15 -6 -4 -9 4 -2 2 -4 -5 -5 -10 -9 4 4 -3 5 -1 -1 0 5 14 11 8 8 9 11 -8 0 0 1 -10 0 3 7 -1 -4 -8 -10 -9 -16 -4 -5 -14 3 -7
5447gNLLj5PlNNoKKQmkJ7j0j1PmJLMrJ2j2j1J1Nj5LOmOjojl%%PMJql%j1J5QJm
$$ -7 -2 1 4 -11 -4 -7 -2 3 -3 -1 1 9 5 3 20 10 -1 6 2 3 6 10 1 13 1 -10 1 6 -9 -6 0 -4 2 1 -5 -6 -9 -9 -9 -2 2 3 -5 -8 -8 -19 -4 4 5 1
5497Aj0J2MloJ5j6JPPq%MnlMkMmpj1JJ1J3j2NmjkPoqNoOjKOj0QmKRll%JlJ6j7
$$ 1 -9 3 7 4 -2 13 -3 -2 5 12 4 4 8 3 0 4 2 6 2 -5 -16 -15 -4 9 -3 2 -2 -3 -5 2 -4 -12 -7 -13 -7 -8 -6 0 -10 -2 -6 -4 5 2 -1 -1 0 -3 13 -4
5547dOMLjmqRoJ4j5LlMJj5RoMLLlJ2j5kmLkNjNonjJ1Rrj2J1QlRj2Lj0PNLJKnp
$$ -4 2 6 9 8 4 -4 5 -1 13 -2 1 -2 2 3 -12 -3 -9 -5 -2 1 -2 10 -5 -7 -11 -8 -10 -5 -6 -1 -7 -12 -13 -2 7 -2 -14 -3 5 2 11 -1 2 -8 -1 4 7 8 10 5 -2
5598bNQj0lPmpkJ1qnOpJ0Kj1lnJ5lLJrJ6lrRnJ1mjlJKJkmKjMQj0MKj0j0NQmkK
$$ -2 3 11 1 -2 5 1 -6 -8 3 -5 -10 -4 -11 -1 1 -10 -13 -18 -3 -6 -3 -2 -11 5 2 -7 2 -3 8 4 3 0 1 3 4 2 -2 0 -1 3 11 1 5 7 -3 -13 -8 0 -4 -6 -4
5649dKqj%%kPj3RRjmOjJ0lmm%PpQoJJPj0NkqNRj4Mj3J7moOj2RqNMomMNOj0Qlm
$$ -4 -2 -10 -11 -11 -11 -13 -6 -19 -10 -1 -2 -6 0 -1 9 6 2 -2 -2 5 -2 6 0 1 2 9 -1 4 2 -6 -1 8 -6 -2 -15 2 -2 -8 -2 -14 -5 -13 -8 -4 -10 -14 -10 -5 1 -9 -1 -4 -8
5702hMPj3PqnMMJ4knJ2lj3J0l%nNj%j1J1qJ3po%J1j5J4jj8J1nPJrP%qJ4rkOLq
$$ -8 -4 3 -10 -3 -11 -16 -12 -8 6 4 -1 11 8 -5 5 2 2 -3 2 1 1 -10 1 -7 6 -1 -7 -7 4 -11 3 2 -16 -5 -10 -3 -2 -11 -4 -4 -12 2 -7 -9 -3 0 -8
5749hJ4j2J1pJJ1rknN%QKprNKqkJ0qkJ0p%kj2J5QmnMKkpNk%oJ3j0J2pKN%Qj5P
$$ -8 6 -6 5 -2 -1 10 1 -1 -6 -1 -1 7 9 2 -7 -2 0 -8 -10 0 -8 -10 0 -7 -7 -9 -21 -6 2 -2 -7 -3 -1 -3 -10 -5 -7 -7 -13 0 -10 2 -5 -3 2 2 10 -5 2
5798BkJllRkMojMlk%KkrKnJ3m%MqJmOLj1J7j9J6knQjj4J2JRKj6OkKJ1j2qQN%o
$$ 2 0 1 -2 -5 4 2 6 0 -1 3 0 -2 -2 0 -2 -11 -9 -14 -1 -5 -5 -1 -9 -8 -12 -6 -3 -14 3 -16 0 -2 -7 1 0 -14 -2 -1 8 10 -6 0 -2 0 11 -1 -9 -1 4 4 -2
5849bPmonJQqJJ0prJ4qokJ6r%oRjJ3j7J5loPJMnOLmJJlOkrnPMqRoJkk%j0J2j1
$$ -2 5 1 -5 -10 -9 -1 -9 -8 2 -5 -14 0 -8 -14 -16 0 -9 -9 -15 -6 -7 6 -11 4 1 -5 2 3 7 2 8 11 7 8 9 6 12 10 1 -4 3 7 -1 8 2 3 1 -1 -1 -11 1 -10
5901a0J0plnMKLKkONnkOjkkN%JKj3PPj0lRjJ3ppqM%rLJ1mnOpOqL%kNpPqKOmOP
$$ -10 0 -7 -10 -15 -11 -9 -6 -4 -6 0 5 0 -2 4 3 1 -1 4 4 5 7 -6 1 8 -2 -5 4 3 16 9 2 -6 -2 -2 -11 -8 3 -1 -6 0 -7 -1 -9 -6 -6 -8 -3 -10 -3 -11 -9 -3 -7 -1 6
5956FlLmj1K1pmNkKoLOqLJLJrP%krMLqJ2j1JJmkMlOrj0K3kjjKJ%kJMPpJ0qj3J0
$$ 6 3 6 2 -9 12 5 1 6 4 6 0 3 9 1 4 5 8 9 0 7 7 5 -4 0 3 -5 7 -4 -3 -2 -6 -8 -4 -7 -1 -10 -20 3 1 0 -1 1 2 2 0 1 5 12 5 15 7 -6 4
6009DmJ4mmpJ4pLolLmJLmpRKrPmlqJ3Rj2Qj1RkoMLMqPNnJLoOrPQjlLj4nJ9j0q
$$ 4 0 14 10 6 -1 13 6 9 3 0 3 -1 0 3 -1 -8 1 3 -6 1 -3 -6 -14 -1 8 -4 4 -7 2 0 -6 -2 1 5 -3 4 9 4 5 8 2 8 -1 6 14 13 10 13 -1 -6 13 3 -5
6062eOPj5J0j1QlooJ4%KKj3QJmJ1j4J3j3L3j5j1Rj2J7nmOjjoKLkoJ1j5J6j5JL
$$ -5 1 8 -7 3 -8 0 -3 -9 -15 -1 -1 1 3 -10 -2 -1 -5 6 -8 5 -8 25 10 -1 8 -4 13 8 4 10 9 8 2 4 7 5 -1 10 -5 11 -4 -3 0
6105@lqJ6Mj3Qj1LjJ3kmRj4J0rPJj0Oj1NPJnMQkmqOmJ1klLj1J1jpjM%rLpLJ0k
$$ 0 -3 -11 5 9 -4 4 -7 -4 -5 8 6 2 11 -3 7 -2 5 6 -4 2 -9 -4 3 4 -1 3 11 9 5 -3 3 -1 10 8 5 8 -3 8 7 0 -1 3 3 -6 -3 -10 -7 3 1
6154Aq%OqJ7j4J1pJj4KJ5jlRmPJLoKnK%MJMj4JljRm%oJlNlNj5PmNQJpJj0K1nK
$$ 1 -7 -7 -1 -9 8 -6 5 -2 -1 -15 -13 2 1 -2 7 3 10 11 14 8 10 5 7 7 11 12 16 2 3 0 -1 8 4 4 -2 -1 -4 1 -2 3 -12 -5 -9 -4 4 5 -2 -1 -11 10 5 7
6206GljnNKoJ4j1Jj0J2J4pj1QpoJNkJpQj0J0%PqpoK%J%nNMkLkJkLOLPpmQnj1M
$$ 7 4 3 -2 3 5 -1 13 2 3 -7 5 19 12 1 9 2 -4 -3 2 0 1 -6 2 -8 2 2 9 1 -6 -12 -10 -10 -9 -9 -14 -9 -5 -7 -4 -6 -5 -7 -4 2 5 12 5 1 9 4 -7 -3
6258clJ1%jnJ4qjoRrOkNj%noPKjlj1LOj0nJ3qlJ6oMkNrJ3Nj0LNpLQjpPmj3%Ok
$$ -3 -6 5 5 4 -1 13 5 4 -2 7 -2 4 2 7 6 6 1 -5 2 4 3 0 -11 -8 -2 -12 -17 -4 -12 -15 1 -5 -1 -3 2 -7 6 11 1 4 9 2 5 13 12 5 12 8 -5 -5 1 -1
6310aLokmKJ2k%j1MkNj0J1pNKnJ2rqPJ2k1J1KK%Q%nMnOojL%%LLqpJ3olmNkj0l
$$ -1 2 -4 -6 -10 -8 4 2 2 -9 -5 -7 -2 -12 -1 -8 -3 -1 -6 6 -3 -11 -4 8 -13 -2 0 2 2 10 10 5 9 4 10 4 3 6 6 6 9 12 4 -3 10 4 1 -3 2 0 -10 -13
6361a3J3Jq%QjlMkjJ1rOL%kNnRj2LJ0j0Pj4MLrJ3%rOjkmRj6NQlkLNj1jJ1j0nm
$$ -13 0 1 -7 -7 1 0 -3 1 -1 -2 9 0 6 9 9 7 12 7 16 4 7 17 7 14 0 4 7 -2 11 11 2 8 7 5 1 10 -6 -1 7 4 2 5 10 -1 -2 9 -1 -6 -10
6410a0R%%MM%Pj7KPOmMlj2J1J3oKj5pPlRmP%rMmLoj1J0%kjNJoj2J7nL%KKL%Kj3
$$ -10 -1 -1 -1 3 7 7 14 -3 -1 6 12 8 12 9 -3 8 21 15 17 2 -5 2 -1 8 4 11 11 2 6 2 5 -1 -12 -2 -2 -4 -5 0 1 -5 -17 0 -5 -2 -2 0 2 5 5 7 -6
6461fJ6pkJ8qoJ2j0ONj0ooJ0nKPplPoPj1NKmjKk%lKLklPj2J2JNqk%MlkJ4pJQo
$$ -6 10 3 1 19 11 5 17 7 13 18 8 2 -4 6 1 3 10 3 0 7 1 8 -3 2 4 0 -1 1 -1 -1 -4 -2 1 -1 -4 3 -9 3 4 9 1 -1 -1 3 0 -2 12 5 6 14 8
6512Hr%R%LnjNjj7QnMQjopkLOKj%mpJ6KrM%kj4J9Jj0Oj1J3jrK4j2%%LqNOj1Rj6
$$ 8 -1 -1 8 8 11 6 5 10 9 -8 0 -5 -1 7 6 0 -7 -9 -6 0 2 1 1 -3 -10 6 8 -1 3 3 1 -13 6 7 -3 3 -8 5 4 -5 19 7 7 7 10 2 7 13 2 11 -5
6563eMmNnJ4j3kmOKlKrJ3kKNj2kRkNoLkJRpKKJ0j7J1opNLMlqQqlRj4NoPLnrJ3
$$ -5 -1 -5 0 -5 9 -4 -6 -10 -4 -2 -5 -3 -12 1 -1 1 6 -6 -8 1 -1 4 -2 1 -1 0 9 2 4 6 16 -1 10 4 -3 2 5 9 6 -2 6 -2 -5 4 -10 -5 -11 -4 -1 -6 -15 -2
6615boNmJnKJ5lj0%J1KJrMLMpkJjlJPjknlJ1Pk3J1lJj4J7j4J7mJ0j4mpQMoKJ4
$$ -2 -8 -3 -7 -6 -11 -9 6 3 -7 -7 4 6 7 -2 2 5 9 2 0 1 0 -3 -2 5 4 2 -3 -6 5 12 -11 0 -3 -2 -16 1 -13 4 0 10 -4 -8 -15 -7 -3 -9 -7 7
6663Gj2KmRKKrOJ1j5kJ4moPkMrOnJjLmnMj2J1%MloOmKnJ0j5MpJ2NlkKm%K0j2r
$$ 7 -5 -3 -7 2 4 6 -3 3 14 -1 -3 11 7 1 8 6 10 1 7 2 3 2 5 1 -4 0 -12 -1 -1 3 0 -6 0 -4 -2 -7 3 -12 -8 -15 -3 2 -1 -3 -1 -5 -5 15 3 -6
6713fJ5j0Rkl%Nj2NJJKjNnKlrrRJkLJrNMplNrJ3oPjj2J6qNoJ3plPJ0j4JJ5j1N
$$ -6 9 -1 8 6 3 3 8 -4 1 2 3 5 4 9 4 6 3 -6 -15 -6 -5 -7 -4 -3 -12 -7 -3 -10 -13 -8 -17 -4 -10 -3 -4 -16 0 -8 -3 -9 4 -3 -6 1 11 -3 -2 13 2 7
6763GpmKJ0rOlNljpqJ0%j%%pQnoLnNRkkPorQKMNkjKLjj2J3jj3J3Nj3PrJ2j6No
$$ 7 0 -4 -2 8 -1 5 2 7 4 3 -4 -12 -2 -2 -3 -3 -3 -10 -2 -7 -13 -10 -15 -10 -1 -3 -5 2 -4 -13 -5 -3 1 6 4 3 5 8 7 -5 8 7 -6 7 12 -1 6 -3 9 -7 -2 -8
6815hRkpO%KnkKnMmNllPlOj0J3kjKnJ4j2MJ5j0PrOJ%mJMokjMj5QjnMKjooJ0kl
$$ -8 1 -1 -8 -2 -2 0 -5 -7 -5 -10 -6 -10 -5 -8 -11 -4 -7 -1 -11 2 0 -1 1 -4 10 -2 2 17 7 14 5 11 12 12 8 9 13 7 5 4 8 -7 1 0 -5 -1 1 0 -6 -12 -2 -4 -7
6868gJ2j4JOKj0J5Nqj0J1mOokNjLMlrK3j7MrQlOj0oQMrLlNj2%J3rlJ2nJ%LnKK
$$ -7 5 -9 -8 -2 0 -10 5 10 2 -8 3 -1 5 -1 -3 2 1 4 8 5 -4 19 2 6 -3 5 2 8 -2 -8 0 4 -5 -2 -5 0 -12 -12 1 -8 -11 1 -4 -3 -3 0 -5 -3 -1
6917a%QmkLkKNKn%qQj7J5k%LKj3QjL%j2OJj0K3rk3ROmLQJ%j2RlJ0lmLoKkQJ0j0
$$ -1 -1 7 3 1 4 2 4 9 11 6 6 -2 6 -11 4 2 2 5 7 -6 2 1 4 4 -8 -2 -1 -11 12 3 -20 -11 -5 -9 -6 2 3 3 -9 0 -3 7 4 0 3 -3 -1 -3 5 15 5
6968ENklJQj1J1j3J0j1Qkj1LJ3Joj2JNKrNj3J6qJ0j0NmM%mKrJ4j0J6nJj4K5Ll
$$ 5 10 8 5 6 14 3 14 1 11 0 8 6 -5 -2 11 12 6 -6 -5 0 2 -7 -2 -15 1 -7 3 -7 -2 -6 -2 -2 -6 -4 -13 1 -9 7 2 3 -11 14 17 14
7012A4j4KJ1qKj0J1%nmMnQj4lJ6j7oJ3MjMj0Pj5J4mpPMQlkOqKkLJ2pjPKj2OpN
$$ 14 0 2 13 5 7 -3 8 8 3 -1 3 -2 6 -8 -11 5 -12 -18 -5 -1 -2 2 -8 -1 -16 -2 -6 -13 -6 -2 6 3 1 7 -1 1 -1 2 14 7 6 13 15 3 9 2 7
7059GMnlK%jrMJKpmPl%KnMOj%j0QJ%jOKn%oJ7Qj4LkMj1QpNOojLjj1Oj6K5rNmm
$$ 7 11 6 3 5 5 4 -5 -1 0 2 -5 -9 -2 -5 -5 -3 -8 -4 2 1 1 -9 -1 0 0 -1 5 7 2 2 -4 13 21 7 10 8 12 1 9 2 7 13 7 6 9 8 -3 3 -13 12 3 8 4 0
7113@MmmM%kLkLj0J3oQqRj2J2JlkKjjJ3j1%JKMojJmj%oJ0j2OJqOKnkkPKqjJ1p
$$ 0 4 0 -4 0 0 -2 1 -1 2 -8 5 -1 7 -1 8 -4 8 9 6 4 6 5 4 17 6 6 7 9 13 7 6 7 3 2 2 -4 6 -6 0 1 -7 -1 1 -4 -6 -8 -1 1 -7 -8 3 -4
7165dRjJnLLJ1j7J0kPmoljm%J0mlLJmrJ0LKrNqNLnkLoQJpQpmLJ1j8J2%KqOJ0n
$$ -4 5 4 5 0 3 6 17 0 10 8 15 11 5 2 1 -3 -3 7 3 0 3 4 0 -9 1 4 6 -3 2 -6 -1 2 -3 -5 -2 -8 0 1 -6 2 -5 -9 -6 5 -13 -1 -1 1 -7 -1 9 4
7217DLNmqQpkJ0Oqql%j%JLJJooNkPjj4KPJ0j2PlLkJlNkJ2kqjJlJ2okkMLkkoJ3
$$ 4 7 12 8 0 8 1 -1 9 15 7 -1 -4 -4 -5 -5 -4 -1 0 1 -5 -11 -6 -8 -1 -2 -16 -14 -7 3 -9 -2 -5 -2 -4 -3 -6 -1 -3 9 7 -1 -2 -1 -4 8 2 0 -2 2 5 3 1 -5 8
7271Hj0kjPmnJ2kj1J0Moo%JJQ%mj1J4nKKJQj0KlLjJ5j6%J0kNj4OMojQnMlOj5J
$$ 8 -2 -4 -5 2 -2 -7 5 3 -8 2 6 0 -6 -6 -5 -4 4 4 0 -11 3 -2 0 2 3 11 1 3 0 3 2 17 1 1 11 9 14 0 6 10 4 3 11 6 10 7 13 -2 -1
7320aOnJ2j6oOmOlnLNQrJRqJ5k0MOJKjJNPnnjojMJKloRj1mJ1j1L%JMnKj2J1n%
$$ -1 5 0 12 -4 -10 -4 -8 -2 -5 -10 -7 -2 6 -3 -2 7 -1 14 -6 -2 4 5 7 6 7 12 19 14 9 8 2 1 5 6 8 5 -1 8 -3 -7 4 -7 -4 -4 -3 1 -4 -2 -14 -3 -8 -8
7372hRJj0RLNpMkjPj2KKlMloJ2oLJoQj0PlkJKkPj5RKplj0NLPkjLKnPjjnRJJ%Q
$$ -8 1 2 -8 1 4 9 2 6 4 3 10 -2 0 2 -1 3 0 -6 6 0 3 4 -2 6 -4 3 0 -2 -1 1 -1 6 -9 0 2 -5 -8 -18 -13 -10 -3 -5 -6 -3 -1 -6 1 0 -1 -6 3 4 5 5 13
7427A3j2mJ1Rj5RqlOJlj1OklQj0kMqJ1j%rMjmLMJ2pKmJKmOOmLoOj1OJ0oLj0%N
$$ 13 1 -3 8 17 2 11 3 0 6 7 4 -7 -1 -3 -6 2 -8 -10 -6 -14 -3 -4 -4 -13 -9 -10 -14 -11 -7 5 -2 0 -4 -3 -1 -5 1 7 3 6 0 6 -5 1 11 5 8 -2 -2 3
7477CLlJ1j4rMnlJ4mk%Oj9QJ1mj4J0o%LJ8j4KkKJ2j0Mm%NlJ5kqQj1L%jL%j6K0
$$ 3 6 3 14 0 -9 -5 -10 -13 1 -3 -5 -5 1 -18 -10 1 -3 -17 -7 -13 -13 -10 8 -6 -4 -6 -4 8 -2 2 -2 -2 3 0 15 13 5 13 2 5 5 4 7 7 -9 11
7523A1Nj1nqMnoJ3lJ2k1J6pJ0m%kJ%j1MKLJ3pmJ2lJ0j0%KoQJj3LJ1j5Qj0NlQl
$$ 11 16 5 0 -8 -4 -9 -15 -2 -5 7 -14 2 -5 5 1 1 -1 0 0 -11 -7 -5 -2 11 4 0 12 9 19 9 9 11 5 13 14 1 4 15 0 8 -2 3 0 8 5
7568EmqNjKoMmNMKmoKLMOj2qRlOKKjOpK%J1rOkmnJ0omMomJ3j3KKpJ1qKKnmLNJ0
$$ 5 1 -7 -2 -3 -1 -7 -3 -7 -2 2 4 0 -6 -4 -1 3 9 -3 -11 -2 -5 1 3 5 4 10 3 5 5 16 7 13 11 7 2 12 6 2 6 0 -4 9 -4 -2 0 -7 4 -4 -2 0 -5 -9 -6 -1 9
7623Irj1J0mlJ2klLQk2J4Pj1J2j4J1j1QJ2j5kJ4rj2K0oqJnMLKmJ%qlOqmJ7loJ2
$$ 9 0 -11 -1 -5 -8 4 2 -1 2 10 -12 2 9 -2 10 -4 7 -4 4 16 1 -1 13 4 -8 12 6 -2 -1 -6 -2 1 3 -1 0 0 -8 -11 -5 -13 -17 0 -3 -9 3
7668Cj0LJ0moRL%mNMpLMkj1Oj2KJ1p%Ml%NjrLJqPjnjnMnK1qnRJkJmJP%lmKJMj
$$ 3 -7 -4 6 2 -4 5 8 8 4 9 13 6 9 13 11 0 6 -6 -4 7 0 0 4 1 1 6 5 -4 -1 0 -8 -1 -2 -7 -8 -13 -9 -14 7 -1 -6 3 4 2 3 -1 0 7 7 4 0 2 3 7 6
7723FkRkmLjJj2JkMnLjRlnkjLnlM%MMj2LJ0j0Ol%OnOKNnjkNmPkO%j4jlJ3j4KK
$$ 6 4 13 11 7 10 9 10 -2 -1 -3 1 -4 -1 -2 7 4 -1 -3 -4 -1 -6 -9 -5 -5 -1 3 -9 -6 4 -6 0 -3 -3 3 -2 4 6 11 6 5 3 8 4 11 9 15 15 1 0 -3 10 -4 -2 0
7777@mNlpJ1olRnj%lj0J5jn%Mn%J3qNJ0j1OpqJ2mJ6j9J0JJNJqqOMk0K4j5MorJ0
$$ 0 -4 1 -2 -9 2 -4 -7 2 -3 -4 -4 -7 -17 -2 -3 -8 -8 -4 -9 -9 4 -4 1 11 0 6 -1 -9 3 -1 15 -4 6 7 8 13 14 6 -2 4 8 -12 12 -3 1 -5 -14 -4
7825djPj4%jRlkMKmQoOlJ3JqjNoNqJ0onoQPjlpOOKLj6mlM%Nj1PqPMjQj0mJLPL
$$ -4 -5 2 -12 -12 -13 -4 -7 -9 -5 -3 -7 1 -5 1 -2 11 12 4 3 8 2 7 -1 9 3 -2 -8 0 7 6 3 -4 2 8 10 13 -3 -7 -10 -6 -6 -1 -12 -5 -13 -6 -2 -3 5 -5 -9 -8 -5 2 5
7880EJj0PkqORQj9MjJPjjpJnRjLnJJjMj0nmJ2j1J1j6J1%j3NJkNOJQmqJ3onM%O
$$ 5 6 -4 3 1 -7 -1 8 16 -3 1 0 1 8 7 6 -1 0 -5 4 3 6 1 2 3 2 6 -4 -9 -13 -1 -12 -1 -17 -6 -6 -19 -14 -13 -15 -10 -4 -3 5 1 -7 6 0 -5 -1 -1 5
7931EKpnOkmRljolJ1jNnoj3J1j4K3mlmKJMKMjj3PqJ5J2j9mJ4oQljJqMKJ1j7J%
$$ 5 7 0 -5 1 -1 -5 4 1 0 -6 -9 2 1 6 1 -5 -18 -7 -21 2 -2 -5 -9 -7 -6 -2 0 4 3 -10 -3 -11 4 16 -3 -7 7 1 9 6 5 6 -2 2 4 15 -2 -1 -1
7980aJjjJmmjJ2qnRnmLQoj0J7j1J0qJ1j2lK7j6j%JQJPjq%PJrJ0jrJmJ3j4MKj1
$$ -1 0 -1 -2 -1 -5 -9 -10 2 -6 -11 -2 -7 -11 -8 0 -6 -16 1 -10 0 -8 3 -9 -12 15 -1 -2 -2 -1 7 8 15 14 6 6 13 14 5 15 14 5 6 2 15 1 5 7 -4
8028dKLjkOooQJj3J1kojOMnOqNkPlOrJ2mOkoNj5KLJ3okmJ0roNj1J2plOmMoMkr
$$ -4 -2 1 0 -2 4 -2 -8 0 1 -12 -1 -3 -9 -10 -4 0 -5 1 -7 -2 -4 3 0 6 -3 9 5 11 9 3 8 -7 -5 -2 11 5 3 -1 9 0 -6 -1 -12 0 -7 -10 -4 -8 -4 -10 -6 -8 -17
$$ [...]
8191@
##END NTUPLES=NMR FID
##END=
