##TITLE=1H_LY-DMAA.Per.2.7
 CDCl3
 8 sc, 
 10.02.2022
##JCAMPDX= 6.0         $$ Bruker NMR JCAMP-DX V2.0
##DATA TYPE= NMR FID
##DATA CLASS= NTUPLES
##ORIGIN= UXNMR, Bruker Analytische Messtechnik GmbH
##OWNER= root
$$ XWIN-NMR		Version 3.5
$$ Thu Feb 10 12:26:56 2022 Russian Standard Time (UT+4h)  she@DPX200
##.OBSERVE FREQUENCY= 200.131346
##.OBSERVE NUCLEUS= ^1H
##.DELAY= (6, 6)
##.ACQUISITION MODE= SIMULTANEOUS
##.ACQUISITION SCHEME= undefined
##.AVERAGES= 8
##.DIGITISER RES= 18
##SPECTROMETER/DATA SYSTEM= spect
##.PULSE SEQUENCE= zg30
##.SOLVENT NAME= CDCl3
##.SHIFT REFERENCE= (INTERNAL, CDCl3, 0, 15.7039)
##AUDIT TRAIL= $$ (NUMBER, WHEN, WHO, WHERE, WHAT)
$$ ##TITLE= Audit trail, XWIN-NMR		Version 3.5
$$ ##JCAMPDX= 5.01
$$ ##ORIGIN= Bruker BioSpin GmbH
$$ ##OWNER= she
$$ F:/spectra/data/she/nmr/H-F/1/audita.txt
$$ ##AUDIT TRAIL=  $$ (NUMBER, WHEN, WHO, WHERE, WHAT)
(   1,<2022-02-10 12:25:12.51 +0400>,<she>,<DPX200>,
      <created by zg, POWCHK disabled, PULCHK disabled
       configuration hash MD5:
       00 E9 B6 7A A2 85 ED C7 34 08 36 98 17 FE 4E 26
       data hash MD5: 16K
       BE 54 6A 1D EC A4 67 3B 33 17 C4 85 74 D0 28 F2>)
$$ ##END=
$$ 
$$ hash MD5
$$ 4A 58 F3 DC A0 FF A0 B5 94 D5 8A A4 6C 69 2A BD
##$RELAX= 
##$RELAX= 
##$RELAX= 
##$RELAX= 
##$RELAX= 
##$RELAX= 
$$ Bruker specific parameters
$$ --------------------------
##$DU= <F:/spectra>
##$EXPNO= 1
##$NAME= <H-F>
##$PROCNO= 1
##$TYPE= <nmr>
##$USER= <she>
##$AMP= (0..31)
100 100 100 100 100 100 100 100 100 100 100 100 100 100 100 100 100 100 
100 100 100 100 100 100 100 100 100 100 100 100 100 100 
##$AQSEQ= 0
##$AQ_mod= 1
##$AUNM= <au_zg>
##$AUTOPOS= <>
##$BF1= 200.13
##$BF2= 200.13
##$BF3= 200.13
##$BF4= 200.13
##$BF5= 200.13
##$BF6= 200.13
##$BF7= 200.13
##$BF8= 200.13
##$BYTORDA= 1
##$CFDGTYP= 0
##$CFRGTYP= 5
##$CHEMSTR= <none>
##$CNST= (0..31)
1 1 145 1 1 1 1 1 1 1 1 1 1 1 1 1 1 1 1 1 1 1 1 1 1 1 1 1 1 1 1 1 
##$CPDPRG= <>
##$CPDPRG1= <>
##$CPDPRG2= <>
##$CPDPRG3= <>
##$CPDPRG4= <mlev>
##$CPDPRG5= <mlev>
##$CPDPRG6= <mlev>
##$CPDPRG7= <mlev>
##$CPDPRG8= <mlev>
##$CPDPRGB= <>
##$CPDPRGT= <>
##$D= (0..31)
0 1.2 0 0 0 0 0 0 0 0.06 0 0.03 0 0 0 0 0.0002 0 0 0 0 0 0 0 0 0 0 0 0 
0 0 0 
##$DATE= 1644481511
##$DBL= (0..7)
120 120 120 120 120 120 120 120 
##$DBP= (0..7)
150 150 150 150 150 150 150 150 
##$DBP07= 0
##$DBPNAM0= <>
##$DBPNAM1= <>
##$DBPNAM2= <>
##$DBPNAM3= <>
##$DBPNAM4= <>
##$DBPNAM5= <>
##$DBPNAM6= <>
##$DBPNAM7= <>
##$DBPOAL= (0..7)
0.5 0.5 0.5 0.5 0.5 0.5 0.5 0.5 
##$DBPOFFS= (0..7)
0 0 0 0 0 0 0 0 
##$DE= 6
##$DECBNUC= <off>
##$DECIM= 32
##$DECNUC= <off>
##$DECSTAT= 4
##$DIGMOD= 1
##$DIGTYP= 9
##$DL= (0..7)
0 120 120 120 120 120 120 120 
##$DP= (0..7)
150 150 150 150 150 150 150 150 
##$DP07= 0
##$DPNAME0= <>
##$DPNAME1= <>
##$DPNAME2= <>
##$DPNAME3= <>
##$DPNAME4= <>
##$DPNAME5= <>
##$DPNAME6= <>
##$DPNAME7= <>
##$DPOAL= (0..7)
0.5 0.5 0.5 0.5 0.5 0.5 0.5 0.5 
##$DPOFFS= (0..7)
0 0 0 0 0 0 0 0 
##$DQDMODE= 0
##$DR= 18
##$DS= 0
##$DSLIST= <SSSSSSSSSSSSSSS>
$$ [...]
##$SUBNAM2= <"">
##$SUBNAM3= <"">
##$SUBNAM4= <"">
##$SUBNAM5= <"">
##$SUBNAM6= <"">
##$SUBNAM7= <"">
##$SUBNAM8= <"">
##$SUBNAM9= <"">
##$SW= 18.0517287032376
##$SWIBOX= (0..15)
0 0 2 0 0 0 0 0 0 0 0 0 0 0 0 0 
##$SW_h= 3612.71676300578
##$TD= 16384
##$TD0= 1
##$TE= 0
##$TE2= 300
##$TE3= 300
##$TEG= 300
##$TL= (0..7)
0 120 120 120 120 120 120 120 
##$TP= (0..7)
150 150 150 150 150 150 150 150 
##$TP07= 0
##$TPNAME0= <>
##$TPNAME1= <>
##$TPNAME2= <>
##$TPNAME3= <>
##$TPNAME4= <>
##$TPNAME5= <>
##$TPNAME6= <>
##$TPNAME7= <>
##$TPOAL= (0..7)
0.5 0.5 0.5 0.5 0.5 0.5 0.5 0.5 
##$TPOFFS= (0..7)
0 0 0 0 0 0 0 0 
##$TUNHIN= 0
##$TUNHOUT= 0
##$TUNXOUT= 0
##$USERA1= <user>
##$USERA2= <user>
##$USERA3= <user>
##$USERA4= <user>
##$USERA5= <user>
##$V9= 5
##$VALIST= <valist>
##$VCLIST= <CCCCCCCCCCCCCCC>
##$VD= 0
##$VDLIST= <DDDDDDDDDDDDDDD>
##$VPLIST= <PPPPPPPPPPPPPPP>
##$VTLIST= <TTTTTTTTTTTTTTT>
##$WBST= 1024
##$WBSW= 4
##$XGAIN= (0..3)
0 0 0 0 
##$XL= 0
##$YL= 0
##$YMAX_a= 69503
##$YMIN_a= -67015
##$ZGOPTNS= <>
##$ZL1= 120
##$ZL2= 120
##$ZL3= 120
##$ZL4= 120
##$ABSF1= 10
##$ABSF2= 0
##$ABSG= 5
##$ABSL= 3
##$ALPHA= 0
##$AQORDER= 0
##$ASSFAC= 0
##$ASSFACI= 0
##$ASSFACX= 0
##$ASSWID= 0
##$AUNMP= <proc_1d>
##$AZFE= 0.1
##$AZFW= 0.1
##$BCFW= 1
##$BC_mod= 2
##$BYTORDP= 1
##$COROFFS= 0
##$CY= 11.3945322036743
##$DATMOD= 1
##$DC= 2
##$DFILT= <>
##$DTYPP= 0
##$F1P= 2.36226072786647
##$F2P= -0.459571619588291
##$FCOR= 0.5
##$FTSIZE= 0
##$FT_mod= 4
##$GAMMA= 1
##$GB= 0.15
##$INTBC= 1
##$INTSCL= 1
##$ISEN= 128
##$LB= 0.24
##$LEV0= 0
##$LPBIN= 0
##$MAXI= 10000
##$MC2= 0
##$MEAN= 0
##$ME_mod= 0
##$MI= 1.114404
##$NCOEF= 0
##$NC_proc= 0
##$NLEV= 6
##$NOISF1= 3.799351
##$NOISF2= 2.8
##$NSP= 1
##$NTH_PI= 0
##$NZP= 0
##$OFFSET= 15.70392
##$PC= 1
##$PHC0= -16310.38
##$PHC1= 13.00078
##$PH_mod= 1
##$PKNL= yes
##$PPARMOD= 0
##$PSCAL= 0
##$PSIGN= 0
##$REVERSE= no
##$SF= 200.130013532006
##$SI= 16384
##$SIGF1= 3
##$SIGF2= 2
##$SINO= 400
##$SIOLD= 16384
##$SREGLST= <1H.CDCl3>
##$SSB= 0
##$STSI= 0
##$STSR= 0
##$SW_p= 3612.71676300578
##$SYMM= 0
##$S_DEV= 0
##$TDeff= 0
##$TDoff= 0
##$TI= <>
##$TILT= no
##$TM1= 0
##$TM2= 0
##$TOPLEV= 0
##$USERP1= <user>
##$USERP2= <user>
##$USERP3= <user>
##$USERP4= <user>
##$USERP5= <user>
##$WDW= 1
##$XDIM= 8192
##$YMAX_p= 0
##$YMIN_p= 0
$$ End of Bruker specific parameters
$$ ---------------------------------
##NTUPLES= NMR FID
##VAR_NAME=  TIME,          FID/REAL,        FID/IMAG
##SYMBOL=    X,             R,               I
##VAR_TYPE=  INDEPENDENT,   DEPENDENT,       DEPENDENT
##VAR_FORM=  AFFN,          ASDF,            ASDF
##VAR_DIM=   8192,          8192,            8192
##UNITS=     SECONDS,       ARBITRARY UNITS, ARBITRARY UNITS
##FACTOR=    0.0002768,     1,               1
##FIRST=     0,             0,               0
##LAST=      2.2672688,     0,               0
##MIN=       0,             -67015,          0
##MAX=       2.2672688,     69503,           0
$$ Real data points
##PAGE= N=1
##DATA TABLE= (X++(R..R)), XYDATA
$$ [...]
594a3746J0069J7896r482j8117Q107J6474o125j3166L802Q627j320l387j049j966
608c383L141O861m799j0786N990J3406o729j4423O940J3838o747j1800O157Q549
622F215n244m618M109L74k786L713J265p060K74R434j840j0558L347J0410m694
637B341r063N860O755o714l780P197N69p239K472O800n011n807O692M326p434
652b036k381P149Q6o003K434M106n019j672P277p89r129L044J0310m781j0657
667h061N843J0023o028q394N378N891l994k685K069j030K08M829k479q350M399
682b381J1304n840j3265O492J4059o355j3481N342J1590l624q482J398M464J091
696B312J42l505m847N531R209o965j2771P604J5149p364j6056O257J5389m439
$$ plain form
594 -13746 -3677 14219 4737 -13380 -5273 11201 5076 -8090 -4288 4339 3019 -368 -1417 -3383
608 -3383 -242 6619 1820 -8966 -2976 10430 3701 -10722 -3782 10056 3309 -8491 -2334 6215
622 6215 971 -3647 462 836 -1950 1763 3028 -4032 -3758 5676 3836 -6722 -3375 7035 2341
637 2341 -6722 -862 5893 -821 -4601 2596 3165 -4074 -1602 5198 187 -5620 1072 5398 -2036
652 -2036 -4417 2732 2818 -3185 -751 3355 -1664 -3336 3941 3152 -5977 -2933 7377 2596 -8061
667 -8061 -2218 7805 1777 -6617 -1239 4652 658 -2027 42 -988 -780 4049 1570 -6780 -2381
682 -2381 8923 3083 -10182 -3690 10369 4014 -9467 -4125 7465 3841 -4641 -3243 1221 2312
696 2312 2454 -1051 -5898 -367 8842 1877 -10894 -3290 11859 4495 -11561 -5304 10085 5646
710E646j3186K130R602M44n105k980O3N140N048o755r648P648J3324p744j5631
725a2004P029J6396n627j5484L668J3032j367r259j032M618L312M47n186n464
739f921O532R856p212j3236P179J5209o483j5611N162J4407l424j1771J440Q000
753C127N59l523k408j177L909N606m903r330N437J1987n454j3282N031J3155m232
768D502j1660L189R029k023n626Q52J764K49K129j255n545K023Q226k681r904
783f731L148J0451l453r873L620Q249l624n833L477K971l168Q3K697k957k001
798b944N290J114o823j14P517j027p299K220O251l397m592M472K485n302k45N769
814C375j846n763L504N297m592m325N024K894m786j036L938j102k602L295J032
$$ plain form
710 5646 -7540 -5410 4192 4636 -469 -3449 -3386 1754 6802 47 -9601 -1953 11371 3627 -12004
725 -12004 -4975 11421 5794 -9690 -6022 7010 5643 -3616 -4648 -30 3282 3729 -1457 -6921
739 -6921 -389 9467 2255 -10981 -3802 11407 4924 -10687 -5525 8882 5458 -6313 -4873 3127
753 3127 3686 163 -2245 -3422 487 6093 1190 -8140 -2703 9284 3830 -9452 -4421 8734 4502
768 4502 -7158 -3969 5060 3037 -2589 -1737 27 276 2405 1150 -4395 -2372 5854 3173 -6731
783 -6731 -3583 6868 3415 -6458 -2838 5411 1787 -4046 -569 2402 -766 -683 2014 -943 -2944
798 -2944 2346 3460 -3363 -3477 4040 3013 -4286 -2066 4185 788 -3804 668 3153 -2149 -2394 3375
814 3375 1529 -4234 -730 4567 -25 -4350 674 3568 -1218 -2254 1684 582 -2020 1275 2307
829B307n336N58O990j951q133L006Q577l619q179L649O979l147n061K213K490
844A343r46M82m77l561J854O396k984q705L717J0308l968j0920L710J0468k935
859C782q944J758O505l19l340j189k83K592L887l667p173M281R823m450j1511
874h248M071J2040l211j1383J985R581n55o787r72L344K376M97l500m252M225
889g89P607m507j0198M310J1803l704j2166K682J1328j426r348L4O471J315k965
904D47k504q71L409M515l913p666M025J0006l771j1256L165J1324k291j0233J303
919d311Q116k63n250p05J949J491J500k081m618K408P137k499q858K402R584k157
935C845r302J807Q069j399o100R75L615n91q23K31j908J09M296m33o076P39P132
$$ plain form
829 2307 -3029 -2471 4519 2568 -5565 -2559 6018 2399 -5780 -2131 4848 1701 -3360 -1147 1343
844 1343 397 879 402 -3159 -1305 5091 2107 -6598 -2881 7427 3459 -7461 -3751 6717 3782
859 3782 -5162 -3404 3101 2782 -558 -1747 -2030 562 4449 782 -6391 -2110 7713 3263 -8248
874 -8248 -4177 7863 4652 -6731 -4746 4835 4280 -2507 -3479 -135 2241 2738 -762 -5014 -789
889 -789 6818 2311 -7887 -3577 8226 4522 -7644 -4962 6366 4940 -4408 -4374 2097 3412 447
904 447 -2057 -2928 481 4996 1083 -6583 -2558 7448 3677 -7579 -4414 6910 4619 -5614 -4311
919 -4311 3805 3542 -1708 -2413 -464 1027 2527 446 -4172 -1764 5373 2874 -5984 -3582 6002 3845
935 3845 -5457 -3650 4419 3020 -3080 -2105 1510 919 96 327 -1581 -1472 2824 2391 -3685 -2946 4186
952D186j044p400J389O860j714n668K040L914k320j823K467k97k499K263K281
967B635l810j857M829J179n217l12N011p46m237J877L053k974j594L901J26m552
983b688J220M843k282m659K957L991l182k894K975J408k421L37J582k196o06L952
999B337l81n397J195O394j780o829K049O624k003n722J633M224j027k175K61j99
1015g96N78K645j293m905J868O714k170p925K145Q372j857p958J298O712n30m804
1031a906l13K334J130M45j834l214K327N641k515p522K402Q703k011q996J370
1046c959Q408n77o946l30M838J197k222j936o57K453L466k696n898K647P719k315
1062C192q797J774Q951j057q202K49O653N30m421j252J785J794J032k132l679
$$ plain form
952 4186 3142 -4258 -2869 3991 2277 -3391 -1351 2563 243 -1580 887 590 -1909 354 2635
967 2635 -1175 -3032 1797 2976 -2241 -2553 2458 1712 -2525 -648 2405 -569 -2163 1738 1864 -2688
983 -2688 -1468 3375 1093 -3566 -609 3382 200 -2694 281 1689 -732 -395 1187 -1009 -1615 2337
999 2337 1956 -3441 -2246 4148 2368 -4461 -2412 4212 2209 -3513 -1880 2344 1317 -858 -597 -796
1015 -796 -218 2427 1134 -3771 -1903 4811 2641 -5284 -3139 5233 3376 -4582 -3284 3428 2898 -1906
1031 -1906 -2219 115 1245 1690 -144 -3358 -1031 4610 2095 -5427 -3025 5678 3667 -5329 -3959
1046 -3959 4449 3872 -3074 -3404 1434 2631 409 -1527 -2184 269 3735 1039 -4859 -2212 5507 3192
1062 3192 -5605 -3831 5120 4063 -4139 -3890 2763 3293 -1128 -2380 -595 1199 2231 99 -3580
1077c580K231N870k103p394J784Q152j348q037Q27P104l12n500j75L378N82r82
1093D97q61j455J029L644j108n317J057O402r55o794Q46O469p00n531O01M085
1109A909n26k258M67L06m39J597L84l222l03M407J38n044P3N130m02m659P81L725
1127B064j217k444J629R90j969M70K165j769k137K738J924l345j423L497P30l252
1143a349J52K668j124j823K088Q39k933J38L546r91l857J634L782j994l326K047
1159e03K501j844j344J388k4p86J484J22k880N22M039j000m877J302N273j418
1175A955n088J259M430r37l268M57J714P6J02o22j952J075L650j363n019J463
1191b068N889j364o169J058N874o18m951Q4L488M98j636j026m15J444K447j680
$$ plain form
1077 -3580 -1349 4521 2418 -4976 -3192 4960 3612 -4425 -3598 3506 3194 -2306 -2481 897 1479 497
1093 497 -364 -1819 -790 2854 1746 -3571 -2514 3888 2933 -3861 -3015 3454 2754 -2777 -2176 1909
1109 1909 1383 -875 -408 -102 -541 1056 1440 -1782 -2085 2322 2460 -2584 -2511 2619 2217 -2442 -1661 2064
1127 2064 847 -1597 32 1022 -947 -477 1688 -81 -2218 520 2444 -901 -2324 1173 1903 -1349
1143 -1349 -1197 1471 347 -1476 612 1451 -1482 -1344 2202 1211 -2646 -1012 2770 776 -2550 -503
1159 -503 1998 154 -1190 198 174 -612 872 994 -1886 -1364 2675 1675 -3202 -1900 3373 1955
1175 1955 -3133 -1874 2556 1619 -1649 -1192 522 598 700 78 -1874 -799 2851 1488 -3531 -2068
1191 -2068 3821 2457 -3712 -2654 3220 2602 -2349 -2265 1223 1721 85 -941 -1356 88 2535 855
1207H55m258J735N604j565o417J190O611p05o116Q4N052N12l455j079J495J526
1223A069O09j769k662J834M420j684n682J352O359q90o375L52N788J75m596o56
1239b356K943J024j001j252j025J331K872j277m382J092N391q50n789N13N629
1254B863j91m924o3L694K97k148m35M35N12J272n16k759M61L903l71m591K82M802
1272B523k31m481J81L754k18k656K95J316l85M1N21j361n92K418O07l155n41L508
1290A544L67l468p5L054l10k334P60J428j204m16J569n30j827J364J892j964j767
1307a917K269J413k301q56K066J36j600O73R94j486l29K212l07k753Q17L055j165
1324I21l068J335K749j284k117J056J234p07j58K94j021J44K116n07l059P53L731
$$ plain form
1207 855 -3403 -1668 3936 2371 -4046 -2856 3755 3050 -3066 -2982 2070 2582 -873 -1952 -457 1069
1223 1069 1678 -91 -2753 -919 3501 1817 -3865 -2513 3846 2956 -3419 -3067 2721 2896 -1700 -2356
1239 -2356 587 1611 610 -642 -1667 -336 2536 1259 -3123 -2031 3360 2510 -3279 -2766 2863
1254 2863 2672 -2252 -2315 1379 1676 -472 -907 -472 40 1312 796 -1963 -1502 2401 2030 -2561 -2279 2523
1272 2523 2292 -2189 -2008 1746 1528 -1128 -833 483 98 139 660 -701 -1293 1125 1732 -1423 -1964 1544
1290 1544 1911 -1557 -1632 1422 1112 -1222 -462 966 -238 -654 915 385 -1442 -78 1814 -150 -1917
1307 -1917 352 1765 -536 -1392 674 810 -790 -117 877 -609 -938 1274 967 -1786 -969 2086 921
1324 921 -2147 -812 1937 653 -1464 -408 826 119 -39 255 -766 -622 1494 987 -2072 -1319 2412
1341B412q74m023Q23L920o56l404L72K502k8j303l02r8O51J486q61k778R58L823
1359B620r30m469P57M685m74m412J14L681K85k569o69J168R74L86j189j899J241
1376g00L225j170m217R22M804n88m885J61M486K83l629o79K390J012r24j196o30
1393a335J254K105j153l331R19M217o02m636K23M569J54m048m81L111P28j874
1409a80q91M79R10R48q36k233O83L238m59l899K24M136J7l951k06L356L49k452
1427g67m14J323L85q3l19j087J90K095m2k836r3L246J98l321k24L020J95k417
1445i51p8J618j08o81L11k40n35J112O86j758q08K206P63k355o31K262L54j907
1463g40oJ385m22p59Q59Q4j244N14J519j000j632J334J569j477j299J404Q97j203
$$ plain form
1341 2412 1538 -2485 -1662 2258 1602 -1802 -1430 1072 1044 -259 -561 -659 -8 1478 617 -2161 -1203 2620
1359 2620 1690 -2779 -2022 2663 2189 -2223 -2109 1572 1857 -712 -1381 -213 761 1147 -42 -1941 -700
1376 -700 2525 1355 -2862 -1940 2864 2276 -2609 -2448 2038 2321 -1308 -1987 403 1415 491 -705 -1335
1393 -1335 -81 2024 871 -2460 -1541 2676 2074 -2562 -2339 2230 2384 -1664 -2145 966 1694 -180
1409 -180 -1071 -592 318 1266 430 -1803 -1120 2118 1659 -2240 -2016 2120 2137 -1814 -2020 1336 1685 -767
1427 -767 -1181 142 527 444 125 -962 -772 1323 1281 -1555 -1648 1598 1796 -1525 -1749 1271 1466 -951
1445 -951 -1029 589 481 -200 111 -129 -664 448 1134 -624 -1432 774 1537 -818 -1449 813 1167 -740
1463 -740 -746 639 217 -542 317 401 -843 -329 1190 190 -1442 -108 1461 -16 -1315 89 986 -217
1481b17l18Q70l38m54J027K7j632L63K103o56k381Q12K419q34k194P26J711n27
1499E07j031K53J94K8P06k97j556M74K287n77k797N66L038m49k956K64K556j0
1517A200j875k51R84M80O2o47j120P45K076p48k836O30L324m43l461J76L245J32
1535A673k699m41J861O95q13q78l26R61J424r22k395P91L099n33l490K25L508
1552A740J09l159m37K492P02j582q66N02R40O02q80j635P31K475m97l033K00L277
1570A681J05l192l69K772N90k075p10J170P39j76o74q12N47J672l42k353J14K765
1588A452Q7k860k82K676M02k213m63J528M24p12l14j40J63R29J2j555k08K020
1606I46L51k228m31K195M47j930l57J479J98q88J1K63k70L51N00q74o95J259P95
$$ plain form
1481 -217 -535 335 -3 -457 570 597 -1035 -672 1431 775 -1606 -794 1625 791 -1403 -677 1034 507
1499 507 -524 -271 -77 -49 657 360 -1196 -722 1565 988 -1809 -1243 1795 1346 -1610 -1346 1210 1200
1517 1200 -675 -926 58 538 600 -47 -1167 -422 1654 906 -1930 -1300 2024 1581 -1880 -1704 1541 1673
1535 1673 -1026 -1467 394 1089 276 -602 -928 33 1457 535 -1860 -1069 2030 1497 -1993 -1768 1740
1552 1740 1849 -1310 -1747 745 1447 -135 -1001 -499 441 1043 163 -1472 -741 1734 1237 -1796 -1596 1681
1570 1681 1786 -1406 -1775 997 1587 -488 -1198 -28 711 535 -139 -951 -404 1268 926 -1427 -1313 1452
1588 1452 1539 -1321 -1603 1073 1475 -738 -1201 327 751 39 -275 -415 -252 677 689 -866 -1074 946
1606 946 1297 -931 -1362 833 1280 -650 -1007 472 670 -218 -207 56 -214 137 637 -237 -932 327 1122
1625A122j480q08J517O90j401m54J110J49p37K21L24o20J22R49m75j201P47J337
1643A112r03j322R45J122q27q04O41L57l87J60J06o98J53J200l81j581M98J813
1661A204n21j861M66J696l31j347J71Q02M4j64k45n02L69J166m60j697M53K093
1679A336l90k252K43K192m0j921j60J395L63p16n34m1O51Q15o75j520O05K078
1697A429m69k422K72K505pk343k33J918M62j281o55N12P52L12p53j104O76J764
1715A335n08k254K83K486k2k455k54K186M79j699o38J007P47k43p47n25O57J255
1733A090m98j808K81K175m5k309j76K205L89j882n41J371O04p24n85LN09O70l64
1752C65j276J92J697Qj950j92J972L20j782m06J437L97r09l53L34K37K60q8p69
$$ plain form
1625 1122 -358 -1166 351 1041 -360 -814 296 445 -292 -71 253 -367 -245 704 229 -972 -225 1112
1643 1112 209 -1113 -168 954 127 -677 -36 321 -66 94 200 -498 -345 855 474 -1107 -609 1204
1661 1204 683 -1178 -712 984 653 -694 -523 279 323 159 -86 -588 -219 947 487 -1210 -757 1336
1679 1336 946 -1306 -1063 1129 1089 -832 -992 403 766 50 -484 -525 126 941 266 -1254 -649 1429
1697 1429 960 -1462 -1190 1315 1308 -1035 -1268 650 1112 -169 -824 -312 440 752 -1 -1105 -429 1335
1715 1335 827 -1427 -1144 1342 1320 -1135 -1389 797 1276 -423 -1061 -54 693 450 -297 -822 -165 1090
1733 1090 592 -1216 -935 1240 1195 -1114 -1290 915 1304 -578 -1119 252 856 132 -453 -450 59 729 365
1752 365 -911 -719 978 986 -964 -1156 816 1136 -646 -1052 385 782 -127 -480 -146 91 351 263 -506
1771e06r3J187K49j453l49J529M12j424m14J195L36q52j92M29Rj8K20l79m35P09
1791A60N90r45o70J039O91j012o03Q60M17o07j80L34j24l3M40k61p04M76R25o30
1811A63j041O70J033o20r08M93O66k95l19Q4q9J14N13k95q89M16J196m46j386
1830i40M12J422l22j294J69J035Po41j80J44L36L44m21q52M68J268m52j541L39
1849f99J669j80j635MJ417J82j028l59N42M91L8n70n99N72J114n00j505L49J746
1868A049j61j816l2J658K51j340m37Q70N64l16o21k79O04Q43n24j305L77J628
1886A013j92j759m1J732K46j513m07J138N25o48n86J18N66M36m92r32L64J316
1904H84j90j538j0J600J95j500l51J237M50q41n02L90M46J04l51n81K38R61o9
$$ plain form
1771 -506 -599 588 837 -616 -965 564 976 -448 -862 333 669 -183 -375 54 63 45 265 -114 -549 160
1791 160 750 -195 -865 174 865 -147 -750 110 527 -80 -260 74 -50 -83 357 96 -608 -132 793 163
1811 163 -878 -208 825 205 -703 -210 456 161 -158 -74 -163 -49 464 169 -720 -304 892 446 -940
1830 -940 -528 894 572 -722 -553 482 489 -152 -332 -188 148 492 71 -781 -313 955 503 -1038 -699
1849 -699 970 790 -845 -841 576 758 -270 -629 -87 404 442 -128 -727 -155 959 459 -1046 -697 1049
1868 1049 888 -928 -960 698 949 -391 -828 42 606 290 -331 -610 -6 837 313 -992 -615 1013
1886 1013 821 -938 -979 753 999 -514 -921 217 742 94 -492 -374 192 628 136 -796 -432 884
1904 884 694 -844 -854 746 941 -559 -910 327 777 -64 -566 -176 270 374 23 -558 -320 641 572
1923E72j225q9J333K37j311l40J158L81q62l57M79K82p9j68k97OO42J25q73k67
1943f53J012L62j018m07R25L81p17k96M34J76j36lj42j86L87L63n80n05O87N81
1963F65p06n91O29N15m83l83L02J64p2O5j30l19K95N57m23p25M73Q34m62q22L70
1984b47P35k42n31Q0K63P4O4k31l66L22O72l76r04L64J039k99j076J89R84n5p73
2005c14j07M73K48j37l44k44M14O19m24r29L71J127k65j207J13J184O0j021k03
2024e86P42L39l67m31o2M90M55m68q24L86J105k66j255J00J290N6j160k48R19
2043B15L89n72m73J75M93K60n02o20M14R39k77j156J18J247M3j199k11J031L41
2062F55p48m30L90M75j7m31l72L61P01k47r41Q0J114N2j114j93J013L04p98l63
$$ plain form
1923 572 -653 -742 591 828 -483 -823 335 716 -146 -503 -24 258 179 11 -286 -280 362 487 -386 -653
1943 -653 359 721 -297 -704 221 602 -115 -411 23 199 63 60 -82 -268 119 482 -98 -603 84 665
1963 665 -41 -632 -3 512 29 -354 -52 112 40 105 -25 -344 -49 508 85 -640 -167 667 205 -617 -247
1984 -247 488 246 -285 -205 58 132 196 -35 -401 -79 593 217 -687 -323 716 417 -659 -470 514 459 -314
2005 -314 -421 52 300 163 -181 -425 -11 608 184 -745 -374 753 488 -719 -606 578 638 -383 -586
2024 -586 156 495 128 -303 -365 125 580 112 -712 -326 779 513 -742 -642 648 704 -456 -704 215
2043 215 604 32 -441 -266 227 487 -15 -635 -221 718 441 -715 -597 650 693 -506 -717 314 655
2062 655 -93 -523 -133 342 325 -106 -478 -117 584 337 -604 -524 590 642 -472 -665 348 652 -146 -509
2082e09M96L79j65l33j86K48M84j28p25pQ68J27r19k32Q72K91p21l09M89K83k22
2103H1k13n1J06L18jn06j42O59K55p07l23O78L53n79l24L99K65j99j62%QK12J43
2126B70l74k90M68M12n23m80M77M82l83m25K42L25q8j55o5m8K19K34l24m14L83
2147e7N61l84o30L40O20k35n55J03M30K6k08j77k4K73K61l32m82L55O61l32p61
2168e47K57P89j67p11J0N86J17l72k30R7L31J74l76m30L65O56l18q09K27Q86j09
2189D26q49m7P28J77n03l00K51L74N3m06l50L77O02l16p91K31Q91r2r02m4Q01
2210C11J93o29k93L72L66r7l77k10L73M69l23o85K27Q11j00q60m1Q25J55o78k76
2231d67M83L30k28l31n0L21L13k62n28J65O93m6p63o6P50J62o43k52M82K77k69
$$ plain form
2082 -509 -13 366 201 -132 -318 -70 414 286 -439 -446 422 549 -370 -602 270 561 -160 -469 20 303 81
2103 81 -132 -183 -77 241 240 -266 -408 251 506 -201 -524 154 507 -72 -396 3 268 69 -93 -93 -85 127 270
2126 270 -104 -394 74 486 -37 -517 -40 442 59 -366 -124 201 113 -42 -107 -155 64 298 -26 -440 -57
2147 -57 504 120 -510 -170 450 215 -340 -237 193 219 11 -166 -190 83 344 12 -470 -115 546 214 -547
2168 -547 -290 499 332 -379 -369 217 334 -38 -268 -171 160 334 -42 -472 -107 549 231 -578 -351 535 426
2189 426 -423 -470 258 435 -68 -368 -117 257 310 -96 -446 -69 533 217 -574 -343 548 456 -446 -490 311
2210 311 504 -125 -418 -46 320 223 -154 -364 9 478 155 -530 -303 508 408 -452 -493 332 487 -191 -467
2231 -467 16 346 118 -213 -263 58 371 109 -419 -254 439 393 -370 -436 314 476 -167 -419 63 340 71
2252G1k79K9K38K04j77l96O8N57J5o21j13O24J91n62k31M33K58k74k20Q1J58J22
2274A76r0k87j4M13J14m84k00M98K65m49k85L43K79k12k16M5J25J03j4k31j10
2295b31L41K21l80l31L98L56l26l73K30L26j05k49j7J25J40K1k36j75L10L01l20
2316B6m22L04M90k62m79J53M38l3l26r7J93J81kk59j82L19L34l10m82K89N54k18
2338B09n62J06N21J0m22j23K60K26p6l01j34L30L18l22m73K65N89j75o30P2O06
2359B94M2m97j59L61K41j60l04n7L44K44l11m32K64N63j83o30P8O28K8n62j35
2380c43M18K24k40k94M8L16J53k97l35K32M93j65n78P0N95M0n54j36M54K08k80
2401B9k59J03K69Q6k40k68J96L99j14m90J9N26P6n05j49M22J93l03k06J29K22
$$ plain form
2252 71 -208 -179 59 263 86 -310 -242 315 330 -291 -404 220 411 -151 -382 51 309 35 -185 -104 54 176
2274 176 86 -201 -215 198 312 -172 -372 126 391 -58 -343 0 279 67 -149 -104 21 124 110 -121 -231
2295 -231 110 331 -49 -380 18 374 48 -325 -95 231 126 -123 -140 -15 125 146 -90 -265 45 346 26
2316 26 -396 -92 398 136 -343 -190 248 215 -111 -208 -15 166 164 -95 -277 42 376 66 -416 -127 427 209
2338 209 -353 -247 274 284 -138 -261 -1 225 149 -152 -286 44 362 40 -433 -168 421 246 -384 -312 294
2359 294 336 -161 -320 41 282 122 -182 -239 105 349 38 -394 -130 433 250 -380 -302 326 354 -208 -343
2380 -343 75 299 59 -235 -187 129 282 -15 -350 -118 375 210 -368 -298 297 337 -217 -353 101 309 29
2401 29 -230 -127 142 228 -12 -280 -84 315 201 -289 -270 256 332 -173 -322 100 293 -10 -216 -87 135
2422A35K1j92j80J35L15n6m02l1M44J16m42j73L76J90k55k03J27J86Pj28j52O8
2444i4K69Pl44q2L69J66l58k25L06K33j97k14Q5J72M1j14j45J1K37Q1k91j79L06
2467D0K60k97k94K28L04j45k71L1K17N8r7j76oK51J12k83k25K99L05k62l42J90
2489a03L61j10l31QK56R8j46j81K1K48J25k90k48K82L46k47m05J65M28r2l91k0
2511b26L15J21j97k10O6K52J02k88k33K71L47k25m18J56M61o2m45l7L71J38k62
2532ck00J11K55M2k83j87K66L04k09m12J58M47o4m51l3L97J18k90j90J63K33j8
2554A54k51j41K42K69j91l63J30M11m3m29l9L87J13k98j80J86K12n2k09q1J81
2575HK20j47l03P3L78j7l95n1L63J13k78j67J79J83n8j88m9J32J81j08k58L7L11
$$ plain form
2422 135 156 -36 -216 -81 234 178 -224 -255 189 305 -137 -310 66 256 1 -202 -75 111 118 -10 -162 -94
2444 -94 175 182 -162 -244 125 291 -67 -292 14 247 50 -164 -79 93 134 20 -125 -114 123 204 -87 -266 40
2467 40 300 3 -291 -63 241 96 -175 -144 73 131 34 -142 -148 103 215 -68 -293 6 311 49 -293 -103
2489 -103 258 148 -183 -175 81 179 33 -148 -127 121 246 -44 -292 -10 336 89 -316 -151 277 185 -206 -226
2511 -226 89 210 13 -197 -131 121 223 -65 -298 -27 320 95 -323 -167 294 232 -213 -250 121 259 -3
2532 -3 -203 -92 163 205 -78 -265 1 305 96 -316 -158 289 225 -226 -259 138 256 -34 -224 -61 172 154
2554 154 -97 -238 4 273 82 -281 -151 260 217 -212 -251 136 249 -49 -229 -43 169 117 -92 -173 8
2575 8 228 81 -222 -149 229 212 -183 -234 129 242 -36 -203 -24 159 101 -87 -136 -4 177 69 -189 -152 159
2598A59M1l44q5L11J28k36j75J52J87o3j46n4J14J55n3k28l1K98R5l03j51K68
2620C9J90k04k02J31J69j1j50q1J01J53j2k36n6K52J37k63j98K20K52j76k59R9
2642a05K19J0j71r9J03J69Kk34p6K45J68k45k45K28K76j32l00O2K65L0k13j12
2664a55J15J77rk31q5K43J81k29k66J90L12j26l16L5L21J9k33j28J51J82l5k31
2686a18o6K35J74k21k57J74L24j24l44N2L27M0k77j11J85J87q3k16l7K18J62k20
2708Dk45J83L03j27l24L9L25M4k76j12J96J68j12j80k7K05J19j82k16J37K90r4
2730A18l10J4L12O4k79j09J95J55j04j69%J75J05j48j79J06K50o9k77mK81O9k53
2753e7j20J97J37j10j49LJ54P6j24j55P2K25k9k49n0K65Q7k30j22J60J71r2j54
$$ plain form
2598 159 200 -144 -229 82 210 -26 -201 -49 138 75 -71 -125 -11 144 91 -137 -168 130 225 -78 -229 39
2620 39 229 25 -177 -46 123 112 -38 -119 -18 135 123 -113 -169 83 220 -43 -241 -21 231 55 -204 -105
2642 -105 114 124 -47 -146 -43 126 128 -106 -182 63 231 -14 -259 -31 245 113 -187 -125 140 170 -43 -155
2664 -155 -40 137 128 -103 -188 55 236 7 -259 -69 243 117 -199 -164 157 176 -57 -185 -34 148 113 -118
2686 -118 -184 51 225 4 -253 -79 245 121 -223 -171 156 196 -81 -192 -7 180 97 -119 -156 62 224 4
2708 4 -241 -58 245 118 -206 -167 158 202 -74 -186 10 178 66 -114 -141 64 183 1 -215 -78 212 118
2730 118 -192 -178 134 198 -81 -190 5 160 56 -113 -113 62 167 19 -160 -54 196 127 -150 -154 127 196 -57
2753 -57 -177 20 157 47 -102 -99 55 131 7 -148 -76 149 120 -129 -179 86 173 -57 -179 -19 152 60 -94
2776i4lJ32Q9j02j57L9K16K1k36q3K38J34k05j61J41J74n8j76oJ28Q7q0j64K9
2800i7J98M5k14j19K22J57j80j92J16K02m7j88l2J66Q8q8j57J7K00N1k05j29K01
2823A5J79j54k18R4K38l6k03m7J74J02r4j68K2J99O8k02j60K00J99j55k33R3K47
2846A60l1k32n1J90J07j17j66L9J91N2j99j43K01J93j42k45R7K58k3k41m3K03
2868E8R9j31j54N5J78L8j92j15J71J85j33k27O9K46j5k44m3J96J03j15j45L5J74
2891I3K5j68r6J36J62r6k14N9K33Lk23o3J91J01j32j18O1J37J7j36r6J27J49q7
2915F5j94L0K23J8k11p3J73J05j11j39N3J35K5j23q7R0J37l6j90jJ97M4j78j00
2939a48J66J11j03j36M3J43K3j23q8P7J49k9j72k6J88O5j72j12J52J31q5j50K9
$$ plain form
2776 -94 -97 35 124 22 -135 -96 120 141 -95 -178 60 194 -11 -172 -31 143 85 -91 -97 31 118 38 -126 -97
2800 -97 101 146 -68 -187 35 192 12 -180 -64 138 91 -97 -129 37 125 37 -120 -103 97 148 -57 -186 15
2823 15 194 40 -178 -84 154 118 -85 -132 42 144 50 -118 -96 103 171 -31 -191 9 208 53 -180 -87 160
2846 160 129 -103 -154 36 143 26 -140 -101 90 142 -57 -200 1 194 52 -193 -96 162 139 -102 -145 58
2868 58 157 26 -128 -73 105 143 -49 -164 7 192 59 -168 -99 147 132 -112 -155 41 144 29 -116 -81 93
2891 93 118 -50 -146 -10 152 56 -158 -99 134 137 -86 -149 42 143 11 -107 -46 91 108 -28 -124 3 152 65
2915 65 -129 -99 124 142 -69 -142 31 136 25 -114 -61 74 99 -24 -111 -21 116 80 -110 -111 86 130 -48 -148
2939 -148 18 129 26 -110 -67 76 99 -24 -112 -35 114 85 -87 -113 75 140 -32 -144 8 139 54 -96 -67
2962f7J51K9j14j05P5J44k5j75k6J73R5j77j33J26J63o4j75jJ72M3j19j07P2J38
2986I3mj65n6J86J13j59j58J31J77q0j77OJ70M4j24j06P2J53k0j67m6J63J14j56
3010Dj58J25J78p6j78oJ93L6j43q3O7J49k8j57m1J49J08j32j59J01J92m9j97J0
3034i5J71N2j38j06R2J42k6j46m4J42R4j25j43Q1J81m0j86pJ60O0j24j12Q6J34
3058A03l8j38l3J48Q2r5j51O4J78l2j74j9J62N6j19j01R1J11j8j20l8J12Q8q9
3082C0j38N2J73k4j63k4J41Q7j24j09O5J25j1j30m6J03Q8o8j32L4J52Nj57m3J32
3107A8R3j06j12P0J08Mj14n6R9R7o0j19PJ49L3j43o7J30Q6q5j27N4J22J2j26n1
3133h4R0J07p5j23OJ50L5j43q5J18J14r1j17L1J37Oj18m4Q8R9m9j47J8J43M2j37
$$ plain form
2962 -67 84 113 -1 -106 -31 113 88 -87 -113 60 155 -22 -155 -29 134 70 -105 -106 66 109 -10 -117 -45 93
2986 93 89 -76 -132 54 167 8 -150 -19 158 78 -99 -93 77 121 -3 -109 -37 116 96 -71 -117 46 160 4
3010 4 -154 -29 149 73 -105 -111 82 118 -25 -108 -41 108 80 -77 -118 31 139 7 -152 -51 141 92 -105 -95
3034 -95 76 128 -10 -116 -24 118 92 -54 -98 44 138 13 -130 -49 132 92 -94 -101 59 119 -5 -117 -31 103
3058 103 65 -73 -106 42 124 29 -122 -58 120 88 -86 -105 57 113 -6 -107 -16 95 77 -43 -81 31 119 30
3082 30 -108 -56 117 93 -70 -94 47 134 10 -99 -34 91 80 -50 -96 7 95 27 -105 -71 81 86 -71 -114 18
3107 18 111 5 -107 -37 71 75 -39 -95 4 101 41 -78 -71 78 111 -32 -99 31 117 32 -95 -41 81 93 -33 -84
3133 -84 6 113 38 -85 -79 71 106 -37 -122 -4 110 19 -98 -67 70 76 -42 -86 2 101 52 -95 -77 66 108 -29
3159b9q8J18J18q5j39N0J29K5j35n5Q7J01n1j41K0J38M2j28q5R9J18o5j31J5J60
3184H8Nj29o7J09Q3o5j25K6J29M2j26q4R6J21p2j31K8J48Pj18o3J03J04n8j21
3209g0J0J22L5j10q3Q8J11n6j28J0J32K8j21n2Q6P4m6j02NJ15L1r7p5P0J03l2
3235D8j35J4J22L7j07n9P3R2m3r6j0J11M6r5q2O2J15l0j20j7J30L5j05p1P0R3
3261G8m7q6rQ7N8q2r3O3J06k3j18j8J28M5j06p0P1R1k6r6j7Q9N1p1q5M4J13j3
3289F4j14k3J10O0r2r1Q0Q4j6j10j4R3N7p7p6K2J20j4j20k4R7P3q5j00P6R6k4
3316E2j05j6Q7N7p1q4L8J00J3j15k4R3O4q5r6N4J24j8j12j8R5N2o6r1M1R8lj01
3344c7m4J14N5p5j09N9J09j6j02m0R8O4p3q5L3R8J0r5n1Q9Q1q0p1L9R3j8r6j3
$$ plain form
3159 -29 -117 1 119 34 -105 -55 74 99 -36 -91 -4 97 46 -95 -75 63 105 -23 -108 -9 109 44 -87 -72 88
3184 88 93 -36 -103 6 89 24 -101 -75 54 96 -30 -114 -18 103 31 -100 -72 76 83 -35 -98 5 109 51 -70
3209 -70 -60 62 97 -13 -96 -8 103 47 -81 -71 61 89 -32 -84 2 76 30 -72 -67 48 79 -18 -93 -23 80 48
3235 48 -87 -73 49 86 -21 -80 -7 85 42 -54 -64 47 93 -2 -84 -22 93 63 -57 -74 56 91 -14 -85 -15 78
3261 78 31 -55 -64 23 81 -1 -94 -31 75 52 -66 -84 44 89 -17 -87 -16 75 49 -47 -64 25 76 5 -80 -36 77 64
3289 64 -50 -73 37 97 5 -86 -6 78 62 -48 -62 31 88 11 -65 -43 77 63 -57 -81 16 89 4 -96 -20 76 52
3316 52 -53 -69 18 75 4 -80 -42 58 71 -44 -68 25 89 4 -92 -38 86 68 -44 -62 33 85 19 -72 -31 67 64 -37
3344 -37 -81 33 88 13 -96 -37 72 56 -46 -86 12 76 3 -82 -49 49 59 -36 -87 2 83 3 -68 -29 64 46 -50 -63
3372f3Q8N5o6p8L3J00mr0l8P6P5o5q9L5Q7%j03k6Q3N6n9q0M0Q1%p5m3P2O9n6r1
3403g6J7J05Qr1k9P7P1o5p5L3P3J2p6n5O0Q0l3r9K8Q6J6q9m2O9P2n8p1PQ9Np5
3434b6k9M6P9n1r0K1R0J2p5n6P4O2m6p7K1Q2J9o5n7N4O8j4r6J4Q7K6q0n8Q0N9
3464G4m9p2K0Q0J3p8m0M5Q2l8r3nJ03J7q6n4Q3O1m6o3KP7K2p9m0N9P0l7p4lR2
3495D3L6j01l8O6O7m2p0NP9Qn8m1M6O3k6p2j2Q9K4p9n3O2P1k3r6RO7K7n8n8N3
3526a2O9k4o8j1Q1K7o9n2N3P3l3q2pR1K9o3m5M3N9k6p0%P4L5p1m8M2P0l0p5PN7
3558B4J8m2n4L2P0j7o9j6P2L9n4o6N0P1j9p4mN6L1o1l6L7O0j3o7lP0K4l9o5M0
3589eO0j1p2j7Q1K0m7n3K9O4j1o2k9P0M0n3o3L2P3j6o4j5O8L1n2m8K9O9oo5l2
$$ plain form
3372 -63 25 80 14 -64 -31 69 65 -25 -63 13 88 23 -66 -31 56 56 -47 -73 10 66 7 -73 -33 48 48 -27 -70 2 71 15 -76
3403 -76 -59 46 54 -37 -66 11 82 17 -58 -25 48 60 -16 -71 -11 69 36 -63 -35 51 67 -22 -64 5 77 19 -52 -45 44 49 -26
3434 -26 -55 -9 70 19 -71 -50 40 52 -23 -79 -5 57 11 -66 -45 37 56 -9 -66 -12 56 42 -54 -40 47 73 -7 -65 15 74
3464 74 25 -47 -27 53 66 -12 -52 -7 75 37 -56 -61 42 59 -27 -81 2 63 17 -46 -44 33 55 -24 -64 -5 65 28 -46 -49 43
3495 43 79 -22 -60 6 73 31 -39 -34 45 53 -5 -46 0 63 37 -35 -47 42 66 -13 -66 -4 67 44 -52 -43 24 51 -7 -65 -12
3526 -12 57 33 -35 -46 35 62 -7 -59 -6 67 34 -48 -55 36 65 2 -43 0 59 33 -37 -37 37 72 1 -47 -5 65 35 -40 -33 24
3558 24 42 0 -54 -22 48 31 -38 -54 18 57 3 -63 -13 58 39 -35 -39 17 48 -13 -49 -12 48 35 -32 -35 35 59 20 -45 -5
3589 -5 55 44 -28 -45 36 56 9 -44 -15 49 38 -24 -53 17 57 4 -59 -27 46 30 -34 -49 19 50 -2 -50 -21 48 42 -23 -55
3620e5O7M4m7o1L0P1qp8j0P0L9n6m4L0N1np7lO1L8m4o1K1P2j4o5j6O4L1m9n2K0
3652c6P3j4n5k5O5L8l4o0L1P1j3o6k7P0M7n6n0K7O2no7oM5L9l6o8J5P0km8k9O0
3684A6L2l6o5J9O3jn8j6M6M2m1m9K3N1Nn9k6O1M6n0n0K4N8qm7j5M7L4k5o1K3N0
3716C3J2n3k9M3M5m0n4K7N5j2n1j7L9L5j7n5mN8J8n1l6L9N2k7n8J3N6J4o0pL8
3747FL3k7m7jO1J3n3k6M5O1l6o0RO2On4l9M9L7k9m9MN6Ol5l8M4M3k6n7J7N3J0
3780C8n9l5M4N6k1o0MN9K4o1k5L2M7j4n4kO1J6n1l9M6L7k6m3NM5K0m8k8K5M2r
3812B6o5kN3K9o1l6N3M6j9o4J2M7K0m6l7M0N0k2m9lM9K9m8l9M7M2k3n5kO2Om4
3844dk9L1M3rn3rM2K4n0j7K1M5j6m4qN0J7m9k2K8M3k4m1pO4J9m8k9L4L9j2n0m
$$ plain form
3620 -55 12 56 9 -52 -22 49 41 -37 -47 23 62 6 -38 -8 43 38 -39 -42 19 57 13 -48 -27 45 31 -34 -50 14 45 -4 -56 -36
3652 -36 37 23 -32 -57 8 46 12 -48 -17 54 41 -25 -52 18 65 9 -41 -14 48 43 -24 -30 15 54 18 -50 -35 35 33 -15 -44 16
3684 16 48 12 -53 -34 29 28 -30 -46 0 42 1 -48 -25 26 31 -28 -54 7 53 3 -47 -23 35 27 -20 -35 12 46 21 -40 -17 33
3716 33 45 -8 -37 6 51 11 -43 -16 39 27 -24 -41 -2 33 16 -39 -43 15 33 -18 -54 -15 37 10 -48 -35 21 35 -25 -32 6
3747 6 39 12 -35 -36 25 38 -15 -41 4 65 29 -31 -22 40 46 -8 -47 2 39 10 -39 -35 21 27 -8 -46 -2 41 15 -42 -25 28 38
3780 38 -21 -56 -12 44 23 -37 -33 26 50 -11 -36 -4 43 29 -25 -27 34 50 -1 -40 6 43 17 -26 -21 24 44 -4 -32 -7 35 26
3812 26 -39 -41 12 41 -20 -56 -3 43 24 -40 -28 19 39 -7 -44 -4 46 24 -25 -28 21 50 2 -37 10 52 29 -26 -28 34 40 -4
3844 -4 -33 -2 41 32 -21 -30 12 36 -14 -31 -10 35 19 -25 -33 17 34 -15 -37 -9 34 10 -31 -38 26 45 -3 -32 2 41 29 -21 -25
3877b5M4K4l7l5J5N3j5m0pM2K9m4m7M4K9j2m6j2L7M1m9l7K7N5j1m8j2N4J7l7m0
3908d3K4N5j5m3mL4L2l9m0K0N1Nn2j4L5K6k0m5K8M8j6m6pM5K8m5l5J6N2j6m7k0
3940d8M2L7l4l6L2M4j4n3rN5K1l1m1J9M6jm9nL6L7m0m3K4N4qo0mM7J5k3l2J0M8
3973C6rl1k2K9L2k2n5K2N3j7m3j9L5L6k5l4J5M4nm0j8L9M5l5m9J6N3nn2LL6K8
4005D1k8l7J2M3rl3k4L4M1k6m1KN5Pn8mL1J8k6k1%M0kl1j4L1K5j7l3PM8rl8k1
4039c7L6L2j4n0J6M4kk8k0L0L6l5k9LL9Nk7k7K8K4nm4LM4%l5k4K8L2k2l7NL6K3
4073B8m2k2K3M4j9m2OL8J0l6k1K4L5j1l1pM9J2l6k7L0L8j9m6KL7J8m5k1L4K0j1
4105A2m0qO1ol2k7L1M3l3l4NM4J3k7k3RM1nm1pM1J7k8k3K1L1j9l1%M0J1l9j4J1
$$ plain form
3877 -25 19 43 6 -29 -14 39 24 -16 -23 19 48 4 -43 1 30 18 -28 -40 -3 38 -11 -48 -21 34 23 -25 -37 17 34 -3 -43
3908 -43 -19 36 21 -22 -26 8 40 1 -39 -19 32 37 -15 -29 6 32 12 -33 -5 43 27 -19 -26 19 47 2 -33 -17 35 19 -28 -48
3940 -48 -6 31 -3 -39 -7 37 23 -30 -39 16 37 6 -35 -16 30 29 -20 -25 11 48 8 -35 -11 43 35 -25 -29 18 33 10 -22 -12 36
3973 36 27 -4 -26 3 35 13 -42 -20 33 16 -27 -46 -11 25 0 -34 -19 25 20 -20 -38 1 46 11 -38 -22 31 26 -26 -23 13 41
4005 41 13 -24 -12 31 22 -11 -35 -1 40 14 -27 -25 30 37 -21 -25 6 24 -2 -23 -23 17 15 -16 -30 1 26 9 -24 -17 31 22 -16 -37
4039 -37 -1 31 17 -33 -17 27 25 -3 -23 7 43 8 -21 -18 21 26 -1 -28 0 24 19 -25 -22 22 22 -13 -37 -9 23 1 -36 -31 5 28
4073 28 -14 -36 -13 31 12 -30 -24 14 24 -12 -33 -9 26 15 -16 -23 26 38 2 -25 5 43 24 -22 -20 17 35 -10 -31 3 23 12
4105 12 -28 -36 25 19 -13 -40 -9 34 1 -33 -28 16 29 2 -21 -12 29 24 -17 -24 17 34 6 -17 4 35 16 -15 -15 25 36 -3 -17 -6
4139fL9k5l8J1L4Ql1j8J9M3k1m4PL5Kk7k1K0L5ol5j0M6K5m2k4L0K1j2k5qM4mk7
4173ek0L0K5k1l5J4K1J2k9j9RL3j4j6j4M6J2l2j7J2K9j0l1j5L9J5l1k1J4M0ol8
4205b3pM2K0l7k2K5L1j0l2kK5J5j7l0K8K4ol5KK8J2k8l4K9K3j2l1lK6K7l0k8J0
4238b0M2j0m0kM2Kk2k7K7K3Nl9kK6K3k0k8J3L5j7j7k3L8K9l0k1%M2j0l3j1L2J9
4271B6l3k1J1L1mk6pL5Ok2k8J6K6Mm0nL2K1k0k4J4L2nk4k1L1K5k1l7K1K9%k8m
4305a0K3J9k6l1J4L2%l6j9L8J8k1l0QL1Kl7qL8K0k9k6J6L0Jk9j9K1L3k0k3NL9
4338B4lj7j4K0L4l6j8PL8j6k4k5M6Qk3j6J5K0ql2jJ8K4k2k5QL0kk3nRJ9rk7J3
4373a3K5Kl4kK4K5j6j8lK9Lqk9L1J4j7k5LK2J4k5j3J5K2j4l3oK8J8k8k0K4J9q
$$ plain form
4139 -6 33 8 -30 -19 15 23 -8 -26 -7 36 15 -29 -22 13 15 -12 -33 -13 22 16 -19 -29 17 42 0 -24 6 27 15 -10 -18 26 22 -5
4173 -5 -25 5 30 9 -26 -12 9 21 -8 -27 -18 15 1 -15 -29 17 29 -3 -20 -8 21 11 -20 -35 4 19 -12 -33 -19 21 15 -23
4205 -23 -30 12 32 -5 -27 -2 29 19 -13 -15 10 25 8 -22 6 30 24 -11 -9 19 31 3 -31 -2 21 9 -22 -25 1 28 -2 -30 -20
4238 -20 22 12 -28 -30 12 14 -8 -35 -8 15 20 -19 -21 5 28 8 -20 -7 28 11 -6 -29 9 38 8 -13 -13 29 19 -14 -25 7 26
4271 26 -7 -28 -17 14 10 -16 -23 12 18 -4 -32 -16 10 14 -26 -31 1 22 2 -22 -8 24 19 -5 -26 5 30 9 -28 -7 22 22 -6 -10
4305 -10 13 32 6 -25 -11 21 21 -15 -34 4 22 1 -29 -21 10 12 -25 -33 5 25 -4 -30 -14 16 17 -12 -31 -10 23 3 -20 -15 24
4338 24 21 4 -10 10 44 8 -10 -3 35 19 -5 -30 16 24 1 -15 0 20 12 -20 -21 -3 21 -1 -26 -18 12 10 -13 -18 -9 10 1 -26 -13
4373 -13 12 14 -20 -22 2 27 11 -7 -10 19 22 14 -15 16 30 13 -12 -9 13 27 2 -11 4 26 12 -21 -27 1 19 -9 -29 -5 14 6
4407Fk2j0M6ok6j1J6K7j5l3K3J7J0k2k7K9J9jl0oK5K1k7j7J2J6kl8J7K4J3l1j7
4440b0jM2k1j0oJ8J5k6k1K7K1k0j2KJ9J7l1j2J3K8j3l0J3J9K5l9j3J9K8j3l1P
4472fK9mk2j5K0K5j0l0JK4Rk1l6L6K4j8l1RJ6Pok1JL1ll6RK3J3k1k2K9J9j3l0
4507b0J3K2K5k5l0K4J8nl1mL4kk6j2J4L1j2l4NJ5J4k4j8J9J8pk4QJ9Oj1k4J4K8
4541A8j6j9mK7J4j4k3J3J8jk0mJ2L7k3k2%L2j6j9kJ5J2k6j3NL5Ol5pJ9Qj5k0J
4576b7M0ll2JK3Qok5J1K7j0k4pL4J8j5l7J9K3J5l7j1K3J1j5k8J5K4J1m3lJ4K1
4609A5ll0ML0j5k3mJ5K0j7k5J5L1j0j1mJ7J1qk9J3K4qj7pK7J2k1j6jL6Nl1rJ3
4644aJ6j4j5OJ5Kk0k1K0K8k1k3K0Rjj4j1K0J8j8j4J9%J9k2j4K0J2Jk2JK4Pl9Q
$$ plain form
4407 6 -16 -26 20 14 -12 -23 -7 20 5 -28 -5 12 22 0 -27 2 21 20 -10 -16 9 30 3 -14 -2 14 12 -26 -9 15 28 -3 -20
4440 -20 -21 21 0 -10 -16 2 17 -9 -30 -3 18 -2 -14 -12 7 24 -7 -19 -6 22 9 -21 -8 11 36 -3 -16 3 31 18 -13 -6
4472 -6 23 19 -3 -18 2 27 17 -13 -12 12 21 0 -36 0 24 6 -25 -16 0 7 1 -20 -19 12 9 -27 -18 5 18 -3 -25 4 23 10 -20
4507 -20 -7 15 40 15 -15 9 27 22 -9 -13 21 19 -7 -19 -5 26 14 -20 -15 0 14 -10 -28 -9 9 2 -22 -14 5 11 0 -24 -10 18
4541 18 2 -17 -21 6 20 6 -17 -4 14 13 -7 -11 1 38 15 -7 -7 25 9 -10 -12 3 15 -11 -24 -19 16 22 -13 -20 -1 7 -8 -28 -27
4576 -27 13 10 -22 -21 2 10 4 -21 -10 17 7 -17 -24 10 28 13 -24 -5 18 33 -4 -15 8 19 4 -24 -9 15 26 -17 -20 -6 15
4609 15 12 -18 -14 16 1 -22 -26 -11 9 -8 -33 -18 13 3 -8 -12 5 16 8 -21 -8 16 8 -9 -16 11 23 2 -14 -15 21 26 -5 -14 -1
4644 -1 15 1 -14 -8 7 9 -11 -32 -12 16 -5 -28 -8 1 0 -14 -25 -5 13 -5 -19 0 0 19 -3 -17 3 15 16 -6 -5 19 26 -13 -5
4679eJ4J3j3rKPJ6k6k5L0Oj5qMK1rj5NJ1J3j0l3J8J9Lk2j4J5K2ll3KL2J4k1k0
4715a4J8J8rk1lK2J4j7j7RL0j1k3%K1Mk7rMK9rk0rJ9Rj7j1RK5%k7lK2Pj2j6QK4
4753A7Pl1mJ8J3j1k1J1K3%k5PJ1J3k3j4K1J3rk5PNPj4j1RK1j1k6rL3J8k3k1J2
4788a2L3nk9J0KJ5j0rOPPj6kJ9Nj2l0L0J0j1j9kK4Mrj6J4J2Jl5JK9Lj7j6K1J6
4825A9j7qj2J8Pj0j7J3J5Kk2KK1Rj5qQK8ol2KQNj4lkK3oj5qJ5J9qk6QK1j0pj8
4864b1K3Jj4j6J1K3nj0pJ2J6j8j8J2J3Kmj8K5J3j5qJ2NrqoK6Rj2k3PK0jj6oJ0
4901E%kk7RK9qj8j2K1JNk4K0J3pj0j1J8J7j5j3J5Qkj2j9K8Nrk1QL0rj9JPRj3j4
4940a6J0J7pj8lJ6J6j4l3J4J9Qk8JJ0J8j6j6J4POj6nJ4J3qj5J2QQj9jPJ9j7j1
$$ plain form
4679 -5 9 22 9 0 2 9 25 -1 -26 4 10 -5 -13 -9 12 3 -12 -7 4 17 7 -26 -8 11 14 -8 -22 -7 15 12 -21 -19 13 27 6 -14
4715 -14 4 22 13 -8 -11 11 25 8 -9 0 30 19 -4 -4 17 21 -6 -15 -11 18 9 -11 -20 -1 8 -9 -20 -11 14 14 -13 -16 6 13 1 -15 -7 17
4753 17 24 -7 -11 7 20 9 -12 -1 22 22 -3 4 15 28 5 -9 12 25 16 -9 -2 3 10 -4 -15 -6 15 4 -22 -31 2 20 -3 -24 -12
4788 -12 21 16 -13 -3 -1 14 4 -5 1 8 15 -1 -3 16 21 9 -21 9 19 8 -11 -13 11 15 6 -10 4 16 17 -18 -17 12 15 -2 -18 3 19
4825 19 2 -6 -18 0 7 -3 -20 -7 8 10 -12 -10 11 20 5 -3 5 33 27 -5 -3 5 10 -4 -7 -9 14 8 -7 -15 0 19 11 -15 -7 14 4 -3 -21
4864 -21 2 3 -11 -27 -16 7 2 -8 -15 -3 13 -5 -23 -11 2 4 0 -18 7 20 5 -3 9 14 5 -3 -9 17 26 14 -9 -2 18 17 1 -5 5
4901 5 5 3 -24 -15 14 6 -12 -24 -3 -2 3 -21 -1 12 5 -5 -16 2 19 4 -9 6 14 12 0 -19 9 14 5 -16 -8 22 13 -6 -5 2 11 -2 -16
4940 -16 -6 11 4 -14 -17 -1 15 1 -32 -18 1 9 -19 -18 -8 10 -6 -22 -8 -1 5 -11 -16 -2 11 3 -12 0 8 16 -3 -4 3 22 5 -6
4976fKJ1Lmj1nK0pj8OL0j3k6J1lJ7rj5NJ0Nj0qJ3RrnLRjnkKJ2Nl3J2J6Nrj3K3
5018A7qjk4%K2Oj0j5J0J3j2k0J9J1Lj2j0NNNj0kkK0j2qPJ9nj9MOJ0k1LNJ6mj8
5057gRRLok5J9J4lk5nK2Kj8rJ3PNj3j5K6kpj1mK1Qj9j0J3L1j8k2J2PK0l0JK3M
5096B0j3j5ML0j2k4NJ1J7j7j6RQ%j2j6K2jJj5MJ3j4j0lK6Mj6kJJ1Qk4QJ6NoKn
5135DJ6%k6J1kK5k7mJ0Nnj6rK1kpnLJ0J0l1LJ0K0j4j8QJ7pj5RJ1Pj3qjJ6lMk0
5175a3K2Mnj3OJ8pj2pJ1Qoq%PJ1j1j4LK4k1qj0K1Mj1mPLj5PNOMj7jJ3Mjj3JJ8
5217A0Rk3%PJ3oj4PQJ4j8r%K2mk3%J6Lj8j5J3ONk0j0L1J0j5j1PJ2jj5lJ6Qj7p
5256a2J8Qkj7LOL0k7j8J1J4lk4JK3pQk2J3J2k0pKK2j1j3LnJ1jk1J6LJ3qj8QRr
$$ plain form
4976 -6 -4 7 10 6 -5 -10 10 3 -15 -9 21 8 -18 -7 -10 7 -2 -17 -12 -2 3 -7 -15 -2 7 -2 -7 -4 5 4 -1 -3 -1 11 16 -17 -5 11 16 7 -6 17
5018 17 9 8 -16 -16 6 12 2 -13 -3 10 -2 -22 -3 8 11 -1 -11 -6 -1 4 -6 -8 -10 10 -2 -10 -3 16 11 -8 -4 2 12 -9 -6 -1 15 11 -7
5057 -7 2 11 14 8 -17 2 16 13 -12 -17 5 7 -11 -20 -7 0 5 -8 -23 3 1 -6 -17 -21 0 8 -11 -21 -8 23 5 -17 -5 2 22 -8 -7 16 20
5096 20 7 -8 -4 26 14 -10 -5 6 23 6 -10 -1 7 7 -5 -21 1 0 1 -14 -10 3 -11 -21 -24 2 6 -10 -12 -11 0 8 -16 -8 8 13 7 9 4
5135 4 20 20 -6 5 3 28 1 -3 7 12 7 -9 -18 3 1 -6 -11 -8 2 12 -19 -16 -6 14 0 -18 -10 7 0 -15 -6 5 12 -1 -9 -10 6 3 7 -13
5175 -13 9 13 8 -5 1 19 12 0 -7 4 12 6 -2 -2 5 16 5 -9 -6 18 -3 -11 -21 0 4 -7 -11 -4 -1 -16 -9 -4 2 6 -11 -12 1 5 4 -9 -8 10
5217 10 19 -4 -4 3 16 10 -4 3 11 25 7 -2 -2 20 16 -7 -7 9 12 -6 -21 -8 -2 3 -17 -27 4 14 -1 -12 -5 7 6 -9 -12 4 12 -5 -12
5256 -12 6 14 12 -5 -2 4 34 7 -11 0 14 11 -13 -12 11 4 12 -10 3 15 -5 -12 -10 12 1 -12 -9 -14 -3 -4 -25 -9 -6 7 -1 -19 -11 -2 -11
5295a1oOJ3%%j0J1J5pj8jK0Pj7j6OJ7kk1LK4jopKOmj1%RKj9nJ8Ook4J5J1J1j3
5336cpkJPnpJ5J3j0j0J3J2nj3nPJ2j4jJ%%j2%OJ3j7PLmLlj1J5Kj8MjLJ3oj2MJ8
5380FNk2%NPoJjJ5rJKOMj8%J5jnj6oK0%j2rK1Mj1j2%J8mlj5PJ2kj2rK3Rnj8mL0
5425A1pj2rK5j1%lJ5mOj5%J4Mj4j1J4Rk2kJJ1Jnj9J6J4j0kj1J7Kk1nJ8J5j0j0
5463a0O%NjmJJ0j4OmK1mj8LQJ4j5qKJ1j1KrJ5lj5JQOJmj2J7qorJ1J4j3pmPOlK
5508eLpPo%oK4jj8RJPj1NPj6J2nj3J6Lnpj1J7jmj7J9Mj3JJPPrrJ1L%j1jJ4kpJ
5554fJ5njj%NJrkJ3J0j4j3lJ7%j1lJ0jlj4QQkJj5J6jmnlJ6nLk3J2K4pj5LPJ0k4
5598a1J0J1lJj3KNQnj2J6%j0oJ0JqrqK1Nj1ppJ2Mj3kJ6J3j2k0J5J0prRNRj7%J3
$$ plain form
5295 -11 -17 -11 2 2 2 -8 3 18 11 -7 -8 12 19 2 -14 -8 9 7 -14 -11 13 12 6 -1 1 7 3 -8 -8 1 3 -16 -21 -3 3 -3 -27 -12 -1 10 -3
5336 -3 -10 -12 -11 -4 -9 -16 -1 12 2 -8 5 17 12 -1 -6 1 13 -1 -2 -1 -1 -1 -13 -13 -7 6 -11 -4 -1 -5 -2 -5 -16 -1 1 -17 -13 -14 -11 2 -4 -16 -12 6
5380 6 11 -11 -11 -6 1 -5 -4 -5 10 1 2 4 10 14 -4 -4 11 10 5 -11 -17 3 3 -9 -18 3 7 -4 -16 -16 2 -2 -5 -20 -13 -1 -3 -15 -24 -1 8 3 -15 -19 11
5425 11 4 -8 -17 8 -3 -3 -6 9 5 11 -4 -4 10 14 0 -11 3 12 -10 -12 -11 0 1 -4 -23 -7 7 -3 -5 -16 1 3 -18 -23 -5 10 0 -10
5463 -10 -4 -4 1 0 -4 -3 7 -7 -1 -5 16 12 -6 -3 5 19 4 -4 -2 9 -2 0 -9 6 3 -12 -11 -3 3 4 0 -12 5 -3 -9 -18 -7 7 -6 -13 -17 -10 -4 -7 -5
5508 -5 -2 -9 -2 -8 -8 -14 10 9 -9 0 1 8 -3 2 9 -7 5 0 -13 3 6 1 -6 -17 0 -1 -5 -22 -3 1 -12 -11 -10 -3 4 -5 -14 -3 0 0 -11 -12 2 0 -7 -6
5554 -6 9 4 3 2 2 7 8 -1 -3 10 20 6 -7 -10 7 7 -4 -7 3 2 -1 -15 -7 1 -1 0 -15 1 0 -4 -9 -12 4 -1 2 -21 -9 15 8 -7 -4 3 13 -11
5598 -11 -1 10 7 8 -5 -3 2 10 5 -7 9 9 -1 -7 3 4 -4 -13 -21 0 5 -6 -13 -20 -8 -4 -17 -19 -3 10 -2 -22 -7 3 -4 -13 -4 1 10 -7 -7 6
5640FLpkj1RJ0Mj9PlQj5J0%Mj6JJQKj6KKJ6Pk2lPLk4J4PJNK%oPLJ%Njjj0RNpj1
5689eJ2%jj5J7Jj3%%J0ojq%OKpoJ6mLmJQp%J%MPj6NJ1m%j7J5QlnnkQOj9%J5Jj2
5738cmNJ1jj3%qJmJjRLrjNJ1j9LJ9Pj0j2K0nlj1JK1nqnK%Pj2PnJ7j1j1J4Rj7j0
5783a5J0QKj8lQPpLj1J4Lk0QMLK%JQppPOjJ3k2J2MpkpNJ%njJ2rpOMj2J3j1NmJ0
5831Cj4JlJ4j1RppJ5mrJ7j6J0mQnNQj8J1J2nrMlRj9OJNpJ1j8NMnlmQOmk0RLj4
5877b5J8%j0RlOkKJ3j2j1J6J1j4j2K0Qjj2OoKRk6J6J7j9j6J0j1J1Lj6J8rRj4%
5915a5J0KorMPJMjJOMqMjkj3NJ4rQmPjoooRJ1j3%J2j6Qj0kJ4j0JjnRj4Mj3J2K
5962a2qQLJ9j1ljJ1jj1QMjnjKKOppRjj2jK1j4jlLQj3Nj2ROQj1mjKrO%OjJKlLq
$$ plain form
5640 6 9 2 0 -11 -2 8 12 -7 0 -3 5 -10 0 0 4 -12 -11 -10 -2 0 -16 -14 -12 4 11 -11 -14 -7 -4 -28 -14 -7 -6 -1 1 1 -5 2 5 6 6 11 10 9 -1 8 13 6 -5
5689 -5 7 7 6 -9 8 9 -4 -4 -4 6 0 -1 -9 -9 -3 -1 -8 -14 2 -2 1 -3 -2 6 -1 -1 0 0 4 11 -5 0 11 7 7 -10 5 13 10 5 0 -2 6 12 -7 -7 8 9 -3
5738 -3 -7 -2 9 8 -5 -5 -13 -12 -16 -15 -16 -7 -4 -13 -14 -9 2 -17 -14 5 12 2 -10 10 5 2 -9 -8 13 8 0 -5 -3 -3 4 -8 -1 -6 11 0 -11 3 12 -5 -15
5783 -15 -5 3 5 -13 -16 -8 -1 -8 -5 -16 -2 1 -19 -11 -7 -4 -2 -2 -1 7 0 -7 0 6 5 18 -4 8 12 5 3 -4 1 2 2 -3 -4 8 -1 -8 -2 2 -10 3 -8 -3 -7 3
5831 3 -11 -10 -13 1 -10 -1 -8 -15 0 -4 -13 4 -12 -2 -6 2 -3 2 10 -8 3 15 10 1 5 2 11 -8 -2 -1 4 -3 8 -10 -5 -1 -6 -9 -13 -5 1 -3 -23 -14 -11 -25
5877 -25 -7 -7 -17 -8 -11 -5 -7 -5 8 -4 -15 1 12 -2 -14 6 14 13 1 7 1 3 12 -14 2 19 0 -16 -6 -17 -6 -3 -19 -1 -10 -1 -15 -15
5915 -15 -5 -3 -9 -18 -14 -7 -6 -2 -3 -2 4 8 0 4 3 1 -12 -7 7 -2 6 2 9 8 2 -4 -10 -1 10 -3 -3 9 -7 1 -9 -11 3 -7 -6 -7 -12 -3 -17 -13 -26 -14 -12
5962 -12 -20 -12 -9 10 -1 -4 -5 6 5 -6 2 6 5 0 -1 1 3 9 2 -5 4 3 -9 -10 11 -3 -4 -7 -4 4 -9 -4 -16 -7 -1 7 -4 -8 -9 -7 -16 -10 -10 -4 -5 -4 -2 -5 -2 -10
6012a0NLJRpjnONLnJ1omQompJ3j3JmJ1j1pQJ0rj1NQlj1kJ5omNKOrK%NRp%mONp
6063aqRPj0LRjKj2oJ1nj4nJ5LrjmJ1%j4J5j3J2pQKqJ1ooQQkj1KJ4jj2lJ3kk%j
6109aMpNj4J0Omj0jQmJ0j3NjnNjMokkjPkoRJ1j5RKRlJmLNljLpQj0j1OJ3k2mJ2
6158ekOj7J3mKrKlJ2nMlKKklMJ0pKPnlP%OjnKJpJ0pOqpRpN%llOj1RnOj0lpJ7j
6211cnj1J3LmMolMJ4j8J0kNqQjn%lOLll%J1rnNQpKj5NJ3rj6PJ0Kj5LJ1m%oLJ1
6259@j3LOmRKj9J3KPj5J0NLjj5R%Mlj3MJ8k7LJ2KQj4j4J5Oqj4MkNlRpKLQLjj0
6305hJ0j0J5oJLMKmoLJnRon%OoK%kj1J0J3poj1J1kjRj6PLlkjNKmQKqQmKJJoJ0
6356H%LOpjlkRj4%JoJ4j6jkJ2l%qJ0mnKPMj1KmLOOqKjJ5k3QJO%kkJ4j1KmPlml
$$ plain form
6012 -10 -5 -2 -1 8 1 0 -5 1 6 9 4 15 9 5 13 7 3 -4 9 -4 -3 -7 4 -7 -14 -6 4 -5 -16 -11 -3 -6 -17 -19 -4 -10 -14 -9 -7 -1 -10 -8 -8 -3 6 -1 -1 -5 1 6 -1
6063 -1 -9 0 7 -3 0 9 8 10 -2 -8 3 -2 -16 -21 -6 -3 -12 -13 -17 -6 -6 -20 -5 -18 -6 -13 -5 -3 -11 0 -6 -12 -4 4 2 -9 -7 7 6 -6 -9 4 2 0 0 -1
6109 -1 3 -4 1 -13 -3 3 -1 -11 -12 -4 -8 2 -11 -6 -7 -12 -7 -8 -4 -10 -12 -14 -15 -8 -10 -16 -7 4 -11 -2 0 9 6 7 3 6 11 8 7 10 3 11 1 -10 -4 9 -13 -17 -5
6158 -5 -7 -1 -18 -5 -9 -7 -16 -14 -17 -5 -10 -6 -9 -7 -5 -7 -10 -6 4 -3 -1 6 1 -2 5 5 11 10 5 7 8 1 11 4 10 2 -5 4 -3 2 2 -1 -4 2 -9 0 -5 1 -9 -12 -19 -2 -3
6211 -3 -8 -19 -6 -3 -7 -3 -9 -12 -8 6 -12 -2 -4 1 -7 1 0 -5 -5 -8 -2 1 -2 -5 -5 6 -3 -8 -3 5 -2 0 -15 -10 3 -6 -22 -15 -5 -3 -18 -15 -4 -8 -8 -14 -11 0
6259 0 -13 -10 -4 -8 1 3 -16 -3 -1 6 -9 1 6 9 8 -7 2 2 6 3 -10 -6 12 -15 -12 0 2 10 -4 -18 -3 3 -5 -19 -15 -17 -12 -15 -6 -13 -11 -8 0 3 2 -8
6305 -8 2 -8 7 1 2 5 9 11 7 1 4 5 0 9 3 -2 -2 4 -2 0 0 -2 -13 -3 10 3 -3 -14 -3 -5 -6 3 -13 -6 -3 -6 -8 -9 -4 -2 -6 2 4 -4 4 0 2 3 4 -2 8
6356 8 8 11 17 10 9 6 4 13 -1 -1 0 -6 8 -8 -9 -11 1 -2 -2 -10 0 -4 -9 -7 0 4 -7 -5 -9 -6 0 6 -2 0 -1 14 -9 -1 0 6 6 4 2 16 5 7 3 10 7 3 0
6407@L%lJoJ1j4JLJ1mj0JnJ1orPrK9k6KJ2KMmkPp%rPMnJ6nkJ%mKOoj2nJ3mj1O
6456hJ3kj4OLrMLpJ5rKmKPjM%NprKJ1KjkkjJJm%N%Kj4Mlj5J6LmoMQj7RLmO%rQ
6509crKMJOJnNKLmMj1J4qoJ3ppNNMjnqMQlk0R%pKj6K6%j6R%%Pnj0K0rRkmJjJJ
6561aJ0JqjL%Jj1J1moMmJ2Rj9KMpJrPNj0MrKJ3j6NNnLkoJ2mJ3j0MPkK%J2j9NO
6609A0k%pNpmNmpNJ5pnj0KJ4j5KpKLOjPnLlqJ0mnJ0NJkKkLRnKlMj6J2Kk6J2Nj3
6659a2MJ4j0kjNj4QJqJ4rjmPoJ5j0%PpJkjLqJ4mMJlJ2rQOrj1JJNj5RPpNNpNkm
6709drkJ3j0oLRj0jOK2j1j0lMJ6j0LlOj2RqJ1Pqj1Q%oRj0L%mJ0KlnOqrKMnMmL
6757a2jkPmJ1j0JNnmJ0LJlmNJ1j0lJ4j7J3l%Jj4Nj0RJqJJ%MqOnkLJKMj0j%NjR
$$ plain form
6407 0 3 3 0 1 -5 6 -8 -7 -4 7 3 -7 -6 -11 0 -6 -15 -8 -17 12 -14 -12 0 2 6 2 0 7 0 0 -9 -2 2 -3 13 8 6 7 7 3 5 11 5 -7 -12 1 -3 -14 -8
6456 -8 5 3 -11 -5 -2 -11 -7 -4 -11 4 -5 -3 -7 -5 2 1 5 5 10 3 -6 -4 7 9 8 6 4 3 4 5 1 1 6 6 8 -6 -2 -5 -20 -4 -1 -5 -11 -7 1 -16 -7 -4 -8 -2 -2 -11 -3
6509 -3 -12 -10 -6 -5 1 2 -3 2 4 7 3 7 -4 10 2 -4 9 2 -5 0 5 9 8 3 -5 -1 7 4 -16 -7 -7 -14 -12 -28 -2 -2 -18 -9 -9 -9 -2 -7 -17 3 -6 3 1 -3 -2 -3 -2 -1
6561 -1 9 10 2 1 4 4 5 -6 5 1 -5 -1 -5 7 16 -3 -1 3 -4 -3 -12 -5 0 -10 -6 -15 -13 0 -16 -11 -6 -11 -8 -10 -16 -4 -8 5 -5 -1 6 4 6 6 18 -1 4 10
6609 10 8 8 1 6 -1 -5 0 -4 -11 -6 9 2 -3 -13 -11 3 -12 -10 -17 -15 -12 -6 -7 0 -5 -2 -5 -13 -3 -7 -12 -2 3 4 2 4 2 5 14 9 11 8 12 -4 8 10 -16 -4 1 -12
6659 -12 -8 6 -4 -6 -7 -2 -16 -8 -7 -15 -1 -10 -11 -15 -8 -14 1 -9 -9 -2 -9 -8 -10 -11 -8 -16 -2 -6 -2 -1 -4 8 -1 7 13 4 -7 -6 -5 0 -15 -6 1 -6 -1 4 -3 2 0 -4
6709 -4 -13 -15 -2 -12 -18 -15 -6 -16 -17 -11 11 0 -10 -13 -9 7 -3 0 -3 3 -9 0 -8 3 10 2 -9 -1 -1 -7 2 -8 -5 -5 -9 1 3 0 -5 1 -7 -16 -14 -10 -15 -11 -15 -12
6757 -12 -13 -15 -8 -12 -1 -11 -10 -5 -10 -14 -4 -1 0 -3 -7 -2 9 -1 -4 10 -7 6 3 3 4 -10 -5 -15 -6 -5 -13 -12 -11 -11 -7 -15 -9 -14 -16 -13 -12 -10 -6 -16 -17 -17 -12 -13 -4
6806dLkPj2mORojK%J8j2mKmMJlj3J5lnKjkj4J9JoPmlLlm%%jL%KkJQjjlPlJ0j2
6858c%MlRrOKkomJ7j6Npj1J3lKpR%Kj6oJ9rJ1j4J2j4J0%MJjKKNko%k%PrPlMoM
6908bJ0Kj3%lpjmNRkPk0J0Pnj4J0LpJ1nkNkmJ5oRJj1ONoOp%MpNkMkPonLloJ6o
6959Bk5J7MjpQj3K1j0rLLj6K5j5RJQolQrJ0kPnMrLNnjjmmPkKMjjj7J2j0PoJJ3
7007BolJ1kpMPj1N%KJK%pNMOj5NMKj0KLj1J3JoKLj5Kj1LJ6j3J3nrjKOJj2J8Oj0
7055clkPKklLKjLjlKQqKPj4JjJ0JkpjJ3%k0J2rJk%j0NJ2rnRnL%JjLK%LNljkJ4
7108A3j1Np%JNlOk0JMkNnOmOlMnnLMj9J4Mj9J4%Nj4NJ6rqJ0kLNkMM%qlMJLnjL
7159CJ0j5k%jkKLj1JJKJ1mmmJPj1RKmJ1qJ0j1QpjkQKj6J4qJ1kmpPJ0nj0LLpMj
$$ plain form
6806 -4 -1 -3 4 -8 -12 -6 3 -3 -4 -2 -2 16 4 0 2 -2 2 3 0 -13 2 -1 -6 -4 -5 -7 -21 -2 -1 -7 0 -4 -7 -4 -7 -11 -11 -11 -12 -9 -9 -7 -9 -8 0 -1 -2 -5 2 -1 9 -3
6858 -3 -3 1 -2 7 -2 4 6 4 -2 -6 11 -5 0 -7 -18 -5 -8 -6 -13 -4 -4 -2 -18 -24 -5 -14 -3 -17 -5 -19 -9 -9 -5 -4 -5 -3 -1 4 2 -4 -4 -6 -6 1 -8 -1 -4 0 -6 -2
6908 -2 8 10 -3 -3 -6 -13 -14 -18 -13 -4 -6 1 -19 -9 -2 -7 -21 -11 -8 -15 -4 -9 -11 -6 -8 -12 3 -3 6 7 -4 2 7 1 7 0 0 4 -3 2 0 4 2 9 3 -2 1 -2 -8 8 2
6959 2 -23 -6 -2 -3 -10 -2 -15 6 -4 -13 -10 -7 -23 2 -13 -4 -3 5 -1 -4 4 -5 5 3 10 5 9 0 3 8 3 2 1 -3 -7 0 -2 0 4 3 2 -15 -3 -13 -6 -12 -11 2
7007 2 -4 -7 4 2 -5 -1 6 -5 0 0 2 3 5 5 -2 3 7 13 -2 3 7 9 -1 1 4 -7 6 7 1 3 6 -9 -7 -18 -15 1 -12 1 -4 -13 -14 -12 -6 -5 -17 1 7 -3
7055 -3 -6 -8 -1 1 -1 -4 -1 1 0 3 2 -1 1 9 1 3 10 -4 -3 -4 6 7 5 -2 -3 10 10 -10 2 -7 -6 -8 -8 -18 -13 -1 -10 -15 -6 -11 -8 -8 -7 -8 -5 -3 -3 0 5 2 1 -1 13
7108 13 2 7 0 0 1 6 3 9 -11 -10 -6 -8 -3 -8 -2 -6 0 -3 1 -4 -9 -6 -2 -21 -7 -3 -22 -8 -8 -3 -17 -12 4 -5 -13 -3 -5 -2 3 1 5 9 9 1 -2 2 3 6 1 0 3
7159 3 13 -2 -4 -4 -5 -7 -5 -2 -13 -12 -11 -9 2 -2 -6 -10 -9 -2 -13 -4 -2 -6 5 -3 7 -4 4 -3 -4 -6 2 4 -12 2 -6 5 3 -1 -8 -1 9 4 -6 -3 0 -7 -3 -4
7207dpNNJj3J4j0JmNnlj1OJ8mjkJ1JoO%pkrJ1J0kpO%j1QnPkqKNJoLnLmQ%QqMj9
7259a6JkPnnRJ3j0kJ0qJ0j2J4kjP%ojkj4J4NklKM%rM%kOj6jQLnP%Nnj1kQJrNQ
7309@oJJ0j3KOOjnJ1oqoJ9l%kMKj0JOloljJ1j4l%%KjNrJ1qQNJomJ2j1R%mNMjm
7360Ck%kjNJjoMNQpNj5Qj3LKmJrMjNkKJoMpLmJ0OmKLrNj3RNLpnLJQkMolMlLnL
7417dMP%j6OmmMjnJ4kj3J3mMj2k%KMmJ6lPnljJ3j0OLj7OnJ1jj1NmPmMorJmRpM
7467a1pJ0lNLkko%Q%%j0ONnQPj3NLKrPo%QknPlj0J1qJ1mlpLj1J0j2QJLPj2LJ3
7516Cn%l%njRjLKJJLqLnMLj1LM%%oMLmMqMokj1PO%NqNkrJ1OjoKKLLOpjMj1JJ2
7572FmpRplJ3j0j3J1jPj6NJ3lj0KjOpoL%NolJ1m%OQpOj1MLnJ4pnJ0k%pMJ0kj0
$$ plain form
7207 -4 -11 -6 -1 0 -13 1 -9 -8 -12 -7 -12 -15 -26 -20 -2 -6 -7 -9 2 3 -3 3 3 -4 -6 -15 -4 6 4 -3 3 3 -8 0 -5 2 0 -8 -6 -1 0 -6 -3 -8 -5 -9 -1 -1 7 -1 3 -16
7259 -16 -15 -17 -10 -15 -20 -11 2 -8 -10 0 -8 2 -10 4 2 1 8 8 2 1 -1 -15 -1 4 2 -1 1 5 5 -4 0 0 -2 4 -12 -13 -5 -2 -7 0 0 5 0 -11 -13 -5 -4 -13 -8 0
7309 0 -6 -5 5 -8 -6 0 6 5 0 11 5 -3 -9 10 7 7 5 9 11 1 2 8 5 -1 -4 -5 6 -8 -11 -11 -11 -9 -10 -5 -14 -3 -11 -3 2 3 -3 -7 5 -6 3 3 -1 4 8 7 3
7360 3 1 1 -1 -2 3 4 3 -3 1 6 14 7 12 -3 5 -8 -5 -3 -7 -6 -15 -11 -12 -7 -9 -7 -6 -12 -8 -15 -12 -16 -6 0 -4 -2 1 -8 -3 -16 -7 -2 1 -6 -11 -8 -7 1 -1 3 -3 -6 -2 -5 -2 -7 -4
7417 -4 0 7 7 -9 -3 -7 -11 -7 -8 -13 1 -1 -14 -1 -5 -1 -13 -15 -15 -13 -9 -13 3 0 7 2 -1 -2 11 1 7 10 -7 -1 -6 5 4 -7 -2 -6 1 -3 1 -5 -14 -13 -17 -8 -15 -11
7467 -11 -18 -8 -11 -6 -3 -5 -7 -13 -13 -5 -5 -5 -15 -9 -4 -9 -1 6 -7 -2 1 3 -6 1 -5 -5 3 1 -4 3 0 -10 1 -7 4 0 -3 -10 -7 -18 -8 -20 -12 -11 -8 -1 -13 -10 3
7516 3 -2 -2 -5 -5 -10 -11 -2 -3 0 2 3 4 7 -1 2 -3 1 4 -7 -4 0 0 0 -6 -2 1 -3 1 -7 -3 -9 -11 -22 -15 -9 -9 -4 -12 -7 -9 -18 -7 -1 -2 -8 -6 -4 -1 2 8 1 0 4 -7 -6 6
7572 6 2 -5 4 -3 -6 7 -3 -16 -5 -6 1 -15 -10 3 0 -10 -8 -9 -3 -10 -16 -13 -13 -8 -14 -17 -6 -10 -10 -4 4 -3 3 -8 -4 -1 -6 8 1 -4 6 4 4 -3 1 11 9 -1
7620alLj5J3KKj0%kJ5qJmqjJ3j0MMJMNk1PJ4j0Qj7PoMJ0j3J8j0QOLmln%mnJ3%
7666Ej3QmlQnJM%j6RqJKkjQjPoJ3kqjJqJ8MppKK%LMjpNNnj1J3JJj6kMllKOMrJ3
7720Ej6LQlj4J1LkOj2K0oKkJ%jNoJ5kj3Pj3kJ6rjRkpOjnKmmOjpK%JmmRoOj1J2
7770cMqKLNLMk1J5lMkj1J1LqOOprJ1LmpoQqOo%J2j1O%jjQj0MMmmkOPnnkLJJ1m
7822DOo%NoMKJj2J1Lk1RJ1j2ljK%%%n%J0Mj1PJMnrKPrRomNLQ%jnMKoMloLoPjj
7876a%RqoJmkRoN%ojJ1Kqj7K3rpJ4kPrMKoJ2rJ4KoLj0KNj0jNnJjmJ4qkpJ3onL
7927emQlqJJJ0jnLj0J3j2QOKj1KMJ0pJ5q%JqLj3J4pjlNj2JJ7j5OMplJJjkmJ2J
7975aqRmpPMrJ1JopNKLnRLj7K1monOolJ3nnJjkJ6qj2KJkMmPNj0KJ4qmJ0qqJ5l
$$ plain form
7620 -1 -4 -1 -16 -3 -1 1 -9 -9 -11 4 -4 -3 -7 -15 -16 -3 -13 -9 -5 -4 0 5 -16 -9 5 -5 3 -14 -7 -13 -9 1 -12 6 -4 4 10 13 9 6 1 1 -3 -8 5 5
7666 5 -8 0 -4 -7 1 -4 -3 1 1 -15 -6 -14 -13 -11 -13 -14 -6 -7 0 -6 7 5 -3 -4 -3 -11 7 11 4 -3 -1 1 1 4 8 7 0 5 10 5 -6 7 8 9 -7 -9 -5 -8 -11 -9 -3 1 -8 5
7720 5 -11 -8 0 -3 -17 -6 -3 -5 1 -11 9 3 5 3 4 4 3 8 2 17 15 2 9 -4 -6 10 1 0 9 7 0 6 5 0 2 -2 -6 0 -1 -8 -6 -6 -5 -9 -13 -4 -10 -4 -15 -3
7770 -3 1 -7 -5 -2 3 6 10 -11 4 1 5 3 -8 3 6 -2 4 10 3 -6 5 8 4 -3 -9 -1 -9 -3 -9 -9 3 -8 -2 -2 -3 -4 4 -6 -2 2 -2 -6 -8 -2 5 0 -5 -7 -4 -3 8 4
7822 4 10 4 4 9 3 7 9 10 -2 9 12 -9 0 11 -1 -4 -5 -3 -3 -3 -3 -8 -8 2 6 -5 2 3 7 2 -7 -5 2 -7 2 -4 -8 -3 0 8 8 7 2 6 8 2 6 3 -3 0 -6 1 0 -1
7876 -1 -1 8 0 -6 -5 -9 -11 -2 -8 -3 -3 -9 -10 1 3 -5 -22 1 -8 -15 -1 -3 4 -5 -1 1 -5 7 -2 12 14 8 11 1 3 8 -2 -3 2 -3 -2 -3 -7 7 -1 -3 -10 3 -3 -8 -5
7927 -5 -9 -1 -4 -12 -11 -10 0 -1 -6 -3 -13 0 -12 -4 2 4 -7 -5 -1 9 2 17 9 9 10 2 5 -8 6 -1 -2 -5 0 -12 -11 6 -9 -3 1 -6 -9 -8 -7 -8 -10 -14 -2 -1
7975 -1 -9 0 -4 -11 -4 0 -9 2 3 -3 -10 -5 -3 0 -5 4 7 -10 11 7 1 -4 2 -4 -7 6 1 -4 -3 -4 -6 10 2 -10 -8 -7 -9 -5 -9 -2 3 -7 -5 9 1 -3 7 -1 -9 6 3
8026CpnRjnJLNKKj0J3Pj9%MKj3j7J8K2jnj5J1qLrJOlMj1NPLlPpOnJKljkjJ0Jj2
8076eRJ0jj5nO%J0j2%L%mjjO%%m%mjJ%OjKj5J1MkJjkNnPmlKmJ4pJ1j7J5%j4J9
8125A4rlj%nJrJ5rMKnJPrNkJlLlLLOrMOpQKj%JnjnQjlOlJ2j1Rj8NrKkLjkkNNp
8181dkkPnmPJkJQ
$$ plain form
8026 3 -4 -9 0 -1 -6 -5 -2 3 5 7 -3 10 17 -2 -2 2 4 -9 -26 -8 14 13 8 -7 4 -4 -1 -10 -9 -3 -6 -2 -13 -8 -1 2 -1 6 -1 5 0 1 3 0 -1 -3 -4 6 7 -5
8076 -5 4 14 13 -2 -7 -1 -1 9 -3 -3 0 0 -4 -5 -6 0 0 0 -4 -4 -8 -9 -8 -8 -2 -3 -1 -16 -5 -1 -3 -2 -3 -5 0 -5 2 -2 -5 -3 -7 7 0 11 -6 9 9 -5 14
8125 14 5 2 1 1 -4 -3 -12 3 -6 -2 0 -5 -4 3 -6 -1 -3 -2 -5 -2 -5 -2 1 7 -2 2 8 1 9 11 10 10 11 6 5 0 8 7 4 10 7 19 8 17 -1 4 -5 -3 -5 -2 -3 -5 -7 -2 3 -4
8181 -4 -6 -8 -1 -6 -10 -3 -2 -4 -3 5
8191E
$$ Imaginary data points
##PAGE= N=2
##DATA TABLE= (X++(I..I)), XYDATA
0@%%%%%%%%%%%%%%%%%qJ6j6J6j6J6k4L2l2L3m1M8n6O5p3Q8r7J06j22J38j54J70
39H9j93K17k42K70k94L25l63M00m40M86n37N92o53P19p91Q72r62J067j188J329
59G03j494J687j921K211k585L085l789M864o730J0842l5482K5682P2430o9051
73D52n4317M1836N4560k7765l6285O25K3746J8277k241m0664j3675N3528L1933
86E0010o4515m2778O5833N1626o3384n2572N2831M9863l9491m0425K1690K8318
98A7006m050j2722j3994k701K9073J7861m1247k9946M8491L8660n1257m2289M9018
111A903M1340m2794l5586L3068K6255k1194j4272Q257J369M319J0988j5615k1352
124b3314K4730K8537l1174l1883L4564L1069l4960k6462L2668J8748k8174r109
$$ plain form
0 0 0 0 0 0 0 0 0 0 0 0 0 0 0 0 0 0 0 -8 8 -8 8 -8 8 -16 16 -16 17 -24 24 -32 33 -40 48 -49 57 -65 73 -81 89
39 89 -104 113 -129 141 -153 172 -191 209 -231 255 -282 310 -343 376 -415 457 -505 562 -626 703
59 703 -791 896 -1025 1186 -1399 1686 -2103 2761 -3969 6873 -28609 -2927 69503 452
73 452 -53865 -12029 42531 14766 -21519 -20894 2852 21129 18888 -21776 -35451 18077 50010
86 50010 -14505 -57283 8550 60176 -3208 -55780 -2949 46914 7423 -33002 -11312 17006
98 17006 12956 234 -13760 -16461 12612 30473 -10774 -40720 7771 46431 -4826 -47115 1903
111 1903 43243 449 -35137 -2069 24186 2992 -11280 -3023 -1654 2665 13653 -1962 -23314
124 -23314 1416 29953 -1221 -33104 1460 32529 -2431 -28893 3775 22523 -5651 -14760
136a4760K2050j147j4874J0733P341j8442J33K3406p031k4995J3079K3158j7974
149F77j8222K1577J0912k3798k216K4581o746k3994J4777K1966k0863j8636K4148
162D163J4026k4223q417K1038K014j4932M827O691j1643K678J8067j2056k3402
175b1169K0231K7234k6136k9053K9047K8550k8453k5630K4398K0354j7326j3092
187a1045P964M421K502M961j2942j4330K2155K2717k9038k9310L2750L3455l2885
200A375l4608K9375L2626k2581k7510J3229J9731k305r875q991j126J9473J2269
213B1082k7996k2506L3609L0753l5719l6192L4096L8112k8943l6315K0776L0894
225B1651j0500k2370p99J1594J1941L31k1737j2238K9284K2855l3772l1020L4833
$$ plain form
136 -14760 7290 6143 -8731 2002 9343 -9099 -8966 14440 7409 -17586 -4507 18651 677
149 677 -17545 4032 14944 -8854 -11070 13511 6765 -17229 -2452 19514 -1349 -19985 4163
162 4163 18189 -6034 -14451 6587 8601 -6331 -1504 5187 -6456 -3778 14289 2233 -21169
175 -21169 -938 26296 160 -28893 154 28704 251 -25379 -981 19373 2047 -11045
187 -11045 -3081 1340 3842 8803 -4139 -18469 3686 26403 -2635 -31945 805 34260 1375
200 1375 -33233 -3858 28768 6187 -21323 -8094 11637 9332 -543 -9534 -10660 8813 21082
213 21082 -6914 -29420 4189 34942 -777 -36969 -2873 35239 6296 -30019 -9243 21651
225 21651 11151 -11219 -12018 -424 11517 11848 -9889 -22127 7157 30012 -3760 -34780 53
238E3L6006l2455l7212K6934L4650j8932k8610R312J9774R10r172j0693k155J9145
252G555J2929k5488k2149K9141K8853k9926l2410K7842L2562k3278k9324J6750
264f943K3168q965j4779P68N171P125M633j3923j3601J9175K0785k2452k5423
277b5261K3588K7092k2689k5716J9937K1524j5791j5142J0674P325n076Q61m95
290H31q502N636J4747j0036j8905J3453K0574j5680j9670J6744J6446j6624j1395
303a2381J5473N246j3370J187J0541p093p206J1781L507j4748L48J5605m175j4396
317i681P786J1285j1015o725J3621J377j5493M091J6424q933j6255J2549J4928
330A3959j4436j2372J4374Q702j2322m102Q592j133l605O604k046j1842P551J6397
$$ plain form
238 53 36059 3604 -33608 -6674 27976 9044 -19566 -10254 9520 10430 1258 -9435 -11590 7555
252 7555 20484 -5004 -27153 1988 30841 915 -31495 -3653 28909 5631 -23693 -6943
264 -6943 16225 7260 -7519 -6751 -1580 5545 10178 -3745 -17346 1829 22614 162 -25261
277 -25261 -1673 25419 2730 -22986 -3049 18475 2684 -12458 -1784 5541 465 1326 831
290 831 -7671 -2035 12712 2676 -16229 -2776 17798 2118 -17552 -808 15638 -986 -12381
303 -12381 3092 8338 -5032 -3845 6696 -397 -7603 4178 7685 -7063 -6715 8890 4715 -9681
317 -9681 -1895 9390 -1625 -8350 5271 6648 -8845 -4754 11670 2737 -13518 -969 13959
330 13959 -477 -12849 1525 10227 -2095 -6197 2395 1262 -2343 4261 2215 -9627 -2076 14321
344A4321j2310j9759J5618K1538j7099k1471J6500J9404j3829j5535R456J0027
356F861l766l405k497l730Q629J0854j3958j7167J7791K2125j9680k5120J9359
369c704K5847j6840k4145J2367K0103o484j4039k43O496O992J823j3093j0153
382a5073J7848J7607k0730k3445K1440K7027j9894k7936J6332K6045j1105k1507
394a3391M827J4830J872o655q282k122J3783J0633j7835j8011K0057K3459k0284
407B881k6479J8509K6747j4989k4325J0108J9467m433j2729j524M891P137L275
420H536j1878j0934J5342J7311j7215k1740J7408K3844j5943k3450J3132K0631
432A5044r272j5770M816R420k13k332m155m681P826J0949j0659j5771J2399J8680
$$ plain form
344 14321 2011 -17748 -2130 19408 2309 -19162 -2662 16742 2913 -12622 -3166 6861
356 6861 3095 -310 -2807 -6537 2092 12946 -1012 -18179 -388 21737 2057 -23063 -3704
369 -3704 22143 5303 -18842 -6475 13628 7144 -6895 -7138 -642 6350 8173 -4920 -15073
382 -15073 2775 20382 -348 -23793 -2353 24674 4780 -23156 -6824 19221 8116 -13391
394 -13391 -8564 6266 8138 1483 -6799 -8921 4862 15495 -2340 -20351 -294 23165 2881
407 2881 -23598 -5089 21658 6669 -17656 -7548 11919 7486 -5243 -6767 -1876 5261 8536
420 8536 -3342 -14276 1066 18377 1162 -20578 -3170 20674 4731 -18719 -5587 15044
432 15044 5772 -9998 -5182 4238 4025 1693 -2462 -7143 683 11632 973 -14798 -2399 16281
446A6281j3064j9409J2711J7951j1407j4604R420R758o862m159M088j648j143
459b087O918j690j1054M255J3731o488j4635Q234J3761r462j1317J0099P660j0160
473b235l311R593j145q498N175O872q324m763J0235K276j0696N00R763l401p566
488e525O293M457q913q68J1104k745j2582N884J3139q158j2641R246J1027r100
502F18q317P669M663n220l51K023m303J545Q752m869j2746P712J5749r611j7386
517a4072J0322J7479r732j5882P901J2718n014q204J402K767K526L074o196q913
531i824R285J4039j1347j7992J2127K0279j1513k0677R552J9045o475j5541K645
544f397J0448J496m213n528k449Q929Q994j1374j4705J2652J8961j2565k1348
$$ plain form
446 16281 3217 -16192 -3481 14470 3063 -11541 -2121 7637 775 -3384 704 -944 -2087
459 -2087 4831 3141 -7913 -3658 10073 3585 -11050 -2816 10945 1483 -9834 265 7925 -2235
473 -2235 -5546 4047 2902 -5596 -421 6451 -1873 -6636 3599 5875 -4821 -4321 5442 2041 -5525
488 -5525 768 5225 -3688 -4556 6548 3803 -8779 -2895 10244 2086 -10555 -1309 9718 618
502 618 -7699 -30 4633 -587 -938 1085 -3218 -1673 7079 2210 -10536 -2824 12925 3314 -14072
517 -14072 -3750 13729 3997 -11885 -3984 8734 3720 -4484 -3082 -315 2211 5285 -911 -9824
531 -9824 -539 13500 2153 -15839 -3712 16567 5054 -15623 -6071 12974 6499 -9042 -6397
544 -6397 4051 5547 1334 -4194 -6643 2286 11280 -94 -14799 -2147 16814 4249 -17099
557a7099J1215K1559q725j9599N380J5678j570j0198k337L708N963L075q951r511
571a1412J1024J4905j1966j8783J1760K0684j0382k0488Q078J8226n043j4152
583g549J638Q749J804k587m960l633P483R376r220j4012J0025J7046r888j8259
597a3987Q884J7512p158j5018M992J1002k543o063R6P20K142M490m023q942N444
612b452J2291o414j4113O900J4331o901j2980O496J0293n748o633M689K495l491
626a237J737K042n513m88Q368j058j0144K597J0631m044r866N318P984o316n302
641e291P011K181p265J004P071l827o349N964N137p211l387P404J273o689J153
656a821N125l737k930O186M37q274J960R811m000j0599N400J0470o041r332N821
$$ plain form
557 -17099 -5884 15675 6950 -12649 -7269 8409 6839 -3359 -5696 -1988 3975 7050 -1901 -11412
571 -11412 -388 14517 2551 -16232 -4472 16212 5830 -14658 -6580 11646 6603 -7549
583 -7549 -5911 2838 4642 2055 -2905 -6538 945 10321 1101 -12911 -2886 14160 4272 -13987
597 -13987 -5103 12409 5251 -9767 -4775 6227 3684 -2379 -2283 -1563 579 5069 1046 -7896 -2452
612 -2452 9839 3425 -10688 -3788 10543 3642 -9338 -2842 7451 1703 -4930 -241 2254 -1237
626 -1237 500 2542 -2971 -3459 4909 3851 -6293 -3696 6935 2891 -6975 -1657 6327 11 -5291
641 -5291 1720 3901 -3364 -2360 4711 884 -5465 499 5636 -1575 -4962 2442 3715 -2974 -1821
656 -1821 3304 -433 -3363 2823 3260 -5014 -3054 6757 2757 -7842 -2442 8028 1987 -7345 -1524
671a524P238m763m370L088Q69r48K965j357o664L509R916n197j2430O272J3814
686A0418o522j3944N949J2690m579j0157K552O578j66k229k334k477M575P094
700G448o341j1129P414J4128p594j5790O915J5927n424j4468L335J1532q35p469
714b351j721K587M120K517o020p436P286J1628p813j4654P493J6198o406j6123
728a0695M692J4443k556j1281J63P043K200k100m303k983N931P766o965j1701
742a0346P304J4399o907j5621N886J5207m328j3273K445J0004m37n828j536J178
756a853L213L448m463p588N234J0816n509j2801N299J3386m655j2571L736J0476
770F168k612p389J430L727k90K12p68l910J661O990k387r194K932J0322l336j0293
$$ plain form
671 -1524 5714 951 -3419 -331 538 -410 2555 1198 -5466 -1957 7959 2762 -9668 -3396 10418
686 10418 3896 -10048 -4099 8591 4012 -6145 -3593 2985 2819 590 -1744 -4221 354 7448
700 7448 1107 -10022 -2608 11520 3926 -11864 -4949 10978 5554 -8914 -5579 5953 5118 -2351
714 -2351 -4072 -1485 2635 5152 -868 -8304 -1018 10610 2797 -11857 -4364 11834 5428 -10695
728 -10695 -6003 8440 5884 -5397 -5234 1809 4009 1909 -2394 -5377 554 8320 1355 -10346
742 -10346 -3042 11357 4450 -11171 -5285 9922 5594 -7679 -5234 4770 4333 -1495 -3031 -1853
756 -1853 1360 4808 345 -7243 -2009 8807 3298 -9503 -4204 9182 4527 -8044 -4308 6168
770 6168 3556 -3833 -2403 1324 1034 1246 478 -3432 -1771 5219 2832 -6362 -3430 6892 3556 -6737
786f737L557R173l647p127L561M458l356j448K975j573k369M198J605o174o34
801c538P284m36p523J621O868k803n495L961L576m920j366N581q57n811K740N582
817D464m137m859M876L656m963k009M426ol307K182J852m356k23O238j310p633
833e109K546Q442l371q487L701P685l469o097K727L833j599j057K50k034J175
848h64N003k437p638L403R611l900j0737L894J0828l359r830K384P827j052m989
863a856m36J575J897K132l171n617M043Q593m433j0788M324J1909l698j1859K634
878d751J0607j303q285k04N128J691j455k971k412L929N995m424r012M478J1141
893H152m054j2133L232J1907k075j0487P52Q013O45m750j954J044K997K742l708
$$ plain form
786 -6737 -3180 5993 2346 -4781 -1220 3238 -118 -1566 1409 -164 -2533 1665 3270 -2904 -3538
801 -3538 3746 3310 -4213 -2592 4276 1473 -4022 -61 3515 -1405 -2771 2810 1953 -3858 -1118 4464
817 4464 327 -4532 344 4000 -963 -2972 1454 1448 -1859 323 2175 -2181 -2404 3834 2524 -5109
833 -5109 -2563 5879 2508 -5979 -2278 5407 1938 -4159 -1432 2401 802 -255 -5 -2039 -864
848 -864 4139 1702 -5936 -2533 7078 3178 -7559 -3665 7163 3804 -6026 -3642 4185 3133 -1856
863 -1856 -2292 -717 1180 3312 141 -5476 -1433 7160 2727 -8061 -3737 8172 4474 -7385 -4751
878 -4751 5856 4553 -3732 -3936 1192 2883 1428 -1543 -3955 -26 5969 1545 -7467 -2989 8152
893 8152 4098 -8035 -4803 7104 5029 -5458 -4706 3307 3952 -798 -2752 -1708 1289 4031 323
908C23o174M002Q951l946j0779L505J1429k755j0927J825R295p89o766k32L628
923E90J138k06j819l117K269N978k476q111K477R345k294r561J979Q803j599p174
939c778J189M891p68k238M05n75m7L155k79n255O01O676q88p367J227P215j545
956B619o335J885M834k178k918K423P62k496J311K408l096k099M397J544n102
971b041p96N211k03m692J295L687k437k331L457Q56m276N88M745j795m803K678
987h57M390l119l504L140K204k749n50K015j265j092L093J03m723Q01N963j527
1003B323o688J952O791k059o248J843N049j366l252O55J033J54J416r48l813J626
1019a532N865k045p389K191Q244k038q262J606P436r24n857J19L628P26r63j520
$$ plain form
908 323 -5851 -1849 7102 3156 -7623 -4118 7311 4556 -6371 -4546 4749 3960 -2806 -3038 590
923 590 1728 1522 -297 -3414 -1145 4833 2357 -5754 -3277 6068 3774 -5787 -3808 4995 3396 -3778
939 -3778 -2589 2302 1534 -704 -299 -874 -921 2234 1955 -3300 -2699 3977 3089 -4278 -3051 4164 2619
956 2619 -3716 -1831 3003 825 -2093 330 1092 -1404 -93 2315 -781 -2880 1517 3061 -2041
971 -2041 -2837 2374 2171 -2521 -1226 2461 24 -2307 1150 2006 -2270 -1682 3063 1268 -3535 -857
987 -857 3533 414 -3090 50 2254 -495 -1045 970 -295 -1387 1706 1809 -2914 -2113 3850 2323
1003 2323 -4365 -2413 4378 2319 -3929 -2086 2963 1597 -1655 -1000 33 187 1603 655 -3158 -1532
1019 -1532 4333 2288 -5101 -2910 5334 3296 -4966 -3360 4076 3152 -2705 -2586 1042 1768 805 -715
1035g15j837K099M469k453o662K489Q217k233q975J723Q830r86p788J22N991P72
1051C063l596j578P95K220K095k600m751K717O888k523q366K078Q988j434q699
1066d703O72P511J53n613r32L165J560l79j995k402K214M846k196o710J950P883
1082E024j567q208J110P653n57o391O2M497L82k196p34k65R66K583j065m558J083
1099b181N954j022o692R03O721p72o086O56M869n56l208N06J284m58O81M27k460
1116a434l45L867K40m798m4N163k34m966N96M238j008l124J427J728j809k59K089
1133A327j152k180K301K054l092j699L483J099l426l18L014o35k261J619J345
1148A479k536l45L284n86l756J344L878j861l605K068K957j983j967J638O87j103
$$ plain form
1035 -715 -2552 -453 4016 1563 -5099 -2610 5607 3374 -5601 -3878 4952 3966 -3822 -3700 2291 3063
1051 3063 -533 -2111 -1316 904 2999 399 -4352 -1635 5253 2730 -5636 -3558 5430 3996 -4703
1066 -4703 -4031 3480 3633 -1980 -2912 253 1813 1434 -561 -2963 -749 4097 1901 -4809 -2859 5024
1082 5024 3457 -4751 -3641 4012 3455 -2936 -2874 1623 2005 -191 -925 -1190 -224 2359 1294 -3264 -2181
1099 -2181 3773 2751 -3941 -3038 3683 2911 -3175 -2519 2350 1794 -1414 -908 376 -82 599 1026 -1434
1116 -1434 -1779 2088 2328 -2470 -2514 2649 2415 -2551 -1955 2283 1275 -1849 -422 1306 -503 -762 1327
1133 1327 175 -2005 296 2350 -742 -2441 1042 2141 -1285 -1603 1411 776 -1485 134 1479
1148 1479 -1057 -1402 1882 1296 -2460 -1116 2762 901 -2704 -636 2321 338 -1629 9 696 -407
1164d07P59M43k199K09L499p78m528J199N118j383n253J370M844j130l906P11
1180a432K531j81q35l59j031Q59K841j231m404J436N533j436o126J239O095q51
1196B648n484L63M277K15k614p66O22J263J436j574l389J722M997j683o070J398
1212b639O596r66o433L95N664K20m328q10K504J318m44j680j661J827L587j784
1228A366n110J546O073j120o458O40O160q9n251m19L807Q76k000j155j7J317J978
1245B144j324l677J200M948r86n654O80N778l69n328M6M362J84k944l87J299M94
1262D66M29n34k045M98L390m19m321L31M756k42m696K11M153j82l235K56K003
1279H19l37o40M56p30n46J908O12k829n88L375M68l531k39L296j07k732N23J905
$$ plain form
1164 -407 352 795 -1404 -1195 2304 1526 -3002 -1803 3315 1932 -3321 -1951 2893 1763 -2143 -1432
1180 -1432 1099 918 83 -276 -1307 -448 2393 1162 -3242 -1806 3727 2291 -3835 -2596 3499 2648
1196 2648 -2836 -2473 1804 2019 -595 -1361 -739 524 1960 386 -3003 -1281 3716 2033 -4037 -2639
1212 -2639 3957 2991 -3442 -3047 2617 2837 -1491 -2301 203 1521 1077 -603 -2264 -437 3150 1366
1228 1366 -3744 -2198 3875 2755 -3703 -3063 3097 3008 -2243 -2662 1145 2021 21 -1134 -1151 166 2144
1245 2144 820 -2857 -1657 3291 2305 -3349 -2669 3109 2740 -2588 -2542 1820 2004 -940 -1327 -28 466
1262 466 895 361 -1684 -1186 2204 1785 -2536 -2205 2551 2309 -2387 -2176 1977 1795 -1440 -1184 819
1279 819 482 -158 298 -432 -978 930 1542 -1287 -1875 1500 1968 -1563 -1802 1494 1387 -1345 -822 1083
1297A083r80r29J403p2j721R77J898j693j868K170J614k325j161K211N15j860
1313g38K65J307j075o70J864kk515N78K946j015l104J269K949j330k463J193J709
1330A168q98p19N08m10p3J567l34k609O46L435q38l914Q58M033p65l722N09L001
1348A443j93j932j66O33M95P96p64k171R30L342r61m205Q59M651o18m607K90M110
1366A932R0l180m69J872Q49l90j103j152J229K593j233l755J056M559p52m921
1382b775L80M736O7m114m88L049Q60j701j102J30J250J391j212k764J053L835
1398B595p76m464M07M674m4m358l31L636O17k528q22J185R14K40q86j618P75K766
1416A982n82l625L47M065r5m086j22L689K88k934l84J907M00o93l67n19K65J613
$$ plain form
1297 1083 103 -826 577 505 -1216 -239 1659 -34 -1902 268 1882 -443 -1604 607 1122 -738
1313 -738 -473 834 -241 -911 953 951 -1564 -986 1960 945 -2159 -890 2059 729 -1734 -541 1168
1330 1168 270 -449 59 -351 -424 1143 809 -1800 -1154 2281 1443 -2471 -1613 2420 1655 -2067 -1558 1443
1348 1443 1250 -682 -848 -215 280 1076 312 -1859 -929 2413 1452 -2753 -1894 2757 2139 -2468 -2178 1932
1366 1932 2022 -1158 -1627 245 1094 704 -399 -1551 -322 2271 1038 -2717 -1661 2898 2146 -2775
1382 -2775 -2395 2341 2408 -1706 -2194 855 1715 14 -1088 -958 292 1683 471 -2293 -1240 2595
1398 2595 1819 -2645 -2238 2436 2392 -1966 -2297 1339 1956 -572 -1394 -209 705 945 59 -1559 -784 1982
1416 1982 1400 -2225 -1878 2187 2092 -1994 -2116 1573 1861 -1073 -1457 450 850 157 -210 -729 -464 1149
1434A149j12k509l1L097J54l332k25L196K32k742j56K053j2j163J98K13m15P04
1452B99O21j473p57K026P98k313p13K334N04k097j86J657k07j081O40M18j061
1469e91K16J386p70j587J192J625j440j462J474J120j338o27J078po66O64K54
1486E21j339J77J887n13k272P49K436q46k321P89J983o37j397L88O38j18K50j73
1504B02j143L95J946n40k575N67K952n24l031L68K798j45k257j04J454L68m76
1521B55n68n93P16J639p76k480O97L115n51l422L16L406l5l016k80K300N71j363
1539f9p97K44R43Q88r63j934Q68K772o66l327L89L527m5l368k94K863N96k060
1557d33q11J048R24O2r35j137Q14K079o09k791L41L207m7l274k38L011M82k448
$$ plain form
1434 1149 1037 -1472 -1503 1594 1748 -1584 -1809 1387 1619 -1123 -1279 774 762 -401 -203 10 -405 299
1452 299 920 -553 -1310 716 1514 -799 -1512 822 1326 -771 -957 700 493 -588 52 470 -591
1469 -591 -375 1011 241 -1346 -154 1471 31 -1431 43 1163 -175 -802 276 269 -397 267 521
1486 521 -818 -641 1246 733 -1539 -790 1646 800 -1521 -732 1251 614 -783 -395 243 125 375 202
1504 202 -941 -546 1400 860 -1715 -1148 1804 1280 -1751 -1383 1415 1270 -987 -1091 363 731 255
1521 255 -313 -906 -190 1449 673 -1807 -1110 2005 1454 -1968 -1652 1754 1719 -1297 -1577 723 1294 -69
1539 -69 -866 -622 321 1209 246 -1688 -820 1952 1286 -2041 -1652 1875 1830 -1538 -1832 1031 1627 -433
1557 -433 -1244 -196 728 790 -145 -1282 -468 1611 1002 -1789 -1448 1759 1712 -1562 -1800 1211 1693 -755
1575g55o52J644P20o69p19l26O19J257m32k058K41K588jk860j84K790L49k475
1593i23m29J893M56j140l91K99K45N33p2j265j14J816K83k150m00K233M40k075
1611g61l97J715K85j184j06N92j43N1L96o36n94J099P37j394q10J520P58j485
1629c57n77J267L13r39K0N28m05j09P86l07j099O33J293q45j345R50J240q94r87
1648h34P43N98n15r7K41m33L1R56k66j410M44J722n27j865N16J801m21j542K59
1667e99J087o0m89j46j64L06Q33m15j451M59J930m30k211L25K255j50k086m8J683
1686F29K63j076m58L54N92M29o59j181O51J809n52k267L77K493j47k452j10K159
1704H54L56j628n63R18P10j05p71p20P38J459o07k033M09K386j40k513j18K346
$$ plain form
1575 -755 -1407 237 957 288 -431 -757 -138 1119 687 -1371 -1130 1458 1457 -1403 -1587 1203 1552 -923
1593 -923 -1352 541 997 -143 -534 -235 10 543 471 -794 -908 908 1191 -959 -1359 874 1314 -761
1611 -761 -1158 557 842 -342 -448 144 1 52 448 -188 -782 317 1054 -340 -1150 370 1128 -357
1629 -357 -934 333 646 -293 -273 255 -150 -259 527 220 -879 -246 1047 202 -1143 -193 1047 153 -834
1648 -834 -91 507 -8 -105 136 -297 -266 690 424 -986 -542 1180 653 -1212 -696 1105 684 -858 -599
1667 -599 488 428 -61 -207 -371 -65 768 353 -1098 -639 1291 861 -1350 -1025 1230 1080 -1006 -1054 629
1686 629 892 -184 -642 -288 304 733 74 -1107 -456 1353 801 -1466 -1089 1404 1257 -1195 -1305 854
1704 854 1210 -418 -981 -63 647 542 -229 -949 -211 1248 641 -1392 -983 1403 1263 -1250 -1368 978
1722I78L61j954n78J381O87o42p49j49P15R05n86j540L82K023j61k270p1K286
1740A018K92k063m64J652N62j048n95L58N62L39m46r86K79J505q9j866r1J993
1758I12K49j901l81J623M13j172m04O31L05l8j57n35NJ007J63j333l04J511L99
1777I93j496m26J326L96j039k77O45R7k09J07j94l37N82N11q64o38J006O86j031
1796a62o54R34N19p44l13M87L0j78K85j26n69L62Q39n67r97O62J064o55j003N74
1816b12P95l91n12K05J28LK99k18o98L57J060m35j304M34J416l68j384K63J171
1835F09q1q39r5L96K65R9l89o06M57J067m61j432L99J630k72j672R0J548R6j249
1855d40k85P91M49k58n42l10N81Q76n50j332M37J660k81j796P4J762J43j528l37
$$ plain form
1722 978 1339 -615 -1193 188 875 233 -516 -665 50 955 369 -1171 -789 1234 1073 -1197 -1268 1018
1740 1018 1310 -753 -1217 435 997 -51 -646 -288 274 613 167 -819 -540 965 876 -990 -1081 912
1758 912 1161 -740 -1121 502 915 -257 -661 -30 275 237 80 -455 -450 557 720 -613 -917 594 993
1777 993 -503 -929 397 793 -246 -523 122 219 10 117 -77 -414 168 679 -185 -823 183 869 -162
1796 -162 -816 118 637 -107 -420 67 97 -81 204 78 -491 -129 710 143 -854 -192 872 217 -786 -212
1816 -212 583 192 -320 -115 13 16 315 97 -601 -244 816 381 -923 -489 927 559 -825 -562 609
1835 609 528 -311 -406 -10 255 354 -35 -641 -184 883 422 -1010 -611 1019 747 -925 -835 713 809 -440
1855 -440 -725 66 515 257 -285 -595 -14 862 312 -1020 -583 1077 796 -1000 -926 836 979 -549 -886
1874h86J116M93n86o02J7O22N67n77j092M49J486k88j713P8J756J48j655l20J345
1893C58M73r05n63L77O03J62n35p05M34J143k66j453R6J604R5j575k85J402M04
1912H64j069m59O21M64j32m15l52L01P78j43j121j6J312J58j349k85J247L69j021
1931b48l69O64L39k79k26j22Q2M83O1p56k15R57L16j012m02R68M12q19l54N86
1951F6K56k93j10pp3K59K81m82m36O37N52p03n93O81N60n68m64L89K91j99n2k0
1973b8k08K18M45l73o51M46Q09m78q43M19P97l08o46J55M05J3j01j58k07K80N18
1994E04l55q02L89R84l51j067K57J036j20r05j2O34J79l07l12o6L87M42m26p73
2014f84L94J046l29j202K09J224l0j135j24Q98K83n59l99J55M67K68m79o60M36
$$ plain form
1874 -886 230 723 137 -465 -448 174 741 164 -928 -479 1007 719 -994 -916 840 988 -667 -987 358
1893 358 831 -74 -637 -260 343 505 -30 -735 -301 842 576 -877 -781 823 918 -657 -942 460 864
1912 864 -205 -664 -43 421 289 -126 -478 -177 601 458 -663 -679 633 791 -558 -843 404 773 -248
1931 -248 -617 47 386 107 -119 -241 -159 324 385 -371 -586 371 687 -325 -727 241 653 -166 -520 66
1951 66 322 29 -81 -88 -161 98 379 -103 -539 98 650 -53 -646 35 595 27 -437 -48 243 44 -8 -28
1973 -28 -236 -18 427 54 -597 -151 658 180 -663 -244 553 245 -401 -246 159 172 71 -87 -294 -14 504
1994 504 149 -653 -264 720 369 -698 -441 595 475 -430 -442 192 371 64 -248 -314 73 515 89 -684
2014 -684 -290 756 427 -775 -566 658 628 -507 -631 267 550 -9 -408 -253 214 482 3 -657 -221
2033b21R88l34j198J77J300k2j242j57J063L09p55m37L76M92M5n04m44M48P95
2052F79l34j078J98J227l7j244j31J128K85r03l79N75M51k06m50j86L98N50l11
2071B32q32J70J029j8j106j44J081K59r13l44O59L79l27l81jK99L34j86o17P3
2091c54Q01O0r11j82R15K69q20k97O03L05l54k59P4J79J79m4m24p5N93K06p06
2112b42k82P01L48o36l36M81L12l07k22J09Q0J13O5k90k14M27L39m95m50N14M78
2133D93m46m56L18L70j69k36J0N4J36J58k79l39L59M95l79o24L76O57k91o10J72
2154b31N10m2l24j06J05K22J45l14l69L51N77l62p22L14P89k22p62Q3O56O2m92
2175a32j74K35K86M2l60l16L90N47l46p49K84Q46j58q86K7Q05J14o18k46L77L44
$$ plain form
2033 -221 767 433 -765 -588 712 690 -552 -709 354 663 -92 -529 -153 339 384 -120 -564 -116 679
2052 679 345 -733 -535 692 655 -589 -720 408 693 -210 -589 -14 437 231 -219 -405 -7 543 232
2071 232 -600 -430 599 581 -525 -669 412 671 -242 -586 73 452 125 -256 -257 42 376 190 -427 -354
2091 -354 447 507 -404 -586 329 598 -222 -519 84 389 35 -224 -150 29 208 164 -260 -335 258 464 -242
2112 -242 -524 177 525 -111 -447 34 346 39 -183 -74 6 119 184 -106 -320 107 446 -49 -499 15 493
2133 493 47 -409 -91 279 110 -126 -116 -62 74 232 -47 -386 -27 468 89 -535 -159 498 207 -403 -231
2154 -231 279 237 -87 -193 -88 134 279 -35 -404 -53 524 162 -560 -246 543 321 -441 -358 298 360 -132
2175 -132 -306 -71 215 257 -103 -419 -29 518 172 -577 -293 553 395 -491 -464 341 455 -163 -409 -32 312
2196C12r7l93j93L97M81l68p02K69Q64j58r05K2Q53J20p28k42N13L32k35l86n5
2217b99L89L42l62n73K68P61j53q52K1Q54R4p75k17N97L06l53l52R1L37J86k93
2238A7m26K32O06j04p49lP66J23o97k13N73K68l78k85J54K70P7k03l17J20M92
2259C23l6n92p7O32J67o14k24N13K51l56k42J62K04K7j25j99K4L68O7m63j58N05
2281A57K39m85k82M16K78k79k62J43J75K5p0j76n8K96J75l70k81L93L42l59l68
2302c51K67L75j77l07N2J90Q3n6j95j03K86K38l22l53L19M41k73m81K06M61r4
2323B06l99oK54J36q6k46q2K95K54l15m21L19N20k58n58J66N49m7m85p3L52J81
2345B56j72k66k9L16K13l20l98K86N41k23o29J33O39k8n56j17M45K05k51k82P0
$$ plain form
2196 312 215 -178 -371 26 507 139 -563 -294 570 412 -493 -471 382 502 -226 -468 45 377 142 -244 -299
2217 -299 90 432 70 -503 -235 526 373 -479 -458 396 490 -285 -502 95 401 48 -304 -213 124 310 17
2238 17 -409 -177 429 325 -424 -427 339 462 -235 -448 125 393 15 -270 -116 154 231 28 -289 -169 323
2259 323 287 -305 -382 250 417 -197 -421 92 343 -13 -255 -93 111 138 13 -186 -162 206 273 -190 -348 157
2281 157 396 -89 -371 45 323 44 -218 -75 100 125 55 -121 -179 117 292 -78 -359 34 376 17 -351
2302 -351 -84 291 114 -193 -141 49 132 76 -119 -222 64 302 -20 -373 -54 387 114 -367 -161 300 206
2323 206 -193 -199 55 191 105 -141 -223 72 326 11 -410 -91 429 171 -387 -221 328 281 -204 -277 75 256
2345 256 84 -182 -211 105 318 -2 -400 -114 427 204 -425 -292 347 319 -237 -354 91 296 45 -237 -167
2366a67L08J52l15l48K94M95k22n98J28O44l9n93q4N00J82l51k59J63K91O6l14
2387f7k55K75M18k05n54J25N95j6n84q5N06J89l81k40J99K76k3k58j72K20L38
2408C01j44m60O8N27J5n25r7M73J66l68k19K30K22n7k05j10J57K52q2l74J1M36
2430B17O6m58j38M07K00l42j95K05J90n7j55q6J00K16l4l05o1L76J21l78j86L37
2452D0K30k42k50J50K08k7j37j04N9K03M0k77j29L05K33l21k79K68L08j90k95
2473b07R0K44Oj56j29N4K21M7k57j71K77K76k80l32K23L65j31l76N5L10M6k03
2495b8j40Q0K25N1k66j83K77L01k64l86K20M06j20m18K6L55Q2k56j70J14K51O
2517A63k71j66K84K91k43l99J90M45j06m56J7M06Q6l18j70J96K40m3k71j13K77
$$ plain form
2366 -167 141 293 -22 -370 -76 419 197 -401 -273 371 332 -261 -345 155 337 -14 -273 -110 181 247 -67
2387 -67 -322 -47 371 166 -388 -263 332 316 -268 -353 153 342 -39 -279 -80 196 173 -85 -257 -37 301
2408 301 157 -303 -235 292 307 -218 -315 158 324 -44 -263 -33 189 132 -73 -183 -26 226 144 -230 -219 217
2430 217 283 -175 -313 94 294 -48 -243 -38 152 95 -60 -146 -46 170 136 -169 -230 146 267 -111 -297 40
2452 40 270 28 -222 -72 136 109 -28 -132 -73 130 170 -107 -236 69 302 -19 -298 -30 278 88 -207
2473 -207 -117 127 133 -23 -152 -98 123 170 -87 -258 19 295 15 -317 -94 271 140 -236 -181 129 175 -28
2495 -28 -168 -88 137 188 -78 -261 16 317 53 -333 -113 293 173 -245 -219 136 218 -38 -208 -94 157 163
2517 163 -108 -274 10 301 58 -341 -151 294 188 -268 -251 155 241 -77 -247 -51 189 146 -125 -238 39
2538C9K54k48l56J74M41j11m54J8M29N7l38j61K29K09q2k34p0K47K06k19l21J60
2560a31L95p6m42J4M03Q9l57j37K40J88j04k12l6J92J79j74k76J14L58m3l93k2
2582b31L86R7l40j33K41J78j22k02OJ74J17j41k13O4K92ll24p3L32J26k98j57
2604b24K09J75r4j77pJ35J10q2j94J2K67O0k98j23K88J66k27j95J57K07p2j80
2626h7k8J23J30n5j92k7K39J08k62j86K52K21k01k49J32K33l8k04n8J49J23n4
2648F9k02l8K49J18k43k10K28K71j72k85R5K84jk53o4J66J43o3k03m7K37J50k52
2671b3k28K12K85j60l26Q8L28mk83q2K11J53j06k07JK28J25k50k11K05K97j64
2693H9l27P9L49j5k99p7K39J36j35j88K1K25Q2k06j96J81K86j37l37P5L43pl03
$$ plain form
2538 39 293 45 -311 -137 304 193 -261 -243 186 243 -95 -256 -27 182 100 -134 -204 43 249 30 -291 -131
2560 -131 264 188 -254 -240 163 252 -105 -242 -2 186 82 -130 -166 26 205 31 -245 -131 227 184 -209 -231
2582 -231 155 252 -88 -221 20 198 76 -126 -120 54 171 30 -183 -119 173 170 -154 -227 105 231 -67 -224
2604 -224 -15 160 66 -111 -118 17 127 45 -149 -137 130 190 -108 -231 57 223 -4 -199 -42 165 93 -87
2626 -87 -115 8 138 83 -109 -136 103 211 -51 -237 15 236 35 -214 -82 151 113 -91 -149 0 123 69
2648 69 -133 -171 78 196 -47 -257 -29 242 70 -215 -120 164 163 -90 -154 12 155 92 -111 -158 79 229 -23
2671 -23 -251 -39 246 86 -240 -152 176 172 -111 -193 18 171 65 -142 -141 87 212 -38 -249 -44 253 89
2693 89 -238 -159 190 175 -124 -201 38 174 39 -149 -128 97 179 -27 -223 -42 244 107 -230 -155 188 181 -122
2716a22p5K42J37j45j89N0J95P4k02j71J66K53j15l13O0L07L0l07p8K47J38j69
2738A3j68O4J75M2j61j41J35K28q7k78L3K90L6k82q1K33J27j45j62N6J65L0j46
2761b4j17J06J80m7k53pK66O8k47j12J96J52j36j51L6J43N1j13j17O9J86j0k35
2784a16n2K43J08k24j33J63J74j07j74L8J50M2j17j15N3J86Pk17p9K26J27k02
2806a9j88J67J94q0k07J8J79N4j25j36N9J73L1j98j01K02J58j85j96J30K42p7
2828I5k25kJ96P3j33j41O5J83K6k17j00K10J62j73k24J31K51o7k53KK14P3j53
2851gj42Q5J79mj94r5K00J68j74k20J24K51o8k49rK36O5j68j32J00J70nj81q2
2875a52J79J52j43k14J03K43m2k49k1K18P6j66j21Q4J67k7j67o8J51J33j17j93
$$ plain form
2716 -122 -197 45 182 37 -152 -102 93 167 -35 -206 -40 213 98 -215 -155 152 182 -125 -203 44 182 13
2738 13 -155 -91 84 126 -35 -176 -41 187 100 -178 -145 145 181 -101 -182 51 178 33 -129 -73 92 122 -24
2761 -24 -141 -35 145 98 -155 -162 104 172 -75 -187 9 161 25 -126 -90 53 104 -9 -126 -57 129 119 -116
2784 -116 -168 75 183 -41 -174 -11 163 56 -118 -80 70 112 -5 -120 -67 119 126 -91 -170 56 183 -19
2806 -19 -207 -40 154 74 -133 -115 64 118 -7 -143 -84 89 120 -78 -179 23 181 -4 -200 -70 172 95
2828 95 -130 -132 64 137 4 -137 -72 111 137 -80 -180 30 192 19 -205 -74 177 110 -143 -141 73 146 -7
2851 -7 -149 -64 115 111 -83 -178 22 190 16 -204 -80 171 103 -146 -155 81 146 -22 -154 -54 116 111 -70 -152
2875 -152 27 179 36 -178 -75 168 126 -123 -144 74 150 -16 -137 -53 114 87 -80 -148 3 136 19 -174
2897a74Q3K40m2k34k9K10Q5j65j14J02J36j2j51o2J39J11q2j79O1K00rj96n9K06
2921F5Q6j56j20Q9J46j4j57m4J12J22p5j72K9J77L1k05p2J78J11j30j30P1J40
2944H2jj30o6J13J21o5j62KJ94M9j89r1J58J31j16j54O9J45Jj24q1J07J11l6j66
2969i8jJ76P1j82j04J32J50r5j80N0J57J9j39p7Q8J41n7j43k0J73P6j64j20J33
2993a4J76j05j91N8J63K5j37q2R9J26m5j55k0J74O6j63j21J14J82q8j87K9J82
3016H6J4j45p7R8J40o7j35l2J70P5j44j32J11J80q0k07M7J84K2j53q1J24J14m8
3040F4j45j2J51P6j31j42J19J62p5j70KJ92J9j52p9J14J02m2j49MJ38N9j13j24
3064a32R4J48l7j86KJ64M2j41p1J05J06m2j26j0J16N1r5j01P1J37k2j56j8J67
$$ plain form
2897 -174 -91 149 107 -127 -156 54 139 -26 -140 -38 98 86 -65 -127 12 123 41 -138 -77 123 114 -82 -141 65
2921 65 151 -5 -125 -36 110 96 -61 -105 7 129 54 -118 -89 88 119 -86 -158 20 131 1 -129 -58 82
2944 82 81 -49 -115 -2 119 54 -108 -106 88 137 -52 -143 15 146 30 -124 -55 90 91 -33 -114 -7 104 68 -98
2969 -98 -99 77 148 -34 -138 -6 144 49 -131 -81 76 95 -44 -121 -33 108 51 -92 -112 61 137 -27 -147 -14
2993 -14 162 57 -134 -76 87 112 -25 -107 -8 118 73 -82 -102 72 138 -25 -146 -32 150 62 -125 -96 86
3016 86 100 -45 -122 -24 116 49 -86 -118 52 127 -17 -149 -38 142 62 -145 -98 86 108 -45 -126 -2 112 64
3040 64 -81 -93 58 134 3 -139 -20 142 67 -103 -101 91 110 -42 -121 -7 95 53 -96 -92 46 105 -8 -132
3064 -132 -38 110 73 -113 -111 53 95 -46 -117 -12 94 52 -74 -84 32 83 -12 -113 -42 95 73 -83 -101 66
3088F6N4j43q9R7J17m6j23oJ16O0r7j13N0J44j1j54l0J46O3j17j11Q8J18l1j29
3113h1j4J10P6p4j17L7J47Pj58l2J37P4j03j09N9J38l6j17k4J08P7q7j01L1J33
3138H1J1j46o4J34J04j18j18P1J21nj49j6J06P2o6j19L3J41J3j44n4J22J08r9
3162A9j27N8J50k5j30l4J19P7q4j07L2J19L0j38o9J26J01r1j43M8J50qj34m0J17
3187A6Q1p7j10K3J22J6j14p2J12J07q6j27M2J50nj31m5J01Q8p4j01L2J13K9j13
3212b3p4J06R8p3j34M6J39j8j16l7J03P4o5j06L3J02K1j25n1R1Q7n6j15L5J33
3237G5jj25m1R6P6o7r0K2J03L4j06p0R1J02n5j18%J32K5j16n9Q6J02o4q4MJ06
3264E8K2r8o1O1J06m2j21j5J29L2j12o3Q6R2n2r5J7Q9L7q6o0N3R8k4j14QJ02N0
$$ plain form
3088 66 120 -23 -112 -15 102 56 -67 -73 43 103 6 -107 -57 87 76 -78 -108 38 101 -16 -127 -39 79 48 -81
3113 -81 -95 15 91 17 -100 -63 84 91 -67 -99 38 112 9 -100 -41 97 61 -56 -80 28 105 18 -83 -52 81
3138 81 92 -54 -118 16 120 2 -116 -45 76 71 -78 -94 12 84 18 -101 -68 73 86 -58 -112 10 118 19
3162 19 -108 -50 100 75 -55 -89 30 107 23 -84 -52 67 97 -41 -110 16 117 26 -117 -69 81 73 -61 -101 16
3187 16 97 20 -90 -67 55 71 -43 -115 -3 104 18 -109 -67 83 78 -53 -98 3 91 17 -84 -52 61 90 -23
3212 -23 -97 9 107 34 -100 -54 85 67 -49 -86 17 91 26 -80 -47 55 76 -49 -100 -9 78 22 -93 -58 75
3237 75 74 -51 -92 4 80 13 -77 -55 48 82 -24 -94 -3 99 44 -74 -74 58 83 -33 -92 -6 96 32 -52 -48 58
3264 58 80 -18 -79 -18 88 46 -75 -90 39 71 -41 -104 -18 74 22 -73 -56 33 70 -16 -76 -23 75 51 -63 -55 47 97
3292I7j07p4P1J04n0r6KR7L5q7o0M8Q9j5j20j1J16O0j12p4P0R1l6j15QR5M1r0
3320b3o9N5J11k4j11k3J17N5j07p7P8J13m8j06oJ11L0q3o5O1Q4j7j03k3J08N4
3346I2r8p5M8J19m2j21LJ10M0q5p2N0R0j9r4j7R2N3q2q8N5J05l4r3mJ03K9p9n6
3375g0N0Q0nr4k2R1N2p4p9M9J09l4j01pQ6M3q0o5L6Q2j1q4k4P5O2o9p5M2R3nr7
3406d6k2Q3M6n7p7L8Q2%p9l7Q6O1n9q4K4R6Mj00j6Q3N7p0p2L3P1Nq7l0P0O4o0
3437Gp5L0Q3J0r7l9Q4N8n8p8M1O6J2o9l7O4P0n3q2K0R0J8r7l1P7O0n8p7K5P8J5
3468E7p8m0O5O5m8q4K1Q9J9r7l7O7O5n2p6K6Q3Kq5l7P2O3n7p4K2P5L0r2l6P2O3
3499F3n8o8L3P4J2q3k3N1P1m4q0RQ6K5q4n1O7O1m7q6L2Q0%p3j5L0O1k9p8J5P3
$$ plain form
3292 97 -10 -84 -13 91 41 -55 -53 44 79 -8 -68 -20 69 54 -66 -77 39 99 -13 -87 -17 74 38 -77 -69 26 67 -23
3320 -23 -92 -37 74 50 -61 -84 33 88 -19 -96 -18 95 47 -59 -65 46 76 -7 -72 -11 73 56 -47 -70 38 92
3346 92 -6 -81 -33 86 44 -77 -74 36 76 -9 -81 -31 59 40 -54 -71 21 74 -8 -96 -41 64 30 -63 -67 36 65 -14 -70
3375 -70 -20 60 55 -39 -61 30 82 8 -71 -22 87 53 -48 -55 31 74 -6 -71 -35 47 36 -48 -72 3 65 -4 -79 -37 56 51 -46
3406 -46 -68 15 61 4 -73 -35 47 47 -32 -69 17 78 19 -65 -41 55 59 -41 -57 26 83 13 -59 -26 45 50 -37 -67 3 67 7
3437 7 -68 -38 45 55 -42 -81 3 61 3 -75 -34 32 44 -25 -62 2 72 19 -63 -43 47 65 -32 -63 14 74 16 -61 -36 42 57
3468 57 -21 -61 4 69 21 -63 -42 47 66 -31 -68 -1 64 12 -64 -38 45 47 -38 -75 -3 60 3 -71 -49 26 56 -36 -72 0 63
3499 63 5 -63 -30 44 56 -27 -50 1 72 28 -52 -43 43 68 -16 -67 0 61 14 -72 -40 40 40 -33 -48 -18 43 14 -64 -49 24
3530B4K4q0l9N8Q0o0o4J5Q7Ko9k7N1N9l6o5OO2K2n4m8N4N8k8q1K3O2J7o9m6M7
3561a5N0k0o9JP3L0p3n0O4O5m4o0PO5J3n3m0N4M6j9p2NP2K1o0n5O7N5l8p3PP2
3593B6K7o3l4M5N2l0n9mN4M0o9n3M5O9j8o6k0P8K8p4l3L8N5qp4j0O3M6o2m8M0
3624a9P4j5q2%O4L9n9m9L8N9k7n4j4P4J1m5m0K2P4k4p6lP8K6o2n5M0O2j8o7mN4
3656BM5o2m1L0O5j1p9mP0L6n9l5K5P2j8o8rP0K3m5n7L1P1k5o3j4N8M4n6m7L3N2
3688C4qo4oN2J6j5n6K4O2k8n0j4N3M5n2n9M8M4qm2j7M6M5m5m6L1N8j9n2j2M7L8
3720E0l2n9K8N5on9j9M9L8m1n0J6N4kn1k5N5L8m2m1J8N4nm5k7N6K5l3m1K8M3P
3752C6o0j8M3L8k6m5LP3k0m5j9M3L0j6n7J8M8Nn0m2O5L5m5m9J9O3pm7j7M6K5l3
$$ plain form
3530 24 48 -32 -71 -13 67 7 -57 -42 45 47 -22 -49 2 61 25 -40 -34 28 50 -4 -52 2 60 32 -49 -26 36 53 -16 -62 -15
3561 -15 35 15 -54 -53 20 50 -23 -73 -9 56 12 -48 -41 24 37 -16 -56 -2 44 25 -47 -42 30 51 -9 -64 3 58 20 -53 -46 26
3593 26 53 -10 -44 1 53 23 -36 -40 14 54 -15 -68 -23 46 28 -38 -58 20 48 -26 -59 -21 34 26 -48 -58 5 51 -11 -59 -19
3624 -19 55 40 -42 -42 22 61 2 -47 -9 50 23 -31 -45 29 40 -5 -45 -23 51 27 -49 -52 26 52 -10 -65 -25 37 19 -48 -52 2
3656 2 47 -15 -56 -26 39 28 -51 -55 15 51 -8 -43 -18 54 36 -32 -41 29 52 7 -50 -19 52 27 -36 -50 8 52 -4 -51 -18 34
3688 34 26 -38 -44 8 24 9 -47 -23 39 11 -39 -53 0 45 -7 -66 -18 26 18 -24 -41 5 50 5 -41 -10 48 29 -23 -35 12 50
3720 50 18 -41 -13 42 36 -23 -42 7 45 4 -46 -30 24 22 -29 -54 1 39 -3 -44 -26 28 23 -22 -49 7 32 -1 -42 -14 29 36
3752 36 -24 -42 1 39 13 -32 -29 44 24 -21 -40 3 33 17 -40 -22 26 31 -19 -61 4 39 -6 -55 -36 27 20 -27 -44 2 27 -6
3784fl3KN9J3n8k0M6M9m1m4J2N8Jm3l5M6L6k5m2J5M5Nn2k9L8M2l3m7J3N3J2p9
3816d2lL8M2k2n7RN3J0m4k5K9M7l2m5J2M8J5n1k1M8K7j9m2RN3Nm9j8K7M0k5n2
3848c5J7L9J4m9k9M6L2l5l5KM9Pm7j5L9K5k1m6J2M0J2l9k3L3L7j6m2lM9J7l1m4
3880d0L8M5k4l8kN1J3m6l7L8N3k7m2qM8J1m7m1L5M8k2m4nM5L4n5l3L4N4j8n3%
3912c5L6L4l7m2M0M0j4m6pL7L4n1l0K5N2j9l3j1N0J9l9l5K3K9Ll7k4N6K4l1n6
3943d5K5N6j7m9j0L8L3m8k9K7N0nn6j0N8K4l8l4K1M4j9l0rN2Pm0k7K1M3pm2rM4
3976A9K3l7l7K1M2j5n0rN0K4m5k2L0L2j1m6oL9K4l6l1K1M2Kl7j9M4K9m0l2K4L8
4008C1%l9nL2J7k3m7K8M3j7n1MM4Ok8l0J2M1ok8j8L1L1k5m7K5L4Om9j2M5J5j7
$$ plain form
3784 -6 -39 -37 22 35 -23 -43 3 52 11 -33 -21 37 38 -5 -40 6 42 17 -25 -10 35 40 -12 -41 -3 39 6 -41 -28 25 37 -42
3816 -42 -45 -7 35 13 -44 -35 18 28 -16 -41 -12 35 3 -42 -30 18 33 -18 -39 9 36 17 -25 -16 37 42 -7 -25 2 42 17 -35
3848 -35 -18 21 35 -14 -43 3 35 0 -35 -33 16 23 -24 -39 0 25 4 -42 -30 10 22 -17 -40 -7 30 14 -28 -31 18 35 4 -40
3880 -40 -2 43 19 -19 -21 30 43 -3 -40 -2 51 24 -18 -26 22 33 -14 -55 -20 28 6 -38 -43 2 36 -19 -52 -18 36 18 -35 -35
3912 -35 1 35 -2 -44 -4 36 22 -24 -31 6 40 -11 -41 -16 36 17 -16 -27 23 42 3 -32 -9 20 23 -14 -38 18 42 11 -45
3943 -45 -20 36 19 -30 -40 -2 31 -17 -46 -19 31 26 -30 -40 18 42 4 -30 -9 35 16 -14 -23 29 36 -4 -31 -10 33 26 -16 -25 19
3976 19 42 5 -32 -11 31 16 -34 -43 7 31 -14 -36 -6 26 15 -31 -37 2 26 -10 -41 -20 22 24 -13 -32 12 41 1 -31 -7 31
4008 31 31 -8 -13 19 36 13 -34 -6 37 20 -31 -27 17 23 -5 -35 -23 18 12 -16 -34 -3 28 3 -44 -19 15 21 -28 -40 5 20 3
4041Cl7K2L7nl5j4L6K7l0l6J9M9jl7j3J9L2l0k5PL5nl7mL8J3l4k8J6M7j7m4mL7
4075AL5m1l9K7M0kl9j6M9K1k4k7ML3Rm3j4L8K8k7l8RM3Ll2k5K9L6k6l6JL3J8l2
4109dk2J9L8l0l0MK8J4k9k0K8L2k4l5NM8Jl3k4M5K6j8m2PL9Qk8k6L0K9k0l6MM3
4143B7Ml8j5J4M7l3l8MM6Kl5j4K1K7j9k7LJ9K1k9k9L1L1j4l7NM5J2m0kK1K2nm7
4177b0RL2K2l5k8J3K7ml6jL4Kl0j4K5L0k7k9jL6J4k5k6L2J3qk9LK2K8l6k4K9K8
4211B6j7l0MK1J8l3k1K6M1k1l2JM0J6m0l0K9K3ql7OJ8K2k6k6K6K3lm4qL3K4l4
4244a3k6L3K2j3j9j0L9J3k3k0J8K8j6l9QL3J1l0j9K1L6j0l1j0M1Jl0j8K4J8Ml6
4276a3kK8J2l4k3J8K5j5l3J0K4K3l4j9K3K1jl9NL7K1l4k4J4L5pk9nL5J6l2k3J0
$$ plain form
4041 3 -34 -12 25 20 -15 -29 7 34 4 -32 -13 36 35 -2 -15 4 36 6 -19 -12 23 18 -19 -23 15 28 -6 -34 -18 29 12 -32 -36 1
4075 1 36 -5 -44 -17 23 21 -18 -34 15 36 12 -15 -11 22 31 -12 -26 12 40 13 -25 -16 27 30 -2 -27 2 38 12 -24 -23 10 28 -4
4109 -4 -26 -7 31 1 -29 -25 3 17 -12 -32 -4 28 4 -31 -26 22 23 -10 -34 11 37 19 -23 -16 23 31 3 -23 7 36 16 -20 -16 27
4143 27 31 -7 -22 -8 39 6 -32 -28 18 20 -15 -29 -8 19 0 -27 -24 -5 16 -13 -42 -11 20 6 -31 -26 19 31 -9 -11 10 32 27 -20
4177 -20 -11 21 43 8 -20 -7 20 16 -20 -21 13 15 -15 -29 -4 26 -1 -30 -31 5 19 -6 -32 0 13 5 -24 -21 1 29 -7 -31 -2 26
4211 26 9 -21 -17 4 22 -11 -32 -6 35 14 -18 -17 23 39 -1 -31 -2 21 13 -24 -18 0 22 -4 -30 -4 19 16 -28 -36 -3 21 -13
4244 -13 -39 -6 16 3 -16 -26 13 26 3 -17 1 29 13 -26 -18 15 26 -4 -23 -2 34 24 -7 -17 24 25 -5 -23 1 19 23 -13
4276 -13 -15 13 25 -9 -32 -14 11 -4 -37 -27 -3 20 -14 -33 -10 11 10 -29 -24 13 34 0 -24 -10 25 18 -11 -16 19 35 3 -20 -10
4309a0M2j6k1k1K3K2k1k4J7K6kk7j8L6Pql5QM0jl3rK2K3j6l0K1J0Nk7lK3L2l0
4343Ej6JL3Mk4j5L2%j8k9J6L1j0k1j3K9J3j6k2J4K3Jl4j1K8K2k2k5QK8Ll4rL4
4377FJ1k1k4OL9Nk4j9J7K8j1l5J5K6Kk7j2J9K6j4l3NL6ok6j3K1J8j2k5oM2pk1
4411a4j5K3K3j1l7J5L7lk5oK5J6j9k6NL4rj2k1K5K7j4k7KL9ml4oJ3L3k2l2QJ6
4445DJ3k8j1J9K9k3l3JL8Rk9j6L3J7j7j7JL1Lk5j9K0J5lk1J1J1J6k7j9J6K6pl1
4479a3jL5%k9l%L1ok1pJ7J7k7j2J5K3j8j2j1K7J3l3mJ6K1j0k5lK6K2l5j2J9K4
4513B4j1j7j0K2J3k5rJ4K4j5l1jL1Qk7j9K0J5mj9nK4J1k0k3J7K6pk9QK0J9k4l4
4547c4L2J4Kk0JK1Rk2j6K2RLk9kK4J1k0l5L0J7pk8nK6Kj4j9J7K3rl0OK3J7l1j2
$$ plain form
4309 -10 32 16 -5 -26 -3 19 -2 -26 -9 17 15 -12 -30 6 13 5 -30 -22 18 17 -16 -25 -3 20 4 -26 -5 5 10 -17 -20 3 35 5
4343 5 -11 -10 23 27 3 -12 20 20 2 -27 -11 20 10 -11 -24 5 18 2 -20 -6 17 18 -16 -27 1 23 1 -24 -16 12 15 -19 -28 6
4377 6 17 -4 -28 -22 17 22 -2 -21 -4 24 13 -22 -7 19 21 -6 -18 1 27 13 -20 -15 21 15 -11 -24 -3 15 3 -22 -28 14 7 -14
4411 -14 -29 -6 17 6 -31 -16 21 18 -7 -13 12 28 9 -17 -12 22 13 1 -20 5 32 18 -9 -7 32 28 -6 -12 1 34 12 -20 -12 4
4445 4 17 -11 -22 -3 26 3 -30 -29 9 18 -11 -27 6 23 6 -11 -10 21 24 -1 -20 0 15 12 -9 2 13 29 2 -17 -1 25 18 -13
4479 -13 -14 21 21 -8 -11 -11 20 14 -7 -14 3 20 -7 -19 -4 19 1 -11 -22 5 18 -15 -19 -3 18 8 -17 -20 6 28 -7 -19 0 24
4513 24 13 -4 -14 8 21 -4 -13 1 25 10 -21 -22 9 17 -10 -29 -9 6 2 -17 -22 2 13 -7 -30 -13 13 6 -23 -15 5 24 0 -34
4547 -34 -2 12 14 -6 -5 16 25 3 -13 9 18 21 -8 -10 14 25 5 -30 0 17 10 -18 -23 3 5 -9 -28 -11 12 3 -27 -21 2 19 -12 -24
4583b4RK1Jk6lL5pj9jQK4%k0j5L6Lk0j9OL5k4j4nK7J5j6j4J0J8j5k1nJ6J2j7k5
4619c4J5K3nj8j0K2K3k4j3J9J6Ml9PJ2K5j8k7K2K2Ml0j2J6Qlk6K1J0J4k2k5K4
4652AJ8k6k1J3L8j2l8MK4Qj0j9J2J3nj2j6K7J4j1j6RJ3Oj7j0J7J4qk2J4J1Kj7
4686bj6J7K7l3nnK7mk1kJ6Pj4j2QRJj5oK1Rj0k2J6J7Lj4lLK3j3k1OJ4J0k5mJ6
4724CJ7j3k0J0J1J2k0k1J1K7k3k1J2J6Pj3k8J5K2j0k7RK8ok0j5J5L0Pl9J7J9J
4757A3j8rJ3L0j7j7%K3ok7JJ1J9qk0JK6pj5pLJ8mk8PK5J5m2oJ7K1j0k8kL0Qk7
4794a7lJ4J4nj8J3J8J4k5j0NJ3oj4KJ7mj2j0J2J6%k4j2J7J1k6mK1J1jk2LJ5Lk2
4830a6kJ6J2nk1qK6Lj0rJ1J0pj4pK7Rj9nJ2J0kk2%K1jj0j4K2Rj4k5QJ7J1k3j3
$$ plain form
4583 -24 -15 6 7 -19 -22 13 6 -13 -14 -6 18 18 -2 -17 19 22 2 -17 -11 24 0 -14 -19 8 23 7 -7 3 21 6 -15 -20 -4 8 -9 -34
4619 -34 -19 4 -1 -19 -29 -7 16 -8 -21 -2 14 18 -21 -14 -2 23 5 -22 0 22 26 -4 -16 0 8 5 -21 0 10 24 2 -23 1
4652 1 19 -7 -28 -15 23 11 -27 -23 1 9 -1 -20 -8 5 0 -12 -28 -1 13 2 -14 -5 8 14 -3 -13 4 18 10 -12 2 13 15 -2
4686 -2 -18 -1 26 -7 -12 -17 10 6 -15 -17 -1 6 -8 -20 -12 -3 -2 -17 -23 -2 7 -3 -25 -9 8 11 -3 -6 -3 20 7 -14 -8 6 16 -9 -13 3
4724 3 20 7 -13 -3 8 20 0 -21 -10 17 -6 -27 -15 1 8 -5 -33 -18 4 -6 -33 -24 4 -2 -22 -37 -22 8 15 -24 -7 12 13
4757 13 -5 -14 -1 29 12 -5 -5 18 12 -15 -14 -3 16 8 -12 -11 15 8 -7 -14 -11 7 3 -25 -18 7 22 -20 -26 -9 12 2 -26 -28 2 10 -17
4794 -17 -20 -6 8 3 -15 -2 16 30 5 -5 0 13 7 -7 -5 12 8 -4 -14 -2 14 14 -10 -22 -5 6 -20 -24 -3 8 7 -15 -12 3 6 -16
4830 -16 -18 -2 10 5 -16 -24 2 5 -5 -14 -3 7 0 -14 -21 6 15 -4 -9 3 13 11 -11 -11 10 9 -1 -15 7 16 2 -23 -15 2 13 -10 -23
4867b3NK4lj6kJ5J7k6nJ3J2oj5j6K6J2j2j0jK1jj3j2L2Prk4QK8j0j8%K0Ok6rJ
4904a0J5j4lkMPj3j2J0K0Pl6LK7J3k1rJ8J1mj0j8K5J2j5j8%K5j1rrK9Pj9njJ5
4941In%k8K9Kj1k0J1J8Oj9j7J6K3j4k3J1J4Kj7qJ3J9j6j1K0J1jj8j2K1J8j5j1
4975cNJ6rj8JPJ5j6j4J1OPk4nJ9Pj4j0J1J7rk2J5mK4j4j4PMLkj6J9J2j2k2K6J3
5013A7qqj4J4MjjjOJ3j6j9J4J2j1k0jK1%j2qNJ4j1pJ1MM%j5RJ6Jk6pK5Lj9PpK2
5054A0J2k5rJ5J0j8pJ5kOj2j0L1oj9oRJ3Kk1kQJ0j3j4LJ6Mj1j6K5Nj1rJ5LOpp
5093gJ7plj5J7K0j0k8MK9Lk7kJ1K1j8j7JJ3J3j2k0J0J8rj4lJ5Pj9j2J4J9k0j5
5128b6J9J0Nj1j4RJ8jk0kJ7J0j0k3K1J8j7rJ7Qjj2j5JK2j8%kNJ1j9l%J8j8j0P
$$ plain form
4867 -23 -18 6 3 -13 -15 0 17 -9 -14 -1 11 5 -10 -26 0 12 0 -10 -11 10 9 -4 -16 16 23 14 -10 -2 26 16 -2 -2 18 24 -2 -11 -10
4904 -10 5 -9 -12 -14 -10 -3 -16 -28 -18 2 9 -27 -24 3 16 -5 -14 4 15 11 1 -17 8 20 5 -13 -13 12 1 -8 -17 12 19 0 -5 -6 9
4941 9 4 4 -24 5 7 -4 -24 -13 5 11 -8 -25 -9 14 0 -23 -12 2 4 -13 -21 -8 11 -5 -16 4 15 14 -4 -16 5 23 8 -3
4975 -3 2 18 9 -9 -8 -1 14 -2 -16 -5 1 8 -16 -21 -2 5 -9 -19 -8 9 0 -22 -7 -11 13 -1 -15 -8 -4 -1 -3 -19 0 12 0 -22 4 17
5013 17 9 1 -13 1 5 4 3 2 8 21 5 -14 0 12 1 -19 -20 1 1 -11 -19 -14 0 -11 -18 -7 -3 1 1 -14 -5 11 12 -14 -21 4 7 -12 -5 -12 10
5054 10 22 -3 -12 3 13 -5 -12 3 1 7 -5 -15 16 10 -9 -15 -6 7 9 -12 -14 -6 4 -9 -23 -20 -4 0 -11 -27 -2 3 -8 -17 -2 1 7 0 -7
5093 -7 10 3 0 -15 2 22 12 -16 -12 17 20 -7 -9 2 23 5 -12 -11 2 15 3 -17 -7 11 2 -12 -15 0 7 -12 -24 -10 9 -11 -26
5128 -26 -7 3 8 -3 -17 -8 10 9 -11 -13 4 14 4 -19 2 20 3 -6 11 19 18 6 -9 -8 14 -4 -4 -6 -1 10 -9 -12 -12 6 -12 -22 -15
5165a5J1%LpRPpqnPJ9rj4NK3jk2LJ7j2PokJ2j0qlJ5Qk0rK0rPj2rK2mj2kOJ3Lj2
5209aoJ2Nkj6jK7kj8kLK0qk4QJ1Ooj7J6J1mj8PJ4J0k3j7K6j0Rk2MJ2Lj0ojJ5%
5249Ek2JROroJ4J4Pl4J5LJ2rjjJ3Jj7lK0lj5pK0kqk1J3J5mrkLJ0j2k0NK2kqj6
5291b3J6J5j4j5MJ2N%j2K2Pj2mpK1Nk4NrK4qj7jK4j2Lj1kQloOmPj0lJ1Oj6pQR
5333bLnk3K5Rmj1NpJ7j3jJ7Pj1j8OQRj8LjQNoj1RJ5j4j1J2nLk0RlJ3j2jMLQj2
5376a1j2K1KjoKPjj7KJ7Jnj3QLRooQRrpNROj2k%Mpj2%PLj2m%PJ0j9%K9j0j3qJ9
5423eNoj1J5J2p%oJ1Pj1p%PJ8k8j1J9J2j2j4LJ4Nj1pjJ2mk3RJ6Nk2rJ4J4oj3K
5463a4J8kj6lK2kj0oNJ7mj0jJ5oKmJ0Klj1OpJ4k7KOONj5JkPnlRKNj5PPnJqLQn
$$ plain form
5165 -15 -4 -4 -1 -8 1 8 1 -7 -12 -5 14 5 -9 -4 19 18 -4 -1 16 4 11 5 3 15 5 -3 -6 9 17 -3 -12 8 -1 6 -6 -15 7 3 -9 -11 -5 8 11 -1
5209 -1 -7 5 10 8 -8 -9 18 16 -2 -4 -1 19 11 -13 -5 6 12 6 -11 5 16 12 -6 1 15 25 2 -15 11 1 10 -12 -8 4 7 -3 -9 -10 5 5
5249 5 -17 -16 -7 -1 -10 -16 -2 12 19 -15 0 3 15 6 5 4 17 18 1 -2 18 15 0 -7 13 11 3 -18 -5 10 6 -3 -5 -2 8 -4 -24 -19 3 1 -7 -23
5291 -23 -7 8 -6 -21 -17 -5 0 0 -12 10 17 5 1 -6 15 20 -4 1 -8 16 8 -9 -10 14 2 5 -6 -8 0 -3 -9 -3 -7 0 -10 -13 -2 4 -12 -19 -11 -2
5333 -2 1 -4 -27 -2 7 3 -8 -3 -10 7 -6 -7 10 17 6 -12 -6 2 11 -7 -4 -5 3 8 2 -9 0 15 1 -10 2 -3 0 -20 -11 -14 -1 -13 -14 -10 -7 1 -11
5376 -11 -23 -2 0 -1 -7 -5 2 1 -16 -14 3 4 -1 -14 -6 -3 6 0 -6 2 11 2 -5 0 9 15 3 1 1 5 -2 -14 -14 -7 -4 -16 -20 -20 -13 -3 -22 -22 7 -3 -16 -24 -5
5423 -5 0 -6 -17 -2 10 3 3 -3 8 15 4 -3 -3 4 22 -6 -17 2 14 2 -12 -9 5 10 -1 -8 -9 3 -1 -24 -15 1 6 -16 -25 -11 3 -3 -16 -14
5463 -14 4 2 -14 -17 5 3 -7 -13 -8 9 5 -5 -6 9 3 5 1 11 13 10 -1 5 -2 12 -15 -13 -7 -1 4 -11 -10 -12 -5 -10 -13 -4 -2 3 -12 -5 2 -3 -2 -10 -7 1 -4
5510dLj4NQKj1RJ0J3j8lPLmj0nJ0%krQRj1krNQJr%kPoJN%MqoJ7J0k3QLMpoRJL
5560DLj5J8Oj2lkMRj7mJ1Pk0mOJ3qoMlJ5j0j0MJ4j1MnjJ2nrKJ0Mk%jmMoOJ2nj4
5606ekPO%k2J9MqpRmJ9j5Nj3LJ1k1JQQj7kQJ8j2j4OQlJj0J8%mj2PMPkj0J2Nrp
5651eLMmojPJj5Mj3J5MOj4jPmj2PJ4Jjj0OLKJj2JOMmLjLm%J1mPj3J0qKjqkJ2%
5700Aj7MMPj6NPjmKj1NlQoOJ3oj0nJ8oJ2j7nK2lj7J2j1K3j6Nj1J8Kj8j2J3K0j4
5741bj0NJ2%qmJ2pMj7QR%j0mkJ7j9rK7mJK%JNlqnK0j2rQpK2j5mLJ1j2j1MRjk1
5786b4J4K%%joJ3lkmJ0Opj2J3nJ0llk%lJ1jPMj1QqPppMJ2j3kLnLj4J2Oj4RMj3
5832a2JJ0rJjRRrlOpMoKmNJ9j7jOkkOrJ3kKrkNJpjJ2%j2%kQnj5J2j2J3Oj1R%o
$$ plain form
5510 -4 -1 -15 -10 -2 0 -11 -2 8 21 3 0 7 10 6 -4 -9 1 1 -1 -10 -2 7 -4 -6 -15 -10 -2 -1 -10 -10 -12 -5 -11 -10 -5 -5 -1 -9 -15 2 12 -11 -3 0 4 -3 -9 0 1 4
5560 4 7 -8 10 16 4 1 -1 3 12 -5 -9 2 9 -11 -15 -9 4 -4 -10 -6 -9 6 -4 -14 -10 4 -7 -3 -8 -9 3 -2 -11 -9 1 5 3 3 2 -2 2 -4 2 14 9 -5
5606 -5 -7 0 6 6 -16 3 7 -1 -8 1 -3 16 1 6 -7 -4 7 -14 -13 -5 3 -14 -16 -8 10 -2 -16 -10 -2 -5 -4 -14 4 4 0 -12 -5 -1 6 4 -6 6 11 2 -5
5651 -5 -2 2 -2 -8 -9 -2 -1 -16 -12 -25 -10 -6 0 -14 -15 -8 -12 -24 -17 -3 -2 -3 -13 -7 -4 -2 -1 -13 -12 -6 -2 -6 -3 -4 -1 -5 -5 6 2 9 -4 6 -2 0 -1 -9 -11 1 1
5700 1 -16 -12 -8 -1 -17 -12 -5 -6 -10 -8 -19 -14 -17 -9 -15 -9 4 -2 -12 -17 1 -5 7 -10 -15 7 4 -13 -1 -12 11 -5 0 -11 7 9 -9 -21 -8 12 -2
5741 -2 -12 -7 5 5 -3 -7 5 -2 2 -15 -7 2 2 -8 -12 -14 3 -16 -25 2 -2 -1 1 1 2 7 4 -4 -9 11 -1 -10 -2 -9 13 -2 -6 -3 8 -4 -15 -11 -2 -3 -24
5786 -24 -10 -8 -8 -8 -9 -15 -2 -5 -7 -11 -1 5 -2 -14 -1 -6 4 1 -2 -4 -4 -7 4 3 10 14 3 11 3 10 3 -4 0 12 -1 -3 0 -5 -2 -16 -4 2 -12 -3 1 -12
5832 -12 -11 -1 -10 -9 -10 -1 8 -1 -4 2 -5 -1 -7 -5 -9 -4 15 -2 -3 3 1 -1 5 -4 9 7 9 0 -2 3 4 -3 -4 8 8 -4 -4 -6 2 -3 -18 -6 -18 -5 1 -10 -1 -1 -7
5881gjoJ1LjrJ5KmpkK3j2jMmoJKj0J0J0j8oJ9Qj7%LJ4j7rnNJ2oj3ONNqj0K3Lj5
5926a0J%K1j4lNJ1Kj2Mj1J9Jj6JJ0Lmnk%JqJJ0mj2J3mPqllJ9j3kj2J3J6oj9JJ0
5969bjlQNpJLkMNKqNlNj2NJ4k0rJ5knlkLPmlj0JMNjjQqpN%%LOLrMPlpORj6KJ1
6023HKql%RqQpqQjjnKLjj7MOMj2JMj0QLKJ1jjj7J8J4k3LMOlLqJ1lpPlJ2qmj1L
6073fJ5mk4J5Rlj7OlQmlKkJ5j1rJ2J1j9lJ7j2PqJ2KKpJPJmj6J3MNrqQQoj8J2j1
6118a5J2rLJ5j7JKRmnjnJ5klrJ0mlL%RQj8OlOkj1J0NRj6%J2%j4oLJQj3qJ7%ok
6165a2klOMMkjLrMNlnJ1MroLrMJ1Nkn%%JrJ6Lj6J2LpkJJKlj1KJ1ojjj4%J4%j3
6215b1J3J0j3J1jJjoNoJ3KQk9J2J0kjmJ0oojlRkkj3RkJJj0J2Rj8LLokJ%QqMpM
$$ plain form
5881 -7 -8 -14 -3 0 -1 -10 5 7 3 -4 -6 17 5 4 8 4 -2 -1 1 -9 1 11 -7 -13 6 14 -3 -3 0 14 -3 -12 -17 -12 0 -6 -19 -13 -8 -3 -11 -21 2 5 -10
5926 -10 -9 -9 12 -2 -5 0 11 13 1 5 -6 13 14 -2 -1 9 12 8 3 1 1 2 -6 -5 5 1 -11 2 -2 5 -3 -6 -9 10 -3 -5 -17 -4 12 6 -13 -12 -2
5969 -2 -3 -6 2 7 0 1 4 2 6 11 13 5 10 7 12 0 5 19 -1 -10 5 3 -2 -5 -7 -4 3 -1 -4 -14 -13 -9 -4 -5 -6 2 -6 -13 -8 -8 -8 -5 1 4 -5 -1 6 3 -4 2 11 -5 -3 8
6023 8 10 2 -1 -1 8 0 8 1 -7 1 0 -1 -6 -4 -1 -2 -19 -15 -9 -5 -17 -16 -12 -22 -14 -11 -9 2 1 0 -17 1 15 -8 -5 -1 5 2 5 -3 8 5 -2 5 2 14 6 2 -9 -6
6073 -6 9 5 -19 -4 5 2 -15 -9 -12 -4 -8 -11 -9 -11 4 -7 -16 -4 7 -12 -15 2 -10 -3 -11 1 3 5 -2 -1 6 7 3 -13 0 4 9 0 -8 0 8 2 -16 -4 -15
6118 -15 -3 -12 -9 6 -11 -10 -8 1 -3 -8 -9 -14 1 -1 -4 -13 -3 -7 -10 -7 -7 2 10 -8 -2 -5 1 -1 -12 -2 3 12 -4 -4 8 8 -6 -12 -9 -8 0 -13 -21 -4 -4 -10 -12
6165 -12 -14 -17 -11 -7 -3 -5 -6 -3 -12 -8 -3 -6 -11 0 4 -5 -11 -8 -17 -13 -2 3 1 -4 -4 -4 -3 -12 4 7 -9 3 6 -1 -3 -2 -1 1 -2 -13 -11 0 -6 -7 -8 -22 -22 -8 -8 -21
6215 -21 -8 2 -11 0 -1 0 -1 -7 -2 -8 5 7 15 -14 -2 8 6 5 1 11 5 -1 -2 -5 4 2 0 -13 -4 -6 -5 -4 -14 -2 7 -11 -8 -5 -11 -13 -12 -12 -4 -12 -8 -15 -11
6262a1K3k0kMJ4q%j1J1L%qJ5j0OpnOLmjj7K0Mj1lJ0lqpJ1Pj8JJkJ6j0PrOOj3M
6306a0RnNnnJ9j2jJ5klmPJ%nLj2Qjj0OjlJj1J0%jkKkNoOjJKrJ0lJM%j%l%%JML
6358ErRPj7J0%npMNnLLjqK%Kj0pJ0oQmJoJ4jlmONNj0jQ%j2J2Nnj1QjJ1qoJlPm
6409cj0J0%%nPLj1jKNmklLPmJNj0K%mQLojJ1M%j0NlKOpMlRqj6NRj0JlK0jj0nJ2
6460Dj2j%k%LNj0LMLn%J5oj0QpKJ0%lqJ0nLMjoJlMJmmjMlNnrJ4j1lO%MpOjJLL
6513akL%lQj0JJ6lj5Kn%PqJ3nPJqmQoKmJ8j4nklPnlNMnlkJ1jljpK0kljqPJNJ0
6565A4nrKJ5j4j2OoJ0oM%j1J5o%j2J5Jj5RLJJj5J4nj1QqPJ0%j0NmJ3j0JRNlpJ0
6609ImNrQkLnpnRnoPPnj8PMPj9J1j1J1LMjoj0J9njkPj6J2rP%NJ6rqRmPkJj1Pp
$$ plain form
6262 -11 12 -8 -10 -6 8 0 0 -11 0 3 3 -5 10 0 6 -1 -6 0 3 -1 -2 -19 1 5 -6 -9 1 -2 -10 -17 -6 1 -17 -16 -15 -17 -1 -11 -4 -13 -7 -1 -14 -10
6306 -10 -1 -6 -1 -6 -11 8 -4 -5 10 8 5 1 8 9 9 4 7 -5 3 2 -8 -2 -3 -6 -5 -16 -6 -6 -7 -9 -7 -9 -4 -10 -4 -5 -4 -2 -11 -1 -4 -3 1 1 0 0 -3 -3 -3 -2 2 5
6358 5 -4 5 12 -5 5 5 0 -7 -3 2 -3 0 3 2 -6 -4 -4 -2 -12 -19 -9 -15 -7 -11 -10 -16 -2 -3 -6 -10 -4 1 6 -4 -5 3 3 -9 3 8 3 -8 0 -1 10 2 -4 -3 -6 1 -3
6409 -3 -13 -3 -3 -3 -8 -1 2 -9 -10 -8 -3 -7 -9 -12 -9 -2 -6 -5 0 -10 -8 -8 -12 -4 -1 -7 -8 3 7 7 -3 2 -1 1 7 0 4 1 10 2 -14 -9 0 -10 -9 -12 8 7 -3 -8 4
6460 4 -8 -9 -9 -11 -11 -8 -3 -13 -10 -6 -3 -8 -8 7 1 -9 -1 -8 -6 4 4 1 -7 3 -2 1 5 4 -2 -1 -4 0 1 -3 -7 -8 -4 -7 -2 -7 -16 -2 -13 -16 -10 -10 -6 -13 -7 -8 -7 -4 -1
6513 -1 -3 0 0 -3 5 -5 -4 12 9 -6 -4 -9 -9 -2 -10 3 -2 5 6 -2 -6 2 -4 -2 -6 12 -2 -7 -9 -12 -5 -10 -13 -8 -4 -9 -12 -14 -3 -4 -7 -8 -15 5 3 0 -1 -9 -2 -1 4 14
6565 14 9 0 2 17 3 -9 -3 -9 1 -5 -1 -1 -12 3 -3 -3 -15 0 1 -14 -5 -2 -1 0 -15 -1 -6 -17 -9 -17 -10 0 0 -10 -5 -9 4 -6 -5 4 9 6 -1 9
6609 9 5 10 1 9 7 10 5 -2 -7 2 -3 -9 -2 5 0 -18 -11 -7 0 -19 -8 -19 -8 -5 -1 -2 -8 -18 1 -4 -5 -7 0 -16 -4 -13 -6 -6 -1 15 6 -2 7 3 10 8 9 -2 5 -2
6659bJ5j7LMq%J0nj5LJkJrNJ8k5J3RllnN%LRk3J4J1jrkjJ2%j1PQlj1OJ%NnoNJ2
6707A4k1oLMj4J3PKjj4LMj0J2jRJj0oJ2QnnlJ6Kj7pJ5k%LmjKqj3J5LLJnOQj2j1
$$ plain form
6659 -2 13 -4 -1 3 -5 -5 5 0 -15 -12 -11 -13 -12 -21 -16 2 -23 -10 -1 -4 -7 -12 -7 -7 -4 5 -18 -4 7 6 -3 -5 -6 6 6 -5 2 10 7 -4 2 3 3 8 3 -3 2 14
6707 14 -7 -13 -10 -6 -20 -7 0 2 1 -13 -10 -6 -16 -4 -5 4 5 -5 -11 1 9 4 -1 -4 12 14 -3 -10 5 3 3 6 2 1 3 -5 -18 -3 0 3 4 -1 5 13 1 -10
$$ [...]
8191e
##END NTUPLES=NMR FID
##END=
